##TITLE=1H_LR-794-O-C3-2
 CDCl3
 8 sc, 
 24.12.2024
##JCAMPDX= 6.0         $$ Bruker NMR JCAMP-DX V2.0
##DATA TYPE= NMR FID
##DATA CLASS= NTUPLES
##ORIGIN= UXNMR, Bruker Analytische Messtechnik GmbH
##OWNER= root
$$ XWIN-NMR		Version 3.5
$$ Tue Dec 24 14:17:40 2024 Russian Standard Time (UT+4h)  she@DPX200
##.OBSERVE FREQUENCY= 200.1315
##.OBSERVE NUCLEUS= ^1H
##.DELAY= (6, 6)
##.ACQUISITION MODE= SIMULTANEOUS
##.ACQUISITION SCHEME= undefined
##.AVERAGES= 8
##.DIGITISER RES= 18
##SPECTROMETER/DATA SYSTEM= spect
##.PULSE SEQUENCE= zg30
##.SOLVENT NAME= D2O
##.SHIFT REFERENCE= (INTERNAL, D2O, 0, 15.7039)
##AUDIT TRAIL= $$ (NUMBER, WHEN, WHO, WHERE, WHAT)
$$ ##TITLE= Audit trail, XWIN-NMR		Version 3.5
$$ ##JCAMPDX= 5.01
$$ ##ORIGIN= Bruker BioSpin GmbH
$$ ##OWNER= she
$$ F:/spectra/data/she/nmr/H-F/1/audita.txt
$$ ##AUDIT TRAIL=  $$ (NUMBER, WHEN, WHO, WHERE, WHAT)
(   1,<2024-12-24 14:16:14.79 +0400>,<she>,<DPX200>,
      <created by zg, POWCHK disabled, PULCHK disabled
       configuration hash MD5:
       00 E9 B6 7A A2 85 ED C7 34 08 36 98 17 FE 4E 26
       data hash MD5: 16K
       5F 96 27 59 0B 62 3C 91 66 C4 81 A8 57 98 03 73>)
$$ ##END=
$$ 
$$ hash MD5
$$ 9E F7 C2 07 85 E0 4E F1 7E 98 78 86 A6 CC 1F 95
##$RELAX= 
##$RELAX= 
##$RELAX= 
##$RELAX= 
##$RELAX= 
##$RELAX= 
$$ Bruker specific parameters
$$ --------------------------
##$DU= <F:/spectra>
##$EXPNO= 1
##$NAME= <H-F>
##$PROCNO= 1
##$TYPE= <nmr>
##$USER= <she>
##$AMP= (0..31)
100 100 100 100 100 100 100 100 100 100 100 100 100 100 100 100 100 100 
100 100 100 100 100 100 100 100 100 100 100 100 100 100 
##$AQSEQ= 0
##$AQ_mod= 1
##$AUNM= <au_zg>
##$AUTOPOS= <>
##$BF1= 200.13
##$BF2= 200.13
##$BF3= 200.13
##$BF4= 200.13
##$BF5= 200.13
##$BF6= 200.13
##$BF7= 200.13
##$BF8= 200.13
##$BYTORDA= 1
##$CFDGTYP= 0
##$CFRGTYP= 5
##$CHEMSTR= <none>
##$CNST= (0..31)
1 1 145 1 1 1 1 1 1 1 1 1 1 1 1 1 1 1 1 1 1 1 1 1 1 1 1 1 1 1 1 1 
##$CPDPRG= <>
##$CPDPRG1= <>
##$CPDPRG2= <>
##$CPDPRG3= <>
##$CPDPRG4= <mlev>
##$CPDPRG5= <mlev>
##$CPDPRG6= <mlev>
##$CPDPRG7= <mlev>
##$CPDPRG8= <mlev>
##$CPDPRGB= <>
##$CPDPRGT= <>
##$D= (0..31)
0 1.2 0 0 0 0 0 0 0 0.06 0 0.03 0 0 0 0 0.0002 0 0 0 0 0 0 0 0 0 0 0 0 
0 0 0 
##$DATE= 1735035374
##$DBL= (0..7)
120 120 120 120 120 120 120 120 
##$DBP= (0..7)
150 150 150 150 150 150 150 150 
##$DBP07= 0
##$DBPNAM0= <>
##$DBPNAM1= <>
##$DBPNAM2= <>
##$DBPNAM3= <>
##$DBPNAM4= <>
##$DBPNAM5= <>
##$DBPNAM6= <>
##$DBPNAM7= <>
##$DBPOAL= (0..7)
0.5 0.5 0.5 0.5 0.5 0.5 0.5 0.5 
##$DBPOFFS= (0..7)
0 0 0 0 0 0 0 0 
##$DE= 6
##$DECBNUC= <off>
##$DECIM= 24
##$DECNUC= <off>
##$DECSTAT= 4
##$DIGMOD= 1
##$DIGTYP= 9
##$DL= (0..7)
0 120 120 120 120 120 120 120 
##$DP= (0..7)
150 150 150 150 150 150 150 150 
##$DP07= 0
##$DPNAME0= <>
##$DPNAME1= <>
##$DPNAME2= <>
##$DPNAME3= <>
##$DPNAME4= <>
##$DPNAME5= <>
##$DPNAME6= <>
##$DPNAME7= <>
##$DPOAL= (0..7)
0.5 0.5 0.5 0.5 0.5 0.5 0.5 0.5 
##$DPOFFS= (0..7)
0 0 0 0 0 0 0 0 
##$DQDMODE= 0
##$DR= 18
##$DS= 0
##$DSLIST= <SSSSSSSSSSSSSSS>
$$ [...]
##$SUBNAM2= <"">
##$SUBNAM3= <"">
##$SUBNAM4= <"">
##$SUBNAM5= <"">
##$SUBNAM6= <"">
##$SUBNAM7= <"">
##$SUBNAM8= <"">
##$SUBNAM9= <"">
##$SW= 24.0689530833862
##$SWIBOX= (0..15)
0 0 2 0 0 0 0 0 0 0 0 0 0 0 0 0 
##$SW_h= 4816.95568400771
##$TD= 16384
##$TD0= 1
##$TE= 0
##$TE2= 300
##$TE3= 300
##$TEG= 300
##$TL= (0..7)
0 120 120 120 120 120 120 120 
##$TP= (0..7)
150 150 150 150 150 150 150 150 
##$TP07= 0
##$TPNAME0= <>
##$TPNAME1= <>
##$TPNAME2= <>
##$TPNAME3= <>
##$TPNAME4= <>
##$TPNAME5= <>
##$TPNAME6= <>
##$TPNAME7= <>
##$TPOAL= (0..7)
0.5 0.5 0.5 0.5 0.5 0.5 0.5 0.5 
##$TPOFFS= (0..7)
0 0 0 0 0 0 0 0 
##$TUNHIN= 0
##$TUNHOUT= 0
##$TUNXOUT= 0
##$USERA1= <user>
##$USERA2= <user>
##$USERA3= <user>
##$USERA4= <user>
##$USERA5= <user>
##$V9= 5
##$VALIST= <valist>
##$VCLIST= <CCCCCCCCCCCCCCC>
##$VD= 0
##$VDLIST= <DDDDDDDDDDDDDDD>
##$VPLIST= <PPPPPPPPPPPPPPP>
##$VTLIST= <TTTTTTTTTTTTTTT>
##$WBST= 1024
##$WBSW= 4
##$XGAIN= (0..3)
0 0 0 0 
##$XL= 0
##$YL= 0
##$YMAX_a= 443645
##$YMIN_a= -506370
##$ZGOPTNS= <>
##$ZL1= 120
##$ZL2= 120
##$ZL3= 120
##$ZL4= 120
##$ABSF1= 10
##$ABSF2= 0
##$ABSG= 5
##$ABSL= 3
##$ALPHA= 0
##$AQORDER= 0
##$ASSFAC= 0
##$ASSFACI= 0
##$ASSFACX= 0
##$ASSWID= 0
##$AUNMP= <proc_1d>
##$AZFE= 0.1
##$AZFW= 0.1
##$BCFW= 1
##$BC_mod= 2
##$BYTORDP= 1
##$COROFFS= 0
##$CY= 11.3945322036743
##$DATMOD= 1
##$DC= 2
##$DFILT= <>
##$DTYPP= 0
##$F1P= 15.6554695791079
##$F2P= 12.8336369535428
##$FCOR= 0.5
##$FTSIZE= 0
##$FT_mod= 4
##$GAMMA= 1
##$GB= 0.15
##$INTBC= 1
##$INTSCL= 1
##$ISEN= 128
##$LB= 0.24
##$LEV0= 0
##$LPBIN= 0
##$MAXI= 10000
##$MC2= 0
##$MEAN= 0
##$ME_mod= 0
##$MI= 1.114404
##$NCOEF= 0
##$NC_proc= 0
##$NLEV= 6
##$NOISF1= 3.799351
##$NOISF2= 2.8
##$NSP= 1
##$NTH_PI= 0
##$NZP= 0
##$OFFSET= 15.70392
##$PC= 1
##$PHC0= -26572.57
##$PHC1= 11.58744
##$PH_mod= 1
##$PKNL= yes
##$PPARMOD= 0
##$PSCAL= 0
##$PSIGN= 0
##$REVERSE= no
##$SF= 200.130013532006
##$SI= 16384
##$SIGF1= 3
##$SIGF2= 2
##$SINO= 400
##$SIOLD= 16384
##$SREGLST= <1H.CDCl3>
##$SSB= 0
##$STSI= 0
##$STSR= 0
##$SW_p= 3612.71676300578
##$SYMM= 0
##$S_DEV= 0
##$TDeff= 0
##$TDoff= 0
##$TI= <>
##$TILT= no
##$TM1= 0
##$TM2= 0
##$TOPLEV= 0
##$USERP1= <user>
##$USERP2= <user>
##$USERP3= <user>
##$USERP4= <user>
##$USERP5= <user>
##$WDW= 1
##$XDIM= 8192
##$YMAX_p= 0
##$YMIN_p= 0
$$ End of Bruker specific parameters
$$ ---------------------------------
##NTUPLES= NMR FID
##VAR_NAME=  TIME,          FID/REAL,        FID/IMAG
##SYMBOL=    X,             R,               I
##VAR_TYPE=  INDEPENDENT,   DEPENDENT,       DEPENDENT
##VAR_FORM=  AFFN,          ASDF,            ASDF
##VAR_DIM=   8192,          8192,            8192
##UNITS=     SECONDS,       ARBITRARY UNITS, ARBITRARY UNITS
##FACTOR=    0.0002076,     1,               1
##FIRST=     0,             0,               0
##LAST=      1.7004516,     0,               0
##MIN=       0,             -506370,         0
##MAX=       1.7004516,     443645,          0
$$ Real data points
##PAGE= N=1
##DATA TABLE= (X++(R..R)), XYDATA
0@%%%%qJ2j2J6j6K1k9L2m0M8n6O8p8R4j12J28j44J66j91K18k50K85l22L61m03
$$ 0 0 0 0 0 -8 4 -8 8 -8 13 -16 16 -24 24 -32 36 -42 52 -60 68 -76 90 -101 117 -133 152 -170 191 -212
29b12M53n12N72o35P05p80Q62r59J065j175J297j433J582j747J936k152K394k668
$$ -212 241 -271 301 -334 371 -409 453 -506 559 -616 681 -752 830 -917 1019 -1133 1261 -1407
47a407K986l362L808m352N029n884P003q531J0727j4097J9773l0815N8797k35458
$$ -1407 1579 -1783 2025 -2327 2702 -3182 3821 -4710 6017 -8080 11693 -19122 39675 -195783
61a95783l10587R50015m07745k48778N10896n27860J01969L74798n74173K46823
$$ -195783 -506370 443645 35900 -212878 298018 -229842 -127873 246925 -327248 -80425
71h0425L35849l71391K54587o4540k74484N54191k72566m41816M95590j74531
$$ -80425 255424 -115967 138620 74080 -200404 353787 81221 -360595 134995 -39536
81c9536q2494K96062l86697K99939K23561o59884L36608K10234m76060L77289
$$ -39536 -122030 174032 -212665 87274 310835 -349049 -12441 197793 -278267 99022
91I9022q4131l58400O31289j00083m03184M25827j51240j45136K11891l90126
$$ 99022 14891 -343509 287780 187697 -215487 210340 59100 -86036 125855 -264271
101b64271K42017L22058o05254K50715L17634m56873L31077k0424n01281N26633
$$ -264271 -22254 299804 -305450 -54735 262899 -193974 137103 116679 -384602 142031
111A42031m2579m39073M92333n5751j77601L22372l57017L8898M13830m84926
$$ 142031 99452 -339621 152712 96961 -80640 241732 -115285 -76387 337443 -147483
121a47483m8335L23850k47631J34312Q2751k50818K86218m5747k94453K70005
$$ -147483 -195818 128032 -119599 14713 97464 -153354 132864 87117 -207336 62669
131F2669j01876n5096K76757l82941R8789M62726m39112J7962K75231l51267J52387
$$ 62669 -39207 -94303 182454 -200487 -101698 361028 -78084 -60122 215109 -136158 16229
142A6229N8318l15009L35426K8174l23493K59426p561j34083K43056k45117j12629
$$ 16229 74547 -240462 94964 123138 -200355 59071 51510 -82573 160483 -84634 -197263
153a97263L69144k21110p2168K75134j85294R0593N9248k83076K65040L1751l08865
$$ -197263 171881 -49229 -121397 153737 -31557 59036 118284 -164792 100248 131999 -176866
164a76866J94394k7640j00367K47618j56939r8180K65142j57443j08536J81097
$$ -176866 17528 -10112 -110479 137139 -19800 -117980 147162 -10281 -118817 62280
174F2280j09170M7954P5034k23143J89529J28998k37812J23242q955j43904J79808
$$ 62280 -46890 1064 76098 -147045 42484 171482 -66330 56912 47957 -95947 83861
185H3861j22003r1902K37060j18510p4427J47338r2191N9586O2884k21458R2316
$$ 83861 -38142 -130044 107016 -11494 -85921 61417 -30774 28812 91696 -129762 -37446
196c7446J22850j62632Q8146N8808j00095J19411n6109j12782J68270o7616j15897
$$ -37446 85404 -77228 10918 69726 -30369 89042 32933 -79849 88421 20805 -95092
207i5092J01344o7431M2703J13937j54575M6945R7772j43272M0126L6512o8924
$$ -95092 6252 -61179 -18476 95461 -59114 -12169 85603 -57669 -17543 18969 -49955
218d9955Q8666l1742o9563J32699N074p9743L9073n1733k6898P5744q4121J351
$$ -49955 38711 6969 -62594 70105 75179 -4564 34509 -17224 -44122 31622 -52499 -51148
230e1148J09982q7244Q454N6318o0310O7827l0755r8487R0875R559l0824N6705
$$ -51148 58834 -28410 -19956 36362 -23948 43879 13124 -85363 5512 15071 -15753 40952
242D0952k0493j1780L9692n1604k9693O7785m4972n1152N6453k4200L1633N0085
$$ 40952 20459 8679 48371 -3233 -32926 34859 -10113 -61265 -4812 -29012 2621 52706
254E2706q4300K7389L0047n9821L2347L929j2654L2460k4375n288M6994j630l5768
$$ 52706 -31594 -4205 25842 -33979 -1632 2297 -10357 22103 -2272 -7560 39434 37804 2036
267B036n444j6677n597L0989k9368K319M1789m0864J1510K9068k7255K8509j9897
$$ 2036 -3408 -20085 -25682 5307 -24061 -21742 20047 -20817 -9307 19761 -7494 21015 1118
280A118m2979M7956P553j4035K8001j8602j0346K5961l0383p738L1112m2466j5484
$$ 1118 -41861 6095 13648 -387 27614 9012 -1334 24627 -5756 -13494 17618 -24848 -40332
293d0332L7204j9524K3857L5449n7414J3763L6226n4706K5465K5123n2051L2057
$$ -40332 -3128 -22652 1205 36654 -20760 -6997 29229 -25477 -12 25111 -26940 5117
305E117J1000k8880M5499j624l9862K196q926p498J1247J797l734J0663K097L732
$$ 5117 16117 -12763 32736 31112 -8750 -6554 -15480 -22978 -11731 -9934 -13668 -3005 -908 2824
319B824J6481j4742L703j1775l0574M6456m095j3303M6200m2648l502L3599m6550
$$ 2824 19305 4563 8266 -3509 -34083 12373 8278 -5025 41175 -1473 -4975 28624 -17926
332a7926Q927J1415l8905J2490K4228n363J6694J6011l7123N907J8524l7299L2466
$$ -17926 -8999 2416 -36489 -23999 229 -5134 11560 27571 -9552 -3645 14879 -22420 10046
345A0046L378l7729M6600j3369j0566L9693l8719j4021R073k0773J1326J5419
$$ 10046 13424 -24305 22295 8926 -1640 38053 -666 -14687 -5614 -26387 -15061 358
357C58l284k503R655k00j223J3249j4079n156m95o912K3959l200J024R152l0227
$$ 358 -2926 -5429 4226 4026 2803 16052 1973 -3183 -3678 -10590 13369 10169 11193 20345 -9882
372i882R375O848k2038J5419o846j7138K0245N514N50J1814o626j1559N436K828
$$ -9882 -507 6341 -15697 -278 -7124 -24262 -4017 1497 2047 13861 7235 -4324 1112 3940
386C940j460P046m665q808Q692N69L50P818j6499q952O229j0529J0392R861j1959
$$ 3940 2480 9526 4861 -3947 4745 5314 5664 13482 -3017 -11969 -5740 -16269 -5877 3984 -7975
401g975N389M360J926N768M418m761j8073J0128k67p154K4775j4100r593J4137
$$ -7975 -2586 1774 3700 9468 13886 9125 -8948 1180 913 -6241 18534 4434 -5159 8978
415H978j4726N452J266j1037j139o623J3541O788L895Q753r573k136l604O361
$$ 8978 -5748 -296 970 -10067 -11206 -17829 -4288 2500 6395 15148 5575 3439 -165 6196
429F196m132r100J7492k1782P413K9655l1716J2110J957l6288K0466J763q364
$$ 6196 2064 -7036 10456 -11326 -3913 25742 -5974 6136 8093 -28195 -7729 -5966 -14330
442a4330J7448n52l240N858P250n242q87o540j2983J4044m657P062J6115k7604
$$ -14330 3118 2566 -674 5184 12434 7192 6305 -235 -13218 826 -3831 3231 19346 -8258
456h258J3626O54k9825L0661r615k3912K8958r226j744L0790j3375j2207J3818
$$ -8258 5368 6022 -23803 6858 -2757 -26669 2289 -6937 -8681 22109 8734 -3473 10345
469A0345j3403o732J8160r213j098J0274j6750J0325J0427j9638P300q509j4153
$$ 10345 -3058 -9790 8370 -843 -1941 8333 -8417 1908 12335 -7303 -3 -8512 -22665
482b2665K7515r890o248L0010k1964l647K3119k2409J1437J0829l1724J1338J4320
$$ -22665 4850 -5040 -11288 18722 -3242 -6889 16230 -6179 5258 16087 -15637 -4299 10021
495A0021j3762O701L300j5474P179L720j8002J7956M901k3421J6812n332K177
$$ 10021 -3741 2960 6260 -9214 -2035 1685 -16317 1639 6540 -16881 -69 -5401 -3224
508c224K6339k9887M335J8127k2537J1647q23j1045J3353q284j1398J3087J4234
$$ -3224 23115 -6772 -2437 15690 -6847 4800 3977 -7068 6285 -1999 -13397 -310 13924
521A3924j6595m431N473j3369K2697q191k0199L7465j2659j1686K2414j5281J1444
$$ 13924 -2671 -7102 -1629 -14998 7699 -492 -20691 16774 4115 -7571 14843 -438 11006
534A1006J347l1382J0400J7599q259m899O566n230P509K813l0346K4897J2394
$$ 11006 12353 -19029 -8629 8970 711 -4188 2378 -2852 4657 7470 -22876 2021 14415
547A4415l8877K2284N400k593K9782l4500q331L4755k4152q797J4255j3422J6535
$$ 14415 -24462 -2178 3222 629 30411 -4089 -12420 22335 -1817 -10614 3641 -9781 6754
560F754N473l5600K7846K4605m4090M102P870j3198L7056k2146k5437O0038k1003
$$ 6754 12227 -23373 4473 29078 -15012 -10910 -3040 -16238 20818 -1328 -26765 33273 12270
573A2270l0126L7672k8831R072K8770o8951K8247N5115n7893J0480J3665l0965
$$ 12270 -17856 19816 -9015 57 28827 -40124 -11877 43238 -14655 -4175 9490 -21475
585b1475M4798k2901m4790O8741o488m6557M2524j4723j093M7405p4636O12P8675
$$ -21475 23323 422 -44368 24373 17885 -28672 13852 -871 -1964 45441 -29195 -28583 50092
598E0092o6448L633L4088n2505O1077j4701p5134Q8412l582n8768M4779k5435
$$ 50092 -16356 -12723 21365 -31140 29937 15236 -59898 28514 24932 -33836 10943 -14492
610a4492O717N5746p4649l319Q0530o1090k599L8427o2176O9644J358j15755J08382
$$ -14492 -7775 47971 -26678 -29997 50533 -10557 -13156 25271 -36905 32739 34097 -81658 26724
623B6724J4773r3360Q0063m0694k2698J05574r6971k6643J14316o7325k2059N3180
$$ 26724 41497 -51863 28200 -12494 -35192 70382 -26589 -53232 61084 -6241 -28300 24880
635B4880n5915N3251K7406j14080O9729M3343q5638N4190l1559k3852J11659j02682
$$ 24880 -31035 22216 49622 -64458 5271 48614 -37024 17166 -14393 -38245 73414 -29268
647b9268k9119J30569q6722m992N3949r9209Q9044M0794j50520R2385N5251j06403
$$ -29268 -58387 72182 -14540 -19532 34417 -64792 24252 65046 -85474 6911 62162 -44241
659d4241P0919k4509n5541J26300q3869o9934J39716n7235k3168O1527j02246
$$ -44241 26678 2169 -53372 72928 -10941 -80875 58841 1606 -21562 39965 -62281
670f2281P8884N8493j66900Q9889O4099j21662R4968k6426p9135J61987q1764
$$ -62281 16603 75096 -91804 -1915 62184 -59478 35490 9064 -70071 91916 10152
681A0152j04023J50299n0909l8529P5148r7743N4228Q4742j50354M5540Q1259
$$ 10152 -93871 56428 5519 -33010 42138 -55605 -1377 83365 -66989 -21449 59810
692E9810j00093N9715j8928p0783J54224p1212r5631J47745p3598j5061R1014
$$ 59810 -40283 19432 504 -70279 83945 12733 -82898 64847 -8751 -23812 67202
703F7202j49819P4309J15148j89215N2544J04272j17850O0583J650r9417J41342
$$ 67202 -82617 -8308 106840 -82375 -29831 74441 -43409 17174 18824 -80593 60749
714F0749k5224j21604J28577l2497l8587R3494j30888M5360J28641j76298L7875
$$ 60749 35525 -86079 42498 10001 -28586 64908 -65980 -20620 108021 -68277 -30402
725c0402R1349j08567Q5094k2429j08175J65705l8429j27288J41887l8789n1658
$$ -30402 60947 -47620 37474 15045 -93130 72575 34146 -93142 48745 9956 -41702
736d1702J14629j22262J346J53907j43877r193J01609q9704O7393q900j12901
$$ -41702 72927 -49335 -47989 105918 -37959 -47152 54457 -35247 32146 23246 -89655
747h9655J54461k7550j25887J32602m3209m0368J18012j28259O71J51285j35519
$$ -89655 64806 37256 -88631 43971 762 -39606 78406 -49853 -49182 102103 -33416
758c3416p997R0943r3258P1820R635j30003J39974J4760j42273J04384j0293n5717
$$ -33416 -41413 49530 -43728 28092 37727 -92276 47698 62458 -79815 24569 14276 -41441
770d1441J04533r9298j7305J40176j10136o195P5502r5792Q2780Q303j41302J37069
$$ -41441 63092 -36206 -53511 86665 -23471 -29666 45836 -49956 32824 41127 -100175 36894
782C6894K6351j32666R1229n854n2125R6663q4643l6279J31953q4827k4813Q3375
$$ 36894 63245 -69421 21808 15954 -36171 60492 -24151 -60430 71523 -13304 -38117 45258
794D5258q6790O1019L6790j43779J03600M4055j18354P5289j3563l5037R7671
$$ 45258 -41532 19487 56277 -87502 16098 60153 -58201 17088 3525 -31512 66159
805F6159r0765k6083J18680q1904j9521P2014p9728M8488N2324j29184O8114O2410
$$ 66159 -24606 -50689 67991 -13913 -33434 38580 -41148 7340 59664 -69520 -1406 61004
817F1004j06172N5056l618m5717R9815p3914m2865J18591o6174k4715O2472p0347
$$ 61004 -45168 9888 6270 -39447 60368 -13546 -56411 62180 -3994 -28709 33763 -36584
829c6584M0544M4944j02910M8074N1594p5298L8316n863l9317Q6735n2723n5120
$$ -36584 3960 48904 -54006 -5932 45662 -29636 8680 2817 -36500 50235 -2488 -57608
841e7608J04621m0391l4544N8657n9385K5646M9798r1313L5125M8115o3537L5980
$$ -57608 47013 6622 -27922 30735 -28650 -3004 46794 -44519 -9394 38721 -24816 11164
853A1164p344l9731P7572l7225n4834P9328j9539k8754M0896m1295J5638M3247
$$ 11164 3820 -35911 41661 4436 -50398 28930 9391 -19363 21533 -19762 -4124 39123
865C9123p0287J6303M5630n0160K6237K736m3158O6813j9876n6957O3724j4464
$$ 39123 -31164 -14861 30769 -19391 6846 9582 -33576 33237 13361 -43596 20128 5664
877E664k2245L4746l9072J8916L6802n6016J0139L1496l2389J3694M112l1707
$$ 5664 -16581 18165 -20907 -1991 34811 -21205 -11066 20430 -11959 1735 5847 -25860
889b5860M4050J074m9877M1742k9k6116K9921l2279O537M1462m7410P145K8390
$$ -25860 18190 19264 -30613 11129 11100 -15016 14905 -17374 -10837 30625 -16785 -9640 18750
902A8750k6257J3522l711k1657K9688K11k7968J9075Q692j5001J3845j5677n770
$$ 18750 -7507 6015 2304 -19353 10335 10546 -17422 1653 10345 -4656 9189 -6488 -12258
915a2258L2560k7732p956K8843j8092Q373L702k2618K3456Q13k3191J3859L385
$$ -12258 20302 -7430 -15386 13457 -4635 3738 7440 -15178 8278 9091 -14100 -241 3144
928C144m998Q576j0412j865J7652j1811j1644J5704m025j946P048j3052R477R742
$$ 3144 -1854 6722 -3690 -5555 12097 286 -11358 4346 321 -1625 5423 -7629 1848 11590
942A1590j9397M583P740p638N997m003m809J4717o062q130O849j267L63L4m653
$$ 11590 -7807 -3224 4516 -3122 2875 -1128 -5937 8780 2718 -5412 1437 170 533 567 -4086
957d086M765N282n265m596O790k107l325M254o944O863N671j2784P451J341n616
$$ -4086 679 5961 696 -3900 2890 783 -2542 1712 -5232 1631 7302 -5482 1969 3310 -2306
972b306L930n795K840M340k927j37q2N126n835r07K146n235R600n988k915J2092
$$ -2306 1624 -4171 -1331 3009 82 -55 -137 4989 -846 -1753 393 -4842 4758 -1230 -4145 7947
988G947r991K929K098r426R434l723l530O117o28J035j963J336k574k81K358p178
$$ 7947 -2044 885 2983 -6443 2991 -732 -4262 1855 1227 2262 299 1635 -939 -1220 1138 -6040
1004f040Q226n37m906R923r464L447M740j3173P992J194o462Q666k491k115M483
$$ -6040 2186 1649 -3257 6666 -2798 649 5389 -7784 208 1402 -5060 3606 1115 -1000 3483
1019C483k295l711J909J215m064L773J072k784N405m029j421K973o062L826P79
$$ 3483 1188 -2523 -614 601 -3463 310 1382 -1402 4003 -26 -1447 1526 -4536 -710 69
1034F9l803P522k386l880O922n253k584O104n457K56N466l478M18K319j397k743
$$ 69 -3734 3788 1402 -2478 4444 -809 -3393 2711 -2746 -2490 2976 -502 -84 2235 838 -1905
1050a905J290O87l521M594r68j156L844m135K807k412k240N456n876L752L549
$$ -1905 -615 72 -3449 1145 177 -979 2865 -1270 1537 -875 -3115 2341 -3535 217 3766
1065C766o180N459k663j885J530k058K824m124M938P28n914R082o293k352O014
$$ 3766 -2414 3045 382 -1503 27 -2031 793 -3331 1607 2335 -3579 5503 -790 -3142 2872
1080B872o820M238J53n78K610l264L659l973o1K316n315N903k952J262M069p408
$$ 2872 -3948 290 443 -135 2475 -789 2870 -1103 -1164 1152 -4163 1740 -1212 50 4119 -3289
1096c289P508n191l540Q694q615L475N336o979M577O60l564P72N16k613n82N624
$$ -3289 4219 -972 -4512 4182 -4433 -958 4378 -2601 1976 2636 -928 -156 360 -2253 -2835 2789
1112B789m228J581M464p361M367j490m814P475n429O24O683o341M235J599q194
$$ 2789 -1439 142 4606 -2755 1612 122 -4692 2783 -2646 -2022 4661 -1680 2555 4154 -4040
1127d040N427m08o430P326n29l912O732l479l060N834m197l450O035k037j539
$$ -4040 1387 979 -5451 1875 1346 -2566 4166 687 -2373 3461 -736 -4186 1849 -188 -1727
1142a727O238n187N12O112j0605L610L403p639Q950l523l569J0068q046l20M013
$$ -1727 4511 -676 -164 5948 -4657 -1047 2356 -5283 3667 144 -3425 6643 -1403 -1723 2290
1157B290n569L579l31k349L235L420m356k190O037o005J946K530q877J1354j845
$$ 2290 -3279 300 -31 -2380 855 4275 -81 -2271 3766 -2239 -293 2237 -6640 4714 2869
1172B869p955J0289o666J432K244q704P696O87k581Q86l29L430l223j203p50J546
$$ 2869 -5086 5203 -1463 -31 2213 -6491 1205 1892 -689 197 -132 3298 75 -1128 -1878 -332
1188c32M601q310L495M285l675L314p723J861P254p155M87J092L544Q98o364K389
$$ -332 4269 -4041 -546 3739 64 3378 -4345 -2484 4770 -2385 -1898 -806 2738 3636 -2728 -339
1204c39M39J442j528o941R259K723o152J327j598L312J481r037J134Q282k454
$$ -339 100 1542 14 -6927 2332 5055 -1097 230 -1368 1944 3425 -5612 -4478 3804 1350
1219A350l391J464O01M787l234r865O966O971q390O05K880j57P210j0964n653
$$ 1350 -2041 -577 24 4811 1577 -8288 -1322 5649 -2741 -2136 744 587 7797 -3167 -8820
1234h820J6726p268o723P409o806J1757J511k0172J4290N560j2670M497k975K168
$$ -8820 7906 638 -6085 1324 -5482 6275 7786 -12386 1904 7464 -5206 -709 -3684 -1516
1248a516J2759j3311q567K0096m233j2932R942q769P029J3095k8889J3459J7398
$$ -1516 11243 -2068 -10635 9461 5228 -7704 2238 -6531 498 13593 -15296 -1837 15561
1261A5561k3494J0432n704o170K6926k1883j1359K9074r210q398Q535j3049R033
$$ 15561 -7933 2499 -3205 -9375 17551 -4332 -15691 13383 4173 -4225 4310 -8739 294
1274B94J5139l1395P409K7109k5152P423J829j8518L5442j7725k7241M0216j1442
$$ 294 15433 -15962 -8553 18556 -6596 827 2656 -15862 19580 1855 -25386 14830 3388
1287C388r964J6670k4544J8195J7942m2077J2787K4314k4938J2025r71k1767M0233
$$ 3388 -6576 10094 -14450 3745 21687 -20390 -7603 16711 -8227 3798 2827 -18940 21293
1300B1293j1648m0032M2562l873k0420K4357k6958J2065L2562m9017Q148L0442
$$ 21293 9645 -30387 12175 8302 -12118 12239 -14719 -2654 29908 -19109 -10961 19481
1312A9481l0840J7064l555k6802M8774j2484m1229M2853p361j5965K5400l5611
$$ 19481 -11359 5705 2150 -24652 24122 11638 -29591 13262 5901 -10064 15336 -20275
1324b0275J1879M3515n2645J633L9755l4489J4643M740l9707N0950j318n1534
$$ -20275 -8396 35119 -17526 -15893 23862 -10627 4016 8756 -30951 19999 18681 -32853
1336c2853M5227m938j7339L1948m5469J1762M9601n7908M445L7181l3846K2497
$$ -32853 12374 7436 -9903 22045 -23424 -11662 37939 -19969 -15524 21657 -12189 10308
1348A0308m6m4253N3103L584n8158M4167J433k4928M3093m6312m092O6160n9669
$$ 10308 10262 -33991 19112 22696 -35462 8705 10138 -14790 28303 -18009 -22101 44059 -15610
1361a5610o543M4859l9011K7955J467n0459N7343M421n6570L8854j394j9770M2147
$$ -15610 -22153 22706 -16305 11650 13117 -37342 20001 24422 -32148 6706 5312 -14458 27689
1374B7689m2620j0822O9080m9744j8389M7262l9357K4272J2527o1994N7008J4718
$$ 27689 -14931 -25753 43327 -6417 -24806 22456 -16901 7371 19898 -42096 14912 29630
1386B9630o0306L9422o332j7548M5559m8127r428O7080m5258j3904L9463l8464
$$ 29630 -30676 8746 2414 -15134 30425 -17702 -27130 39950 -5308 -19212 20251 -18213
1398a8213K7274J4905o8189N2687K4881o4037L8650k219k6050N5258m6701k4314
$$ -18213 9061 23966 -44223 8464 33345 -30692 7958 5739 -20311 34947 -11754 -36068
1410c6068P4788m0964j8835M1584l9375K7860J8905o8921M5123K6331n6394L1992
$$ -36068 38720 -2244 -21079 20505 -18870 8990 27895 -41026 4097 30428 -25966 6026
1422F026l754k0150N2786m1794k8436O8854l2177k2139L9238l8697K5294K7828
$$ 6026 2272 -17878 34908 -6886 -35322 33532 1355 -20784 18454 -20243 5051 32879
1434C2879p1655L9238L1714n7159L2842p394k4405O0292m0321l0792O4873k6791
$$ 32879 -38776 462 32176 -24983 7859 465 -23940 36352 -3969 -34761 30112 3321
1446C321j8791L0235l4861K1665K9616o3531K6111L8013n0865K4958j049l2334
$$ 3321 -15470 14765 -20096 1569 31185 -32346 -6235 31778 -19087 5871 4822 -27512
1458b7512N9581l0012l8988O3341k2755j5531K8969l9506K4768K7580n9832K2567
$$ -27512 32069 2057 -36931 26410 3655 -11876 17093 -22413 2355 29935 -29897 -7330
1470g330L2120l9222K1048j770k9400N1297j9326m2784N4385j4066j7354L1370
$$ -7330 24790 -14432 6616 4846 -24554 26743 7417 -35367 19018 4952 -12402 18968
1482A8968l9461J8977L5512o0226J6608L1554l6502K1608l817k6187M7210j5362
$$ 18968 -20493 -1516 33996 -26230 -9622 21932 -14570 7038 3221 -22966 24244 8882
1494H882l6873M1166r667j2595K3933l3274J4351L5086m9049Q103K8422l0635
$$ 8882 -27991 13175 3508 -9087 14846 -18428 -4077 31009 -18040 -9937 18485 -12150
1506a2150J8629k945k8286M5625j0643l5076L7735j0472j0158K4607l5300J0948
$$ -12150 6479 3534 -24752 20873 10230 -24846 12889 2417 -7741 16866 -18434 -7486
1518g486L4504m0802M708K3560k1954J3792k514k4552L3113q66l1881K6767j586
$$ -7486 27018 -13784 -9076 14484 -7470 6322 3808 -20744 12369 11503 -20378 6389 4803
1531D803j1573K2134k7724K555L2543l4041K678J9470j9279J8181o652k1062L0081
$$ 4803 -6770 15364 -12360 -9805 22738 -11303 -8625 10845 -8434 9747 3095 -17967 12114
1544A2114m362k2356J8213k547m802J5692j9954j105K7411k3828m513J8746j7472
$$ 12114 7752 -14604 3609 1062 -3740 11952 -8002 -9107 18304 -5524 -10037 8709 -8763
1557h763J4670J041k4665K8209j366k1549J6667o399j188J3474j7890J828J8629
$$ -8763 5907 6948 -17717 10492 9126 -12423 4244 -2155 -3343 10131 -7759 -5931 12698
1570A2698j4057m158R766q646P188J964j7525J6850N172j6824J0775l691l442
$$ 12698 -1359 -5517 4249 -4397 2791 4755 -12770 4080 9252 -7572 3203 -488 -3930
1583c930J3322j6370q4J7140j2295rO107q026Q102p54j2832J1344K834r256N773
$$ -3930 9392 -6978 -7062 10078 -2217 -2226 3881 -4145 3957 3203 -9629 1715 4549 -4707 1066
1598A066j104p17P172r409k534J0466n431k066M338m833O517Q26j1785R507J202
$$ 1066 -38 -755 6417 -2992 -5526 4940 -491 -2557 1781 -3052 3465 4291 -7494 2013 3215
1613C215p791O882m750O60Q453r339M11N917m445m41K46q78L137K582o419J444
$$ 3215 -4576 2306 -2444 -1784 6669 -2670 -2259 3658 -787 -1228 -982 -1860 1277 3859 -2560 -1116
1629a116O205p339J547J046l858P075m204j821N749l514K070k993j191N061m411
$$ -1116 5089 -2250 -703 343 -3515 3560 -644 -2465 3284 -230 1840 -1153 -2344 2717 -1694
1644a694J296P79r72L558l284m44J169J59j282j685M067j890Q18J811n497N250
$$ -1694 -398 381 -591 2967 -317 -761 408 567 -715 -2400 1667 -223 595 2406 -3091 2159
1660B159j116n077N439k254N68K090k315J486k4o39j153l99K419j977O01J679
$$ 2159 1043 -4034 1405 -849 -281 1809 -506 980 956 317 -836 -1235 1184 -793 -192 1487
1676A487j716J684o19k470J213O73j147l15K591m70j261K303k431j027L004l192
$$ 1487 -229 1455 836 -1634 -421 252 -895 -1210 1381 911 -350 1953 -478 -1505 1499 -1693
1692a693L71L555l233J056J990l282J659l5j970J356j07O42l14Q50K76k197J666
$$ -1693 -1322 2233 -1000 56 2046 -1236 423 388 -1582 -226 -333 309 -5 845 1121 -1076 590
1709E90j567j033L050k395K004K57p61J010k277J902j618j160L627l612L367M95
$$ 590 -977 -2010 1040 -1355 649 906 145 1155 -1122 780 -838 -1998 1629 -1983 1384 1879
1725A879l275L375k567o15J928k271J837j209K277m28j543L056m327J483J175
$$ 1879 -1396 1979 -588 -1203 725 -1546 291 -918 1359 931 -612 2444 -1883 -400 775
1740G75l628M852k075n57K565k688J626j381j64O87j722K901j744Q20J818l264
$$ 775 -2853 1999 -76 -633 1932 -756 870 -511 -675 12 -1710 1191 -553 267 2085 -1179
1756a179K527k192n07K468k561K353O2j393K074k058J37K41j411J131M42K6j0
$$ -1179 1348 -844 -1351 1117 -1444 909 971 -422 1652 -406 -269 -28 -1439 -308 134 160 150
1773A50R10o93j003J185j388j41J809j832J429J535k764J543O9k640K595j577
$$ 150 1060 367 -636 549 -839 -980 829 -1003 426 1961 -803 740 809 -1831 764 -813
1789h13p91L434k304Q11J314k459J369p46j675K101j19j13L75M56n73K1K37k988
$$ -813 -1604 1830 -474 337 1651 -808 561 -185 -1860 241 122 9 384 840 267 288 525 -2463
1807b463L067m88j897M628l944J989J992o255M768j099l024M201k524J468J768
$$ -2463 604 116 -1781 2847 -1097 892 2884 -3371 1397 298 -2726 1475 -1049 419 2187
1822B187k830M01L94M1j850J061J069j349L391l846J323K843n275L410j946q78
$$ 2187 -643 -242 152 193 -1657 -596 473 -876 2515 -1331 -8 2835 -2440 970 -976 -1854
1838a854N532n525J678L030l949K127j591j520L032q10j635J703K087k272K25
$$ -1854 3678 -1847 -169 2861 -1088 1039 -552 -2072 960 150 -1485 218 2305 33 258
1853B58n06j638L843k828j953N434k818J555j79l772N135j854m442M157j28j31
$$ 258 -248 -1886 1957 -871 -2824 2610 -208 1347 1168 -2604 2531 677 -3765 392 264 133
1869A33J932l881J991K659m566j78K108j007K545k354j466N174j187m491J898
$$ 133 2065 -1816 175 2834 -1732 -1910 198 -809 1736 -618 -2084 3090 1903 -2588 -690
1884f90K93L80J563m638K756N294o538O09J653l174N588m885l211R844m306k174
$$ -690 -397 -17 1546 -3092 -336 4958 -1580 -971 682 -2492 3096 -1789 -5000 4844 538 -1636
1900a636L193l810M887j150o940N251M032m317l21J526j950N375m218p355J1692
$$ -1636 1557 -2253 2634 1484 -5456 -205 3827 -490 -811 715 -1235 4140 -78 -7433 4259
1915D259k536n562O617o119N956K912j3494Q238L498o572L893l543J004Q249p683
$$ 4259 1723 -3839 2778 -3341 2615 5527 -7967 271 3769 -2803 1090 -2453 -1449 6800 -883
1930h83m854R163j932m153L475n446O688N803j5873P209P422j0674O601n711k399
$$ -883 -5737 3426 1494 -2659 816 -4630 2058 7861 -8012 -803 6619 -4055 2546 -3165 -5564
1945e564J5883j1862n550J3409o048p55K378r887J0799N095j7020Q096P522r171
$$ -5564 10319 -1543 -7093 6316 268 -487 1891 -7996 2803 7898 -9122 -1026 6496 -2675
1959b675O476o424m810J7927j1130r565J6731n837p64N118j5107J2205Q547k1428
$$ -2675 3801 -2623 -7433 10494 -636 -10201 6530 693 -71 5047 -10060 2145 10692 -10736
1973a0736R009P189q990J0204r714n606K1667j3239r987J4911o040K394M662j6400
$$ -10736 -1727 5462 -3528 6676 -3038 -8644 13023 -216 -10203 4708 -1332 1062 5724 -10676
1987a0676J2350J1390k2621N556R225r952J2068r436r629K6301j2570j2824J6952
$$ -10676 1674 13064 -9557 -4001 5224 -4728 7340 -2096 -11725 14576 2006 -10818 6134
2000F134r827N528N863k2552J7154J1530k2350O653N576q279J3218j0483j2871
$$ 6134 -3693 1835 7698 -14854 2300 13830 -8520 -1867 3709 -4570 8648 -1835 -14706
2013a4706K8151q858j6454J9234j0661L259J1571k8408J5446J7659k5925R019
$$ -14706 13445 4587 -11867 7367 -3294 -35 11536 -16872 -1426 16233 -9692 -673
2025f73M044r510J8199j4583j3184K8146q608j3955J5976r920N142J2548k9045
$$ -673 3371 -6139 12060 -2523 -15707 12439 3831 -10124 5852 -4068 1074 13622 -15423
2038a5423J0908K1036k5933P756N050j2065K3112j3867j8584L1545r311j4246
$$ -15423 -4515 16521 -9412 -1656 3394 -8671 14441 574 -18010 13535 4224 -10022
2050a0022J5821j3026Q507J4196l0343J0471K0541k3331O135K524j1663K3971
$$ -10022 5799 -7227 1280 15476 -14867 -4396 16145 -7186 -1051 1473 -10190 13781
2062A3781j1100k1002L0208n230j5864J5294j4130O822J8219l1444P884K3219
$$ 13781 2681 -18321 11887 6657 -9207 6087 -8043 -1221 16998 -14446 -6562 16657
2074A6657k3102P401N33j4235K7144j1560k2403K9605m391j1853J3240j5731P184
$$ 16657 -6445 956 1489 -12746 14398 2838 -19565 10040 5649 -6204 7036 -8695 -1511
2087a511J8671l0164L778K3783k0000O702K540j7802K8564q369k6958K9279m481
$$ -1511 17160 -13004 -9226 14557 -5443 1259 3799 -14003 14561 6192 -20766 8513 4032
2100D032j0728J5243j9317R327J9737l0024L667J9172j5813O711M4j5743K6026
$$ 4032 -6696 8547 -10770 -1443 18294 -11730 -8063 11109 -4704 2007 2051 -13692 12334
2113A2334l337k7187K4023j150j1417J6097k0183O470K4233l0052K226J8912j6612
$$ 12334 8997 -18190 5833 4683 -6734 9363 -10820 -4350 19883 -10169 -7943 10969 -5643
2126e643R613k471j6403K5918k399k3687J9425l0q742J3127j8709L118K4861k5036
$$ -5643 3970 1499 -14904 11014 8615 -15072 4353 4323 -4419 8708 -10001 -6883 17978 -7058
2140g058j480J8682j5153R615q73j9669K4894p0k3393J8139p95o143J3668j9296
$$ -7058 -8538 10144 -5009 4606 3733 -15936 8958 8888 -14505 3634 2839 -3304 10364 -8932
2154h932J687K2892k1341k235J4864j1889J0039p89j8158K0743J846k0973J4297
$$ -8932 -7245 15647 -5694 -7929 6935 -4954 5085 4296 -13862 6881 8727 -12246 2051
2167B051q79m754J4181j7885l49K2645j9300k150J2316j2429J2389j125j8362
$$ 2051 1172 -3582 10599 -7286 -7635 15010 -4290 -6440 5876 -6553 5836 4711 -13651
2180a3651K0343J318j6624J0859k816k741J2555j5135j776K0298j3604n186J1665
$$ -13651 6692 8010 -8614 2245 -571 -3312 9243 -5892 -7668 12630 -974 -6160 5505
2193E505j1117Q823K893j9448J7887L857j5808J0894m462j944J2063j5174o79
$$ 5505 -5612 3211 6104 -13344 4543 8400 -7408 3486 -976 -2920 9143 -6031 -6710
2206f710J5496r510j918N922p113P495J463j5868J2180N238j2987R006l439k865
$$ -6710 8786 -724 -2642 3280 -3833 3662 5125 -10743 1437 6675 -6312 2694 -745 -3610
2220c610J3691j4883j952J4790j0532L1N536q381R501J338j3997R501L959r852
$$ -3610 10081 -4802 -6754 8036 -2496 -2465 3071 -5310 4191 5529 -8468 1033 4992 -4860
2234d860O077j786k801J0923r039m091J1574o566j514M117p312P610K370j1124
$$ -4860 1217 -569 -3370 7553 -1486 -5577 5997 -569 -2083 2034 -5278 2332 4702 -6422
2248f422P768K700p133N378m735m67R229q565j547Q599n663J343J263o682O841
$$ -6422 1346 4046 -3087 2291 -2444 -2911 6318 -2247 -3794 4805 -858 485 1748 -4934 1907
2263A907J521q707N599L030n426M781l348l306R308o784l370Q825n341J402K562
$$ 1907 3428 -5279 320 3350 -2076 2705 -643 -3949 5359 -1425 -4795 4030 -1311 91 2653
2278B653o931O298O92o875M198P06j262K186k581m33M382k645l467M556k116j35
$$ 2653 -4278 2020 2712 -4163 35 741 -521 1665 -916 -1349 3033 388 -3079 1477 -639 -774
2294g74K993n295M721J546o682M810j527j915M877m650M46M944l998m09K064j804
$$ -774 2219 -3076 1645 3191 -3491 1319 -208 -2123 2754 -1896 -1450 3494 -504 -913 1151 -653
2310f53K79J315k874J688K902m526K310J114l362L407k132j745M760l223Q5J956
$$ -653 -374 941 -1933 -245 2657 -1869 441 1555 -1807 1600 -532 -2277 2483 -740 -655 1301
2326A301j850J182k30k415K350L15j685J364M7o96J627j591p09J981j538m52J663
$$ 1301 -549 633 403 -2012 338 653 -1032 332 379 -317 1310 -281 -990 991 -547 -999 664
2343F64j204J388K37k146J400J23j954J723R1j129K570k128P5J794k078K37J30
$$ 664 -540 848 1085 -1061 339 462 -1492 231 322 -807 1763 -365 -290 1504 -574 -337 -207
2360b07l60R80l95j7K20L46o41l89N91q80P52N45j537K639j598j25J493k975J857
$$ -207 -567 413 18 1 221 567 -74 -463 128 -752 0 545 -992 1647 49 -76 1417 -1558 299
2379B99k68j693K821j256O16J85q03P47j365O27m17K12J437j404Q47n7j031J467
$$ 299 31 -1662 1159 -97 519 704 -99 648 -717 -90 -507 -295 1142 -262 585 528 -503 964
2397I64k306J597k48j056K243j176N09O99k189J098n65j36M03j29R85o84N63k47
$$ 964 -1342 255 7 -1049 1194 18 527 1226 -963 135 -430 -566 -163 -292 693 9 572 325
2415C25p40Q61j402O04N67n80J114k88o07K62m97J57L4n71O19J91J88L71k73m71
$$ 325 -415 446 -956 -352 215 -365 749 461 -146 116 -381 -224 -190 -761 -142 49 237 608 335 -136
2435a36L05p11J77K84K92j47L85J76r31L20J50j211J358p59K39P96j014J235n94
$$ -136 169 -542 -365 -81 211 64 449 625 -306 14 164 -1047 311 -448 -209 587 -427 808 214
2454B14r13J273j441O90L87o20J448q51J9o4j55j49o15R89n73K3J617j664J021
$$ 214 -699 574 -867 -177 210 -410 1038 187 206 142 -13 -162 -777 212 -361 -338 1279 -385 636
2473F36j36k040K547k030K62J724j990K270r58q88J493j463l7L49Q6J96N43j39
$$ 636 500 -1540 1007 -1023 -761 963 -1027 1243 285 -603 890 -573 -610 -261 -175 21 564 425
2491D25j171J702r10j678K707j824N04J523k682K621n03j970K225j926M78J401
$$ 425 -746 956 46 -1632 1075 -749 -245 1278 -1404 1217 714 -1256 969 -957 -479 922
2507I22k208J875R97j802K64K88j501P73P03k339L032P60l351K575n55j623K483
$$ 922 -1286 589 1586 -216 48 336 -1165 -392 311 -2028 1004 1764 -1587 988 433 -1190 1293
2524A293k136o56L600k806J95K141k872K034j81l359L804j86k376K670j412L47
$$ 1293 -843 -1499 2101 -705 -510 1631 -1241 793 612 -2747 1057 871 -1505 1165 -247 100
2540A00K215l776J08L368k715l82K276k190J741R02m591L924O45m752M598k292
$$ 100 2315 -1461 -1353 2015 -700 -1082 1194 -996 745 1647 -2944 980 1625 -3127 1471 -821
2556h21n05N131n965R81M405m764J246Q04k599L908k98m348L740J402m213K624
$$ -821 -1326 3805 -2160 -1179 3226 -1538 -292 512 -2087 1821 1523 -2825 915 2317 -1896 728
2572G28j069j965O393n794j208P141n359J124J316n299O702j226n779N907N3k579
$$ 728 -341 -2306 4087 -1707 -2915 4226 -1133 -9 1307 -3992 2710 1484 -4295 1612 1665 -914
2588i14K711l099j1M869n465j523O929m279O06K574o268O459L93q351O624N46
$$ -914 1797 -1302 -1313 3556 -1909 -3432 3497 -782 -176 2398 -3870 2589 2982 -5369 1255 1801
2604A801l785M754m391k89P483p645j345O545m246J407J020n540P007P95q795
$$ 1801 -1984 2770 -1621 -1910 5573 -2072 -3417 3128 -1118 289 1309 -4231 2776 3571 -5224
2619e224O047Q80m110M736n181L40R025q046k223P805n465J994J364q258R155
$$ -5224 823 1703 -2407 2329 -2852 -2512 6513 -1533 -3756 4049 -1416 578 1942 -6316 2839
2634B839J753r905O763l72k624N246p332M37R608p862k067O734m153K632L68q799
$$ 2839 4592 -5313 1450 1078 -1546 3700 -3632 -3195 6413 -1449 -3516 3218 -935 1697 2065 -6734
2650f734Q544L288j1174O782P69l683P740r403r99J2622r615j637O205m509M808
$$ -6734 1810 5098 -6076 706 1475 -2208 5532 -3871 -4870 7752 -1863 -3500 2705 -1804 3004
2665C004p35q662Q296K996r854M481J122k299O702q184k289J3499r033l114O631
$$ 3004 2269 -6393 1903 4899 -4955 -474 648 -1651 5051 -3133 -5422 8077 -956 -4070 2561
2680B561o167O858L55j1524J0701K837r684M768j440j312P857q916k654J2856
$$ 2561 -3606 3252 3607 -7917 2784 5621 -4063 705 -735 -2047 5810 -3106 -5760 7096
2694G096o822l385N125n894O750J033j2322J0046M510r471M558k467j265R934
$$ 7096 274 -3111 2014 -3880 2870 3903 -8419 1627 6137 -3334 1224 -1243 -2508 7426
2708G426j0972l026J3152o404j945L474o226Q518N98j3332R426M051p888M467
$$ 7426 -3546 -6572 6580 176 -1769 1705 -4521 3997 4595 -8737 689 4740 -3148 1319
2722A319k970m53R833j0126m489J2652n555k157M121p708R254K165j4501R072
$$ 1319 -1651 -2104 7729 -2397 -6886 5766 211 -1946 2175 -5533 3721 5886 -8615 457
2736D57L800p335N316n359M33J1067j0131l560R860m209j007J467o522Q524L384
$$ 457 4257 -3078 2238 -3121 -2688 8379 -1752 -5312 4548 339 -668 799 -5723 2801 6185
2751F185j3408O745N222p525N809o153j461J3560j0865l818J0490n123J629o7
$$ 6185 -7223 -478 4744 -2781 3028 -3125 -4586 8974 -1891 -5709 4781 -342 1287 1220
2765A220p788R461K509j1814N806L987m748M903o164k136J2542q688n405J0192
$$ 1220 -6568 2893 5402 -6412 -606 3381 -1367 3536 -2628 -4764 7778 -910 -6315 3877
2779C877m808K538J154r802R741L364j2137N755J589k689O136q108q39J1560p693
$$ 3877 -931 1607 2761 -7041 2700 6064 -6073 -318 1271 -1418 4718 -3390 -4229 7331 -362
2794c62m961P428l426K977J214r663Q752M414j1092L989J754k886O537p527k208
$$ -362 -5323 2105 -1321 1656 2870 -6793 1959 6373 -4719 -730 1024 -1862 4675 -2852 -5060
2809e060J2128o741m158O245m609L988J279j0269Q892L676q992L916J20j763O139
$$ -5060 7068 327 -3831 2414 -2195 1793 3072 -7197 1695 5371 -3621 295 415 -1348 4791
2824D791p443k381J0537m516m120N272m432M121K251j1227Q051L732q465M525
$$ 4791 -2652 -5033 5504 988 -3132 2140 -2292 1829 4080 -7147 904 4636 -3829 696
2838F96j234r30P465q317k028Q339l964j355K180l289M518J714r443N506M425
$$ 696 -538 -1468 5997 -2320 -4348 3991 27 -1328 852 -2437 2081 3795 -5648 -142 4283
2853D283p477L677j070k021Q795p960k746R459n426n41K210n093O180J156p920
$$ 4283 -3194 483 -587 -2608 6187 -1773 -4519 4940 -486 -1027 1183 -3910 2270 3426 -4494
2868d494M693K850m587K328k156j355P556n594l567P865l217j200K867o142N646
$$ -4494 199 3049 -1538 790 -1366 -2721 4835 -759 -4326 3539 322 -878 1989 -4153 1493
2883A493K246q605N414J891l967L292k918j309O949n486k887O508k851J73K120
$$ 1493 3739 -4866 548 2439 -1528 1764 -1154 -2463 4486 -1000 -3887 2621 -230 -57 2063
2898B063n262M525K409p632L704J963l348L217k023k384O948m554l419O236l835
$$ 2063 -3199 1326 3735 -3897 -193 1770 -1578 1639 -384 -2768 4180 -374 -3793 2443 -1392
2913a392J272K291n632M538K003o240L320Q08k451K996k850p20N072k785k668
$$ -1392 -120 2171 -3461 1077 3080 -3160 160 968 -1483 1513 -1337 -2057 3015 230 -2438
2928b438M077k363N94J781m817L242L379o156L716j55k716M415l894j366N517
$$ -2438 1639 -724 -130 1651 -3166 76 3455 -2701 1015 860 -1856 2559 -1335 -2701 2816
2943B816l291q02K736k118J087J047l706J831K550m189J896J625l179L785k124
$$ 2816 -475 -1277 1459 -659 428 1475 -2231 -400 2150 -2039 -143 1482 -1697 2088 -36
2958c6k523N184l134r33K663k454J826P98l656K448Q97k558J461L62j230K443
$$ -36 -2559 2625 -509 -1442 1221 -1233 593 1391 -2265 183 1080 -1478 -17 345 -885 1558
2974A558j365k100L705j578j684K386k001J115J408k987J906J254k847J571k49
$$ 1558 193 -1907 1798 220 -1464 922 -1079 36 1444 -1543 363 1617 -1230 341 92
2989I2j503K738j397j419L138j786l10J667k094P44R56k619J876J168j839J018
$$ 92 -1411 1327 -70 -1489 1649 -137 -447 1220 -874 -130 826 -1793 83 1251 -588 430
3005D30nj503J839p38j548K258p88k96J596j930N79Q90k423J690L46j193J554
$$ 430 425 -1078 761 23 -1525 733 -55 -351 1245 -685 -106 784 -1639 51 397 -796 758
3022G58r02k12Q26l93n46N69j71o80J366m16o71J481j748O32O82j828J710m25
$$ 758 -144 -356 470 77 -469 100 -71 -751 615 199 -472 1009 -739 -107 575 -1253 457 32
3040C2p29J474j035K87M72n02Jj34J0l94J031j91o46J013j215J50O35r62J220
$$ 32 -697 777 -258 29 501 -1 0 -134 -124 -518 513 322 -324 689 -526 -376 259 -703 517
3059E17m34m62J379j104J15M33p77R7K20k78L51J88O7k68K95p62q4M05m07N16
$$ 517 83 -379 1000 -104 11 444 -333 -236 -16 -294 57 245 312 44 339 -423 -507 -102 -509 7
3079GJ66j68L37j76n05N83m40j09M87k21n5M69m43K79k74j31K89m12N61K06k88
$$ 7 173 5 342 166 -339 244 -196 -305 182 -39 -94 375 -68 211 -63 -194 95 -317 244 450 162
3100A62J04l00J87j71m0K52o50O67m65M41L85r04J036q79o91J087p09M78J97j99
$$ 162 266 -34 153 -18 -58 194 -456 211 -254 187 572 -332 704 -175 -866 221 -488 -10 187 -12
3120a2O49r07N16n93k01J009j106Q42m9l20M91p54O73j032J67J045j239J426q3
$$ -12 637 -270 246 -347 -548 461 -645 197 148 -172 319 -435 238 -794 -627 418 -821 605 522
3139E22p52Q26p28j03J36p12J059l46j81M05N6j71j58L15n11J26O02p32J001r8
$$ 522 -230 596 -132 -235 -99 -811 248 -98 -279 126 182 11 -147 168 -343 -217 385 -347 654 556
3159E56r09J101q82m41J177r68L02K85o98O60k52m43P21l44l94Q15n78N4J018
$$ 556 -353 748 -134 -575 602 -366 -64 221 -477 183 -69 -512 209 -135 -529 286 -292 -238 780
3178G80j054PJ090j414M56M03p63Q62P72k131J491L88j907J671p69m25J580j580
$$ 780 -274 -267 823 -591 -135 268 -495 367 1139 -992 499 887 -1020 651 -118 -543 1037 -543
3196e43J45J695j529J27L99j163J224J43j474J572K0j134J130l82j443K408j439
$$ -543 -398 1297 -232 -105 294 -869 355 498 -976 596 616 -518 612 230 -1213 1195 -244
3213b44j515L313k025L44J589k916J998K92k692K202J95j171J496j039l75K175
$$ -244 -1759 1554 -471 -127 1462 -1454 544 836 -1856 346 541 -630 866 -173 -548 1627
3229A627j583j578K776j651j83J994l084K257J593m405K767O28k642K680j997
$$ 1627 44 -1534 1242 -409 -592 1402 -1682 575 2168 -2237 530 1158 -1484 1196 -801
3244h01j34L387k968o03K450j693j24J334k596K330J689m157K214J193l164K862
$$ -801 -935 2452 -516 -1119 1331 -362 -486 848 -1748 582 2271 -1886 328 1521 -1643 1219
3260A219j767j413M296k454j681L864k390J13J617m036L070J961m791K672J250
$$ 1219 -548 -1961 2335 -119 -1800 2064 -326 -213 1404 -2632 438 2399 -2392 280 1530
3275A530k537K882k186j628M483k916j870L653j966O97J828m483K637K737n725
$$ 1530 -1007 1875 -311 -1939 2544 -372 -2242 1411 -555 142 1970 -2513 124 2861 -2864
3290b864K505J548k676L809k826k111O138l863j963M146l240J533J901m997L186
$$ -2864 -359 1189 -1487 2322 -504 -2615 3523 -340 -2303 1843 -1397 136 2037 -2960 226
3305B26K902n359J592J606l029M200k291l084O804k827l318M558l518J751K278
$$ 226 3128 -2231 -639 967 -2062 2138 -153 -3237 3567 740 -2578 1980 -1538 213 2491
3320B491o184M107K953n327K009M11k174M019k671l258O465j613l573M307l297
$$ 2491 -3693 414 3367 -1960 49 460 -1714 2305 -366 -3624 2841 1228 -2345 1962 -1335
3335a335J066L696p480L110M695n925K333O98k594N019l126m013O631k187k318
$$ -1335 -269 3427 -4053 -943 3752 -2173 160 858 -1736 3283 157 -3856 2775 588 -1730
3350a730L023l186J941L782p220K427M481n627J921P45k920N711k658m723O701
$$ -1730 1293 -1893 48 3830 -3390 -963 3518 -2109 -188 557 -2363 3348 690 -4033 2668
3365B668j555k871L198l770K637L621p468K859M094m920J942n34k946O582k977
$$ 2668 1113 -1758 1440 -2330 307 3928 -3540 -681 3413 -1507 435 -99 -3045 3537 560
3380E60m665O209j144k191K566l813J965M399p061J802M556m381K145j096l391
$$ 560 -4105 2104 960 -1231 1335 -2478 -513 3886 -3175 -1373 3183 -1198 947 -149 -3540
3395c540P181l418m519O052j371o37K000m678K774L727o152M92M238l046J927
$$ -3540 3641 223 -4296 1756 385 -252 1748 -2930 -156 3571 -2581 -2089 2149 -897 1030
3410A030q15l226O398j905n853N701q75j010K713n330L275M188o734J271K645
$$ 1030 215 -3011 3387 1482 -4371 1330 455 -555 2158 -3172 103 4291 -2443 -1172 1473
3425A473k582K875k165k594O257j556m942M238j262j27K411n483K900M652n913
$$ 1473 -1109 1766 -399 -2993 3264 1708 -3234 1004 -258 -385 2026 -3457 -557 4095 -1818
3440a818N47K309k197L211k528l264O813j645m071L593j137L56K252n720K323
$$ -1818 -1271 1038 -1159 2052 -476 -3740 3073 1428 -2643 950 -187 169 2421 -3299 -976
3455i76M576m813L50J615j792L196k601k862N396q12l824L125j064J034K352o031
$$ -976 3600 -1213 -863 752 -1040 2156 -445 -3307 2089 1277 -2547 578 -486 548 2900 -3131
3471c131K306M008m633O98O72j092M104l363k518N108j117k406J425j367J862
$$ -3131 -825 3183 -1450 -752 -80 -1172 2932 -431 -2949 2159 1042 -1364 61 -1306 556
3486E56J969n120J260M482m170N44O51k095M299k203l495N415j259j587J256k427
$$ 556 2525 -2595 -1335 3147 -1023 -479 172 -1923 2376 173 -3322 2093 834 -753 503 -1924
3502a924K498J681m786J206L519k594M03j57j526L736j689l424M248l58j329J637
$$ -1924 574 2255 -2531 -1325 2194 -400 3 -154 -1680 2056 367 -3057 1191 833 -496 1141
3518A141k784K070K240n195J891K057k293J801j499p83L890k276k547L212p00
$$ 1141 -1643 427 2667 -2528 -637 1420 -873 928 -571 -1354 2536 260 -2287 925 225
3533B25q93J505k456K362J870m613J113J955k078J901j441j578M654j896k614
$$ 225 -668 837 -1619 743 2613 -2000 -887 1068 -1010 891 -550 -2128 2526 630 -1984
3548a984L379j641J42J260l085K144K372l997J136J148j654J960j577j351L576
$$ -1984 1395 -246 -104 1156 -1929 215 2587 -1410 -274 874 -780 1180 -397 -1748 1828
3563A828j455k127K947r70j02Q42k737J567K359l692J057J192j498K486k071j571
$$ 1828 373 -1754 1193 223 121 963 -1774 -207 2152 -1540 -483 709 -789 1697 -374 -1945
3579a945L571j558j269J917j127N82J229k527J118J660k931P23J131j556K338
$$ -1945 1626 68 -1201 716 -411 171 1400 -1127 -9 1651 -1280 -557 574 -982 1356
3594A356j507j872L841j934j063J976j787J451P08l067J989J373k370J081j95
$$ 1356 -151 -2023 1818 -116 -1179 797 -990 461 1169 -1898 91 1464 -906 175 -20
3609b0p82J714p54j487K472n72j823K167j461Q0J710k751J651J389k308J191J98
$$ -20 -802 912 158 -1329 1143 571 -1252 915 -546 -466 1244 -1507 144 1533 -775 416 614
3626F14j406J632j256j285K843j295j51J276j485Q24Q24k211R04P65j135Q45J42
$$ 614 -792 840 -416 -1701 1142 -153 -304 972 -513 311 1135 -1076 -172 593 -542 303 445
3643D45j249K178r87j822K149r01j77J201j393N9K005k720J226M24j244J199o06
$$ 445 -804 1374 387 -1435 714 -187 -364 837 -556 -497 1508 -1212 14 438 -806 393 -213
3660b13n59J469q7j230J064k63p19P12m96N8J255j536O68P99j626J253m12j244
$$ -213 -772 697 610 -620 444 181 -538 174 -322 -264 991 -545 123 922 -704 549 137 -1107
3678a107K049o78q48Q96m16J54J77n97nN05k06k84J103j206P18L68j359R90j4
$$ -1107 942 264 -584 312 -104 50 227 -370 -375 130 -76 -360 743 -463 255 623 -736 254 240
3697B40j232J589q88K01R44j180L18M20p07K12J97k47k5O96n84J34N53j032M80
$$ 240 -992 597 -291 -90 854 -326 -8 412 -295 -83 114 -133 -158 538 -46 88 641 -391 89
3716H9l60j04R16o73M37K69p57J90L9m68L35j06K06L77J8n73Q15r02l54N44j05
$$ 89 -271 -375 541 -132 305 574 -183 7 46 -422 -87 -193 13 390 408 -165 650 -252 -606 -62 -167
3737a67K58L51l44kK43n73q2M21m77m2P27o46N90M9m55K16k34j09L68l31K51L44
$$ -167 91 442 98 96 339 -234 -316 105 -372 -414 313 -333 257 306 -149 67 -167 -276 92 -239 12 356
3759C56m33k3K31k46k78M19K31n72O62n57L61J49m27L71n34j15N83m59Q66o84
$$ 356 -77 -100 131 -115 -393 26 257 -315 347 -210 151 300 -127 244 -290 -405 178 -281 585 -99
3779i9K24J22l47J25k22R0P9KM14n41M29j62l07M36p82M42K36q9N64m60m47O04
$$ -99 125 247 -100 25 -197 -107 -28 -26 388 -153 276 114 -193 243 -539 -97 139 50 614 154 -293 311
3801C11n34K57j95k16M45q1j17M71r8k34k44N34n62O09l79J7Q1J26k02O7n32L77
$$ 311 -223 34 -161 -377 68 -13 -130 341 243 9 -235 299 -263 346 -33 -16 65 191 -11 56 -476 -99
3823i9l4l5O17J7k78J47j72m05N48n07k95J027o87M2J10r1L5J69m88O13J63m15
$$ -99 -133 -168 449 466 188 335 163 -242 306 -201 -496 531 -156 -114 -4 -95 -60 109 -379 234 397 -18
3845a8N03m73q0N67m47o94J472j367K62P31j107J010J42j301P53o6l30P98l61
$$ -18 485 12 -68 499 52 -642 830 -537 -275 456 -651 359 501 -800 -47 -113 -443 355 -6
3864fk26O51l32o81J330m95o20R68j046M23R58j694J040M32j783J421k91p30J284
$$ -6 -232 419 87 -594 736 241 -379 589 -457 -34 924 -770 270 702 -1081 340 49 -681 603
3883F03p67k18J009k92n12N50j000J80J299j848Q70P46r30J146q94r12K192j583
$$ 603 -164 -382 627 335 -177 373 -627 -447 852 -996 -126 620 -310 836 -58 -970 1222 -361
3901c61n87J962j255K30Q67j926J074R13k153J254N51j072J208p67j076K080j140
$$ -361 -948 1014 -241 -11 856 -1070 4 917 -1236 18 569 -503 705 -62 -1138 942 -198
3918a98q81K070j260K3J164j954J129J002k384P71J361k058J966n57j361K832
$$ -198 -1079 991 -269 -246 918 -1036 93 1095 -1289 -518 843 -1215 751 194 -1167 1665
3934A665j217j707K089j640M79J180j990Q83J746k470R26R12k133K551j071j994
$$ 1665 448 -1259 830 -810 -331 849 -1141 -258 1488 -982 -56 856 -1277 1274 203 -1791
3950a791L031q05j867K707j868M12J817l408J474J733k366J238M19j364J679j011
$$ -1791 1240 435 -1432 1275 -593 -181 1636 -1772 -298 1435 -931 307 726 -638 1041 30
3966C0j767K702n74j826K178j019l59K393l426J170K634l585J597k2j864L026
$$ 30 -1737 965 391 -1435 743 -276 -635 1758 -1668 -498 2136 -1449 148 126 -1738 1288
3982A288o65k525L202j012j422J722j460M84K570l552O54K827l304R46R74k444
$$ 1288 623 -1902 1300 288 -1134 588 -872 -388 2182 -1370 -716 2111 -1193 -247 727 -1717
3998a717L188p05l304L898r97j471K086k075P08K540l811N76L181k787Q21L50
$$ -1717 1471 766 -2538 1360 363 -1108 978 -1097 -389 2151 -1660 -1084 2097 -690 131 481
4014D81k206L257q26l270L621l89j607K171k354O81K778l886L09L223k739R15
$$ 481 -1725 1532 706 -2564 1057 668 -939 1232 -1122 -441 2337 -1549 -1240 1983 -756 159
4030A59K91k306L837r71l514L297l80j300K220k622J098K611l654J22K870k422
$$ 159 450 -1856 1981 1010 -2504 793 413 -887 1333 -1289 -191 2420 -1234 -1112 1758 -664
4046f64P89P17k945L580j80l807L404l19j476K358l188R32L501l720J92J760j792
$$ -664 125 842 -2103 1477 1297 -2510 894 575 -901 1457 -1731 -799 2702 -1018 -826 934 -858
4063h58J197k87k006L361k66k945K400J52j578K328l055K04M024l278k82K133
$$ -858 339 52 -1954 1407 1141 -1804 596 748 -830 1498 -1557 -1353 2671 -607 -889 1244
4079A244k228K182o99k671L532l50k742K317l70l12J601l017J91L461k596o57
$$ 1244 -984 1198 499 -2172 1360 1010 -1732 585 215 -97 1504 -1513 -1322 2139 -457 -1114
4095a114K025j689J852n31l213M369o99k548J810l42k02J910k972L17L010k301
$$ -1114 911 -778 1074 543 -2670 1699 1000 -1548 262 -80 -282 1628 -1344 -1027 1983 -318
4111c18m70J253j458J984m82k711L253J1k213J451p11L6K035k849K2L305k462
$$ -318 -788 465 -993 991 509 -2202 1051 1062 -1151 300 -411 -375 1660 -1189 -1167 2138 -324
4128c24m05J369j460J989j80l511L613m44j444J687j662J009J288k770K39K223
$$ -324 -729 640 -820 1169 989 -2522 1091 647 -797 890 -772 237 1525 -1245 -1006 1217
4144A217j277q6M55j141J774K10l217K607N60j912J536j419O12K220l193j43K505
$$ 1217 -60 -146 309 -832 942 1152 -2065 542 1102 -810 726 -693 -81 2139 -1054 -1197 1308
4161A308j608N70l68r20K442o62k297J905L00q65N89j399P19K399k778n25K218
$$ 1308 -300 270 -98 -1018 1424 762 -1535 370 670 -195 394 -1005 -286 2113 -665 -1190 1028
4178A028j498Q55m88j136K512o02k264J959l82k28Q21j737Q64K032k448O6J490
$$ 1028 -470 385 -103 -1239 1273 671 -1593 366 -16 -244 577 -1160 -296 1736 -712 -646 844
4195H44j160Q45n20j282K274j96k305K001j38o76J254j860K87K062k321J34J206
$$ 844 -316 529 9 -1273 1001 805 -1500 501 363 -313 941 -919 -632 1430 -891 -757 449
4212D49j026J566p20j509K208m25j581J035m59L90R57j759N31K077k015m21J113
$$ 449 -577 989 269 -1240 968 543 -1038 -3 -462 -72 885 -874 -343 1734 -281 -702 411
4229D11q67J454n02k137K668o48j324J255n78N27Q34k243J012J441j602k7Q95
$$ 411 -456 998 496 -1641 1027 379 -945 310 -268 259 1093 -1150 -138 1303 -299 -326 569
4246E69q18R08n85j132J544L1j394J468p31jJ177k212P38J299j400O05L89j086
$$ 569 -249 659 74 -1058 486 517 -877 591 -140 -141 1036 -1176 -438 861 -539 66 455 -631
4264f31J599o70j486J679np90O99k29l49J252j608j69J671j608N90K53p73J129
$$ -631 968 298 -1188 491 486 -304 395 166 -183 1069 -539 -708 963 -645 -55 198 -575 554
4282E54k17j311J704n07q24J056j045M03J271j759N38J031j357P06o7q06J037
$$ 554 337 -974 730 223 -601 455 -590 -187 1084 -675 -137 894 -463 243 176 -630 407
4299D07k68r54J036j67k68O61j116M14R08q82k98J322j298R30J4j448J608p12
$$ 407 139 -815 221 54 -214 447 -669 -255 653 -229 -527 795 -503 427 441 -1007 601 -111
4317a11q40J721j056J35O90o56K64J58o74M1R52p69K33L84j373J289or37N96J44
$$ -111 -951 770 -286 -151 539 -117 147 305 -369 -328 624 -145 88 472 -901 388 382 -555 41 185
4337A85n06O91m84J78N07j091Q70r0q10M81j39l97P29L29r28O58M2q32J032p35
$$ 185 -321 370 -114 64 571 -520 350 260 -550 -69 -208 -605 124 453 -475 183 225 -607 425 -310
4357c10O5J009j124L49M27p32M30k81l70P55m22j26P63k42p54P35j07l48M60k64
$$ -310 -245 764 -360 -11 416 -316 114 -167 -537 218 -204 -330 433 191 -563 172 65 -283 177 -87
4377h7J67N28q11Q3N11o72K17o0J28K40j78n58P56l17j63M09o86M22L41o32L86
$$ -87 80 608 -203 -120 391 -281 -64 -124 4 244 66 -492 264 -53 -216 193 -493 -71 270 -362 24
4398B4K49m44P8J37m81L94K28n94O04k14k69M88k86k53L90k83J74J33l60P00o39
$$ 24 273 -171 -93 44 -437 -43 185 -409 195 -19 -288 200 -86 -339 51 -232 -58 75 -285 415 -224
4419b24p4L32j48J40k88L01K2J85K1m11K42r6q5N20p78N44k33J69k26M1K83l65
$$ -224 -298 34 -114 26 -262 39 61 246 267 -144 98 2 -83 437 -341 203 -30 139 -87 -46 237 -128
4441a28j22K54j60K17P8q5J70l00K08k04p8J99k6L84m79J16J98m59K60J89p42
$$ -128 -250 4 -156 61 139 54 224 -76 132 -72 -150 49 23 407 -72 44 242 -217 43 232 -510
4462e10L99L9j47J05O6J14j20J97k77P1Kj33K11L12l32J54n5n61M40j68l0r8K62
$$ -510 -111 -72 -219 -114 -48 66 -54 143 -134 -63 -61 -194 17 329 -3 151 96 -465 -25 -193 -223 -321 -59
4485e9J14K45o45L66o5N8K54l87%K41J15J00k82J1n6k26P7L25l05K15N5K9n26
$$ -59 55 300 -345 21 -44 14 268 -119 -119 122 237 337 55 66 10 -216 -139 186 -119 96 151 180 -346
4508c46N52l84j08L11l02O29j3o28N65l91RL39m03K31J1K50l77J61m75O6J50r9
$$ -346 206 -178 -286 25 -277 352 339 -289 276 -115 -106 233 -170 61 72 322 -55 106 -369 -303 -153 -252
4530b52N5P78j081P56j35m76J057r16l1O44j042O07K11l61O79l75j39k81M49o34
$$ -252 -197 581 -500 256 121 -355 702 -214 -245 399 -643 -36 175 -186 493 118 -21 -302 147 -487
4550d87N43m2k28P67p0q65Q06p71l6O95o45J88P63j068M86J25p14P99J36r41J110
$$ -487 56 14 -214 553 483 -382 424 -347 -383 312 -333 -145 618 -450 36 161 -553 246 382 -559 551
4571E51n64l34P75n49N7N87j306N06J076j584Q41J74n12M94j26q46J138l77o64
$$ 551 -13 -347 428 -121 -64 523 -783 -277 799 -785 56 230 -282 212 86 -760 378 1 -663
4590f63R98m41K74P34j507M46N92j102P94L57r89J085n84j052K009o11q95J068
$$ -663 335 -106 168 902 -605 -159 433 -669 125 482 -507 578 -6 -1058 951 340 -555 513
4608E13j077P9J637j877K74J593j596L57R5p24J505p80r08J710n33p22R28r82
$$ 513 -564 -485 1152 -725 -451 1142 -454 -97 -2 -726 779 -1 -909 801 268 -454 474 -508
4626e08Q5J669j742j65J750j434J98O99j648J784m49j556J894n12n05J277j076
$$ -508 -423 1246 -496 -661 1089 -345 -147 552 -1096 688 239 -1317 577 65 -440 837 -239
4643b39l21J662j838M46J371j840N81P16j540J503K77k329K124l69q16J344j319
$$ -239 -560 1102 -736 -290 1081 -759 -178 538 -1002 501 778 -1551 573 204 -612 732 -587
4660e87J96K011k503L49J297j617Q31M34j506K205o85j758J701j41q23J358j741
$$ -587 -391 1620 -883 -534 763 -854 -23 411 -1095 1110 425 -1333 368 227 -596 762 -979
4677i79L20K015j807k50J556j322L21O79j949K106M98k795K097K17j582K207j993
$$ -979 -659 1356 -451 -701 855 -467 -146 533 -1416 690 1188 -1607 490 707 -875 1332 -661
4694f61j10K108j894k11J640j359J009m2j797J840M72k491J734J70j002J886k096
$$ -661 -771 1337 -557 -768 872 -487 522 480 -1317 523 995 -1496 238 408 -594 1292 -804
4711h04R5K540k250p15K115j544J293j39k074K276J78k029J100n0m67J277j381
$$ -804 -709 1831 -419 -1134 981 -563 730 591 -1483 793 971 -1058 42 -8 -475 802 -579
4728e79j19K253j583q61J569j388J222J99k338K278K46k193J650m36m6J201j866
$$ -579 -698 1555 -28 -889 680 -708 514 713 -1625 653 899 -1294 356 -80 -126 1075 -791
4745g91N5K056j522k24R99r17P32N8j796J735P40k040J285l18o94K136k462k68
$$ -791 -736 1320 -202 -426 573 -344 388 446 -1350 385 1125 -915 370 52 -642 1494 -968 -1236
4763a236K479j445n10J421j477J394K87k356J755K03j343R99o53J20J642j683
$$ -1236 1243 -202 -712 709 -768 626 913 -1443 312 515 -828 171 -482 -362 1280 -403
4779d03l86J675j082l94J097q49O84N53k191J397J053k261J257k32n81K440k109
$$ -403 -789 886 -196 -590 507 -342 342 895 -1296 101 1154 -1107 150 -82 -663 1777 -332
4796c32p21K116j385N48N2p89J116M50k327J260P88j496P19k26m35K001j952l64
$$ -332 -1053 1063 -322 226 278 -511 605 1055 -1272 -12 776 -720 -1 -227 -662 1339 -613 -977
4814i77J901j243K76N21j712J886K54k188J415L69p49J061j117k07J822j473j167
$$ -977 924 -319 -43 478 -1234 652 906 -1282 133 502 -247 814 -303 -510 1312 -161 -1328
4831a328J539j34j38M24j268J499L66j998J357j2n74J084j294L3J659j426l76
$$ -1328 211 77 -61 363 -905 594 960 -1038 319 307 -267 817 -477 -444 1215 -211 -587
4848e87Q61q27P57J8j312J539L38j852J073J13m47Q11q67m6J706j314m87P83l99
$$ -587 274 -553 204 222 -1090 449 787 -1065 8 121 -326 485 -382 -428 1278 -36 -523 260 -139
4867a39L65j7j276J767j78j200J106j92n05R04j337N6J480j057k38P83k76M23
$$ -139 226 209 -1067 700 522 -678 428 236 -269 635 -702 -646 834 -223 -461 322 46 469
4885D69j31j326Q59K09q20R56m6k98P00j101k28J509p72k16O49r65J383n47r13
$$ 469 338 -988 -129 80 -740 216 170 -128 572 -529 -757 752 -20 -236 413 -552 831 284 -629
4904f29O74O23q41J74k09j90J154j048j03J058r96l5O05j045J098o3q94J100j47
$$ -629 45 668 -173 1 -208 -398 756 -292 -395 663 -333 -368 237 -808 290 227 -667 433 286
4923B86n78N49o55M09M35o49n07J190n45K80k1r83J269Q7r41O49k15K46J44r38
$$ 286 -292 257 -398 11 446 -203 -710 480 -65 215 194 -789 480 567 -374 275 60 306 450 -488
4943d88M89P31j101l46J256r41L34K62p68R52Kq12O48k68l73N73k56K23O36j166
$$ -488 1 732 -369 -715 541 -400 -66 196 -572 380 382 -430 218 -50 -423 150 -106 117 753 -413
4963d13L9O23m63m2M18o21P77N4j114R01n4m16M92n63J85R65j101L45M89p50L83
$$ -413 -374 249 -214 -256 162 -459 318 372 -742 159 105 -311 181 -382 -197 768 -333 12 501 -249 134
4984A34j64n94M53O49q69R09m89j65P59o86k43P80n56J12L63m39J59J63p44N82
$$ 134 -30 -624 -171 478 -391 518 29 -136 623 -63 -306 474 -82 30 393 -46 113 276 -468 114
5004A14O5l96M05J97k27L72o69k58P32l72q1R5l13O46l36j28M86m0n74L76k87
$$ 114 179 -217 188 385 158 530 -139 -397 335 -37 -118 -23 -336 310 -26 -154 332 292 -282 94 -193
5025a93RM37l35p3K85j63l01O67o06M57j32n73O85K08m89K31j56l76N80o39J87
$$ -193 -184 253 -82 -155 130 -33 -334 333 -273 184 52 -521 164 372 -117 114 -42 -418 162 -477 -290
5046b90O57m37j7Q0R1j20R5k70J66k5j72L84o4k63N26k80j05n7j42n7M42n0k30
$$ -290 367 -70 -87 -7 84 -36 59 -211 -45 -70 -242 142 78 -185 341 61 -44 -101 -243 -300 142 92 -138
5069a38L51m82N6O91m07J42k09J95L20q99Q33o58L01Q3l51K83j06k07J47R8nk13
$$ -138 213 -269 -213 478 71 213 4 199 519 -380 453 -205 96 179 -172 111 5 -202 -55 43 38 -175
5091a75k64N62p03O39j20j15L79j64j03k20L24m2j78J49j83M2K11l05N79q41N43
$$ -175 -439 123 -580 59 -61 -176 203 39 -64 -284 40 -2 -180 -31 -214 -172 39 -266 313 -528 15
5112A5J12l56P1K26j68J44m81L31j20M1K03n3j33J35lj42L71l17J43m9nM4K20
$$ 15 127 -229 -158 68 -100 44 -437 -106 -226 -185 18 -35 -168 -33 -36 -178 193 -124 19 -30 -35 9 229
5135B29j19r7M5k7m2J21m32M83r6k37j6J54j68M72k63K99m81K59Q4m2K4k77K6
$$ 229 110 13 58 31 -11 110 -322 161 65 -172 -188 -34 -202 270 7 306 -175 84 168 126 150 -127 -101
5158a01N5k56J54P5L45k89L38n5m37L41k51O8j76J01j30M76j54l17M01l67P5K57
$$ -101 -46 -302 -148 -73 272 -17 321 266 -171 170 -81 -13 -189 -88 -218 258 104 -213 188 -179 -104 153
5180A53m39M36l81J44k00M65m35P5O68p29M45j73j59K16m01L04K41m52J86K37
$$ 153 -286 150 -231 -87 -287 178 -257 -182 486 -243 202 29 -130 86 -315 -11 230 -222 -36 201
5200B01j93j15M20k51K89m96j27L18j35P1K70k06k92M37j53j09P19r87k31Q68
$$ 201 8 -107 313 62 351 -145 -272 46 -89 -18 252 46 -246 191 38 -71 648 -339 -570 298
5220B98m62M60l33o1M2J40m60N67m64q2M13k36J02L33m10j91M35k01J08J09m55
$$ 298 -164 296 -37 -98 -56 84 -376 191 -273 -355 58 -178 -76 257 -153 -344 91 -110 -2 107 -348
5241c48O43l39k50M25K4j59L53q15K57N80q24L76M42o05J99J4m55M63J89n14O35
$$ -348 295 -44 -294 131 155 -4 349 -466 -209 371 -453 -77 365 -240 -41 -27 -482 -19 170 -344 291
5262B91l41l24P19n40J8P38n46k64P11q66R07j50r80O61J10n13R11o08k7Q94j344
$$ 291 -50 -374 345 -195 -177 561 15 -249 462 -404 503 353 -627 34 144 -369 542 -66 -93 801 -543
5283e43L44P15o64K79K43p02R43p1j418J312n29m30J010m07m92J271r63m6Q78
$$ -543 -199 516 -148 131 374 -328 615 544 -874 438 -91 -521 489 82 -410 861 -102 -148 730
5302G30j012N38k93n23P38j3q34R21j3o88N71m50n9J330j112l08Q86p48K19P75
$$ 730 -282 256 -37 -560 178 165 -669 252 239 -449 122 -328 -387 943 -169 -477 409 -339 -120 655
5322F55j260O47N37j716J338J3p15J216q89m1J209j184l09Q40l36N1O16j638J241
$$ 655 -605 42 579 -1137 201 214 -501 715 -174 -215 994 -190 -499 341 5 56 672 -966 275
5341B75K37j124O82L28r88J337q49n01J500r29l23Q63j076N34O05j104Q60N38
$$ 275 512 -612 70 398 -590 747 -102 -603 897 -32 -355 508 -568 -34 571 -533 327 865
5359H65j591P56N0o23J331q70o72J674o72q43J054j150Q82N53j911J601K40j518
$$ 865 -726 30 80 -543 788 -82 -754 920 248 -595 459 -691 191 744 -1167 434 674 -844
5377h44J330k06p83J340j093o48J612m65j013J278o40K80N68j488O42J086j872
$$ -844 486 280 -503 837 -256 -904 708 243 -770 508 -132 148 716 -772 -130 956 -916
5394i16R88j99m54J311r94o94J851r88m63J105j117R79K29j458J077J99j217J304
$$ -916 72 -127 -581 730 -264 -958 893 -95 -558 547 -570 409 638 -820 257 456 -761 543
5412E43n89n21J454j107k29J270o02n14P45j249R25P69j911J024J054j658R67
$$ 543 -46 -567 887 -220 -449 821 219 -295 450 -799 126 895 -1016 8 1062 -596 371
5429C71m04r24K070j361k40J352q25r7O50q40O74L56j364L93Q52r58M02j27p10
$$ 371 -33 -957 1113 -248 -488 864 39 -58 592 -248 426 782 -582 -189 663 -295 107 -20 -730
5448g30J889j070r06J734j007oP13j512J261M41k055J154N41q12O94k96n91J235
$$ -730 1159 89 -817 917 -90 -96 617 -895 366 807 -1248 -94 447 -365 329 33 -558 677
5466F77m89q74J001j65n87J005j350Q61O49j888J184L61q95J200p49n75J420p22
$$ 677 188 -686 315 150 -437 568 -782 79 728 -1160 24 385 -510 690 -59 -634 786 64
5484F4o61J132n07R2K76j696J188J268j884O40J02k58O77m99m32J111p81o79J228
$$ 64 -597 535 28 120 396 -1300 -112 1156 -728 -88 14 -244 433 -66 -498 613 -168 -847 381
5503C81n58oM66q80N22Q57j581Q19L66o78P04m96m77J089o04j87L71l49N11J56
$$ 381 -177 -183 283 -597 -75 782 -799 20 386 -292 412 -84 -561 528 -76 -263 108 -241 270 426
5523D26r48O96R26j639N16m8l60Q66n04m14J115m56o01N31k86K98K25o67L84N50
$$ 426 -522 174 1100 -539 -23 -71 -431 435 -69 -483 632 176 -425 106 -180 118 343 -324 60 610
5543F10q70Q1K45l82J096q92o11J167n5o32P91j271J101O5j113P91M98o13J17
$$ 610 -260 -179 66 -316 780 -112 -723 444 389 -243 548 -723 378 443 -670 121 619 6 123
5562A23k03k03N62m00m40R73j9o86N40o58O09M79j162N21N41p50M82n09M3N83
$$ 123 -80 -283 279 -121 -561 412 393 -293 247 -411 198 677 -485 36 577 -173 309 -200 -157 426
5582D26p56J67M82m61K34L9m51N31J83q34L93M61m53LK7j40M02j37m83Q96n72
$$ 426 -330 -163 319 -142 92 131 -320 211 394 -440 -47 414 -39 -36 -9 -149 253 116 -367 529 -43
5603d3k20L57j31oP07j150L82K54j21K66o09L3O31k99k18L11j51k43N23m94J51
$$ -43 -263 94 -37 -43 664 -486 -104 150 29 295 -314 -281 350 51 -167 144 -7 -250 273 -221 -70
5624g0O09r73L53L84p36P72m04l60O36j56n99R55p06N40P6o98N07K86m50K13j52
$$ -70 539 -434 -81 303 -433 339 -65 -425 211 55 -544 411 -295 245 321 -377 130 416 -34 179 27
5645B7k97N94l27k03N44m36rL79m33L19K97n51J82M8l75O90n77K19M93q66n0R33
$$ 27 -270 324 -3 -206 338 -98 -107 272 -161 158 455 -96 86 134 -241 449 -128 91 584 -282 -332 601
5667F01m16l04J90k6k45M62n89J99L18j88K56q1k54Q5M7l29O86k42r3K92l57Q
$$ 601 185 -119 71 45 -200 262 -327 -128 190 2 258 177 -77 8 55 -274 412 170 77 369 12 20
5689B0J76l06K6L47m79N29j86j84K38j95k50M33l0o05M47j08K24J12l17OO11n80
$$ 20 196 -110 -84 263 -216 313 127 -57 181 -14 -264 169 139 -466 -19 -127 97 209 -108 -102 509 -71
5711g1N2l58R8N99k83j85J73J29k45J03Mr3J94P5k58J31l05J08R2m52N02J04n97
$$ -71 -19 -377 -279 320 37 -148 25 154 -91 12 16 -77 117 192 -66 65 -240 -132 -40 -492 10 114 -483
5734d83R50m33lL68p08L37K60m32q7m9L76qK3o2n7j06j68L80Q6k32K14j05k20
$$ -483 467 34 31 399 -309 28 288 -144 -231 -280 96 88 111 49 -8 -114 -282 98 184 -48 166 61 -159
5757a59M03l02O1j88J96Mo8K78j98M29n51q9J73rR9K10j1Rk65J34r9j81J22P3
$$ -159 244 -58 3 -185 11 15 -53 225 27 456 -95 -184 -11 -20 79 289 278 287 22 156 57 -124 -2 71
5781G1j51K9L63m77L76l16j84L74j21j62R3j40K12j19K4R4P3K2k36jP2J78J43
$$ 71 -80 -51 312 -165 211 -105 -289 85 -36 -198 -105 -245 -33 -152 -128 -34 39 61 -175 -176 -104 74 217
5804B17l96J97l0L10k10R8%j39k12Q23o31P3J85l57L7o2NJ29R9P5j36J88k66j16
$$ 217 -179 18 -12 298 88 186 186 47 -165 658 27 100 285 -72 -35 -97 -92 37 136 211 75 263 -3 -119
5828a19K31k33J63N7m36N23j68k68P06n55J13k08L41l68K23j9k2n3L2k88L95O7
$$ -119 112 -121 42 99 -337 186 18 -250 456 -99 14 -194 147 -221 2 -17 -39 -92 -60 -348 47 114
5850A14J5n0k47K98l8K04j13l50N12n32J23J73K78k82j57p4L1J36j74j5L62l83
$$ 114 129 79 -168 130 92 296 183 -167 345 -187 -64 109 387 105 -52 -126 -95 41 -133 -148 214 -169
5872a69M07n18N1M74k8o2j27J7K18k14k49J43N9o8J76K9m20L95M42p58J77M99
$$ -169 238 -280 -229 245 217 155 28 45 263 49 -200 -57 2 -66 110 139 -281 114 556 -202 -25 474
5894D74r13N76J1m69O04n70J02K92j16k8K87l93n7M20k01j32M54m81K35O2k34
$$ 474 -439 137 148 -321 283 -287 -185 107 -9 -37 250 -143 -200 220 19 -113 341 -140 95 157 -77
5915g7o8J81j40K38k47J65K1P7j48K31n43P0J47k37M82J74o75N34l59JL68m10
$$ -77 -145 36 -104 134 -113 52 73 150 2 233 -310 -240 -93 -330 152 326 -349 185 -174 -173 195 -215
5937b15M0O71o10L6M51o45O75k28o13K61N09m98M16k64l77P86o80m1N91m57M81
$$ -215 -175 496 -114 -78 373 -272 403 175 -438 -177 332 -166 250 -14 -391 395 -285 -326 265 -192 289
5958B89k38l10O22R7q25N59J07q61R11l34j36P51p56n9O74q73K67L42n64J88J15
$$ 289 51 -259 363 460 -365 194 301 -560 351 17 -119 632 -124 -183 491 -382 -115 227 -337 -149 -34
5979c4k21K80L64q83Q00J83r24R03n82n0O86l75j45L86j134Q31L14j016O55Pk8
$$ -34 -255 25 389 -494 306 489 -435 468 -114 -164 522 147 2 388 -746 85 399 -617 38 45 17
6000A7J02k78k21R10n13l44Q37n49k88P33j199R83K15r21N58P9m74Q94q54L5O15
$$ 17 119 -159 -380 530 17 -327 510 -39 -327 406 -793 190 405 -516 42 121 -353 541 -313 -278 337
6021C37k00o43P72p21N14N13j030O67M28j024L30K87q29Q48j67o21J184q31j8
$$ 337 137 -506 266 -455 59 572 -458 209 637 -387 -57 230 -599 249 82 -539 645 -186 -204
6040b04O78o35L78N81j490N62L73n05L36J64m67Q65o85l96O62j10j63M30p88M83
$$ -204 474 -161 217 798 -692 -130 243 -262 74 238 -229 636 -49 -445 217 107 -56 374 -414 69
6060F9P70j319M64L11p74O81m04l95J067l26p30P47k28l24Q23r67O21M77q98K13
$$ 69 839 -480 -16 295 -479 202 -202 -597 470 144 -586 161 -67 -391 432 -535 86 563 -335 -122
6080a22N33r27M90nn21R68k02r16Q82j95n99J210j098N60L90j104N24N00q32N41
$$ -122 411 -516 -26 -31 -552 416 214 -702 180 -15 -614 596 -502 58 448 -656 -132 368 -464 77
6100G7p9k32P31j97q25P83Q8p37O41n77m0R49j031O87K68j230J058n43m9J108
$$ 77 -2 -234 497 300 -525 258 346 -391 250 -327 -367 582 -449 238 506 -724 334 -209 -258 850
6120H50o00o36P10k35P7L26p64K75M81q28J99O66q48P10k72n67P53r0p25P48j06
$$ 850 250 -386 324 89 166 492 -272 3 484 -344 -145 521 -327 383 111 -456 297 207 -518 230 124
6141A24O5J04q98P22O65j135P5M51p55J310k90q30J116p42m1K33o50J70Q55j301
$$ 124 189 293 -605 117 782 -353 -278 173 -582 728 438 -392 724 -18 -59 174 -476 -306 549 -752
6161g52L44R94q53K73nm75J105o85n74J194n56l38P60q88M76J72q59M28Q16o01
$$ -752 -408 586 -267 6 1 -474 631 -54 -628 566 10 -328 432 -456 20 192 -667 -239 577 -24
6181b4j34J75j27M22k36q87J301l32k56L99n25O4P01r23m3J048o30L58l53k31
$$ -24 -158 17 -110 312 76 -811 490 158 -98 301 -224 -160 541 -382 -425 623 -7 351 -2 -233
6201b33P39l37n64O41on28M15k18J99P88j558J75Q63p57M3N30l58P70l18p94N02
$$ -233 506 169 -395 246 240 -288 127 -91 108 896 -662 -487 376 -381 -338 192 -166 604 286 -508 -6
6222fJ60k11K22l42j3P38r28K40N56q33K47P1m70J117n45l30J016l67m92M31n18
$$ -6 154 -57 165 -177 -190 548 -380 -140 416 -417 -170 -99 -569 548 3 -327 689 322 -170 261 -257
6243b57L66M49r09K84M42o31L52k48pN22l87q2O00n35k14M70o77K54P91q72k2
$$ -257 109 558 -351 -67 375 -256 96 -152 -159 363 -24 -106 494 -41 -255 215 -462 -208 583 -289 -311
6264c11O41n10L78l00j74P01m16o22P60j89jK09o47L77M47l96j45L81n62O41m37
$$ -311 330 -180 198 -102 -276 425 9 -613 147 -42 -43 166 -481 -104 343 -53 -198 183 -379 262 -175
6285a75k02Q22k56o26Q22l14o0L20p63M38L48m44J54K76m86L77n54j04M12M2j85
$$ -175 -377 445 189 -437 385 71 11 331 -432 6 354 -90 64 340 -146 231 -323 -427 -15 27 -158
6306a58K66l08J52K76l52n4L09m47J76m1j6M80k53m16N98m9p9k21J5K34r5L3J18
$$ -158 108 -200 -48 228 -124 -178 131 -316 -140 -181 -197 283 30 -386 212 163 84 -137 -122 112 17 50 168
6329A68L49p31J96r8J8M41j65j74J39N4k89J24j43m5M58m31K36J63k61J23Q4p67
$$ 168 517 -214 -18 -116 -98 343 178 4 143 197 -92 32 -111 -156 302 -129 107 270 9 132 216 -551
6351e51O81m32J10L25l13kM69p5n00L47q2R2K9N5j23J10m55M98j04m90N84k3k33
$$ -551 130 -302 -192 133 -180 -182 287 212 -288 59 -23 69 98 153 30 140 -315 183 79 -411 173 150 -83
6374h3K99k71L94m15o7K70j94j48M4J17L21k77J78m24L93R8m08O6J80J0o1j26
$$ -83 216 -55 339 -76 -143 127 -67 -215 -171 -54 267 -10 168 -256 137 235 -173 -107 73 83 22 -104
6396a04J30J75m61L63l06L06l39M62l24J55j06j81J42P3k09K87K9n70N09k88L27
$$ -104 26 201 -260 103 -203 103 -236 226 -98 57 -49 -230 -88 -15 -224 63 92 -478 31 -257 70
6417G0l7k62L65J06n14L51j01J21J10k53qK39p5J35l41J90J31L29m30j79L27l85
$$ 70 33 -229 136 242 -272 79 -22 99 209 -44 -52 187 112 247 -94 96 227 556 126 -53 274 -111
6439a11J56q3O5j3l18R6N99j35m46J2K04L63k77l13M38k94r2K12j03K35q7L1k70
$$ -111 45 -38 27 14 -304 -208 391 256 -190 -178 26 389 112 -201 237 -57 -149 63 -40 195 108 139 -131
6462a31K58K8j16o3J24l3nr7J68N5m95N40%p2o1j85L45k90P6J87j63k54P6K04
$$ -131 127 155 39 -24 100 67 62 -35 133 188 -307 233 233 161 100 -85 260 -30 46 233 70 -184 -108 96
6486I6k68M29K44p87L96J43k07J98j46k41J58m8j21L72l79K80j50N3k20K71j73
$$ 96 -172 257 501 -286 110 253 46 244 98 -143 15 -33 -154 218 -161 119 -31 22 -198 73 -100
6507a00q9J66l32M91M5j75Kn5J41l7l96L84pp7K36l00q0K31k53L54j1m24K59J16
$$ -100 -189 -23 -355 136 181 6 8 -47 94 57 -339 45 38 -39 197 -103 -183 48 -205 149 138 -286 -27 89
6531H9k48M83j80m91L82J35l31R3R9j91j97L00K1l5J85n06M66J72n44M46j53M3
$$ 89 -159 324 144 -347 35 170 -161 -68 31 -160 -357 -57 -36 -71 114 -392 74 246 -298 148 -5 38
6553C8l42L53r2L5K93J18k21k93J8J54j7k94L18j02K80k36K10P3n21L66l50Q0
$$ 38 -304 49 -43 -8 285 403 182 -111 -93 61 44 -250 68 -34 246 10 220 293 -228 138 -212 -132
6575a32K51p6L70n55M18q7R5n57M45K01m46J27K6k87L74R1k28n0r1R1j94k24O25
$$ -132 119 43 413 -142 276 189 284 -273 172 373 -73 54 80 -207 167 258 30 -20 -111 -20 -214 -438 187
6598A87Rl51K70n2o4J86m5m66M41J51l14K64j72l5q7o3K76j53k20K27J50m40L90
$$ 187 196 -155 115 63 -1 185 140 -326 115 266 -48 216 44 9 -78 -141 135 -18 -238 -11 139 -301 89
6621H9r8j47O6M03o24O94k47p9q3j38J32K34k83j12L42m11J81j00R2k16J88j88
$$ 89 -9 -156 -90 313 -311 383 136 57 -26 -164 -32 202 -81 -193 149 -262 -81 -181 -89 -305 -117 -305
6643c05N23j29l45K54k88M72L20q18L30k07j2K38j69k57N75l41j40O31n52K79
$$ -305 218 89 -256 -2 -290 182 502 -316 14 -193 -205 33 -136 -393 182 -159 -299 332 -220 59
6663E9L6k88J71Q7j51K23P3j52J24l31j11O54Q1o42M27k63O0J68m92P1L19k84
$$ 59 95 -193 -22 65 -86 137 210 58 182 -149 -260 394 475 -167 260 -3 57 225 -267 -196 123 -161
6685a61J97O8l73M97m69j69P63j26j90L63l57Q6L41o19m2M36l07J49J50p74P69
$$ -161 36 104 -269 228 -241 -410 353 227 37 400 43 129 470 -149 -191 245 -62 87 237 -537 232
6706B32l23o28R95l98j17N64j56k86M81m94n7M22k28j9k06j69R51l90m64N14m05
$$ 232 -91 -719 276 -122 -239 325 169 -117 364 -130 -187 235 7 -12 -218 -387 564 174 -290 224 -181
6727a81J19N84n95j31L20n04L80K95m63J77K01m09O00k16n72M99J10k63J36l20
$$ -181 -62 522 -73 -204 116 -388 -8 287 -176 1 202 -207 393 177 -395 104 214 -49 87 -233
6747b33qO39o25K41J22k50M42K0r21Q44l73n57M64K36j34L50k77k3M52n57l52
$$ -233 -241 398 -227 14 136 -114 328 348 -573 271 -102 -659 -195 41 -93 257 -20 -43 409 -148 -500
6768e00O99n75L47R2m29Q18l72m01M82k68M4N32o35K07N81p74J32K41m93N28l16
$$ -500 199 -376 -29 63 -366 452 80 -321 161 -107 -63 469 -166 41 622 -152 -20 221 -272 256 -60
6789f0l48Q99N1o48L45l34k62O77r26K87Q74o54L0P9k67P50m08p36J030l74m4
$$ -60 -408 491 542 -106 239 -95 -357 320 -606 -319 555 -99 -69 10 -257 493 85 -651 379 5 -39
6810c9K68L2n97R98r41l23R25m95mM64l07J58j88o79R28j94n4M48o63m6O26n52
$$ -39 229 261 -336 662 -279 -602 323 -172 -176 288 -19 139 -49 -728 200 6 -48 400 -263 -309 317 -235
6832b35JQ53p45Q9K35k35N29o37j71J027o09l35L73k57J72L86o69r9P33n94L68
$$ -235 -234 619 -126 -37 198 -37 492 -145 -316 711 102 -233 140 -117 55 441 -228 -327 406 -188 180
6853A80q6m65P25l49l07K82L14n08K86j51k05O30n68M2L43j71l7J23o25R55l05
$$ 180 94 -371 354 5 -302 -20 294 -214 72 -79 -284 346 -222 -180 163 -8 -45 78 -547 408 103
6874A03n74M14J48k56N14r32M72K52l44p9K65l06K88L26p83N89J8l70M62k55N7
$$ 103 -471 -57 91 -165 349 -583 -111 141 -203 -282 -17 -323 -35 291 -492 97 115 -255 207 -48 9
6895IO26q13K91K67p99N62R3m31N92l6q57O29L4n06N65k42j51N07k56l13M37k80
$$ 9 635 -178 113 380 -419 143 236 -195 397 361 -496 133 167 -339 226 -16 -167 340 84 -229 208 -72
6917g2k3N15m03L50r6l83M39k42j32L28k09k31O53m29o5J81l51K19P0n9K51j94
$$ -72 -95 420 17 367 271 -112 327 85 -47 281 72 -159 494 65 0 181 -170 49 119 60 311 117
6939A17k80L08j02k03J23J49j80L64n27L3N17m13n8L16l71L43L6k01K41j89m57
$$ 117 -163 145 43 -160 -37 112 -68 296 -231 -198 319 -94 -152 164 -207 136 172 -29 212 23 -434
6960d34L76j1L2N29o45L5L96j75Rk10R3OJ47l13L54j10j75L66j76O2j33k61J14
$$ -434 -58 -69 -37 492 -153 -118 278 103 112 -98 -5 1 148 -165 189 79 -96 270 94 156 23 -238 -124
6983a24K34m00L41m6j09n7K46l10P7L81l97O8k12K87K5j97k68M62l45J62L21k75
$$ -124 110 -290 51 5 -104 -161 85 -225 -148 233 -164 -96 -308 -21 4 -193 -461 1 -344 -182 139 -136
7005a36L25p7l01L6K53l1q3M5l89N95m32J61k9l82O4K93M25j90l23Q5j01K42m62
$$ -136 189 112 -189 -153 100 69 -14 31 -358 237 -195 -34 -63 -445 -381 -88 337 147 -176 -91 -192 50 -412
7028d12M97j89pM85o4m41N5Q0J97n3k42J61R1l18J47J55j43J24n5q2K8k15N9M66
$$ -412 85 -104 -111 374 310 -131 -76 4 201 148 -94 67 158 -160 -13 142 -1 123 68 -14 14 -201 -142 324
7052C24m18L58k27J25N7j29k57R9qJ06J67l14k04N25O7m41J92m85K73M52l99L22
$$ 324 -94 264 37 162 219 90 -167 -68 -76 30 197 -117 -321 204 271 -170 22 -463 -190 262 -137 185
7074A85k2k87K8j06J76O5J91k49j76L45l48K43K31n11L30j12p6J38j15k8K06j01
$$ 185 163 -124 -96 -202 -26 39 230 -19 -195 150 -198 45 276 -235 95 -17 -93 45 -70 -98 108 7
7096Gq2k68N97l12j09j62O90m63L36k60J59j84j13L84k86L38n60L24j25k90K80
$$ 7 -75 -343 254 -58 -167 -329 361 -102 234 -26 133 -51 -164 220 -66 272 -288 36 -89 -379 -99
7117i9K5k87M12J83j74m8j65M07J28n83K44k82K34Q9Nn49M14R4J09k08j31r6L72
$$ -99 -74 -361 51 234 60 12 -153 254 382 -201 43 -239 -5 84 89 -460 -46 48 157 -51 -182 -278 94
7140I4q2n6K26j47lK14j70p7ml01J58J45Q6l6j48j75J51Q1J53j35k99K08J5j1
$$ 94 12 -44 182 35 32 246 76 -1 -5 -306 -148 -3 83 47 -101 -276 -125 -44 109 -26 -325 -117 -102 -113
7164a13k7K39j40J22j45K40K8l92K07q3Q6K68l89m3M03k08j13j06J74r6qm9Q9
$$ -113 -140 99 -41 81 -64 176 204 -188 19 -64 22 290 -99 -142 261 53 -60 -166 8 -88 -96 -145 -56
7187e6Q3q0n6L49l25k25n3K71J63k01L5J53J14l30L09N4k52j04Q0J51q0r7j3K21
$$ -56 27 -53 -109 240 -85 -310 -363 -92 71 -130 -95 58 172 -158 151 205 -47 -151 -71 80 0 -97 -110 111
7211A11l47J28R5j36K65k16L68q7l72L04j64J44k87K18o2k3P0j98K62j40Jmo8
$$ 111 -236 -108 -13 -149 116 -100 268 181 -191 113 -51 93 -194 24 -38 -61 9 -189 73 -67 -66 -70 -138
7234a38K50J72m03J97J03L9n3k08o7L45q9j19o0P2q4L56k62k81J30k03M09k15
$$ -138 112 284 -119 78 181 220 167 -41 -108 237 148 29 -31 41 -43 313 51 -230 -100 -303 106 -109
7256a09N1J89k39J62k01J88k8p3J5O8K97j79n97M99j39n2L50j94K51l68K19k25
$$ -109 -58 131 -108 54 -147 41 13 -60 -45 23 320 141 -456 43 -96 -148 202 8 259 -109 110 -115
7278a15J94l39R7K47j04j05M8j11O30n29R2j89K66j61L31n27M38j86J31J9k04
$$ -115 79 -260 -163 84 -20 -125 -77 -188 442 -87 5 -184 82 -79 252 -275 163 -23 108 127 -77
7299g7M6l1qM4J31j85J82R2P5j76Pn61P46k13l05L71q8k98P56n35m44Q57l83n6
$$ -77 -31 -62 -70 -26 105 -80 102 194 269 93 100 -461 285 72 -233 138 50 -248 508 -27 -471 386 3 -53
7323e3j04J88J19j08j69k5J86k30K21J39k18K39l23k77M41K50r6k37p7J64K33
$$ -53 -157 31 150 42 -127 -152 34 -196 25 164 -54 185 -138 -415 26 276 180 -57 -134 30 263
7344B63o22M43k0J36k75l1J04K65p5l56M21m39J13l1k50M65m18Q1N06J87n72L05
$$ 263 -359 84 64 200 -75 -106 -2 263 188 -168 253 -186 -73 -104 -354 111 -307 -226 280 467 -105 200
7366B00l94j65N94k11j73K44P7k73K53m15L92R7l69M17k15l07L48J54l47M65o20
$$ 200 -194 -359 235 24 -149 95 172 -101 152 -263 129 226 -143 274 59 -248 100 254 -93 372 -248
7387b48p2M23l63L00J70n17N53l40q8N09l49j79N46k69k04M15l41r9J38k90L08
$$ -248 -320 103 -260 40 210 -307 246 -94 -182 327 -22 -201 345 76 -128 287 -54 -153 -15 -305 3
7408CK61m87L49k7m50N50k59j41L6q5n1N31l93J30L5j79J98L47o08K35M2m71M84
$$ 3 264 -223 126 99 -351 199 -60 -201 -165 -250 -301 230 -163 -33 2 -177 21 368 -240 -5 37 -434 50
7431E0k57j38L92r4P4J78j91k51L13M9j21q5k08L06j01k88M15RN3J14J2o25N82
$$ 50 -207 -345 47 -47 27 205 14 -237 76 125 4 -81 -289 17 -84 -372 43 52 105 219 231 -394 188
7454A88j74k03J13k08M10J98l02L27r8m25J56M0R4J05n6o22O34o24N09j71l40
$$ 188 14 -189 -76 -284 126 324 22 349 251 -174 -18 22 116 221 165 -457 177 -447 62 -109 -449
7475d49N35k15k46M19J91o42J05L90n16R05o75j75Q19o02Q5L56l95J69J8l56L48
$$ -449 86 -129 -375 44 235 -407 -302 88 -428 477 -198 -373 446 -156 -71 285 -110 59 77 -279 69
7496F9J51j38j10j76J85K36k57l81Q20o86K14J9q6L8K05o79O09J76l34M39o15
$$ 69 220 82 -28 -204 -19 217 -40 -421 399 -287 -73 -54 -140 -102 103 -576 33 209 -125 314 -301
7517c01L82K66p7m43K46j9P8P1n55O50Q1n90M74l06k11K31J49k43M24p23M29K46
$$ -301 81 347 270 -173 73 54 132 203 -352 298 379 -211 263 -43 -254 -23 126 -117 307 -416 13 259
7539B59m69j92L62j52K06j2k04M37j30k81R2J33j32N48n71j7M44n52J05K88m71
$$ 259 -210 -402 -40 -192 14 2 -202 235 105 -176 -84 49 -83 465 -106 -123 321 -231 -126 162 -309
7560c09L70J73m24J92K8j36M09l97p0M56k20k42K48m73Q05q6n12M67o0n05M9K05
$$ -309 61 234 -190 2 30 -106 303 -94 -164 292 72 -170 78 -395 410 324 -188 279 219 -286 -237 -32
7582c2r1L91j30n61O88k0l32K63k65K97j70k57rK23k25M08q4n47P91m35l56O09
$$ -32 -123 268 138 -423 265 245 -87 176 -89 208 38 -219 -228 -5 -230 178 94 -453 338 -97 -453 156
7604A56k08k86K72J59j0k2l01M66Q1k73j58J15pQ5l05R1M01j39j35L54n76K39
$$ 156 -52 -338 -66 93 83 61 -240 226 307 34 -124 -9 -16 69 -236 -145 256 117 -18 336 -240 -1
7626aK35l56J96o0j93J93r9k25K33J4k60M68n28M76N5q5J30k51oO7M6m29L50J08
$$ -1 234 -122 74 14 -179 14 -85 -310 -77 -63 -323 145 -383 93 148 63 193 -58 -64 3 49 -380 -30 78
7650G8k52N20l23n5K66k84M56n70r4L49l0j19K60l74J62J26j26j48L05k55kR7
$$ 78 -174 346 23 -32 234 -50 406 -164 -258 91 61 -58 202 -172 -10 116 -10 -158 147 -108 -110 -13
7672a3L04l24K42n82K14J22J6M9K13j60k77j03J37Q9j06J57O3j94m6J38j41N39
$$ -13 291 -33 209 -373 -159 -37 -21 28 241 81 -196 -299 -162 -73 -179 -22 41 -153 -199 -61 -202 337
7694C37k32l83L89j64j00j8J72q0J63K55m51l4K93k26l5j05K9L22j93J34j5mK9
$$ 337 105 -278 111 -53 -153 -171 1 -79 84 339 -112 -146 147 -79 -114 -219 -190 132 -61 73 58 54 83
7717H3m17R5N87l04k26K76q7L68k57j34J17n6J2J06o0l00J96n9K8L59k56k03l3
$$ 83 -334 -239 348 44 -182 94 7 375 118 -16 101 45 57 163 103 -197 -1 -60 -32 327 71 -132 -165
7740a65K16l2L04l20P2K40m39K58l34K10J27P7n29M42k47K36k18J49j19N29l88
$$ -165 51 19 323 3 75 315 -124 134 -200 10 137 214 -315 127 -120 116 -102 47 -72 457 69
7761F9j00K04l4n2j75J52j09j55M28k59M1l54L94j80K61l0k75J42J24n1l16L38
$$ 69 -31 173 139 87 -88 64 -45 -200 228 -31 10 -344 50 -130 131 101 -174 -32 92 41 -275 63
7783F3K17k69m2r9L09r7k20M80Q3n78L54q8m6l17J73J09j26k08K74q9RK41l33
$$ 63 280 11 -31 -130 179 82 -138 342 425 -153 201 113 67 -250 -77 32 -94 -302 -28 -117 -108 133 -200
7806b00L61l20Q0o1J4M1j75O12l76J82n39L20p4J40j14J29m5j31j50J41P8J47
$$ -200 161 -159 -79 -140 -126 -85 -260 352 -24 158 -381 -61 -135 5 -109 20 -25 -156 -306 -165 -87 60
7828F0L7r6p1K29j42m6j40K63n3nK2m6M1lj32K0K22l21P0L38j91j9Q2o8j62n9
$$ 60 97 1 -70 159 17 -29 -169 94 41 36 58 12 53 50 -82 -62 160 -161 -91 247 56 37 119 51 -111 -170
7854a70L19p0m4k78M81l09J16l2j84K9M86k15j64J14j34J17n1r3K24j5j29K68
$$ -170 149 79 35 -243 238 -71 45 13 -171 -142 344 129 -35 79 -55 62 11 -82 142 127 -2 266
7876B66l97J71N7k08J69p2O7m42M42k85L68j45k33J98P0j84L8J19J31J9j99K60
$$ 266 -131 40 97 -111 58 -14 53 -389 53 -232 136 -9 -242 -44 26 -158 -120 -1 130 149 -50 210
7898B10k71j60L33J06l60n8N74j32J1l24J4O8k14L29K4k62J05J40m81N77l08L6
$$ 210 -61 -221 112 218 -142 -200 374 242 253 -71 -57 11 -203 126 150 -112 -7 133 -348 229 -79 -43
7920d3Nk16J35J14m22M91J26k12K13k23o1p0M26mm38K63l7J49n8l03K83kM5k26
$$ -43 -38 -254 -119 -5 -427 64 190 -22 191 -32 -93 -163 263 259 -179 84 47 196 138 -165 118 116 161 -65
7944f5K09k01r2m5K36J16j24j3K15m27L47J1m52L90k38O8J4j89oN79m88K89L21
$$ -65 144 -57 -149 -194 42 158 34 21 236 -191 156 167 -285 105 -133 -65 -51 -240 -246 333 -155 134 455
7967D55n93J66p1J9J88j02j47J39m29M58P0q8j54q0N1K06q3k91M04k87J38K49
$$ 455 -138 28 -43 -24 164 62 -85 54 -375 83 153 65 -89 -169 -118 88 5 -286 118 -169 -31 218
7989B18j48m26O66j79k19j3j97K43L21m84L41l33O8L39j22k2J75J99n95L59j73
$$ 218 70 -356 310 131 -88 -101 -298 -55 266 -218 123 -210 -142 197 75 53 228 427 -168 191 18
8010A8K16Ol85R1J04j95L31j57k46J41K66N4j79J69n80L10j46J62K3j02K97j96
$$ 18 234 240 -145 -54 50 -145 186 29 -217 -76 190 244 65 234 -346 -36 -182 -20 3 -99 198 2
8032Bk73N10m12K23J14o9o3p4J40k99L31k29q6M99l34J20ro1j37K80k48M7l46
$$ 2 -271 239 -173 50 164 95 32 -42 98 -201 130 -99 -185 314 -20 100 91 30 -107 173 -75 -28 -374
8055c74R4M39k19j07J49j65J40L68o66P29k18j17K19k04l29M16k77JL05k57o4
$$ -374 -280 159 -60 -167 -18 -183 -43 325 -341 388 170 53 272 68 -261 155 -122 -121 184 -73 -137
8076a37M4K29m02P02m97J27K94n98P3L29k61J75j57r4N01k59j38J20j27L0M02
$$ -137 -93 136 -266 436 -61 66 360 -238 -165 164 -97 78 -79 -173 328 69 -69 51 -76 -46 356
8097C56m23R6l7j43m1P8N1J85j44j78K52K3j09k6k56M69j02j29N2J31k09J54l57
$$ 356 -67 29 -8 -151 -192 -114 -63 122 -22 -200 52 75 -34 -60 -316 153 51 -78 -26 105 -104 50 -307
8120c07J46K17k62m9J73l8m9J38k52P00m0m48K11K60k15k0K04o17M13L6m79M41
$$ -307 -161 56 -206 -255 -82 -120 -169 -31 -283 417 377 -71 140 400 185 165 369 -248 165 201 -278 163
8142A63o2k34L28k29K36l5l13K4J39k29K50j10L3K57k51k84M33m2j44R9L7j32
$$ 163 101 -133 195 -34 202 167 -146 -122 17 -212 38 -72 -39 218 -33 -317 116 74 -70 29 66 -66
8164f6L49o10R2M51o57N74l2l12N96n50L27J33m46M50k57k01L41k38j69K03O8
$$ -66 283 -327 -235 216 -441 133 101 -211 385 -165 162 295 -151 299 42 -159 182 -56 -225 -22 46
8185D6m23P89k96k85L92j58
$$ 46 -377 412 116 -169 223 65
8191F5
$$ Imaginary data points
##PAGE= N=2
##DATA TABLE= (X++(I..I)), XYDATA
0@%%%Qj6K4l2M0m8N6q0J11j36J64k03K48k96L52m23N03n90O87p96R21j061J221
$$ 0 0 0 0 8 -8 16 -16 24 -24 32 -48 63 -73 91 -112 136 -160 192 -231 272 -318 369 -427 494 -567 654
26F54j399J592j806K041k303K597k920L272l656M073m532N042n602O212o881P618
$$ 654 -745 847 -959 1082 -1221 1376 -1544 1728 -1928 2145 -2387 2655 -2947 3265 -3616 4002
42D002q431R332j0333J1454j2712J4130j5748J7612j9788K2366k5479K9323l4205
$$ 4002 -4429 4903 -5430 6024 -6688 7442 -8306 9306 -10482 11884 -13595 15728 -18477
55a8477M0643m9585O2936q5253J31708l80632M27738J49667p25803P19520k28380
$$ -18477 22166 -27419 35517 -49736 81972 -298660 129078 278745 -447058 272462 44082
66D4082j92889N07345m36024j41889N17837m36903J3804K33829k92766L89952
$$ 44082 -148807 358538 -77486 -219375 298462 -138441 -124637 109192 -183574 206378
76B06378N8817o16973M35999P0080l99930L03941j97509j5475M55858n18886J06264
$$ 206378 265195 -351778 84221 154301 -245629 58312 -139197 -154672 301186 -217700 -111436
87a11436N27886n17515Q1312K04309n02426M07335J59729n74476L71463J55235
$$ -111436 416450 -101065 -19753 184556 -317870 89465 249194 -325282 46181 201416
97B01416l36756K65123j83894o9221M04235n17532n4955N71146m01538O6676L19461
$$ 201416 -135340 129783 -54111 -123332 280903 -236629 -291584 279562 -121976 -55300 264161
108B64161m99419L12457K49173o11844L02684J82961m17329K89106p5916j64261
$$ 264161 -235258 77199 326372 -285472 17212 200173 -217156 71950 -3966 -168227
118a68227M87862l08116k79726M43190j89043j18712K11329k42997J50419J74451
$$ -168227 319635 11519 -268207 174983 -14060 -132772 78557 -164440 -14021 160430
128A60430l19378K20901J11412k46186K19294k08924j60309N00101k98739k26984
$$ 160430 -158948 61953 173365 -72821 146473 -62451 -222760 277341 -21398 -248382
138b48382M58731k29741n2692K50837l26748J31981J78045m01996J60767K01362
$$ -248382 210349 -19392 -72084 178753 -147995 -16014 162031 -239965 -79198 122164
148A22164k14753J96795l3787k24377L45985r0561k88123K86724j00682j03193
$$ 122164 -92589 104206 70419 -153958 192027 101466 -186657 100067 -615 -103808
158a03808K00033k13789J34869K02440l54709R0459J29319k14937J66940k5286
$$ -103808 96225 -117564 17305 219745 -134964 -44505 84814 -130123 36817 11531
168A1531j89981K76282j0009j93085K13570k8537j09553J05456j86008M5096K21112
$$ 11531 -178450 97832 87823 -105262 108308 79771 -29782 75674 -110334 -65238 155874
179A55874k39395K9738J55569j69323J19699K524j94183J93844l4037j77894J84106
$$ 155874 -83521 -53783 101786 -67537 52162 54686 -139497 54347 20310 -157584 26522
190B6522o81l2098J24229j59887L374J82829j74175l1769J21036j22406N4650
$$ 26522 25841 -6257 117972 -41915 -38541 144288 -29887 -61656 59380 -63026 -8376
201h376N3707j27069J41003K3495j80908R1833K391n6393J19375j05538k5249
$$ -8376 45331 -81738 59265 82760 -98148 -6315 -3924 -60317 59058 -46480 -71729
212g1729J71967j00466j7210J03875r1366J7001Q159j06297R4862M8379j07067
$$ -71729 100238 -228 -17438 86437 -4929 12072 20231 -86066 8796 57175 -49892
223d9892M0498K4320m4659P1510m2759o6399J03259n7154n1190J07540l4277K4176
$$ -49892 -9394 14926 -29733 41777 -982 -67381 35878 -21276 -72466 35074 797 24973
235B4973L5510j04618O4005M2350q8977K3666l678l5935M8474p175k8386O8085
$$ 24973 60483 -44135 19870 62220 -26757 -3091 -6769 -42704 5770 -1405 -29791 38294
247C8294j0498q1047M7853J657k5031N5433n8814J667Q4869m6804J0652K7952
$$ 38294 27796 -53251 -5398 -3741 -28772 26661 -32153 -30486 54383 7579 18231 46183
259D6183m6727O141k1003k6068M3382R572l1493Q498J6930o040K0764k3122l2824
$$ 46183 -544 5597 -15406 -41474 1908 11480 -20013 -11515 5415 -625 20139 -2983 -35807
272c5807L7482k3775q536N8865j3376J0716J0036n0212K8486J2615m8018R368
$$ -35807 1675 -22100 -30636 28229 14853 25569 35605 -14607 13879 26494 -21524 -12156
284a2156l834j5487L8922L96j4620L3991k6940l7903L7543q969r383M1992l4565
$$ -12156 -15990 -31477 7445 7841 -6779 27212 272 -37631 -88 -9057 -18440 23552 -11013
297a1013k790O5429l7097j0525L8030o1060n536L1613l8345K9343K3691m0496
$$ -11013 -13803 51626 14529 4004 42034 -19026 -24562 7051 -31294 -1951 21740 -18756
309a8756J1851J4726r622M808m500j4343L660R933M383K0483k248p194M571l0803
$$ -18756 -6905 7821 -1801 3007 -1493 -15836 -12176 -2243 2140 22623 20375 13181 17752 -13051
323a3051K1843R313m6371L1567j3179k4977N8002k2491j0567L1881l7216l360
$$ -13051 8792 18105 -28266 3301 -9878 -34855 23147 656 -9911 21970 -15246 -18606
335a8606K8648j1965r49J8980k0116j047L9476k6979Q53J9213n5678K0646J2571
$$ -18606 10042 -1923 -2872 16108 -4008 -5055 34421 7442 8295 27508 -28170 -7524 5047
348E047l5140M2119j2286k3930L4144r266K32J2708j4814j1871O468Q540N86J6684
$$ 5047 -30093 12026 -260 -24190 9954 688 920 13628 -1186 -13057 -6589 1951 2537 19221
362A9221k750j1734O635j1638O037l952k0505J1306j4138O824L1242j6327O378
$$ 19221 16471 4737 11372 -266 5771 1819 -18686 -7380 -21518 -14694 16548 221 6599
375F599N056k6837J1973Q133j1051Q674K130o131J2235R626o766n302j0008j7008
$$ 6599 11655 -15182 -3209 4924 -6127 2547 4677 -1454 10781 20407 13641 8339 -1669 -18677
389a8677L316O453r32J1905k841o289J5261m671l066O548j7714j184J2053L483
$$ -18677 -15361 -8908 -9840 2065 -776 -7065 8196 3525 459 7007 -10707 -11891 162 3645
403C645R122M069l166j5706J061N061j9103J1527k989j7893K4387Q95J64J1597
$$ 3645 12767 16836 13670 -2036 -975 4086 -15017 -3490 -6479 -24372 15 910 1074 12671
417A2671j4679k626l558M610Q848n503Q224m305j262O298K43j063j8636P455q449
$$ 12671 -2008 -4634 -8192 -3582 5266 -237 7987 3682 2420 8718 8961 7898 -10738 -3283 -11732
432a1732j1129L5884j8839o542K6867l0128J2852J8703k2874R142J92r548P690
$$ -11732 -22861 13023 -5816 -12358 14509 -15619 -2767 15936 -6938 2204 2396 -7152 538
445E38R532j676m539M38j1464O900J868j1840J3772j9371L46K4749k4125K0603
$$ 538 10070 8394 3855 4293 -7171 -271 1597 -10243 3529 -15842 -15496 9253 -14872 5731
459E731J3557l5864K1419L781k0632K4961o182k0527J9865J342j1378J6417n727
$$ 5731 19288 -16576 4843 8624 -12008 12953 6771 -13756 6109 7451 -3927 12490 6763
472F763j6909Q018j1394m18J9932j4230L467J1776j4531K0672O86k5770K1744
$$ 6763 -10146 -2128 -13522 -13940 5992 -8238 -4771 7005 -7526 13146 13832 -11938 9806
485I806r991j8816L2323q795n058K2160k8175k245K0833j9628m783Q974r937O524
$$ 9806 -185 -19001 13322 4527 -531 21629 -6546 -8791 12042 -7586 -12369 -3395 -13332 -6808
499f808J6161j0763Q262J2707k8425M845Q840j3634K3384j5523j0988L3070j8477
$$ -6808 9353 -1410 6852 19559 -8866 -4021 4819 -8815 14569 -954 -11942 21128 2651
512B651k511J0274k0679O219j784j2155J4142J6837j0455r426J5778q430O228
$$ 2651 140 10414 -10265 -4046 -5830 -17985 -3843 12994 2539 -6887 8891 461 6689
525F689M343l0412K6114N727k8244K8287m171n989J0623k8469L861K1938j2187
$$ 6689 11032 -19380 6734 12461 -15783 12504 8333 2344 12967 -15502 -11641 10297 -1890
538a890j0948R633K566J583J0732k0344Q452K5740m0578N481K5197j9387J9405
$$ -1890 -12838 -3205 -639 944 11676 -8668 -216 25524 -15054 -9573 15624 -3763 15642
551A5642j5163k2540M2129j1373k5250K1505q312j481J2590k7941J2038L8024
$$ 15642 479 -22061 20068 8695 -16555 4950 -3362 -4843 7747 -20194 -8156 29868
563B9868l8375r086L1236j5514J5839k546m0977M6592L656n1548L9265K42k0744
$$ 29868 -8507 -17593 13643 -1871 13968 11422 -29555 17037 20693 -30855 8410 8652 -12092
576a2092L8113m6861n794P0419n3087k1770M5433k8655K2081J2013n3811N1283
$$ -12092 26021 -20840 -26634 43785 -9302 -31072 14361 -14294 7787 19800 -34011 17272
588A7272J9634o8482L0071J5785l0425M1561l6568l1093R1665m1002m5570O2659
$$ 17272 36906 -31576 -1505 14280 -16145 25416 -11152 -42245 49420 8418 -37152 25507
600B5507m3633J4242L0018q2639O3621M2610q5422L6952J5227l0138M9304m6185
$$ 25507 -18126 -3884 26134 -56505 7116 49726 -35696 1256 16483 -13655 35649 -10536
612a0536l8046Q9786l2882m6032O5640l9311J1632M6131j13277N6794P7306j22743
$$ -10536 -48582 41204 8322 -37710 27930 -11381 251 46382 -66895 -10101 67205 -55538
624e5538M8019L3201o7726R4202m0977p9330J21812l1231p7263P5817k6747k815
$$ -55538 -7519 25682 -42044 52158 11181 -68149 53663 22432 -54831 20986 -5761 -8576
636h576N8530r6115K1322R3654r8196J1435L4978o0690Q9259l8184q6228J41320
$$ -8576 49954 -46161 -24839 68815 -29381 -17946 17032 -43658 45601 7417 -78811 62509
648F2509l7455p8429R2284o4005J2857Q8672j40811K9720J19417j20582J9011
$$ 62509 25054 -53375 38909 -25096 -12239 76433 -64378 -34658 84759 -35823 -16812
659a6812N1671q6272R0800j2031j19641J32567J958r6478Q4105n1583J920J05537
$$ -16812 34859 -51413 39387 27356 -92285 40282 42240 -54238 29867 -21716 -19796 85741
671H5741j44175J5399J35546j32586K4718O1646j14632J13051M579j56622J40023
$$ 85741 -58434 -43035 92511 -40075 -15357 46289 -68343 44708 49287 -107335 32688
682C2688K2264j12549Q6156m1793k0615J14110j18577k1683J38066r2728o487
$$ 32688 54952 -57597 28559 -13234 -33849 80261 -38316 -59999 78067 -14661 -21148
693b1148N7426r1327J00046O803j52536J33389Q459j01384J12754q1439j9107
$$ -21148 36278 -55049 44997 51800 -100736 32653 41112 -60272 52482 -28957 -48064
704d8064J59689j55364l3779J68931j09426j6573P8780j02519Q1897N0265j57934
$$ -48064 111625 -43739 -77518 91413 -18013 -34586 44194 -58325 23572 73837 -84097
715h4097R3912M7620j09685Q8360n3707m1124J61331j29584n0716J60966j00251
$$ -84097 9815 57435 -52250 36110 -17597 -58721 102610 -26974 -77690 83276 -16975
726a6975J179O0038j25077J08720M5821j70872J12032M8211j19959R9948m0899
$$ -16975 -15796 44242 -80835 27885 73706 -97166 14866 63077 -56882 43066 2167
737B167p7344J64484q6553r3737J51342o0408j6521O3016j17811R2509N4355j68553
$$ 2167 -75177 89307 2754 -90983 60359 -49 -16570 46446 -71365 21144 75499 -93054
749i3054R9668M5475j09878J06803m8985p5655J66840q2790r0911J37701o3203
$$ -93054 6614 52089 -57789 49014 29 -75626 91214 8424 -82487 55214 -7989
760g989j1059P3102j24840P3226Q8389j66398N8870P4081j04699P7388k2436q0976
$$ -7989 -19048 54054 -70786 2440 90829 -75569 -16699 57382 -47317 30071 7635 -73341
772g3341J45223n5943q4998J18738o4117J579P3628j37323P2028R7791j59922
$$ -73341 71882 15939 -69059 49679 -14438 -12859 60769 -76554 -4526 93265 -66657
783f6657M6970P0644r2443O8900j5230q4136J28012l0120r2928J06768m3756j9090
$$ -66657 -19687 50957 -41486 27414 12184 -71952 56060 25940 -66988 39780 -3976 -23066
795b3066Q5307j23154L6727J12339j35893K8341N9457p7824P4026k9773p7401
$$ -23066 62241 -60913 -24186 88153 -47740 -19399 40058 -37766 36260 6487 -70914
806g0914J24464l4293p8535R5447m0956j8364Q3891j04873N868J13819j06560
$$ -70914 53550 19257 -59278 36169 -4787 -23151 60740 -44133 -38265 75554 -31006
817c1006L557O4340p1421O6871j2007r0241J14307j8362q2395Q2848l3261j4334
$$ -31006 -27449 36891 -34530 32341 20334 -69907 44400 26038 -56357 26491 -6770 -21104
829b1104P4000q4709R00Q9333p6615l329M3887n4210N6359p19q6003R3089O307
$$ -21104 52896 -31813 -30913 58420 -18195 -21524 22363 -31847 24512 23793 -62210 30879 37186
842C7186q2986O4279k0496k3949P0607o9523q109Q3547o2567k074L5986n2388
$$ 37186 -45800 18479 -2017 -25966 44641 -24882 -32991 50556 -12011 -14085 21901 -30487
854c0487M9679M489p8341O9774J7684o2622M2267j0346j9578N2297n0051j6919
$$ -30487 19192 23681 -54660 15114 32798 -29824 12443 2097 -17481 34816 -15235 -32154
866c2154O8353m1804r052L5766m5850L7256J7585p5003N0645K1488n2317L5908
$$ -32154 36199 -5605 -14657 21109 -24741 12515 30100 -44903 5742 27230 -25087 10821
878A0821j3213j1733M7564m4247j3643N0427k8261q883K3254k8674K1399K1941
$$ 10821 -2392 -14125 33439 -10808 -24451 25976 -2285 -11168 12086 -16588 4811 26752
890B6752n4860K4611K8788m3532K2875l366j9033M6584l2507j9418M5356k3937
$$ 26752 -28108 -3497 25291 -18241 4634 1268 -17765 28819 -3688 -23106 22250 -1687
902a687n103J4928k2761J9115J2806l2312J0727J9969k1028M595J793j4606K9060
$$ -1687 -6790 8138 -14623 4492 17298 -15014 -4287 15682 -5346 -751 1042 -13564 15496
915A5496j1319k4276L4535r154j2093J5604k0894J1968J4433k7315R931J3536
$$ 15496 4177 -20099 14436 5282 -6811 8793 -12101 -133 14300 -13015 -3084 10452
927A0452j1730L714k808p637J5780m674j6544J6644L823j0408Q803p638p18J3803
$$ 10452 -1278 2436 -372 -8009 7771 3097 -13447 3197 7020 -3388 5415 -2223 -2941 10862
941A0862j7285k688J6017p802J349K853p821J0809j787j3397Q388K378l538K538
$$ 10862 -6423 -9111 6906 -896 453 3306 -4515 6294 4507 -8890 -502 1876 -1662 876
955H76k665L087M933n641n520N911J084o513M656j462N53Q957j1649R64Q345r356
$$ 876 -1789 1298 6231 590 -4930 981 2065 -4448 208 -1254 -701 8256 -3393 -2429 5916 -3440
971c440K732j405r70P186l828n17K92K686k204n143N656m293M285J653q789J2422
$$ -3440 -708 -2113 -3083 4103 275 -242 50 2736 532 -4611 1045 -3248 1037 2690 -6099 6323
987F323m976n627Q505r383M827L070p713O792Q2j416m10o06O25k361L738m684
$$ 6323 1347 -4280 4225 -5158 -331 2739 -4974 1818 1900 484 74 -532 93 -2268 1470 -3214
1003c214K703N324r164P706l332m535J0176j1065K779Q052r756O161J644o425
$$ -3214 -511 4813 -4351 3355 23 -4512 5664 -5401 -2622 5430 -4326 1835 3479 -2946
1017b946M039l73l799J691L484l631J295L445n010L065q62m730N382k956K69N239
$$ -2946 1093 720 -3079 -1388 2096 -1535 -240 3205 -1805 1260 398 -4332 1050 -1906 -1637 3602
1033C602n492M083J361p977N592l71o152P768j930k912O101k169k946K285j119
$$ 3602 -1890 2193 3554 -4423 1169 798 -5354 2414 484 -2428 3673 1504 -1442 843 -276
1048b76k867J754K558k547L073J412m156L202k783o71J999m578O131k147j334
$$ -276 -3143 -1389 1169 -1378 1695 3107 -1049 2153 -630 -1301 698 -3880 2251 104 -1230
1063a230O653p353K028J614n411L755j635K106n02r4M797p520M735j52p427Q164
$$ -1230 5423 -1930 98 1712 -3699 56 -1579 527 25 -69 4728 -2792 1943 1791 -5636 2528
1079B528m195m1N315m106K683k082M46l45l741N061m213K795K189l675O024o684
$$ 2528 -1667 -1708 3607 -499 2184 102 548 203 -3538 1523 -2690 105 2294 -1381 4643 -2041
1095b041K086K427q191R102l277l430R330p491J089L851n281K68J562q45j030
$$ -2041 45 2472 -5719 3383 106 -3324 6006 -1485 -396 3455 -1826 -1558 4 -841 -1871
1110a871M517j280l219O037o022KM161o360N940l54m228P559m715j678N293p637
$$ -1871 2646 1366 -1853 4184 -1838 -1836 2325 -4035 1905 1551 -2677 4882 167 -1511 3782 -3855
1126c855K135M734p108M960L235o753M182Qn798N458m85m717N557R27m482N294
$$ -3855 -1720 3014 -4094 866 4101 -2652 1530 1538 -4260 1198 713 -4004 1553 2480 -2002 3292
1142C292k060m634P111o810j247R309p927L910K948q724R145l450o766Q420m403
$$ 3292 1232 -3402 3709 -3101 -4348 4961 -2966 944 3892 -4832 4313 863 -5903 2517 -1886
1157a886R75L261l605K410K268l271m242N782j651l937P248o914M893M883j2700
$$ -1886 -911 2350 -1255 1155 3423 152 -4090 1692 41 -3896 3352 -3562 1331 6214 -6486
1172f486Q568r02n848P214p225M472N602o786K368j378K187j579l781K645j26
$$ -6486 2082 1180 -4668 2546 -4679 -207 5395 -1391 977 -401 1786 207 -3574 -929 -1055
1187a055M795n310j194Q219o425J103k429k606R727n672k084M722k75J834o305
$$ -1055 3740 -1570 -2764 5455 -970 133 -2296 -4902 4825 -847 -2931 1791 1516 3350 -2955
1202b955J200L279j968J023n641O071N650q743L50J577K20J920o584K07R400k104
$$ -2955 -1755 1524 -444 579 -5062 1009 6659 -2084 -1734 -157 63 1983 -4601 -4394 5006 2902
1218B902n847K440K080P34j290q128N391R187q484k896O596j582K343m991q533
$$ 2902 -2945 -505 1575 2309 1019 -7109 -1718 7469 -1015 -3911 2685 1103 3446 -1545 -10078
1233a0078J5427J05j3872R807q35R94O555j8610O917J4940j6341J362N147k848
$$ -10078 5349 5454 -8418 1389 554 1548 8103 -10507 -3590 11350 -4991 -3629 1518 -1330
1247a330R446p566j2241J7501K839j9173R479K590m458J5554k0276k114K8376
$$ -1330 8116 550 -11691 5810 8649 -10524 -1045 1545 -2913 12641 -7635 -9749 18627
1260A8627k4048j794J1785j3456K0811p678k3280L0579j212k0906J2332m082j533
$$ 18627 -5421 -7215 4570 -8886 11925 4247 -19033 11546 10334 -10572 1760 -2322 -3855
1273c855J7298k1253o122L4012j9449j1356J8819j9443J9194L625l8139L5214
$$ -3855 13443 -7810 -13932 20080 631 -10725 8094 -11349 7845 11470 -26669 8545
1285H545Q052k9880J9800j0464j433K5603l3931k753L7632k3020n572J6586k2514
$$ 8545 16597 -13283 6517 -3947 -5380 20223 -13708 -16461 21171 -1849 -7421 9165 -13349
1298a3349K1881Q911m7570L1574K0433l8188K1252m590j1206L7932l5918j5228
$$ -13349 8532 17443 -30127 1447 21880 -16308 4944 354 -10852 27080 -8838 -24066
1310b4066M7491k6180n807J9151k8765K9268J0822n3102L3425J8046l6680K3779
$$ -24066 23425 -2755 -8562 10589 -18176 11092 21914 -31188 2237 20283 -16397 7382
1322G382j1592j1400M7739l6681k4585N4461k4225j4064K7248l4972K4898K5799
$$ 7382 -4210 -15610 32129 -4552 -29137 25324 1099 -12965 14283 -20689 4209 30008
1334C0008o1313K9495K5873m0915K7347j6758j6157N8082m0988k4558N5929k6754
$$ 30008 -31305 -1810 24063 -16852 10495 -6263 -22420 35662 -5326 -29884 26045 -709
1346g09p104K3832m1630K8528K9801o4527K5048L4389m4838K8837j0127l3710
$$ -709 -7813 16019 -25611 2917 32718 -31809 -6761 27628 -17210 11627 1500 -32210
1358c2210O8086l2845m1898O4371k4812q891K9262n0169L2003L2699o6711K2954
$$ -32210 35876 3031 -38867 25504 692 -8199 21063 -29106 2897 35596 -31115 -8161
1370h161L0190l7278K8465j0319l5165O4986k1714n1320N9995j6920j4737L7382
$$ -8161 22029 -15249 13216 2897 -32268 32718 11004 -40316 19679 2759 -11978 25404
1382B5404n3961K4497M6925p1230J8761L0153l8787L5130j5829l5126O7424k1236
$$ 25404 -28557 -4060 42865 -28365 -9604 20549 -18238 16892 1063 -34063 33361 12125
1394A2125m6478N2300j9058r125L7318n7431J9677N6141o9767J1772L6768m4578
$$ 12125 -34353 17947 -1111 -10236 27082 -30349 -10672 45469 -24298 -12526 24242 -20336
1406b0336L6398q492m9664P1577j0770n4460N3189j6793j1006M0109n8476J3824
$$ -20336 16062 7570 -42094 29483 18713 -35747 17442 649 -10357 29752 -28724 -14900
1418a4900N6035o0802P574L1094l6495L5845r164n0266O4447l362n3056M6177
$$ -14900 41135 -19667 -12093 19001 -17494 18351 9187 -41079 23368 20006 -33050 13127
$$ [...]
8191b73
##END NTUPLES=NMR FID
##END=
