##TITLE=1H_LR-794-O-C3-1
 CDCl3
 8 sc, 
 24.12.2024
##JCAMPDX= 6.0         $$ Bruker NMR JCAMP-DX V2.0
##DATA TYPE= NMR FID
##DATA CLASS= NTUPLES
##ORIGIN= UXNMR, Bruker Analytische Messtechnik GmbH
##OWNER= root
$$ XWIN-NMR		Version 3.5
$$ Tue Dec 24 14:10:42 2024 Russian Standard Time (UT+4h)  she@DPX200
##.OBSERVE FREQUENCY= 200.1315
##.OBSERVE NUCLEUS= ^1H
##.DELAY= (6, 6)
##.ACQUISITION MODE= SIMULTANEOUS
##.ACQUISITION SCHEME= undefined
##.AVERAGES= 8
##.DIGITISER RES= 18
##SPECTROMETER/DATA SYSTEM= spect
##.PULSE SEQUENCE= zg30
##.SOLVENT NAME= D2O
##.SHIFT REFERENCE= (INTERNAL, D2O, 0, 15.7039)
##AUDIT TRAIL= $$ (NUMBER, WHEN, WHO, WHERE, WHAT)
$$ ##TITLE= Audit trail, XWIN-NMR		Version 3.5
$$ ##JCAMPDX= 5.01
$$ ##ORIGIN= Bruker BioSpin GmbH
$$ ##OWNER= she
$$ F:/spectra/data/she/nmr/H-F/1/audita.txt
$$ ##AUDIT TRAIL=  $$ (NUMBER, WHEN, WHO, WHERE, WHAT)
(   1,<2024-12-24 14:09:15.26 +0400>,<she>,<DPX200>,
      <created by zg, POWCHK disabled, PULCHK disabled
       configuration hash MD5:
       00 E9 B6 7A A2 85 ED C7 34 08 36 98 17 FE 4E 26
       data hash MD5: 16K
       10 2C 8D 3A 97 78 86 F2 C8 A3 EC 90 5C 77 F3 08>)
$$ ##END=
$$ 
$$ hash MD5
$$ DD E7 F3 2C DD 7B D0 B8 45 15 96 08 FA A0 E0 2D
##$RELAX= 
##$RELAX= 
##$RELAX= 
##$RELAX= 
##$RELAX= 
##$RELAX= 
$$ Bruker specific parameters
$$ --------------------------
##$DU= <F:/spectra>
##$EXPNO= 1
##$NAME= <H-F>
##$PROCNO= 1
##$TYPE= <nmr>
##$USER= <she>
##$AMP= (0..31)
100 100 100 100 100 100 100 100 100 100 100 100 100 100 100 100 100 100 
100 100 100 100 100 100 100 100 100 100 100 100 100 100 
##$AQSEQ= 0
##$AQ_mod= 1
##$AUNM= <au_zg>
##$AUTOPOS= <>
##$BF1= 200.13
##$BF2= 200.13
##$BF3= 200.13
##$BF4= 200.13
##$BF5= 200.13
##$BF6= 200.13
##$BF7= 200.13
##$BF8= 200.13
##$BYTORDA= 1
##$CFDGTYP= 0
##$CFRGTYP= 5
##$CHEMSTR= <none>
##$CNST= (0..31)
1 1 145 1 1 1 1 1 1 1 1 1 1 1 1 1 1 1 1 1 1 1 1 1 1 1 1 1 1 1 1 1 
##$CPDPRG= <>
##$CPDPRG1= <>
##$CPDPRG2= <>
##$CPDPRG3= <>
##$CPDPRG4= <mlev>
##$CPDPRG5= <mlev>
##$CPDPRG6= <mlev>
##$CPDPRG7= <mlev>
##$CPDPRG8= <mlev>
##$CPDPRGB= <>
##$CPDPRGT= <>
##$D= (0..31)
0 1.2 0 0 0 0 0 0 0 0.06 0 0.03 0 0 0 0 0.0002 0 0 0 0 0 0 0 0 0 0 0 0 
0 0 0 
##$DATE= 1735034954
##$DBL= (0..7)
120 120 120 120 120 120 120 120 
##$DBP= (0..7)
150 150 150 150 150 150 150 150 
##$DBP07= 0
##$DBPNAM0= <>
##$DBPNAM1= <>
##$DBPNAM2= <>
##$DBPNAM3= <>
##$DBPNAM4= <>
##$DBPNAM5= <>
##$DBPNAM6= <>
##$DBPNAM7= <>
##$DBPOAL= (0..7)
0.5 0.5 0.5 0.5 0.5 0.5 0.5 0.5 
##$DBPOFFS= (0..7)
0 0 0 0 0 0 0 0 
##$DE= 6
##$DECBNUC= <off>
##$DECIM= 24
##$DECNUC= <off>
##$DECSTAT= 4
##$DIGMOD= 1
##$DIGTYP= 9
##$DL= (0..7)
0 120 120 120 120 120 120 120 
##$DP= (0..7)
150 150 150 150 150 150 150 150 
##$DP07= 0
##$DPNAME0= <>
##$DPNAME1= <>
##$DPNAME2= <>
##$DPNAME3= <>
##$DPNAME4= <>
##$DPNAME5= <>
##$DPNAME6= <>
##$DPNAME7= <>
##$DPOAL= (0..7)
0.5 0.5 0.5 0.5 0.5 0.5 0.5 0.5 
##$DPOFFS= (0..7)
0 0 0 0 0 0 0 0 
##$DQDMODE= 0
##$DR= 18
##$DS= 0
##$DSLIST= <SSSSSSSSSSSSSSS>
$$ [...]
##$SUBNAM2= <"">
##$SUBNAM3= <"">
##$SUBNAM4= <"">
##$SUBNAM5= <"">
##$SUBNAM6= <"">
##$SUBNAM7= <"">
##$SUBNAM8= <"">
##$SUBNAM9= <"">
##$SW= 24.0689530833862
##$SWIBOX= (0..15)
0 0 2 0 0 0 0 0 0 0 0 0 0 0 0 0 
##$SW_h= 4816.95568400771
##$TD= 16384
##$TD0= 1
##$TE= 0
##$TE2= 300
##$TE3= 300
##$TEG= 300
##$TL= (0..7)
0 120 120 120 120 120 120 120 
##$TP= (0..7)
150 150 150 150 150 150 150 150 
##$TP07= 0
##$TPNAME0= <>
##$TPNAME1= <>
##$TPNAME2= <>
##$TPNAME3= <>
##$TPNAME4= <>
##$TPNAME5= <>
##$TPNAME6= <>
##$TPNAME7= <>
##$TPOAL= (0..7)
0.5 0.5 0.5 0.5 0.5 0.5 0.5 0.5 
##$TPOFFS= (0..7)
0 0 0 0 0 0 0 0 
##$TUNHIN= 0
##$TUNHOUT= 0
##$TUNXOUT= 0
##$USERA1= <user>
##$USERA2= <user>
##$USERA3= <user>
##$USERA4= <user>
##$USERA5= <user>
##$V9= 5
##$VALIST= <valist>
##$VCLIST= <CCCCCCCCCCCCCCC>
##$VD= 0
##$VDLIST= <DDDDDDDDDDDDDDD>
##$VPLIST= <PPPPPPPPPPPPPPP>
##$VTLIST= <TTTTTTTTTTTTTTT>
##$WBST= 1024
##$WBSW= 4
##$XGAIN= (0..3)
0 0 0 0 
##$XL= 0
##$YL= 0
##$YMAX_a= 356535
##$YMIN_a= -417131
##$ZGOPTNS= <>
##$ZL1= 120
##$ZL2= 120
##$ZL3= 120
##$ZL4= 120
##$ABSF1= 10
##$ABSF2= 0
##$ABSG= 5
##$ABSL= 3
##$ALPHA= 0
##$AQORDER= 0
##$ASSFAC= 0
##$ASSFACI= 0
##$ASSFACX= 0
##$ASSWID= 0
##$AUNMP= <proc_1d>
##$AZFE= 0.1
##$AZFW= 0.1
##$BCFW= 1
##$BC_mod= 2
##$BYTORDP= 1
##$COROFFS= 0
##$CY= 11.3945322036743
##$DATMOD= 1
##$DC= 2
##$DFILT= <>
##$DTYPP= 0
##$F1P= 15.6554695791079
##$F2P= 12.8336369535428
##$FCOR= 0.5
##$FTSIZE= 0
##$FT_mod= 4
##$GAMMA= 1
##$GB= 0.15
##$INTBC= 1
##$INTSCL= 1
##$ISEN= 128
##$LB= 0.24
##$LEV0= 0
##$LPBIN= 0
##$MAXI= 10000
##$MC2= 0
##$MEAN= 0
##$ME_mod= 0
##$MI= 1.114404
##$NCOEF= 0
##$NC_proc= 0
##$NLEV= 6
##$NOISF1= 3.799351
##$NOISF2= 2.8
##$NSP= 1
##$NTH_PI= 0
##$NZP= 0
##$OFFSET= 15.70392
##$PC= 1
##$PHC0= -26572.83
##$PHC1= 11.58744
##$PH_mod= 1
##$PKNL= yes
##$PPARMOD= 0
##$PSCAL= 0
##$PSIGN= 0
##$REVERSE= no
##$SF= 200.130013532006
##$SI= 16384
##$SIGF1= 3
##$SIGF2= 2
##$SINO= 400
##$SIOLD= 16384
##$SREGLST= <1H.CDCl3>
##$SSB= 0
##$STSI= 0
##$STSR= 0
##$SW_p= 3612.71676300578
##$SYMM= 0
##$S_DEV= 0
##$TDeff= 0
##$TDoff= 0
##$TI= <>
##$TILT= no
##$TM1= 0
##$TM2= 0
##$TOPLEV= 0
##$USERP1= <user>
##$USERP2= <user>
##$USERP3= <user>
##$USERP4= <user>
##$USERP5= <user>
##$WDW= 1
##$XDIM= 8192
##$YMAX_p= 0
##$YMIN_p= 0
$$ End of Bruker specific parameters
$$ ---------------------------------
##NTUPLES= NMR FID
##VAR_NAME=  TIME,          FID/REAL,        FID/IMAG
##SYMBOL=    X,             R,               I
##VAR_TYPE=  INDEPENDENT,   DEPENDENT,       DEPENDENT
##VAR_FORM=  AFFN,          ASDF,            ASDF
##VAR_DIM=   8192,          8192,            8192
##UNITS=     SECONDS,       ARBITRARY UNITS, ARBITRARY UNITS
##FACTOR=    0.0002076,     1,               1
##FIRST=     0,             0,               0
##LAST=      1.7004516,     0,               0
##MIN=       0,             -417131,         0
##MAX=       1.7004516,     356535,          0
$$ Real data points
##PAGE= N=1
##DATA TABLE= (X++(R..R)), XYDATA
0@%%%%qQ%Qj6J6k4L2l2L6m4N4o6P7r0J05j17J37j61J83k08K36k68L00l37L79m25
31b25M76n30N88o52P22q01Q89r85J089j202J330j470J626j809K015k243K507k819
49a494L193l646M205m913N837p094Q894j1649J6279k5270M8054j91382k58145
62d17131P73666l14622k16062M41175m26312O2308L25879n12761J91288K75112
72A82540l36318K43746m5796j98634N01679k32616l47478L85107j83601r1135
82a22506K00601l23374K51523K08717m97970L09159K17587l95295K94044r3446
92D9040l59297M95980j08019l44766L93065r8031p1571K20162l18623K04390K34187
103B96517n53977J75211K30357l89751K92693J2126l76131M72791j0275l65287
$$ y = [0, 0, 0, 0, 0, -8, 0, 0, 8, -8, 8, -16, 16, -16, 20, -24, 30, -36, 41, -49, 56, -61, 76, -85, 98, -110, 126, -142, 158, -179, 200, -225, 251, -279, 309, -343, 379, -422, 467, -518, 571, -631, 699, -771, 855, -954, 1061, -1182, 1325, -1494, 1699, -1947, 2258, -2655, 3182, -3912, 4982, -6667, 9612, -15658, 32396, -158986, -417131, 356535, 41913, -174149, 267026, -159286, -96978, 228901, -283860, -92572, 182540, -153778, 89968, 44172, -154462, 347217, 114601, -232877, 152230, -31371, -122506, 78095, -245279, 6244, 214961, -283009, 26150, 243737, -151558, 142486, 49040, -310257, 185723, 77704, -267062, 126003, 27972, -43599, 176563, -142060, 62330, 296517, -257460, -82249, 148108, -241643, 51050, 63176, -312955, 159836, 149561, -215726]
113b15726L91004p0056j91606K42636l03158K5466L74272l81538k2785L01250
123A49759k11948J12219N6702k39891K34752n9976k46015K39548q7015k4575K33050
134A56610l14471Q7144L79359l54447k402K34751k89540J04940O8251k83120K71239
145E8314L7530k93087K40233L969j09334K31870k17531r0980K95812k06131o7522
156a16857K03205j46983P7369O5405k00319K25384N7346k63883J37257k6192j30592
167a18860J95260j36744r7683K55784j14406o1765J80405r2794M1818L5672k13873
178a27186J34423Q7429j92867J03130J9209r2736J65153p3202q7241J83289j12085
189G316j01475J12951q5543M5493P8064j73168R3918J26599j34075P1878L8426
$$ y = [-215726, 175278, 105222, -86384, 156252, -146906, -121440, 252832, -128706, -151491, 149759, -62189, 50030, 106732, -133159, 101593, 41617, -204398, 35150, -51865, -76440, 156610, -157861, -70717, 308642, -45805, -48207, 186544, -102996, 1944, 70195, -212925, 58314, 95844, -197243, 42990, 46959, -62375, 169495, -48036, -139016, 156796, -49335, -116857, 86348, -60635, 16734, 82139, -118180, 107204, 164550, -99333, 37924, 11732, -118860, 76400, -60344, -158027, 97757, -16649, -78414, 101991, 9197, 51015, 86687, -127186, 7237, 94666, -98201, 4929, 24138, -68598, 96555, 23353, -63888, 119401, 7316, -94159, 18792, -66751, -21258, 56806, -116362, -22444, 104155, -29920, 41958, 80384]
200H0384j04682Q6353n6716r6678J44263m5271q6056Q8559m5008L5732R1722j26712
212c4110J9991Q0155j18406K0325M3953o2818P1882j3311o7429J23828J1471o8660
224F871M2813n5201k1878N7004q2331n45P5112o4332R556N3605k4442N4044r490
237D0786q5390N5746J3125n4263M0062j7475k1148N9984l4002o499P5417m3689
249B2654m1663K3151l5055J3260K1954n9041J7240M4767k1721L0453K7339j9004
261B4334J3251k6794l4052L5815q472l1512J1865r290J7074L7644k3982K824J6216
274B4921m2952m275J4146j6911K0321l595k7001M5481K2365j4438K1892j9618
286B0336k3827K0801l0134j1420L2004l8077j1415L8741j4276K5562L2103n0187
$$ y = [80384, -24298, 62055, 5339, -91339, 52924, 7653, -78403, 10156, -34852, 880, 92602, -34110, -14119, 66036, -52370, -32045, 11908, -50910, 20972, 7661, -59768, 64060, 75531, 6871, 49684, -5517, -27395, 29609, -52722, -53267, 21845, -42487, -32931, 20674, -3768, 50276, 40786, -44604, 11142, 24267, -29996, 10066, -7409, -28557, 31427, -2575, -9074, 66343, 22654, -19009, 4142, -30913, -17653, 4301, -54740, -37500, 7267, -14454, 15999, 43338, 24334, 37585, 10791, -23261, 12554, 4082, -27430, -15565, -24855, -7781, 29863, 5881, 8705, 24921, -18031, -22306, -8160, -25071, -4750, -8345, -35346, 10135, 32500, 18062, 39954, 20336, -3491, 17310, -12824, -24244, 7760, -30317, -41732, -2991, -17267, 8295, 40398, -9789]
298i789P302K7632m4201J3484J9901m3340J6761K0185j9306L9627J5626l7501
310F381J521o743j8373Q235j2614r302Q185k390K3620J8872m51J6194k0011k2168
324i044K6128j3725j6487K1520k7707n035M0517j5832M590K6428m0097m191K0979
337H044k8666J1760Q498l5697K1663K0873j0617L5644J985k7987J7951j2459k0695
350i703K0284k1303k3233J9347l498R028K9211q462o413L063j2240K384J862q982
364h655m78m873R232K1233J618O534q85k3802J166L615j7945L783l979j8239J5620
379a6055J5881O55J6474m56j3467P122R5m878J842j2290r839O664M497J0886J1374
394A8505q391n411L85q432j902O36j4268o475J1359O967J2016K0591m144j0592
$$ y = [-9789, -2487, 25145, -19056, -5572, 14329, -29011, -12250, 7935, -11371, 28256, 43882, 6381, 7902, 1159, -17214, -8979, -21593, -30895, -22710, -25100, -1480, 17392, 16941, 33135, 13124, -9044, 17084, 3359, -13128, 8392, -19315, -24350, 16167, 335, 4925, 31353, -8744, -12935, 8044, -20622, -8862, -364, -36061, -14398, 6475, -4142, 31502, 33487, 5500, 23451, 10992, -9703, 10581, -10722, -33955, -14608, -18106, -9078, 20133, 11671, 5258, 8321, -3919, -1535, 327, -8655, -9133, -14006, -4774, 16459, 18077, 24611, 23726, -76, 1090, 4705, -13240, -9457, -13436, -31675, -16055, -174, 481, 16955, 16499, 3032, 10154, 10249, 5371, 7213, -5077, -14916, -8252, -3755, 7131, 18505, 10114, 4703, 5088, -3344, -5246, -4610, -18878, -25353, -13994, -7027, 4989, 25580, 21436, 10844]
408A0844O658p515r633N818j2940j5459R759M148N002J4970k497q255p31j381
422a212K155k497n362n1p708P868K0317m018M446R276k1973K314J3868k4209k946
437i732L224k5820J1841K1264p674J5283P597j5764Q927J563q985K534j5312m847
451a5901J2481k275J6417R690j9426R276j400k3114J7316m756k7620J7141o8o792
465a9031L3855k237j3590J9672j0471p332J5237j5279o716K275j6893J2297J2848
478D635q607J1434n612r595K0401j0749j3535J6129j9729q323K5320o868J0547
491E448K1337k3736J957J7974k1664j646p73k3015R369N248q553K4025N163j2928
505a794Q271n112L10J2436k1627p362J6603r494N174J4813j0260Q733K320k2636
$$ y = [10844, 17502, 9987, 354, 6172, -6768, -22227, -12468, -8320, -3318, 11652, 9155, 900, 169, -1212, 943, -1554, -6916, -6967, -14675, -6807, 13510, 9492, 13938, 23214, 1241, 3555, 17423, -6786, -9732, -6508, -32328, -20487, 777, -6897, 8386, 15983, 219, 9146, 10709, 1724, 4258, -11054, -15901, -3420, -5695, 10722, 20412, 986, 10262, 8862, -14252, 3064, -1692, -29312, -12171, -12239, -19031, 14824, 12587, -1003, 18669, 8198, 866, 16103, 824, -5892, -3617, -20510, -8213, 4635, -3972, 7462, 1850, -7745, 12656, 1907, -11628, 4501, -15228, -23551, 1769, -5099, 5448, 26785, 3049, 5006, 22980, 1316, -330, -1103, -24118, -14749, -9501, -18054, 5971, 11134, -1794, 6477, 1365, 1675, 14111, -7516, -14878, 1725, -7769, -2595, 12218, 1958, 10691, 13011, -9625]
519i625J3528R155k2871r93l976o312K3436l894r689K6362j933j3363J5147o548
533H424m006N155k9272n94K8951j0939J09J1519j1985J4768J37k9362J9473M775
547G153l3182J2886Q389J147K6915j9112j2048L5192j5166j6097J4705k1298O479
560d037R070l7789K7294L0115l6955R675P797j2478L4335k3638l1499M7180j8771
573B99k6554L7831j8084R523L3679n7222J4808N1614n3457l715J3059l4342M0076
586G515o329m3983O6705Q21m5002M1159j8686l903M2500p0222l333O8335m8949
599a3372K757L0386m0382M6196k231p0960O7608Q578o4058L8704j9885m203O5911
612D5049o7580o899Q0472n6507L721L2078o2290O0177J334j05817Q5317K7363
$$ y = [-9625, 3903, 13058, -9813, -10806, -14782, -21094, 2342, -1552, -11241, 15121, 13188, -175, 14972, 8424, 4418, 9573, -19699, -20293, 8658, -2281, -2172, 9347, -2638, 12130, 12267, -17095, 2378, 7153, -26029, -13143, -4754, -3607, 23308, 4196, -7852, 27340, 12174, -3923, 10782, -10516, -4037, 5033, -32756, -5462, 24653, -12302, -2627, 5170, -7308, 27027, 3389, -28110, 19070, 299, -26255, 11576, -6508, 3015, 36694, -20528, -5720, 45894, -7563, -11278, 1781, -32561, 7515, 1186, -42797, 23908, 24729, -20273, 20886, 2200, -1703, 40797, -29425, -32758, 35577, -13372, -10615, 19771, -20611, 25585, 23354, -47606, 20002, 28580, -35478, 3226, -16659, -20862, 45049, -22531, -29430, 51042, -5465, -1744, 30334, -31956, 28221, 29555, -76262, 9055, 36418]
624C6418q1638O4031j8927l3002R7726o9743m8473J05020n5843l2376N3892n1259
636c4174M8961L3909j00027N9730L9889o9930M2991l4724k7188R6767q3664l6186
648f3646J20149o4099j3214O0422q8752O6678N4939j44318O4140O1390j00022
659d6333O1358j0075n6793J17826o0256p3054J21134m4767k8751N2642r6310O2499
671h80O7001j46324O9894P2125j07484P6666p385q6466J36473n0747j14626J28025
683C6272k5998m5182P4148q4539L7203Q8742j32807L1610P3783q9057N1969j8194
695b050o7832J36894n0177r1282J27003n0446k4276R1938j29090L6114J25824
706A02620j69268J7943J14778j07249M7640J8034r6326J24810q620j12351J02751
$$ y = [36418, -45220, 18811, -116, -33118, 64608, -5135, -53608, 51412, -4431, -36807, 17085, -34174, 14787, 48696, -51331, 8399, 48288, -21642, 21349, -13375, -40563, 56204, -27460, -63646, 56503, -7596, -20810, 39612, -49140, 17538, 72477, -71841, -7701, 53689, -46333, 15025, 4950, -51843, 65983, 5727, -67327, 53807, 9040, -19711, 32931, -63379, -880, 66121, -80203, -10309, 61816, -45668, 30998, 23613, -62853, 73620, 22873, -91753, 36272, 10274, -34908, 39240, -45299, -8096, 80646, -52161, -20551, 53232, -35825, 16144, -2050, -69882, 67012, 16835, -74447, 52556, 2110, -22166, 69772, -59318, -23204, 102620, -66648, -48705, 66073, -41176, 6464, 24498, -71828, 52982, 44362, -67989, 34762]
717C4762k8346l5459Q1021j11432K8341J26495j42224J3538R5621r4660O2380
728C0037k859j17726J39521j1329j30686J27432k0349n7309J12483r9485j6038
739d6308J42075j15305k6325Q5901p1648N3174P42j04878J31731l917j21180J14668
751C8730k5264n4335J11140j06277k6292J46770j07136k3695R0709p9535N8329
762B3144K5340j26409J13836K8466j34996Q2224N34n4596R4045p6398k7859J26856
774G4187q2976j7393O9619q4976O1093K6516j37328J06506N1358j29134P4307
785A1779J1165n7541R2514o7144m6746J17103o9910k7959P1166p5210M8878M4219
797E2314j23509P5815N9004j03375N0906K07m5892Q7006o7998m4216J16883o3839
$$ y = [34762, 6416, -29043, 51978, -59454, -31113, 95382, -46842, -33304, 62317, -32343, 30037, 27178, -90548, 48973, 37644, -93042, 34390, 14041, -43268, 69215, -30270, -46308, 95767, -19538, -45863, 40038, -31610, 21564, 22306, -82572, 49159, 45242, -75938, 38730, 13466, -40869, 70271, -36006, -62298, 84472, -22664, -46359, 44350, -35185, 23144, 48484, -77925, 35911, 64377, -70619, 11605, 12139, -42457, 51588, -24810, -52669, 74187, -8789, -26182, 43437, -41539, 19554, 46070, -91258, 15248, 66606, -62528, 11779, 22944, -34597, 57917, -9227, -55973, 61130, -8780, -36739, 34427, -40783, 8095, 52314, -71195, 4620, 63624, -39751, 11155, 11362, -34530, 52476, -15522, -59738, 57145, -6694]
809f694k7258P7269p4853L5818N8002j19617M4661O1916q7578L8389M229l9821
821c5537Q5739m8616n1955J03434m4729l8516O0316o1313K2097N6359r2953L1308
833a4366N6941o5513L2817j920m1755P8753m0024o0596Q9416k5220l8150N3126
845B3509m5548J3832N5119p5813J7153M9217n5751K3300l12m3741O7527j8590
857I902n8958P0504n287l1713L9336l7021N333M3996o3260P639M3052m1197K2030
870D356O111l8965N5791o076n5911M6053j531k7224K9564k9100M957M2772m6141
883a5344P40L8262l1317J2568O226l5891L8446K149m4694L1220M199j7629K3025
896A1960k0655Q42L6688l4014q625K8307k1823M524O181k4906K7519R816k9956
$$ y = [-6694, -33952, 43317, -31536, 4282, 62284, -57333, -12672, 49244, -38334, 55, 4284, -35537, 50202, 1586, -50369, 53065, 8336, -30180, 30136, -31177, -9080, 47279, -45674, -14366, 42575, -22938, 9879, 7959, -33796, 44957, 4933, -55663, 33753, 8533, -29617, 23509, -22039, -8207, 46912, -28901, -11748, 37469, -18282, 5018, 4706, -39035, 28492, 9902, -49056, 21448, 16161, -15552, 23784, -13237, -7904, 36092, -27168, -19529, 23523, -17674, 4356, 10467, -28498, 27293, 21217, -34694, 11359, 9828, -17396, 12168, -16932, -11975, 30797, -15344, -14604, 23658, -7659, 4909, 11135, -24756, 13690, 15839, -28855, 2365, 6564, -11065, 11960, -8695, -7853, 28835, -5179, -13804, 14503, -7320, -2796, 3385, -21521, 5998, 15814, -14142]
909a4142J9317O366j4161J1975j7364n693K7487j9295r630K3330q111K770O264
922I113j8226J3483P842k3248P099O892q080R422p823m731J9818p828j0627J2820
936E926l308j917L240j2369N482R365j3605J946R285k865M249j906o468R119k355
951C819j1849M679J416r99M431l308K549R114p044m919N069l899k331J276l979
966e975N185N887o514J059N957l319j733R5l325L210L65n940M088K689k715K327
982A341j217N56N182m722k933M909m704k402L030m080L680N302n345L721M192
997F510n546J021k075n130M105j561k497P804j474j67N319o137M40L834r736J505
1013c785N280p150M422M431n743M873K195o745M457M14n394L070j579j132K856
$$ y = [-14142, 5175, 11541, -2620, 9355, -8009, -13702, 13785, -5510, -15140, 8190, 79, 2849, 9113, -9113, 4370, 12212, -11036, -3937, 2955, -5125, 4297, -3526, -8257, 11561, 3733, -6894, 5926, 2618, 701, 3941, -8428, -2946, 6419, -7186, -5240, 4045, 1180, 5429, 3523, -2945, 6174, 3819, -8030, -3351, -1935, -2934, 1497, -1811, 738, 9852, 2808, -2111, 2958, -941, -3272, -1996, -5975, -790, 5097, -1417, -358, 5599, 2280, 547, 642, -2683, 527, 892, -5048, -960, 1729, -986, 1341, 124, 680, 5862, 1140, -1793, 3116, -1588, -3990, -960, -5040, -1360, 3942, -1403, 2318, 6510, 964, 1985, -90, -5220, -1115, -2676, -5173, 2631, 1157, 990, 6309, 172, 612, 4446, -5290, -3785, 1495, -5655, -1233, 3198, -2545, 2328, 4523, -2222, 2235, 2649, -2745, 325, -1254, -2386, 470]
1028D70k780R16K548k815M147Q30m194L758j795o627N624j520m524P532j56k892
1044a478O659r79m181K097k671l896J674K41l7K002J738M83n04O23L73l243p28
1061a827J581l096J171M073k562K8L514l042k60L378k683k383K758j613k948L556
1077c55k46k863L773J335j475L175M5l375K73j487k057J331l04J510J548l80L124
1094C572l70l366K088l310l858N063k039j487P205k551j916O716m511k018M253
1109C471o135J87L918m008J932J819l475L179k51j866M700l043j731M095n070
1124b278R79L536o659L803L998o248N436L355p178L874j639p430O588j194m841
1139e898P455o88j456O120m281l26L218p830Q83L606m158M385R04m604O779j401
$$ y = [470, -2310, -1394, 1154, -1661, 2486, 3316, -878, 2880, 1085, -5542, 82, -1438, -5962, 1570, 1414, -1478, 5181, 4202, 21, 2118, -553, -4449, -2775, -2534, -2571, -569, 1169, 1652, 1148, 1771, 2144, -1099, -1827, -246, -3342, -2171, 1902, -660, -632, 2882, -160, -420, 2958, 275, -2108, 650, -963, -3911, -355, -601, -3464, 309, 1644, 169, 3344, 3389, 14, 287, -1200, -3257, -1926, -2230, -720, 828, 448, 3572, 3202, -164, 1924, -1386, -5244, -181, -2220, -3707, 3498, 947, -969, 5747, 1236, -782, 3471, -2664, -2477, 1441, -2567, -635, 1184, -2291, 888, 637, -1229, 3471, 428, -1303, 2792, -2278, -1299, 2237, -4422, -619, 3379, -2869, 2567, 5922, -1256, 2618, 979, -6451, 137, -1057, -5898, 1557, 869, -587, 5533, 1252, 926, 4144, -3686, -2803, 803, -3355, 1030, 1934, -2670, 4109, 2708]
1155B708n016N042l394j950M534n397J637O234p170N86N240l691K914J684o183
1170b222N159R4o903L134J80k018K599k467J611O484l217l599K296j592p12l39
1186a512l056M402L293l892J077L616m42j589l924k162M841L6n540K516N366k341
1202F89j036K34m92M658k769o604N449M320n292j045k85J798M841o888j531R916
1218E963k835n222J181l036N980M04j2511Q240R014p665K239n04j770R112j1547
1233b957p659J5906l930o101N707n975R529O556k1019P087J1834j4385L915J17
1247a375n321J8606j0827j5427K3722l466j1103J0118j2090P718J3655k6507N686
1260f611J8082j7787O021n65r894K6923j0460k4535K9140l933j4720J4896j7165
$$ y = [2708, -2308, 2734, -660, -2610, 1924, -3473, -1836, 4398, -2772, -2186, 3054, -637, 2277, 3961, -2222, 2937, 3031, -3872, -738, -558, -2576, 23, -2444, -833, 5651, 2434, -1165, 1131, -461, -1173, -1512, -4568, -166, 3127, -765, 312, 3928, 3486, 1897, -2027, -4189, 652, 688, -4852, -2336, 3030, 689, -347, -113, -605, 4053, 1284, -5320, 129, 4449, -843, -1888, -2173, -375, 4466, -2422, -3953, 5963, 3128, -2094, -913, -3949, 2031, 2435, -10076, -1836, 7178, -487, 1752, 1248, -522, 8590, -2957, -10616, 5290, 1360, -4741, 966, -5009, 4520, 11076, -9943, -2856, 8978, -5407, -1492, -1375, -6696, 11910, 1083, -14344, 9378, 5912, -5191, 4927, -7163, 555, 14210, -12297, -6611, 11471, -6316, -295, -860, -10754, 16169, 5709, -18826, 10314, 6381, -8339, 6557, -10608]
1273a0608O660K3360l2021M096K6681k1630N405J03j9682L1983p754l1887L3205
1286G911j24j5319J9040k2233O921K9687m1338J941L2447k7284J0795M661l0819
1299b3714L9374P54m4646L4802M866k1611K1904k3479K010L8228m1651m202L5413
1312A8048k6482J3797N235l6036M2906L366n0584L5512K650k2369L0352l0927
1324a4532k206N3721m5099j2460M2590l0658R747J1588m2604M0935J2980n1586
1336b7584L2923M601k0274L3135l7644p060N9685m6856j4337M5477l4537J5299
1348B828J6039n5014M6470K0703o1464L4859P532k8420M2104l5491k1566O8350
1360C6930l8957k4430M7641l0420J2855J9347n8745M0492K7096o2351L0318R658
$$ y = [-10608, -3948, 19412, -12609, -8513, 18168, -3462, 1943, 2046, -17636, 14347, 6593, -25294, 7911, 7787, -7532, 11508, -10725, -3804, 25883, -15455, -13514, 18933, -8351, 2444, 7105, -23714, 15660, 16414, -28232, 6570, 11436, -10175, 11729, -11750, -9740, 28488, -13163, -17365, 18048, -8434, 5363, 10598, -25438, 17468, 20834, -29750, 5762, 8412, -13957, 16395, -14532, -16738, 36983, -8116, -20576, 22014, -8644, 1103, 12691, -29913, 11022, 24002, -27584, 5339, 9940, -10334, 22801, -14843, -21903, 37782, -9074, -23411, 22066, -12471, 2828, 18867, -36147, 10323, 31026, -30438, 4421, 11953, -16467, 25637, -9854, -31420, 36930, -2027, -26457, 21184, -9236, 3619, 22966, -35779, 4713, 31809, -30542, -224, 9434]
1372I434k8197M6993l2094k8336O8846l2795l0020M3166k9603J4047K3609o1439
1384c6389L7205L3561n8717K6158N672k8102N0489l4352l2277P1953l1603k8149
1396b4551M4511l6997J7431L3387p0674L2050M3882o2703K3538J0425l5794N2619
1408B7124k5201m3340P0549j7872l3523M0794l2107J1770L4870o5922K1672M3865
1420C2679n2086K0789O739l1216N3946k5103m6388O5711j5948l0961L9199l4589
1432a7228J2949M0606o5501J7017M5314n0436J9496O721l6254N5465j6390n2724
1444d0965O0080p594l1245L6287l1961Q249M3598n9263P616M4517m3280J4538
1456E77O752l5952N1283o896n0311N0132l065k6353L0427l3487O652M4108n4728
$$ y = [9434, -18763, 28230, -3864, -32200, 36646, 3851, -26169, 16997, -12606, 1441, 25050, -36389, 816, 34377, -24340, 1818, 7490, -20612, 29877, -4475, -36752, 35201, 3598, -24551, 19960, -17037, 394, 33781, -36893, -4843, 39039, -23664, -126, 10299, -25495, 27124, 1923, -41417, 29132, 11260, -22263, 18531, -13576, -1806, 33064, -32858, -11186, 32679, -19407, 1382, 8121, -23095, 30851, 5748, -40640, 25071, 9123, -21838, 17361, -17228, -4279, 36327, -29174, -12157, 33157, -17279, 2217, 8938, -27316, 28149, 11759, -40965, 19115, 11521, -19724, 16563, -15398, -7149, 36449, -22814, -15198, 29319, -13961, 577, 7329, -28623, 22660, 15764, -34547, 15585, 12520, -13833, 16594, -16893, -10241, 33867, -20861]
1469b0861L764M3135l7168J4860P094l8833M6769j137n0471M2472Q14k2747K8960
1482A6651l0947K045M5822m7371m263L9361k9550J1143O702l4830L9339J756m3029
1495b7171L3078R23j5860K6344l0040J287M2629m1330o884L2835k5521J2804O085
1508I179l3248L7514N189m0856K7701K97j6943K6435k5945n795M2377k9147j1323
1521a4565K8134j8348P362O576k9598K6812R840l2618J8082K658j0846J9611k0679
1534g579n870L2304k0464q069J8436j4614J0760K734k7169K4098Q514k6361J5955
1547B675J040r669J9906j8991q573K8356j6625q676J6695j1809R394O930k4399
1560a3746J5779J0550k2153R165J467o797J5217j2453p282K1446r589p804R968
$$ y = [-20861, -17097, 26038, -11130, 3730, 10824, -28009, 18760, 17623, -32848, 9624, 10438, -12309, 16651, -14296, -12251, 33571, -13800, -18063, 21298, -8252, 2891, 9593, -25237, 14102, 15858, -27171, 5907, 6830, -9030, 17314, -12726, -11439, 31190, -10140, -17024, 15811, -9710, 3094, 9179, -24069, 13445, 18634, -22222, 5479, 5776, -11167, 15268, -10677, -16472, 25905, -3242, -14565, 13569, -4779, 2583, 9159, -20439, 6373, 16213, -16405, 1677, 4335, -6511, 13100, -7579, -13449, 18855, -1609, -9678, 8758, -5856, 4904, 7638, -19531, 4567, 13081, -13280, 2675, 3715, -5954, 13952, -5039, -13612, 14744, -1881, -10557, 6138, -5671, 3723, 10653, -13746, 2033, 12583, -9570, -405, 1062, -5735, 9482, -2971, -10253, 11193, 1604, -6200, 3768]
1573C768q923P821M327j7965J1591P965j4499O372n65m730J3358j0048o416J6223
1587H279o287n587O035p369N608M206j3019P544P090q145L453j986k365Q147q050
1602b446m124J0050l519j11K717o068O721K085j1650N566M268o879M325r89l062
1617c116Q639n090n753Q219j735l075L148k921J859L539n889l33M392k033j106
1632a255R35M59K084j374j111k01M37J286l537q15N740k205j616M061k837K44
1648B95K257n748R24N462n608Q51M739l918J546J725n068K178K628m635J165L202
1664A995k294j49J392j777K19K174k219r12L276n86k654K805p20k931L365j284
1680c00k643N415p57m024N024j566m302M340j671l078M797q91k061M646j214l166
$$ y = [3768, -5155, 2666, 6993, -10972, 619, 8584, -5915, 457, -108, -4838, 8520, -1528, -7944, 8279, 1992, -3595, 2440, -4929, 679, 4885, -8134, -590, 6500, -1645, 1808, -178, -2543, 5604, -2446, -6570, 3480, -39, -150, 2567, -3501, 3220, 5305, -6345, -779, 3489, -3390, 935, -54, -3116, 5523, 433, -5320, 2899, 1164, -1911, 1237, -1684, 175, 3714, -2175, -2508, 1884, -149, -1255, -320, 139, 2223, 849, -262, -463, -26, 1260, -2277, -3092, 2648, 443, -1173, 2888, 51, 295, 2552, -3196, -2272, 3190, -2418, -1567, 3172, -746, 800, 2525, -2543, -365, 2263, -2372, -1207, 1995, -299, -448, 944, -833, -614, 1560, -659, -1571, 1705, 1119, -1535, 1270, 550, -2381, 984, -300, -2943, 2472, 1715, -2309, 2715, 1149, -3153, 1187, -484, -3562, 1235, 344, -1717, 2929, 1715, -1451]
1696a451K831j265k562L055j215j320K939J98j684J115L79k440J130K95j499J266
1712b28J355k244L55K135k157j56K345k359L74K858k516k10K346l085p90K574
1728E97j988M30L092k064m21K693k850p63J957k058m26K476r62M86K027j671p65
1745b10Q52j469m81J460n93J19P10J2k10M66r16j04J69JM64j46N92k40o60L3l69
1766e20o67J276M53r98J622l31j178J392j477j329J868r06J64K256j148j73J361
1783A665k240J23N37j646J152J09l29K091l57j179J013k008L2J322j189N82J628
1800A306k212J724P5j596J337p55j221K471o11j016J783k173j97K071k588N62
1816a040K758k587J160J108j893J862q87k962K477K51j159J829p22R45O04k541
$$ y = [-1451, 1380, 115, -2447, 608, -607, -1927, 1012, 1210, -474, 641, 1020, -1420, -290, 5, -1494, -228, 1127, -1117, -762, 1373, -784, -940, 1405, -954, -580, 2278, -238, -448, 1898, -1187, -1977, 597, -1391, -961, 2131, 67, -354, 2339, -511, -1274, 683, -1375, -1801, 675, -287, 199, 2226, 555, -210, 642, -827, -1308, 152, -441, -322, 388, 400, 190, 656, -260, -364, -195, -194, 270, 124, 716, 476, -184, -151, -520, -1187, 89, 542, -456, 1166, 835, -343, 1049, -428, -1757, 111, -795, -631, 1625, 477, 304, 1665, -575, -452, 85, -1561, -409, -300, -629, 1462, 1105, -74, 939, -1069, -1037, 285, -904, -322, 1306, -906, 818, 893, -703, 634, -121, -1342, 1129, 518, -498, 1285, -888, -1085, 986, -1602, -1040, 1718, -869, 291, 1399, -494, 1368, 481, -2481, -4, 247, -912, 917, 195, 1140, 1744, -797]
1832g97O30L43j264J043j182L90L603k457j386K969j871m49J178k577K180J871
1848B224m046J663J478j653O69j461n72L324j273j359K147j228P28q43k670M127
1864A255P68l889K220R22q18J982m017l6L590l346r82K789m54K532j727l753M987
1881B023l03l737J787j120J842L103o215K327M532n601P06K29k228O294k908o396
1897e665Q417m92m616L326l481K084N123r036K236Q250p120N22M31m138Q140k545
1913A436q408R347N80m499L126m783K978N757j1548K253Q528n447K237r94m881
1928d318J1001m733j0162J0743j257l488N172q562O129R001j6031K015R569p756
1942b677M798k120p196J5175m271j2695J2842k429l523P083j2419O138J3537j8396
$$ y = [-797, -167, 176, -1088, -45, -1227, -837, 2766, 309, -1077, 1892, 21, -428, 750, -1827, 353, 2224, -1822, -159, 1319, -334, 335, -1126, -1698, 1626, 353, -1006, 1141, -87, 641, -202, -2872, 1255, 2023, -1866, 354, 1276, 458, 2440, -1577, -1613, 1977, -1369, -2351, 438, -16, 2516, 789, -2964, 2023, 1720, -2017, -230, -1350, 492, 3595, -2620, -293, 4239, -1362, -656, -427, -2655, 3639, 731, -5665, 2752, 2260, -2356, 970, -2511, -427, 4696, -4340, -2104, 6146, -974, -452, -21, -4159, 3981, 1436, -6972, 2375, 2955, -1544, 1582, -3201, -223, 5534, -6014, -3761, 4767, -680, 1557, 563, -4318, 6683, 1950, -8212, 2531, 1274, -2214, 2958, -5604, 525, 9526, -6505, -4490, 5079, -2677, 2121, 1, -7195, 7980, 3709, -8986, 3856, 1427, -2096, 4987, -7432, -1294, 12243, -6153]
1956f153J565J0714j0102O553k368j0773J8681k471j5711J4048j821l618Q440
1969F984j6052N212J6717j8615J399J0809j0189R518m447j4353K1501k134j7849
1982a1499J4641k898j661J1778j9183L041K0332j9719m36J1112r900J1689m673
1995B624j7071K3138j354j8793J4549n070o55J5661k3502L536K3634k2557q45
2008f705J2317j2913J5247k181k2635K5357K129k1374J4509o371j492J7465k3466
2021a0113M76K6251j9914j966R929j3671J8085k710k5415K5983L178k0160J5908
2034E861q943j877K1382k6078k469K7960j8292j542Q659j5536K0340p44k8829
2047b0108K5297N086j9840J5843r887k025K4546k7201n797K8858j7291r96Q637
$$ y = [-6153, -4588, 6126, -3976, 2577, 209, -10564, 8117, 5646, -10065, 3983, 2162, -1456, 6984, -9068, -3856, 12861, -5754, -4355, 6454, -3735, 5783, 1336, -13017, 8484, 6350, -11499, 3142, 244, -1417, 10361, -8822, -5781, 14551, -5168, -5604, 5508, -4392, 7297, 2624, -14447, 8691, 7337, -11456, 3093, -1977, -2632, 13029, -10473, -6937, 16697, -5860, -6705, 5612, -7301, 7946, 5765, -16870, 8487, 10616, -10758, 3751, -2620, -4112, 13353, -10113, -9637, 16614, -3300, -5266, 4663, -9008, 9077, 6367, -19048, 6935, 10113, -10047, 5861, -3082, -4959, 16423, -9655, -12124, 15836, -2456, -3998, 4661, -10875, 9465, 8721, -20108, 5189, 10275, -9565, 6278, -3609, -5634, 18912, -8289, -14086, 14772, -2519, -3515, 5122]
2060E122j8061K2299K928l1693K2538P381j9595J4028j0468k427K7187k4629q121
2073a3511K7435j5710L35P065k0828K3407M815l2044K0865Q399j7986J4232j2900
2086f426l639K9605k3634r779K6680j4477J131P095k2140K1753Q200l1799J7704
2099B74R096j5093J4551j4434n968K9652k1627j0746K4643j2633L180O913k3488
2112a5680K1295R981l1377J4686P572j2608J6216j4715p455L0060j8586j3352
2124a3963K2375j1267L412P502k3749J8930J2043k8180J1710O450j1550J6347
2136A0060j4181q560K9405j5313j3346J9188j0890M451P451k4153J6821J3846
2148A4779k4830R174N548j0588J5622j3170r646K6533j1204j1635J5227r078N824
$$ y = [5122, -12939, 9360, 12288, -19405, 3133, 10514, -9081, 4947, -5521, -7948, 19239, -5390, -13511, 13924, -1786, -1451, 5614, -15214, 8193, 13008, -19036, 1829, 10228, -7758, 6474, -6426, -10065, 19540, -4094, -13873, 12807, -1670, -539, 6556, -15584, 6169, 14369, -17430, 274, 9370, -5723, 8828, -5606, -11574, 18078, -3549, -14295, 10348, -2285, 895, 7808, -15680, 5615, 15596, -15781, -1095, 6477, -6131, 10085, -4630, -12085, 17975, -611, -13963, 8412, -2855, 557, 8059, -15690, 3240, 15283, -12897, -1187, 5263, -6287, 10060, -4121, -12681, 16724, 1411, -11935, 7253, -3637, 814, 8265, -15888, 933, 14779, -10051, -877, 4671, -5917, 9705, -3465, -13111, 13422, 2218, -9417, 5810, -3268, 2556]
2161B556O773k3316J3367J2859k1327Q668L180q358J6774j3705j0677K4571r063
2174B302j0018J3182j0507O864Q733k2728J1138J2367j8626O518K448p576J6023
2187A0120j0079j2118K0877o067r554J0535q745N847Q417j8536P780J1594j3951
2200c880L789L10o361J4736r164r367J6999n129n470P741j0392P207P451j7802
2214i332P565J0216j2463O200j425p227J4733o964j0932J5234l584n805Q326r302
2228d760M073Q765j5030K895R955q443L667l0n758J0261m229q282R976k274k274
2243a488M350p282N090O048j1813L838M344o321N919l984l821J1814n768o703
2257e777R968m290j354N421r440M568P955j0752K228N387o701M338j242n677R339
$$ y = [2556, 9329, -13987, -620, 12239, -9088, -420, 2760, -5598, 11176, -2529, -13206, 11365, 2302, -7716, 5466, -5041, 1823, 10556, -12172, -1034, 11333, -7293, -775, 1673, -5903, 10120, 41, -12077, 8800, 2733, -6821, 3714, -5031, 816, 9233, -9303, -1523, 10071, -3880, -91, 219, -6142, 8594, -570, -9937, 7062, 1933, -3537, 4204, -6188, 1019, 8470, -9332, -1767, 8449, -4014, 2186, 761, -6466, 8267, 1303, -9629, 5605, 2021, -3784, 4542, -4760, -687, 8078, -6952, -4057, 5898, -2545, 1122, 1092, -4666, 5595, 1366, -6916, 3060, 786, -1488, 2862, -4420, 670, 6718, -5095, -1257, 3087, -3234, 2685, -1299, -5120, 6694, 926, -5777, 4191, -99, -1453, 3968, -5472, -904, 7051, -3701, -1473, 3914, -2787, 1551, 309, -5368, 3971]
2272C971j716o799O655p18k472L658n455J233N089n209J013K103j655K819l083
2287e66k918O376k936k973M240k314J610K853o366L195L452p213K900K038l857
2302b479N169j273m935O327j199m387L733j340o18K912k987L57L207l422R7J222
2318C84j813K954j121k188L519q33k032K044j832L06J541k785J563J989j753O71
2334F14l61j731K373j208j443K629r93l68J764j377N64J304l834J032K202k236
2350a069J010J282k162J661L8j909J124K90r29J083m53N2J196j882N10L64j054
2367h48J131n72J59J163n21p44J156j232o44R78p97M53J277j003J75O98q92M5
2385a8J41o26O21J53o65P00j47N0N02j138k83Q26m91N49K95k65J02M9p53P01n22
$$ y = [3971, 2255, -4544, 2111, 1393, -1079, 2579, -2876, -1643, 3446, -1763, -750, 1353, -302, 2517, -566, -3484, 2892, -44, -3017, 1223, -1091, 519, 3372, -2994, 201, 3653, -3560, -660, 1378, -2479, 2690, 1417, -3518, 2809, 1610, -2777, 956, -384, -1002, 1910, -1077, -720, 2487, -935, -838, 384, -1429, 1525, 404, -1784, 1735, 902, -1130, 914, -918, -612, 929, -1856, -293, 1696, -57, 614, 253, -1478, 895, -313, -1756, 873, -120, -488, 1276, -101, 463, 1767, -2067, -1035, 1167, -1069, -59, 1223, -939, 722, 760, -1149, -25, 265, -664, 419, -34, 18, 1214, -668, -158, 206, -848, 283, -289, -130, 1033, 512, -232, 924, -308, -952, 26, -771, -318, 959, -44, 131, 829, -63, -18, 123, -503, 118, 271, -394, 306, 159, 209, 711, -427, -710, 116, -375, 174, 469, 204, 306, 355, -398, 303, -219]
2406b19m61R46l2l12Q28k50q95M35m84j59P11p4P9K71j19j89J40n46Om17M39R22
2428F20l27J33L65q72L69j83j285J030K04l24M54O19j092P86k56r39L53K71m2
2447a16L18J64l28L01n51N23n55l83Q00n50o0J755j717j10Q01p45j25J261r67
2466b84j30J468j347N38L17j045J3P6j45O42N7K86Q6n59J96Rj698J809N86k085
2486a210J795M22j715J517m33j744J976l10j286J380n01K58N90j635J058J26j606
2503a318J456k50o06L033k615q65L264k667j065K826k625J012K640l654J242K541
2519B349l273M72O71j903K668j128j366L348j363j235K032k660J550J316m105
2534b627K982J816l781K853p98k587M435k271k999N150j794j602K933l415J572
$$ y = [-219, -680, 266, 234, -78, 750, 500, -395, 40, -444, -603, 108, 34, 113, 384, 265, 76, 216, -330, -324, -741, -302, 620, 293, 426, 791, -81, 288, 105, -1180, -150, 54, -270, 184, 803, -289, 497, 241, -698, -345, -74, -116, 202, 366, 38, 339, -212, 311, -244, -627, 173, -377, -437, 1318, -399, -509, 292, -453, -578, 683, -284, -414, 1054, -293, 245, 562, -483, -470, -394, -539, 103, 160, 446, 532, -27, 169, 178, -1520, 289, 875, -1210, 585, 1007, -708, 809, 376, -1368, 608, 298, -988, 392, -109, 149, 739, -896, 162, 288, -1318, 138, -112, -718, 2315, -300, -1165, 2099, -568, -1633, 1193, -1432, -420, 2220, -1434, -192, 2349, -924, -452, 219, -1684, 984, -144, -1510, 1838, 475, -760, 1272, -1388, 162, 1478, -2627, 355, 2171, -1610, 1243, 445, -2142, 2293, 22, -2977, 2173, 379, -1223, 1710, -1705, -133]
2549a33K628n631K544L153m491L378p78k723N523l677l559O241k547j713M167
2564B382m319K356L666p483K456L782n150L197q08k913O700l165m600O483k568
2579A6j389L430n459L503M498p714K269M230n686L860j730m075Q310k840n628
2594d405P271k244j646L824p054L551O010q983K417N161o101M242j858n081R057
2609D161k957o550Q081k614m75M288q407L548O824r958J791N196n230N575k871
2624D02o065J1109l645p537P841k541l12N512r461L132Q559j0145O05M448m993
2639c091O775l365o831J2042k757p817P542m061O26O326j1360M011R650j0471
2653b781R57M217n726P398l333q941J2969r36q732P084l434P66O137j1978L257
$$ y = [-133, 2495, -3136, -592, 2561, -1930, 1448, 670, -2053, 3470, -207, -3766, 2475, -72, -1785, 2382, -1937, 419, 4085, -3398, -942, 2840, -2310, 887, 79, -2834, 3866, 701, -3899, 2584, 16, -1373, 2057, -3402, 101, 4599, -3115, -846, 3384, -2302, 1558, -172, -4247, 4063, 1223, -4405, 2866, 622, -1024, 2800, -4254, -703, 5307, -3676, -1259, 3902, -2199, 2043, 185, -4896, 4161, 1204, -5346, 2735, 121, -354, 3934, -4473, -925, 5899, -4059, -2268, 2928, -2302, 3273, 402, -5663, 5446, 1801, -5736, 2105, -436, -748, 4764, -4697, -1565, 6994, -3151, -2546, 1902, -3091, 3684, 319, -6512, 5530, 2773, -5044, 2498, -1563, -937, 5389, -5971, -1960, 7690, -2781, -1824, 2393, -3333, 4065, 732, -8209, 4760, 3824, -4908, 2176, -1258, -492, 5645, -6333, -3076]
2668c076R889r450K039K267n174R527m608j0135J2573q8q523O713l998J830P683
2683G469j3271K101J0488q812J301J202m765J0395l668j0681J1269O08p067N335
2697A904n955L626Q981j4024J684J0621q365J255M17o097J2259k990j1642J1553
2711C227J81n628M679o881L447R143j3182M67J0611p059K076j128o128J2301k767
2726C359j1795J0676O52l760M327r047M330J0061j3695pR897o224L305j822o968
2741f711J2718k077j2044R106Q34k786M810r308L812J0513j2276j370Q075m626
2755a330M225k770p771J3661j158j1629P816m18j020M765j0573L598J1674j1462
2769b392j210O348m336N268l257q525J3237n61j0014O584j408J26M936j0843K520
$$ y = [-3076, 6813, -2637, -598, 1669, -3505, 6022, 1414, -8721, 3852, 3764, -4759, 1954, -2044, -214, 7469, -5802, -3701, 6787, -2025, -724, 478, -4287, 6108, 2440, -8241, 3028, 3636, -3431, 1904, -4051, -425, 8556, -5468, -3784, 6837, -1528, -273, 144, -5953, 6306, 3316, -8326, 3227, 3408, -2220, 2459, -4422, -975, 8168, -5014, -4547, 6064, -995, 1081, -47, -6175, 6126, 3359, -8436, 2240, 2892, -868, 3459, -5588, -1258, 8803, -4892, -4899, 4998, -1226, 2079, 257, -6711, 6007, 3930, -8114, 992, 1826, -960, 3850, -5458, -1646, 8867, -3409, -4779, 3296, -1330, 2895, 125, -7646, 6015, 4857, -6772, 1044, 626, -394, 4371, -6202, -2604, 9070, -2392, -3602, 2746, -1590, 3678, 421, -8104, 5133, 4572, -5442, 1142, -266, -140, 4796, -6047, -3527]
2784c527J1635j0326m67M564m146O946l608r338J2368k57q791O091k274J676N639
2799F185j1948K092J0551q998O3K721l820Q688l613r545J0907M18p602N024l239
2814b116J830O933j1335J326R847q056N61J625m812Q953k556r444J0333N87o093
2829b417L880m462K475O853j0511J171Q371o234J145K35n097R308k831q948R381
2844B319K28m165M403o225K478P787j1114R94P789o090K545J30n598R075j811
2859B745q964P540K37l190M585o153K013P315r234M19O124n195L207p80n481R241
2875D429j286q201O786j401k034M801o782J801Q000q405QN336m836L284p21o089
2891e310Q638l08p308O122r43j973M187o085O46P616p205l03M814m621L963q24
$$ y = [-3527, 8108, -2218, -2685, 1879, -2267, 4679, 1071, -8267, 4101, 3844, -4947, 1144, -1130, 546, 6185, -5763, -3671, 6880, -2118, -2055, 666, -3154, 5534, 1921, -7624, 3283, 3701, -3901, 1123, -2116, -286, 6647, -4688, -3362, 6485, -1571, -1010, 615, -4197, 4756, 2200, -7244, 3089, 3676, -2417, 1463, -2999, -524, 6329, -4182, -3011, 5360, -874, 271, 506, -4591, 4717, 1886, -7062, 2319, 2547, -1618, 2785, -3440, -962, 6825, -4289, -3295, 4494, -1596, 949, 1079, -4519, 4556, 2745, -6219, 1321, 1558, -1632, 2953, -3200, -1187, 6128, -3106, -2687, 3437, -1758, 1449, 669, -4812, 4429, 3143, -5058, 1728, 327, -1707, 3094, -3688, -1887, 6113, -2292, -2284, 3052, -1784, 1500, 779, -5310, 3328, 3020, -4288, 1834, 891, -1082, 3105, -2980, -2334, 5282, -1923, -2226, 2588, -2033, 1930, 1106]
2907A106o002P089m4n864N292j492r67M666o745P29O497o321N19L218m214M605
2923B072n95n459O337k67n585M472j547p52N080n942K54N648n085K90K513l789
2939b355L607L91n351N413N33m854L804j505j448M751m867j31N039m182N55K361
2955A761l642L068J9m388M382L86l351L049j762q40L838l921o03M586l696L57
2971g57K398l214K698K52m111L119Q52k802K479p66r91K898k760n91L077k780
2987i99L19J587k797K796N47l316K232O97k601K061p83p39L253k370j044K836
3003A679k023j61J056j960J394J047k070J429J14j828K273j162r65K404j769j70
3019g12K399j778L10P46j939Q00J022k168J622N74j535J029j66r10J377r88p78
$$ y = [1106, -4896, 2193, 2149, -3715, 1577, 85, -882, 3784, -2961, -2232, 4265, -2056, -1537, 1681, -2533, 2072, 1477, -3982, 2355, 2088, -3497, 975, -572, -1324, 3756, -2186, -1932, 3716, -1369, -1079, 1434, -2355, 1252, 1643, -3708, 1705, 2238, -2616, 1188, -317, -1765, 2986, -1881, -2012, 3027, -1155, -600, 1761, -1881, 1187, 1206, -3182, 1200, 1586, -1765, 1284, -478, -1318, 2520, -1401, -2004, 2582, -1114, -757, 1641, -1573, 1125, 1377, -2734, 385, 1237, -1565, 914, 148, -843, 2055, -705, -1296, 1781, -999, -680, 907, -1890, 906, 1453, -1863, 369, 1066, -1535, 526, -257, -996, 2257, -113, -1157, 1679, -344, -505, 551, -1409, -15, 1032, -1038, 391, 505, -1323, 950, -212, -1177, 1227, -542, -712, 1687, -91, 219, 965, -974, -174, 848, -1320, 302, 876, -659, 370, 204, -706, 671, -317, -1095]
3036a095J636q59L87R50j263L82M35j266N88J43n00R62o15l59J166r04m12R18
3054B94j108N35J135j090M96N96j296J71R71j482O58K52m78P98j81n98N69k51
3072im36M14k52L00L05k89L02J13o64N38K75j047N62K35k82K80J51m25m05J30
3092b04p7j00K29M92o30M82N84q83K23K26j076K98J659j318L1R10q55r22J289
3111C58o80l54J020j71q09J394l07j138Q08j35n04J98Q83p94M34O82j174k4J104
3130G91j174j07O93o96J26J078r31N7P25j197L82K41q4M98m1q33R15m38j22J91
3150G4n05k73J032r42M62P81q72k0O21q24M02J72j154J430k9k49M05n22J98L7
3170B24j537J571R3j156J580m63j701K596j151j987L188j440j133K821j607m39
$$ y = [-1095, 541, -318, 69, 1019, -244, 138, 573, -693, -105, 38, -462, 500, -115, -474, 692, -212, -624, 294, -814, -279, 856, -234, 262, 858, -438, -267, 704, -778, -120, 132, -346, 452, 271, -327, 242, -9, -445, -31, -283, 17, 322, 33, 335, 448, -216, 322, 597, -450, 112, 347, 65, 345, 496, 71, -334, -204, -281, -381, -152, 340, -290, 192, 776, -107, 116, 342, -734, -436, 1223, -95, -64, 846, -9, -931, 358, -322, -676, 344, 173, -636, 758, 451, -687, 121, -14, -518, -320, 563, -231, 203, 885, -289, -313, 791, -383, -490, 203, -493, -367, 711, -220, -163, 562, -635, -253, -12, -96, 402, 361, -472, 443, 5, -117, 74, -431, -704, 328, -614, -152, 629, -243, -263, 358, -466, -64, 108, -1046, 384, 355, 106, 511, -11, 187, 224, -1313, 258, 351, -805, 775, 312, -1389, 1207, 56, -1931, 1257, -183, -1316, 1505, -102, -541]
3186e41K393k540l10K205j724K95R23j730J438K38j670J712q52r15J414j056M41
3203b79K478k896L63J991k915J432N72k261K371P4k577K639k38j816K268k235
3219a029j20L307l291M14K862l324J337R13l328L189P09l871L318l91k122L618
3235B191l153r14M484l736m28L585k948J483J101m159L660R15m878L650k83k151
3251a581M239l487q98N101m416j150L898l087J605J552m922M207J370m948L424
3266I07j39k394M365l808j100N871m180j345L705l569J763J791n887M358K335
3281B673n536L838k16l159N010l745k068O873l615j924M035l744K411K083p069
3296d153M488K756o121L853m39k040N316m622k655P296l659k082M078m023K905
$$ y = [-541, 1852, -688, -998, 1207, -517, -222, 701, -1029, 409, 647, -1023, 689, -163, -1078, 336, -720, -279, 2199, -697, -334, 1657, -1258, 174, 746, -1515, 856, 930, -1647, 992, 754, -1062, 1206, -1029, -1149, 2158, -1133, -719, 2143, -1181, 156, 1069, -2259, 930, 1639, -2232, 1086, 695, -1427, 2191, -962, -1876, 2608, -1128, -1556, 2029, -919, 564, 1665, -2494, 1166, 2081, -2797, 853, 570, -1581, 2658, -829, -1727, 3374, -1042, -2192, 1706, -1381, 224, 1776, -3146, 1061, 2431, -2517, 907, 768, -1626, 2739, -1069, -2169, 3702, -478, -1823, 1882, -1687, 76, 1867, -4020, 338, 2673, -2863, 975, 759, -2400, 2610, -1135, -3203, 3670, 55, -1869, 2166, -1578, 833, 2916, -4153, 335, 3091, -3030, 823, 384, -1656, 3660, -962, -3617, 3679, 20, -2062, 2016, -2007, 898]
3311H98K332p100M045L050n945L185n47k196O353m872l316P509l803j548L850
3326A895m600L424K933q066M258M030o366L423j058k484O771m135m180P555k898
3341E02k180L284m931M004L184p978L586L968n342L437j678l134P681m045m975
3356d617P438k062j719L123n657L888M142r030K973M626m584K829j498l123P543
3371D272l673n182O547j601p41K392n258L696M283q053J957L337l789L410k208
3386f11k665P697l360n182N708j201m41K166n785L911M511p319J547K870l137
3401a291L149k359l572P688k166m926M441j002M77K145o386L177M926o214Q14
3416a099K496k470L736l647k969P223j751m334L875j816J395K098o629L483M196
$$ y = [898, 3230, -3870, 175, 3225, -2720, 465, -82, -2278, 4075, -797, -4113, 3396, -407, -1955, 1895, -2705, 719, 3652, -4414, -156, 3874, -2492, 931, -127, -2611, 4160, 25, -4155, 3400, 502, -1678, 1606, -3325, 679, 3863, -4115, -529, 3439, -1903, 1534, -144, -3278, 4403, 358, -4617, 2821, 759, -960, 2163, -3494, 394, 4536, -4494, -1521, 3105, -1479, 1350, -148, -3271, 4272, 599, -4583, 1964, 363, -378, 2014, -3244, 452, 4735, -3318, -1361, 1976, -1813, 1597, -611, -3276, 4421, 1061, -4121, 1587, 386, -55, 2111, -3674, 237, 4748, -2571, -1024, 1846, -1291, 1858, -501, -4073, 3615, 1449, -3477, 964, -38, 439, 2584, -3802, -625, 4301, -1913, -1099, 1397, -1073, 2663, -984, -3953, 3270, 1519, -2815, 1060, -756, 639, 2737, -3892, -409, 3787]
3431C787n680Q73J444j326M274l465l690O969k029l463L094k084K271J671o268
3446c622K958M220m771L00N66j187M815l460l514O348j195k988J970k181K778
3461A037J426n559K438L206l211J058j721n70N618m134l373N919j273j533J316
3476F44k793L120K217o417K294L112k806J232j324q64N407m329k718M499p90n64
3492h0Q26l243M043J652n802J710K268j994J758k253q05N610l605k782L785q23
3508B65k10J63l123L747K229n181J620J507j259J797l283m16N207k854k262L341
3524A288j511J159Q9m136L476K332n057J967Q75j003K600l256j146N099k767j492
3540a483K412j518J647M36m375L148J923m287K016J86r28L221l294j325M971k496
$$ y = [3787, -1893, -1020, 424, -902, 3372, -93, -3783, 3186, 1157, -2306, 788, -1296, 975, 2646, -3622, -664, 3556, -1215, -915, -349, -1536, 3279, -181, -3695, 2653, 1458, -1530, 440, -1741, 1037, 2463, -3096, -658, 2548, -663, 395, -1326, -1896, 3722, -412, -3785, 2134, 861, -672, 644, -2149, 971, 3188, -3229, -935, 2177, -629, 603, -721, -1585, 3822, -507, -3225, 1274, 484, -80, 746, -2497, 1546, 3198, -2604, -894, 1374, -620, 1138, -1115, -1920, 3690, 85, -2697, 1088, 265, 55, 218, -2905, 842, 3071, -2110, -490, 1017, -242, 1555, -1728, -2144, 3063, 209, -2053, 1288, -223, 936, 1025, -3111, 365, 2697, -2360, -393, 482, -521, 2079, -1177, -2323, 2776, 9, -1483, 929, -589, 1058, 1494, -2881, 267, 2190, -2097, -81, 105, -823, 2398, -896, -2221, 2750, 254]
3556B54j758K513k427J955J246m416L186J848l642J892j074q35L584l353j358
3571b385M859k613o41J727k511K246Q13m070L143J580l208J827j096r25L449k821
3587f26j560L868j529j054J913k317K232O77m425K768J304k780K328n03j593L749
3603B452k781j968M094k042n72J908k317J685J442l849K013R32k527K344n35j469
3619a190L232j877j545K704j572l58J375k186J698J470l130J718R71k569K276
3634A017r60j545K979j579j395L102j649n00J736k250R65J837k804J051J049k022
3650i68J955m86j754K192n86j650K073j119j82J720j686L35J132k353J232J240
3666A095k143J628j16j505K073j018j195J533q26m21J771j500M31J314j777N68
$$ y = [254, -1504, 1009, -1418, 537, 1783, -2633, 553, 2401, -1241, 651, -423, -1258, 2326, -1027, -2385, 2474, -139, -780, 947, -1564, 682, 1495, -2575, 568, 2148, -1060, 767, -329, -1254, 2195, -626, -2186, 1682, 153, -901, 1012, -1305, 927, 1604, -2821, -53, 1251, -1529, 799, 296, -1297, 2452, -329, -2297, 1797, -245, -817, 1091, -1226, 459, 1901, -1948, 65, 997, -1530, 814, 279, -1190, 2042, 165, -1380, 1324, -248, -606, 769, -1417, 281, 1751, -1379, 339, 1310, -1259, 1017, 57, -1488, 1491, -88, -1483, 1619, -30, -530, 1206, -1044, -79, 1758, -1046, 5, 1054, -968, 987, 501, -1253, 939, 353, -1297, 776, -343, -525, 1195, -491, -156, 976, -1377, -145, 1095, -1048, 580, 464, -1041, 1032, 14, -1181, 352, -474, -895, 876, -624, -193, 1121, -656, -88]
3682h8P89j517R55L98j167J357k29q05Q68r74K3Q28j274O09J075j388M56O64j301
3701g21P72Qp23J288n63n45J104l44p00O13l80o84J334q26K70J65k87M64j50q20
3721g25P74l22j15P48k5q33J152m75n87R13o62j84O91l40j62K61l92K62J97k00
3741b4j24m06J81P31n76J71L23m54J05M37r93O54K33n23N97J71r10L64J84o59
3761e18K86K84r2O9M4o0p6R5j00j24M7N87p28L21L33j68l47K20n74N31K6K7K52
3784C35l47K13O1k83k85O0R6kL43j68K47k24m38M74J82n71K23o6K0L64j08j94
3806f8N8R8m78M46k38K13L64o61M07J31r04P64m21n0N25o92L40O95m91k82O93
3827D49o38k5L95m91M69J59o58P89n83M3L85q78K72P66o94k0P48p99L47L87j241
$$ y = [-88, 701, -816, 139, 537, -630, 727, 498, -307, 561, -413, -390, 438, -836, -227, 848, -540, -84, 580, -721, 51, 59, -664, 624, 61, -484, 620, 276, -424, 189, -191, -875, 459, -367, -97, 68, -219, 245, 95, -725, 49, -273, -388, 360, 335, -498, 654, 179, -408, 505, -157, -341, 350, 10, -152, 109, -283, -21, 176, -24, -148, -554, -373, 358, -218, -47, 276, -178, -73, 364, -629, 25, 258, -265, 332, 503, -407, -43, 141, -518, -232, 52, -40, 29, 73, 13, -63, 32, -68, -192, -145, 442, -286, 35, 368, 200, -147, 73, -501, 30, 56, 83, 335, -12, 201, 262, -21, -306, -246, -150, -152, 191, 23, 270, 46, -392, 82, 264, -307, -84, -150, -130, 234, 126, -68, -10, 88, -390, 56, -182, 31, 395, -266, 141, 272, -632, 132, -289, -339, 186, -506, -166, 529, 38, -244, 449, -189, -214, 181, -310, 159, 318, -340, 449, -134, -91, 294, -584, -312, 454, -240, -260, 488, -311, 36, 423, -818]
3848h18J173K12j662J499p0r22J168n55j160J850j085n44J372m29k49R98j266
3865d88N75N72j284Q02L39r73J132n27r54J850j336o53J640r89M30N83j729J539
3883E29L43k192J487P7j194J921r11j102K159j153q52J760j638M91J496k707J449
3900c7J595k842J318M12k075K456r14j625L371k008m72J896j716L86J703k903
3916a455J229J665k801J980J93k180K822j421k044K996o82j700K563k089N31K482
3932B089l648J126K496l706J573N60j911L240j057l308L947p32k138K726k314
3947a057P13K510l496Q52K423l216J465N32k530L392m90l363L766r06k083K903
3963A415k181k85L580m057N4L503k864O82J182l101L491l42l767L787k85k449
$$ y = [-818, 355, 567, -1095, 404, 334, -588, 580, 25, -1135, 715, -370, -914, 458, 29, -220, 778, -488, 87, 659, -625, 177, 516, -457, 675, 148, -806, 1044, -292, -945, 695, -294, 136, 719, -1010, 529, 872, -1320, 167, 244, -950, 971, 60, -1042, 1117, -36, -888, 872, -766, -275, 1221, -1486, -37, 1558, -1284, 34, 446, -1629, 827, -87, -1712, 1659, -349, -821, 1075, -641, -255, 1448, -1455, -226, 1439, -1362, 618, 811, -1369, 1453, 32, -2012, 984, 302, -1398, 1165, -924, -393, 2089, -1559, -433, 2063, -1643, -70, 490, -1421, 1819, 762, -2546, 1401, 669, -1469, 1257, -1057, -344, 2166, -1330, -478, 1945, -1271, 194, 726, -1804, 1588, 1098, -2265, 1501, 595, -1488, 1415, -766, -1051, 2529, -1528, -1474, 2029, -835, -153, 1029, -2072, 1419, 1077, -2690, 1097, 812, -1637]
3979a637L129k360K36L305m464K56L596k760J151N45k911L507l38m039L377K48
3995H41k451L214k610r7L911m132j61L597l025J286N54l405M074L6m305L539k02
4012F64j789K535k745j22M570l913m71L198k375P57N18l506L839J150m769L114
4028F55%j587K495k740o62M777l475r51L136k323J456J52l734L674J235m545K676
4045B39J03j158K833l313p27M819l572r11K739k088K092L07m164L836R19l943
4061a989J776K63r55L134l491o86M745l267j023J818j627K435j68l450L177J118
4077A810l118J190m91j89K780k973o95M256k916k88R85j941K666J43l713L072
4093E78J232k870J264p39k14K990l108j006M042k002p69R01j718K899Ml936K549
$$ y = [-1637, 1492, -868, -632, 2673, -1791, -1535, 2061, -699, 452, 997, -1914, 1593, 1255, -2784, 593, 841, -1610, 1604, -1006, -1103, 2808, -1324, -1485, 2112, -913, 373, 927, -2478, 1596, 1632, -2673, 866, 664, -1125, 1410, -1335, -1457, 3113, -800, -1271, 1927, -448, 309, 827, -2679, 1160, 2310, -2459, 655, 655, -932, 1563, -1177, -1839, 2938, -537, -1488, 1648, -675, 781, 933, -2801, 873, 2108, -2437, 239, 342, -816, 2017, -1296, -2023, 2796, -776, -1687, 1052, -1036, 1056, 1363, -2801, 1035, 1954, -1989, -213, 50, -905, 2229, -1262, -1948, 2797, -470, -1493, 325, -1302, 1133, 965, -2485, 692, 1810, -1308, -118, -609, -798, 1982, -991, -1686, 2570, -346, -634, 351, -1590, 1076, 1219, -2494, 578, 1810, -1060, 204, -535, -749, 2241, -867, -1873, 2169, 167, -602, 299, -1419, 1480, 1484, -2452, 97]
4110I7J327k593J722j276J12K919k795j274L444j715k61K93j690K905K81l474
4126a978J681J405j563P03j194K06K993k556j167K657j193M68n67j628L234k01
4142A300k923J877J76n95J333k341K70L185k926p55K288r60N84p38j784L283m09
4159H65k402J753J6M7Q41k569N75K726k254o88J565n24J135o40k389K829K82k161
4177i93J140n04K84J386k517N61K401k077k52N18q66K003j036j888K634K35j957
4194i28J212p49K02J579k719Q63K296k292K56M70j054J568n41j910K712rj590
4211f34J329j087N63J411k958L70K360j508L32K45j503K245r16j835K233q7j143
4228e83J357j323M61J835k892M79J856j659M67J71j303K553p68k027K231m17j130
$$ y = [97, 1424, -1169, 553, -723, -611, 2308, -487, -1761, 1683, -32, -293, 0, -1690, 1215, 1496, -1978, -297, 1108, -455, 248, -946, -740, 2253, -303, -1470, 1187, -6, 462, -105, -1733, 1501, 1300, -1623, 254, 430, -165, 1168, -1173, -903, 2282, -644, -1399, 889, -71, 513, -225, -2009, 1274, 865, -1537, 216, 232, 279, 1120, -1449, -874, 1852, -402, -1090, 475, -49, 1086, 446, -1943, 886, 1168, -993, 147, -357, -73, 1313, -1204, -643, 1758, -319, -571, -53, -919, 1084, 48, -1840, 794, 1029, -928, 284, -465, -263, 1316, -1403, -540, 1756, -536, -280, 190, -864, 704, 163, -1747, 965, 956, -634, 695, -392, 171, 1582, -1376, -1006, 1354, -154, 178, 423, -1080, 1165, 249, -1586, 647, 560, -583, 774, -549, -88, 1747, -1145, -666, 1190, -469, -2, 169, -1134, 1419, 651, -1376, 855, 438, -692]
4245f92J360j544P00J851k374L47J557j858J004m93j289K237l79j575J854m79
4261B27p31J038j409K86J965k413P52J038p77L76K9j712K333o84j466J799p54
4278a03k59J514j718P2J711j949K94R74j148J217j36j491K043n33j331J251l45
4295F3m86J394j550J42J683j837K75M33p96J165J02j667J602O3j647J672r12l29
4313f30J541j400k26J574j332M9J393j694J008O7j358J240K64j422J558m54j294
4330a116J919j567J83J302j080J60Q89j171O95K20j440J313J98r15Q84m20p14
4347f60J260o42p16J103n80J66L00m46N49l47m86L64L36p09J018m48m75Q80m14
4366E3o38J082p73QM30p90L82M59o86O59M36p42k1r3j06P05m57o6R66o86j4R9
$$ y = [-692, 668, -876, -176, 1675, -699, -352, 1205, -653, 351, -142, -1431, 806, 427, -1148, 706, 227, -504, 534, -875, -589, 1376, -1037, -285, 753, -24, 352, 381, -1331, 1002, 318, -1148, 651, -103, -362, 1152, -566, -494, 1217, -732, -438, 536, -612, 605, 469, -1022, 1021, 488, -843, 408, 63, -423, 971, -579, -437, 1246, -591, -316, 117, -679, 486, 588, -1079, 523, 586, -1061, 611, -301, -630, 911, -489, -715, 859, -473, -424, 969, -725, 283, 350, -1008, 232, 496, -926, 632, 178, -1116, 803, -764, -581, 721, -359, -199, 690, -481, 214, 434, -1006, 307, 505, -410, 474, 54, -660, 600, -42, -758, 345, -235, -69, 231, -215, 334, -13, -499, -135, 201, -508, 510, 62, -413, 467, 53, -585, 497, -276, -268, 162, -628, -246, 213, -473, 186, 622, -120, -141, -234, -340, 365, -92, -158, 808, 122, 108, 207]
4388B07n20N22j79k46K52N26n81L61o7n84N35m37k55R17k11o99Q25j49j60J40
4408A97m37J93N9j92L66p7j0J0p2m47J46J79l12K64K4j26N99J0n90K19k80N06
4430B29j83l33N79j55l1j3j6n9o6j02J43J44k83Rj2J52K6k72l05O16N7j16L46
4453C55l61R9m3J0j97j01k9K23k20M46o0n30O15j31j16Q4M77p43K73J54l65J92
4475C2r0l4L4j09O3K61l83J62O03p93J96K62l75M6M47o27L88j22m62N68J38m40
4497b35M05q4J48K04p11O53j58m19J46J14l87O65l10r4M07l08k75N81o29l47R33
4518B99n09M40L76p61P2K18o65N31K9m84Q41l66m10J072o86l79Q72j041J44N70
4538A63m43L96L01r64L60L28o40Q94k26p58J159o37j44Q78j131M07L59n61L80
$$ y = [207, -313, 209, 30, -216, 36, 562, -19, 342, 275, -309, 226, -211, -466, 451, 240, -459, 366, 217, 57, 197, -240, -47, 12, -180, 186, 109, 99, 109, 37, -410, -264, -85, -397, -133, -109, -235, 364, 374, -216, 3, -277, 229, 46, -287, 292, 137, 106, 93, 77, 18, -48, -150, -7, 137, -146, -137, -149, 3, 29, -243, -548, 68, 125, 9, 355, -6, 93, 50, 60, -137, -238, -267, -44, -264, 182, 122, -408, 207, 76, -40, 44, 521, -222, 51, 205, -160, 32, -58, -92, -58, -167, -104, 157, -226, -64, 539, -254, -58, 204, -171, -125, 322, -305, 83, -39, -501, 67, 205, -235, 170, 86, 234, 438, -273, 380, 222, -197, -51, 63, -324, 341, 31, -63, 344, 36, -239, 342, -287, -634, 299, -210, 230, 606, -155, -83, 135, -530, 1, 30, -454, 387, 21, -389, 683, -3, -382, 490, -551, -407, 163, -280, 116, 417, -547, -187, 141, -499, 395, 169, -589, 570, -67, -211, 667, -464, -57, 302, -259, 121]
4557A21L27r02R96m04j021J269l29p56J021k83j09J265j772K39J335j346K18M51
4575C20q75J034J78j812J604k62r94J594q17p71J805j575J69J640j724K66Q64
4592F44j451J228M39k272J668M96j611J479p27p31J904j515n25J960j382M83R73
4609A060k157J388M01j555R69N90j602J782j069p23K160j292q94J941j206lJ286
4626A076k102J567M99k371J637K8j277J708q43r01K802j737j322K242j534K53
4642b75J191k335J756R75k664J650J69j554J965q56j644L118j705j069K354j380
4658c04Q1J139k460J747Q07k389J136J185j930J813n70j627K702j270r95J834
4674H99j116R7J573k848J553J389k434J280J31j373K242j276j664K854j131j771
$$ y = [121, 448, -454, 542, 138, -883, 386, 57, -699, 322, 39, -70, 1195, -577, -338, 997, -349, -131, 320, -555, 479, 657, -1155, 449, 187, -807, 787, -30, -801, 1004, -571, -402, 1238, -486, -220, 644, -807, 421, 860, -1412, 256, 752, -859, 620, -107, -838, 1066, -449, -974, 986, -396, 87, 1060, -1097, 291, 692, -863, 106, 696, -906, 876, -193, -916, 1244, -48, -942, 999, -207, -210, 1076, -1026, 541, 1040, -1331, 306, 334, -943, 765, -78, -979, 1823, 86, -1236, 1006, -528, -275, 916, -1419, 337, 1312, -1352, 298, 467, -1087, 878, 22, -1622, 1496, -209, -1278, 1076, -304, -223, 916, -1544, 203, 1010, -1379, -243, 942, -988, 825, 255, -1372, 1330, 60, -935, 899, -217, -120, 1453, -1395, 158, 1547, -887, 393, 524, -849, 1393, 117, -1547, 1307, 176, -1595]
4690a595K372j223L63J236k413J012K013k596P20N53j581K173j080j735L339q62
4706F96j931K140j445M94J525k989J312K107k782J041j52j131K391j103j835K688
4722A026n51j133J540j421O09J261k887J018J690j954R35J04j345K374q66k174
4738a774K514o72r89J660j551J096J432k771M44J720j807O75m0p06K097q58j968
4755a498J893N9r17J036j743J152J636k890P30J534j653R43l27j297K714j210
4771A62j581K276r79l64J172k007R34J792k180J93J531j242R38o23q63J900p73
4788B86j547J717m66NO80j950J226J387j948k62J502j086J134p54r71K197n80
4805E70j609J400n15N06O35k031R17J526k035M92L09m96J107q50r37J884k52j831
$$ y = [-1595, 777, -446, -83, 1153, -1260, -248, 1765, -831, -111, 442, -1139, 1034, -46, -1781, 1558, 696, -1235, 905, -540, -46, 1479, -1510, -198, 1909, -873, 168, 16, -1115, 1276, 173, -1662, 1026, 475, -658, 882, -539, 70, 1331, -1556, -538, 1152, -802, 133, 237, -1108, 1266, 400, -1774, 740, 68, -921, 739, -812, 284, 1716, -1055, -611, 1109, -698, -23, -63, -769, 1328, 470, -1498, 395, 454, -463, 573, -1170, -18, 1618, -1272, -542, 992, -661, 282, -45, -1342, 1372, 162, -1419, 857, -122, -486, 686, -1321, -387, 1405, -775, -582, 949, -293, 645, 22, -841, 1059, 286, -1261, 456, -10, -5, 675, -1275, -49, 1338, -610, -872, 630, -456, 678, -76, -1047, 1150, 570, -1039, 361, -154, 352, 987, -1044, -127, 1399, -636, -144, 165, -331, 776, -74, -1011, 873, 621, -1210]
4823a210J498r17J026K82j662R44J237j532K22N1n60J569q63j054J641k93q87
4840e08O08o84R32l72j083R33J149j154J69J43n95J558j239p67J502j76j228J232
4858D20j008Q45M03j711P17R37j135M95j86l23J594r82q70J243j61n38O76j345
4876i29J173O93j729Q60M95j004O80o63l15J721r09q84J550r07O3N29r13N25N50
4895E86j491R11O95r21P21p49o00J850j259m53J469p92L17L61j052L99J115k001
4913h94R08J60n79Q96o29m73J334p88m70J039r90M32N81j392Q78Q28j604P21L03
4932B61p10J021j064M2J349o30o77P42o49L61O07j361N34R77j462O44J54l67Q40
4951F12j158k81J405p05j67O98n93Q5Q9q13O80Q35r96O12k10n72J189q79m81R12
$$ y = [-1210, 288, -629, 397, 679, -983, -39, 1198, -334, -112, -61, -621, 948, 85, -969, 672, 379, -508, 100, -584, 348, -24, -1107, -174, 975, -179, -10, 133, -462, 1096, -143, -910, 592, 416, -812, 420, -588, 257, 660, -1051, -334, 603, -532, -37, -223, -546, 1048, 66, -804, 439, 278, -260, 416, -929, 244, 937, -792, 68, 563, -441, 239, -424, -739, 982, 73, -811, 739, -168, -105, 424, -489, 36, 586, -905, 6, 701, -220, 501, -248, -848, 1002, -257, -710, 759, -33, 284, 645, -407, -8, 1107, -894, 14, 174, -405, 491, -138, -611, 723, -65, -535, 504, -486, -54, 527, -865, 13, 841, -763, -42, 261, -449, 572, -492, -450, 899, 269, -408, 334, -315, 46, 653, -708, -174, 803, -659, -15, 139, -228, 612, -546, -827, 578, -127, -294, 404, -189, -104, -15, -828, -148, 687, -309, 303, 93, -479, 710, -169, -650, 262]
4971B62l51l21P01k11k07J043j190J28M72p17K08M58p80J115l53p72R33k74m57
4990c13M52m63N66K05p49P46K3q22L43M6q82J123j15n73P22j19n81N96n90M4J074
5011G33q71K71q8k88M97po88Q73j94n01R47l01n98M35m16K71K10n95J4O31k56
5032G9L5M8m32K47L45r94R08k74m15P27o22p7O68l04l74R41q86L02J10m26P96
5053D02l63N6J80j41m23L91l33j89R51n68k62K99J83p3K5n31O68m0j83L58m91
5074h4N7j51Q1j73L60l28K47N5l21K18R4l94K70Pj03O68n14k54M05j94L4J29k45
5097a36p2M10l15j77N75n56O52k58k02J34K35n08O02k80l26M18k51L6O9k90L89
5118A49k58R6K00k43K89J6J17n60N31m79LM65m60L63j78j46j63J8k80N61J04J92
$$ y = [262, -89, -410, 291, 80, -127, 916, -274, -146, 326, -391, -183, 275, -505, 610, 257, -515, 418, 144, -313, 139, -324, 242, 447, -302, 444, 467, -355, -12, 34, -848, 275, 160, -413, 309, 190, -391, 205, -385, -341, 733, -138, 133, 45, -243, 254, 247, -441, 432, 238, -263, 684, 383, -215, 220, -196, 75, 285, -310, -296, 335, 79, 114, 162, -270, -23, 322, -672, 236, -38, -453, 274, -348, -425, 243, -61, -435, 506, -380, -78, 32, -394, 402, 39, 95, 275, 134, -289, 102, -231, -420, 531, -37, -299, 0, 183, 110, 135, -396, 272, 232, 49, 407, -84, -27, -178, -97, -270, 90, -238, 9, 64, -257, -39, 55, -339, -69, -62, -165, 503, -11, -265, 140, -54, -20, 109, -136, -208, 202, -113, -290, 285, -271, 381, 123, -79, 55, 290, -218, 384, 104, -222, 196, -55, -19, 50, -240, 149, -109, -13, 187, -56, 233, 249, 366, -194, 337, -142, -139, 326, -134, 229, 51, -95, -258, -240, -520, 41, 145, 337]
5140C37k55n7J6o3l62J96J09j26K63K2m79M87j54k03J65m50N88q9J74Q1J5l42
5162a27o0J74o9K56j34Q5K81m62J46P5k6j01l9O3j62M87l80J57Jk46L1L78m20
5185i2L65n00K49K44k75j7M23k87k17J92l1N7K88m59N9L09o81N26j13m56P01m2
5207B43m07L18m07J12J27n16M14N34o92L63J37k96K17J7j65L26j32n70P80n25
5227a22j58N41o00L62Q5n03P26j08m83N14j08r48J184j75r38J319o36n8O46r79
5247d39N85N44j102M55L45n13O16o66l81J169n50p40R79j28n41J075j127M09O06
5266E96j162O21O48j292P71q9p36J246l21q60J030m37k57N39p74N14P34j004K92
5285E9J69p23R66m78j003J692o60m75P14p62K0J125j186j09J350j259M43P71j216
$$ y = [337, 82, 25, 41, -22, -384, -188, -79, -205, 58, 80, -399, 88, -66, -269, -104, -554, 34, -55, 119, 200, 215, -127, -187, -13, -82, 174, 40, 125, 406, -56, 90, 165, 139, 38, -1, 62, -100, 387, 7, 164, 165, -81, -50, 328, -92, 273, -227, 22, 266, -9, -26, 397, 110, -107, 85, 54, 111, 399, -60, -1, 308, -373, 153, 40, -416, 285, 243, -164, 154, -253, -141, -14, -530, -116, 418, -274, 89, 226, -70, 147, 164, -1, 325, 193, -377, 403, -122, -280, 261, -339, 23, 108, -395, 331, 223, -260, 254, 146, -802, 382, 207, -731, 588, -48, -106, 540, -439, 146, 690, -412, 43, 388, -125, 491, -175, -556, 613, 63, -677, 302, 174, -367, 708, -419, -10, 596, -566, 55, 703, -589, 182, 93, -643, 603, 282, -578, 452, 15, -242, 297, -477, 37, 771, -233, 59, 228, -495, 471, -7, -1010, 682, 22, -453, 261, -501, -481, 644, -542, -651, 699, -560, -117, 654, -562]
5304e62J091m01j110J628m65r39J411r20J72Q10j422M26R27q79J69L36o82O34
5322B24r3j156J415p7j079J238p08k25J467j465O0J350j120j37O99j501J562k05
5340B49j372J745p1j097J082o87j31J304j695J91J455j146L45L93j568J430r5
5357C32j537J531k1r42J001o50K4J594k014r9J521r33J31N53j296J336J12j713
5375a070J174L53j066J143r52Q5J656j722j60J576j254M1L63j089J441M63j886
5392i04J199m2q03J131q67m67J841j181n29J267o69K96N8j644J674J83j656J222
5410A09L98q11R49r76j40J814j539p04J793j060N24j55j012J147M95j510O70J69
5428A61l05J007j224j16J702j511k30Q60r48Q59j04j121J219L33j355O72L09p19
$$ y = [-562, 529, 128, -982, 646, 181, -758, 653, -267, -95, 715, -707, -281, 646, -233, -64, 272, -410, 224, 131, -1025, 390, 313, -766, 472, -236, -461, 1006, -459, -399, 951, -169, -306, 393, -1108, 454, 249, -1123, 622, 551, -546, 536, -151, -282, 1022, -673, -482, 973, -173, 172, 565, -1003, 427, 332, -1205, 326, 305, -637, 364, -286, -262, 1332, -682, -781, 740, -193, -62, 491, -805, 531, 643, -1070, 104, 457, -609, 534, -418, -333, 1323, -399, -559, 1017, -237, -196, 167, -922, 519, 982, -904, 295, 253, -550, 581, -286, -753, 1088, -93, -622, 645, -24, 272, 330, -1314, 360, 543, -1113, 109, 507, -304, 645, -331, -471, 1343, -196, -900, 893, -167, 357, 202, -810, 337, 832, -678, -8, 161, -144, 863, -361, -477, 1225, -286, -516, 344, -604, 255, 151, -970, 249, 582, -773, -101, 208, -511]
5446e11J287j205M0J626j568l27Q84o74M81R8j546J557M79r09P38n44j38N85o90
5465c37k65J293o97m78P50r32R95K21j658J397P3j001P86m59J86J102j372m48
5483h44K000j043m14O18q84Q67K17j278J101nn67M1j32k58J581j191k31J093q02
5502a31k97N52l26M47L31j250O98P42r47O04o09m7J033j155l54J214o75R2l8l32
5522d48P10M37j612J106K56n98P46j057j71J239j037k24R59n41P77m55m79J034
5540F42l88j086P78K15m76N08o73k13J586j201N5O98m58L60J48j301J086J11p26
5559c35J50K33n14R12n70k90J389j155l11O80m34M08k60p18J054J43q90O96n97
5578d09Q7O17j087L36R57m29m92P47o06M51p0p51Q88O8j018Q26o2j70M83o55Q7
$$ y = [-511, 776, -429, -389, 1237, -331, -658, 226, -448, 33, 131, -1415, 142, 621, -288, 450, -94, -232, 353, -337, -602, 691, -6, -484, 266, -666, 329, 550, -1108, 289, 362, -639, 147, -312, -126, 976, -396, -844, 1156, 113, -301, 317, -567, 300, 517, -761, 340, 335, -232, -191, -323, -581, 1000, -191, -422, 671, -131, -428, 124, -202, 245, 576, -674, 24, 766, -181, 423, -186, -233, 800, -355, -709, 505, -170, -78, -116, -448, 262, 699, -913, 193, 449, -149, 597, -460, -631, 608, -429, -653, 306, -235, 542, 87, -392, 642, 254, -832, -54, 161, -315, 193, -480, -693, 893, -308, -253, 445, -13, 347, 495, -806, 280, 391, -335, -185, 48, -466, 446, -124, -414, 975, -180, -491, 189, -245, 163, -97, -815, 239, 382, -508, 188, -409, -322, 295, -792, -456, 501, 72, -420, 327, -279, 172, 102, -649, 239, 307, -711, 115, 53, -117, 366, -289, -202]
5599b02N82m78l51N16o11P37K58j199Q33J31o40M23q8n7O01l02p50J134n52l5
5619e0K59o92O40J2p11P43p3n36Q59m05j2O36o31l90O24n38K81q0m48R64m05j16
5641f9L38j88l07J88K83q10Q71o48K16O41p01k9L35n81L18K11m83L66L18p17O09
5662A61o1n58R51o48j1O11m77j43N05n13J79N87n18k83M54p19P05l24J52N30n30
5683E0j47j0k12M76j89j73N80K33r69M98j63k60N87l98KK05J10m79Q13o39k72
5704c57O80n72K85J4k85J66J12k7r4J15n82L27L16k36J91l18M15J27n36N19N0
5725C10k48O1l18Q0M18m51K41J01j30k84M41p8j62K49m64K46K21k42j67K39p2
5746iK24j15l51L82k48K79j37N1l95M14j63k06O79l73r5L33n46N25n34j70O70
$$ y = [-202, 380, -98, -449, 67, -544, 193, 451, -748, 85, 216, -424, -1, -89, -146, 455, 153, -597, 537, -15, -50, 209, -483, 157, 169, -542, 201, 128, -408, 451, 46, 34, 670, 39, -351, 273, -265, 16, -64, -512, 452, 47, -69, 269, 81, -226, -38, 245, -565, 306, -342, -126, 515, -186, -215, 120, -461, -143, 68, -415, -49, 269, -448, 161, 100, -458, 493, -155, -166, 445, -32, -175, 330, -183, -4, 583, 65, -218, 236, -483, 222, -102, 50, 580, 50, -97, -107, -319, 157, -32, -205, 375, 608, -361, 137, -26, -286, 301, -97, -95, 110, 220, -259, 554, -85, -357, 323, -249, 36, 50, -235, -69, 43, 16, -78, 37, -545, -218, 98, -138, 53, -265, 150, 277, -259, 260, 310, 62, 123, -195, -115, 303, -148, 93, 194, 64, -220, 221, 143, -19, 230, -234, 12, 233, -9, -176, 63, -9, 215, 100, -251, 131, -117, 162, 25, 76, -319, 95, -68, -274, 405, 32, -63, 270, -276, 249, -285, -455, 215]
5767B15j62k21M42k92k12L43j59Lo5j69K17J20j96J23MRJ67k66P4NNj7K62k72
5791d2K7L47m34j83J08K37J07N7k58L34l93j40N31m6l31J01j89K55O8J87j81Q7
5813B49l55ON5M40k36j10j19Q9m47N31k11j26J89L88n15J48R3j79j2j13Q0L3K22
5836A00J84n46K02K33n63L00j2J49k23M42l44k01M51l13J21j47kJ75K34j94P4
5857A20L9m03L87j70o3k38J20K21M38j67l91J13K29l44K1j44K44J87k14M2K3m74
5879d24K29k2J66j3j78J41J45l35r3L76k38M49j98r1N07l74m41M45K58n66N25
5900B68l75l18O58j11Q7j45l00L69J51j51J73l92j74M82j35k04K05k55R0P00j006
5921c83L63K97l09J60q2m80N01R0o82M16J29j41L39k70q3K72m79q4N60l65K38
$$ y = [215, 53, -168, 274, -18, -230, 113, -46, -43, -108, -277, -60, 60, -136, -13, -9, 0, 167, -99, -25, -20, -15, -32, 230, -42, -15, 332, -102, -285, -177, 60, 167, 224, -34, 300, -93, -233, 298, 252, -79, 22, -167, 88, 156, 343, 162, 249, -106, -100, -45, 395, 159, 49, -70, 19, -428, 103, -108, -234, -45, 343, -172, -24, 69, -110, -122, -235, -155, -122, 100, 284, -262, -60, 173, -390, -90, -102, 47, -176, 266, -78, -279, 172, -141, -20, -167, -169, 6, 240, 46, 120, 159, -244, 143, -27, -90, -328, -208, 13, 451, 284, -107, 6, 235, -109, -88, -232, 12, 199, -15, 27, 50, -424, -195, -217, -51, -64, -242, -101, 44, -291, -384, -8, -246, 203, 5, -86, 421, 47, -394, 51, 309, -257, 268, -107, -425, 233, 122, 209, 64, -236, 133, 284, 133, 306, -86, -260, 222, 87, -117, 88, -167, -77, 623, -383, -20, 277, -32, 128, 46, -434, 67, 157, -525, -109, 20, -121, 218, -52, -135, 137, -342, -426, 134, -231, 7]
5942GM45j032R53j97l63L82k22k26O88m10o53J099m77l0K00p40Q26N8p74P07K11
5963D52q95N83j99j5L59l51m42J075o46J65j63m20O83J16o10L92N44j138P39k45
5983a6m35P32m84m79J318q08k4O34r13R76L2j181N02N91r66Q52m44n46J093o42
6003b08n2P32m55l61O21r03P72J85n15j92J004j142J030l85m79J012o89o51R10
6022B34l16j14P74j375O97P15j240N02O28p20O73l19o36Q83n34o04J009j25L9
6041A71L39r73K41P06j182M24N95p36R37o16l27R76m49p75R92m18K81M34q18N57
6061C59K32j242N29N21j010J051l62o69J395n09j092J095k90j45N30o58L27N84
6079F46q28k7L80m14Q46o79o22J313k36q02Q57m92n4O20j183N22P55j454R08o8
$$ y = [7, 452, -580, 373, 176, -187, 195, -27, -253, 435, 25, -628, 471, -6, -36, 164, -576, 250, 308, -466, 241, 452, -443, 140, -59, -74, 285, -66, -508, 567, -79, 86, -77, -497, 186, 302, -308, 84, 628, -510, 229, -16, -451, 281, -203, -682, 636, -172, -196, 438, -475, 501, 533, -648, -146, 445, -521, 331, -113, -659, 434, -208, -260, 472, 17, -344, 277, -626, 146, 331, -184, -376, 628, -514, 516, 131, -348, 664, -25, -676, 234, -82, -196, 578, -797, -100, 615, -625, -123, 505, -215, 458, 139, -497, 386, -148, -752, 257, 132, 171, 510, -463, -222, 484, -698, -274, 321, -415, 522, -94, -421, 555, 106, -669, 323, -95, 186, 620, -198, 359, 591, -651, -122, 399, -611, 440, 78, -591, 804, 295, -797, 298, 8, -137, 393, -265, 62, 646, -182, -209, 171, -243, 603, -76, -698, 615, 379, -423, 434, -58, -112, 508, -675, -153, 602, -852, 56, -12]
6099a2n07J103p11m68J208l66o28L92j41j31R13r93L95K69r05O50R2o67R23l60
6119E6j137J430k26n22P62r01O21O06j508M25R99r20K63k06l23J251o55m01J076
6138F90o90k05L08m33J85Q67j292N02R46j092K83k28m87J110k80o75O21j8k31
6157a19M04n59L54Q25j597P28M78j054J173q10l00J279l26j090J238m66l4K54
6175C78j066N76R28j278M52M85p78R94q14rP81m13j019Q77k56J98M19r02L19J246
6195A118j531J74O25q46Q56l95n62P77j0o82N31oJ34L34j037M06P32r35L56K07
6215B46o21P24j85o39J094o46m85O30k03r8P15j421Q24M91p66N59om56O82o9q70
6236e00O39Mr23R80l78k1O57r67K72P58p59K40L00m97O77n53l40Q42n43k17O50
$$ y = [-12, -519, 584, -127, -595, 613, 247, -381, 11, -130, -261, 652, -341, 54, 323, -582, 68, 160, -507, 416, 56, -1081, 349, 123, -399, 363, -538, 83, 689, -819, -394, 605, -315, -52, -258, -581, 670, 15, -386, 690, 0, -205, 103, -330, -145, 722, -570, -68, 878, -214, 69, -159, -646, 464, 184, -491, 130, 112, -119, 285, -274, 80, 905, -692, 36, 514, -540, 633, -177, -477, 802, 476, -614, 624, 158, 124, 378, -688, -112, 816, -462, -10, 475, -303, 691, -123, -132, 649, 236, -783, 94, -162, 36, 455, -447, -128, 1118, -413, -239, 386, -460, 396, 1, -561, 216, 206, -476, 55, 49, 183, 517, -520, -114, 618, -317, 39, 246, -375, 349, 164, -475, 619, -27, -512, 118, -85, -183, 532, -889, -65, 426, -340, 219, 213, -243, 439, 370, -500, 139, 143, -780, 200, -178, -199, 458, -509, -237, 521, -238, 2, 302, -195, 482, -71, -411, 431, -112, -329, 321]
6257C21m47o3Q82j133J14P51j22j01j90j09L62l13n09R06K1l66L91p30L41K64
6277B70q34R2J141r99O07l28m22Q41k92p32R06k60l11O71m00k3M19m67j85L70
6297F4n07M30K25k51L48k57m48N71J7n02N52n52K16K38o15R4J024p37r1J44l90
6318d27R92n18o16Q09n43J06L16k74jL90k25k2P4j31M17k85m48L47M57n83N50
6339C85m80R4M59l88m37N25k81j3R8K39m16p9K92j05L19m24L49j01J51J91o67
6360b89J61K52k40J63J18n71L98K06o55P74k48l79M54k39l2R0m9J78m10K68J54
6381A04Q5J42l73N8j65J12K13k22M11l02j37K58l32M56l88J12j81L43k59M76l69
6402D2k79M28k36K3K68m32K49r0N6m33O72l12j78M70l90L53O4m49K32Nk89K41
$$ y = [321, -126, -189, 693, -440, -326, 425, 303, 202, 12, -97, 265, -48, -557, 349, 370, 4, 395, -335, 6, 270, -564, -472, 669, -330, 277, -51, -473, 368, 76, -656, 250, -10, -321, 350, -50, -73, 346, -121, -306, 64, -443, -13, 212, -39, 309, 52, -396, 175, 192, -310, 242, -310, -94, 144, -471, -377, 647, -90, -181, -37, -427, 565, 47, -569, 240, -303, -197, 119, -155, -156, 234, 9, -13, 61, -70, 347, 62, -386, -39, 418, -165, 385, -95, -1, 458, 70, -367, 158, -123, -136, -38, 201, -215, -294, -2, -107, 212, -212, 137, 36, 187, 378, -289, -128, 124, -116, 47, 165, -406, -8, 198, -457, 317, 69, -310, 144, -95, -127, -37, -86, 92, -318, -50, 104, 189, 331, -42, 16, -149, -37, 176, -46, 365, 63, -74, 184, -148, 308, -80, 32, -149, 194, -65, 411, 42, -237, 191, -45, -22, 246, -186, 63, -27, 29, -404, 268, -44, -222, 248, -142, 211, 275, -174, 58, 63, -226, 15]
6424A5L9nl5k27J77J77m81J57J69mJ10K7l82O1N90l46q0j17K5M14j16j84L8Rl5
6449dM09p23L14j41K43p6l6j5j35J6K25Q7m42L65q2K0j89L9L65l16K50j87Q1k09
6473a41K73L72l86p2r3j59J8R6k6O1K00lj04j80O6m8P5n52P79j26m3r8J39o4r1
6498a07k32m5M58l06J12J5L2J26j13l69K15QL42nm22M52l80Q0J00l24K93l74N20
6521G6M3j17K33M3j85n2n5J82n12K98M7n7k6J44j89J62l17K56L8k98J82K67j6
6544A47j43m8L5p2J64j36j7L31j41J12j62l80L12k59O1M37l08n4O4k16K30L41
6566B98o73K18L53l01J86K39l67J86J81k27J24O2n95P55n44p0L87r1j51J93l92
6587b29K17R3n13O01K58l20r6J28MJ30n62K76J42k74M17m71J92M7j90j8m8M29
$$ y = [15, 54, 49, 14, -213, -36, 141, -340, -183, -14, -18, 92, 119, -263, -202, 388, 42, -38, -155, -130, 284, 168, -16, 22, 31, -4, 405, -318, -4, -145, 98, 22, -14, -29, -164, -148, 77, 164, -278, 87, 5, 25, -164, -125, 240, -76, 174, -13, 68, -141, 132, 504, 118, 46, -47, -206, -188, -92, -118, -57, 143, 140, 36, -144, -78, -126, -51, -603, 176, 50, 7, -91, 48, -16, -107, -339, -384, 74, -232, -120, -105, -73, 53, -60, -429, -214, -206, 136, 131, -291, 161, -219, -139, -39, -363, -70, -444, 76, 119, 2, 235, 278, 93, 41, -14, 168, -344, -46, 1, -56, -82, 62, -127, 35, -282, -26, 12, -286, -104, 163, 147, 4, -44, -9, -81, 83, -53, -70, 261, 120, 232, 70, -310, 2, -257, -196, 241, -67, -121, -57, -273, -43, 298, -375, -157, 196, -105, 81, 320, -47, 139, 320, 93, 217, 279, -316, 439, -105, -175, 212, 121, -30, 163, -229, -12, 81, -432, 169, 427, 107, 11, 139, 143, 273, -289, -13, 129, -145, 272, -199, -7, 40, -150, -168, -216, 213]
6609B13o29M34j87L02o9k59j98N93k99K56l92R9L72j5n1o1j53j90K83l14K87K37
6631B59l20K64p1n07J66L06l26R5K1k33J76j10K6M32n04J35N53o17KO83m82J96
6653A44J63j042J039n02j86M05j03j93N86o24J77O22o24jK44r3k86N64n54M18
6673A54j83j29L65k03l93O72n56N53J69o20l8K89o28J149k83m57O46m54n95M85
6693e7N2k49N51m45j96O83k90k20L83m92K97o6m45O54J05n79O92o38nO98n04l09
6715c80R20o80k87N73m05N07o9o90N36j3m28R15p41j08J178j355L72P67q17j98
6735d03O65k96L44j03p31N42Q0j35jr1J34O19o97m04J045o99j01N89q59Q07J25
6756D30j273Q97K69m43J61j97q5P16o39L6N70n45L1L85m20K85K15r31N73M32r42
$$ y = [213, -416, 18, -169, 133, 64, -195, -393, 200, -99, 157, -235, -136, 236, 221, 170, 109, -44, -234, 49, -265, 22, 259, -61, 203, 132, -375, -209, 97, -229, -134, -113, -346, -170, -280, -254, 178, -326, -191, 362, -255, -253, 430, -52, 144, 307, -735, 304, -198, -384, 21, -82, -275, 311, -313, -136, 486, -138, -139, 105, 12, -274, 290, -264, 154, -29, -158, 207, 4, -389, 283, -273, 280, 449, -171, -209, 80, -548, 601, 318, -139, 507, 53, -542, -57, -5, -254, 297, -148, -344, 339, 49, -171, 212, -280, 17, -49, -494, 160, 265, -314, 378, -260, -265, 433, -71, -380, 540, -140, -427, 146, -259, 248, 179, -511, 25, 12, -416, 499, -242, -350, 828, -527, -155, 612, -205, -403, 262, -34, 310, 207, -524, 18, 98, -37, -38, -129, 5, 624, -73, -477, 568, -131, -232, 357, -502, 305, 430, -843, 54, 323, -120, 41, -156, -241, 475, -164, -128, 442, -103, -72, 313, -107, 178, 393, -538, 35, 467, -475]
6777d75Q22n74J01P62j030K28M90k86R3K35p20L32M17q01L91K25n53R92r20j84
6797d55J098n12m58N24k17KL61o77Q12j41r13Q82k81j43M36l41m69J252r71J50
6817f1N80o28PM81j064P19J12m27L67M9m37N59j67q03J482r63l31P55m65M10K37
6838D12j035R46J74r13O22l02o03J200q07nQ60n18k20L29m19J15P41p69L44p7
6858G5o35R67l06m40R65r17nO48o08O4M12m62M89P1q79Q16K50p12Q8J19l71N42
6880A71k58m17J087o39l52L77j95PM16q67O44M13p74N02j00n97Q44j70o13Q96
6900C75k39l10K59l57L67J91n65K01M73n22L15k81J29J56M6m24O55o91K32K10
6920B20n11N17N70j074K09K01j58K70n04K30K45j18k11L83l82j77L03k55J17N67
$$ y = [-475, 347, -227, -126, 636, -394, -166, 324, 38, 131, 366, -354, -22, 395, -406, -15, 210, -343, 649, -271, -455, 643, 131, -327, 197, -20, -18, 343, -334, 478, 337, -576, 306, 25, -118, 318, -23, -492, 760, -211, -61, 519, -109, -102, 379, -685, 34, 146, -281, 86, 135, -302, 257, 90, -713, 769, -194, -525, 230, -235, 175, 412, -623, 323, 497, -416, 206, -96, -699, 501, -306, -311, 549, 31, -189, 140, -279, -164, 577, -192, 152, 75, -560, 407, 101, -339, 626, -291, -296, 352, -256, -192, 220, -242, 247, 318, -561, 255, 505, -207, -119, 0, -371, 171, -87, -504, 583, -56, -408, -31, -226, -219, 197, -670, -26, 387, -387, 115, 15, -582, 262, 92, -521, 375, 136, -174, 85, -272, 95, 286, -279, -78, 395, -127, 188, -93, 36, 192, 238, -186, 469, -222, 10, 220, -291, 226, 796, -278, -69, 132, -26, 244, -260, -30, 215, 97, -114, 269, -113, -290, 13, -242, -125, 442]
6940D42p52N12J52m83K30n2p6L86m18n5L77k47k98N37n06K02M04p91N51J87l42
6961d0K41k03m19P30n96K03N34o31J19M43m54J21O0k37K8N16k53L04k25j75M56
6982E22k26m89L89j08l35N77m45K5L18m79J52L88o45M99l03K5L96l9k14J25k15
7003h2k96M55j35M09J30r21M27k57K09J91P1n13M67k65J0P13n80j23K29J66n08
7024b03L26n56O14j1l00M91j88n45M40m4k58M13j01K3L7m17K44M19o66kJ25J24
7046c5L36j54l25J23J00K3L75n44N1J4N8J16R2m27L2K7P5kJ57j64Q1L66m10J32
7070I7l67QL98n17J89K20N3j48J74j97N1J42N3K9l82J94J22n3N5n5j72O7L64k83
7094D2j37J94j15J64l73K00k05m7K09K53l18m2m5M62l96Q5J25k49p9L65J76L06
$$ y = [442, -310, 202, 354, -129, 101, 49, -27, 359, -59, -114, 263, 16, -282, 255, -251, -49, 355, -436, 115, 302, -40, 201, -2, -421, 309, -287, -84, 450, -181, -62, 381, -73, 48, 108, -129, -101, 415, 162, 466, 241, 66, 522, 296, -193, 196, 88, -247, 330, -115, -90, 228, -251, -99, 289, -356, 143, -160, -135, 261, 222, 8, 133, -82, -378, 77, -58, 351, 481, -440, -13, -270, -61, 130, 201, -312, 155, -110, -100, 613, 33, -90, 139, 305, -203, 123, -433, 181, 170, -130, 361, 173, -372, 68, 24, -234, 179, 78, 101, 138, -279, -35, 384, -282, -284, -159, -35, 301, 147, -178, -55, 45, 68, 443, -101, -50, -36, 22, 138, 230, -197, -165, -138, -63, -65, 92, -72, 9, 375, -35, 97, -270, -262, 136, -381, -192, 28, 81, -67, 107, -90, -39, 103, 156, 185, -197, -3, 119, 66, 121, 66, -106, -39, 325, 42, -95, 99, -16, 148, -225, -25, -230, -277, -68, 185, -133, -175, -220, 242, -154, -69, 56, -193, -272, 93, 269, 575]
7116E75p00Q6J11j49Q8p2K20j06o4j25M15q6j0M7l99K31j22J02j5M8J82Q7l28
7139A6j13N3K9J50m25K80p2k4k91L46J09k73n1J14r6K54n3q0N4j8P3L3o1J15J24
7164A93l79K88j25R8k28j39N27j25L2l64J50Jj70L47n6p1K79l8l84L11l65J92
7186b6O0k06P29o04J21j87Q9O2l65M96j46j32L39k61J50k8J47k01M8P4qj70J45
7209A26l03J01J38j95K99j12k04N01m50k42M16k09L46j87l13P1L01l74K64M4j98
7230a80O2K67j98L48m36j03J31K06l57J25J01J17J83k15k11K40k18K07m3l17L45
7251E4R0M6k1k02J72p3l16J48K25k22q4L55l42J91j68J17j80M78o6k08J13m39
7273c32L06m75N90R7n21K02K00n2lJ97m74K05r5K5N64m01l23L81m89K44K05l33
$$ y = [575, -125, -39, 72, -77, 11, -61, 159, 53, -11, -136, 279, 193, 183, 230, -169, 62, -60, 42, 27, 75, 257, 344, 16, -97, -44, -15, 135, -290, -10, -82, -106, -397, -51, 58, -215, -266, -152, -248, 6, -47, -127, -73, -91, -18, 15, -46, 69, 193, -186, 102, -23, 75, -153, -292, 235, 110, 142, -222, -72, -71, -241, 106, 50, -21, 258, 220, -164, 147, -218, -26, 34, -172, 557, -47, 74, -113, -24, 38, -327, 169, 23, -109, 230, -31, 119, 91, 238, 37, 85, 159, 151, -19, 126, -177, -76, 62, -133, 166, 54, -150, 351, -99, -341, 75, -134, 212, 25, -288, -217, 84, -290, -26, 18, -180, -118, 149, -49, 299, -137, -240, -109, 97, -260, -135, -34, 83, 266, 51, -160, 80, -138, 69, 26, -291, 54, 144, 190, 169, -33, 139, 66, -250, -102, 123, -99, -183, 172, -170, 21, -147, -30, -210, 268, 202, -6, 107, -332, -26, -501, 89, 186, -335, -133, 67, 15, 12, 209, -265, -60, -155, -130, 434, 33, -290, 91, -398, -154, 51, -282]
7295b82K60J68n04L81mm3J20k46nL86j07k57K97k75J46J8j34j56N36n83L86o4
7317C8j20J69l28O4M84k00j49K99k04J89N8l07Q2j75j10P0k4j66N81np79K71M23
7340A61l71N94p65L43j5m7N08k39j86J0R6n77P72m87K01M83m21l5K59p05L60L21
7362B60p66N18L55o23N06j02m27N18l66J77l0K25l53K26k97J16N28o25K03lm16
7383c76O71k58m61P44m80j67J57k36K41L55o73M83L03o50K79j9j87N36k22m35
7403c95O35l39J31L8l23M09R6l52J29K41J33j46j10l70P52j88o36L96j21j7K92
7424B55m65K59N47q37K13P6m73P76l75l97Q91m69l88N19j54j27L48m07j41R72
7444F23p67LK07o54R30l93n40R89j46n71M09j00L37j93l02n7O33k77p7j16m2L24
$$ y = [-282, -22, 146, -358, 23, 19, -24, 96, -150, -155, 231, 124, -133, 164, -111, 35, 53, -81, -237, 299, -284, 102, 38, -82, 87, -241, -177, 307, 107, -42, 257, 53, 242, 300, -7, 75, -100, -210, -140, -164, -330, 251, 246, -533, -262, 161, -210, 384, -381, -38, -53, -100, 408, 169, -17, -7, 89, -488, 284, -203, -2, 481, 60, 25, 284, -421, -61, 260, -506, 12, 367, -256, 250, 148, -279, 239, -127, 50, 20, 245, -108, 118, -179, -63, 465, -160, 43, 40, -376, 295, 37, -424, 320, -160, -327, -170, -406, -165, 190, -483, 0, 303, -347, -68, -87, -274, 262, 40, -395, 240, -99, 32, 70, -253, 156, 252, -100, 29, 270, 403, 257, 147, -223, 529, 341, -295, 101, -20, -37, 255, -210, 49, 596, -241, -28, 48, -425, 351, -24, -421, 470, 1, -387, 132, -22, -149, 199, -208, -349, 623, -144, -141, 66, -588, 342, -51, -591, 398, 252, -319, 90, -10, 327, 134, -168, -225, 408, 131, 54, -62, -104, 220]
7466B20n52k4P95j05n84N29l95Q9L19p56K00O04n51L74k27m49P28j0n41O40l04
7487@l55P97n17j00L45k77k39P98q78L82L99p05P84m60j36L27J5o71N24k27J15
7508g9N56p54J3P15p02K05K40o12Q85l43l97O41o50K42K64l39j51O92p08l5N88
7529B71l59K06k28p9M28p8p06R20m56J03K52n18N9N69l97j47M68l86N72m36k96
7550b38N09k09m49M32J47k44J10q0q0L10m89M05L82q17J00K76m17N44J44l02K25
7571B59m57K35J33o65L44P87p73J65K5l1K37j31j86J35j09l01K55K07j72J43j04
7592dl84Q29o42m0L58k65K8L75q32Q03P6k31Q9o8l5M03n41j92O23l33r5r3L39
7615A68Q7L15o43M31o70K56P2m03L31L57j43o45O73k84j14K81j92K00K9l60M85
$$ y = [220, -332, -356, 439, 334, -250, 279, -116, -27, 292, -464, -264, 340, -211, 163, -64, -513, 215, 205, -336, 304, 0, -355, 442, -75, -175, 170, -107, -346, 452, -426, -44, 355, -350, 434, -26, -162, 165, 180, -491, 33, -194, -79, 477, -277, -264, 451, -251, -46, 194, -418, 467, 124, -273, 368, -282, -40, 224, -115, -266, 426, -282, -317, 271, -88, 118, -110, -189, 239, 161, -545, 375, -81, 22, 274, -244, -185, 384, -13, -160, 308, -78, 494, 58, -238, 271, 62, -387, 45, 192, -52, 58, -22, -102, 208, -281, 124, 506, -311, -211, 65, -352, 192, 336, 34, 259, -198, 37, 170, -495, -151, 636, -137, 28, 53, 22, 259, 128, -58, 77, -32, -333, -78, 129, -43, 100, -4, -388, 441, -201, -241, 117, -148, -120, 255, -577, 226, 302, 71, 160, 92, 57, 460, -81, -273, 350, 17, -78, -171, 168, 255, 570, -73, 358, -312, -56, 16, -387, -56, 301, 158, -487, 186, -98, -212, 69, -123, 77, 106, -254, 231]
7636B31j18n45N25j22k20J83Q2J17K30p07K20K64l0j42L0k12J98K40l05l2J77
7657F4l48K58j96O5L92k48j31J15k09J27Q4q1L64j76k36R2o6N3L06r7j28n1qq9
7681a44J61p7J47k55j87M29K70n21M49l18K30k20P3k5K27l40j3J81j66J13O4n6
7703B2k50J99K9R0j00k2J79k20j48M98j20k19L26Om4J07m55r9M47n48M12k51L
7726a58K06J44l98L20k29n6K63k01L28k45K7J63j36O2j78k3L25P8n84K12J91n6
7748E5j37k62M77k38M63m32m6J58m40O95k80K64j01j81l64P95l18P5K82p00o3
7769b98M51l85K37m1L6O8J14l17L6k5jK93j81L37j2n17j19K82K5k62L09K0q1L88
7793C57m18K61J43m04k4J84j74L43k86k9K86l97N7J23j0J78J40J91l29j04k02
$$ y = [231, 113, -432, 93, -29, -249, -66, 16, 133, 363, -344, -124, 140, 110, -32, -2, -214, -16, 224, -81, -113, 64, -284, -26, -222, -157, 235, -13, -144, -29, -238, -111, -27, -108, 256, 80, -156, -64, -130, -77, 229, 132, 4, -47, -55, -144, 17, -60, 87, -168, -355, 74, 344, -177, 272, -46, 184, -36, 37, 12, 239, -101, -114, 67, -99, 14, 78, 22, -228, -29, 0, 90, -10, -32, 147, -73, -221, 277, 157, -62, 264, 270, 226, 333, -122, -221, 226, -322, 90, -161, -158, 48, 192, -206, 114, -115, -171, 92, -109, 219, -26, 1, 164, 28, 90, -88, -111, 214, 292, -292, -80, 111, 55, -82, -344, 133, -105, 358, -74, -120, 38, -402, 293, 13, 277, 176, -5, -369, 426, 108, 183, 465, -235, -298, 153, -232, 5, -36, 0, 68, 182, -135, -99, -124, -125, 168, -13, 324, 312, -205, -324, -42, -17, -279, 30, 50, -31, 357, -61, 200, 343, -61, -85, 99, -75, 268, -18, -47, 239, -158, -101, 22, 12, 190, 330, 521, 192, 88, -114]
7814a14P0p4P4P5j45j78K07J54k8P2J9j1j25j66K41r4j40K06J52k18J28j90J70
7837H5j13J06j48J38l4K85j56j33j65j0K5R5J8k43L86J13m9l48J62k95K64LJ83
7860A69j81k16N93l74m4q1J4j94K15K15m23K22o4K8J88O1L22j08m52L22n29M86
7882A69j87jJ17j20j60L82J38k73K18l41qj87J5M1K91k04J28q6K00k01p8RJ33
7905eK11l84L72m47K50M45o28J26L68l45N1P3l76K19J85j17O6K68p81P96m93J44
7927bL4Km06L29J00N0q0n4K39K3pl16L94n10K76J94l21M5j41J66k27J23r7L24
7951A38j7k19J79R0q6J40o28N01r7nK88j17k86K48p3k47J21K8L9k30J75K12L8
7974A92m62K33P3k98O32k52J0k13l9J45P5j97j25N62m44K14k0l56J96J77k79L68
$$ y = [-114, -44, -118, -44, 31, -114, -292, -85, 69, 41, 113, 132, 121, -4, -170, 71, -23, -163, 43, 195, -23, 105, -85, 85, -28, 78, -70, 68, 34, 319, 163, 30, -135, -145, -120, -25, -7, -250, 136, 249, 200, -148, 14, -281, -17, -14, 169, -12, -228, 365, -9, -53, -134, -120, -314, -99, 116, -307, -85, -149, -121, 67, 128, 450, 342, -110, 212, -317, 169, -18, -19, 98, -22, -182, 200, 338, 65, 283, -58, -66, -253, -238, -197, 94, -110, 18, -68, 132, -69, -147, -138, -5, 206, -178, 194, -253, -3, 442, -186, -60, 308, -37, 14, 87, -289, -70, 115, -2, 64, 332, -449, 347, -146, -2, 32, 34, -372, -43, 57, 107, 27, -27, 212, 235, 228, -88, 306, -204, 72, 266, -55, -10, -151, 15, -212, -89, -186, 138, 121, -98, 81, 171, 85, 225, -403, 98, 1, -4, 284, 167, -119, 129, 56, -191, -70, -42, -3, -233, -58, 154, 192, -270, -37, 36, -262, 370, 118, 128, -85, -124, 21, 96, -101, -226, 336, -108, 106, 86, -270, -74, 103, -176, 192]
7996A92j37k86L24l19J61P9j69K68o6m77N14J20m89M4J17p9M51l35k69L67K00
8017B11m35n9j07K16M43o07M46j37j81M96n77L23mk15lM46J1k04J97k46J26j29
8039A1k44J59l6J72K33l32j35M79m49L4L11n04M63Q4n24L48M38n56K06j73J08
8060I3l00J87k66N08k95J87K43k11k03J87k05L20j6n63J66L94l94K50n24J44P51
8081D53k79j89J71O0Q7J25n31K56n7l54J85l00K93L14k88n2K47l57J93J42k60
8102a41K82kk65J73K96n49K81j48M5J04O2k77N25n74K31M4j85J26P4p1l2M27n00
8125g4k02J79n1L55l86J30J11J36M9ol64J95K91m54m2K26l79M42j39l50N05k60
8147h8m8J41j3l24N36m38J16L10o68M36K17o59P92j53n96P64j31l59L28l46O7
$$ y = [192, 55, -231, 93, -226, -65, 14, -155, 113, 47, -430, 84, 204, -285, -241, -124, -203, 248, -87, -356, 11, 211, -224, -283, -390, -174, 269, -338, 108, -29, -210, 286, -291, 32, 28, -187, -190, 256, 267, 63, 260, 14, 140, 11, -233, -74, -110, 62, 295, -37, -172, 307, -142, -108, 203, -301, 162, 246, -278, 70, 508, -48, 158, -15, 93, -207, -20, -286, 222, -73, 114, 357, 146, -57, 130, -75, 245, 229, -334, -168, 226, -168, 82, -442, -298, 453, 174, -15, 156, 216, 303, 428, -103, 153, 96, -258, -73, -373, -80, 234, -54, -106, 141, -216, -23, 119, -141, 141, 139, -126, 47, 343, -206, 75, -73, -28, 76, 138, -139, 386, -188, 43, 87, -98, 28, 102, 31, -1, 426, -74, -276, -97, -148, 207, -179, -49, 62, 198, 247, 241, -123, 72, 363, -91, -133, 93, -286, 156, 17, -333, 172, -88, -136, 5, -8, -332, 204, -234, -118, 192, -476, -40, 177, -482, 310, 157, -439, 325, 194, -165, 163, -183, -116]
8168a16K89m00L57ok54J81K41r0m4L4o54O62n04L38K26m38R5K24m53P30j71l08
8190f1J4
$$ y = [-116, 173, -227, 130, 124, -130, 51, 292, 202, 158, 192, -462, 200, -304, 34, 260, -178, -83, 141, -312, 418, 247, -61, -47]
8191d7
$$ Imaginary data points
##PAGE= N=2
##DATA TABLE= (X++(I..I)), XYDATA
0@%%%JrJ6k4L2m0N4p0Q8j12J36j60J96k37K82l38M05m77N54o42P44q58R86j129
27f02J287j459J648j860K095k353K638k949L287l658M068m517N010n553O146o801
43c573P527q335R241j0257J1404j2710J4214j5971J8054k0570K3677k7626L2838
56A7913m0086N0921o9069J06981l11227L39479J29385o04994N83229j61672j73483
67a32623M50831l47832j27289M48808m01813k575J76808k78373L44513M3051m80244
78c06738M06436O8621k97780K39360j88135m1642L24949m48735P0344M53644l92630
89a12306R8202K26394l99808L41956J23537n33644K75415Q5953l09031K38983
99C5651j36146j2168L85543m09816k4239M65362l70455J9087K24183m41563K56366
$$ y = [0, 0, 0, 0, 1, -8, 8, -16, 16, -24, 30, -40, 48, -64, 72, -88, 108, -129, 153, -185, 220, -257, 297, -345, 399, -459, 527, -602, 685, -774, 874, -986, 1109, -1244, 1394, -1555, 1732, -1926, 2142, -2375, 2635, -2918, 3228, -3573, 3954, -4381, 4860, -5397, 6007, -6703, 7511, -8460, 9594, -10976, 12701, -14925, 17913, -22173, 28748, -40321, 66660, -244567, 94912, 224297, -380697, 202532, 40860, -132623, 318208, -29624, -156913, 291895, -109918, -112493, 64315, -214058, 130455, 173506, -306738, 99698, 168319, -129461, 109899, -78236, -119878, 205071, -243664, -173320, 280324, -112306, -14104, 212290, -187518, 154438, 277975, -255669, 19746, 105699, -203332, 35651, -100495, -112663, 272880, -136936, -161175, 304187, -66268, -47181, 177002, -264561, -8195]
110h195K25127m75916K84456J89159l34233K34425p0219j73721L77862k73510
120b4765k57597L86027j43328q2081K10024k01114J36910J41546k87708J85371
130F3285O8761k10433J85410j80801j17609M16583k36375j91113L76725j73374
140A059o2128K23995k68077Q8260J67386l59895J24919J77299k03456J83163k5470
151D7055j78917L17489p4101k24644K25197r8909j00185J33560j76998R8803J80401
162A48751k66272P8488J51033j72931J31550j6640k05697K12156k5320j82420
172a47302J98374j4296o1054J18268j42312N2191J69882k16744q043R8842j48658
183a00852Q7945K3924j38838J75881P550j46749J53082m405o0242Q9233j50907
$$ y = [-8195, 216932, -258984, 25472, 214631, -119602, 114823, 44604, -129117, 248745, -24765, -282362, 103665, -39663, -121744, 88280, -112834, 24076, 165622, -122086, 63285, 132046, -78387, 107023, -73778, -191387, 225196, -11179, -202292, 174433, 1059, -61069, 162926, -105151, -16891, 150495, -209400, -84481, 92818, -110638, 72525, 47055, -131862, 185627, 111526, -113118, 112079, 13170, -87015, 46545, -130453, -31650, 148751, -117521, -39033, 112000, -60931, 70619, 53979, -151718, 60438, 35118, -147302, 51072, 36776, -24278, 93990, -48322, 3869, 173751, -42993, -51036, 47806, -100852, -12907, 11017, -127821, 48060, 55610, -91139, 61943, 57538, -2704, 86529, -64378]
194f4378j3714J68827j33415j1220J22656r5723M9874M2098j18833J03968O461
205E6601j58408O9908Q859l6365J03522p3458k2589J42078p1435k7700Q9649p6576
217D086j994J5983r9251P6154M9916j00269M3367K2281l2807P5128l9948m9760
229c7114P4796n7394m6574O9588j9993J4798L4389o3731N1406O2400o9823O358
241A9106M31o2353L1383j3283l9875P3971o398m6883N8188Q429o973K8808n6737
254a2186j9607M6377l1574l857L7443j9094R411J1286k1652L5558N031n4481k319
267a9664n178r799K8018j6493p462M0905j0005K573M0467j3584p516n259m4283
280b7280J4890K3068l3579J0807J0416j4980L6009K819k3891K6321k9621m0134
$$ y = [-64378, -78092, 90735, -42680, -53900, 68756, -26967, 22907, 65005, -53828, 50140, 56601, -101807, -31899, -23040, -59405, 44117, -29341, -51930, 90148, 18713, -8987, 80662, 4086, 2092, 18075, -81176, -5022, 44894, -55375, -12008, 10273, -22534, 52594, 12646, -37114, 37682, -19712, -66286, 3302, -16691, -1893, 32496, -31235, 20171, 82571, 12748, 19106, 19537, -42816, -11433, -24716, -64591, 9380, 2982, -43901, 14287, 22716, 15743, 44551, -12186, -31793, 14584, -16990, -20847, 16596, -2498, 6913, 18199, -3453, 32105, 37136, -17345, -19664, -24842, -34641, -6623, -23116, -30578, 10327, 322, 2895, 43362, 29778, 22262, 17003, -27280, -12390, 10678, -22901, -12094, -1678, -16658, 19351, 22170, -1721, 24600, -5021, -45155]
292d5155L4745p233n723M0100k7937O01N8761k3579q380K8888m8767j7958K3946
305B309l1010J0566K5133l4578P846K9675m535J3696p95k1092J984r090P72J2904
319C785j1235Q548L698j0761L5106Q005l1080J0470k0445l2003L0061j0978j9055
332c5884L4904j2618k891M9224r299n893J5989m0618m702K2617k6047R645J4113
345H540k8240K1670J8937j9029J8799p873l6267J2754j53j1229K0140m364r150
358a5465K0989O894Q460J0883j1945r981j0071q145O586q532p839P159p368J2278
372f097K4844p305j855J765k3281J017J1608j2075M535O406o156J6939J5567l896
386B2016m55j3505j8503n94k230l499M771n418L11J6803Q906M952O243j0879j2412
$$ y = [-45155, -10410, -17643, -23366, 16734, -11203, -10602, 48159, 24580, 16200, 45088, -3679, -21637, 2309, -28701, -18135, 6998, -27580, -19734, 9941, 5406, 19102, 18307, -2785, -801, -9891, -9119, 3785, -7450, 1098, 4796, -5965, 29141, 37146, 6066, 16536, -3909, -35912, -5851, -16829, -35884, -980, -13598, -16489, 32735, 23436, 17543, 33532, -7086, -11788, 10829, -15218, -5573, 8540, -19700, 1970, 20907, 1878, 20677, 12804, -23463, -10709, -10862, -22091, -1951, -6315, -15465, 5524, 12418, 20878, 31761, 19816, 9835, -236, -8381, -1795, -10327, -18166, -11007, -18375, -6097, 18747, 11442, 9587, 11352, -11929, -10912, 696, -11379, -6844, -438, -6594, 10345, 25912, 22016, 21561, 8056, -10447, -11041, -13271, -16770, -11999, -17417, -17106, -303, 8603, 13555, 19798, 8919, -3493]
401c493N409p44n733O490n641j0384J4111J1088l865Q492o323k0551L037R89r359
416a6477M650j444n195J2946J4298J0486M615p034n192j1135o812P255j0570r956
430a9565J3694o866M789K8430j1329j0846J1042k1791l855K0737j5134j310J4482
443B478r940J1350J7899p010J595q452j3984P199q406m687O513j8484N463K0729
457B263r606J7248J4083k8385P919Q175k2653J3975Q85k6726J9367R315p809K1977
471B0028k824j6103N053j5800l376J1041j6779J651R102n200K4859Q777j6566
484C863J5710p680k1836J8466o937j4045J6754j6787n401L1322q045o360J3789
497A2813j7730K62J0453j7951O488P917j9553J0320J2688J565J6948j0404j4087
$$ y = [-3493, 1916, 1172, -4561, 1929, -3712, -14096, 15, 11103, 7238, 15730, 9407, -11144, -8107, -7118, -16477, -11827, -13271, -18466, -5520, 8778, 19264, 23879, 16845, 11653, 518, -6294, 961, -9609, -19565, -5871, -12737, -7948, 20482, 9153, -1693, 9349, -12442, -16297, 4440, -10694, -12004, 2478, -7462, 3888, 21787, 14777, 16372, 7920, -6064, 1135, -7271, -11958, -5445, -23929, -18466, 2263, -7343, 9905, 23988, -4397, 3522, 11697, -10956, 3019, 3904, -22822, -3455, 5860, -1949, 20028, 17204, 1101, 6154, -9646, -13022, -1981, -18760, -17109, -8007, -13207, 11652, 20429, 3863, 19573, 11893, -9943, 8523, 1586, -12459, 4295, -12492, -17893, 13429, 5384, -976, 12813, -4917, -4655, 5798, -12153, -5665, 2252, -17301, -6981, 5707, 7272, 24220, 13816, -271]
510b71J5769j0542j4561Q586j3246l363J3640j0874J4477K4496j8410n503P442
523G640j1672R088k528k2201J8192Q567j6051J8566Q700j0493O787j8123j1150
536a4678K5733j2747j9467J4137o138P655J6694j8347J4808K0873l2462J213J7489
549A4763j5835P042j1509k3041L5687L805k2552K3714l846q730J6003l1958K055
562a4402L4411l9097q128L2756j0478K3762L052l8297L9361L555n0651K9121k723
575B242k3670L4280l4225q078O9893l5797k7027M1407k6256J0715J6537n6690
587c6669L8773K6207o3499L2910K0263k6427M3081l5245l3094P6188l4819m2876
599c5207M6189l3196Q745L4060o4345M5585N1439p6192K2265K2009l8340M8140
$$ y = [-271, 15498, 4956, -9605, -1019, -14265, -17628, -3988, -14862, -385, 24111, 5701, 198, 7640, -4032, 5056, 2528, -19673, -1481, 7086, -8965, 9601, 18301, 7808, 14595, -3528, -14678, 11055, -1692, -21159, -7022, -13160, -5505, 11189, -7158, 7650, 28523, -3939, -2726, 14763, -1072, 5970, -5539, -28580, 7107, 10912, -11640, 12074, 8228, -502, 15501, -16457, -14402, 20009, -19088, -27216, 5540, -4938, 18824, 21876, -16421, 22940, 26495, -24156, 4965, 2242, -21428, 12852, -21373, -29451, 40442, 4645, -22382, 19025, -7231, 3484, 20021, -36669, 2104, 28311, -35188, -2278, 17985, -8442, 34639, -606, -33700, 42488, 7669, -35207, 10982, -22214, -13469, 20591, -43754, 1831, 53270, -22922, -657, 21352, -16988, 31152]
611C1152l8134m7742Q8507k8333l8566O3832m0713J4366M3251j01393M0696P2242
623E9165j04528K4995L8596o1308P7086j1587q3339J06103p834q1746O7544k3901
635g54j2471N4605q9741J5601Q6434p6773J3533K8194n1136P7918k9802q6598
647g0990J15056k3000q0226Q4553m6052K610R6926j18997N721J18501j06280J487
659b0691N1843q4962P5538L896j11618J14587J6652q6624P1644m4520o243R9982
671G9484j26113m018J27123j10041J0195O8952j01134Q8112K8124j48198J05321
682A7807M1757j10125O7541k9591l1318J10616r5485k8780J28108p6573o399M9493
694C7051q4402Q4957J2013j40310J05935K1526r2125R9148n6702l9246J54185
$$ y = [31152, -6982, -54724, 33783, 5450, -33116, 30716, -9997, 4369, 47620, -53773, -13077, 59165, -45363, -20368, 18228, -43080, 34006, 22419, -60920, 45183, 37349, -44397, 23147, -754, -13225, 41380, -48361, -32760, 53674, -23099, -9566, 18628, -32508, 45410, 15608, -70990, 44066, 21066, -59160, 25393, -20659, -18049, 78877, -40120, -34399, 84102, -22178, -20691, 31152, -53810, 21728, 25624, -85994, 28593, 45245, -41379, 30265, -14255, -20498, 79484, -46629, -50647, 76476, -33565, -23370, 45582, -55552, 32560, 60684, -87514, 17807, 59564, -50561, 16980, -12611, -43929, 66687, -28798, -57578, 70530, -6043, -12442, 37051, -47351, 37606, 49619, -90691, 15244, 36770, -55355, 43793, -12909, -52155, 102030]
705A02030j19010o4378J61831q7058l6689Q1077r4055O5739O0543j38306P5192
716F916M7422r1078P4251m6878m6995J39834j00681o5233J45014p1171j2630O9330
728D8101j12884Q1307O6831j64090Q2590N7728j18389Q7631k2899p9946J49678
739G5658n6648r3633J25286m0704k2315N2200j05267O8947O3453j49538P7512
750e049N9128j03889R2185k5937q8783J47922n2834j02098J19744m4841k0307
761b4759P5675j09504N0585R6307j45956L7385P5512r3310O0557j2492q0720J22258
773E1538l2816q1435J01264m4498p065P6732j19543L9418J07292j42809J7459
784c4463P9927q6635N8031J496q4108J13435j4660q6987Q8724l7643k1841P6466
$$ y = [102030, -16980, -81358, 80473, -6585, -43274, 37803, -56252, 9487, 70030, -68276, 6916, 54338, -36740, 37511, -9367, -56362, 83472, -17209, -82442, 62572, -8599, -21229, 48101, -64783, 16524, 83355, -80735, 1855, 59583, -58806, 28825, 5926, -74020, 75658, 19010, -74623, 50663, 9959, -12356, 39844, -65423, 3524, 66977, -82561, -5049, 54079, -49810, 42375, 16438, -72345, 75577, 22743, -79355, 40389, -4452, -24759, 50916, -58588, -8003, 88304, -57652, -20267, 55245, -38065, 22492, 10000, -70720, 51538, 18722, -62713, 38551, -5947, -13012, 63720, -55823, -16405, 90887, -51922, -34463, 45464, -41171, 16860, 18356, -65752, 47683, 33023, -53964, 34760, -2883, -24724, 51742]
796E1742j03542J6979J09763j04855N921O4295o6431N5138r444q6468J05757j4993
808B3862q6329Q9679l0872k5604Q7761q9406o881J06995q4683r706N4302n9209
820c0091M9480K72q3936R2163N703q1329O9977j6966k7663P2694p2192j7853Q6391
833D6650o3010p805M3888m8655N1384Q432q2701P4740J6647p8877M8982j0388
845g13k8238O4776n1383j9141P7537m5237j0874L5761m7058L6724J5505p7042
857d9383N2071K8651n9519L4831k430k2165N2479l9672k3075O0973l5155j2830
869a5224L0355m0545K8237K4375o2685L4744L0743m4115K2680l508k1615M1919
881B5361l1677k5523N1232k0128j1047K8145k9421J9021K2991n0909J5662K4590
$$ y = [51742, -51800, -34821, 74942, -29913, -23992, 40303, -26128, 29010, 19566, -66902, 38855, 23862, -62467, 27212, -3660, -29264, 58497, -30909, -37790, 69205, -15478, -25184, 29118, -30091, 19389, 19661, -64275, 27888, 33591, -47738, 22239, 5273, -22390, 50304, -21888, -39741, 46650, -16360, -24165, 19723, -28932, 22452, 30884, -51817, 22923, 39570, -39307, 9675, -713, -28951, 35825, -15558, -34699, 42838, -2399, -13273, 22488, -24570, 12154, 27659, -49383, 2688, 31339, -28180, 6651, 4221, -17944, 34535, -5137, -28212, 32761, -2394, -15224, 15131, -25414, 2823, 27198, -35487, -743, 30000, -14115, 8565, 5057, -16558, 25361, -6316, -31839, 19393, -735, -11782, 16363, -13058, 5963, 28954, -21955, -6293, 18297]
893A8297l3345J3996o11j4132L7274j7684k3678L7870j0842j4477J6707k1273
905a1898Q877K0417l3631P685K2319j9184Q005K58j2409K5821r732k3122K3076
918F482l054j1798J0891j1286N414J8654j9584Q23J6553j2122L07j769j1716J5590
932C385q75j5430J5316N180p132O337p020j620J0221j2951n388J1994l432k09
946a624L322m877Q271K769j2064L461M998n613O00j853j893P830l576n442Q660
961B969J380l685K138k667j60L344p100l763P444j082j464M640k46K571J807p249
977a123N7K386n417p14K258m11N801l82l550O397j657n844K943l025j926N064
993H57m108r7P577l681kK962m522K626Q69o423M321n37n031N229k123j375P913
$$ y = [18297, -15048, -1052, -1663, -15795, 21479, 3795, -19883, 17987, 7145, -7332, 9375, -11898, -3021, 17396, -16235, -8550, 13769, -5415, 2590, 2848, -9561, 16260, 6528, -16594, 6482, 3428, -8370, 2521, -8765, -3351, 15303, -4281, -3458, 13095, 973, 1280, -489, -12205, 3385, 2510, -12920, 2396, 7576, 444, 6781, -239, -1859, 8362, -4589, -9977, 2017, -1415, -1624, 1698, -3179, 5092, 7861, -4203, -742, 4256, -1357, -757, -2610, -4503, 3327, -249, -5691, 2969, 4349, 664, 2802, 135, -25, 3319, -3781, -7544, -100, -1182, -2646, 1994, 1748, 4319, 6126, -1123, -1066, 1320, -4097, -4811, -2553, -2964, 2837, 2455, -1095, 5302, 3645, -2199, 744, -2281, -4207, 857, -3251, -3348, 4229, 548, 546, 3508, -1014, 1612, 2481, -3942, 379, -158, -5189, 40, -2083, -3458, 4455]
1010D455m581j354Q625o672k118M873p973q8N869n850L573N944l825J998J249
1025D125m681J225l023k196K829k267K117M688l169L484K104p404L659R84p225
1040d750M152J497o023N581K184m987L843R78l798K318R04k246k60o09p14j77
1056b107M27K668p38N01L391j685j785J903l603l391K532o82j083N077J216k383
1072B58L200k20m070J154p6m499J851K772j681K364K823l027O76P67k876L93l94
1089e85j446R44p34J357J427k872L325P06l521M644K01n274L769j625n882N937
1105C71m23l381O450j259k131N602l745k973K499m898K88K959k091M963P76k919
1121H8M623k477l488L988n764j628O587n204J309P078o977J716M495p636M283
$$ y = [4455, -126, -1480, 7145, 473, -1645, 3228, -4745, -4833, 1036, -4814, -1241, 4703, 878, 2876, 4125, -556, 669, -2354, -4550, -1721, -3988, -1871, 2817, -352, 3132, 5236, -2168, 1491, 2475, -4750, -598, 899, -5124, 457, 2641, -2346, 1497, 2475, -1323, 995, 1899, -347, -607, -1216, -1930, -2107, -1680, 988, 250, 751, 4142, 2457, 672, 2575, -1028, -4419, -1887, -2569, -3652, 1425, 2641, 258, 3458, 3238, -832, 322, 246, -4253, -2402, 370, -1311, 1053, 3876, 849, 1525, 2292, -584, -191, -585, -2031, -1087, -1821, -464, 963, -1909, 1416, 2122, -1399, 3245, 3446, -1828, 1941, 316, -5566, 371, -52, -3433, 3017, 1758, -373, 5229, 1484, -1489, 1010, -3888, -3600, -641, -2732, 2231, 3007, 88, 4711, 2234, -1254, 2734, -3030, -4658, 1929, -3275, -1966, 5112, -1865, -149, 4346, -3290, 993]
1136I93K435q053N003J255n202N505j355l181O289l786j362O412m540q58J892
1151A447o394L583K269o527N622K746l793N413k133l293N743o585m166P250k606
1166a424j78M339l962K944L839p496O53L193m786P60K73j034O016j111m814M213
1182A425Q68j515K63k268J797K009n328q29M289o2k157k39L20M348J377n780l97
1199a879M628l349l336J649J126L856k21n447N173N471p725l394J638m63K965
1214F92l225l287J0446k51p433L596Q4J342K044j1100L089J1597q868k278N319
1229A767k752N872m238j0184J5404R51j3582O154j173M37Q920j5952N88J9887
1243A2099j2555k739Q756q300J0028l075k1120K0021O459j9940J0978nk684J6314
$$ y = [993, 3428, -4625, 378, 1633, -3569, 1936, 581, -2600, 3689, -97, -1459, 4953, 413, -445, 1447, -4947, -1364, 905, -5622, 0, 2746, -1047, 4366, 2233, -1060, 4683, -1902, -6068, 1182, -1424, -1602, 2737, -1225, 1719, 5558, -1938, -1285, 1908, -2878, -2118, -1845, -2879, 3137, 2026, -2788, 1425, 2293, 778, 1041, -1227, 570, 2579, -2749, -3578, 711, 649, -1508, -1747, -1427, 2921, 4298, -1482, -1879, 2749, -600, -3936, -2287, -1161, 2695, 2474, -2973, 2200, 7671, -54, -3448, -1810, -2273, 692, -2533, -5820, 4626, 4375, -3058, 538, 622, 1964, 4008, -7092, -4003, 7594, -1274, -3552, 1767, -985, 4887, 649, -9535, 5869, 6820, -6762, -608, -1781, -1344, 7576, -8376, -7788, 12099, -456, -3195, 5561, -2739, 7289, 4214, -16906, 3115, 9574, -10366, 612, 607, -2077, 14237]
1257A4237j9137o456K4796j5631o979J2302j1529J6208K952k9118K3571J1101
1269A6317k6921J3221k836q368K4700k2106j1675L4915j6365j0107J5727j7320
1281a0818J8046R120l8296K3146J6738l0589J4962l472j0691L2969k5886j6198
1293b0969M4021k0159j2650K1639k8721J8066K0621m8821K1501K8527l3970J4677
1305C762o84j6116L7221k5705k6234M5964j6129j2014K3339l1463K0620K5970
1317B8531n5046K0334K9906l8296K0082m267k3904N0426k3031l8486N3259j3550
1329E958j8444K9558l3613J4662L4303n6555J2951L2303l5325K0989o482k7325
1341b7020N8313k2261m3097N5095j6734j8935L4124m3146J5785M6987o3605J1578
$$ y = [14237, -4900, -11356, 13440, -2191, -9170, 3132, -8397, 7811, 10763, -18355, 5216, 16317, -10604, 2617, -219, -8587, 16113, -5993, -17668, 17247, 882, -9225, 6502, -10818, 7228, 16348, -21948, 1198, 17936, -12653, 2309, -1163, -11854, 21115, -4771, -20969, 23052, 2893, -9757, 11882, -16839, 1227, 21848, -26973, -5472, 23055, -10915, 3762, 3078, -13038, 24183, -1522, -27756, 18208, 2079, -9935, 13404, -18059, 2561, 28531, -26515, -6181, 23725, -14571, 5511, 1244, -22660, 27766, 4735, -33751, 19508, 5958, -12486, 17072, -16541, -1879, 32424, -24131, -11180, 21123, -14202, 6787, 305, -27020, 31293, 9032, -34065, 21030, 4296, -14639, 19485, -23661, -7876, 39111, -24494, -12916]
1353a2916M0848m1704K3318k330m1984O0231j0477n3796N3910o814k1663L5823
1365B2446m3595J0094N2184o1862L406M2208m0224K4934J158m7911N9941k695
1377B0084n7028M9173m039j9858L6415m6004N004N5816n7609r78L9829l7236K9586
$$ y = [-12916, 27932, -13772, 9546, 7216, -34768, 25463, 14986, -38810, 15100, 8286, -13377, 22446, -21149, -11055, 41129, -20733, -17327, 24881, -15343, 9591, 10749, -37162, 22779, 20084, -36944, 12229, 8190, -11668, 24747, -21257, -16253, 39563, -18046, -19024, 20805, -16431, 13155]
$$ [...]
8191C47
##END NTUPLES=NMR FID
##END=
