##TITLE=1H_LR-793-O-C3-MK
 CDCl3+DMSO-d6
 8 sc, 
 26.12.2024
##JCAMPDX= 6.0         $$ Bruker NMR JCAMP-DX V2.0
##DATA TYPE= NMR FID
##DATA CLASS= NTUPLES
##ORIGIN= UXNMR, Bruker Analytische Messtechnik GmbH
##OWNER= root
$$ XWIN-NMR		Version 3.5
$$ Thu Dec 26 14:10:44 2024 Russian Standard Time (UT+4h)  she@DPX200
##.OBSERVE FREQUENCY= 200.1315
##.OBSERVE NUCLEUS= ^1H
##.DELAY= (6, 6)
##.ACQUISITION MODE= SIMULTANEOUS
##.ACQUISITION SCHEME= undefined
##.AVERAGES= 8
##.DIGITISER RES= 18
##SPECTROMETER/DATA SYSTEM= spect
##.PULSE SEQUENCE= zg30
##.SOLVENT NAME= D2O
##.SHIFT REFERENCE= (INTERNAL, D2O, 0, 15.7039)
##AUDIT TRAIL= $$ (NUMBER, WHEN, WHO, WHERE, WHAT)
$$ ##TITLE= Audit trail, XWIN-NMR		Version 3.5
$$ ##JCAMPDX= 5.01
$$ ##ORIGIN= Bruker BioSpin GmbH
$$ ##OWNER= she
$$ F:/spectra/data/she/nmr/H-F/1/audita.txt
$$ ##AUDIT TRAIL=  $$ (NUMBER, WHEN, WHO, WHERE, WHAT)
(   1,<2024-12-26 14:08:52.79 +0400>,<she>,<DPX200>,
      <created by zg, POWCHK disabled, PULCHK disabled
       configuration hash MD5:
       00 E9 B6 7A A2 85 ED C7 34 08 36 98 17 FE 4E 26
       data hash MD5: 16K
       01 78 0B F6 B0 13 69 31 68 B5 1B C3 01 13 FE BF>)
$$ ##END=
$$ 
$$ hash MD5
$$ 1A BD A7 3C 96 8C 3A 61 AA 55 60 F1 A8 EE 58 D9
##$RELAX= 
##$RELAX= 
##$RELAX= 
##$RELAX= 
##$RELAX= 
##$RELAX= 
$$ Bruker specific parameters
$$ --------------------------
##$DU= <F:/spectra>
##$EXPNO= 1
##$NAME= <H-F>
##$PROCNO= 1
##$TYPE= <nmr>
##$USER= <she>
##$AMP= (0..31)
100 100 100 100 100 100 100 100 100 100 100 100 100 100 100 100 100 100 
100 100 100 100 100 100 100 100 100 100 100 100 100 100 
##$AQSEQ= 0
##$AQ_mod= 1
##$AUNM= <au_zg>
##$AUTOPOS= <>
##$BF1= 200.13
##$BF2= 200.13
##$BF3= 200.13
##$BF4= 200.13
##$BF5= 200.13
##$BF6= 200.13
##$BF7= 200.13
##$BF8= 200.13
##$BYTORDA= 1
##$CFDGTYP= 0
##$CFRGTYP= 5
##$CHEMSTR= <none>
##$CNST= (0..31)
1 1 145 1 1 1 1 1 1 1 1 1 1 1 1 1 1 1 1 1 1 1 1 1 1 1 1 1 1 1 1 1 
##$CPDPRG= <>
##$CPDPRG1= <>
##$CPDPRG2= <>
##$CPDPRG3= <>
##$CPDPRG4= <mlev>
##$CPDPRG5= <mlev>
##$CPDPRG6= <mlev>
##$CPDPRG7= <mlev>
##$CPDPRG8= <mlev>
##$CPDPRGB= <>
##$CPDPRGT= <>
##$D= (0..31)
0 1.2 0 0 0 0 0 0 0 0.06 0 0.03 0 0 0 0 0.0002 0 0 0 0 0 0 0 0 0 0 0 0 
0 0 0 
##$DATE= 1735207732
##$DBL= (0..7)
120 120 120 120 120 120 120 120 
##$DBP= (0..7)
150 150 150 150 150 150 150 150 
##$DBP07= 0
##$DBPNAM0= <>
##$DBPNAM1= <>
##$DBPNAM2= <>
##$DBPNAM3= <>
##$DBPNAM4= <>
##$DBPNAM5= <>
##$DBPNAM6= <>
##$DBPNAM7= <>
##$DBPOAL= (0..7)
0.5 0.5 0.5 0.5 0.5 0.5 0.5 0.5 
##$DBPOFFS= (0..7)
0 0 0 0 0 0 0 0 
##$DE= 6
##$DECBNUC= <off>
##$DECIM= 24
##$DECNUC= <off>
##$DECSTAT= 4
##$DIGMOD= 1
##$DIGTYP= 9
##$DL= (0..7)
0 120 120 120 120 120 120 120 
##$DP= (0..7)
150 150 150 150 150 150 150 150 
##$DP07= 0
##$DPNAME0= <>
##$DPNAME1= <>
##$DPNAME2= <>
##$DPNAME3= <>
##$DPNAME4= <>
##$DPNAME5= <>
##$DPNAME6= <>
##$DPNAME7= <>
##$DPOAL= (0..7)
0.5 0.5 0.5 0.5 0.5 0.5 0.5 0.5 
##$DPOFFS= (0..7)
0 0 0 0 0 0 0 0 
##$DQDMODE= 0
##$DR= 18
##$DS= 0
$$ [...]
##$SUBNAM2= <"">
##$SUBNAM3= <"">
##$SUBNAM4= <"">
##$SUBNAM5= <"">
##$SUBNAM6= <"">
##$SUBNAM7= <"">
##$SUBNAM8= <"">
##$SUBNAM9= <"">
##$SW= 24.0689530833862
##$SWIBOX= (0..15)
0 0 2 0 0 0 0 0 0 0 0 0 0 0 0 0 
##$SW_h= 4816.95568400771
##$TD= 16384
##$TD0= 1
##$TE= 0
##$TE2= 300
##$TE3= 300
##$TEG= 300
##$TL= (0..7)
0 120 120 120 120 120 120 120 
##$TP= (0..7)
150 150 150 150 150 150 150 150 
##$TP07= 0
##$TPNAME0= <>
##$TPNAME1= <>
##$TPNAME2= <>
##$TPNAME3= <>
##$TPNAME4= <>
##$TPNAME5= <>
##$TPNAME6= <>
##$TPNAME7= <>
##$TPOAL= (0..7)
0.5 0.5 0.5 0.5 0.5 0.5 0.5 0.5 
##$TPOFFS= (0..7)
0 0 0 0 0 0 0 0 
##$TUNHIN= 0
##$TUNHOUT= 0
##$TUNXOUT= 0
##$USERA1= <user>
##$USERA2= <user>
##$USERA3= <user>
##$USERA4= <user>
##$USERA5= <user>
##$V9= 5
##$VALIST= <valist>
##$VCLIST= <CCCCCCCCCCCCCCC>
##$VD= 0
##$VDLIST= <DDDDDDDDDDDDDDD>
##$VPLIST= <PPPPPPPPPPPPPPP>
##$VTLIST= <TTTTTTTTTTTTTTT>
##$WBST= 1024
##$WBSW= 4
##$XGAIN= (0..3)
0 0 0 0 
##$XL= 0
##$YL= 0
##$YMAX_a= 206592
##$YMIN_a= -293839
##$ZGOPTNS= <>
##$ZL1= 120
##$ZL2= 120
##$ZL3= 120
##$ZL4= 120
##$ABSF1= 10
##$ABSF2= 0
##$ABSG= 5
##$ABSL= 3
##$ALPHA= 0
##$AQORDER= 0
##$ASSFAC= 0
##$ASSFACI= 0
##$ASSFACX= 0
##$ASSWID= 0
##$AUNMP= <proc_1d>
##$AZFE= 0.1
##$AZFW= 0.1
##$BCFW= 1
##$BC_mod= 2
##$BYTORDP= 1
##$COROFFS= 0
##$CY= 11.3945322036743
##$DATMOD= 1
##$DC= 2
##$DFILT= <>
##$DTYPP= 0
##$F1P= 15.6554695791079
##$F2P= 12.8336369535428
##$FCOR= 0.5
##$FTSIZE= 0
##$FT_mod= 4
##$GAMMA= 1
##$GB= 0.15
##$INTBC= 1
##$INTSCL= 1
##$ISEN= 128
##$LB= 0.24
##$LEV0= 0
##$LPBIN= 0
##$MAXI= 10000
##$MC2= 0
##$MEAN= 0
##$ME_mod= 0
##$MI= 1.114404
##$NCOEF= 0
##$NC_proc= 0
##$NLEV= 6
##$NOISF1= 3.799351
##$NOISF2= 2.8
##$NSP= 1
##$NTH_PI= 0
##$NZP= 0
##$OFFSET= 15.70392
##$PC= 1
##$PHC0= -26591.52
##$PHC1= 38.78744
##$PH_mod= 1
##$PKNL= yes
##$PPARMOD= 0
##$PSCAL= 0
##$PSIGN= 0
##$REVERSE= no
##$SF= 200.130013532006
##$SI= 16384
##$SIGF1= 3
##$SIGF2= 2
##$SINO= 400
##$SIOLD= 16384
##$SREGLST= <1H.CDCl3>
##$SSB= 0
##$STSI= 0
##$STSR= 0
##$SW_p= 3612.71676300578
##$SYMM= 0
##$S_DEV= 0
##$TDeff= 0
##$TDoff= 0
##$TI= <>
##$TILT= no
##$TM1= 0
##$TM2= 0
##$TOPLEV= 0
##$USERP1= <user>
##$USERP2= <user>
##$USERP3= <user>
##$USERP4= <user>
##$USERP5= <user>
##$WDW= 1
##$XDIM= 8192
##$YMAX_p= 0
##$YMIN_p= 0
$$ End of Bruker specific parameters
$$ ---------------------------------
##NTUPLES= NMR FID
##VAR_NAME=  TIME,          FID/REAL,        FID/IMAG
##SYMBOL=    X,             R,               I
##VAR_TYPE=  INDEPENDENT,   DEPENDENT,       DEPENDENT
##VAR_FORM=  AFFN,          ASDF,            ASDF
##VAR_DIM=   8192,          8192,            8192
##UNITS=     SECONDS,       ARBITRARY UNITS, ARBITRARY UNITS
##FACTOR=    0.0002076,     1,               1
##FIRST=     0,             0,               0
##LAST=      1.7004516,     0,               0
##MIN=       0,             -293839,         0
##MAX=       1.7004516,     206592,          0
$$ Real data points
##PAGE= N=1
##DATA TABLE= (X++(R..R)), XYDATA
$$ [...]
$$ plain form
1915 32 -254 -15 116 -245 26 200 -108 303 3 -392 -195 236 270 -177 -40 -71 -69 -90 -253 -228 -276 -116 182
1938 182 183 32 142 -37 -61 -11 26 256 199 -88 362 -89 -147 -115 128 -103 -44 20 213 -196 -79 -196 -91
1961 -91 -189 -287 -327 -53 -421 -184 2 178 -178 9 -115 -158 -164 210 116 106 113 241 -14 390 -5 -90 86 -138
1985 -138 -174 340 97 -101 147 -17 -113 -91 -256 55 -203 69 66 -221 147 -151 -35 -222 62 -256 3 -61
2007 -61 220 207 120 -230 127 27 252 -290 -41 78 139 34 396 116 137 106 103 166 -214 -160 -379 -8 -90 161
2031 161 46 -20 144 427 -141 -150 154 129 -249 -121 -80 -152 128 253 162 -14 5 63 -279 47 -52 91 -133
2054 -133 90 -78 -177 -16 89 90 80 148 -149 474 246 -62 421 124 158 -79 -115 -40 55 -141 49 -104 348
2077 348 -40 -427 -74 4 193 300 -267 144 -49 -210 83 -371 12 51 -96 9 10 142 -83 -138 -59 9
$$ packed form
1915C2k86K39J31l61K71J74l08M11l00l95J97M31L4m47J37l1Kk1j63K5m8J60K98
1938A82Jj51J10j79k4N0L7K30n7k87M50m51n8L2K43k31N9O4J93m09J17j17J05
1961i1r8r8m0K74l68K37J86J76l56J87j24m3oL74r4j0PJ28k55M04l95q5J76k24
1985a38l6N14k43j98K48j64r6K2j65L11k58K72lk87L68k98J16j87K84l18K59o4
2007f1K81j3q7l50L57j00K25n42K49J19O1j05L62k80K1l1lO3l80N4k19L71q2K51
2031A61j15o6J64K83n68rL04k5l78J28M1p2K80J25r1j76J9N8l42L26r9J43k24
2054a33K23j68r9J61J05Jj0O8k97O23k28l08M83k97L4k37l6P5R5j96J90j53M52
2077C48l88l87L53P8J89J07n67M11j93j61K93m54L83L9j47J05JJ32k25n5P9O8
$$ plain form
2099 9 129 -198 170 -42 -92 -233 -444 -226 -231 -281 -24 -61 -172 34 -159 -146 -98 -170 22 -49 206 53 -27 -43
2123 -43 -209 -65 131 85 206 28 225 -63 -223 -162 238 -109 -232 -104 34 80 -62 -100 -40 7 237 -47
2145 -47 -176 341 -7 -232 -125 88 73 -293 76 22 -49 -20 207 -65 19 233 280 190 179 -119 -147 265 283 141
2169 141 56 -211 49 69 -43 266 168 -41 139 175 46 76 46 -155 -176 250 -229 10 88 1 -65 253 -62
2192 -62 -144 0 88 77 -315 -112 202 -142 150 24 -224 -99 -29 -36 -96 -24 -236 -71 154 -50 144 44 -108
2215 -108 130 -227 -223 -26 103 -38 174 -35 303 -150 -56 55 342 88 -199 93 136 -27 350 -182 153
2236 153 347 -240 262 -43 -186 -287 -73 -240 -201 -81 -69 110 45 64 -157 -152 -156 82 -13 -75 -162 49 -58 261
2260 261 -58 -3 127 -93 43 76 171 -25 -194 167 -345 88 -376 -198 -70 180 32 47 104 171 95 -14
$$ packed form
2099IJ20l27L68k12n0j41k11K18nn0K57l7j11K06j93J3M8p2J92p1K55j53q0j6
2123d3j66J44J96m6J21j78J97k88j60O1M00l47j23J28J38M6j42l8O0M7K30k84
2145d7j29N17l48k25J07K13j5l66L69n4p1K9K27k72Q4K14M7r0j1k98k8M12J8j42
2169A41q5k67K60K0j12L09r8k09J80L6j29L0l0k01k1M26m79K39P8q7o6L18l15
2192f2q2J44Q8j1l92K03L14l44K92j26k48J25P0po0P2k12J65K25k04J94j00j52
2215a08K38l57MJ97J29j41K12k09L38m53R4J11K87k54k87K92M3j63L77n32L35
2236A53J94n87N02l05j43j01K14j67L9J20J2J79o5J9k21NmK38r5o2q7K11j07L19
2260B61l19N5J30k20J36L3R5j96j69L61n12M33m64J78J28K50j48J5N7O7p6j09
$$ plain form
2282 -14 -63 99 174 -39 -456 147 146 81 227 143 286 175 112 -199 251 -70 -206 -321 -66 -101 -112 52 -142
2305 -142 176 -124 124 166 118 24 -69 57 242 -48 -25 33 287 297 -125 -35 322 170 139 129 -243 -42 -62 -11
2329 -11 -49 158 -158 -11 -33 32 163 88 74 -40 -66 150 255 -98 114 81 110 241 -92 66 -30 -197 -240 431
2353 431 -267 181 513 124 -28 -38 -291 78 -333 -150 -225 126 65 -209 -64 -92 -298 -169 -73 142 67 67 -99
2376 -99 186 103 -152 -106 -125 -23 129 -21 -346 -286 32 34 -61 315 -283 -39 58 -273 29 10 -410 130 -6
2399 -6 -407 -441 -15 65 -21 263 -103 196 -40 -182 117 -384 68 9 -148 93 -158 -499 20 93 176 -166 158
2422 158 -188 -127 229 64 109 -152 -99 7 328 17 185 123 -131 -55 93 -215 241 148 174 296 105 -85
2444 -85 -238 -173 40 -41 272 72 -427 36 214 -156 285 -227 -165 -73 -94 -27 98 6 11 146 6 70 -163 -290
$$ packed form
2282a4m9J62P5k13m17O03jo5J46q4J43j11o3l11M50l21j36j15K55l5j1J64j94
2305a42L18l00K48M2m8r4r3J26J85k90K3N8K54J0m22R0L57j52l1j0l72K01k0N1
2329a1l8K07l16J47k2O5J31p5j4j14k6K16J05l53K12l3K9J31l33J58r6j67m3O71
2353D31o98M48L32l89j52j0k53L69m11J83p5L51o1k74J45k8k06J29R6K15p5%j66
2376i9K85q3k55M6j9J02J52j50l25O0L18Kr5L76n98K44R7l31L02j9m20N40j36
2399fm01l4M26Q0q6K84l66K99k36j42K99n01M52n9j57K41k51l41N19P3Q3l42L24
2422A58l46O1L56j65M5k61N3J06L21l11J68o2k54P6J48l08M56r3K6J22j91j90
2444h5j53O5K13q1L13k00m99M63J78l70M41n12O2R2k1O7J25r2NJ35j40O4k33j27
$$ plain form
2468 -290 85 183 -324 106 129 144 282 88 231 -109 -274 44 -105 -48 344 -90 288 -33 -5 6 -66 -313
2490 -313 308 -43 -22 -160 -183 128 -109 147 7 180 62 43 171 116 25 55 -83 -204 -171 66 186 13
2512 13 -133 -92 195 -495 98 -35 -386 -259 -272 313 -45 85 66 -29 105 -56 239 -22 -104 -319 -12 149
2534 149 -405 -230 -112 142 -181 175 -34 -35 -117 -236 119 236 -51 -275 101 -243 95 64 79 -140 12 17
2556 17 -3 5 219 -178 140 -166 -160 17 43 -86 30 -34 149 -208 87 -64 226 -27 -51 -186 -4 9 105 -155
2580 -155 -106 -125 -76 -58 -244 122 175 110 -227 118 170 -261 66 -38 -104 -156 -50 114 119 33 -49 197 -18 473
2604 473 40 99 -15 -302 177 7 79 -40 9 -30 -160 -236 283 -192 -193 -81 153 -22 256 46 -208 23
2626 23 -164 98 10 -3 270 -274 -227 103 266 -29 88 -134 20 -390 -63 -66 -296 -128 -202 166 12 -483
$$ packed form
2468b90L75R8n07M30K3J5J38j94J43l40j65L18j49N7L92m34L78l21K8J1p2k47
2490c13O21l51K1j38k3L11k37K56j40J73j18j9J28n5r1L0j38j21L3K37J20j73
2512A3j46M1K87o90N93j33l51J27j3N85l58J30j9r5J34j61K95k61q2k15L07J61
2534A49n54J75J18K54l23L56k09jq2j19L55J17k87k24L76l44L38l1J5k19J52N
2556A7k0QK14l97L18l06OJ77K6j29J16o4J83l57K95j51K90k53k4j35J82J3R6k60
2580a55M9j9M9J8j86L66N3o5l37L45N2m31L27j04o6n2J06J64Nq6q2K46k15M91
2604D73m33N9j14k87M79j70P2j19M9l9j30p6N19m75jJ12K34j75K78k10k54K31
2626B3j87K62q8j3K73n44M7L30J63k95J17k22J54m10L27lk30J68p4L68j54m95
$$ plain form
2648 -483 -196 -233 -45 -167 -367 72 53 -87 -102 124 -7 -478 -96 -80 211 211 178 104 -32 2 140 176 -157
2671 -157 -33 135 -4 -78 110 231 65 -298 146 -9 -231 -394 -142 -22 21 -114 -106 163 107 -163 73 406
2693 406 76 -195 359 34 -92 -176 -204 21 -186 -47 3 -142 -165 -183 185 64 118 -183 -85 243 62 50 -38
2716 -38 109 -103 46 -62 -52 510 -133 -22 77 -53 -99 206 -316 2 -41 9 91 78 -197 110 -48 -157 51
2739 51 33 216 86 -230 133 243 246 -198 -79 154 -468 60 76 13 148 -40 -24 117 146 21 -240 86 255
2762 255 49 -80 -398 85 183 -172 -133 -168 226 -118 -279 -162 -68 -44 -359 -391 134 60 33 -118 -54 139 22
2785 22 -144 267 145 -81 -244 -64 -39 -161 -26 90 49 84 13 -151 -264 226 78 129 10 278 -134 165
2807 165 282 -305 173 32 -142 100 79 262 -95 -136 -215 1 -71 -142 71 -60 -23 239 383 36 -146 233
$$ packed form
2648d83K87l7J88j22k00M39j9j40j5K26j31m71L82J6K91%l3p4j36L4J38L6l33
2671a57J24J68j39p4J88J21j66l63M44j55k22j63K52J20M3j35QK69n6k70K36L33
2693D06l30k71N54l25j26q4k8K25k07J39N0j45k3j8L68j21N4l01R8L28j81j2q8
2716c8J47k12J49j08J0N62o43J11R9j30m6L05n22L18m3N0Q2j3k75L07j58j09K08
2739E1j8J83j30l16L63J10Lm44J19K33o22N28J6o3J35j88J6J41K9j25k61L26J69
2762B55k06j29l18M83R8l55L9l5L94l44j61J17R4K4l15l2N25p4k7j51O4J93j17
2785B2j66M11j22k26j63J80K5j22J35J16m1L5p1j64j13M90j48N1j19K68m12K99
2807A65J17n87M78j41j74K42k1J83l57m1p9K16p2p1K13j31L7K62J44l47j82L79
$$ plain form
2829 233 -306 367 -243 -206 85 -37 190 -11 249 251 52 -160 -206 -201 -211 89 -71 -23 198 -69 -256 27 230
2852 230 44 182 -45 2 -247 281 -310 -268 86 -30 -119 171 -93 67 -26 208 203 319 -56 215 -66 -116
2874 -116 -51 -52 -42 28 -169 70 81 330 -77 -77 253 -137 -101 122 189 322 -142 184 -30 80 58 -40 -48 293 -342
2899 -342 -130 -100 -193 235 42 80 325 -116 91 -149 -149 -136 -167 81 131 -166 -35 -144 -63 -389 -23 190 41
2922 41 -157 -244 -136 -227 -74 -128 -130 193 6 304 280 262 -36 55 33 -60 -21 -267 30 193 -103 -57 272 -2
2946 -2 144 -9 -248 -9 -224 -108 35 132 -244 325 313 73 -422 56 -70 22 91 -132 37 -114 299 -72
2968 -72 -207 93 33 -62 -211 -89 61 97 -71 -14 98 -151 86 300 24 98 20 156 -133 100 -142 -111 -161
2991 -161 -76 131 326 150 133 162 -181 -306 41 13 31 3 266 -260 32 7 -249 24 -200 106 45 -114 135
$$ packed form
2829B33n39O73o10L7K91j22K27k01K60Kj99k12m6Nj0L00j60M8K21k67j87K83K03
2852B30j86J38k27M7k49N28n91M2L54j16q9K90k64J60r3K34nJ16l75K71k81n0
2874a16O5jJ0P0j97K39J1K49m07%L30l90L6K23O7J33m64L26k14J10k2r8qL41o35
2899c42K12L0r3M28j93L8K45m41K07k40%J3l1K48N0k97J31j09Q1l26L66K13j49
2922D1j98q7J08r1J53n4kL23j87K98k4j8k98R1k2r3L9k46K97J63k96M6L29k74
2946bJ46j53k39K39k15J16J43R7l76N69j2k40m95M78j26R2O9k23J69j51M13l71
2968g2j35L00o0r5j49J22J50L6j68N7J12k49K37K14k76P4p8J36k89K33k42L1n0
2991a61Q5K07J95j76j7K9l43j25L47k8J8k8K63n26K92k5k56K73k24L06o1j59K49
$$ plain form
3014 135 109 -214 239 7 79 -53 -94 154 24 -39 89 30 119 -38 31 -102 236 -275 -194 264 -237 -1 214
3037 214 283 -175 -202 193 -198 205 -26 -95 15 -128 -164 170 -234 -82 45 -184 -8 -58 125 -214 -40 -36
3059 -36 225 31 -30 6 100 21 -101 181 -92 -220 -82 -48 -173 -34 506 43 -250 -209 407 -174 -144 -49 15
3082 15 23 -24 172 -226 53 45 -238 -306 16 22 -25 36 98 468 -78 -35 -250 44 76 -101 80 205 418 -95 -158
3107 -158 19 180 -39 68 -211 93 39 -14 181 179 148 89 -209 -178 -172 24 146 -29 180 -81 -81 134 -2 -186
3131 -186 -104 -49 -151 -128 -186 -48 -105 -46 -34 145 249 58 -74 204 90 166 -56 184 -31 15 315 285 -124
3154 -124 -204 -112 -54 174 108 -320 18 117 -74 -42 125 -124 -219 -295 -194 -266 358 41 212 -64 209 -229 132
3177 132 -202 -209 -160 -134 141 -7 71 -122 -5 63 -205 -35 -260 -126 187 111 -8 158 -31 432 141 -157
$$ packed form
3014A35k6l23M53k32P2j32m1K48j30o3J28n9Q9j57O9j33L38n11Q1M58n01K36K15
3037B14O9m58k7L95l91M03k31o9J10j43l6L34m04J52J27k29J76n0J83l39J74M
3059c6K61j94o1L6R4p9j22K82k73j28J38L4j25J39N40m63k93M1O16n81L0R5O4
3082A5Qm7J96l98K79qk83o8L22Om7O1O2L70n46M3k15K94L2j77J81J25K13n13o3
3107a58J77J61k19J07k79L04n4n3J95kl1n9k98L1OJ96J22j75K09k61%K15j36j84
3131a86Q2N5j02K3n8J38n7N9J2J79J04j91j32K78j14P6k22K40k15M6L00l0m09
3154a24q0R2N8K28o6m28L38R9j91L2J67k49r5p6J01p2O24l17J71k76K73m38L61
3177A32l34pM9K6K75j48P8j93J17O8k68J70k25J34L13p6j19J66j89M63k91k98
$$ plain form
3199 -157 -257 -17 334 200 -230 225 -6 491 -21 -26 193 -114 -5 29 -26 17 26 55 92 -19 -153 -114 11
3222 11 -14 43 30 163 11 -340 -8 14 194 -403 -131 165 -19 -23 153 -277 109 83 -299 -108 -315 84 102
3245 102 170 11 -90 -21 -60 -267 -3 -168 23 158 102 -185 -407 205 29 -390 -238 -189 -401 -17 312 257
3267 257 111 182 202 -14 -82 -1 45 -9 75 -55 -83 281 222 -61 -48 -121 183 -50 143 2 33 -219 29 225
3291 225 -41 0 247 104 16 -507 -243 -117 -167 49 129 95 -208 -167 31 12 -200 -114 -89 -60 106 48 -141 86
3315 86 138 333 40 -145 -100 423 199 -90 1 -31 107 76 -8 231 475 -291 47 -41 88 -32 269 127 -302
3338 -302 60 -55 -290 -146 133 7 86 17 -155 -118 -177 230 57 -22 -166 -77 79 -14 10 41 -150 159 74
3361 74 -3 25 2 -226 -63 21 -250 -128 -86 89 -36 -38 -256 129 -32 122 1 117 -75 298 -224 -361 137
$$ packed form
3199a57j00K40L51j34m30M55k31M97n12nK19l07J09L4n5M3RK9L7j11j34L9J25
3222A1k5N7j3J33j52l51L32K2J80n97K72K96j84mJ76m30L86k6l82J91k07L99J8
3245A02O8j59j01O9l9k07K64j65J91J35n6k87k22O12j76m19J52M9k12L84L29n5
3267B57j46P1K0k16o8Q1M6n4Q4j30k8L64n9k83J3p3L04k33J93j41L1k52K48J96
3291B25k66M1K47j43q8n23K64J26n0K16Q0l4l03M1J98j9k12Q6K5K9J66n8j89K27
3315H6N2J95k93j85M5N23k24k89R1l2J38l1q4K39K44p66L38q8J29j20L01j42m29
3338c02L62j15k35J44K79j26P9o9j72L7n9M07j73p9j44Q9J56r3K4L1j91L09q5
3361G4p7K8k3k28J63Q4k71J22M2J75j25kk18L85j61J54j21J16j92L73n22j37M98
$$ plain form
3384 137 179 84 -84 226 157 -169 42 347 -49 163 66 293 14 93 6 66 -145 258 -45 129 -55 12 -125
3407 -125 -80 -73 -40 -280 -83 -113 107 267 97 174 -99 -84 -84 5 -105 106 -307 58 177 125 265 63 75 -33
3431 -33 293 201 -359 -51 -85 -119 -21 -115 212 72 -238 -44 211 57 54 -10 -171 4 76 -131 35 287 -260
3454 -260 -204 -232 110 -38 20 -100 175 -1 0 -63 -126 86 116 28 117 -92 -203 84 102 -41 80 -80 -99 519
3478 519 -206 239 -75 -125 161 -59 -28 113 -88 -157 132 337 203 -61 -53 229 46 -80 317 97 104 229
3500 229 -50 -94 -51 140 -5 127 363 142 234 23 -108 300 -225 -108 -62 43 200 -68 -132 -178 -30 69
3522 69 151 -77 -20 46 -145 -406 -265 197 -107 94 189 112 35 -47 153 -331 187 8 -84 -194 4 -143 -195
3545 -195 -229 -24 -98 212 -98 -65 154 101 473 -10 -70 4 -82 545 -151 -397 -31 69 265 221 4 59 201
$$ packed form
3384A37M2r5j68L10o9l26K11L05l96K12r7K27k79P9q7O0k11M03l03J74j84O7j37
3407a25M5PL3k40J97l0K20J60j70P7k73J5%Q9j10K11m13L65J19n2J40k02J2j08
3431c3L26r2n60L08l4l4R8r4L27j40l10J94K55j54lo4j61J75P2k07J66K52n47
3454b60N6k8L42j48N8j20K75j76Jo3o3K12L0q8Q9k09j11K87J8j43J21j60j9O18
3478E19p25M45l14n0K86k20L1J41k01o9K89K05j34k64QK82j83j26L97k20PJ25
3500B29k79m4M3J91j45J32K36k21R2k11j31M08n25J17M6J05J57k68o4m6J48R9
3522F9Q2k28N7O6j91k61J41M62l04K01R5p7p7q2K00m84N18j79r2j10J98j47n2
3545a95l4K05p4L10l10L3K19n3L72m83o0P4q6O27o96k46L66J00J96m4k17N5J42
$$ plain form
3568 201 -150 -443 87 -35 203 -27 39 -205 -73 -145 -59 128 69 -96 292 -126 -60 -44 -43 -104 39 -107 -57
3591 -57 24 -143 357 -98 127 155 -409 61 233 -17 319 -14 -103 -12 -166 154 32 249 217 131 -197 -293 115
3614 115 432 -39 137 134 -82 -20 179 -131 -172 -363 23 -24 -208 38 -13 -119 205 -7 -152 74 -83 16
3636 16 169 105 5 -105 147 140 -17 83 106 -36 55 -127 -42 49 -323 54 -76 50 114 -167 42 241 84
3659 84 78 113 161 73 90 -176 2 240 -89 -1 -213 147 -24 40 175 51 153 -67 -33 141 346 97 4 -91
3683 -91 -219 -77 -86 90 -338 -8 271 343 347 -12 -17 -303 -69 -274 21 71 178 -219 23 -107 -206 -160 -155 -135 -284
3708 -284 105 -37 208 -304 -378 -65 -163 57 177 -20 -120 -75 89 168 -190 131 17 -11 133 -89 31 -124
3730 -124 47 -79 -106 -97 -29 141 -143 70 54 103 150 44 -74 -115 182 -91 -22 -48 -144 94 -128 -51 -110 -572
$$ packed form
3568B01l51k93N30j22K38k30O6k44J32p2Q6J87n9j65L88m18O6J6Jo1J43j46N0
3591e7Q1j67N00m55K25K8n64M70J72k50L36l33q9R1j54L20j22K17l2q6l28r6M08
3614A15L17m71J76lk16O2J99l10m1j91L86m7j84K46n1j06L24k12j45K26j57R9
3636A6J53o4j00j10K52pj57J00K3j42R1j82Q5R1l72L77j30J26O4k81K09J99j57
3659H4oL5M8q8J7k66J78K38l29Q8k12L60j71O4J35j24J02k20L4J74K05k49r3r5
3683i1j28J42rJ76m28L30K79P2Ml59nk86K34k05K95N0J07l97K42j30r9M6NK0j49
3708b84L89j42K45n12p4L13r8K20J20j97j00M5J64P9l58L21j14k8J44k22J20j55
3730a24J71j26k7RO8J70k84K13j6M9M7j06j18m1K97k73O9k6r6K38k22P7n9m62
$$ plain form
3754 -572 -402 62 -165 -175 7 -34 31 -189 -32 43 -5 40 21 252 30 14 -334 -137 -149 -33 205 -142 -332
3777 -332 245 -267 100 -143 -90 -89 -47 57 -221 329 88 153 108 168 -187 46 -70 -87 -233 -46 48 386 -83
3800 -83 -254 70 -324 -235 115 -77 140 77 32 286 -310 -252 38 -178 119 121 102 154 -105 -21 20 256 26 32
3824 32 -195 8 18 -153 13 -94 -121 77 -232 -121 -32 -6 247 -168 -58 -20 -141 141 -164 209 -210 -134
3846 -134 13 108 -108 -57 12 256 272 122 155 -53 -225 30 8 -117 145 -201 119 218 276 -144 -120 -297 196
3869 196 67 -126 29 -91 45 -99 -99 132 29 -171 104 -45 -5 135 -239 304 1 26 309 33 -63 -37
3891 -37 -244 242 86 27 -140 -95 17 -75 -128 82 176 192 68 61 -328 153 115 218 106 -242 57 152 69 -53
3915 -53 -287 114 164 136 -62 -236 -345 11 -122 227 -12 7 160 -18 126 -147 208 -7 -30 254 31 71
$$ packed form
3754e72J70M64k27j0J82m1O5k20J57P5m8M5j9K31k22j6l48J97j2J16K38l47j90
3777c32N77n12L67k43N3JM2J04k78N50k41O5m5O0l55K33j16j7j46J87R4L38m69
3800h3j71L24l94Q9L50j92K17o3m5K54n96N8K90k16K97Kj9N2k59Q4M1K36k30O
3824C2k27K03J0j71J66j07k7J98l09J11Q9K6K53m15J10L8j21K82l05L73m19P6
3846a34J47R5k16N1O9K44J6j50L3k08j72K55k2j25K62l46L20R9N8m20K4j77M93
3869A96j29j93J55j20J36j44%K31j03k00K75j49M0J40l74N43l03K5K83k76r6K6
3891c7k07M86j56n9j67M5J12r2n3K10R4J6j24pl89M81l8J03j12l48K99R5q3j22
3915e3k34M01N0k8j98j74j09L56j33L49k39J9J53j78J44k73L55k15k3K84k23M0
$$ plain form
3937 71 -28 -54 117 385 -271 -94 14 -24 -78 90 -156 128 293 140 -55 -66 175 -4 -42 -5 -60 4 262
3960 262 4 168 115 -14 -55 225 137 70 44 162 -129 -194 8 124 107 -121 -165 -76 -21 19 73 78 -120 141 -45
3985 -45 99 222 95 -21 26 -111 -82 119 -16 -138 -54 52 16 251 50 113 -33 -70 -246 -159 73 115 28
4008 28 212 -128 -36 40 -86 94 206 100 75 -53 -135 50 181 -202 -20 -56 -187 -270 207 312 -135 -24
4030 -24 -310 -2 -45 82 -34 51 -298 -196 -27 -52 339 101 98 47 -90 -137 -63 45 -244 198 -69 245 100
4053 100 184 95 45 -10 240 111 -19 -108 -28 162 24 168 94 97 -127 224 42 -108 -45 4 30 12 -146 35
4077 35 -74 -146 -94 -235 -27 60 210 178 -42 -55 -75 11 -290 129 81 10 118 -17 -100 -21 46 -204 -149 -73 103
4102 103 -173 171 -19 327 -91 198 85 -81 76 -160 47 168 45 -146 -263 94 118 41 -106 -433 189
$$ packed form
3937G1r9k6J71K68o56J77J08l8n4J68k46K84J65j53j95j1K41j79l8L7n5O4K58
3960B62k58J64n3j29m1K80q8o7k6J18k91o5K02J16j7k28m4Q9N5M0N4Nj98K61j86
3985d5J44J23j27j16M7j37K9K01j35j22Q4J06l6K35k01O3j46l7j76Q7K32M2q7
4008B8J84l40R2P6j26J80J12j06k5j28q2J85J31l83J82l6j31q3M77J05m47J11
4030b4k86L08m3J27j16Q5l49J02J69k5L91k38ln1j37m7P4J08k89M42k67L14j45
4053A00Q4q9n0n5K50j29j30q9Q0J90j38J44p4Lk24L51j82j50O3M9K6j8j58J81
4077C5j09p2N2j41K08Q7J50l2k20j3k0Q6l01M19m8p1J08j35q3P9O7k50N5P6J76
4102A03k76L44j90L46m18K89j13j66J57k36K07J21j23j91j17L57K4p7j47l27O22
$$ plain form
4123 189 -203 426 268 -141 -12 8 338 -309 -30 97 124 -90 62 -77 -145 -46 90 119 48 -183 6 330
4145 330 -52 159 60 89 133 185 79 -74 156 99 226 61 -177 14 106 -108 110 -25 5 -164 -346 -126
4167 -126 -228 -212 -119 -23 -275 343 116 -13 36 -163 -186 -39 -133 -122 -84 67 143 -3 16 -3 -280 -341 -60 83
4191 83 58 58 214 110 137 95 -260 -87 -276 -122 196 25 118 -41 -143 -306 222 -37 31 -91 -155 150 -86
4214 -86 -366 137 208 58 -195 54 -79 59 -209 -115 -168 -192 11 30 -8 -333 -51 -53 113 -233 -153 -31 -42 -180
4238 -180 -29 132 31 176 242 -9 43 281 -185 157 -33 -90 135 -217 -173 -152 -86 350 87 101 -147 -334
4260 -334 -259 216 -275 200 -105 55 -132 -82 -48 165 -123 11 255 118 28 193 48 107 269 -258 -262 -118
4282 -118 34 -166 -412 -233 -102 19 -174 158 -333 117 86 -184 206 63 -164 195 384 -319 226 -254
$$ packed form
4123A89l92O29j58m09J29K0L30o47K79J27K7k14J52j39o8R9J36K9p1k31J89L24
4145C30l82K11r9K9M4N2j06j53K30n7J27j65k38J91R2k14K18j35L0j69j82K20
4167a26j02J6R3R6k52O18k27j29M9j99k3J47r4J1L8J51P6j46J9j9k77o1K81J43
4191H3k5%J56j04K7m2l55J73j89J54L18j71R3j59j02j63N28k59O8j22o4L05k36
4214h6k80N03P1j50k53K49j33J38k68R4n3k4K03J9l8l25K82kJ66l46Q0J22j1j38
4238a80J51J61j01J45O6k51N2K38m66L42j90n7K25l52M4K1O6M36k63J4k48j87
4260c34P5M75m91M75l05J60j87N0L4K13k88J34K44j37r0J65j45N9J62n27mJ44
4282a18J52k00k46J79J31J21j93L32m91M50l1k70L90j43k27L59J89p03N45m80
$$ plain form
4302 -254 223 142 -8 217 -131 -262 23 -26 -76 255 75 1 -8 16 -5 205 184 -165 115 -262 -148 -64 -70 111
4326 111 -293 173 138 76 27 -64 -96 328 -201 87 -205 58 -166 291 -48 -135 -156 291 -183 -391 241 -314
4348 -314 93 -444 10 204 -45 30 266 -100 -140 88 46 41 -33 -114 38 -141 -89 121 108 -282 186 165 -55
4371 -55 61 89 112 -65 111 139 89 2 -19 -117 -233 33 -53 -78 0 -77 17 -209 -60 -16 -77 -51 -19 56 327 -156
4397 -156 -194 -194 106 -296 2 -126 -85 -130 -172 -50 -221 5 -62 -62 -80 -7 190 97 70 76 -175 -243 67 223 153 -182
4423 -182 -31 -214 -380 -45 332 -52 -238 87 7 57 152 -125 -210 -58 81 134 -271 -69 -156 -121 -52 -288 -11
4446 -11 120 -79 73 17 355 27 164 67 114 -12 166 -42 -380 -76 281 -78 138 -225 -151 190 163 176
4468 176 226 -111 -25 -282 271 -255 -147 116 -144 -102 -125 -61 158 70 22 86 -138 -82 177 219 182 -139 -135 25
$$ packed form
4302b54M77q1j50K25l48j31K85m9n0L31j80p4rK4k1K10k1l49K80l77J14Q4oJ81
4326A11m04M66l5o2m9r1l2M24n29K88k92K63k24M57l39q7k1M47m74k08O32n55
4348c14M07n37M54J94k49P5K36l66m0K28m2np4q1J52j79N2K10j3l90M68k1k20
4371e5J16K8K3j77J76K8n0q7k1r8j16K66q6k5P8p7R4k26J49M4o1K6L2P5K71m83
4397a56l8%L00m02K98j28M1m5m2J22j71K26o7%j8P3J97r3k7Ok51o8L10J56p0l35
4423a82J51j83j66L35L77l84j86L25q0N0R5k77q5J52J39N3m05K02q7L5O9k36K77
4446a1J31j99J52n6L38l28J37r7M7j26J78k08l38L04L57l59K16l63P4L41k7J3
4468A76N0l37Q6k57N53n26J08K63k60M2k3O4K19q8m8O4k24N6K59M2l7l21MJ60
$$ plain form
4492 25 -193 6 -227 -177 -89 -17 88 -34 -7 -34 289 -78 -85 408 -278 259 -120 -90 -127 -113 14 270 -31 -229
4516 -229 241 3 29 -124 -69 -52 136 223 248 367 -14 234 -84 158 -84 -272 73 -29 156 161 -7 114
4538 114 26 341 271 -27 113 91 18 -382 162 -22 11 22 147 99 106 -13 -35 -44 -246 -139 154 102 -112 -64 27
4563 27 -50 133 -186 -47 -91 -62 25 -30 -51 220 -15 -135 170 -179 174 -278 216 81 -394 39 51 -71 28
4586 28 59 151 50 -61 72 -10 -68 -85 82 101 -273 70 -19 -82 114 108 81 115 116 -119 -36 33 229 126 88 65
4612 65 293 62 -155 -187 -35 -170 -222 -70 -90 174 1 152 -274 -160 521 -128 86 295 -159 61 -88
4633 -88 116 295 172 -11 148 -25 358 -186 -127 4 -218 51 -120 -437 74 -188 -6 214 374 231 438
4654 438 276 118 35 123 -35 -420 -194 26 -137 252 -92 460 213 131 86 5 -127 -117 250 -83 32 -40
$$ packed form
4492B5k18J99k33N0Q8P2J05j22K7k7L23l67pM93o86N37l79L0l7J4J27K56l01j98
4516b29M70k38K6j53N5J7J88Q7K5J19l81K48l18K42k42j88L45j02J85Nj68J21
4538A14q8L15p0k98J40k2p3m00N44j84L3J1J25m8Pj19k2rk02J07K93n2k14M8R1
4563B7p7J83l19J39m4K9Q7n5k1K71k35j20L05l49L53m52M94j35m75M33J2j22R9
4586B8L1R2j01j11J33q2n8j7J67J9l74L43q9o3J96ok7L4Jk35Q3O9J96j03l8k3
4612F5K28k31k17l2J52j35n2J52k0K64j73J51m26J14O81o49K14K09m54K20j49
4633h8K04J79j23j83J59j73L83n44N9J31k22K69j71l17N11k62J82K20J60j43K07
4654D38j62j58q3Q8j58l85K26K20j63L89l44N52k47q2m5q1j32J0L67l33J15p2
$$ plain form
4676 -40 -39 -181 -118 180 43 -296 192 123 199 -212 162 -125 -123 99 -11 105 -242 13 -166 -137 -7 248 219
4699 219 244 -22 -26 55 -207 -130 170 -274 -179 256 49 211 -96 -4 -72 -137 61 114 -26 178 64 19 -99 -4
4723 -4 228 39 222 277 -88 41 8 157 18 229 85 -6 -49 61 260 -171 48 -20 28 100 -35 -26 58 -351
4747 -351 218 251 101 39 175 177 -235 -219 -101 -42 -51 147 -35 -20 -215 -12 -70 16 205 -70 431 -88 39 -24
4771 -24 292 87 -279 166 -35 -39 -170 226 109 77 -142 201 -37 106 -119 86 -375 137 -311 -157 187
4792 187 -27 -208 6 -73 -63 102 -178 25 40 -46 322 108 -98 72 16 9 10 -125 324 160 -104 11 145
4815 145 -35 373 -365 24 1 89 -135 -127 -107 169 18 -23 135 247 78 -168 -254 -314 -228 -113 -211 -36 6 -118
4839 -118 -297 460 -66 344 -138 55 117 196 6 -27 -13 -69 54 -112 128 -22 -76 62 -11 25 -429 278 5
$$ packed form
4676d0Jj42O3K98j37l39M88o9P6m11L74k87KK22j10J16l47K55j79K9J30K55k9
4699B19K5k66mQ1k62P7L00m44R5M35k07J62l07R2o8o5J98N3j40K04j14m5j18R5
4723dK32j89J83N5l65J29l3J49j39K11j44r1m3J10J99m31K19o8M8P2j35RQ4m09
4747c51N69L3j50o2J36Km12J6J18N9rJ98j82J5j95K03n8Q6J89k75N01n19J27o3
4771b4L16k05l66M45k01mj31L96j17l2k19L43k38J43k25K05m61N12m48J54L44
4792A87k14j81K14p9J0J65k80K03J5q6L68k14k06J70n6pJj35M49j64k64J15J34
4815A45j80M08p38L89k3Q8k24QK0K76j51m1J58J12j69k46q6o0Q6J15r8J75M2j24
4839a18j79P57n26M10m82J93O2P9j90l3J4n6J23j66K40j50n4J38p3L6m54P07k73
$$ plain form
4862 5 -300 13 -23 71 -242 21 -301 -155 -122 12 -351 -33 75 0 278 -300 -335 277 134 66 202 -48 -158
4885 -158 166 -2 106 59 -6 -196 6 -131 -225 163 -105 -49 122 59 -169 30 -57 -38 10 365 17 -87 -323
4908 -323 43 -59 -188 22 -70 -149 79 -121 3 39 175 -9 145 -27 419 156 0 -120 -107 82 -84
4929 -84 288 -11 -64 -181 2 -1 -320 -107 320 -21 -128 -3 -280 -228 106 -368 -64 -80 174 393 -361 -249
4951 -249 -193 -126 -194 110 128 23 86 -103 -76 230 34 57 34 165 -169 -227 -238 344 125 -98 307 -31 235
4974 235 41 141 73 102 -261 219 -53 138 120 -97 -346 16 -41 -10 -32 10 152 34 89 100 -74 243 -284
4997 -284 55 263 176 73 164 274 115 -84 119 201 -190 -256 -29 -216 155 170 -267 336 -136 -19 -126 78
5019 78 -27 57 -103 238 102 -305 156 208 83 -35 -268 -232 138 -116 -224 -54 295 12 83 15 77 116 201
$$ packed form
4862El05L13l6R4l13K63l22J46L3J34l63L18J08p5K78n78l5O12j43o8J36k50j10
4885a58L24j68J08m7o5j90K02j37r4L88k68N6J71o3k28J99q7J9M8L55l48j04k36
4908c23L66j02j29K10r2p9K28k00J24L6J36j84J54j72M46k63j56j20J3J89j66
4929h4L72k99n3j17J83ll19K13M27l41j07J25k77N2L34m74L04j6K54K19p54J12
4951b49N6O7o8L04J8j05O3j89K7L06j96K3k3J31l34n8j1N82k19k23M05l38K66
4974B35j94J00o8K9l63M80k72J91j8k17k49L62n7L1k2M2J42j18N5J1j74L17n27
4997b84L39K08q7j03R1J10j59j99K03Q2l91o6K27j87L71J5m37O03m72J17j07K04
5019G8j05Q4j60L41j36m07M61N2j25j18k33L6L70k54j08J70L49k83P1o8O2L9Q5
$$ plain form
5042 201 -32 45 297 -162 -10 186 47 152 13 35 91 164 59 322 -236 180 -13 10 -47 65 -30 -66 122
5065 122 246 -175 214 144 -317 -39 90 -154 -127 33 -21 -260 152 -91 -115 -75 -141 58 -270 -59 374 -184
5087 -184 -105 91 309 144 -171 -111 -8 -13 -78 -152 -313 114 -64 51 -173 154 -71 -42 -304 -14 -115 137
5109 137 -204 -10 -95 140 41 -162 -3 -213 118 -181 -77 -96 -173 -207 -131 -148 105 -70 -157 19 369 -155 -44
5132 -44 -9 183 -194 76 -75 -9 179 99 -24 -169 163 -79 123 -473 274 137 10 11 -102 -238 264 -248
5154 -248 -73 217 -26 -332 -80 -244 221 -55 -53 115 47 44 71 4 -11 -259 -315 -47 -19 -17 -66 24 -31 174 157
5179 157 -28 92 42 39 246 99 -49 -130 187 -5 382 -115 -181 122 97 -46 -257 78 200 -206 215 -319
5201 -319 94 62 27 -22 106 146 -60 -72 247 202 -71 -46 46 129 -312 -7 69 305 -155 120 232 1 -93 263
$$ packed form
5042B01k33P7K52m59J52J96j39J05j39K2N6P3j05K63n58M16j93K3n7J12r5l6J88
5065A22J24m21L89p0m61K78J29k44K7J60n4k39M12k43k4M0o6J99l28K11M33n58
5087a84P9J96K18j65l15O0J03no5p4j61M27j78J15k24L27k25K9k62K90j01K52
5109A37l41J94q5K35r9k03J59k10L31k99J04j9p7l4P6j7K53j75q7J76L50n24J11
5132d4L5J92l77K70j51O6J88q0j23j45L32k42K02n96P47j37j27Jj13j36N02n12
5154b48J75K90k43l06K52j64M65k76KJ68o8lK7o7j5k48n6K68K8Km9R0n5K05j7
5179A57j85J20n0lK07j47j48q1L17j92L87m97o6L03k5j43k11L35J22m06M21n34
5201c19M13l2l5m9J28M0k06j2L19m5k73K5R2Q3m41L05P6K36m60K75J12k31r4L56
$$ plain form
5225 263 62 -6 -33 239 -80 -156 -74 -189 196 -126 -371 169 -140 102 330 296 42 -55 269 -182 125 160
5247 160 -323 48 367 -248 71 377 -84 -221 23 139 211 98 -65 84 70 134 291 -276 -157 89 68
5268 68 33 231 -46 16 30 -328 -172 205 80 51 -226 -231 -94 -48 -45 30 155 3 380 349 -208 39 -64 -164
5292 -164 384 -316 -57 51 75 -81 171 -144 42 80 111 175 52 -48 -50 103 -77 406 179 71 227 294
5314 294 362 8 -213 28 -205 147 -25 151 75 -32 -105 -205 -149 -132 -210 -181 -111 -3 168 75 12 -334 159
5337 159 -79 -141 -35 -59 -205 -274 133 -185 -296 68 -156 -112 -206 43 -114 114 76 171 392 174 -68 74
5359 74 160 97 -271 40 -266 -624 -157 -7 156 -132 -373 -77 -57 -206 -34 -119 146 187 77 -14 -95 8 -79
5382 -79 30 -174 49 -107 -190 102 -109 125 187 -37 271 301 -66 -56 182 52 -104 15 9 -190 -30 -277
$$ packed form
5225B63k01o8k7K72l19p6Q2j15L85l22k45N40l09K42K28l4k54r7L24m51L07L5
5247A60m83L71L19o15L19L06m61j37K44J16P2j13j63J49j4O4J57n67J19K46k1
5268F8l5J98k77O2J4l58J56L77j25k9k77nJ37M6LP5J25j52L77l1n57K47j03j00
5292a64N48p00K59J08K4j56K52l15J86L8L1O4j23j00kJ53j80M83k27j08J56O7
5314B94O8l54k21K41k33L52j72J76p6j07p3j00N6J7p8K9P0J08J71r3o3l46M93
5337A59k38o2J06k4j46o9M07l18j11L64k24M4r4K49j57K28l8R5K21k18k42J42
5359G4Q6o3l68L11l06l58M67J50J63k88k41K96K0j49J72q5K65M1j10r1q1J03q7
5382g9J09k04K23j56q3K92k11K34O2k24L08L0l67J0K38j30j56J19oj99J60k47
$$ plain form
5404 -277 166 -82 -44 190 79 59 65 22 -104 113 224 -130 159 192 -145 75 -274 -219 -59 -385 78 27 -234
5427 -234 321 -39 -10 -178 -186 -75 -132 -235 208 -61 -28 227 -62 146 -128 113 -97 24 103 98 127 -158 -172
5450 -172 -209 65 144 116 19 150 88 6 149 134 36 -74 316 73 -66 302 -223 204 176 10 -112 -358 -4
5473 -4 -201 -167 40 -57 127 96 -266 -233 -39 97 -197 236 97 101 -96 -114 -235 -172 10 33 183 -86 -13 162
5497 162 -38 30 -31 89 268 275 68 147 -277 -4 -84 23 -161 104 -215 307 -10 -94 -122 -25 117 30 -288
5520 -288 -118 -154 146 277 231 23 -123 -218 -283 3 105 -113 318 -82 -205 -20 15 -89 -242 47 49 123 -79
5543 -79 -309 174 50 0 41 -295 131 -181 -182 -149 109 -159 86 152 39 53 51 -205 -2 -48 -376 -241 -20 -101
5567 -101 111 -210 189 134 133 24 293 118 -105 121 -17 407 103 196 92 -295 -323 305 276 -244 -65 -79
$$ packed form
5404b77M43k48L8K34j11k0Om3j26K17J11l54K89L3l37K20l49N5J60l26M63n1k61
5427b34N55l60K9j68qJ11n7j03M43k69L3K55k89K08k74K41k10J21P9nK9k85j4
5450a72l7K74P9k8r7J31o2q2J43j5r8j10L90k43j39L68n25M27k8j66j22k46L54
5473dj97L4K07r7J84l1l62L3J94J36k94M33j39Mj97j8j21O3J82K3J50k69P3J75
5497A62k00O8o1J20J79Pk07P9m24K73q0J07j84K65l19N22l17q4k8R7J42q7l18
5520b88J70l6L00J31m6k08j46r5o5K86J02k18M31m00j23J85L5j04j53K89KP4k02
5543g9k30M83j24n0M1l36M26l12jL3K58k68K45O6j13J4kk56K03m6l28J35K21q1
5567a01K12l21L99n5jj09K69j75k23K26j38M24l04R3j04l87k8O28k9n20J79j4
$$ plain form
5589 -79 -48 -157 330 206 212 -66 -167 -44 -148 363 105 -175 403 90 -125 183 -153 87 -210 -171 -12 40
5611 40 -123 12 -73 -1 -55 91 -83 -378 -21 313 2 56 159 -116 73 81 -96 -216 136 24 -86 -83 -160
5634 -160 -73 -122 -22 121 23 337 219 147 79 -98 295 81 -110 -86 -35 90 -60 -271 -89 -353 -153 -100 222
5657 222 -148 9 263 -195 -42 112 -38 -161 -150 -47 -261 123 138 12 -221 90 -235 -121 22 -4 -120
5678 -120 -142 -70 112 7 -18 9 206 31 107 -6 39 221 -118 -2 6 44 -156 -39 -116 343 -94 -78 89 -23
5702 -23 80 -341 -114 -98 33 7 -68 315 260 79 165 44 64 68 -116 -47 -436 112 276 -89 12 -400 -167
5725 -167 -138 -34 -120 111 44 -145 148 63 23 95 22 -155 25 -234 4 -176 101 222 -103 -129 -78 82 -100
5748 -100 72 57 181 -102 -103 -117 -34 -221 -157 220 -86 -75 -232 20 -92 43 31 -46 34 -10 18 -63 -22 -222 166
$$ packed form
5589g9L1j09M87j24Ok78j01J23j04N11k58k80N78l13k15L08l36K40k97L9J59N2
5611D0j63J35q5P2n4J46j74k95L57L34l11N4J03k75J89Qj77j20L52j12j10Lp7
5634a60Q7m9J00J43r8L14j18p2o8j77L93k14j91K4N1J25j50k11J82k64K00N3L22
5657B22l70J57K54m58J53J54j50j23J1J03k14L84J5j26k33L11l25J14J43k6j16
5678a20k2P2J82j05k5K7J97j75P6j13M5J82l39J16QL8k00J17p7M59m37J6J67j12
5702b3J03m21K27J6J31k6p5L83n5j81Q6j21K0Mj84O9l89N48J64l65J01m12K33
5725a67K9J04q6K31o7j89K93q5m0P2p3j77J80k59K38j80K77J21l25k6N1J60j82
5748a00J72j5J24k83jj4Q3j87O4L77l06J1j57K52j12J35j2p7Q0m4K8q1M1k00L88
$$ plain form
5773 166 51 501 42 62 149 -431 35 38 13 -24 -30 281 186 -109 53 -84 -9 -257 -171 -167 -292 140 -133 93
5797 93 142 -27 105 320 50 -159 127 -51 -48 122 231 -89 -252 -235 125 16 225 6 -183 48 -118 224
5819 224 -46 -44 316 -252 -287 103 35 163 303 21 29 233 -53 155 377 -160 -81 0 355 -130 -456 333 -133
5842 -133 58 -7 69 179 -64 84 -124 472 26 228 40 345 -132 114 77 254 -85 -294 -36 -85 3 -534
5864 -534 -274 203 -92 99 -37 -72 -1 173 -45 -84 46 -185 -95 95 56 54 -12 203 152 51 -153 -207 -113 273
5888 273 -67 -13 18 -87 -217 -105 -157 12 38 -350 238 -208 -77 -211 15 30 181 76 -337 -302 169 123
5910 123 122 255 114 -188 -100 97 119 -288 -189 2 -44 -95 -43 -187 61 -73 -339 398 31 229 160 -121 -201
5933 -201 11 24 201 90 12 43 127 -195 22 146 185 245 154 -330 -198 -142 -15 -20 166 -117 -11 135 99 269
$$ packed form
5773A66j15M50m59K0Q7n80M66Lk5l7oL11r5k95J62j37P5k48Q6Mj25M32k73K26
5797I3M9j69J32K15k70k09K86j78LJ70J09l20j63J7L60j09K09k19j89K31j66L42
5819B24k70KL60n68l5L90o8J28J40k82QK04k86K08K22n37P9Q1L55m85l26P89m66
5842a33J91o5P6J10k43J48k08N96m46K02j88L05m77K46l7J77l39k09K58m9Q8n37
5864e34K60M77k95J91j36l5P1J74k18l9J30k31R0J90l9ko6K15n1j01k04n4R4L86
5888B73l40N4L1j05j30J12n2J69K6l88N88m46J31j34K26J5J51j05m13L5M71m6
5910A23jJ33j41l02Q8J97K2m07R9J91m6n1N2j44K48j34k66P37l67J98o9k81q0
5933b01K12J3J77j11p8L1Q4l22K17J24L9O0r1m84J32N6J27nJ86k83J06J46l6J70
$$ plain form
5957 269 -97 114 -166 -73 -122 -42 -62 -107 21 -20 137 -289 -95 334 125 191 39 -512 -20 153 45 -36 58
5980 58 36 23 -241 -129 -150 44 -110 361 48 -240 79 -115 27 -15 111 168 31 -42 -43 -25 245 -112 34
6003 34 177 0 203 69 321 -157 -84 316 -5 230 -61 -96 166 76 -189 234 -195 -88 51 58 -290 129
6025 129 377 241 154 49 87 220 -48 9 -61 80 -66 -127 312 -89 105 80 101 -113 71 135 -162 160 -101
6048 -101 58 -218 40 58 8 129 223 -281 65 -155 31 -229 140 -133 -50 -94 -1 -151 -103 317 -186 109
6070 109 -73 267 80 -132 -152 -169 -128 -309 -77 171 -196 230 -348 -217 -183 -166 -218 -169 109 197 210 -82 -78 146
6094 146 243 -207 74 -253 -264 -23 -83 166 78 -185 -220 70 -54 -23 33 132 31 12 156 158 -30 88 132 183
6118 183 -205 -41 -142 37 -307 190 102 209 16 -24 58 408 353 225 279 79 121 24 201 -27 65 -138 106
$$ packed form
5957B69l66K11k80R3m9Q0k0m5J28m1J57m26J94M29k09O6j52n51M92J73j08q1R4
5980E8k2j3k64J12k1J94j54M71l13k88L19j94J42m2J26N7j37p3jJ8K70l57J46
6003C4J43j77K03j34K52m78P3M00l21K35k91l5K62r0k65M23m29J07J39Pl48M19
6025A29K48j36q7j05L8J33k68N7p0J41j46o1M39m01J94k5K1k14J84O4k97L22k61
6048a01J59k76K58J8n0J21R4n04L46k20J86k60L69k73Q3m4R3j50M8M20n03K95
6070A09j82L40j87k12k0j7M1j81K32K48l67M26n78J31L4J7n2M9K78Q8J3k92MK24
6094A46R7m50K81l27j1K41o0K49q8k63l5K90j24L1N6R9j01j9J44Kj88J18M4N1
6118A83l88J64j01J79l44M97q8J07j93m0Q2L50n5j28N4k00M2r7J77k28R2k03K44
$$ plain form
6141 106 84 159 195 26 -201 -4 -241 -161 -31 -63 264 241 -39 113 55 -129 -33 15 -105 22 12 -71 -252 -5
6165 -5 -124 -200 342 -5 250 -129 -29 -142 97 -157 145 -82 -41 10 120 251 225 59 -267 45 84 -177
6187 -177 -57 -13 -21 393 -70 70 237 126 30 -305 63 350 -17 63 41 99 1 133 90 130 29 106 -109 -102
6211 -102 -68 -107 339 -117 -96 -110 -109 289 -149 -36 -40 187 123 -214 122 -268 -296 -70 222 138 -205 111 -211 112
6235 112 -161 195 251 5 222 195 59 -9 18 -87 124 262 70 342 114 70 -257 362 204 -173 206 -210
6257 -210 145 193 329 194 -338 37 -220 269 171 125 16 209 128 -178 -75 115 100 161 -280 112 74 -94
6279 -94 149 -162 202 28 211 197 -178 119 -111 -188 -163 -12 32 -68 -131 -121 -120 87 -138 11 174 -238 158
6302 158 182 265 116 -126 347 -139 -69 -39 -201 -108 183 98 68 274 85 68 -287 -20 34 -224 93 -34 -103
$$ packed form
6141A06k2P5L6j69k27J97k37Q0J30l2L27k3k80J52n8j84R6M8j20J27j0q3j81K47
6165ej19p6N42l47K55l79J00j13K39k54L02k27M1N1J10J31k6j66l26L12L9k61
6187a77J20M4qM14m63J40J67j11r6l35L68K87l67Q0k2N8r8J32m3M0j01P7k15P
6211a02L4l9M46m56K1j4JL98m38J13mK27o4l37L36l90k8K26K92q4l43L16l22L23
6235A12k73L56N6k46K17k7j36o8K7j05K11J38j92K72k28m4l27O19j58l77L79m16
6257b10L55M8J36j35n32L75k57M89r8m6j09J93q1l06J03J90j5O1m41L92l8j68
6279i4K43l11L64j74J83j4l75K97k30p7K5J51M4j00o3J0JK07k25J49J63m12L96
6302A58K4Q3j49k42M73m86P0L0j62R3K91q5l0K06j89j7l55K67N4k58L17j27o9
$$ plain form
6325 -103 0 28 141 301 230 140 23 11 70 -244 35 -88 -53 12 164 178 -46 -80 48 147 345 -229 -137 185
6349 185 -66 99 195 71 -92 5 122 -65 -51 -177 -113 112 176 38 212 -309 84 189 -99 329 179 117
6371 117 107 -40 64 135 -142 363 -9 -4 30 -18 -19 193 -315 -124 -142 -125 -36 -84 -18 -266 147 190 94 -117 39
6396 39 -156 64 205 121 127 -66 -80 -256 -288 192 122 90 9 500 27 -104 -179 168 259 -166 -121 -97 110 299
6420 299 -158 138 -242 -106 76 -92 191 33 -7 93 24 -11 -49 -170 235 -237 101 -119 -21 -213 181 -99
6442 -99 -79 -343 88 37 -378 -290 120 120 -339 -92 -146 55 -170 -235 -99 -140 -302 167 -172 100 291 143 111
6465 111 431 178 321 -4 257 -271 -46 179 -233 -129 -278 71 -360 234 -187 155 218 -113 21 -145
6485 -145 120 123 166 -163 -216 -29 -160 -153 53 25 -396 -103 -200 38 -57 37 -155 -56 251 -301 65 201 92 267
$$ packed form
6325a03J03K8J13J60p1r0j17j2N9l14K79j23L5O5J52J4k24l4J28R9J98n74R2L22
6349A85k51J65R6j24j63R7J17j87J4j26O4K25O4j38J74n21L93J05k88M28j50o2
6371A17j0j47J04P1k77N05l72NL4m8jK12n08J91j8J7Q9m8O6k48M13M3r6k11J56
6396C9j95K20J41q4Oj93j4j76l2M80p0l2q1M91m73j31p5L47R1m25M5K4K07J89
6420B99m57K96l80J36J82j68K83j58m0J00o9l5l8j21M05m72L38k20R8j92L94k80
6442i9K0k64M31n1m15Q8M10%m59K47n4K01k25o5J36m1j62M69l39K72J91j48l2
6465A11L20k53J43l25K61n28K25K25m12J04j49L49m31N94m21L42O3l31J34j66
6485a45K65LM3l29n3J87j31PK06k8m21K93r7K38r5R4j92R9L07n52L66J36j09J75
$$ plain form
6509 267 -219 7 27 -117 129 135 -90 -110 357 -175 -124 -261 64 -45 -33 -241 -23 95 33 157 21 25 79
6532 79 98 212 -111 269 -156 93 -110 7 322 54 191 -299 -176 63 -57 127 93 110 294 223 42 207
6554 207 208 183 47 -73 188 -18 149 -338 -217 9 176 98 -46 -211 -255 216 -96 189 -68 -64 -91 -19 245
6577 245 -242 -236 -299 72 -258 154 43 42 202 -165 -100 -98 0 -145 -144 102 204 9 74 139 41 120 183 124 -55 -178
6603 -178 44 239 190 259 149 93 67 158 202 -145 -114 80 79 45 124 -127 -72 -57 251 -86 -24 -387 129 72 5
6628 5 -311 -26 113 225 -429 116 -54 -50 -390 -51 28 37 387 57 -18 -226 55 28 -321 250 3 -37 13 53
6652 53 -237 108 290 68 116 -27 -168 81 34 -80 -105 -11 297 -271 -29 -133 228 349 -180 89 86 -140
6674 -140 373 30 110 23 7 -116 -43 -120 176 -309 -109 305 -33 151 177 -137 130 21 -91 152 -82 180
$$ packed form
6509B67m86K26K0j44K46Ok25k0M67n32N1j37L25j09J2k08K18J18o2J24j36MN4
6532G9J9J14l23L80m25K49k03J17L15k68J37m90J23K39j20J84l4J7J84p1j81J65
6554B07Jk5j36j20K61k06J67m87J21K26J67p8j44j65m4M71l12K85k57Mk7P2K64
6577B45m87Oo3L71l30M12j11jJ60l67O5KR8j45JK46J02j95O5O5r8P9O3n9j79j23
6603a78K22J95m9O9j10n6k6R1M4l47L1J94jl4P9k51N5J5L08l37O2l63N16n7o7
6628El16K85J39J12o54N45j70Ml40L39P9RL50l30p5k08K81k7l49N71k47m0N0M0
6652E3k90L45J82k22M8j43j41K49m7j14k5R4L08n68K42j04L61J21n29K69lk26
6674a40N13l43Q0q7j6j23P3p7K96m85K00M14l38J84K6l14K67j09j12K43k34K62
$$ plain form
6696 180 104 79 -73 86 264 -81 -137 114 -259 -104 95 -70 105 -70 66 -148 -2 -173 -191 86 -59
6717 -59 171 298 -322 -127 -82 -20 151 -55 85 172 175 -87 -138 -28 -75 49 -56 177 237 90 201 -170 -41
6740 -41 -310 34 -139 66 265 46 -71 -456 -120 -36 199 -391 -123 290 148 342 74 -54 -337 -237 65
6761 65 145 -29 125 -42 22 -164 -47 -26 -30 -130 128 80 -198 -59 -302 -10 -58 21 -154 -131 -86 -145 41 140
6785 140 -17 192 -229 -91 -219 -8 169 -114 15 75 -150 -387 -40 37 -31 84 -57 -192 -160 -117 -102 -38
6807 -38 230 28 9 28 53 176 24 -85 352 -191 4 -38 28 -89 16 -135 -110 111 -150 -225 -79 -172 25
6830 25 -260 -151 28 170 -83 -110 115 122 146 -80 119 -103 -210 393 -106 207 74 -163 -24 186 -14 93
6852 93 134 -133 -78 -58 299 179 -141 79 266 318 -296 65 247 157 57 -181 163 92 29 -238 -26 -26 -47 153
$$ packed form
6696A80p6k5j52J59J78l45n6K51l73J55J99j65J75j75J36k14J46j71j8K77j45
6717e9K30J27o20J95M5O2J71k06J40Q7Lk62n1J10m7J24j05K33O0j47J11l71J29
6740d1k69L44j73K05J99k19j17l85L36Q4K35n90K68M13j42J94k68j28k83J00L02
6761F5Q0j74J54j67O4j86J17K1mj00K58m8k78J39k43K92m8P9j75K3M5n9J86R9
6785A40j57K09m21J38j28K11J77k83J29O0k25k37L47P7o8J15j41j35L2M3J5O4
6807c8K68k02j9J9K5J23j52j09M37n43J95m2O6j17J05j51K5K21k61p5J46r3J97
6830B5k85J09J79J42k53k7K25PK4k26J99k22j07O03m99L13j33k37J39K10k00J07
6852I3M1k67N5K0L57j20l20K20J87N2o14L61J82r0j00k38L44p1o3k67K12%k1K00
$$ plain form
6876 153 -101 68 217 -53 -122 -130 -178 -181 170 28 -173 198 -76 54 -303 20 -179 -119 155 -171 -82 118 293
6899 293 210 -121 -35 38 67 103 -261 -92 86 368 59 -88 -49 27 -41 50 -163 -186 -386 -74 -143 -66 107 2
6923 2 278 -474 6 23 -219 390 -51 97 -126 191 203 -269 190 208 71 -283 -309 -45 308 -238 -91 -47
6945 -47 -20 269 5 -39 47 -29 51 -332 49 -66 -26 341 48 -95 49 44 211 -122 148 302 -13 -277 206
6968 206 116 -24 86 223 -22 -439 187 -110 -133 97 -73 263 -201 144 139 -354 -66 -120 40 -166 -125 395
6990 395 -68 -73 8 118 244 245 152 204 -135 -16 -29 -23 246 -24 -145 67 -171 -13 -86 44 28 91 131 176 71
7015 71 -314 -21 233 -7 -117 186 -45 186 -145 90 30 89 13 -204 54 -216 61 14 -27 -177 -86 105
7037 105 -88 492 46 -55 177 -33 33 13 71 224 -92 -47 -61 22 164 -23 107 -63 47 15 27 -84 -194
$$ packed form
6876A53k54J69J49k70o9qm8lL51j42k01L71k74J30l57L23j99O0K74l26Q9K00J75
6899B93q3l31Q6P3K9L6l64J69J78K82l09j47L9P6o8R1k13k3k00L12o9P7J73j05
6923BK76p52M80J7k42O09m41J48k23L17J2m72M59J8j37l54k6K64L53n46J47M4
6945d7K7K89k64m4Q6p6Q0l83L81j15M0L67k93j43J44nJ67l33K70J54l15k64M83
6968B06r0j40J10J37k45m17O26k97k3K30j70L36m64L45nm93K88n4J60k06M1N20
6990C95m63nQ1J10J26Jr3N2l39J19j3OK69k70j21K12k38J58p3J30j6O3M0M5j05
7015G1l85K93K54k40j10L03k31K31l31K35o0N9p6k17K58k70K77m7m1j50R1J91
7037A05j93N80m46j01K32k10O6k0N8J53l16M5j4Q3J42j87J30j70J10l2J2j11j10
$$ plain form
7060 -194 -55 -59 -299 -29 132 211 171 -303 48 77 -251 37 228 54 539 78 262 -59 -110 183 83 -3
7082 -3 90 -72 -90 159 199 65 -120 -64 49 61 160 225 -49 286 -89 -98 -319 125 246 141 -138 -50 -12 6 71
7107 71 -197 -224 -106 77 84 102 48 -124 179 37 -105 -262 -87 89 42 -141 -79 54 -18 208 -200 174 -55
7130 -55 -405 -68 -132 -291 215 211 -9 33 -188 16 -319 -129 97 45 -254 -20 101 53 -16 31 -63 166 135 86
7154 86 245 -180 -125 -13 -80 -24 182 3 -121 -44 -262 -81 64 308 -74 70 24 32 -13 -151 -159 -265 -27 84
7178 84 56 -75 -18 -233 -51 52 95 31 355 -8 64 -25 43 -73 -101 251 90 64 175 175 195 -88 65 42 -52
7203 -52 -237 177 143 70 54 -349 232 157 300 240 -24 138 -464 289 -100 68 246 -283 139 83 134 -138 -49
7226 -49 361 -13 -442 -62 -155 49 11 -79 62 287 -185 167 127 5 -135 137 148 162 105 -17 -78 121 -103
$$ packed form
7060a94J39mk40K70J61P9m0m74L51K9l28K88J91j74M85m61J84l21n1K93j00q6
7082cR3j62j8K49M0j34j85N6J13J2R9O5k74L35l75rk21M44J21j05k79Q8L8J8O5
7107G1k68k7J18J83PJ8n4j72L03j42j42j57J75J76m7j83O2J33p2K26m08L74k29
7130e5l50L37o4j59N06mk20M2k21K04l35J90K26n2k99K34J21m8o9M7r4K29l1m9
7154H6J59m25N5J12o7N6K06j79j24P7k18J81J45K44l82J44m6Qm5j38qj06K38J11
7178H4k8j31N7k15J82J03M3o4L24l63P2q9O8j16k8L52j61k6J11%K0k83J53k3r4
7203e2j85M14l4p3j6m03N81p5J43o0k64J62o02P53l89J68J78n29M22n6N1k72Q9
7226d9M10l74m29L80r3K04l8r0J41K25m72L52m0j22j40K72J1J4n7j22o1J99k24
$$ plain form
7249 -103 175 22 42 -129 74 297 -110 5 93 -94 75 4 344 119 33 -229 -14 212 22 -130 -18
7270 -18 62 67 -114 -122 -14 -130 180 72 -9 -98 -221 -105 -79 191 279 -148 131 -65 -261 -353 -99 -154 -50 115
7294 115 -67 -142 -175 56 105 -53 79 195 17 -180 81 134 -120 196 -18 197 337 2 197 -78 145
7315 145 -88 5 -118 219 -201 -203 134 157 -218 339 152 62 -131 -216 -136 385 -45 -38 22 27 -129 46 -336 125
7339 125 -13 116 63 135 115 192 -174 -67 135 -61 1 -289 -51 -428 236 80 14 92 -116 141 -203 -234 -66
7362 -66 25 -373 -556 -63 -104 186 -112 171 -3 189 -48 -317 -156 76 70 -166 -42 46 -38 331 -99 41
7384 41 182 113 360 132 137 -13 157 135 -63 -63 76 -106 36 74 296 -67 87 192 -161 34 66 -4 33 70
7408 70 147 123 -249 -286 -115 151 -142 -185 12 -17 103 -62 -27 148 59 135 156 -24 254 5 -249 330 -155
$$ packed form
7249a03K78j53K0j71K03K23m07J15Q8j87J69p1L40k25q6k62K15K26j90j52J12
7270a8Q0Nj81qJ08j16L10j08q1q9j23J16K6K70Q8m27K79j96j96r2K54n5J04J65
7294A15j82p5l3K31M9j58J32J16j78j97K61N3k54L16k14K15J40l35J95k75K23
7315A45k33R3j23L37m20kL37K3l75N57j87r0j93q5Q0N21m30PO0Nj56J75l82M61
7339A25j38J29n3P2k0P7l66J07K02j96O2k90K38l77O64j56o6P8k08K57l44l1J68
7362f6R1l98j83M93m1K90k98K83j74J92k37k69J61K32ok36J24Q8q4L69m30J40
7384D1J41o9K47k28Nj50J70k2j98%J39j82J42L8K22l63J54J05l53J95L2p0L7L7
7408G0P7k4l72l7J71K66k93m3J97k9J20j65L5J75q9P6K1j80K78k49k54N79m85
$$ plain form
7431 -155 39 -15 107 -55 123 -230 48 45 -58 -107 85 -1 -121 344 18 81 64 -6 80 197 120 216 59 426
7455 426 197 -127 -242 58 -110 57 -17 12 206 169 165 -54 -351 201 -125 17 248 60 -87 -50 175 -64
7477 -64 4 -109 -66 -29 -94 -206 -59 -73 -115 -110 113 -4 379 -441 -110 110 113 -78 -147 -47 -174 99 -83 -14
7501 -14 -191 -82 -24 -428 46 -179 -231 -56 224 -81 -142 135 169 -93 -312 -78 -117 46 -118 -116 -12 339 -185
7524 -185 -4 83 121 178 108 220 -35 106 -235 -70 123 105 -198 -89 419 -18 -155 11 -13 199 17 100
7546 100 -114 61 -117 -251 19 -245 -291 -292 21 -333 -208 59 18 134 52 85 -123 13 -88 83 -224 -84
7568 -84 -280 -182 -199 -82 -103 256 -92 -258 -462 40 10 133 -26 -178 -139 -82 -65 -40 -118 -42 -75 -40 -163 18
7592 18 -124 10 -153 301 -210 -189 -288 -78 233 410 323 216 -388 9 -93 124 -30 -157 25 -344 37
$$ packed form
7431a55J94n4J22j62J78l53K78lj03m9J92q6j20M65l26O3j7p0Q6J17p7R6j57L67
7455D26k29l24j15L00j68J67p4K9J94l7mk19k97N52l26J42K31j88j47L7K25k39
7477f4O8j13M3L7o5j12J47j4m2NK23j17L83q20L31K20Lj91o9J00j27K73j82O9
7501a4j77J09N8m04M74k25n2J75K80l05o1K77L4k62k19K34l9J63j64KJ04L51n24
7524a85J81Q7L8N7p0J12k55J41l41J65J93j8l03J09N08m37j37J66k4K12j82Q3
7546A00k14J75j78j34K70k64m6jL13l54J25K67m1J16q2L3k08J36j01J71l07J40
7568h4j96R8j7J17k1L59l48j66k04N02l0J23j59j52L9N7J7K5p8P6l3L5j23J81
7592A8j42J34j63M54n11K1r9K10L11J77q7j07o04L97j02K17j54j27J82l69L81
$$ plain form
7613 37 57 -104 25 -64 55 -140 -42 -15 157 324 -145 182 -119 176 -275 -65 157 -82 -49 73 -107 -6
7635 -6 97 64 -172 -82 -28 -203 -94 -80 266 126 -385 -40 -79 -200 82 -104 175 188 -219 41 -32 339 24
7658 24 -90 -44 170 316 172 -238 88 -143 -164 202 61 -13 90 -240 -101 71 41 133 214 25 -35 95 285
7681 285 112 0 68 -83 -6 6 4 163 -1 -77 58 -242 147 -33 221 -422 -109 392 -204 266 231 -74
7703 -74 174 64 375 318 -149 -103 323 -49 31 312 -213 17 195 -47 -361 -41 172 265 -139 90 -57 -114
7725 -114 121 265 -71 -206 135 106 -243 42 116 -19 143 -91 -77 166 190 -90 66 207 182 -3 -69 -200
7747 -200 -129 -103 149 -63 -113 197 94 -79 -41 276 74 -98 -80 -138 -9 -21 -78 77 133 -183 -57 27 -115
7770 -115 74 -113 -69 -147 -63 -44 -64 160 -78 -398 22 121 -52 -54 -300 -224 205 325 74 80 34 81 -182 187
$$ packed form
7613C7K0j61J29q9J19j95R8K7J72J67m69L27l01K95m51K10K22k39L3J22j80J01
7635fJ03l3k36R0N4j75J09J4L46j40n11L45l9j21K82j86K79J3m07K60p3L71l15
7658B4j14M6K14J46j44m10L26k31k1L66j41p4J03l30J39J72l0R2Q1j89o0J30J90
7681B85j73j12O8j51P7J2kJ59j64p6J35l00L89j80K54o43L13N01n96M70l5l05
7703g4K48j10L11n7m67M6M26l72Q0K81n25K30J78k42l14L20K13R3m04K29j47n7
7725a14K35J44l36j35L41k9l49K85P4j35J62k34J4K43K4k80J56J41k5j85o6j31
7747b00P1K6K52k12n0L10j03j73L8L17k02j72J8n8J29j2n7J55N6l16J26Q4j42
7770a15J89j87M4p8Q4J9k0K24k38l20M20R9j73kk46P6M29J20k51Om6M7k63L69
$$ plain form
7794 187 -60 28 4 -8 74 -73 260 44 -14 -155 -130 -194 -105 -147 -138 233 156 90 273 17 -61 55 -133 116 -24
7819 -24 114 85 39 187 -73 -150 -228 -275 13 -61 448 91 37 -1 63 54 -312 -12 109 -375 245 -61 263 -86
7843 -86 -41 5 -188 9 -259 307 41 -41 -98 118 198 -125 -40 57 76 14 160 93 -187 259 -168 187 -185 300
7867 300 115 -186 78 99 -147 -64 38 -46 -293 -75 -11 -201 91 189 117 -194 -187 79 320 274 -76 -19 -43 22
7891 22 28 -95 -198 -43 -139 334 -65 266 80 -28 -22 -286 -248 146 47 -10 131 186 -30 301 -279 102 -171
7914 -171 346 -54 68 175 -275 -264 -123 366 -61 37 -279 89 215 -52 -167 -7 187 295 -172 -199 -142
7935 -142 48 156 61 -86 -46 302 -237 58 225 326 -306 -131 -1 38 113 -129 -113 198 -64 128 131 -1
7957 -1 -11 206 92 -25 73 -48 -98 -67 35 -51 -22 22 -190 -88 75 -169 48 96 -34 74 76 -30 -187 42
$$ packed form
7794A87k47Q8k4j2Q2j47L33k16n8j41K5o4Q9m2RL71p7o6J83k56p8J16j88K49j40
7819b4J38k9m6J48k60p7p8m7K88p4N09l57n4l8O4rl66L00J21m84O20l06L24l49
7843h6M5M6j93J97k68N66k66q2n7K16Q0l23Q5R7J9o2J46o7k80M46m27L55l72M85
7867C00j85l01K64K1k46Q3J02q4k47K18O4j90K92R8p2l11PK66K41m6l50N7k4O5
7891B2Oj23j03J55r6M73l99L31j86j08Ok64L8L94r9n7J41N5k16L31n80L81k73
7914a71N17m00J22J07m50J1J41M89m27R8l16L68J26k67j15J60J94J08m67k7N7
7935a42J90J08r5j47M0L48n39K95J67J01o32J75J30L9P5k42J6L11k62J92Lj32
7957aj0K17j14j17R8j21n0L1J02q6K9M4k12J02J63k44K17M8j30J08Kj06j57K29
$$ plain form
7981 42 65 110 -279 227 -21 -90 113 204 -301 204 163 -88 -194 -194 -77 -76 61 -168 -188 185 -180 -122 -208 43
8005 43 235 -99 105 -90 -57 -91 -82 14 3 3 117 -312 143 -37 76 -70 -72 -3 63 -23 132 114 102 480 -154
8030 -154 -91 16 174 -40 254 25 186 -38 -73 4 1 200 83 230 173 -98 103 -60 -205 -194 -122 -89 -145
8053 -145 262 -24 -101 -176 -345 136 -36 4 52 -291 5 -165 -275 -305 161 4 -96 -46 2 -97 -85 106 -148
8076 -148 167 -94 -72 314 70 29 88 -135 -97 -63 70 216 -255 -100 161 -9 21 -174 173 -260 -135 -186
8098 -186 3 -261 -7 4 -33 -25 90 -209 53 -1 -97 117 157 -247 -79 -41 -123 -23 -333 -170 -1 112 127
8121 127 -9 -274 243 -202 22 67 -464 440 290 -93 -165 -88 -43 204 -104 -15 -153 94 -61 5 -123 147
8143 147 212 74 280 92 142 102 79 96 -84 152 129 111 278 137 157 -264 94 356 -227 147 50 89 -109
$$ packed form
7981D2K3M5l89N06k48o9K03R1n05N05m1k51j06%J17JJ37k29k0L73l65N8q6K51
8005D3J92l34K04j95L3l4RR6j1%J14m29M55j80J13j46kO9O6q6J55j8j2L78o34
8030a54O3J07J58k14K94k29J61k24l5P7lJ99j17J47n7k71K01j63j45J1P2L3n6
8053a45M07k86p7p5j69M81j72M0M8l43K96j70j10l0M66j57j00N0M8r9J2J91k54
8076a48L15k61K2L86k44m1N9k23L8L4J33J46m71J55K61j70L0j95L47m33J25n1
8098a86J89k64K54J1l7QJ15k99K62n4r6K14M0m04J68L8q2J00l10J63J69J13J5
8121A27j36k65N17m45K24M5n31R04j50l83p2P7M5K47l08Q9j38K47j55O6j28K70
8143A47O5j38K06j88N0m0k3J7j80K36k3j8J67j41K0m21L58K62n83L74r7L9j98
$$ plain form
8166 -109 65 262 -60 -95 -4 2 -4 -79 -11 220 -133 193 6 29 286 91 -35 201 -20 -251 51 -244 -2
8189 -2 -35 -54
$$ packed form
8166a09J74J97l22l5R1Oop5O8K31l53L26j87K3K57j95j26K36k21k31L02k95K42
8189bl3j9
8191e4
$$ Imaginary data points
##PAGE= N=2
##DATA TABLE= (X++(I..I)), XYDATA
$$ plain form
0 0 0 0 0 0 -8 8 -8 8 -8 16 -16 24 -32 33 -40 56 -64 72 -88 104 -121 144 -167 192 -221 253 -287 326 -369
29 -369 421 -472 532 -596 663 -741 829 -922 1021 -1135 1259 -1395 1543 -1706 1890 -2094
45 -2094 2324 -2581 2875 -3209 3600 -4060 4609 -5282 6126 -7228 8720 -10878 14283 -20500
59 -20500 35534 -148671 -61093 206592 -42124 -38952 72650 -46617 -139657 64654 94212
70 94212 -11093 29303 61067 -52702 -12951 82311 27371 -21311 30481 -2746 -25493 28663
82 28663 50 -54372 14550 8200 -83668 -18849 66760 -37927 -78769 24028 8120 -53670
94 -53670 23806 40462 -36724 9210 59799 -29097 -25179 77614 33442 -36526 35161 47158
106 47158 -31669 -4023 37687 -16070 -9708 34825 -24242 -44605 23371 -6639 -60968 10319
$$ packed form
0@%%%%qJ6j6J6j6K4l2M0n6O5p3R6j20J36j60J92k25K65l11L59m13M74n40O13o95
29c69P90q93J004j128J259j404J570j751J943k156K394k654K938l249L596l984
45b094M418m905N456o084O809p660Q669r891J1408j3354J5948j9598K5161l4783
59b0500N6034j84205Q7578K67685k48716L172J11602j19267r3040K04311K9558
70I4212j05305M0396L1764j13769L9751R5262n4940m8682N1792l3227k2747N4156
82B8663k8613n4422O8922o350r1868O4819Q5609j04687m0842J02797j5908o1790
94e3670P7476J6656p7186M5934N0589q8896L918J02793m4172o9968P1687J1997
106D7158p8827K7646M1710n3757O362M4533n9067k0363O7976l0010n4329P1287
$$ plain form
118 10319 29508 -50874 -21006 37303 -26514 -32226 47611 8984 -38406 46399 52224 -44502
130 -44502 -3317 71886 -294 -29509 51496 30450 -37599 5841 25572 -30490 -9709 27183
142 27183 -24045 -32262 17299 -13267 -45922 6887 13719 -30610 -3174 21318 -18038 -7583
154 -7583 27983 -4551 -8779 42067 20420 -24000 16506 34184 -15150 -4996 32826 1913
166 1913 -16294 11976 -6176 -28441 6311 5865 -33305 -9601 16768 -24065 -30167 10310 -1523
179 -1523 -20761 9183 10129 -13382 7657 16698 -14092 2253 34936 4363 -14231 20703 15246
192 15246 -16488 2036 16080 -8418 -4063 10414 -16672 -20400 9746 -5366 -30094 138
204 138 12403 -19871 -16395 7516 -5419 -9393 10275 2795 -5617 14129 9962 -11684 6883
$$ packed form
118A0319J9189q0382K9868N8309o3817n712P9837l8627m7390Q4805N825r6726
130d4502M1185P5203p2180k9215Q1005k1046o8049M3440J9731n6062K0781L6892
142B7183n1228q217M9561l0566l2655N2809O832m4329K7436K4492l9356J0455
154g583L5566l2534m228N0846k1647m4420M0506J7678m9334J0154L7822l0913
166A913j8207K8270j8152k2265L4752m46l9170K3704K6369m0833o102M0477j1833
179a523j9238K9944R46k3511K1039R041l0790J6345L2683l0573j8594L4934n457
192A5246l1734J8524J4044k4498M355J4477k7086l728L0146j5112k4728L0232
204A38J2265l2274L476K3911j2935l974J9668p480q412J9746m167k1646J8567
$$ plain form
217 6883 23583 529 -4453 15759 6990 -7645 3063 2359 -6772 4476 3250 -16646 -8404 8317
231 8317 -10643 -19298 3234 4921 -10743 -3600 2927 -4921 1452 8473 -1550 3116 17473 4690
245 4690 -6749 9586 15115 -879 520 10540 3313 -1342 2141 -4657 -5635 5459 -393 -13343
259 -13343 -3030 5024 -9338 -12386 1861 2530 -3779 416 456 -1437 5517 4835 -2637 5321 14288
274 14288 3816 -2939 6972 8447 -18 328 4197 2148 1508 -742 -7508 -4400 2876 -3769 -9723
289 -9723 -1808 2194 -6570 -8713 -2375 -22 319 219 -1963 967 5790 1232 -3249 4847 9217 2520
305 2520 -696 3631 4205 120 -1616 -946 1129 1800 -2895 -7613 -3741 200 -5288 -8175 -2224 298
321 298 -3555 -5281 -3638 -661 1718 -24 -1898 2495 5789 583 -3079 2827 6769 2944 -477
$$ packed form
217F883J6700k3054m982K0212q769j4635J0708p04r131J1248j226j9896Q242J6721
231H317j8960q655K2532J687j5664P143O527p848O373P021j0023M666J4357j2783
245D690j1439J6335N529j5994J399J0020p227m655L483o798r78J1094n852j2950
259a3343J0313Q054j4362l048J4247O69o309M195M0j893O954o82p472P958Q967
274A4288j0472o755R911J475q465L46L869k049o40k250o766L108P276o645n954
289i723P915M002q764k143O338K353L41j00k182K930M823m558m481Q096M370o697
305B520l216M327N74m085j736O70K075O71m695m718L872L941n488k887N951K522
321B98l853j726J643K977K379j742j874M393L294n206l662N906L942l825l421
$$ plain form
336 -477 1423 3237 786 -3189 -3118 252 1446 -2479 -5844 -2578 -315 -4140 -6395 -2278 1445 -456
352 -456 -3660 -2552 1532 2671 53 -132 3699 5714 2764 -430 1512 5012 3744 -98 594 3985
368 3985 2391 -3176 -3201 489 1030 -1907 -3526 -1232 469 -2339 -4713 -1854 2032 1922 -829 -687
384 -687 2281 3466 799 743 3832 5618 3664 376 1569 4108 3085 -785 -252 3311 1813 -2131
400 -2131 -3134 -1218 -27 -1693 -3053 -1560 1291 -623 -3836 -2457 2010 1736 -1047 -243 3054 3023
416 3023 529 -33 2148 3900 3316 293 -478 2289 1682 -2034 -1924 878 945 -2158 -3961 -2369 -531
433 -531 -2110 -3927 -2198 824 -386 -3341 -2561 756 1073 -862 -580 2077 2307 558 -610 527
449 527 2570 2007 -635 -427 1615 252 -2813 -2557 -281 51 -1922 -3613 -2501 -516 -1548 -3692
$$ packed form
336d77J900J814k451l975P1L370J194l925l365L266K263l825k255M117L723j901
352d56l204J108M084J139k618j85L831K015k950l194J942L500j268l842O92L391
368C985j594n567k5L690N41k937j619K294J701k808k374K859L886j10k751J42
384f87K968J185k667n6L089J786j954l288J193K539j023l870N33L563j498l944
400b131j003J916J191j666j360J493K851j914l213J379M467k74k783Q04L297l1
416C023k494n62K181J752n84l023p71K767o07l716J10K802O7l103j803J592J838
433e31j579j817J729L022j210k955P80L317L17j935K82K657K30j749j168J137
449E27K043n63k642K08K042j363l065K56K276L32j973j691J112J985j032k144
$$ plain form
465 -3692 -2370 434 869 -1704 -1987 648 1603 -159 -349 1648 3227 1078 -645 708 2605 1308
481 1308 -785 -450 1986 739 -1802 -2289 -419 35 -1531 -2197 -1575 231 -772 -2262 -1098 784
497 784 2006 229 -756 1835 2708 947 -288 2128 3594 2114 471 639 2099 1292 -132 -196 1231
514 1231 1446 -995 -2090 -663 660 -873 -1703 -136 709 -241 -766 -560 631 1736 1060 66 1787
531 1787 3052 1083 247 1769 2434 1482 797 552 1376 999 -438 -1458 54 858 -987 -2771 -781
548 -781 69 -1306 -2105 -757 70 17 -687 -1259 272 1478 341 -60 1598 1789 445 326 614 669 763
567 763 -38 -576 -581 694 -1233 -2381 -1192 235 -1448 -2656 -1066 -474 -1431 -1475 -1092 -761 267 -121
585 -121 -1689 282 1300 -499 -649 1639 1419 -203 225 612 -236 -54 182 -1031 -1092 582 -972 -3004
$$ packed form
465c692J322K804M35k573k83K635R55j762j90J997J579k149j723J353J897j297
481A308k093L35K436j247k541m87J870M54j566o66O22J806j003j490J164J882
497G84J222j777r85K591Q73j761j235K416J466j480j643J68J460q07j424o4J427
514A231K15k441j095J427J323j533q30J567Q45r50n25K06J191J105o76r94J721
531A787J265j969q36J522O65r52o85k45Q24l77j437j020J512Q04j845j784J990
548g81Q50j375p99J348Q27n3p04n72J531J206j137m01J658J91j344j19K88N5R4
567G63q01n38nJ275j927j148J189J427j683j208J590N92r57m4L83L31J028l88
585a21j568J971J018j799j50K288k20j622M28L87q48J82K36j213o1J674j554k032
$$ plain form
603 -3004 -1110 538 -1714 -2201 -249 -305 -1257 -374 -725 -912 1032 1264 -390 590 1989 407 -635
620 -635 1734 1697 158 403 1060 95 226 169 -901 -740 592 -378 -2221 -786 118 -385 -886 -91 140
639 140 374 416 63 239 1734 885 132 1381 1907 882 572 1332 1125 995 971 -128 178 723 -187 -962
659 -962 117 764 -687 -988 388 -204 -909 -40 133 -604 881 1160 -654 141 2197 670 -128 2175
677 2175 1819 128 369 1300 -126 230 812 -170 -632 495 -444 -2293 -595 565 -961 -1260 -213
694 -213 -515 -1441 -142 181 -1014 220 886 -313 -243 1489 478 -577 824 1165 -45 -238 296 -164
712 -164 -513 -369 -1313 -1017 -45 -440 -2121 -1513 -442 -1250 -1172 -419 -721 -1334 -137 52 -771 174 326 151
732 151 333 822 3 -73 738 616 139 227 -259 -515 240 -781 -1568 -435 200 -830 -1202 -418 -438 -660
$$ packed form
603c004J894J648k252m87J952n6r52Q83l51j87J944K32j654R80J399j582j042
620f35K369l7j539K45O57r65J31n7j070J61J332r70j843J435R04n03n01P95K31
639A40K34M2l53J76J495q49p53J249N26j025l10P60k07j30k4j099L06N45r10p75
659i62J079O47j451l01J376n92p05Q69J73p37J485K79j814P95K056j527p98K303
677B175l56j691K41R31j426L56N82r82m62J127r39j849J698J160j526k99J047
694b13l02r26J299L23j195J234O66j199P0J732j011j055J401L41j210j93N34m60
712a64l49J44r44K96R72l95j681O08J071q08P8P53l02o13J197J89q23R45J52j75
732A51J82M89q19p6Q11j22m77Q8m86k56P55j021p87J133O35j030l72P84k0k22
$$ plain form
752 -660 -523 90 -598 104 836 76 16 1299 725 130 1772 1167 80 334 1267 318 261 838 -218 -677
772 -677 656 132 -1499 -657 632 -287 -599 546 -345 -640 338 434 -69 274 1538 265 140 1533
790 1533 1011 -133 1250 1374 -42 580 1174 21 111 831 242 -839 286 486 -824 -791 18 -328
808 -328 -516 292 -207 -356 -247 103 131 703 836 167 496 845 365 174 750 530 84 -26 43 -449 -182
829 -182 -311 -624 -653 -153 -736 -750 -621 -903 -949 -149 -97 -734 -312 137 -275 -525 409 186 -272 193 876 -463
851 -463 -169 193 -415 -264 189 -126 -705 -347 -745 -1116 -994 -480 -795 -978 -120 -1165 -1010 -273 85 -530
871 -530 -129 546 190 -123 791 384 63 781 740 -94 110 397 -3 -261 358 -308 -403 -13 -386 -474 -576
892 -576 -350 -473 -265 253 -159 -574 380 469 -275 460 752 474 481 726 585 -43 1012 724 428 377 222
$$ packed form
752f60J37O13o88P02P32p60o0J283n74n95J642o05j087K54R33r49n7N77j056m59
772f77J333n24j631Q42J289r19l12J145q91k95R78R6n03L43J264j273j25J393
790A533n22j144J383J24j416O22N94j153R0P20n89j081J125K00j310L3Q09l46
808c28j88Q08m99j49J09L50K8N72J33o69L29L49m80j91N76k20m46j10O9m92K67
829a82j29l13k9N00n83j4J29k82m6Q00N2o37M22M49m12k50R34k23m58M65O83j339
851d63K94L62o08J51M53l15n79L58l98l71J22N14l15j83Q58j045J55P37L58o15
871e30M01O75l56l13R14m07l21P18m1q34K04K87m00k58O19o66r5L90l73q8j02
892e76K26j23K08N18m12m15R54Q9p44P35K92k78PK45j41o28J055k88k96n1j55
$$ plain form
913 222 -63 142 300 -92 -112 382 -230 -212 -369 -36 -107 -373 153 -137 -20 507 445 387 588 656 239 751
935 751 658 264 511 558 347 42 236 115 -167 17 -49 -251 -449 -51 -257 -613 -201 -314 -579 -185 -22
956 -22 202 212 439 -223 217 275 -359 -215 451 173 -193 177 381 -236 -43 83 -76 -695 -297 -317 -337 -320
978 -320 -383 -644 -608 -584 -537 -445 -806 -99 -322 -325 -26 262 -136 451 -69 -84 96 58 -166 188 238 149 -624 -302
1002 -302 -4 -252 -185 -435 -416 -419 -123 -163 -520 -329 -75 -624 -212 221 -14 -74 219 238 486 270 -83 92
1024 92 52 129 122 401 -10 -43 -4 30 137 -196 4 8 -74 -209 70 -202 -65 456 197 177 454 334 639 686
1048 686 488 105 423 575 152 212 602 227 412 259 -136 -57 253 -231 2 100 -84 -49 -215 69 89 -346
1070 -346 -10 126 248 432 409 201 311 -114 366 437 216 220 -173 68 -61 129 122 -18 168 -47 -266 -293
$$ packed form
913B22k85K05J58l92k0M94o12J8j57L33p1k66N26k90J17N27o2n8K01O8m17N12
935G51r3l94K47M7k11l05J94j21k82J84o6k02j98L98k06l56M12j13k65L94J63
956b2K24J0K27o62M40N8o34J44O66k78l66L70K04o17J93J26j59o19L98k0k0J7
978c20o3k61L6K4M7R2l61P07k23lK99K88l98N87n20j5J80l8k24L54N0q9p73L22
1002c02K98k48O7k50J9lK96m0l57J91K54n49M12M33k35o0K93J9K48k16l53J75
1024I2m0P7pK79m11l3L9L4J07l33K00Mq2j35K79k72J37N21k59k0K77j20L05M7
1048F86j98l83L18J52m23O0L90l75J85j53l95P9L10m84K33R8j84L5j66K84K0m35
1070c46L36J36J22J84k3k08J10m25M80P1k21Ml93K41j29J90pj40J86k15k19k7
$$ plain form
1092 -293 -172 -380 -114 -153 -179 -366 -1 -380 -333 -436 218 -63 -195 -148 166 13 -363 180 185 -65 -34 83
1114 83 -434 -128 -524 -331 -16 -627 -222 -204 -283 -834 -418 -402 -465 -299 -27 -167 81 80 88 -180 -486 -184 -144
1137 -144 -108 -13 303 152 1 -147 -213 -232 -206 -170 -134 -256 -247 -132 44 -115 -107 -47 -17 -187 -92 99 -18 150 78
1162 78 69 169 389 67 567 297 -8 203 -105 -97 404 16 152 215 -176 91 90 83 -6 569 217 -339 7 160
1186 160 228 81 393 408 289 394 282 221 230 438 81 39 535 213 388 249 158 27 91 -176 -13 -48 130
1209 130 137 -378 239 4 -140 107 -66 255 -191 259 199 478 -91 -102 -264 -39 136 -194 -63 29 -149 79
1231 79 254 -81 -115 -371 -272 -36 -164 -389 -363 -418 -404 -333 -53 -56 -214 78 -258 -147 194 -118 228 56 -304
1254 -304 75 -395 27 -71 -196 -159 -314 -195 -302 192 -460 -218 -120 -361 -379 -325 47 -238 -319 -77 -26 175
$$ packed form
1092b93J21k08K66l9k6j87L65l79M7j03O54k81j32M7L14j53l76N43Nk50L1J17
1114H3n17L06l96J93L15o11M05J8p9n51M16J6o3J66K72j40K48jQk68l06L02M0
1137a44L6R5L16j51j51j48o6j9K6L6L6j22RJ15J76j59QO0L0j70R5J91j17J68p2
1162G8rJ00K20l22N00k70l05K11l08QN01l88J36O3l91K67jpq9N75l52n56L46J53
1186A60O8j47L12J5j19J05j12o1RK08l57m2M96l22J75j39r1j31O4k67J63l5J78
1209A30Pn15O17k35j44K47j73L21m46M50o0K79n69j1j62K25J75l30J31R2j78K28
1231G9J75l35l4k56R9K36j28k25K6n5J4P1K80lj58K92l36J11L41l12L46j72l60
1254c04L79m70M22r8j25L7j55J19j07M94o52K42R8k41j8N4L72k85q1K42N1K01
$$ plain form
1276 175 236 -8 106 135 16 293 -56 196 172 35 356 -219 52 -153 54 59 -91 184 -48 -122 27 368
1298 368 58 85 143 -20 -123 63 187 330 157 -131 51 260 216 204 169 -16 165 198 24 60 417 55
1320 55 199 57 -29 78 62 183 94 184 278 211 111 172 344 -225 68 298 341 99 232 73 135 379 185
1343 185 43 181 548 -64 -313 208 -1 -252 165 333 -329 -32 -67 -109 112 -107 29 89 -187 172 -145
1364 -145 -4 254 51 -141 163 39 -68 -189 2 -93 -332 -12 -412 17 -236 -174 -276 16 -186 -83 -468
1385 -468 -284 -30 -45 -98 -343 -91 139 -182 -106 -79 32 -265 -22 -156 -215 307 104 -84 -5 -32 -294 -613
1407 -613 42 -357 -104 -235 119 -82 -249 4 65 -11 -17 275 -171 122 292 -8 -101 14 -23 -71 93 357
1429 357 -419 163 168 -251 -83 -47 152 -166 154 305 -43 158 -61 42 -211 -111 76 -95 161 375 49
$$ packed form
1276A75O1k44J14K9j19K77l49K52k4j37L21n75K71k05K07Nj50K75k32p4J49L41
1298C68l10K7N8j63j03J86J24J43j73k88J82K09m4j2l5j85J81L3j74L6L57l62
1320E5J44j42q6J07j6J21q9R0R4o7j00O1J72n69K93K30M3k42J33j59O2K44j94
1343A85j42J38L67o12k49N21k09k51M17J68o62K97l5m2K21k19J36O0k76L59l17
1364a45J41K58k03j92L04j24j07j21J91r5k39L20m00M29k53O2j02K92k02J03l85
1385d68J84K54j5n3k45K52K30l21P6K7J11k97K43j34n9N22k03j88P9k7k62l19
1407f13O55l99K53j31L54k01j67K53O1p6oK92m46K93J70l00r3J15l7m8J64K64
1429C57p76N82Nm19J68L6J99l18L20J51l48K01k19J03k53J00J87j71K56K14l26
$$ plain form
1450 49 203 295 390 11 271 -176 55 161 28 5 75 99 169 44 -101 348 71 423 -31 271 166 -172
1472 -172 264 320 15 -145 -146 48 240 258 186 287 242 200 162 -95 376 264 33 21 172 49 -207 -89 -315
1495 -315 -123 -3 -254 8 -346 -147 -28 -110 392 385 -425 -101 -144 289 -186 109 -86 57 238 178 -77 -156
1517 -156 -8 -139 98 -113 -180 -409 -133 -159 -423 -222 232 37 -8 76 -26 -241 140 -7 -231 -198 22 -185
1539 -185 -54 -133 -58 -164 102 178 -212 3 -155 9 -297 -107 268 -322 -55 -283 -309 -83 130 202 156 210
1561 210 195 -32 112 165 202 74 67 354 249 33 -47 133 -194 116 -550 -46 158 197 -42 61 149 -3 -3
1584 -3 -182 -65 265 -118 -101 -67 -48 98 171 -12 147 -248 -12 383 157 207 96 -113 254 279 127 125 264
1607 264 -68 31 -165 179 116 -369 -179 93 -49 -168 106 -176 302 -36 5 23 -92 -260 59 -141 303
$$ packed form
1450D9J54R2R5l79K60m47K31J06j33k3P0K4P0j25j45M49k77L52m54L02j05l38
1472a72M36N6l05j60jJ94J92J8p2J01m5m2l8k57M71j12k31j2J51j23k56J18k26
1495c15J92J20k51K62l54J99J19q2N02pq10L24m3M33m75K95j95J43J81o0k55p9
1517a56J48j31K37k11o7k29K76k6k64K01M54j95m5Q4j02k15L81j47k24L3K20k07
1539a85J31p9P5j06K66P6l90K15j58J64l06J90L75n90K67k28k6K26K13P2m6N4
1561B10j5k27J44N3L7j28pK87j05k16q0J80l27L10o66N04K04L9k39J03Q8j52%
1584cj79J17L30l83J7L4J9J46P3j83J59l95K36L95k26N0j11k09L67K5j52kJ39
1607B64l32R9j96L44o3m85J90K72j42j19K74k82M78l38M1J8j15j68L19k00M44
$$ plain form
1628 303 10 23 -112 -134 -157 87 -39 -270 -68 -136 -46 -105 -270 -287 -80 -252 24 -203 -221 -213 -118 -123 -12 198
1652 198 60 -275 90 -178 -12 -373 7 -353 -59 -334 -148 -150 -328 -114 -357 -259 2 -38 -165 -231 68 80
1674 80 -119 -110 -213 -36 -200 -221 -64 -346 77 -125 -109 -69 -140 35 42 1 -64 -58 -58 -308 -45 47 50 20 109 437 15
1701 15 -134 -48 171 -22 -121 -132 181 52 250 0 135 145 193 337 107 -60 -119 -42 4 -80 -65 134 -286 233
1725 233 274 273 297 -39 -149 181 -45 114 -1 105 212 -11 106 118 172 51 81 72 3 -32 64 359 3 77
1749 77 208 48 -198 32 236 256 55 38 -24 227 -80 106 160 -266 -123 -242 77 -224 -55 -139 -59 -76 62
1772 62 -46 -150 -81 116 -46 -159 343 -118 61 249 -44 -209 -329 105 -95 -32 -57 -23 -108 -21 167 -194
1794 -194 -215 -370 -147 -61 -134 -129 -45 100 -90 -186 -117 0 105 -156 -55 -95 195 -27 61 16 147 -10 -91 -235
$$ packed form
1628C03k93J3j35k2k3K44j26k31K02o8R0n9j65j7K07j72K76k27j8QR5nJ11K10
1652A98j38l35L65k68J66l61L80l60K94k75J86kj78K14k43R8K61m0j27o6K99J2
1674H0j99Rj03J77j64k1J57k82M23k02J6M0p1J75Pm1o5O%k50K63R2Ll0Q9L28m22
1701A5j49Q6K19j93r9j1L13j29J98k50J35J0M8J44k30j67n9P7M6q4J5J99m20N19
1725B33M1jK4l36j10L30k26J59j15J06J07k23J17J2N4j21L0ro9l5R6K95l56P4
1749G7J31j60k46K30K04K0k01j7o2K51l07J86N4m26J43j19L19l01J69q4Q0j7J38
1772F2j08j04O9J97j62j13N02m61J79J88k93j65j20M34k00O3k5L4q5Q7J88l61
1794a94k1j55K23Q6p3NQ4J45j90r6O9J17J05k61J01m0K90k22Q8m5J31j57q1j44
$$ plain form
1818 -235 -235 -69 -43 -23 -37 180 101 -47 -127 202 193 -4 25 -277 -206 164 134 -221 -125 -162 50 -153 -192 200 -3
1843 -3 27 214 -17 45 86 317 186 114 147 88 132 -223 43 148 110 -122 162 -105 -179 381 83 127 46 21 65
1868 65 35 -128 94 87 308 300 145 -76 -38 338 427 -40 193 49 -64 -279 249 170 170 258 -219 94 184 -31
1892 -31 -31 -415 68 202 63 -29 -220 53 62 -75 -250 -31 -150 15 166 -115 -110 -49 -165 -98 -31 337 -252 -167
1916 -167 195 -50 -2 -45 -109 -195 -27 -98 61 -332 -118 61 -310 53 -82 -208 100 -71 -118 -317 -233 27
1938 27 -2 295 -49 -150 -18 -217 -132 -63 -190 -77 -60 172 -103 -161 -69 74 -88 44 -35 -9 -56 58 -157
1961 -157 -374 -341 6 290 219 -41 19 -196 95 26 88 -140 -27 -17 -221 211 42 38 282 309 -35 -89 227
1984 227 109 16 -99 15 181 -136 86 -89 -14 -161 50 327 59 276 171 184 125 -67 25 125 275 133
$$ packed form
1818b35%J66K6K0j4K17p9j48q0L29rj97K9l02P1L70l0l55R6l7K12k03l9L92k03
1843cL0J87k31O2M1K31j31p2L3n9M4l55K66J05l8k32K84k67p4N60k98M4q1k5M4
1868F5l0j63K22pK21qj55k21L8L76Q9m67K33j44j13k15N28p9%Q8m77L13R0k15
1892c1%l84M83J34j39r2j91K73Rj37j75K19j19J65J51k81NO1j16O7O7L68n89Q5
1916a67L62k45M8m3o4q6J68p1J59l93K14J79l71L63j35j26L08j71m7j99Q4K60
1938B7k9K97l44j01J32j99Q5O9j27J13J7K32k75n8R2J43j62J32p9K6m7J14k15
1961a57k17L3L47K84p1k60O0k15K91o9O2k28J13J0k04M32j69mK44K7l44n4L16
1984B27j18r3j15J14J66l17K22j75P5j47K11K77k68K17j05J3n9j92R2J00J50j42
$$ plain form
2006 133 -148 87 108 -107 341 193 -57 -54 142 340 96 -180 80 318 -175 -109 91 113 -64 -10 -118 -36
2028 -36 -47 17 -185 75 -53 -53 90 65 -235 66 35 30 -96 -59 198 189 -43 -364 15 -188 51 113 157 -216 -31
2053 -31 -2 -89 2 92 -93 65 -32 24 130 5 2 -41 108 -254 69 -145 -224 302 -94 -3 201 63 141 30
2077 30 87 -161 -108 -42 235 -108 115 -258 258 223 -66 9 209 -74 71 274 3 76 -250 29 -12 -71 -159
2100 -159 263 312 -191 27 -173 336 -55 59 98 -212 24 -62 4 279 410 108 -168 145 -129 -40 43 254
2122 254 114 -47 156 442 111 185 141 49 -163 102 -266 -4 -36 -332 266 241 -190 -58 -34 -72 185 45
2144 45 -179 20 163 -449 80 -165 92 -313 83 -279 305 4 1 119 -135 88 238 -32 -92 215 -123
2165 -123 -28 460 359 -132 92 140 -123 -192 97 -198 -68 87 84 145 -12 268 4 321 -140 125 -260 -220
$$ packed form
2006A33k81K35K1k15M48j48k50LJ96J98k44k76K60K38m93O6K00K2j77N4j08Q2
2028c6j1O4k02K60j28%J43k5l00L01l1nj26L7K57rk32l21L79k03K39O2M4l73J85
2053c1K9q7R1R0j85J58r7N6J06j25lm3J49l62L23k14p9N26l96R1K04j38P8j11
2077C0N7k48N3O6K77l43K23l73N16l5k89P5K00k83J45K03k71P3l26K79m1n9q8
2100a59M22M9n03K18k00N09l91J14L9l10K36q6O6K75J31l02k76L13k74Q9Q3K11
2122B54j40j61K03K86l31P4m4r2k12K65l68K62l2k96N98k5m31J32K4l8K57j40
2144D5k24J99J43o12N29k45K57m05L96l62N84l01lJ18k54K23J50k70o0L07l38
2165a23R5M88j01m91K24M8k63o9K89k95J30J55lO1j57K80k64L17m61K65l85M0
$$ plain form
2187 -220 -2 -17 -154 29 -93 -47 74 -67 52 225 -206 -101 -161 -69 -248 -74 -109 206 -216 -59 23 113
2209 113 -106 176 -75 -166 -25 -16 139 -176 -151 -355 -38 26 437 148 50 16 30 -218 -158 54 -56 -196 -43
2232 -43 -83 16 62 113 208 61 9 -183 -100 -269 -167 121 -35 72 -139 23 52 7 -12 10 139 12 -45 -192
2256 -192 34 177 120 -34 185 -202 -279 -12 -254 361 74 -98 -165 118 152 -145 243 113 144 115 166 -91
2278 -91 95 137 -145 243 239 396 38 -19 -125 -80 -226 44 -162 141 223 -70 -49 13 77 -71 27 -79 -42 -14
2302 -14 364 -17 109 -2 37 312 -302 165 26 9 39 -31 -52 -77 -117 88 -224 48 -6 9 28 198 -387 280
2326 280 -342 -123 -9 122 -241 -305 -233 -315 194 112 -198 -96 -119 333 148 -328 5 173 89 -261 245 31
2348 31 -179 170 86 -72 219 -68 -219 98 198 -77 367 -329 -68 223 31 233 249 -81 -180 70 143 -34
$$ packed form
2187b20K18j5j37J83j22M6J21j41J19J73m31J05o0R2j79J74l5L15m22J57Q2R0
2209A13k19K82k51r1J41RJ55l15K5k04L17O4M11k89r8l4J4k48O0K12j10j40J53
2232d3m0R9M6N1R5j47n2j92Q3j69J02K88j56J07k11J62K9m5j9K2J29j27n7j47
2256a92K26J43n7j54K19l87p7K67k42O15k87j72o7K83L4k97L88j30L1k9N1k57
2278i1J86M2k82L88mJ57l58n7j06M5j46K70k06L03Q2k93K1O2O4j48R8j06L7K8
2302a4L78l81J26j11L9K75o14M67j39j7L0p0k1k5m0K05l12K72n4J5J9J70n85O67
2326B80o22K19J14J31l63o4P2q2N09q2l10J02k3M52j85m76L33J68q4l50N06k14
2348C1k10L49q4j58K91k87j51L17J00k75M44o96K61K91j92K02J6l30r9K50P3j77
$$ plain form
2370 -34 -74 41 146 202 -110 0 303 81 -220 -235 138 -192 147 -52 -336 131 8 -169 -107 70 76 260
2392 260 175 77 44 -198 153 -13 -203 89 204 170 -159 216 153 27 31 276 142 81 87 -144 -260 -22 120
2415 120 -41 -43 120 176 95 -25 -173 82 505 -52 126 142 16 -67 -157 87 -111 51 -78 161 -227 86
2437 86 167 -136 0 93 98 -33 -14 -168 47 -264 221 -91 -17 -173 188 -241 -140 3 -262 -310 18 135 -82
2460 -82 44 -149 -123 140 -4 -173 -4 -132 211 -223 -209 -53 -5 161 -82 -51 -283 19 -426 -37 98 -150
2482 -150 26 105 -62 -194 -19 -74 244 115 -150 -94 -290 17 -58 -175 78 87 265 -33 -118 -36 -272 -165 92
2505 92 -74 -204 56 -216 -61 399 142 156 -55 139 -332 -88 124 -153 135 273 153 26 153 -41 79
2526 79 89 159 99 43 -28 -150 86 -84 87 -80 -178 152 125 91 -107 -80 268 46 69 184 -213 -5 223 223
$$ packed form
2370c4m0J15J05N6l12J10L03k22l01j5L73l30L39j99k84M67j23j77O2J77OJ84
2392B60q5r8l3k42L51j66j90K92J15l4l29L75o3j26MK45j34o1Ok31j16K38J42
2415A20j61kJ63N6q1j20j48K55M23n57J78J6j26q3r0K44j98J62j29K39l88L13
2437H6Q1l03J36R3Nj31J9j54K15l11M85l12P4j56L61m29J01J43k65m8L28J17k17
2460h2J26j93K6K63j44j69J69j28L43m34J4J56M8J66k43L1k32L02m45L89J35k48
2482a50J76P9j67j32J75n5L18j29k65N6j96L07p5j17K53RJ78k98q5Q2k36J07K57
2505I2j66j30K60k72J55M60k57J4k11J94m71K44K12k77K88J38j20j27J27j94J20
2526G9J0P0o0n6p1j22K36j70J71j67r8L30k7l4j98K7L48k22K3J15l97K08K28%
$$ plain form
2550 223 -116 -2 115 -319 -320 3 175 -262 53 -52 -343 -69 201 283 -75 95 -261 -218 -220 209 62 21
2572 21 -65 -47 -349 93 146 -34 -236 23 37 -54 226 73 193 -125 -135 -185 -219 -306 194 -66 188 110 12 65
2596 65 75 -37 -13 -136 36 29 204 9 -188 -167 141 103 -87 -58 268 -191 -37 -30 124 48 19 57 -88 -97 51
2621 51 35 -449 44 3 69 122 294 68 225 210 144 194 59 114 -359 322 170 188 -238 18 36 -180 57 150
2645 150 -165 -92 349 61 -132 140 -4 -175 -135 180 183 188 118 69 -243 68 191 -140 88 258 -30 -232 -59
2668 -59 353 108 10 -153 119 206 204 79 82 -375 -277 73 -13 -58 -86 122 -70 -161 130 115 175 185 -39 392 77
2693 77 81 54 252 17 119 -142 334 -338 -139 -301 134 191 -326 -99 -87 -10 115 228 60 300 -223 36
2715 36 36 -255 -3 -156 -93 67 -118 -122 -323 -48 4 213 -174 291 -159 6 -57 -291 -43 26 97 -198 70
$$ packed form
2550B23l39J14J17m34jL23J72m37L15j05k91K74K70Q2l58J70l56M3kM29j47m1
2572B1q6J8l02M42N3j80k02K59J4r1K80j53J20l18j0n0l4q7N00k60K54p8r8N3
2596F5J0j12K4j23J72pJ75j95j97K1L08l8j90K9L26m59J54PJ54p6k9L8j45rJ48
2621E1j6m84M93m1O6N3J72k26J57j5o6N0j35N5m73O81j52J8m26K56J8k16K37R3
2645A50l15P3M41k88j93K72j44j71M0L15LNp0m9l12L11J23l31K28J70k88k02J73
2668e9M12k45r8j63K72Q7kj25Lm57R8L50q6m5k8K08j92r1K91j5O0J0k24M31l15
2693G7Mk7J98k35J02k61M76o72J99j62M35N7n17K27J2P7J25J13j68K40n23K59
2715C6%k91K52j53O3J60j85mk01K75N2K09l87M65m50J65o3k34K48O9P1k95K68
$$ plain form
2738 70 255 -261 47 -62 -324 -67 -125 167 -104 -320 27 135 354 106 -107 -27 -66 73 418 -317 89
2759 89 -159 -67 71 -78 64 -92 -93 17 -72 -154 -34 2 -309 -194 79 -57 -334 62 -173 24 -103 124
2781 124 -150 -1 -65 -5 253 33 247 336 46 217 -54 -379 -70 0 78 -120 155 -227 -91 -30 -148 -6
2803 -6 24 -329 -77 -83 -40 52 73 178 182 130 -269 35 160 502 -29 116 258 -81 10 238 333 -46 115 -297
2827 -297 -56 158 230 -120 -185 176 -63 -52 -317 145 -182 272 -38 99 7 99 -193 -241 -113 310 -46 7
2849 7 13 -50 70 177 -155 -203 68 -179 -183 7 -78 -220 -12 17 104 1 131 -16 -59 -59 133 265 0 31 -118
2874 -118 -254 50 187 94 -127 -295 3 91 -200 141 -114 13 232 149 140 -30 -219 132 -84 64 37 374
2896 374 -39 103 180 -91 48 366 -233 -57 72 -186 107 211 -64 -140 125 185 47 81 72 311 -86 160
$$ packed form
2738G0J85n16L08j09k62K57n8K92k71k16L47J08K19k48k13Q0l9J39L45p35M06
2759H9k48R2J38j49J42j56jJ10q9q2J20L6l11J15K73j36k77L96k35J97j27K27
2781A24k74J49o4O0K58k20K14Q9k90J71k71l25L09P0P8j98K75l82J36O1j18J42
2803fL0l53K52oM3R2K1J05Mn2l99L04J25L42n31J45J42l39R1K28R5l79J61m12
2827b97K41K14P2l50o5L61k39J1k65M62l27M54l10J37r2R2k92m8J28M23l56N3
2849GOo3J20J07l32m8K71k47mJ90q5j42K08K9Q7j03J30j47m3%J92J32k65L1j49
2874a18j36L04J37r3k21j68K98Q8k91L41k55J27K19q3rj70j89L51k16J48k7L37
2896C74m13J42P7k71J39L18n99J76J29k58K93J04k75p6K65O0j38L4rK39l97K46
$$ plain form
2918 160 -12 -89 -152 -75 17 -80 137 -241 -95 130 -156 -187 92 -163 4 -76 116 -48 306 -309 -88 187
2940 187 353 78 111 193 -282 -198 -22 -100 -62 264 107 -66 -38 -234 155 -388 96 -408 73 60 91 54 -64
2963 -64 20 386 -218 160 -52 -255 -104 110 162 14 82 -73 -129 -37 52 106 -246 -141 107 -79 375 148 115
2986 115 180 -69 -192 -252 -51 -86 -67 0 -108 -204 -46 -15 125 -61 161 84 -104 -41 -113 -88 -261 153 -34 203
3010 203 124 -77 175 102 -96 -253 83 349 93 20 -71 115 -237 -118 -324 -16 -240 -206 -134 -101 46 -34 -88
3033 -88 -219 143 169 -277 -178 -35 91 -79 46 111 87 -122 112 -144 -46 -278 -60 -44 -69 -156 24 220 -172
3056 -172 277 -257 77 -17 -56 -63 -10 -55 -162 269 147 -2 258 -104 1 168 101 -48 -4 -329 -294 110 -185
3079 -185 27 -111 136 45 288 33 -51 241 -59 -242 37 -66 -267 197 -70 11 -191 -366 56 201 90
$$ packed form
2918A60j72p7o3P7R2r7K17l78J46K25k86l1K79k55J67q0J92j64L54o15K21K75
2940A87J66k75L3Q2m75Q4J76p8L8L26j57j73K8j96L89n43M84n04M81j3L1l7j18
2963f4Q4L66o04L78k12k03J51K14N2j48O8j55n6R2Q9N4l52J05K48j86M54k27l3
2986A15O5k49j23o0K01l5J9O7j08r6J58L1J40j86K22p7j88O3p2K5j73M14j87K37
3010B03p9k01K52p3j98j57L36K66k56p3r1J86l52J19k06L08k24L4P2L3J47q0n4
3033h8j31L62K6m46R9J43J26j70J25O5k4k09K34k56R8k32K18J6k5q7J80J96l92
3056a72M49n34L34r4l9pN3m5j07M31j22j49K60l62J05J67o7j49M4l25L5M04k95
3079a85K12j38K47r1K43k55q4K92l00j83K79j03k01M64k67Q1k02j75M22J45j11
$$ plain form
3100 90 209 -7 -200 142 -298 61 27 86 18 -175 -43 -42 57 -266 -147 -34 -37 205 -90 255 -9 124 114
3123 114 143 74 82 30 79 -137 -32 25 -79 22 222 216 -174 1 -51 -106 68 278 62 -69 67 -338 179 -65
3147 -65 215 -221 172 29 -56 1 -266 1 -28 289 -58 78 -52 132 17 -275 227 274 -236 198 91 47
3169 47 -10 352 96 123 243 9 -60 -106 -221 60 -39 175 108 166 11 -402 -136 104 168 -234 290 103 224
3192 224 158 235 -65 -159 29 19 338 -53 119 -79 68 -35 -181 -185 229 -177 -226 44 56 98 163 18 -297
3215 -297 82 -61 26 231 203 78 152 -191 5 -226 34 -97 -33 -99 315 -103 126 57 232 -106 40 48 84
3238 84 -44 89 130 -70 27 -87 -42 -18 -114 -210 -22 -2 220 -118 185 -18 -63 357 20 -161 -56 -16 26 331
3262 331 -108 214 215 -116 -12 -316 50 -72 -82 -14 -40 -142 25 -126 -40 128 9 -7 -93 193 -212 0 36
$$ packed form
3100I0J19k16j93L42m40L59l4N9o8j93J32JR9l23J19J13lK42k95L45k64J33j0
3123A14K9o9Qn2M9k16J05N7j04J01K00ol90J75n2n5J74K10k16j31J36m05N17k44
3147f5K80m36L93j43q5N7k67K67k9L17l47J36j30J84j15k92N02M7n10M34j07m4
3169D7n7L62k56K7J20k34o9m6j15K81r9K14o7N8j55m13K66K40O4m02N24j87J21
3192B24o6P7l00r4J88j0L19l91J72j98J47j03j46mM14m06m9K70J2M2O5j45l15
3215b97L79j43Q7K05k8j25P4l43J96k31K60j31O4o6M14m18K29o9J75l38J46QL6
3238H4j28J33M1k00R7j14M5K4r6r6J88K0K22l38L03k03m5M20l37j81J05M0M2L05
3262C31m39L22Jl31J04l04L66j22j0O8k6j02J67j51Q6J68j19j6q6K86m05K12L6
$$ plain form
3285 36 153 126 -6 136 63 -77 -220 264 -9 110 -137 -155 52 -327 -77 379 -101 124 47 13 -103 -110 -17
3308 -17 -5 -110 338 -230 77 103 -5 212 -115 -31 133 -83 232 96 -202 -72 127 -57 102 28 131 -227
3330 -227 -116 13 228 -19 -38 -349 4 248 139 -13 131 348 192 12 -186 -174 57 110 -101 158 -100
3351 -100 349 -113 -15 -216 -121 -310 316 -168 -236 67 -299 -129 45 24 -328 55 -216 100 -63 300 -345
3372 -345 -141 -131 -202 -150 -328 2 99 -105 -219 130 -16 7 36 319 195 25 297 -322 -60 342 -81 -4
3394 -4 33 -250 142 -37 -16 141 -294 79 49 -65 -269 -143 201 131 -126 -75 97 3 119 -68 -61 -114 -139 -232
3418 -232 -70 -570 -146 -197 -303 225 -241 -32 -39 -85 -246 -147 -384 281 -337 -143 -20 -47 10 58 345 129 -209
3441 -209 157 9 -9 228 219 141 170 101 -148 221 21 -170 29 302 -77 228 -153 -58 -58 49 59 155 -68 58
$$ packed form
3285C6J17k7j32J42p3j40j43M84k73J19k47j8K07l79K50M56m80K25p7l4j16pR3
3308a7J2j05M48n68L07K6j08K17l27Q4J64k16L15j36k98J30J99j84J59p4J03l58
3330b27J11J29K15k47j9l11L53K44j09j52J44K17j56j80j98J2K31N3k11K59k58
3351a00M49m62R8k01R5j89O26m84o8L03l66J70J74k1l52L83k71L16j63L63o45
3372c45K04J0p1N2j78L30R7k04j14L49j46K3K9K83j24j70K72o19K62M02m23P7
3394dL7k83L92j79K1J57m35L73l0j14k04J26L44p0k57N1J72r4J16j87Pn3k5r3
3418b32J62n00M24n1j06N28m66K09pm6j61R9k37O65o18J94J23k7N7M8K87k16l38
3441b09L66j48j8K37rp8K9o9k49L69k00j91J99K73l79L05l81R5%J07J0R6k23J26
$$ plain form
3465 58 194 -198 -4 53 -272 -18 143 163 186 -35 176 -183 151 77 200 -46 177 -151 -68 -100 26 170
3487 170 -20 14 129 -226 211 183 -41 44 -196 112 89 -27 109 154 123 152 -289 103 -120 134 -189 92
3509 92 -116 433 -39 249 -2 -191 -151 211 81 35 -140 203 -326 -86 -88 -199 -137 -45 -73 23 68 -158 -106 -248
3533 -248 -58 -155 -88 67 144 188 228 36 -7 89 32 243 -93 -213 227 39 -368 63 -67 -101 95 -145 240
3556 240 -270 140 144 156 -161 189 -128 -61 55 -100 0 -244 105 94 -190 -175 27 4 -56 -32 148 62 -156
3579 -156 -43 19 -225 -163 -17 -96 307 409 151 154 -64 -154 -96 13 134 288 384 -181 -82 177 -214 257 -229
3602 -229 99 25 -177 -91 -415 288 136 81 -5 105 -275 -156 163 134 -370 186 -23 -119 118 337 -70 129
3624 129 62 -66 145 398 175 18 -155 -170 9 -100 -11 -25 19 193 87 186 230 91 -161 -35 157 51
$$ packed form
3465E8J36l92J94N7l25K54J61K0K3k21K11l59L34p4J23k46K23l28Q3l2J26J44
3487A70j90L4J15l55M37k8k24Q5k40L08k3j16J36M5l1K9m41L92k23K54l23K81
3509I2k08N49m72K88k51j89M0L62j30m6j75L43n29K40kj11O2R2k8R6M5k26N2j42
3533b48J90r7O7J55P7M4M0j92m3R6n7K11l36j20M40j88m07M31j30l4J96k40L85
3556B40n10M10MJ2l17L50l17O7J16j55J00k44L49j1k84J5K02k3o0K4J80q6k18
3579a56J13O2k44O2J46p9M03J02k58Lk18r0N8J09J21J54R6n65R9K59l91M71m86
3602b29L28p4k02Q6l24P03j52n5q6J10l80J19L19k9n04N56k09r6K37K19m07J99
3624A29o7j28K11K53k23j57j73j5J79j09Q9j4M4J74j06R9M4j39k52J26J92j06
$$ plain form
3646 51 -173 174 -74 -21 17 -209 117 -73 -160 -152 160 21 67 -29 -63 96 305 88 140 -102 116 136 -184 -261
3670 -261 -154 -128 -256 -103 88 -57 -54 -54 -130 44 233 409 78 -228 -1 55 -11 -107 70 -36 -326 -158 42
3693 42 -65 -165 179 -126 -37 27 -70 201 315 38 20 -295 214 136 -2 -18 90 -140 64 -61 23 -116 297
3716 297 -172 179 136 -119 -77 -31 162 -241 242 137 -113 62 157 -94 203 -244 188 -28 148 5 192
3737 192 -10 218 -104 -30 30 79 389 -324 91 -195 159 -122 -273 49 237 12 98 94 94 105 -20 21 34 -192
3761 -192 -74 246 -4 171 -188 -127 195 -83 -122 -92 -56 120 -26 25 21 68 569 -47 -110 42 126 -192 479
3784 479 169 -25 -36 -189 38 -47 -37 235 -43 -80 136 223 115 135 123 124 70 -256 98 -14 0 -46 81 -74
3808 -74 147 -78 -107 422 68 -231 180 -112 -9 -131 0 75 272 -5 -246 212 -132 -74 105 -242 -127
$$ packed form
3646E1k24L47k48N3L8k26L26j90q7QL12j39M6r6l4J59K09k17N2k42K18K0l20p7
3670b61J07K6j28J53J91j45L%p6J74J89J76l31l06K27N6o6r6J77j06k90J68K00
3693D2j07j00L44l05Q9O4r7K71J14k77j8l15N09p8j38j6J08k30K04j25Q4j39M13
3716B97m69L51m3k55M2M6J93m03M83j05k50J75R5k51K97m47M32k16J76j43J87
3737A92k02K28l22P4O0M9L10p13M15k86L54k81j51L22J88k25Q6m%J1j25M1J3k26
3761a92J18L20k50J75l59O1L22k78l9L0L6J76j46N1mM7N01o16o3J52Q4l18O71
3784D79l10j94j1j53K27q5J0K72k78l7K16Q7j08K0j2Jn4l26L54j12J4m6J27j55
3808g4K21k25k9N29l54k99M11k92J03j22J31P5J97k77k41M58l44N8J79l47J15
$$ plain form
3829 -127 -354 -64 -210 0 -80 209 99 307 -205 -216 -138 -211 -37 216 176 -34 -32 41 -204 177 -3 137 331
3852 331 83 -174 -79 -163 -11 102 -138 -20 -58 332 -343 306 332 299 -103 108 53 -136 -192 -297 39 -14 -229
3875 -229 -107 -153 1 256 46 118 57 -1 -122 -41 117 196 68 -1 8 150 80 23 -4 -35 28 -169 -193 -212 -257 44
3901 44 113 139 207 289 -373 -461 -93 199 -337 -115 448 -27 -89 89 -4 -313 235 172 302 -365 -168 -217 24
3924 24 -353 114 4 -296 231 -20 128 85 175 -98 9 -185 250 -227 5 -1 -25 141 40 8 -130 102
3946 102 61 -272 208 353 -100 106 50 4 -203 -190 155 94 1 249 -179 -159 254 -25 -24 31 177 91 163 -263
3970 -263 -86 -86 -74 -243 116 18 22 168 -269 -84 230 -93 86 50 -72 43 -111 76 271 60 99 -144 103
3993 103 547 12 -90 -49 -257 -106 12 292 -123 -314 60 293 -155 454 34 -378 9 3 -5 173 -23 -219
$$ packed form
3829a27k27K90j46K10q0K89j10K08n12j1P8p3J74K53m0k10KP3k45L81j80J40J94
3852C31k48k57R5q4J52J13k40J18l8L90o75O49K6l3m02K11n5j89n6j05L36n3k15
3875b29J22m6J54K55k10P2o1n8j21Q1J58P9j28o9RJ42p0n7k7l1O3j97k4j9m5L01
3901D4O9K6O8Q2o62q8L68K92n36K22N63m75o2J78r3l09N48o3J30o67J97m9K41
3924B4l77M67j10l00N27k51J48m3R0k73J07j94M35m77K32ok4J66j01l2j38K32
3946A02m1l33M80J45m53K06n6m6k07J3L45o1r3K48m28K0M13k79JN5J46q6P2m26
3970b63J77%J2j69L59r8MJ46m37J85L14l23J79l6j22J15j54J87J95k11L9k43K47
3993A03M44n35j02M1k08J51J18K80m15j91L74K33m48O09m20m12L87oqJ78j96j96
$$ plain form
4015 -219 54 -40 206 -13 -89 192 -28 291 205 -41 -109 2 -45 90 130 205 174 -209 -55 39 187 144 231 0
4039 0 111 -63 130 5 -107 -144 56 249 -256 170 41 164 36 -113 21 209 111 101 162 -121 -145 -20
4061 -20 265 289 -88 -77 45 43 -116 28 -45 -91 -62 216 127 -157 184 384 -31 -215 255 -195 -63 86 274
4084 274 52 132 -172 -124 -135 -166 256 54 -4 93 27 113 45 -128 -135 119 -164 172 307 -273 -52 77 -171 -259
4108 -259 -70 -262 173 -107 -170 -172 -73 -184 -155 171 19 -130 -70 -131 -122 10 71 91 12 418 -209 43 -85 -29
4132 -29 -283 -170 -106 -83 94 106 145 -19 58 139 -107 124 649 -175 -389 -89 102 135 205 26 -117 249 -156
4155 -156 -31 40 -17 181 -182 75 -197 -95 -80 -263 -2 117 120 19 187 -136 -73 148 -141 -207 -120 361 125
4178 125 9 61 -158 -190 91 -314 54 227 -199 241 -40 -233 251 -154 60 4 -84 70 -139 25 -152
$$ packed form
4015b19K73r4K46k19p6K81k20L19q6k46o8J11m7J35M0P5l1l83J54R4J48m3Q7k31
4039@J11j74J93j25j12l7K00J93n05M26j29J23j28j49J34J88r8j0O1k83k4J25
4061b0K85K4l77J1J22kj59J44p3m6K9K78q9k84L41K00m15j84M70m50J32J49J88
4084B74k22Q0l04M8j1l1M22k02n8R7o6Q6o8j73pK54k83L36J35n80K21J29k48q8
4108b59J89j92M35k80o3kR9j11K9L26j52j49O0o1RJ32O1K0p9M06o27K52j28N6
4132b9k54J13O4K3J77J2L9j64P7Q1k46K31N25q24k14L00J91L3P0j79j43L66m05
4155a56J25P1n7J98l63K57k72J02J5j83K61J19Lj01J68l23O3K21k89o6Q7M81k36
4178A25j16N2k19l2K81m05L68J73m26M40k81j93M84m05K14n6q8J54k09J64j77
$$ plain form
4199 -152 -198 -142 -224 -322 -59 -71 210 68 125 -223 -14 -84 -142 29 100 -72 241 59 114 -353 75 -150 162
4222 162 356 -213 -175 107 154 -42 307 -334 -131 -115 224 -276 -100 20 97 -326 49 55 113 -81 -45 -272 -238
4245 -238 47 -92 -160 -84 316 35 274 -57 -231 -34 247 83 -125 -17 218 -173 -133 -1 13 84 -78 216
4267 216 -185 -200 -5 -111 -205 -46 -97 -6 -56 199 141 -110 52 195 134 99 -39 -63 -171 270 -110 378 60
4290 60 -293 365 -140 39 -54 35 27 15 108 157 -52 68 62 -198 -144 190 80 358 -31 173 403 -209 66 -259
4314 -259 142 -63 -111 49 -35 -133 -7 -295 45 -143 476 -115 16 56 -43 189 -146 217 219 279 -239 -45 68
4337 68 4 -88 63 35 -3 -196 -287 16 -9 -241 3 -95 -3 122 -64 174 186 -52 -200 -132 -22 -69 84 -495
4361 -495 -83 -175 277 -208 211 111 -39 476 71 -7 81 -139 -32 77 7 378 -128 178 143 -283 -292 201
$$ packed form
4199a52m6N6q2r8K63j2K81j42N7l48K09p0n8J71P1j72L13j82N5m67M28k25L12
4222A62J94n69L8K82M7j96L49o41K03J6L39n00J76J20P7m23L75ON8j94L6k27L4
4245b38K85j39o8P6M00k81K39l31j74J97K81j64k08J08K35l91M0J32J4P1j62K94
4267B16m01j5J95j06r4J59n1R1n0K55n8k51J62J43o1l5j38k4j08M41l80M88l18
4290F0l53O58n05J79r3Q9qj2R3M9k09J20ok60N4L34j10K78l89K04K30o12K75l25
4314b59M01k05m8J60q4r8J26k88L40j88O19n91J31M0r9K32l35L63KO0n18J94J13
4337F8o4r2J51k8l8j93r1L03k5k32K44r8R2J25j86K38J2k38j48O8J10m7J53n79
4361d95M12r2M52m85M19j00j50N15m05p8Q8k20J07J09p0L71n06L06l5m26rM93
$$ plain form
4383 201 -4 -158 -243 264 202 248 130 -229 222 -31 -153 -12 198 93 -249 -39 -192 104 87 -1 182 263
4405 263 -288 54 0 180 151 31 52 -130 -71 -67 70 339 -141 -130 -112 -82 77 -28 -230 -77 49 -181 -18
4428 -18 -181 -190 122 30 133 -191 207 79 32 -198 -254 191 23 250 251 -19 88 -186 -46 -79 20 53 -162 88
4452 88 -67 267 -130 48 226 -61 -100 -231 74 -4 7 0 -81 -413 259 -18 23 -115 75 189 -86 441 98
4475 98 187 77 -118 56 -120 30 26 -18 88 -138 -230 -197 229 162 123 56 103 -169 157 57 -236 -90 39 19
4499 19 -176 95 -109 -387 136 -267 -1 -161 -120 10 -57 -75 171 210 140 101 23 -106 -152 188 184 -341 -148 68
4523 68 -173 -222 33 48 119 78 -71 144 31 -259 73 242 34 56 -258 -2 -271 42 63 98 -31 115 74
4546 74 -14 431 118 329 -146 -52 -78 19 -417 -51 134 18 -79 -346 117 -104 -15 -59 115 -79 -30 -117 -36 -239
$$ packed form
4383B01k05j54q5N07o2M6j18l59M51k53j22J41K10j05l42K10j53K96j7q8J83Q1
4405B63n51L42n4J80k9j20K1j82N9MJ37K69m80J1J8L0J59j05k02J53J26k30J63
4428a8j63rL12r2J03l24L98j28m7k30n6M45j68K27Jk70J07k74J40l3R9L3k15K50
4452H8j55L34l97J78J78k87l9j31L05p8J1pq1l32O72k77M1j38J90J14k75N27l43
4475I8Q9j10j95J74j76J50mm4J06k26r2L3M26o7l9o7M7k72L26j00k93J46J29k0
4499A9j95K71k04k78N23m03K66j60M1J30o7j8K46L9p0l9p8j29m6L40mn25J93K16
4523F8k41m9K55J5P1m1j49K15j13k90L32J69k08K2l14K56k69L13K1L5j29J46m1
4546G4q8M45l13K11m75R4k6R7m36L66J85j16r7k67M63k21Q9m4J74j94M9q7Q1k03
$$ plain form
4570 -239 169 -1 -171 -218 97 72 125 -31 -257 2 119 -227 -1 -63 -109 6 -324 92 -94 -290 -243 -214
4592 -214 183 71 84 -60 -215 -34 19 -120 -120 -16 97 267 10 129 -43 127 -25 -64 -19 -100 -57 -125 -51
4615 -51 144 -176 -14 -167 -30 42 -58 34 -50 148 101 187 -364 -59 61 86 135 37 -133 40 168 68 73 -242
4639 -242 211 81 -250 248 6 -346 -108 3 -308 134 114 44 -4 -26 -335 339 -43 18 228 29 41 210
4661 210 -7 235 -82 -258 -39 74 44 90 27 -95 101 169 29 -142 0 95 186 -160 -488 -159 -48 -154
4683 -154 -193 -322 112 38 39 207 -169 -302 88 -214 95 -3 213 -143 -45 252 -83 -163 2 93 346 84 34
4706 34 -10 -17 80 169 -93 -172 150 -255 217 -172 126 103 -303 5 84 146 -106 170 -89 -59 -26 -5 80 -18 248
4731 248 -55 429 83 82 -9 -401 58 -69 7 -227 65 72 -72 -126 -181 219 159 27 66 83 -83 -22 114 153
$$ packed form
4570b39M08j70j70m7L15k5N3j56k26K59J17l46K26o2m6J15l30M16j86j96M7K9
4592b14L97j12J3j44j55J81N3j39%J04J13J70k57J19j72J70j52l9M5q1M3o8P4
4615e1J95l20J62j53J37P2j00R2q4J98m7Q6n51L05J20K5M9r8j70J73J28j00Nl15
4639b42M53j30l31M98k42l52K38J11l11M42k0p0m8k2l09O74l82O1K10j99J2J69
4661B10k17K42l17j76K19J13l0M6o3j22J96O8j40j71J42R5R1l46l28L29J11j06
4683a54l9j29M34p4JJ68l76j33L90l02L09r8K16l56R8K97l35q0J65R1K53k62n0
4706C4m4pR7Q9k62p9L22m05M72l89K98k3m06L08P9O2k52K76k59L0L3K1Q5r8K66
4731B48l03M84l46jr1l92M59j27P6k34K92Pj44n4n5M00o0j32L9J7j66O1J36L9
$$ plain form
4755 153 -84 97 -155 126 138 332 205 29 -177 -199 104 -304 85 -178 2 202 20 -41 -93 86 -342
4776 -342 -40 97 124 -289 238 -79 -175 106 -278 -286 -133 -176 158 278 203 223 -145 64 297 183 445 -133
4798 -133 154 208 -181 155 -159 -216 -169 -27 -45 78 -125 -122 -441 495 -57 5 102 -31 112 223 -3 16 91
4821 91 -143 250 -93 -69 -186 -220 -52 132 205 85 -137 174 -339 -275 173 251 245 -280 -31 -442 5 26 -57
4844 -57 -103 -318 29 83 -72 -22 228 -7 -66 -11 -176 186 70 124 -12 -45 -51 -83 -13 147 28 -3 133 -52
4868 -52 -9 40 91 -27 -103 -333 238 -173 148 219 275 -35 -157 -68 4 87 -96 152 -185 279 79 136 41 105
4892 105 -35 378 35 102 133 16 50 58 77 -42 365 165 -274 -70 240 121 2 235 173 -54 131 -73
4914 -73 83 200 341 61 101 185 -113 20 -47 -377 -36 14 -107 237 143 120 166 -327 34 209 399 37 -27
$$ packed form
4755A53k37J81k52K81J2J94j27j76k06k2L03m08L89k63J80K00j82o1n2J79m28
4776c42L02J37K7m13N27l17r6K81l84qJ53m3L34J20p5K0l68K09K33j14K62n78
4798a33K87N4l89L36l14n7M7J42j8J23k03Ll19R36n52O2R7j33J43J11k26J9P5
4821I1k34L93l43K4j17l4J68J84P3j20k22L11n13O4M48P8on25K49m11M47K1q3
4844e7m6k15L47N4j55N0K50k35n9N5j65L62j16N4j36l3ol2P0J60j19l1J36j85
4868e2M3M9N1j18p6k30N71m11L21P1N6l10j22Q9P2Q3j83K48l37M64k00N7r5O4
4892A05j40M13l43O7L1j17L4QJ9j19M07k00m39K04L10j19j19K33o2k27J85k04
4914g3J56J17J41k80M0Q4k98J33o7l30L41N0j21L44r4k3M6m93L61J75J90l62o4
$$ plain form
4937 -27 -79 48 -3 24 180 -182 8 270 45 -244 250 19 -159 253 160 -118 -126 -56 -96 17 115 -207 -144 130
4961 130 107 76 109 -129 -142 15 -40 18 -26 -154 -199 168 -259 34 -39 -135 135 -109 52 -31 196 152 32 -126
4985 -126 -234 -71 -345 -108 -122 137 -46 -143 51 -67 204 -388 175 -29 -65 -101 137 -154 85 286 -105
5006 -105 133 62 6 -53 52 -229 -175 159 -136 169 105 -199 96 275 -47 225 -186 -167 87 -56 -397 -265
5028 -265 -75 13 94 7 220 -81 -278 -372 0 -122 -609 -139 -269 -138 -215 -16 -213 364 54 190 67 114
5050 114 349 -163 -11 142 -382 -84 175 161 233 280 151 12 -402 42 271 134 -61 -143 -147 244 -70 26
5072 26 29 -242 -289 96 131 111 84 -32 -201 -61 346 154 -582 -88 20 203 107 -393 48 288 14 111 240
5095 240 -148 -146 -269 -112 319 94 -384 167 190 -211 -58 13 -259 67 24 -51 -222 -117 33 60 -144 146
$$ packed form
4937b7n2J27n1K7J56l62J90K62k25k89M94k31j78M12r3k78qP0m0J13R8l22O3K74
4961A30k3l1L3k38j3J57n5N8m4j28m5L67m27K93p3r6K70k44J61q3K27m4j20j58
4985a26j08J63k74K37j4K59j83r7J94j18K71n92N63k04l6l6K38k91K39K01l91
5006a05K38p1n6n9J05k81N4L34k95L05o4l04K95J79l22K72m11J9K54j43l41J32
5028b65J90Q8Q1q7K13l01j97r4L72j22m87M70j30J31p7J99j97N77l10J36j23M7
5050A14K35n12J52J53n24K98K59j4P2M7j29j39m14M44K29j37j95q2mL91l14R6
5072B6Lk71m7L85L5k0k7j16j69J40M07j92p36M94J08J83r6n00M41K40k74R7J29
5095B40l88Kj23J57M31k25m78N51K3m01J53P1k72L26m3p5j71J05J50K7k04K90
$$ plain form
5117 146 74 255 -151 -34 32 -73 -144 -241 -6 -145 -160 92 -55 -116 128 -231 204 28 147 326 28 12
5139 12 -124 66 -104 -228 -177 -331 -176 87 -22 2 -114 83 -51 -235 -48 275 -50 144 -8 224 -17
5160 -17 -235 32 -53 -79 -43 -164 -78 -11 242 165 -92 73 361 112 -41 311 -92 107 121 -46 204 -5 -145
5183 -145 175 81 -43 -30 -232 29 79 123 114 -145 -30 121 224 133 175 92 75 -103 104 -141 -93 -285 -274 26
5207 26 124 -61 -174 -56 53 193 -33 64 -22 -65 -230 -37 -291 288 137 -221 -256 -152 -156 -15 -121 155 -108
5230 -108 -98 -62 242 -198 446 259 -92 78 36 32 155 27 115 -142 -168 -79 117 240 -69 90 -130 -42 7
5253 7 -173 117 66 -134 -30 -40 43 146 -144 16 -2 220 298 234 106 -245 105 47 -94 -80 117 -246 -65
5276 -65 -51 -211 93 -93 -7 168 116 -29 87 318 320 38 49 -56 -68 137 -17 39 -143 -156 133 170 -77 -92
$$ packed form
5117A46p2J81m06J17O6j05p1r7K35j39j5K52j47o1K44l59M35j76J19J79k98j6
5139A2j36J90j70j24N1j54J55K63j09K4j16J97j34j84J87L23l25J94j52K32k41
5160a7k18K67q5k6L6j21Q6O7K53p7k57J65K88k49j53L52m03J99J4j67K50k09j40
5183a45L20r4j24J3k02K61N0M4rk59J15J51J03r1M2q3j7j78K07k45M8j92J1L00
5207B6R8j85j13J18J09J40k26R7q6m3j65J93k54N79j51l58l5J04mJ41j06K76k63
5230a08J0L6L04m40O44j87l51J70m2mJ23j28Q8k57k6Q9J96J23l09J59k20Q8M9
5253Gj80K90n1k00J04j0Q3J03k90J60j8K22P8o4j28l51L50n8j41J4J97l63J81
5276f5J4j60L04j86Q6J75n2j45J16K31Kk82J1j05j2K05j54N6j82j3K89L7k47j5
$$ plain form
5300 -92 154 108 -92 -9 -120 -55 -174 -35 -198 31 132 -140 131 -192 -265 209 -150 -81 -44 -206 126 189 26
5323 26 -76 -144 -129 -189 -51 -301 -37 27 315 -52 -82 -429 -156 110 -210 -74 112 41 -143 163 -188 146
5345 146 177 -110 46 -213 22 -170 -215 399 79 -359 -341 70 70 -246 -88 -30 -317 244 209 -202 15 28 34
5368 34 38 84 136 -564 -103 91 -233 295 68 294 146 93 -6 -188 -180 -163 -165 329 7 223 217 -157 75 -66 -199
5393 -199 74 126 -157 336 58 11 200 121 75 114 165 -14 -90 -69 -156 -232 189 -52 -102 87 -46 -157 -208 45
5417 45 255 -123 1 -265 -165 -126 6 -121 -229 11 270 78 246 178 -101 126 -207 53 -196 -179 270
5438 270 -88 22 -103 39 239 -60 90 94 69 98 230 142 -298 -177 -267 107 -259 -153 -107 286 -33 -312
5460 -312 160 -354 37 43 -143 309 24 92 -57 136 221 -99 169 -241 -164 117 -8 303 224 -213 -100 -121
$$ packed form
5300i2K46m6k00Q3j11O5j19J39j63K29J01k72K71l23p3M74l59O9L7j62L32O3j63
5323B6j02o8J5o0J38k50K64O4K88l67l0l47K73K66l20J36J86p1j84L06l51L34
5345A46L1k87J56k59K35j92m5O14l20m38J8M11%l16J58N8k87N61l5m11K17J3O
5368C4MM6N2p00M61J94l24N28k27K26j48n3r9j82QJ7kM94l22K16ol74K32j41j33
5393a99K73N2k83M93k78m7J89p9m6L9N1j79p6K1q7p6M21k41n0J89j33j11n1K53
5417D5K10l78J24k66J00L9J32j27j08K40K59j92J68o8k79K27l33K60k49J7M49
5438B70l58J10j25J42K00k99J50Mk5K9J32q8m40J21r0L74l66J06M6L93l19k79
5460c12M72n14L91Oj86M52k85O8j49J93Q5l20K68m10P7K81j25L11p9m37J13k1
$$ plain form
5482 -121 119 17 108 -243 200 -452 -24 -179 253 153 -60 -6 -141 151 42 3 64 66 55 -170 68 119 -58
5505 -58 -159 103 -306 -214 94 -63 47 -42 -159 -213 -96 -143 124 -16 109 15 391 -54 74 -69 -36 14 -145
5528 -145 -81 6 -168 224 -241 377 106 10 326 -183 -280 -3 442 175 -96 90 58 3 -198 -82 200 -159
5550 -159 -101 23 162 -51 63 102 115 -122 -47 456 11 117 46 1 65 73 86 -66 119 31 -176 -15 -192 223
5574 223 59 -260 112 -49 49 410 62 207 5 32 -367 161 -8 87 119 -27 -284 -3 75 -12 177 69
5596 69 35 -79 46 264 84 162 -16 129 -43 -127 5 138 55 -188 -243 74 156 199 -145 75 -10 -233 180
5619 180 -260 -30 -137 41 20 221 -12 266 209 68 -180 169 -14 -347 -30 -100 -40 -291 137 -11 96
5640 96 -46 297 83 -41 256 353 -203 84 195 -84 234 66 -43 -2 -125 406 6 158 -220 119 10
$$ packed form
5482a21K40j02R1l51M43o52M28j55M32j00k13N4j35K92j09l9O1Kj1k25K38N1j77
5505e8j01K62m09R2L08j57J10q9j17n4J17m7K67j40J25r4L76m45J28j43L3N0j59
5528a45O4Q7j74L92m65O18k71r6L16n09r7K77M45k67k71J86l2n5k01J16K82l59
5550a59N8J24J39k13J14L9J3k37P5N03m45J06p1m5O4QJ3j52J85q8k07J61j77M15
5574B23j64l19L72j61R8L61l48J45k02K7l99N28j69R5L2j46k57K81P8q7J89j08
5596F9l4j14J25K18j80P8j78J45j72q4J32J33q3k43n5L17Q2M3l44K20q5k23M13
5619A80m40K30j07J78k1K01k33K78n7j41k48L49j83l33L17p0O0k51M28j48J07
5640I6j42L43k14j24K97R7n56K87J11k79L18j68j09M1j23N31m00J52l78L39j09
$$ plain form
5661 10 -175 -16 532 -260 81 36 -314 71 61 -37 -332 74 -92 57 44 -153 153 -72 126 -118 -85 12
5683 12 -263 -281 -449 -4 155 -178 321 84 214 140 -142 161 -43 106 -15 -46 -117 101 -93 16 -127 -63
5705 -63 99 -150 361 -68 -202 125 179 -154 -130 -28 -83 77 141 410 -65 -194 1 9 144 53 -31 93 106
5728 106 34 -153 -71 -325 2 267 -84 334 70 -13 116 -53 -83 -146 60 -123 110 128 -85 -140 140 -180
5750 -180 -22 -115 -6 -153 50 -5 -215 23 58 385 -98 -54 8 -364 -48 -161 165 -136 15 -6 121 105
5772 105 153 -174 -125 207 -61 -120 -85 -129 140 -304 -22 120 -182 156 78 27 67 -299 -191 108 89 -129 -209
5795 -209 56 225 99 20 -93 104 214 -68 278 207 54 -139 -17 50 346 238 -143 23 7 50 -217 -10
5817 -10 333 -300 -332 -74 127 -206 -145 97 -10 -220 193 104 28 199 109 78 -123 181 -326 -105 -113 -1 14
$$ packed form
5661A0j85J59N48p92L41m5l50L85j0r8k95M06j66J49j3j97L06k25J98k44L3R7
5683A2k75j8j68M45J59l33M99k37J30p4k82L03k04J49j21l1p1K18j94J09j43O4
5705f3J62k49N11m29j34L27N4l33K4J02n5J60O4K69m75j29J95QJ35r1q4J24J3
5728A06p2j87Q2k54L27K65l51M18k64q3J29j69l0o3K06j83K33J8k13n5K80l20
5750a80J58r3J09j47K03n5k10K38L5L27m83M4O2l72L16j13L26l01J51k1J27j6
5772A05M8l27M9L32k68n9L5m4K69m44K82J42l02L38p8n1M0l66J08K99j9k18q0
5795b09K65J69j26p9j13J97J10k82L46p1j53j93J22O7K96j08l81J66j6M3k67K07
5817a0L43o33l2K58K01l33O1K42j07k10M13q9p6J71r0l1k01L04n07K21qJ12J5
$$ plain form
5840 14 -121 -264 52 -124 -126 -79 -67 89 -214 257 -137 -1 71 26 22 -254 -24 216 4 64 -96 -238 -75
5863 -75 1 64 -4 148 110 280 346 528 71 -8 235 35 105 -268 -51 -31 83 82 26 -36 60 -11 87 -225 -100
5888 -100 -29 119 -172 -58 -102 -45 -3 38 132 57 -60 64 134 142 215 -215 33 100 -20 109 5 -72 -14 -72 -74 119
5914 119 -195 -5 -101 202 241 -123 492 166 452 255 95 -59 0 -21 300 54 -97 152 -8 227 -255
5935 -255 -477 -241 -143 -229 -164 152 -141 -230 -172 -141 83 227 167 -11 57 131 52 -138 139 -56 32 -228 -60 -157
5959 -157 -7 7 113 262 247 -145 70 14 179 -129 238 118 3 -107 -80 -102 -414 -162 47 132 328 -24
5981 -24 -48 161 10 49 59 79 199 82 46 35 -371 36 -45 -48 162 126 -8 47 -88 212 109 -181 -33 272
6005 272 120 -128 -191 284 -198 79 76 42 -94 104 -30 71 -192 -431 266 87 -43 -124 187 -99 290 -304
$$ packed form
5840A4j35j43L16j76kM7J2J56l03M71l94J36P2m5mk76K30K40k12O0j60j42J63
5863g5P6O3o8J52l8J70O6J82m57p9K43k00P0l73K17K0J14jn6o2R6p1R8l12J25
5888a00P1J48k91J14m4N7M2M1R4p5j17J24P0QP3m30K48O7j20J29j04p7N8n8kJ93
5914A19l14J90r6L03L9l64O15l26K86j97j60j54N9k1L21k46j51K49j60K35m82
5935b55k22K36R8q6O5L16k93q9N8L1K24J44o0j78O8P4p9j90K77j95Q8k60J68r7
5959a57J50J4J06J49j5l92K15n6J65l08L67j20j15j10K7k2l12K52K09Q5J96l52
5981b4k4K09j51L9J0K0J20j17l6j1m06M07q1lK10l6j34N5j35L00j03k90J48L05
6005B72j52k48o3M75m82K77ll4j36J98j34J01k63k39O97j79j30q1L11k86L89n94
$$ plain form
6027 -304 -97 -16 -5 -42 36 -22 -59 -235 -197 -152 153 224 -149 117 -131 -201 -8 -73 241 -9 -4 27 -178 -16 -70
6052 -70 -362 326 323 84 140 -164 81 -71 174 -41 9 -326 251 35 -13 64 -209 52 -148 247 84 -366
6074 -366 26 -89 -38 105 167 -100 -193 247 93 72 226 114 -13 226 -60 -256 122 -72 -97 29 -19 -17 -96
6097 -96 43 -341 -135 185 -95 61 291 -68 -141 307 -15 39 -98 119 -221 177 4 37 127 292 25 -91
6119 -91 -260 -103 -184 -347 -244 -151 70 246 -215 -251 350 -33 -286 140 -73 -176 306 235 43 -40 482 150
6141 150 81 40 234 5 167 119 59 153 -273 326 -211 6 -84 -85 347 385 193 69 -35 -55 -15 27 103 -103
6165 -103 83 21 -187 -140 -89 -9 -136 240 -64 152 41 -6 186 -110 -276 379 -25 195 -76 -1 77 13 -57
$$ packed form
6027c04K07Q1J1l7P8n8l7j76L8M5L05P1l73K66k48p0J93o5L14k50NL1k05J62n4
6052g0k92O88lk39N6l04K45j52K45k15N0l35N77k16m8P7k73K61k00L95j63m50
6074c66L92j15N1J43O2k67r3M40j54k1J54j12j27K39k86j96L78j94k5J26m8Kp9
6097i6J39l84K06L20k80J56K30l59p3M48l22N4j37K17l40L98j73L3R0J65k67j16
6119i1j69J57q1j63J03R3K21J76m61l6O01l83k53M26k13j03M82p1j92q3N22l32
6141A50o9m1J94k29J62m8o0R4m26N99n37K17r0jM32L8j92j24j04k0M0M2P6k06
6165a03J86o2k08M7N1Q0j27L76l04K16j11m7J92k96j66O55m04K20k71P5P8o4p0
$$ [...]
8191h8
##END NTUPLES=NMR FID
##END=
