##TITLE=1H_LR-793-O-C2-KA
 DMSO-d6
 8 sc, 
 26.12.2024
##JCAMPDX= 6.0         $$ Bruker NMR JCAMP-DX V2.0
##DATA TYPE= NMR FID
##DATA CLASS= NTUPLES
##ORIGIN= UXNMR, Bruker Analytische Messtechnik GmbH
##OWNER= root
$$ XWIN-NMR		Version 3.5
$$ Thu Dec 26 14:22:40 2024 Russian Standard Time (UT+4h)  she@DPX200
##.OBSERVE FREQUENCY= 200.1315
##.OBSERVE NUCLEUS= ^1H
##.DELAY= (6, 6)
##.ACQUISITION MODE= SIMULTANEOUS
##.ACQUISITION SCHEME= undefined
##.AVERAGES= 8
##.DIGITISER RES= 18
##SPECTROMETER/DATA SYSTEM= spect
##.PULSE SEQUENCE= zg30
##.SOLVENT NAME= D2O
##.SHIFT REFERENCE= (INTERNAL, D2O, 0, 15.7039)
##AUDIT TRAIL= $$ (NUMBER, WHEN, WHO, WHERE, WHAT)
$$ ##TITLE= Audit trail, XWIN-NMR		Version 3.5
$$ ##JCAMPDX= 5.01
$$ ##ORIGIN= Bruker BioSpin GmbH
$$ ##OWNER= she
$$ F:/spectra/data/she/nmr/H-F/1/audita.txt
$$ ##AUDIT TRAIL=  $$ (NUMBER, WHEN, WHO, WHERE, WHAT)
(   1,<2024-12-26 14:21:21.10 +0400>,<she>,<DPX200>,
      <created by zg, POWCHK disabled, PULCHK disabled
       configuration hash MD5:
       00 E9 B6 7A A2 85 ED C7 34 08 36 98 17 FE 4E 26
       data hash MD5: 16K
       97 55 AE BF 4A 37 4B D7 4B 5C 34 76 D5 19 02 AE>)
$$ ##END=
$$ 
$$ hash MD5
$$ 52 05 6D D7 1D BF 50 24 73 3A 8E 07 EF 9C 9C 76
##$RELAX= 
##$RELAX= 
##$RELAX= 
##$RELAX= 
##$RELAX= 
##$RELAX= 
$$ Bruker specific parameters
$$ --------------------------
##$DU= <F:/spectra>
##$EXPNO= 1
##$NAME= <H-F>
##$PROCNO= 1
##$TYPE= <nmr>
##$USER= <she>
##$AMP= (0..31)
100 100 100 100 100 100 100 100 100 100 100 100 100 100 100 100 100 100 
100 100 100 100 100 100 100 100 100 100 100 100 100 100 
##$AQSEQ= 0
##$AQ_mod= 1
##$AUNM= <au_zg>
##$AUTOPOS= <>
##$BF1= 200.13
##$BF2= 200.13
##$BF3= 200.13
##$BF4= 200.13
##$BF5= 200.13
##$BF6= 200.13
##$BF7= 200.13
##$BF8= 200.13
##$BYTORDA= 1
##$CFDGTYP= 0
##$CFRGTYP= 5
##$CHEMSTR= <none>
##$CNST= (0..31)
1 1 145 1 1 1 1 1 1 1 1 1 1 1 1 1 1 1 1 1 1 1 1 1 1 1 1 1 1 1 1 1 
##$CPDPRG= <>
##$CPDPRG1= <>
##$CPDPRG2= <>
##$CPDPRG3= <>
##$CPDPRG4= <mlev>
##$CPDPRG5= <mlev>
##$CPDPRG6= <mlev>
##$CPDPRG7= <mlev>
##$CPDPRG8= <mlev>
##$CPDPRGB= <>
##$CPDPRGT= <>
##$D= (0..31)
0 1.2 0 0 0 0 0 0 0 0.06 0 0.03 0 0 0 0 0.0002 0 0 0 0 0 0 0 0 0 0 0 0 
0 0 0 
##$DATE= 1735208480
##$DBL= (0..7)
120 120 120 120 120 120 120 120 
##$DBP= (0..7)
150 150 150 150 150 150 150 150 
##$DBP07= 0
##$DBPNAM0= <>
##$DBPNAM1= <>
##$DBPNAM2= <>
##$DBPNAM3= <>
##$DBPNAM4= <>
##$DBPNAM5= <>
##$DBPNAM6= <>
##$DBPNAM7= <>
##$DBPOAL= (0..7)
0.5 0.5 0.5 0.5 0.5 0.5 0.5 0.5 
##$DBPOFFS= (0..7)
0 0 0 0 0 0 0 0 
##$DE= 6
##$DECBNUC= <off>
##$DECIM= 24
##$DECNUC= <off>
##$DECSTAT= 4
##$DIGMOD= 1
##$DIGTYP= 9
##$DL= (0..7)
0 120 120 120 120 120 120 120 
##$DP= (0..7)
150 150 150 150 150 150 150 150 
##$DP07= 0
##$DPNAME0= <>
##$DPNAME1= <>
##$DPNAME2= <>
##$DPNAME3= <>
##$DPNAME4= <>
##$DPNAME5= <>
##$DPNAME6= <>
##$DPNAME7= <>
##$DPOAL= (0..7)
0.5 0.5 0.5 0.5 0.5 0.5 0.5 0.5 
##$DPOFFS= (0..7)
0 0 0 0 0 0 0 0 
##$DQDMODE= 0
##$DR= 18
##$DS= 0
##$DSLIST= <SSSSSSSSSSSSSSS>
$$ [...]
##$SUBNAM2= <"">
##$SUBNAM3= <"">
##$SUBNAM4= <"">
##$SUBNAM5= <"">
##$SUBNAM6= <"">
##$SUBNAM7= <"">
##$SUBNAM8= <"">
##$SUBNAM9= <"">
##$SW= 24.0689530833862
##$SWIBOX= (0..15)
0 0 2 0 0 0 0 0 0 0 0 0 0 0 0 0 
##$SW_h= 4816.95568400771
##$TD= 16384
##$TD0= 1
##$TE= 0
##$TE2= 300
##$TE3= 300
##$TEG= 300
##$TL= (0..7)
0 120 120 120 120 120 120 120 
##$TP= (0..7)
150 150 150 150 150 150 150 150 
##$TP07= 0
##$TPNAME0= <>
##$TPNAME1= <>
##$TPNAME2= <>
##$TPNAME3= <>
##$TPNAME4= <>
##$TPNAME5= <>
##$TPNAME6= <>
##$TPNAME7= <>
##$TPOAL= (0..7)
0.5 0.5 0.5 0.5 0.5 0.5 0.5 0.5 
##$TPOFFS= (0..7)
0 0 0 0 0 0 0 0 
##$TUNHIN= 0
##$TUNHOUT= 0
##$TUNXOUT= 0
##$USERA1= <user>
##$USERA2= <user>
##$USERA3= <user>
##$USERA4= <user>
##$USERA5= <user>
##$V9= 5
##$VALIST= <valist>
##$VCLIST= <CCCCCCCCCCCCCCC>
##$VD= 0
##$VDLIST= <DDDDDDDDDDDDDDD>
##$VPLIST= <PPPPPPPPPPPPPPP>
##$VTLIST= <TTTTTTTTTTTTTTT>
##$WBST= 1024
##$WBSW= 4
##$XGAIN= (0..3)
0 0 0 0 
##$XL= 0
##$YL= 0
##$YMAX_a= 151647
##$YMIN_a= -154033
##$ZGOPTNS= <>
##$ZL1= 120
##$ZL2= 120
##$ZL3= 120
##$ZL4= 120
##$ABSF1= 10
##$ABSF2= 0
##$ABSG= 5
##$ABSL= 3
##$ALPHA= 0
##$AQORDER= 0
##$ASSFAC= 0
##$ASSFACI= 0
##$ASSFACX= 0
##$ASSWID= 0
##$AUNMP= <proc_1d>
##$AZFE= 0.1
##$AZFW= 0.1
##$BCFW= 1
##$BC_mod= 2
##$BYTORDP= 1
##$COROFFS= 0
##$CY= 11.3945322036743
##$DATMOD= 1
##$DC= 2
##$DFILT= <>
##$DTYPP= 0
##$F1P= 15.6554695791079
##$F2P= 12.8336369535428
##$FCOR= 0.5
##$FTSIZE= 0
##$FT_mod= 4
##$GAMMA= 1
##$GB= 0.15
##$INTBC= 1
##$INTSCL= 1
##$ISEN= 128
##$LB= 0.24
##$LEV0= 0
##$LPBIN= 0
##$MAXI= 10000
##$MC2= 0
##$MEAN= 0
##$ME_mod= 0
##$MI= 1.114404
##$NCOEF= 0
##$NC_proc= 0
##$NLEV= 6
##$NOISF1= 3.799351
##$NOISF2= 2.8
##$NSP= 1
##$NTH_PI= 0
##$NZP= 0
##$OFFSET= 15.70392
##$PC= 1
##$PHC0= -26491.32
##$PHC1= 20.78744
##$PH_mod= 1
##$PKNL= yes
##$PPARMOD= 0
##$PSCAL= 0
##$PSIGN= 0
##$REVERSE= no
##$SF= 200.130013532006
##$SI= 16384
##$SIGF1= 3
##$SIGF2= 2
##$SINO= 400
##$SIOLD= 16384
##$SREGLST= <1H.CDCl3>
##$SSB= 0
##$STSI= 0
##$STSR= 0
##$SW_p= 3612.71676300578
##$SYMM= 0
##$S_DEV= 0
##$TDeff= 0
##$TDoff= 0
##$TI= <>
##$TILT= no
##$TM1= 0
##$TM2= 0
##$TOPLEV= 0
##$USERP1= <user>
##$USERP2= <user>
##$USERP3= <user>
##$USERP4= <user>
##$USERP5= <user>
##$WDW= 1
##$XDIM= 8192
##$YMAX_p= 0
##$YMIN_p= 0
$$ End of Bruker specific parameters
$$ ---------------------------------
##NTUPLES= NMR FID
##VAR_NAME=  TIME,          FID/REAL,        FID/IMAG
##SYMBOL=    X,             R,               I
##VAR_TYPE=  INDEPENDENT,   DEPENDENT,       DEPENDENT
##VAR_FORM=  AFFN,          ASDF,            ASDF
##VAR_DIM=   8192,          8192,            8192
##UNITS=     SECONDS,       ARBITRARY UNITS, ARBITRARY UNITS
##FACTOR=    0.0002076,     1,               1
##FIRST=     0,             0,               0
##LAST=      1.7004516,     0,               0
##MIN=       0,             -154033,         0
##MAX=       1.7004516,     151647,          0
$$ Real data points
##PAGE= N=1
##DATA TABLE= (X++(R..R)), XYDATA
0@%%%%%%%%Qj6J6j6J6k4L2l6M4n4O2p2Q8j04J20j36J52j76K04k32K61k97L36l76
32b00M24m73N29n92O58p31Q13r01R97j104J222j353J499j663J848k057K295k567
50a356K888l273L740m322N069o077P512r738J3703k2952Q4314O9010q6332l8427
64A3759o7854n6339m3599N088J5831M1940N8262O9754M9917M2191K1866o411m0551
77A03854m8992n7191n9092n0573k4663m648K0514M5540N8905N2325M9298M1371
89A26648J5313j8784l4632m4230n6371n6910l7818j9920l617K3573M8932N0980
101f836M5250M6562L6600N537k0390l0549m2118n4722m9772l2232j7147J683K7646
114i0488M3276M4500M6146M4739K5594o69j6997k9938m5240m9510m0100k9556
$$ plain form
0 0 0 0 0 0 0 0 0 0 8 -8 8 -8 8 -16 16 -20 24 -30 32 -40 48 -56 64 -72 80 -96 108 -124 137 -160 176 -200
32 -200 224 -249 280 -312 346 -385 428 -473 524 -580 642 -711 788 -875 973 -1084 1211 -1356
50 -1356 1532 -1741 1999 -2323 2746 -3331 4181 -5557 8146 -14806 69508 138518 52186 13759
64 13759 -54095 -110434 -154033 -148945 -133114 -91174 -32912 36842 86759 128950 150816 144405 103854
77 103854 54862 -2329 -61421 -111994 -136657 -141305 -120791 -75251 -16346 35979 85277 126648
89 126648 141961 123177 88545 44315 -12056 -68966 -106784 -126704 -130321 -106748 -57816 -6836
101 -6836 38414 84976 121576 127113 106723 76174 34056 -20666 -70438 -102670 -119817 -118134 -90488
114 -90488 -47212 -2712 43434 88173 113767 113098 96101 66163 20923 -28587 -68687 -98243
126i8243j5943Q827L0634L6791M0126M6730L9193J5754k734j3910l0738m5351
138A1136m3732l4921k7449j1066J3459K8191L2754M0684M4900L1330J0613k511
150I3388j5286l2569m1470l8441l3228k3556m139J4665K3973L2251M1432L8668
162E5688K3683R942j822j8479l2813l6494l5356l1808j8494M52J3147K1769L3842
175a6743M0075L2250J9423R332m167k0789l0436l3060l3981k8361j2845K080J1318
188f5904K2573L4395L5442K6751J7978Q202p194k1009k7741l1752l2550k3357
200f4166q881J461J1106K4759L3368L0517K3583J6773N152r583j9912k6179l1093
213a3095k9149j8307p384J074J2903K5728K9913K6555K2222J4963K247j0234j8724
$$ plain form
126 -98243 -114186 -105359 -74725 -37934 2192 48922 88115 103869 101135 87225 56487 11136
138 11136 -32596 -67517 -94966 -106032 -92573 -64382 -31628 9056 53956 85286 95899 93388
150 93388 78102 45533 4063 -34378 -67606 -91162 -95301 -80636 -56663 -24412 17020 55688
162 55688 79371 89313 87491 69012 36199 -295 -35651 -67459 -85953 -85501 -72354 -50585 -16743
175 -16743 23332 55582 75005 84337 80170 59381 28945 -4115 -38096 -66457 -79302 -77222 -65904
188 -65904 -43331 -8936 26506 53257 71235 79437 72243 51234 23493 -8259 -40809 -64166
200 -64166 -73047 -71586 -60480 -35721 -2353 28164 51747 68520 73672 64089 44177 17998 -13095
213 -13095 -42244 -60551 -67935 -66861 -53958 -28230 1683 28238 50460 65423 67670 57436 38712
226C8712k5879k9707k4915j5476p388K161J5338K5088K6679K4530K0700J1863
238F1706N9j0054j8663k6001k6874k1057j4012o771M549J6613K3088K4137K3374
251C0094J8671R266j020j0246j9233k5074k3763j8766j3395n059P067J6835K1325
264a3298K2901K1884J6026P150j759j1137j9856k3091k0917j7429j2263k647Q477
277d5959J6068K0063K1937K0052J3916N955k855j2318j9312k0947j9538j6757
289c9695j0323j71R241J5440J9580K0818J7935J1992M715m378j3305j8234j9134
302e519j8581j5488p952J511R352J5058J8892J9393J6287J0797L151n834j3316
315B7751j7131j8337j7865j3655n811K646R591J5061J8153J7956J4899R280J321
$$ plain form
226 38712 12833 -16874 -41789 -57265 -64653 -62492 -47154 -22066 4613 29143 49843 61706
238 61706 61765 51711 33048 7047 -19827 -40884 -54896 -61667 -57118 -40505 -17417 6720 30094
251 30094 48765 58031 57011 46765 27532 2458 -21305 -40071 -53466 -58525 -51458 -34623 -13298
264 -13298 9603 31487 47513 54663 52904 41767 21911 -1180 -22097 -39526 -51789 -54436 -45959
277 -45959 -29891 -9828 12109 32161 46077 52032 49177 36859 17547 -3400 -22938 -39695
289 -39695 -50018 -50189 -40948 -25508 -5928 14890 32825 44817 49532 45154 31849 13615 -5519
302 -5519 -24100 -39588 -47540 -46029 -36677 -21619 -2727 16666 32953 43750 46901 41067 27751
315 27751 10620 -7717 -25582 -39237 -45048 -42402 -32811 -17750 403 18359 33258 42538 43859
328D3859o994j2795j6144j7691j6749j1659m204L197R731J4841J7248J6811J3767
341C3218P706q3p388j2451j5713j7235j5456r872k806L900J0070J4546J6523J5823
355B0782J2211N936j262p489j2216j5583j6331j3735q371j931M616J0186J4132
368i055J5870J4901J0800M454k040p593j2336j5371j5381j2198o967r03N138J0390
382b0291J3985J5118J3611R183L341k607p843j2323j4750j4299j0918n780m4N566
396b8051J0455J3731J4510J2346P859K383l116q258j2428j4272j3140r507m684
409c2172P06O044J0679J3384J3447J0974O730J685l643q621j2324j3378j1943
422a8432q526l859J385O500J0768J2936J2564R965N705R04m270q986j2102j2586
$$ plain form
328 43859 36865 24070 7926 -9765 -26514 -38173 -42377 -39180 -29449 -14608 2640 19451 33218
341 33218 40924 40841 33453 21002 5289 -11946 -27402 -37274 -40080 -36180 -26110 -11564 4959 20782
355 20782 32993 38929 37667 30178 17962 2379 -13952 -27687 -36058 -37989 -33373 -23187 -9055
368 -9055 6815 21716 32516 36970 34930 27337 15001 -370 -15751 -27949 -34916 -35819 -30681 -20291
382 -20291 -6306 8812 22423 31606 34947 32340 24497 12174 -2576 -16875 -27793 -33573 -33617 -28051
396 -28051 -17596 -3865 10645 22991 30850 33233 30117 21859 9431 -4841 -17981 -27488 -32172
409 -32172 -31466 -25422 -14743 -1359 12088 23062 29792 31477 27834 19213 6889 -6489 -18432
422 -18432 -26958 -30817 -29432 -22932 -12164 772 13336 23301 29006 29910 25640 16654 4552 -8034
436h034j0856p411l018J956O966J0777J2312J1445Q840N035K31m843r136j1583
450B681j1748r970o696k267K675P337J0588J1622J0667Q046M173n38n379r198
464A1993j1134j0912r130n809j507L250P527J0283J0883R809P255L440j130n818
478A9000r149j0593j0173q363n187p67L913P719R941J0279R120O572K562j993
492B2881o108q893j0019r574p666m288P4M316P665R494R668Q442N740J827k500
507B1059o296q688r536q948o979l470P58M725P628R072R185P852M887J001l065
522A9185o368q414r067q279o221k661J371M938P382Q689Q684P190M064L61l294
537A7560o337q178q636p803n471j976J861N076P249Q366Q248O472L338k36l619
$$ plain form
436 -8034 -18890 -26301 -29319 -27363 -20397 -9620 2692 14137 22977 28012 28243 23400 14264 2681
450 2681 -9067 -19037 -25733 -28000 -25325 -17988 -7400 4222 14889 22935 27108 26570 21191 11993
464 11993 859 -10053 -19183 -24992 -26499 -23249 -15722 -5439 5444 15253 22508 25948 24818 19000
478 19000 9851 -742 -10915 -19278 -24465 -25232 -21319 -13600 -3659 6620 15740 22312 24874 22881
492 22881 16773 7880 -2139 -11713 -19379 -23667 -23593 -19277 -11612 -2118 7550 15992 21732 23559 21059
507 21059 14763 6075 -3461 -12409 -19388 -22858 -22100 -17375 -9747 -675 8510 16362 21249 22250 19185
522 19185 12817 4403 -4664 -12943 -19164 -21825 -20454 -15516 -8134 555 9239 16429 20493 20854 17560
537 17560 11223 3045 -5591 -13394 -18865 -20841 -18980 -13904 -6655 1711 9959 16431 19769 19533 15914
552A5914o270p825q192p249m671j276K207M979P117Q119P634N686K742n68l806
567A4541o224p621p841o572m020p24K401N096P046P778P043N043K169j059l943
582A3113o121p364p381n954l266l47K554N126O938P374O464M509J611j384m018
597A1854o089p185p000n211k705jK801N338O770O873N918L859J104j717m183n986
613D440o892o365m601k225L44L038N330O526O481N381L313O78j910m283n970o631
629c346n817m053j844P06L343N309O243O059M822K752L49k184m404n852o146n273
645i336l644j461J108L492N175N917N691M398K323L2k355m531n708n741m795l281
661a2716j070J445L653N051N682N278L860J890k70k565m576n435n270m460k853
$$ plain form
552 15914 9644 1819 -6373 -13622 -18293 -19569 -17362 -12383 -5266 2853 10487 16173 18915 18347 14541
567 14541 8317 696 -7145 -13717 -17737 -18461 -16060 -10964 -3918 3860 10903 15946 18115 17056 13113
582 13113 6992 -372 -7753 -13707 -16973 -17320 -14766 -9640 -2702 4672 11136 15645 17256 15872 11854
597 11854 5765 -1420 -8420 -13631 -16336 -16337 -13536 -8198 -1428 5445 11363 15222 16326 14609 10426 4440
613 4440 -2452 -8817 -13418 -15643 -15299 -12261 -6931 -405 6076 11457 14770 15448 13538 9255 3285 -3346
629 -3346 -9163 -13216 -15060 -14354 -11011 -5702 541 6600 11422 14174 14523 12339 7935 2083 -4063 -9336
645 -9336 -12980 -14441 -13333 -9841 -4666 1251 6942 11340 13663 13695 11340 6809 1101 -4640 -9435 -12716
661 -12716 -13786 -12341 -8688 -3637 2045 7323 11183 13073 12803 10238 5662 227 -5043 -9503 -12356
676a2356p05J759L659M953N448M847L446J558n52k859m567n149m972m108k415
691a2013k15J954L678M830N154M401K998J294r27l027m400m867m657l730k029
706a1556O0K106L712M687M818M043K760R15j223l157m204m657m418l340j618L48
722a0724K235L743M516M441L714K466N56j502l121l992m530m129k980j248N30
737a0025K332L759M324M205L454K094J40j694l023l984m347l758k575r66P53K531
753f780L616M079L938L161J711j52j732l046l876m134l400k269p64R93K654L503
769b498L862L710K844J367l84j794l036l819l838l054j973n25J242K597L358L712
785A771L481K534J023m89j875l009l672l569k828j743k01J337K546L294L618L177
$$ plain form
676 -12356 -13061 -11302 -7643 -2690 2758 7605 11051 12609 12057 9198 4631 -518 -5490 -9598 -12013
691 -12013 -12228 -10274 -6596 -1766 3388 7789 10787 12081 11154 8127 3727 -1140 -5797 -9527 -11556
706 -11556 -11496 -9390 -5678 -991 3827 7870 10630 11545 10322 7165 2961 -1696 -6114 -9454 -11072 -10724
722 -10724 -8489 -4746 -230 4211 7925 10391 10947 9445 6324 2332 -2198 -6327 -9307 -10555 -10025
737 -10025 -7693 -3934 390 4595 8049 10143 10283 8589 5566 1582 -2765 -6523 -9098 -10064 -9311 -6780
753 -6780 -3164 915 4853 8014 9725 9573 7841 4795 919 -3215 -6615 -8884 -9648 -8655 -6001 -2498
769 -2498 1364 5074 7918 9285 8901 7107 4071 252 -3586 -6640 -8613 -9138 -7896 -5299 -1941 1771
785 1771 5252 7786 8809 8320 6445 3436 -236 -3805 -6633 -8376 -8577 -7240 -4694 -1400 2218 5395
801E395K193P60o04k025k978l452l301k550j456J9J401K519L170L480K864J867
817G302O15p16k081k930l256l101k363j185K88J464K471L118L254K590J606L99
833G475q53k127k820l104k841k119q61L76J473K430L063L006K344J432K49j058
849F065k079k705l001k644j858o44M91J534K470K919K715K104J241N4j144k090
865C428k600k844k411j554n05N29J617K392K778K513J940J028j22j174j997k533
881D85k728k199j327m08O63J649K352K566K384J745Q16k38j223j929k477k496
897b365j966j168l37P39J694K200K432K224J590O74l74j188j947k370k352j756
913d270j074j96Q66J681K112K327K007J412M63l38j238j917k261k118j651r31
$$ plain form
801 5395 7588 8348 7744 5719 2741 -711 -4012 -6562 -8018 -7999 -6598 -4079 -909 2571 5435 7302
817 7302 7917 7201 5120 2190 -1066 -4167 -6530 -7715 -7427 -5963 -3492 -374 2880 5470 7076 7475
833 7475 6622 4495 1675 -1429 -4270 -6389 -7250 -6874 -5401 -2971 92 3098 5442 6874 7123 6065
849 6065 3986 1281 -1720 -4364 -6222 -6866 -6375 -4841 -2371 548 3263 5367 6608 6662 5518 3428
865 3428 828 -2016 -4427 -5981 -6486 -5957 -4340 -1948 830 3343 5283 6311 6189 5015 3018 485
881 485 -2243 -4442 -5769 -6177 -5514 -3865 -1513 1053 3437 5182 5998 5760 4537 2608 131 -2365
897 -2365 -4331 -5499 -5836 -5097 -3403 -1203 1229 3453 5043 5717 5343 4155 2208 -162 -2514 -4270
913 -4270 -5344 -5540 -4674 -2993 -881 1446 3453 4865 5328 4990 3752 1835 -426 -2544 -4195 -5126
929e126k8Q96J635K013K180J888J199M09m53j257j904k131j981j497p72J27R50
946c852J549J999K047J711J002L22n29j297j811j992j818j356o41J98R52J569
962a947J943J914J522R09K09o19j338j772j847j739j202m45L16R71J545J855J763
979B038J361P67P4o63j338j671j824j540j033l58L85R68J564J783J596J261O78
996D048m7p78j274j674j690j441q73k34L97J108J494J634J546J124N08j30q13
1013B905j241j614j553j286p88j82N02J139J449J532J420R87M46k74q33j238j518
1030a47j477j155o84p2O26J066J355J459J304R21K67k82q26j286j426j368j042
1047b767n70J4O47J056J354J410J153P51K41l59q52j275j336j260r78m39J02O97
$$ plain form
929 -5126 -5154 -4258 -2623 -610 1570 3458 4657 5066 4613 3356 1452 -679 -2660 -4157 -4929 -4802 -3852
946 -3852 -2303 -304 1743 3454 4456 4778 4249 2952 1141 -851 -2669 -4025 -4666 -4468 -3516 -1947
962 -1947 -4 1910 3432 4341 4550 3931 2593 821 -1026 -2765 -3967 -4412 -4096 -3125 -1580 275 2038
979 2038 3399 4166 4240 3577 2239 568 -1256 -2796 -3829 -4187 -3802 -2834 -1270 513 2109 3370 4048
996 4048 4001 3223 1949 275 -1415 -2856 -3729 -3963 -3566 -2458 -964 670 2216 3340 3848 3718 2905
1013 2905 1664 50 -1503 -2789 -3577 -3759 -3257 -2118 -669 863 2283 3270 3716 3442 2609 1371 -147
1030 -147 -1624 -2779 -3463 -3535 -2909 -1843 -488 971 2275 3196 3463 3181 2355 1069 -357 -1725 -2767
1047 -2767 -3337 -3323 -2676 -1620 -266 1144 2297 3048 3289 2930 2078 803 -533 -1793 -2771 -3210 -3108 -2411
1065b411J018J327J323J025O65J47l85r04j193j307j142q50l66J98O98R92J260
1082I5J262R54N57Q0m82q86j153j260j063p07k91K47P25J006J184J127R28M29
1100B752l4m61q89j167j159r59o77j60K83P41J012J141J074Q02L37o5n66q94j076
1119C5j063r49n21q7L66P14R83J081R88P15K49j12n91q55j037j017q24n00L1L39
1139b055P94R27J017R07O11K34k28n99q24j008r64p09l93J7M56O90R22R71Q09
1158A575N41J43k39n58q57r17r09o62k90J3M70P11R13R18P28M55Q4k70n89q01
1178D59r16p97n78k50J04M51P28Q47Q82O55L99M3l21n73q18q41p95m86j65J56
1198a816M31P13Q45P57O21L28Lk93o10p52q06p13m28k05K24M59O84P69P73N29
$$ plain form
1065 -2411 -1393 -66 1257 2282 2947 3094 2709 1805 612 -695 -1837 -2687 -3053 -2855 -2157 -1165 95
1082 95 1357 2311 2868 2948 2466 1580 427 -833 -1896 -2603 -2894 -2647 -1922 -916 268 1395 2323 2752
1100 2752 2718 2257 1368 201 -958 -1917 -2594 -2754 -2471 -1730 -718 423 1497 2299 2636 2571 2005 1111 35
1119 35 -1028 -1977 -2498 -2585 -2219 -1505 -522 559 1547 2262 2511 2399 1808 953 -84 -1101 -1925 -2425 -2394 -2055
1139 -2055 -1261 -334 683 1590 2201 2435 2207 1608 784 -224 -1188 -1897 -2290 -2273 -1817 -1127 -205 766 1575
1158 1575 2116 2259 2020 1462 605 -312 -1221 -1883 -2173 -2160 -1690 -979 -66 852 1580 2035 2119 1849 1260 459
1178 459 -457 -1254 -1832 -2082 -1978 -1527 -799 48 930 1585 1984 2027 1706 1133 315 -526 -1321 -1807 -1972 -1816
1198 -1816 -1385 -672 173 930 1551 1879 1882 1589 979 227 -579 -1292 -1720 -1925 -1701 -1242 -558 211 984 1513
1218A513K90j2l55n85p36p84n93m17j29K33M46P11P45O53N10K17l2l67n67p49
1238ho65n83l52n2J89M88O30P62O06M39K07o3m01n92o42o89n25k57m3J90N10O42
1260b09O49N71M13J41q9m09n54o26o26m83k61j1K60M95N67O08N53L71Q9j27l18
1281A004n68o15n76m51k22LK78M85N33N98N09L15M2j25l23n45n52n08l96k28L4
1302a308K69M63N64N05M79K66P1j30l68n11n33m75l37k11P6K47M17M93N45M16
1322I38K60M8k00l41m70m92m92l20j56J02K24M44N10M59L84J92M7k25l23m13m85
1343c09m26k73j49J05K62M18M37M37L52K13j2j90l17m34m41l91k69n3O7K69L86
1364c18M59L91L10J87J9k26l20m02l95l63k79p4Q4K85L45M52L67L34J20k3k03
$$ plain form
1218 1513 1803 1791 1436 851 115 -669 -1262 -1679 -1808 -1575 -1129 -418 327 980 1490 1707 1675 1308 741 -8
1238 -8 -673 -1256 -1608 -1660 -1471 -983 -353 409 1015 1454 1661 1598 1197 605 -37 -726 -1251 -1508 -1551 -1361 -851 -209
1260 -209 440 1011 1424 1565 1476 1067 513 -113 -739 -1222 -1483 -1494 -1234 -739 -172 436 989 1360 1449 1322 1004
1281 1004 436 -179 -755 -1206 -1428 -1425 -1147 -662 -129 469 978 1293 1335 1210 887 342 -210 -718 -1114 -1342 -1308
1302 -1308 -1039 -576 -12 493 972 1238 1309 1179 811 300 -233 -708 -1045 -1256 -1180 -933 -516 -23 522 938
1322 938 1198 1246 1046 705 235 -257 -749 -1069 -1225 -1123 -899 -455 55 514 898 1090 1137 912 589 176 -309
1343 -309 -735 -1008 -1157 -1052 -790 -372 65 502 854 1067 1055 865 548 114 -327 -718 -987 -1040 -973 -704 -318
1364 -318 141 532 842 1029 1048 822 502 100 -295 -658 -937 -1011 -927 -642 -297 155 522 856 976 953 750
1385G50k99l65m27l65j66r0J28K71L09L97L56K81J51l4j82l28l70l49l67j48n2
1406h99J33K33L13L62L78K26J48k2k33k46m17l35k73j56o5R4K69L34L60L18K29
1427G51Q1l2j67l00l49l23k91j35k7J26K31L00L84K71K01P0j7k15k99k94l19k43
1449e96j83kJ46J90K98L31K76K25P3m2j81k85l15k91k37j55J8J00K35L14L32K31
1471D82K20L4m0k08k55k83l34j96j08k5J30K37L06K94K80J47M6o8j81k69k93k62
1493c46k43j00j3J53K30K93K70K36J64P0j32j71k50k79k61k11r9J7J59K21K71
1514b1K78K43J43J0p1j95k56k76k31k11n9J7J21K37K71K61K33J35J0n7j74k75
1536A33k95k04j58j16L2J45K37K60K54K19J13K3p8k16k62k20k51j62r8N8J53K36
$$ plain form
1385 750 451 86 -341 -706 -872 -962 -834 -563 -254 143 499 780 931 897 715 387 17 -332 -699 -847 -899
1406 -899 -766 -533 -220 142 520 746 894 872 639 393 -24 -359 -632 -788 -853 -759 -490 -156 204 522 751
1427 751 832 800 633 333 -16 -339 -630 -765 -792 -666 -435 -135 249 520 721 791 774 559 260 -34 -353 -596
1449 -596 -779 -781 -635 -445 -147 184 460 685 758 716 535 250 -65 -356 -593 -748 -730 -630 -395 -81 251 482
1471 482 702 736 696 488 233 -50 -384 -580 -688 -713 -583 -346 -40 254 534 681 727 659 478 209 -84 -346
1493 -346 -589 -689 -702 -549 -319 -26 244 480 644 714 582 411 161 -118 -379 -590 -689 -672 -513 -292 -21
1514 -21 257 500 643 653 582 387 131 -145 -376 -587 -646 -629 -508 -271 0 261 494 629 639 582 408 133
1536 133 -162 -366 -524 -640 -608 -463 -226 34 288 507 620 643 565 349 87 -133 -384 -546 -644 -586 -433 -197
1558a97K52K33J85J28j5o5j81k66k11k56j40j04O8J72J91K45K13K23J17K2j07
1579E07k08k37k63j99j55k5K4J60J94L10K03K02P2rj13j83k01k67j88j45l3L9
1601e15J50K00K85J87J71R5k5j10k11j53k64k15j16l1Q3J03K25K24K09J89M5j3
1623E13r1j59k54k44j54j35m2Q7J57J91K37J89J80K4K4j32j55k24k01j94j32j5
1645e30O0J48K08K47J60J38O9k8p3j75j98k21j89p8m5P6J56J93J94K00J57M6l5
1668D80p4j94j92k21j73r8m7J11J38J68K26J47J57N4j0j22j61j92k32j51j00J3
1690d73L5J38J92J97J60J75Q3l3j29j57j99j97j55p8qP8J43J65K24J73P0N4l1
1713D27j06j41j84k03j41o3l1O7J17K04K08J17J34N0m0j07j63j85j64j41n7n4
$$ plain form
1558 -197 55 288 473 601 586 521 340 74 -137 -393 -533 -637 -569 -397 -206 39 252 475 592 614 507
1579 507 299 62 -201 -400 -555 -580 -556 -396 -202 108 311 513 585 576 463 280 79 -188 -376 -521 -554 -515
1601 -515 -365 -165 120 307 478 573 548 438 227 74 -190 -405 -521 -552 -469 -366 -141 83 292 481 526 513
1623 513 422 263 9 -235 -389 -524 -566 -479 -322 -131 106 295 475 499 523 391 236 12 -189 -383 -515 -530
1645 -530 -470 -322 -114 133 293 431 500 472 399 224 26 -195 -384 -462 -507 -431 -275 -82 112 312 469 515 480
1668 480 406 212 20 -201 -374 -472 -519 -408 -270 -102 124 271 428 482 472 350 189 -3 -235 -386 -486 -473
1690 -473 -438 -300 -108 89 249 424 507 474 345 188 -11 -208 -363 -441 -449 -371 -228 -63 161 334 404 458 427
1713 427 321 180 -4 -207 -348 -411 -442 -375 -258 -54 154 271 405 455 415 308 145 -40 -204 -345 -402 -456
1735d56O6J39J72K15J77P8O6l8j44j60j72j54j73m0k8P7J45J85J99J61J10J4n7
1758C82r3j42j79j88j19j11P5M8J69J37J72J57P4N9l2j35j52j69j84j13m7nO8
1781c28J40J40J96J64R6Ol7j21j68j69j58j29l6QR1R6K20J32J56O2M5p0j38j19
1805G9j71j53j02n0L8R5J02J85J50J08J02J9n8r2j85j55j19j25o4M4O6J56J38
1828HJ34J81O4mm3j27j38j69j14q6r0K8J05J24J76J33J15L0O3o6j47j17j71j66
1852b77o3l2RR1J55J54J26J28P5J7r1j29j21j55j28j14OK2J31R9J63J41J00N4
1876C61nq1j14j24j49j54o6rN0R2J26J57J40J02L3jp7j30j25j60j07r4mP2P9J29
1902e9J43J09R9N7Nj09j52q1j86j08m8oM9J15J09J97R9Q8M0l9j06j10j51j32q1
$$ plain form
1735 -456 -390 -251 -79 136 313 391 457 419 275 115 -57 -211 -384 -424 -452 -375 -230 -45 154 315 425 439 382
1758 382 289 147 -32 -220 -339 -450 -375 -327 -158 -21 151 308 382 441 409 274 122 -47 -231 -344 -391 -396 -328
1781 -328 -188 -48 148 312 408 414 377 256 88 -81 -239 -368 -404 -396 -305 -209 11 143 299 361 406 336 198 79
1805 79 -92 -245 -347 -397 -359 -264 -162 23 173 281 383 402 344 252 67 -88 -207 -332 -396 -352 -286 -130 8
1828 8 142 323 387 383 340 213 75 -94 -208 -294 -384 -356 -251 -127 49 182 297 327 390 324 177 60 -111 -277
1852 -277 -340 -372 -363 -272 -117 37 163 291 366 383 292 163 42 -113 -241 -355 -349 -327 -196 -97 66 207 307 361
1876 361 356 275 161 37 -112 -266 -332 -341 -291 -199 -73 84 224 326 359 358 281 151 26 -134 -241 -335 -339 -267 -188 -59
1902 -59 84 193 292 349 354 245 93 12 -174 -282 -330 -336 -287 -172 -63 134 233 321 361 322 216 106 -45 -177 -258
1927b58j05L0L7J09J51J86Q3J12Nj1j00j40j56j08j26o3J2J28K1J84J45J43P3
1950C52J1m1q8j71j20j39r3o8J3P4J14J90J01J13P5K3o9p9j57j86r6m6l8PQ1J47
1976i0J25J34R1M3L4n6j09j32j48j16q2k6N9M4J16J74R7J37N2n8j1j07j08j53
2000i0j27p3j8j1J35J06J37J35J04K8J1q0r3j61j25j13j01J6J5J12J11J48J29
2023A95O1N3k8m4q7j53j60r1o0JJ6J23J24J25J04P8O7j3q3j03j51j13j24k3k9
2048c15P9N8J28J34J65M8K3op4j35j25j15r6l9m7Q3Q8J17J33J37M5L4l3p0j34
2073H3j44j21q2n4K7QJ57Q1J45J39N2K7l6r6j17j12j33p5o5K3L4J04J67R6J03
2098B11N3P0m7j37j20r4j10n0p9K6P5R8J18J12J31L5K7o4q4j17j19r8p0o3J5P5
$$ plain form
1927 -258 -363 -333 -296 -187 -36 150 233 345 350 339 239 99 -57 -165 -291 -354 -342 -214 -193 -9 136 279 352
1950 352 363 322 234 63 -57 -196 -289 -357 -344 -270 -156 34 135 248 323 346 277 198 41 -145 -241 -287 -325 -318 -237 -90
1976 -90 35 169 260 303 337 281 172 40 -108 -224 -306 -332 -273 -229 -113 61 158 295 347 289 278 171 63 -90
2000 -90 -217 -290 -308 -319 -184 -78 59 194 298 326 337 257 164 3 -122 -235 -336 -320 -305 -193 -82 66 195
2023 195 256 309 281 237 150 -3 -163 -254 -314 -313 -297 -174 -50 75 179 257 324 311 228 125 -26 -139 -263 -286 -315
2048 -315 -236 -178 -50 84 249 297 320 314 240 105 -20 -135 -231 -270 -317 -234 -146 -29 104 241 286 320 287 217 83
2073 83 -61 -182 -264 -318 -291 -283 -126 -45 100 239 291 318 282 186 69 -43 -176 -251 -316 -293 -259 -155 12 108 211
2098 211 264 334 287 150 30 -64 -174 -224 -303 -277 -202 -104 14 126 257 292 319 255 171 54 -65 -163 -233 -296 -281 -206
2124b06J07J15R9J10R6k4p0q5q8j21j11j00j0L3M2P9J47J17N8J10k1n3q7j20j23
2149a06j17m5JrJ06Q0J07J36L8J07k3m0j00p7j21j25o7k6L7O6J22J04J27P0K3
2174B68L1p8n5j25j11j10p8j0M0L7J23J11J24P1L1J0n3j17j25q7j18n8KM2O0J12
2200f3P9J13Q0P5n2k6j09q7j43o6o0QK0M8J34J06J05Q5kK2q7q5p5j38o9m4j1K8
2228b14Q1Q1J26R4P2L6k1p2j11n0j56o7k7k5P1N4J06R7N2R0J3%m6j25p4j14o3
2255a92o2L5mP8J37J05P0P4kj6r8n2j41r1m8m7K3O0Q3Q7Q7J12O2rk8m5j32j13
2283f7m4r5k7RQ7N0J22J00N1O6J8o4o9n3j39q3n9m9K4N9P8J05P8P2M7K7m9q0q4
2312C1r9r0o6l4K5P4N2J11J16O1M0omp2j20o4r2j9q7K8Q9P4P0Q1J04K6j0n3r1
$$ plain form
2124 -206 -99 16 115 225 321 297 227 142 54 -67 -178 -278 -288 -255 -213 -134 13 130 188 298 277 224 137 17 -106
2149 -106 -223 -268 -267 -276 -170 -90 17 153 191 298 275 235 135 58 -63 -188 -255 -281 -244 -178 -56 48 175 245 268
2174 268 299 221 166 41 -70 -180 -258 -268 -228 -191 -68 43 167 238 269 279 226 109 -16 -103 -221 -279 -277 -235 -175 -63
2200 -63 16 129 209 284 232 206 97 10 -133 -199 -259 -251 -231 -183 -49 57 162 247 245 267 180 95 20 -118 -187 -231 -242 -214
2228 -214 -133 -52 74 168 240 276 255 183 72 22 -134 -201 -228 -253 -182 -128 -22 75 127 217 230 230 184 59 -15 -129 -192
2255 -192 -254 -219 -223 -145 -8 97 167 241 239 223 125 73 -68 -159 -207 -254 -231 -171 -88 -1 86 198 260 251 223 178 46 -67
2283 -67 -111 -206 -233 -224 -137 -87 35 135 186 252 270 206 137 84 -55 -138 -197 -246 -222 -163 -85 20 98 170 217 244 195 115 31
2312 31 -68 -158 -224 -258 -233 -159 -107 4 120 181 221 215 211 139 19 -45 -137 -156 -243 -215 -126 -52 18 99 203 229 219 166 75
2341G5n4o2j28m4j3K4Q0R6L8J07P8M0l3j7p6j02q7j14n0N6j9P2R7N7J04O4M0l6
2369A93l1r2o9j19m9m2MJ9O8P1J06R2M2M0np7o4j00r8o3m2j6P8M7Q3R3Q7K1M7
2398B24j5o7r1r6l6r9k3J3L0O1R7O1R3N0lj9p8q1l1j16o8j6j7Q1L2Q6J22O9J4
2427A77K1j0q1r6o4p9l7k3j8N8R8N2R4O6K1J1m2pj20p2o7m6j5KO6M2Q6P3N0O4
2457B04J9n6q4n5r5m5n6l5lR0O0N9R2O0N4on7m4p4j04n4n4Lj0N8R8P6K8R3J3l4
2488A41l6o1o1r6l4m1j0K9M9R8N1N7O8K0l1j9o6l2j13n5o8K1N8M4P8R7K9O2J4
2517A93m1l2n7q1m7p7mj5N3K8O4N2R3PM3j6m0m1j10p1k0n2J5L2K2Q9P2L8L1L0
2547A58n6j7n6n8q7n5k3K1N6M6O4Q3Q1k0J6j9k6q2n4m0p6LjM7K1O7Q2Q3K5j3k9
$$ plain form
2341 75 21 -41 -169 -213 -226 -202 -122 -26 12 119 197 237 204 187 111 9 -78 -192 -242 -186 -205 -133 -36 21 125 189 229 193
2369 193 162 70 1 -118 -167 -209 -205 -186 -118 -47 59 151 193 233 228 151 87 -13 -111 -174 -216 -232 -154 -107 -24 69 156 177 224
2398 224 209 142 51 -45 -81 -180 -203 -190 -160 -99 -2 59 152 202 199 180 102 21 -10 -126 -194 -210 -227 -146 -114 -28 94 163 177
2427 177 198 188 107 11 -53 -132 -169 -192 -210 -152 -54 -2 92 158 179 190 148 141 21 -51 -118 -164 -179 -177 -111 -69 17 90 140 204
2457 204 223 167 83 28 -67 -112 -168 -203 -206 -116 -56 3 95 155 209 203 146 102 28 -76 -130 -184 -181 -191 -133 -35 41 69 162 175 141
2488 141 105 44 -17 -113 -147 -188 -198 -169 -120 -22 29 86 154 174 143 124 58 26 -87 -142 -210 -189 -131 -87 -9 88 117 179 193
2517 193 152 120 63 -18 -65 -142 -146 -161 -108 -80 -16 36 129 136 179 163 123 82 -28 -99 -119 -171 -156 -124 -102 -13 59 97 128 158
2547 158 102 85 29 -29 -116 -171 -194 -173 -117 -71 -7 76 157 137 153 134 108 26 -28 -68 -144 -141 -142 -95 -74 -7 75 158 183 170 141
2578A41o9n0k9q6k3o4M6L0P2O4O0M7NK2l5p8n0m9n3o4K2j9O7J6Q0Q7K2K1ll8k7
2609F5q4l0n8j1poN3N4N7N9M4Mj1k9k9m8o4m3k8j5K0M0JQ8J04RL7k5rn6r3j6o2
2642h9l7MRP3L2J4Q5L4J4k7k1l9q9m6l5oPj7Q0L1N3N9J6K1J8m7l8o0p2m7Qj6K3
2675a05Q1K5N5L4J6M7j6J9r2p4l8j6m8j5M9N4L8N5M4L8l3kj2p0o2m6n8K2j1M6
2705g5J9Q8J8N8j7L2j7n5l1k7m8o3%j0RL1N6R5J9kM1j9j1j00k1l6m1Lk8Q2LO7
2737B0M8N0K0M2n6l0m1p4q0KqK1mN2O5M6N5K3k7k0k4n4p5m9k3j0J3J8N4Q3J2K2
2769G1O0Om0o7m2l3m2m5K1K5ON1K0P6M2kqJn5k8m2q5oloQ9M2M4L4M8J0ql9n2l5
2804Hk7l5l0l5NO2N7O3L5j0M8n6j1m6n0l2l5k8J3K4jQ0K3L9N7k6Kk4p7k9m4k6
$$ plain form
2578 141 72 22 -7 -93 -116 -180 -134 -104 -32 32 92 139 144 166 131 53 3 -46 -99 -163 -141 -160 -93 -77 3 90 112 133 130 92 65
2609 65 -19 -49 -107 -118 -125 -131 -78 -24 33 92 136 140 129 100 71 23 -41 -84 -112 -127 -107 -67 -66 22 126 135 172 147 138 82 -11 -27 -89
2642 -89 -126 -122 -113 -40 -8 6 91 125 139 112 91 52 -37 -83 -118 -124 -117 -134 -54 -23 30 89 105 126 144 97 59 -1 -73 -120 -112 -128 -105
2675 -105 -24 1 56 90 106 153 137 156 64 -10 -48 -64 -112 -127 -78 -24 14 69 113 151 118 116 104 34 -28 -74 -132 -110 -121 -75
2705 -75 -56 32 50 108 91 123 106 51 20 -7 -55 -118 -118 -128 -119 -88 -32 63 82 80 121 102 91 -9 -30 -66 -107 -104 -132 -50 -47 20
2737 20 68 118 138 180 124 94 53 -21 -101 -99 -107 -86 -90 -38 27 73 128 151 124 104 80 26 -49 -98 -121 -131 -118 -100 -46 37 49 71
2769 71 131 137 97 30 -12 -45 -87 -132 -111 -86 -80 -29 -9 67 109 107 99 100 45 17 -25 -110 -116 -119 -125 -36 6 50 84 132 142 134 95 43 8
2804 8 -19 -54 -84 -119 -114 -52 5 68 103 93 141 85 74 28 -22 -54 -89 -117 -104 -80 -81 -1 22 61 118 92 94 70 -7 -36 -80 -106
2836a06Rj1oO3L1N3P1PNKk9o1n0m9l0mJ7j3P7L6L9Q2k1Pk6K2r1m3m4n4M8m1O0
2869e0K7O6J8L9MK4m7l7j3j12J0m1J0qK5N5O1L0M6k0K2l1m3l8m0m9k7K9j9M5P0
2900FK8J2O6n%k9k0m9m0m0k1jNM5M4O4M5nM2k2m9j3o3kr8k1k6M2M2O3N1M8rJ3
2934A03Jl5k1o6m8n3L3l2O9kM2N6M7k5L8l9k9Lq6j2j6j8JK6N5K3O7j3N8l6Pm2
2966E6rp0m4kk9KJ3P3K0M7L1J1mj1m1j0p2k7l8K2mkN1Q9kN1K4ll3m8l4k5o8lk5
3001a14L1J8K7P1%N2J6rl2k2l8rm0n9N5oRL2N5K6M0K2k5pk9m4n4l5nj4L2J1L8
3034gP9%L2L0qn2m5m9l3j7l2j0M5KO1LP0lRmj2j0q6j1rj3n4O9MM1K9N0J5Mj7j3
3070E8n7m6j9Rj1j4M3L2J4J4Q0j7L3l2k5J2p4n5k1k5K1J8M4M3KO7jRj8k3n0l7
$$ plain form
2836 -106 -97 -108 -114 -51 -20 33 104 111 116 118 89 28 -22 -71 -101 -105 -88 -101 -24 12 51 133 112 119 93 115 24 -19 -63 -117 -69 -110 -50
2869 -50 -23 43 61 100 104 128 81 44 31 -81 -71 -112 -102 -110 -85 -30 31 61 107 87 109 78 35 -3 -43 -92 -119 -90 -109 -64 6
2900 6 34 46 112 107 107 78 58 9 -31 -71 -92 -93 -88 -43 1 65 110 105 147 125 76 63 0 -2 -100 -121 -147 -105 -63 0 51 99 90 103
2934 103 104 69 48 -18 -66 -119 -86 -118 -49 -51 -9 47 94 69 107 68 39 42 -44 -56 -72 -90 -89 -63 -8 15 82 69 127 91 98 56
2966 56 47 -23 -67 -69 -98 -96 -83 -10 10 57 88 99 95 84 43 33 -39 -66 -104 -82 -86 -88 -37 52 50 101 125 122 89 41 7 -18 -86 -89 -114
3001 -114 -83 -65 -38 33 33 85 101 92 60 38 0 -9 -49 -108 -53 -59 -50 -18 37 63 103 125 100 93 64 20 -34 -69 -74 -88 -56 -45 -7
3034 -7 72 72 104 134 126 74 29 -20 -53 -70 -102 -112 -67 -65 -4 -1 69 66 75 71 59 49 -37 -48 -57 -70 -124 -55 -51 -10 19 69 84 88 71 58
3070 58 1 -45 -64 -55 -66 -80 -37 -5 9 23 103 86 119 87 62 74 0 -55 -76 -101 -80 -62 -18 25 27 94 93 102 84 61 11 -26
3102b6j0k6k0K2N4k9M9K3MK9qm2k4j3m2J7m0Jk4P1l4R6nN4j8kJ6n3k9m6mqj8K6
3136e9J2N6MM4K7K2m8l6M1l3k2l6m1j4J8K9L9K4K3L9J7k1n7Lk8n8Ol4K5mL7L1
3168FK1KL3JLl5j4n4j0j5Mj9J2K0J2L5L3J6Rnk3ok6Nl7k3jK0J0M4J8M9lQk2l8
3204C0j2no1PkJ9k6O5MJ5K8L4k5mj4o2j2l6k1K8k1M0K1M%L1J0K8om9j7l2j0pN
3239e3J5k1O9kRM1K0J2j6n4Qk9n5L1k4lK8M5j4L5K7ooJ4o3K1n7Rm7K7K0j9M3J5
3273B0K5K3l4Prj5n0Rl2K4m6M6k3L4L8K1nkQrn6J7l9oJ6l0K0J6N6J7L5m3K8j0
3307E1rm5J7nm4k4J8J1j2P5K0L%k6N6l2l4j0k4j4j8RJ2K0K5L6l7K4j4Rn4pmk7
3341e4pJ1K3j5L9rK7J2Nkrk6j1j0qLl7J1J2K9K8M3l2N5j8l4kNk8k7%k9N5K9Oo
$$ plain form
3102 -26 -36 -62 -82 -60 -6 -35 14 37 41 70 62 20 -4 -17 -59 -42 -82 -81 -105 -34 -68 28 23 77 59 57 73 20 -9 -55 -59 -67 -85 -59
3136 -59 -47 9 13 57 84 106 58 22 63 30 8 -28 -69 -83 -65 -36 3 27 50 89 106 85 28 31 3 -55 -49 -83 -58 -62 -25 6
3168 6 27 29 62 63 66 31 17 -37 -47 -62 -58 -77 -65 -45 -33 2 35 51 60 55 32 26 0 5 -32 -55 -56 -36 -26 18 36 85 82 90 68 30
3204 30 18 13 -48 -41 -43 -24 -50 15 19 34 62 96 71 67 53 -9 -21 -57 -78 -50 -71 -31 -10 -6 -6 25 35 63 57 8 -9 -41 -51 -58 -53
3239 -53 -38 -59 10 8 17 58 78 90 74 20 28 -1 -56 -25 -49 -52 -24 21 7 42 69 63 57 71 8 29 -28 -19 -66 -39 -19 -38 5 20
3273 20 45 68 34 41 32 17 -33 -24 -56 -32 -78 -32 -55 -21 17 38 33 31 39 30 -26 -9 -48 -54 -38 -68 -48 -32 24 41 76 33 61 51
3307 51 42 -3 14 9 -35 -59 -41 -30 -42 33 53 56 56 30 86 54 20 10 -14 -28 -46 -37 -25 -5 20 56 19 43 29 38 -16 -23 -27 -54
3341 -54 -61 -50 -27 -42 -3 -12 15 27 32 30 21 -5 -16 -26 -34 -31 -68 -57 -45 -16 12 55 23 78 60 26 24 29 1 -26 -26 -55 0 29 35 29
3377B9L1kj7j3kj1mk6k2J2m0K4qO8l1P5m0J0K7k4m6j6j8K5j7kk4M5JL3RJ2Pnj6
3412B4Pl3Kk7n2L5J2J6L8j3O6j2l4K5l4K2o0Nj9kJ3lK4lL4%J3qrJ7k5k9k1k7L4
3447b4k5Qj6L6K6J4K8j5j1l0qm2J5j6ML1kK3K6j8JJ5RJ2k8l0Nk5PK1J0l3K6M3
3481C7l6J9N7k8Kjj4l6j7k0K3LL7j7KK1mJ8j0L4m5jk3Ql4j7lK3L5j9K8J7K5m5
3515A9j1nJ1j8j4j7QJ7rL7m1L8OL1j7j8j4J4on8j3J9J2N4l1J5M1k0Nj6L4k4J8
3548D7p6K0k2JJ9K7rJ3K3Jk4K7l1k3Kk5J1k1k0J1K9J4K0J1r%k9K1k0J8m1j4K2
3581b7j3L6l4L1K2K2rmJ1j3l7kj1j4L4Rk7N2J0j1J9kL2m3k2Ppl1K4J6rJ1mKj4
3616DM3k2K1ol2J5m2l0K3J9k8L5k6j8N3j2K0Mj5Ljk1kl8M0kj2K3qJ1J7J4Ol5K3
$$ plain form
3377 29 60 58 41 28 26 15 11 -15 -37 -25 -65 -41 -49 19 -12 63 23 33 60 36 -10 -26 -44 -19 -36 -38 -62 -17 -16 17 26 38 45 40 24
3412 24 31 -2 0 -27 -79 -44 -32 -16 22 9 75 63 29 54 20 42 -18 -13 -32 -34 -21 -24 0 -3 31 31 44 36 27 44 19 -10 -31 -58 -24
3447 -24 -49 -41 -57 -21 5 19 47 32 21 -9 -17 -59 -44 -60 -56 -25 -27 -4 22 4 5 20 29 41 13 -17 -12 -37 -30 -9 1 -32 -6 37
3481 37 1 20 77 49 51 50 36 0 -17 -37 -14 -11 26 9 11 32 28 46 36 70 25 24 1 9 -25 -42 -45 -22 13 -6 22 39 64 19
3515 19 8 3 14 -4 -18 -35 -27 -10 -19 18 -23 15 21 52 35 17 3 17 11 -47 -60 -41 -29 25 -6 9 50 30 35 19 53 29 47
3548 47 -29 -9 -31 -30 -11 16 7 20 43 44 20 47 16 -7 -5 -30 -19 -40 -60 -49 -20 -6 14 25 16 16 -13 8 -12 6 -35 -49 -27
3581 -27 -40 -4 -38 -7 15 37 28 24 35 22 -15 -17 -28 -42 -8 1 -26 26 36 25 44 42 74 31 9 16 9 -22 2 18 9 20 16 18 4
3616 4 47 25 46 40 8 23 -19 -49 -26 -7 -35 0 -26 -44 9 -3 17 21 6 9 8 -13 -15 -53 -13 -15 -27 -4 -12 -1 16 30 36 1 24
3651B4j9k3J1J2pNk5J8L6l1J7J6J9J9o7L0m6NknnK5k7lK6K0L5l1K4m7M2p1j5J1
3685b9J6k4M6j4K1k3K8k1J6J1l3J6l9j1O7n4L4k7OK3l1O3j1k0L3j0Kn2RMorM2
3718B3J0l1PJ2K9j5J6k1nm6M7m6Nk2M5k1K0jNj8Qk7J8Pj8j2nL3j1j9RL5J7rlL
3754A9mmm2N3o0J9rj7K5J2RJ9J2j9j3K4pk4J4Qj7%n5O7JJJ7NL5l3jl7ORKm7M7
3791A5ol9L3Qlj2J7j2j8K3Ql6L7qo4K7Rk6M4K4k6OK2ljj3l2J5j6J2j3J1RJ4K7
3826C3RJ0k8Lnrrl1Ql0M7jK3mLrK3j5k5K0nMJ8p3K4L4Lk5jL0j9l3L8Nm3j0N1j6
3864errM2Nl8M4J9m1RJ9l7J2j2jk8J1J8J8mKlLK4j0J1J0l5QK3l6j3jK0j9J6L5
3900D8pJ0k5j2jk8K1l1J2j7j3M3k0J1j0J2J3J9Jkk1m5K2l2L9l1L0jNJ7nJJ4Jj4
$$ plain form
3651 24 5 -18 -7 5 -2 3 -22 -4 32 1 18 34 53 72 5 35 -11 -6 -8 -13 -18 7 -20 -23 3 23 58 27 51 4 46 -25 -40 -29
3685 -29 -13 -37 9 -5 16 -7 21 0 16 27 -6 10 -29 -40 27 -27 7 -20 -14 9 -22 41 30 10 43 33 35 -17 -8 -4 -10 -19 23
3718 23 33 2 9 21 50 35 51 30 25 -21 26 -20 -15 -37 8 -13 7 6 11 -7 1 -26 -8 -1 -19 -31 -36 -3 -14 -33 -24 11 28 19 16 19
3754 19 15 11 -31 22 -38 -19 -28 -45 -20 -8 1 20 32 13 0 24 17 -7 7 15 -2 -2 -57 10 11 12 29 34 69 36 35 -2 4 13 15 -32 15
3791 15 9 -30 3 11 8 -4 13 1 -17 6 14 -22 15 7 -57 -30 -21 -47 -3 21 -5 1 23 20 19 6 -26 -11 -27 -15 -28 -17 -8 6 33
3826 33 42 52 24 27 22 13 4 -27 -19 -49 -2 -3 20 16 19 10 33 18 -7 13 8 12 30 -43 -19 15 18 -7 -8 22 3 -30 8 13 -30 -40 11 -5
3864 -5 -14 -23 19 24 -14 30 49 8 17 36 -1 11 -1 -2 -30 -19 -1 17 13 15 12 15 39 29 40 50 15 23 46 10 -3 -4 16 -3 13 48
3900 48 41 51 26 14 13 -15 6 -25 -13 -30 -43 0 -20 -9 -19 -7 6 25 26 24 3 -42 -20 -52 -13 -44 -14 -15 -10 7 2 3 17 18 4
3935Dj3Rj9jJ6j5j0M9NJ2nRJj9j0lK8j9ro5M3QpL2J6j2k3L1k8K0l8POo0L1MJ3
3972a2k5M7K6n1K9J0k7K8k6J5l1K2jKj6NQKJ2k0L0RJm2K3Nj1j4K0kLKK6J3Km6
4008A6mLl8L5Rjnm3L3RL1j8K2m7L4l3rMJmj4jj7JRJ7MJ1Pj7M3l5l4M6j1k5KJ5
4046drK2l0L4L6J0n9L1J9j6m3J4j0l1K0K1KJ6J5K6o0N3l0l2LJ2j1kQRl7j7K3N3
4080C6j5l7M1j9k2Pnj0rJKRQK3J0k7J8jk9K9k0L1pl8K4kmk4N6k1MPJ9L1p1J4l3
4117b4J9K8k4k8O9Nn0qL7k9K9l3J0k8J7J6k6R%J3rK1k5J8k1k1L7ql9P5k7k2k7
4150d6K2K1j0N6n6N6l6j2oJ2%K0l1JK8pj5ON0k5L3k3j1rkk3L6l7L0j2j6L3j9R
4184A7%LK1kLn7L4l7JJ6J3m9J6M4k6J0K5k5j1rnjmK2M0m7Nj1kJ8J3J8j1j4nk1
$$ plain form
3935 4 -9 0 -19 -20 -4 -19 -29 20 25 37 32 41 42 23 13 10 38 19 10 -55 -12 -4 -11 21 37 25 2 33 5 25 -13 -6 0 -60 -29 -25 -12
3972 -12 -37 10 36 -15 14 24 -3 25 -1 14 -17 5 4 6 -10 -5 3 5 17 -3 27 36 37 -5 18 23 12 -2 18 16 19 21 47 60 62 16
4008 16 12 15 -23 12 21 20 15 -28 5 14 45 27 49 2 36 3 -6 -2 -1 -5 -19 -20 -37 -36 -27 -10 -6 5 12 -5 38 3 -31 15 4 -21 -19 -4
4046 -4 -13 9 -21 13 49 59 0 31 50 34 -9 5 -5 -36 -16 5 7 23 38 64 4 57 27 -5 -2 10 -1 -3 5 14 -23 -40 -17 36
4080 36 21 -16 25 6 -16 -9 -14 -24 -33 -32 -30 -21 -13 10 20 -7 11 10 -19 10 -10 21 14 -24 0 -2 -6 -30 26 5 9 16 35 66 -5 9 -24
4117 -24 -5 23 -1 -29 40 45 -5 -13 24 -5 24 -9 1 -27 -10 6 -20 -11 -11 2 -7 14 -11 7 -14 -35 2 -6 -45 30 3 -19 -46
4150 -46 -24 -3 -13 43 -13 43 7 -5 -11 1 1 21 -10 -9 19 12 -3 3 53 28 61 38 27 18 16 -7 29 -8 22 10 -6 27 8 17
4184 17 17 20 41 39 42 -15 19 -18 -17 -1 12 -37 -21 23 -3 7 32 7 -4 -13 -18 -19 -23 -1 39 -8 -3 -14 -16 2 15 33 22 8 3 -18
4220a8j0J9PKlpOO0j5k6PL6k7l6K3k3N7p9J7rP0k6k7J0QKO2p7l0L4Kj2k8M0k6
4255a7lK2PK0m3j1L3j1k2Qlj1J4lQJ4l3M1Pj4LJ6k7ROl5Qj1K4NK3j2jPK1K3ok5
4293C1j1k8M0k5k7L3j1j9K1J1J7j2L2q2K5LJ1k4k5L5j5LmK1nMJpk5M6l0Oj1j0
4327c1J9J9Rj1Rlk1L6J2j6j3k3Nj0rJ6J4J4k9M9Jok4L9j9j0j5J9j7l5QN0m5M0
4361B2J4l1K2j4J1m2kK2l5lNj0K1M8m3K0j2K3j4lPk1K3k6j5LJ0ML5l5J7j1L3k1
4395BJ6j3Rl7K0L1l0J2l6M6LolJ4rmLJk8K1m1L3k7k0L9J4K0l7M8j9j8pl3M3rr
4431a1%l1J5L0j1M4mk5l8M4k1J1k2k2M1l6M2k6k4L2j5K9J0K5j5j1j0M0n1K6rK8
4463C5m0K9J0kok2LJ7k7j1L1l7L0j6j1pO8n5J0NoJ7K7k8l7j5N1k1JolL2oj2kK9
$$ plain form
4220 -18 -28 -9 -2 0 -3 -10 -4 56 41 15 22 58 31 -5 18 -5 52 -27 -10 -19 51 25 -2 8 16 18 80 3 -27 7 9 -3 -31 9 -17
4255 -17 -20 2 9 29 -14 -25 8 -3 -25 -17 -20 -31 -17 -20 -12 2 -31 10 17 3 6 22 -5 4 10 -25 -17 -28 -4 1 24 12 11 18 39 62 56 31
4293 31 20 -8 32 7 -20 13 2 -17 4 15 32 20 52 -30 -5 -2 9 -15 -40 -5 -20 -17 -21 0 -5 -1 0 -7 -32 14 -16 -10 -21 -31
4327 -31 -12 7 16 5 14 11 -10 26 38 22 9 -14 -9 -19 -28 -12 2 16 -13 36 37 31 7 46 27 17 2 21 4 -31 -23 27 -18 22
4361 22 36 5 27 13 24 -18 -20 2 -33 -36 -31 -41 -20 28 -15 5 -7 16 2 -1 6 -15 8 -18 -33 -30 -20 -16 19 -16 1 -10 23 2
4395 2 18 5 14 -23 -3 28 -2 10 -26 20 23 17 14 28 19 15 18 19 -9 12 -29 4 -23 -43 -4 10 30 -7 41 22 4 -3 -36 7 -2 -11
4431 -11 -11 -42 -27 3 -8 36 32 7 -31 13 -8 3 -19 -41 0 -36 6 -20 -44 -12 -27 2 12 37 22 11 1 41 -10 16 7 35
4463 35 -5 24 34 32 26 4 7 24 -3 -14 17 -20 10 -6 -17 -24 44 -11 -1 4 -2 15 42 14 -23 -38 13 -8 -7 -13 -16 16 10 -2 -4 25
4499B5j7K3l3lk3K8PqNk6J2KM0l6O5k8kl4J9mJ3l1J6J6K4n9jL8k2k3M1J6k4k0
4533dOoL2n1J7K3K7rk6pLkk8M8l7k8K9j3K5jl3K1J0K9j5%m2K7J7j9J5k8L9Jj3
4568Gj9N3j9j6J0j9O2k3j2k7MK0k2J0kmOJ7rj4lM0J6o9J9l4RLM2n0K8j3k0N5r
4603A7n2J9Pk3J3NJ7k8NoL6pjJ5JK7l2m4K6J5l1LN6m4j7J8M3oJ9J9l6l1K0j1k
4638A0pj9J6LMN6o4K6JK1l4Jj8J6l3K3k9%%L9k8L8k9nM5k7J2km7j0PK6QkkJ0J3
4675A9o4P2Ol7J3pLk5L8k3K1mJMk6J1N3k4nKk2J2mK5l2pJ4j9QRK3kj9Mj0k1J2
4712aj8j8J1J1KQk8L1J5k5J9k9Lk1O0m9L3l1L3j5KJ6j7K6rnK9j5rk6NK6j0mJ3
4747A3jj8O4pj4Pk6j3kPK9n2N1l9j6J1nj5M6j4MkJ6l1Mj3J9k6J4j4k1K8J9qLL1
$$ plain form
4499 25 8 31 -2 -5 -28 0 7 -1 4 -22 -10 -8 32 -4 61 33 31 -3 16 12 25 -6 10 26 50 -9 -10 28 6 -17 24 40 16 -4
4533 -4 2 -4 28 -23 -6 17 44 35 9 2 5 3 -25 23 -14 -42 -13 -26 -1 -2 -35 -14 -4 25 10 10 -32 -5 12 -7 8 -20 19 20 7
4568 7 -12 41 22 6 16 -3 59 36 24 -3 1 21 -1 9 7 3 9 26 17 3 0 40 56 -13 6 -28 -19 -16 26 -24 4 -9 -29 26 17
4603 17 -35 -16 -9 -32 -19 -14 3 -25 -20 -26 10 3 2 17 18 45 13 -31 -5 10 -21 -18 38 -6 -23 -5 38 32 51 70 34 3 23 12 10
4638 10 3 -16 0 3 7 63 -1 25 26 47 13 14 -4 12 -21 2 -27 -27 -27 12 -16 22 -7 -12 33 6 18 16 -31 -41 -34 -8 0 -2 -4 6 19
4675 19 -45 27 33 -4 9 2 5 -20 18 -5 16 12 13 17 -9 2 55 31 26 28 6 18 14 39 7 0 14 -5 3 12 35 33 14 18 8 -13 -1
4712 -1 -19 -37 -26 -15 -13 -5 -33 -2 13 -12 7 -22 -19 -40 20 -29 4 -27 6 -9 -7 9 -8 18 9 4 33 18 9 -17 -12 14 4 0 13
4747 13 12 -6 58 51 37 44 18 5 3 10 39 -13 38 -1 -17 -6 -11 -26 20 6 10 8 24 -7 -3 -16 3 -23 -9 -23 -44 -16 3 -5 -2 29
4783B9m9J1K9j2qj0j1K7m0%QN0j3j2lJ4j1mkJ1j1pJ4mL7l1j6M6njl5N8ol0L8m4
4819GlJ0p0Q0qj4M8n8JlpMk9M9j9jk3K4M2l7mK9Jl5L6k5j8J3KNk6L3j0pK1L2j8
4856B2j2K2m3O1l4l9L4jkj0J1j0M7ql8L0l1J6j4JK1j8J1k6oK7ol2L2k2J4JPl6
4890c1L9j4k4qJ5PJ2j4J1Rl7M6JPj7j1L3l9J1J3l6LJ5L0Pnkrj5NnQNJ8nLk1k7
4928b2O2j8nj1K4l2MJ5J7o6J8%K1opK3lj5K2k0k3J0J4lk4OnNJK9m8N6k2M8n1j4
4964b0L3Ok0Nk4J7J3J5l2K3rk1K9lj6K5Jk0RJ9k9OpJ6J1J9Mm1L4n4kNlj2kJ0k
5001a7L7l9J5J0j0NJ3j7k2MMJ6j0j6l8P8k3kRRM6n7NL6k3k4OK0j1J4jrQJ9j3j9
5037CM8l7R%l1L7m5M6j4j8L2j6pRrLk2JLoMJ0j6%K7k3L4ol1PQlPl9M2j3k1J3L0
$$ plain form
4783 29 -20 -9 20 8 0 -10 -21 6 -34 -34 -26 24 11 -1 -4 10 -1 -5 -7 4 -7 -14 0 -4 33 2 -14 32 27 26 -9 49 43 13 51 7
4819 7 4 14 -56 24 16 2 50 -8 -7 -10 -17 -13 -42 7 -12 -13 -36 -12 30 -7 -11 18 19 -16 20 -5 -23 -10 -8 -3 -29 4 -6 -13 8 40 22
4856 22 10 32 -11 50 16 -23 11 10 8 -2 9 -1 46 38 0 30 -1 15 1 2 23 5 16 -10 -16 11 5 -27 5 -17 -3 -2 5 -31
4890 -31 8 -6 -30 -38 -23 -16 -4 -18 -7 2 -35 11 12 19 2 -9 24 -15 -4 9 -27 -24 -9 21 28 23 21 12 -3 2 -3 5 10 28 23 26 5 -22
4928 -22 40 22 17 6 30 -2 2 17 34 -32 -14 -14 7 1 -6 17 14 -1 21 1 -22 -12 2 -1 -25 -19 -24 -19 -18 11 -37 19 -3 45 -6 -20
4964 -20 13 19 -1 4 -20 -3 10 25 -7 16 7 -14 15 12 -4 21 22 2 11 30 1 7 0 16 27 46 50 9 43 -11 -13 -8 -11 -23 -25 -15 -17
5001 -17 20 -19 -4 6 -4 1 14 -3 -25 -21 -17 -1 -11 -27 -65 13 -10 -12 -3 6 52 -5 0 36 13 -11 -5 15 4 18 17 8 16 35 22 3
5037 3 51 14 23 23 -8 29 -16 30 16 -2 30 14 7 16 7 10 -12 -11 -8 -14 -10 0 -16 -16 11 -12 22 16 -15 -8 0 -3 4 -35 7 -6 -27 -14 16
5076A6lrJ2mLKk0J2l1L6rK2ooL5m2qJ7K9n6K2L0k9j4L4%l8L0j6k2J8J9j6mJ9%
5112B3k5n6J6N0j0k6kK4pJ1J0Pl0K3K0k7j1L2n7L3K3m5M6nj7L7Pm1PMOl0LrK1
5147EMj5M5j6jLJ6n7L5J3l2K6j2nj6j9K8j7J7j7L5kj5%joJ8l4Nj1K2%k5KJ5Ln
5184a4L7k8Kj3PJ6l4K2J3jJ0j2j2J3J5k1J9Kl8L0Ooj3j5L7PN1m2k5J6k0j0J3K
5218A4k2%j4NK0k4J6mnK2k5K4nRj1j2k6M9m7J6mKK1k1%L8j2mm8O4m9K9k8j2M9
5253ElK5MpJ4k2nJ0K1l0MJ1k3J5l5L8j2K0l3%QN8o6JK5k6j5QJ6j3K9m0K6k4J6
5288@K1l0L3n3M6n5L7j7j3J0j4J5J2j3L4Qjj2k0k0N1kj5Nl3L3k6mJ6j0N7l3j4
5321gJ9j7LJ5Lljj7L0J0l1RJ1j6MK0l6J1oRk3jOOMj6%K0jrJ9ml1l4K3KK9j6Jj
$$ plain form
5076 16 13 4 16 12 15 17 -3 9 -22 14 5 27 21 15 50 8 0 17 46 -10 12 42 13 -1 33 33 -5 25 9 -13 5 24 8 4 23 23
5112 23 -2 -58 -42 8 -2 -28 -30 -6 -13 -2 8 15 -15 8 28 1 -10 22 -35 -2 21 -24 22 17 0 37 44 3 10 14 20 -10 -7 -16 5
5147 5 9 -6 39 23 22 25 41 -16 19 32 0 26 14 9 -7 -26 2 -15 2 -15 20 18 3 3 2 -4 14 -20 -15 -26 -4 -4 -29 -27 -12 -9 -14
5184 -14 23 -5 -3 -16 -9 7 -27 -5 8 7 17 5 -7 6 21 0 19 21 -17 13 19 13 0 -15 22 29 80 38 13 29 9 -1 12 14
5218 14 -8 -8 -22 -17 3 -21 -5 -9 -14 8 -17 7 2 11 0 -12 -38 11 -36 -20 -24 -22 -1 -22 -22 16 4 0 -48 16 -33 -4 -32 -44 5
5253 5 2 27 31 24 38 16 11 21 42 12 16 27 4 19 -16 22 10 30 -3 -3 5 63 -3 -2 23 -3 -18 -10 6 -7 22 -18 8 -16 0
5288 0 21 -9 24 -29 17 -38 -1 -18 -31 -21 -35 -20 -8 -21 13 21 20 8 -12 -32 19 17 2 7 -26 7 -19 -23 -7 -17 40 7 -7
5321 -7 12 -5 -2 13 16 13 12 -5 25 35 4 13 24 8 12 32 -4 7 1 10 -13 -14 -8 -2 2 -14 -14 6 5 -4 15 11 -20 -54 -31 -29 0 -16 -15 -16
5361a6K7k8J0k%j8M5k2rK3m2L2j4M6k0J2j7k9N2J6j1l0oJ6%m%J7j4k1L0Ol8J2
5395Ck3L6m1pJ7MM0j9j8J2L5o2J6m8N0K0l8JNj6L3qn%K7Lj3LJ2mk6K5J9r9N0N0
5431C4l2J1l2L9J5m7M2j1k7K5k0Jk2K1QJ7pJ1j8J5J0l9J3j0K4k4nK5j4Oj2JrN
5465fqJ3Oj7pK0k5J0Pk7jJ6ML7l4OK2pLOk3J5mnjqL5Ol9L0%Opokrl7M9j6j1j6
5506b5K1K9l8L7Nk7J1J5m8J6J2l3L3rrj0KJ0K0k8PlMpj9PJ1K1J0l2j9K0J0L1k5
5541@Mjj9K1lL4m8lL4jRj1J3K0j0l3lL0k0j6rkjJ4qrJL1j8jMk4K9l1K0j4KK2m
5580aml1J3L6k8pJ2k4M1K3l9j9J6Jk4P0m3k0N5k7oJ0j0rK3Qj0J5Jj3j2j7RN2l1
5615A0j3K3k6J8L0m0j0oJ0l1K5K3j6kj5K2l7J7J4K7l4j0QKlk0k6N8J4l9K7k4L0
$$ plain form
5361 -16 11 -17 -7 -9 -9 -27 18 -4 -13 10 -32 0 -14 32 12 24 7 -22 30 46 35 5 -1 15 15 11 11 28 14 -7 23 29 -9 3
5395 3 -20 16 -25 -32 -15 -11 29 10 -8 4 39 -23 -7 -55 -5 15 -23 -22 -17 -33 0 -8 -13 -13 14 17 4 7 19 15 -11 14 33 -66 -16 34
5431 34 2 13 -19 20 35 -12 30 19 -8 17 -3 -2 -24 -3 5 22 15 26 8 23 33 -6 7 -3 21 -3 -8 17 3 9 -3 -2 -11 -6
5465 -6 -14 -1 5 -12 -19 1 -24 -14 -7 -34 -35 -19 -15 22 -12 -6 16 9 12 18 -5 10 6 1 0 -8 27 33 -6 24 24 30 23 17 15 6 -31 18 2 -9 -25
5506 -25 -4 25 -13 24 29 2 13 28 -20 -4 8 -25 8 -1 -10 -20 -18 -8 12 -16 -9 -12 -8 -15 -34 -27 -16 5 15 -17 -36 -16 -6 25 0
5541 0 4 3 -16 5 2 36 -12 -15 19 18 27 16 29 49 39 6 3 33 13 -3 -12 -14 -15 -1 -9 -18 -17 14 -4 -5 -1 -25 4 -27 -7 -21 -19 3 -1
5580 -1 -5 -36 -23 13 -15 -22 -10 -34 7 30 -9 -28 -12 -11 -35 35 -8 -28 27 0 -6 4 -6 -15 8 16 6 21 22 9 -3 -20 -11 41 10
5615 10 -3 20 -6 12 42 2 -8 -14 -4 -35 -10 13 -3 -5 -20 2 -35 -18 -4 23 -11 -21 -13 -11 -14 -34 -60 -2 12 -27 0 -24 6
5648Fj7K0j4JRMJK2j1Qj5%m3K3K7j3K5j3j0Lj3RMkKj1j8L5j3k2J9j5j2PPqLPJ
5687gOJQKJ1m5lkJ9j4J3jJj6M2l1J6rJ6J3km5MK7l9K7QJ4j7kJ9nJ0k9K7j7Mj9
5725a5NJ0K5m9K1LK9j5oj8%K7k6J3l9rK8Om2L3MmLK4k4K9k7Rjj7K4j1mj1Oj3J7
5762a5K4l8M1k1K6j5k2L9k4J7n4M6K2k2NpK5k1lK5mk5j8L1%jj7nM3k0lQj8k0K3
5797Bl4L3j0j3L3l8Kj2M0m4O6l8K5k9Ql5L0j8MK8nrKkl1L1K4nk5K1j5L4Jk9L3
5832B5m5L1Ll3K2KL5m7J1pQL7m6oj0M6l3J4j0RNk8J4K4k0l4L5Mj5J9l5QoQJ9j4
5868a0K3l1J0rJ2Ol3J1j0K9oK3j8K6k2%K0j9mK9j7J0nrJJ3%j6K5k0mPj1KN2m6
5904IMj7Qj0joNpqJ7k0K0mJ0k7rK5OkNkj3K3j1rjmJ8J3k3Jk3K3pK1lK1Nm2J6k
$$ plain form
5648 6 -11 9 -5 -4 5 9 10 32 21 29 14 14 -29 -6 21 8 33 20 10 13 0 9 13 11 13 2 -16 19 6 -16 3 -12 -24 -17 -10 -18 -15 -8 -7
5687 -7 -1 0 8 10 21 -24 -27 -29 -10 -24 -11 -12 -11 -27 15 -16 0 -9 7 20 18 -27 -23 4 -35 -8 0 14 -3 -5 14 9 19 -10 17 0 4 -15
5725 -15 -10 0 25 -24 -3 0 29 14 8 -10 -10 17 -9 4 -35 -44 -16 -10 -52 -19 -15 -19 -16 8 -16 13 -14 -5 -6 -23 1 -10 -14 -25 -19 -32 -15
5762 -15 9 -29 12 -9 17 2 -20 19 -5 12 -42 4 26 4 9 2 27 6 3 28 24 -1 -19 12 12 11 -6 -11 32 12 9 17 -1 -21 2
5797 2 -32 1 -9 -22 11 -27 -25 -37 3 -41 25 -13 12 -17 -9 -44 -14 -32 -28 0 -5 -14 -12 -14 -45 -14 10 5 -20 1 -14 20 21 -8 25
5832 25 -20 11 14 -19 3 5 40 -7 4 -3 5 42 -4 -10 -20 26 -7 7 -3 6 11 -17 -3 21 1 -33 2 6 -9 10 -25 -17 -23 -15 4 -10
5868 -10 13 -18 -8 -17 -5 1 -32 -21 -31 -2 -8 15 -3 23 1 1 21 2 -2 27 10 20 15 6 7 20 20 4 29 9 5 12 1 3 55 9
5904 9 13 -4 4 -6 -7 -13 -8 -15 -23 -6 -26 -6 -10 0 -27 -36 -11 -5 -7 -2 -4 -17 6 -5 -14 -15 -19 -1 12 -11 -10 -33 -10 -17 4 1 22 27 -15 1 -1
5945anL2k1qmk4K8rN5k7k2pK8j2J5j4j0Jk8M4j3Nk1lOJ0j0k5K4M8m8j0J8Mqj4
5981b6ML6l6pJJ5J9j8J2j4J0oK5m2JK9J1lk8PJ2LPpK7j0n5L5K6j8J3k5K4J1l2
6016AK6j7L3l0PONl9jK0k5mrjj5L8pjpJ0K3k7J9j6j3K3j7J7Ml4L1pPk7L9k8j4
6053c0L8J1j0qNJ7k7PL8m6K3Pj6QMnK1Ok6Pln9J5K1jJ7K1k6L2l4klj4j5J3J9j
6090Dm0J8mmJ7j0JjL9k8JJ3k6J6J9nroJ9mj6lJ5Lj2J9L0l6Qk7J3N0ok5Mn9N8k9
6128cpK3km2M3k8PL4l5MRK6l0j9K6l3J0MQj7K3k3j2L9k3j1L9k1j7J1L%K6j1m2
6163d1lL1kM0k0oj9J1J1mP%JNj1J8lKk7L2k5J5j9J5J9rrK2j2j7K3j9%j1L3m7O5
6200D6k5k8Pj6Opj7JOL5Jm3L2RpJ1n2L7k5J1jj8N3j9JJ3J9n7J7oK3J3K7l2j1J0
$$ plain form
5945 -1 -6 26 5 -3 -7 -31 -3 -12 43 16 -6 -13 15 3 18 4 -6 -5 -33 11 -2 3 -18 -21 -15 -5 -15 -40 -16 32 -16 -26 -8 -4 -12 -26
5981 -26 -22 14 -22 -29 -28 -13 6 -12 0 -14 -4 -10 15 -27 -26 3 14 11 -17 -10 2 5 12 5 32 22 -33 2 28 10 23 -2 22 33 1
6016 1 27 10 43 13 20 26 31 -8 -9 11 -14 -18 -27 -28 -43 -5 -12 -13 -20 -10 13 -14 5 -11 -24 -1 -18 -1 3 -31 0 -7 0 -27 12 -16 -30
6053 -30 8 19 9 1 6 23 -4 3 41 -5 18 25 9 17 21 16 37 43 17 24 21 -38 -23 -2 -3 14 35 9 41 7 5 2 -12 -27 -14 5 4
6090 4 -36 -18 -22 -26 -9 -19 -18 -19 20 -8 -7 6 -20 -4 15 10 1 -5 14 10 -6 -9 6 9 -3 16 46 10 18 -9 4 54 48 23 27 -32 26 -3
6128 -3 -10 13 11 -31 12 -16 -9 25 -10 -6 3 29 -1 -20 6 -27 -17 -13 -5 -22 1 -22 -34 5 -18 -29 10 -11 -28 -17 -14 -14 12 1 -41
6163 -41 -44 -13 -15 25 5 -1 -20 -9 2 -2 5 5 6 11 0 18 15 17 -10 22 -3 12 -7 8 27 18 9 31 19 2 25 6 6 -5 28 -19 46
6200 46 21 -7 0 -16 -10 -17 -34 -33 -27 8 9 -34 -2 7 0 11 -41 -4 -29 -18 -19 -37 16 -3 -2 11 30 -27 -10 -16 7 20 47 15 4 14
6236A4l3L0j9%M5nk4l9L4N5j0m6j0KK6m9L0k9RQJ0m3K2K2K0m8K5l6JJ1J3k0L6
6269BJ2m0K1j1QOlj0L5k9K0k2PQnk3L4J8l5LPk3M1l3L9k1K0j2l2L3jk0j0K3j5
6304hJ9nJ9k9QpL7l2j7lJ1J7J3l4pLoK8l9K4K7l1J0k9K3mOk7%NJ7l4L9l0jJ2J2
6341a3K9Mk0l4K2J7Jl1L8jrk3OM7l4jjRJ4j8J4LjK0k4Ql0kJ4mPj4K0l0K0Jj7j2
6379b5KNoK0J0l3J6mPjMOqnpL1k4MJ7J1jm8J6J2K7j7j7MnJ4kL0k5nmK3j7K3l2
6418dL8k9l6K5nk1L8PjJ5k5nj0L3k4k9nK3kJ2m1L4K0J6m7KJ4nKmL2Nm6K8j3j1
6454a9J3%rJ2nj6N0j0MJ5j8Rk6QPK7l4j1J8K7l8K4j0m1L7Kj2j5Rl1M3jl6L9l5
6489b3M3rJ6k2j4O2n7k0oK0jOl0J0J5kJ2rJ2n5M9qj2L0j2J5n0M3j4J2J8l0J4J9
$$ plain form
6236 14 -19 11 -8 -8 37 32 8 -31 3 58 48 2 -8 -6 20 -29 1 -28 -19 -11 -1 -44 -22 0 20 -28 -3 -39 -38 -27 -14 -34 2
6269 2 14 -26 -5 -16 -8 -2 -5 -15 20 -9 11 -11 -4 4 -1 -24 10 28 -7 -4 3 -20 21 -12 27 6 26 14 -18 15 14 -6 -16 7 -8
6304 -8 11 6 25 -4 4 -3 34 2 -15 -18 -7 10 23 -11 -18 -15 -21 7 -32 -8 19 -12 -2 -31 -8 -12 -6 -33 -33 -28 -11 -45 -6 -36 -37 -25 -13
6341 -13 16 20 0 -34 -12 5 6 -25 13 12 3 -20 -14 33 -1 -2 -3 6 20 2 16 19 18 38 14 22 -8 -10 4 0 7 -7 13 -17 3 4 -13 -25
6379 -25 -23 -18 -24 -4 6 -27 -11 -15 -8 -9 -5 1 -7 -12 -19 12 -12 -8 9 20 19 -29 -13 -1 26 9 -8 -4 -9 5 3 33 8 3 -1 22 5 28 -4
6418 -4 34 5 -31 -6 -11 -32 6 13 12 27 2 -3 -13 20 -4 -33 -38 -15 -17 -5 -46 -12 8 24 -23 -21 -7 -12 -10 -14 18 23 -23 5 -8 -19
6454 -19 -6 -6 -15 -3 -8 -24 26 16 20 35 17 26 0 8 15 42 8 -3 15 42 4 28 18 -23 14 16 4 -11 -2 -33 10 9 -27 12 -23
6489 -23 20 11 27 5 -9 53 -4 -24 -30 -10 -11 -5 -35 -25 -10 -12 0 -9 3 -52 -3 -11 -23 7 -5 10 -40 3 -11 1 19 -11 3 22
6523B2k1K3j5k2M0k4J1J0j8njOpJ5j6oJ4LJqk4k1N7l2nj0K8J3pk6J4l1N3Oj3J5
6559A9j4j1k1M0k3J3jK3k0j6mJJ2J5J0l4J3K1m0M5J1l6J1jj3ORMoNl2N2l2L4m2
6594bJ4k7QPnJ1mK6l6k6N4l2J0Rm5L3oJ6mKk1%K0nkj4j1M7m0LPpL0pLqL%oJ7R
6635B1k0lJ6jj6L5l3lL7j9Rj9k3L8J6k0mjOnjj1J3onJ6Oj7j3jMk1K5k2J9l8J1
6672c0OK6k0L2nj0j2J4j1rJ5j2J1jO2m2nk4RK0j2Qj7L4KmJ2m4Pk1K4K0j3J6nj9
6708Bj5M1j7j6K8m4RJ5rnPk3L9l6K5k9L7k2k5K2k3M0l0pK0OJ8l2K7Rj8J3l6L3
6742Dm2J8J6pO2m4k5J0mQmN0k1M%kk8J7J2j6K7l3K9j6j4J2j2K1Ln6M7m7K4k5K4
6777hk6K0Mj7K5Lj8k3K3oKj6L5J8m2j1L1m0O5lmn5N1J9k2l0J9K1Lj7N3l5qk9K0
$$ plain form
6523 22 1 24 9 -13 27 3 14 24 6 1 0 6 -1 14 -2 -8 6 9 10 2 -22 -43 14 -18 -23 -33 -5 8 1 -25 -11 -42 11 17 4 19
6559 19 5 -6 -27 13 -10 3 2 25 5 -11 -15 -14 -2 13 23 -11 2 23 -17 28 39 3 14 13 0 6 15 19 13 18 -14 38 6 40 -2
6594 -2 12 -15 -7 0 -5 6 2 28 -8 -34 20 -12 -2 7 -38 -5 -11 5 1 3 -18 -18 2 -3 -5 -19 -30 17 -23 -20 -13 -20 10 3 6 -2 1 1 -5 12 21
6635 21 1 -2 14 13 -3 32 -1 -4 33 14 23 4 -19 19 35 15 11 10 16 11 10 -1 12 6 1 17 23 6 -7 -8 -4 -25 0 -22 -3 -41 -30
6672 -30 -24 2 -18 14 9 -1 -13 1 -10 -19 -4 -16 -5 -6 56 14 9 -15 -6 14 2 10 -7 27 29 25 37 -7 0 -21 3 23 10 26 21 2
6708 2 -13 28 11 -5 23 -21 -12 3 -6 -11 -4 -27 12 -24 1 -28 9 -13 -38 -16 -39 1 -29 -36 -16 -10 8 -24 3 12 -6 7 -29 4
6742 4 -38 -20 -4 -11 51 7 -18 -8 -12 -4 -8 42 21 25 25 23 -5 12 24 8 35 2 31 15 1 13 1 22 25 -31 16 -31 -7 -32 -8
6777 -8 -34 -14 -10 -27 -2 1 -17 -40 -17 -23 -21 -37 -2 16 -26 -37 -6 -46 19 16 12 -43 8 27 5 -25 -6 15 18 1 54 19 11 -18 2
6812BQPJ5k5k6RJ7L2l3j1j1J9J1k9j6O8l0k3K4k0K1NMj6m4O0l2Jjoj3O6k6j4J6
6847Ik9K6OKk0j1K8j3oK2l6LK9%LL1pk6lK3kJ4k8l5M0OL0o3M6nn8J8k7L5NNj5
6884cK6k7lK1j7J7m3M8j8LpKk7K7J2k2j0K6j2mj3j4O9j6%ol0N5rm6L8Jjrj8PK
6921aML8k5%K3l4oL7j6K0m2L1kn1K9KJ5l5L3m4K9J6Nk2l6N5mm2L6j9K6m6M2m7
6955c1L7j8M0m9L0J5l2J6Qj1l4RM6k7L1j4j4J3%J5l3jjk7M5kK7k6k2J1QJ0j5J7
6989B1Qrj7Lj3KM4l4k2O3l7rk4J9j2KmnJ6Rmk0Mrj6J7NJ1J2l2J1K8l2jM0j8pQ
7027bmJ9k0lJ6l4J2M6j7J3nLooNj1J0lJ9j9pJ4qMlk8MK8m4L5Poj7mJ3k8OJ8J0
7066Gk7JNLq%oRJ2kMpJ4l4L7rK8k8J5j1JoMj8J0K1k8K9J2kk7JL0j8PL0m3M0l8
$$ plain form
6812 2 10 17 32 7 -19 -10 7 39 6 -5 -16 3 14 -15 -31 37 7 -16 8 -12 9 14 18 2 -42 18 -14 -13 -14 -20 -33 33 7 -7 9
6847 9 -20 6 12 14 -6 -17 11 -2 -8 14 -22 -19 10 10 13 44 37 11 8 31 29 43 15 -20 20 26 56 -7 39 34 -24 -6 -33 2 7 12 -3
6884 -3 23 -4 -7 14 -3 14 -29 19 1 4 -3 -1 -28 -1 11 -11 -21 5 -7 -11 -24 -38 31 15 15 9 -21 34 25 -21 17 18 17 8 -10 -3 -1
6921 -1 3 41 16 16 39 5 -1 36 20 40 -2 29 27 -24 5 7 22 -13 20 -24 5 21 26 4 -32 23 19 -23 13 -6 20 -26 16 -31
6955 -31 6 -12 28 -21 9 24 -8 8 16 5 -29 -20 26 -1 30 16 2 15 15 30 -3 -4 -5 -32 13 11 38 12 -10 1 9 19 4 21
6989 21 29 20 3 6 -7 -5 39 5 -17 46 9 0 -24 -5 -17 -15 -19 -24 -8 1 -3 -23 -19 -28 -44 -27 -22 -11 1 -31 -20 8 -24 -25 15 -3 -10 -2
7027 -2 -6 13 -7 -10 6 -28 -16 30 13 26 21 24 18 12 17 6 16 13 32 13 6 20 12 16 13 -15 -11 17 -27 8 15 9 -8 -12 1 -27 -21 -3 7
7066 7 -20 -19 -14 -11 -19 -19 -25 -16 -4 -6 -2 -9 5 -29 8 -1 27 -1 14 3 4 -2 2 -16 -6 15 -13 16 28 26 -1 0 30 12 19 49 6 46 8
7105Hk1jJL3j9K2j3j9NlL1m6L6Jpk2rL8j5o%%k8JRK5l0M1oRK2o7O4j7njK9Kn5
7144a3L5RLj5j1k3ML4lJ0Kn3L7pJ1LnJ4Kj3jj4j4j1L3qkJ3mqk3K8nj9K9l2NJk
7183a3OL9n0KK9j7K7n1JQK7j8j4L9ok7K3K9j7m1K5OrK7k9Qj8N0l7K9l5L6Mk8M6
7218E1l2J4J2l0Qlm0L9j2L0rl3m3K0OK8j4K2J6m5J3k3L7l7MJ7J2m4L3qRn%PJj0
7254iRK4J5p0O2j%m6OL1K3k1j8j0j1M5lMk5nJ3J4j5k1K4qJ6k0j2KL5n2PJ2mL2
7290B3n7N5qj2ok5RpJ9k3lL5pqoj6kK5k8LL2J2l4J8J7oK9j6oNk7L9Pj2l6N7l6
7327DlOMm4N1k0M3l7K0j0nj4J8J9l5N3n9onO%L2l0rJ8k8JK4ojQQl0J1J8k7LL6
7365A4k1j0K0j0NK3k2j8K9k8J7RKJ0okK1k3M5m1Rj8K2kk2J0Pj3K2j1%j5l3M7q
$$ plain form
7105 8 -13 -14 -13 20 1 23 10 -9 -4 -7 24 -22 14 15 8 -14 -23 15 0 -6 -6 -6 -34 -33 -24 1 -29 12 6 15 37 -30 34 17 12 11 40 42 -13
7144 -13 22 31 34 19 8 -15 -11 23 20 30 32 -21 16 9 20 23 18 32 34 21 20 6 -8 -19 14 6 4 17 13 5 -18 10 5 -14 15 -17 -12 -11 -13
7183 -13 -7 32 -18 -16 13 -4 23 -28 -27 -19 8 -10 -24 15 9 -18 5 34 17 -24 1 7 -2 25 -4 4 -14 36 -1 28 -7 29 33 5 51
7218 51 19 33 45 15 23 20 -20 19 7 37 28 -5 -48 -28 -22 6 -8 14 30 -15 -2 -25 12 -25 -21 -4 8 -36 -3 -11 -2 -7 -7 0 1 -9
7254 -9 0 24 39 -31 31 30 30 -16 -10 21 44 23 5 -5 -16 29 26 30 5 0 13 27 12 -9 15 7 23 3 -9 -7 28 -24 -17 -5 -9 23
7290 23 -34 21 13 1 -5 -30 -21 -28 -9 -32 -35 0 -7 -15 -21 -37 -39 -14 -42 -39 -7 5 -29 -11 6 0 29 13 7 12 -15 24 31 19 -17 40 4
7327 4 1 7 11 -33 18 -2 41 4 24 14 9 -5 13 32 -3 50 -9 -15 -20 -14 -14 18 -12 -21 -3 -31 -30 -6 -12 -13 -5 3 -27 -16 2 -25 -22 14
7365 14 -7 -17 3 -7 -2 21 -1 -19 10 -18 -1 8 10 20 14 12 33 10 55 14 23 5 27 25 3 13 20 7 29 18 18 3 -30 17 9
7400Ijmj6PNpMj5M3o1M2K9l8kjMpK7l1L%L2n1M6j0qj4j9O8m5OK0Nkj5jJK3j8J2
7440B0k0K1l8K7K4mOm6M8lk5l9L6LPJ2j9j6J0L8m1j2J5K2l3%j1K9k2K8l0j2J1
7473a4K3oj3nJ2k2j1M2k3K3j1Oj2J7K5oj1OopJ0j6ML%j1J5%Kk2J2J3mJ4Lj9%K6
7511C7n8M5pl8LRJ5j9K6j0Pk4J6J2k2J4j8LQlJ9k9j3k2L5j4M0k4j2K4JnNK3l4
7546a0K6mRmkj5K7oj5nPkL1j8QJ0k0qlJ9l2J6k6qJ7J4Pl8K3Pj3k5M3J0l0OK5j4
7584Gm4QJ9lkm3L6j1L3J7m3L4Mrkk2K3J6qKppJ4j1L6l0l0M0J7k8Jj8J4K6k7LJ0
7621A5Ol4J8j6M7k1oj1OJ0j7K2k5J9Rk4K7l2lJ5K8m1lKj8N1n5L3j5K2k3K5Nk4
7655hOK5k1J0J2lNPm3J9j2K1j4K2j8k2M4PJ6m9j0RK4m0L3jlj9%k2K4lK0Jm7K1
$$ plain form
7400 9 8 4 -12 -5 0 -7 -3 -18 25 -36 6 35 -3 -5 -6 -2 -9 18 -13 -10 -10 22 -29 17 7 -1 -15 -34 34 -11 -5 15 20 18 3 2 3 26 8 20
7440 20 0 21 -17 10 34 30 36 -10 38 35 10 -29 7 10 17 29 10 -6 4 42 1 -11 4 26 -7 -7 -18 11 -11 17 -13 -25 -14
7473 -14 9 3 -10 -15 -3 -25 -36 6 -17 6 -5 1 -11 6 31 25 14 20 14 7 17 1 5 8 8 -3 12 12 14 -8 4 17 13 27 30 11 11 37
7511 37 -21 24 17 -21 -18 -9 6 -13 13 3 10 -14 2 14 -8 6 -12 -9 -1 -4 15 -14 -27 -49 -14 -28 12 -12 -24 0 1 -4 1 24 -10
7546 -10 16 12 21 17 15 0 27 21 6 1 8 6 37 19 27 37 17 9 6 25 -7 9 -17 -25 -8 6 13 -25 -2 5 -8 -33 10 20 -10 -4 21 7
7584 7 -37 -29 -10 -13 -15 -58 -22 -33 0 17 -26 8 12 3 1 -21 2 18 10 12 5 -2 12 1 37 7 -23 17 34 6 7 -11 3 29 2 5 15
7621 15 21 -13 5 -11 36 15 9 -2 4 14 -3 19 -6 13 22 -2 25 -7 -10 5 33 -8 -11 -9 -27 24 -31 2 -13 9 -14 11 16 -8
7655 -8 -2 23 2 12 24 21 26 33 -10 9 -3 18 4 26 8 -14 30 37 53 4 -6 3 27 -13 20 19 16 -3 -3 -25 -1 -4 16 17 -30 -9
7691iJ3J1jLj1j9Rj5L5m5J8mKJ8ql9L7jK0l5nK6j2M4m5K4pj3RJ4Mlj2Rjj3K2p
7729A3L1k6RJ5j0j7%K7m6K4j9LK8o3L5Pk1J9j1rj8%N7n2j1L9k1J9Jl8M0Jl4M2
7763A4l1qLK7J8jn6L2j6L1k2M5jJ3n4L4K7m9K0Kl8LkL3J1k9QjJ0m0L2j7J0J2j7
7798CL5l5j5kL5j9m6L0K2l1QJ6j9K9k6k0j8K1L5pPk5OJM9k5l5mJ8J9k0K4%ok8
7833b3M1k5K4k8J6Nj6KN8o3K4k3J2J0ROj5K8m5qNJ6jkM0o6L7k6l0M9k4jj2L6L
7868A3m4L9j2k5J5J4j3K1o1P1l7K2k6ROL7pqj6NJ0j0j4RJ6j8J9NK4j9Lj5Pk2R
7903Gj3K8k7O0j8J1k7jlJ8m1Kk0N6k9K5j6k7Nk5QM1Nk2K3l9M3n0J5K0J9n5OJ4
7937gk5L0OJ3k0J6l4J3M3k7K0n9N1j0J0k7M6Ml3mL9k7Rj1J6j3l0M3pn4N4j5M2
$$ plain form
7691 -9 4 15 14 17 6 -13 -4 -19 16 -29 -11 -15 -13 5 -3 -42 -5 -6 14 -21 -26 0 -12 32 -13 11 4 -9 0 14 18 15 3 12 11 -2 20 13
7729 13 44 18 27 42 32 15 15 42 -4 20 1 4 32 -31 4 11 -10 9 -2 -11 -29 -29 28 -24 -35 4 -17 2 3 -35 5 6 -28 14
7763 14 -17 -25 -22 5 23 22 -34 -2 -18 13 -9 36 35 48 -6 28 55 6 26 28 -10 -7 -9 24 35 6 14 13 23 -17 15 -2 8 20 3
7798 3 38 3 -12 -14 21 2 -44 -14 8 -23 -15 1 -18 11 -15 -35 -53 -32 3 -4 3 -22 -16 -15 34 9 -26 -30 -12 7 -13 11 11 5 -23
7833 -23 18 -7 17 -11 5 10 -6 -4 54 -9 15 -8 4 14 23 29 14 42 -3 -11 -6 10 9 7 47 -19 18 -8 -38 11 -13 -14 -26 10 13
7868 13 -31 8 -4 -29 -14 0 -13 8 -53 18 -19 3 -23 -14 -8 29 22 14 -2 3 13 3 -11 -2 14 -4 15 20 44 25 28 13 20 -2 7
7903 7 -6 22 -5 55 37 48 21 20 17 35 -6 -4 -24 32 3 28 12 -15 -10 -35 -27 14 19 -3 20 -19 24 -26 -11 9 28 -27 -21 -7
7937 -7 -32 -2 4 17 -3 13 -21 -8 35 8 28 -31 20 10 20 -7 39 43 10 6 45 18 27 16 32 19 -11 32 25 -29 25 10 52
7970E2n6PMJRj1Qk0Ll9L2L2j6j7Rk6L8nkpM4m3LLj2QK1m2j2M6Ok8J9Oj4M3l3m
8008GJ2J6j8n%K2j7nk1N7k6%k4K3kj9J9lj5oNJ2qK9l7K1n4L0Pm2J8J5KRk2J1j
8045a0pJ0j4M7k7lml3K6J2k6J8nM1l8M5o4M8oj3pM6mj2kK3l7j4JK0K2j5Kj3J5
8080B2qK4Mm6L3l2K4m1K1jk5J4L0j1%k3J1Nj5J5j6mJL5k5%K5k8LK8p6L5J7J8m3
8115b9M6k4K2Rj9M0k9rMJ6PQm1%j2J4rM5k4j2J7qk0PK2j9J6j3j5j3K3l6M2j9m
8150a7J7Jljk0J3J6l1LJ8jL3m5L4l7N6k4Mk6L3k0j1jJ4mj1k4LL9J9m6M4j9L0n
8185C1m5K3l0N2l0N
$$ plain form
7970 52 -4 3 7 8 17 6 14 -6 -3 -42 -10 22 6 -11 -2 -28 10 5 3 -4 40 -3 0 3 -9 -1 20 -22 -34 12 18 -10 9 15 1 44 11 7
8008 7 19 35 17 12 12 34 17 12 -9 48 22 22 -2 21 19 0 19 16 1 -5 0 12 4 33 -4 17 -37 -7 0 -42 -24 -9 -7 2 -20 -9 -10
8045 -10 -17 -7 -21 26 -1 -4 -8 -41 -15 -3 -29 -11 -16 25 -13 32 -32 16 10 -3 -10 36 32 20 18 41 4 -10 -9 11 33 18 20 7 22
8080 22 14 38 42 -4 29 -3 21 -20 1 0 -25 -11 19 8 8 -15 -4 1 -14 1 -15 -19 -18 17 -8 -8 17 -11 -8 20 -56 -21 -4 14 -29
8115 -29 17 -7 15 24 5 45 16 7 11 27 34 42 1 1 -11 3 -6 39 15 3 20 12 -8 -1 21 2 18 5 -10 -23 0 -36 6 -13 -17
8150 -17 0 1 -2 -3 -23 -10 6 -25 -22 -4 -5 28 -17 17 -20 36 12 16 -10 23 3 -8 -9 5 1 -10 -34 -31 8 27 -19 25 6 36 31
8185 31 -14 9 -21 31 1 6
8191F
$$ Imaginary data points
##PAGE= N=2
##DATA TABLE= (X++(I..I)), XYDATA
0@%%%%%%%%%%%%%Qj6J6j6J6j6K1k9L2l2M0m8N3o1P0p8Q8j01J14j25J39j58J76
36I3j95K15k39K66k96L28l60L98m42M91n46O07o77P61q60R77j121J301j537J861
56A025k332L087m504Q074l4272q9267k1805j0288L795L0231O6661O5670N6763
69G2838M8204L0605n549k8253m2683n8959o8570n1814k9327j0910J1455L9791
81i3172N4212N8223N7684M4088J5173p013k1847m3927o3555n8137m0142k7460
93a25873r991J9762M0590M7171N4179N5650L4451P044o588k1057m6657n9234m7921
106e8474l4616k5850n095K2618L8152M5288N2179M6829K6052P779n825k7385m7999
119C3653m9922m1563l4764k0615L551K2316L3491M5939N0515L6808J9382R012
$$ plain form
0 0 0 0 0 0 0 0 0 0 0 0 0 0 0 8 -8 8 -8 8 -8 13 -16 16 -16 24 -24 29 -32 38 -40 48 -53 61 -64 75 -83 93
36 93 -102 113 -126 140 -156 172 -188 210 -232 259 -287 320 -357 404 -456 521 -600 701 -836 1025
56 1025 -1307 1780 -2724 5350 -28922 -118189 -139994 -150282 -146487 -116256 -49595 16075 72838
69 72838 121042 151647 146098 117845 75162 16203 -52367 -104181 -133508 -144418 -132963 -93172
81 -93172 -38960 19263 76947 121035 136208 129195 107348 63421 -134 -58271 -98413 -125873
93 -125873 -135864 -116102 -75512 -28341 25838 81488 115939 122983 116395 95338 48681 -10553 -58474
106 -58474 -93090 -118940 -124035 -101417 -63265 -17977 34202 81031 107083 114862 109037 81652 33653
119 33653 -16269 -57832 -92596 -113211 -109660 -87344 -53853 -7914 42601 79409 98791 107803
131A07803p756l2718m4927m1171l8167l3647j4948P708K0940L2735M5530M4469
143D5851K9806J8485Q244j3090l4354l9756l7383l6809k8379r179Q024K0609L4648
156c3283M2428L6501K6454J8784L700j7931l1199l4307l6614l5066k2170n772
168h8475P203K1665L5474L7536L1001K5964J7303j711j9988k7933l2156l5686
180b9803l0579j7330m700Q045K3885L3602L2174K8632K5139J2873n853j8613k5170
193C2302l1695l3531k5778j4803m014J0578K5045K9878K8654K8415K2949P714
205G5714p950j6969k4640l1081k9864k1990j3319j848J3333K3800K6203K7375
217A8764K7394J8711L900p563j5953k4731k9311k6345j9960j1809J054J4429K1420
$$ plain form
131 107803 100047 67329 22402 -18769 -56936 -90583 -105531 -97823 -76883 -44148 1382 45851
143 45851 75657 94142 102386 89296 54942 15186 -22197 -59006 -87385 -96564 -88540 -67931 -33283
156 -33283 9145 45646 72100 90884 94584 76653 45454 11147 -25467 -60533 -82703 -88475
168 -88475 -81272 -59607 -24133 13403 44404 70368 87671 85960 65972 38039 5883 -29803
180 -29803 -60382 -77712 -82412 -74367 -50482 -16880 15294 43926 69065 81938 76085 57472 32302
193 32302 607 -32924 -58702 -73505 -77519 -66941 -41896 -12018 16636 45051 68000 75714
205 75714 67764 50795 26155 -4926 -34790 -56780 -70099 -71947 -58614 -34814 -8611 18764
217 18764 46158 64869 68769 61206 45253 20522 -8789 -35134 -55094 -66903 -65849 -51420 -30000
230c0000K4482K7382K5105J4404K015p346j6573k4502k6564k3763j8643r108L957
243e9154J4046J9407K4093K6473K1427J1113J465p601j7222k3412k4310k2310
255c5985j6758o111N457J3005J8875K4307K4602J7963R160P04q822j7470k1920
268G007k2775k0941j4063l305N801J2272J8999K3593K1940J5384P972l79r753
281D1752j7052k0822k1919j9058j1194j987N495J2743J9683K2265J9374J3647
293D2927O696k039j0508j6487k0109k0836j6623q786j188N834J3451J9473K0393
306A2198J7335J2208N256l121j0766j6270j9681j9243j4332p455o81O781J4287
319b3484J8753J8746J5834J0781L661m043j0904j6395j8895j7209j2318o462K7
$$ plain form
230 -30000 -5518 21864 46969 61373 63388 56042 39469 14967 -11597 -35360 -54003 -63111 -59154
243 -59154 -45108 -25701 -1608 24865 46292 57405 58870 51269 34047 10635 -13675 -35985
255 -35985 -52743 -58854 -53397 -40392 -21517 2790 27392 45355 54515 55219 46397 28927 7007
268 7007 -15768 -36709 -50772 -54077 -48276 -36004 -17005 6588 28528 43912 51884 51505 41752
281 41752 24700 3878 -18041 -37099 -48293 -50280 -44785 -32042 -12359 9906 29280 42927
293 42927 49623 47584 37076 20589 480 -20356 -36979 -45765 -46953 -41119 -27668 -8195 12198
306 12198 29533 41741 46997 43876 33110 16840 -2841 -22084 -36416 -43871 -44552 -37771 -23484
319 -23484 -4731 14015 29849 40630 44291 40248 29344 12949 -5946 -23155 -35473 -41935 -41908
332d1908P792J4427J7644J7325J4549R397K498m602j1220j6295j7786j5561j1126
345c4866n725J160Q742J4479J6710J6095J3242Q011J451n517j1695j5780j6353
358a0046j4124j0129m547K449R282J3935J5854J5095J1918O879N78o210j2062
371A8872j5229j5147j3076r227l395L630R761J3575J4967J4069J0828N686o04
384C4710o962j2011j4351j4129j2091q032k207M419R888J3161J4144J3088R838
397B9465M702j653p594j1820j3611j3357j1284o887r30N233R951J2665J3407J2168
411B0455Q673L409k618p881j1349j2950j2679j0266n660R8N598R792J2291J2772
425I685J1314P628K378l328q117j1175j2444j1902r243m508J093O027R687J1713
$$ plain form
332 -41908 -34116 -19689 -2045 15280 29829 39226 41724 37122 25902 9607 -8179 -23740 -34866
345 -34866 -40591 -39431 -30689 -16210 500 16595 29837 37848 39299 33782 22087 6307 -10046
358 -10046 -24170 -34299 -38846 -36397 -27115 -13180 2674 17769 29687 36566 37144 30934 18872
371 18872 3643 -11504 -24580 -33807 -37202 -33572 -23811 -10236 4731 18800 29628 35314 34710
384 34710 27748 15737 1386 -12743 -24834 -32866 -35073 -30654 -20766 -7605 6539 19627 29465
397 29465 34167 32514 24920 13100 -511 -13868 -25152 -32039 -32969 -27736 -17785 -5120 8287 20455
411 20455 29128 32537 29919 22038 10689 -2261 -14940 -25206 -30866 -30768 -25170 -15378 -3087 9685
425 9685 20999 28627 31005 27677 19560 8385 -4059 -15961 -25204 -29712 -28619 -22592 -12905 -1192
439a192J2174J0389O423J269l844p968j0807j2009j1179q147l414J611O156R575
453a0963J1439J1601R398N417M76m235q046j0649j1498j0335p046k555K264O314
467a8418R450J1087J0798Q414M375j64m513q003j0341j0978r516o055j737K617
481b2984O452R358J0783J0100P410L494p46m778q123j0211j0327q474n096j011
495b4153K981O652R308J0204R201O504K776j245n036q115r808r638p642m339m92
510b2842L357O823R163R768Q414N590K161j660n381q212r411q911o739l601J26
525b1355L711O922Q926R090P540M933J584k070n606q076q899q188o104l039N56
540b0075M056O958Q652Q498O859M295J052k545n786p865q468p497n370k452R43
$$ plain form
439 -1192 10982 21371 27794 29063 25219 17251 6444 -5565 -16744 -24891 -28305 -26694 -20538 -10963
453 -10963 476 12077 21475 26892 27368 23133 15087 4438 -7060 -17395 -24441 -26996 -24732 -18418
467 -18418 -8968 2119 12917 21331 25706 25542 21029 13026 2685 -8293 -17809 -23864 -25601 -22984
481 -22984 -16532 -7174 3609 13709 21119 24613 23867 19089 10966 755 -9572 -18046 -23142 -24153
495 -24153 -21172 -14520 -5212 4992 14193 20697 23473 22228 17192 9077 -731 -10369 -18011 -22350 -22842
510 -22842 -19485 -12662 -3499 6269 14683 20273 22434 20774 15393 7181 -2230 -11141 -17880 -21481 -21355
525 -21355 -17644 -10722 -1796 7294 14834 19767 21351 19281 13675 5599 -3300 -11488 -17592 -20631 -20075
540 -20075 -16019 -9061 -409 8089 14948 19243 20295 17750 11964 4099 -4369 -11866 -17236 -19688 -18745
555a8745M324P069Q178P779O249L840N66k963n830p588p955o981m859j943J445
570a7414M548O941P745P276N735L239l7l177n854p369p459o384m247j481J767
585a6171M807O722P226O814N275K691m80l518n734p086p007n836l826r47K252
600a4818M915O404O923O397M771J992r48l699n752o813o502n313l239m27K585
615a3524M939O195O518N948M198J490j266l823n711o395o136m902k753J03K918
630a2201M847N948O281N508L595R50j556l968n543o091n716m445k154N65K888
645a1092M767N798O008M984L032O99j878m034n380n750n439m007j613Q87L039
660i979M682N707N637M398K637K49k094m040n165n536n034l449j146J114L079
$$ plain form
555 -18745 -14421 -7352 826 8605 14854 18694 19260 16297 10467 2879 -5076 -12057 -16916 -18859 -17414
570 -17414 -12866 -5925 1820 9096 14831 18070 18033 14856 9002 1633 -5826 -12210 -16457 -17938 -16171
585 -16171 -11364 -4642 2584 9398 14673 17364 16884 13366 7632 546 -6461 -12297 -16123 -17070 -14818
600 -14818 -9903 -3499 3424 9821 14592 16584 15636 11937 6185 -628 -7130 -12443 -15682 -16109 -13524
615 -13524 -8585 -2390 4128 10076 14274 15764 14498 10675 4964 -1431 -7567 -12469 -15222 -15119 -12201
630 -12201 -7354 -1406 4875 10383 13978 14928 13372 9404 3861 -2230 -7946 -12391 -14545 -13980 -11092
645 -11092 -6325 -527 5481 10465 13497 14196 12318 8284 2904 -2846 -8285 -12292 -13905 -13018 -9979
660 -9979 -5297 410 6047 10445 13082 13331 11237 7197 2032 -3504 -8538 -11987 -13133 -12019 -8940
675h940M656N519N177M011K220p5k360m014m984n336m621k934p12J274L219M658
691c242N304M721L595J789m38k468l982m846n031m156k495m53J455L275M542M998
707B568M432L209J417p21k524l929m843m706l745k072k44J726L412M396M696M093
723G165K819R77q58k587l945m638m360l243j810n2J893L438M204M452L818K488
739I761O85j090k633l937m479l986k914j536K44K105L363M078M205L470K064M09
755I809j159k758l856m194l590k702j287N06K255L255L985L937L145J741K36j347
771G976k911l753l903l330k397r86Q05K255L185L875L652K747J469O4j518k826
787D404l609l661l120k130o84R48K263L178L685L361K476J278j07j725k891l364
$$ plain form
675 -8940 -4284 1235 6412 10423 12643 12568 10208 6194 1210 -4126 -8747 -11681 -12393 -11119 -7900 -3242
691 -3242 2062 6783 10378 12167 11729 9261 5279 433 -4598 -8754 -11249 -11702 -10247 -6972 -2430 2568
707 2568 7000 10209 11626 10905 8381 4452 -391 -5097 -8842 -10914 -11158 -9432 -6020 -1624 3072 7165
723 7165 9984 10961 10103 7516 3571 -1067 -5427 -8670 -10480 -10532 -8639 -5201 -997 3455 7273 9761
739 9761 10446 9356 6723 2786 -1693 -5679 -8593 -10129 -9885 -7780 -4417 -339 3866 7336 9400 9809
755 9809 8650 5892 2036 -2158 -5748 -8450 -9737 -9231 -6976 -3721 264 4201 7346 9087 9323 7976
771 7976 5065 1312 -2591 -5921 -8318 -9304 -8499 -6244 -3059 816 4468 7215 8684 8748 7230 4404
787 4404 795 -2866 -5986 -8116 -8800 -7852 -5589 -2411 1274 4635 7111 8389 8282 6557 3666 302
803C02l429k891j835l56J007K259L196L444L057K191J139l61j818k777l196l295
819c363k630j555j75J076K349L087L233K790K052Q75o07j912k645l086l102k330
835e943j292J4J200K310K968L022K565J811O51p52j842k588l021k855k058j095
851f905Q7J315K330K835K834K428J577L97q78j867k507k897k575j862r20K44J436
868d928K254K651K692K207J348K13r16j843k475k752k354j656p65L87J498K168
884b271K556K545J979J141N8r74j801k419k545k153j533n96N60J520K021K426
900E14K392J844Q81nr73j819k339k386j997j347m56O46J448K019K372K233J570
917D597P85q6j041j819k218k195j865j190k74P28J344K027K210K063J423O63k08
$$ plain form
803 302 -3127 -6018 -7853 -8209 -7202 -4943 -1747 1697 4754 6945 8084 7723 5905 3128 -68 -3363
819 -3363 -5993 -7548 -7723 -6647 -4298 -1211 2022 4812 6864 7739 7132 5220 2575 -511 -3613 -5943
835 -5943 -7235 -7221 -6021 -3711 -743 2279 4844 6655 7306 6554 4712 2124 -897 -3752 -5810 -6905
851 -6905 -6818 -5503 -3173 -338 2496 4924 6501 6898 6020 4153 1646 -1251 -3826 -5688 -6608 -6364 -4928
868 -4928 -2674 -23 2669 4876 6224 6437 5521 3678 1203 -1549 -3903 -5559 -6324 -5937 -4439 -2271
884 -2271 285 2830 4809 5950 6008 5034 3233 814 -1731 -3884 -5417 -6013 -5453 -3933 -1912 514
900 514 2906 4750 5631 5626 4653 2834 495 -1891 -3888 -5235 -5691 -5045 -3597 -1578 794 3027 4597
917 4597 5382 5296 4255 2436 218 -1977 -3842 -5032 -5306 -4578 -3234 -1207 1003 3066 4489 5152 4944
934D944j126j735k117k065j755r77j11P19J399J913K135J876J267N54l64j134
950C423j708j979j958j566q40k3P72J419J898J980J692J160L85m37j119j690j899
967d90j869j369o74P4P69J451J835J845J569R91K51n19j169j585j839j735j196
984c660n14J39Q61J418J750J735J414Q78J22n87j119j616j792j558j048m04J85
1001c796R67J390J640J616J304O95K1o09j184j547j642j386r77l26L31R26J403
1018a174J597J476J226N17m9o57j138j541j568j237q50k11L86R74J348J503J419
1035B021R80M93j35o67j213j429j431j167p18j49M75R52J291J470J236R51L55
1052C315k09p05j162j419j310j060n81o6N23R33J284J396J119P91L38k92p79j126
$$ plain form
934 4944 3818 2083 -34 -2099 -3854 -4831 -4942 -4223 -2824 -911 1224 3100 4367 4921 4557 3423
950 3423 1715 -264 -2222 -3788 -4628 -4651 -3879 -2460 -562 1418 3110 4270 4655 4218 3099 1409 -490
967 -490 -2359 -3728 -4402 -4328 -3559 -2108 -273 1572 3141 4132 4383 3864 2695 1110 -729 -2464 -3660
984 -3660 -4174 -4035 -3174 -1756 -6 1729 3143 4021 4143 3556 2437 821 -971 -2529 -3577 -3981 -3796
1001 -3796 -2829 -1439 201 1817 3121 3816 3837 3228 2044 497 -1145 -2531 -3508 -3834 -3503 -2577 -1174
1018 -1174 423 1899 3125 3642 3593 2936 1798 257 -1311 -2548 -3398 -3609 -3223 -2249 -901 602 2021
1035 2021 3001 3494 3359 2692 1479 50 -1381 -2548 -3266 -3415 -2940 -1988 -697 773 2009 2960 3315
1052 3315 3106 2401 1239 -180 -1490 -2550 -3131 -3197 -2674 -1741 -457 939 2058 2849 3187 2895 2116 990
1070I90j320j241r30n50M0N44R84J244J286J054O88K43l30p79j133j246j161q68
1088b485m20J40N17J030J221J163R25O40J26l75q31j044j205j101p60k99J54O13
1106a991R76J164J114Q61N18J3l83q28j035j168r41o65k83K45O27R45J116J029
1124A314P79M31l6m33q25j029j056q63o13j43K64O40R30J047R58P00L35r3m29
1143A878q34j001r85q08n29n8K62P07R04R65Q98O02L26j52n04p99r46r43p11m45
1163b173l8L28O84Q62R48Q21N59J98j68n65q02q60q69o23m22J4L74O59Q62Q90
1183F79P27N14J27k20n11p64q41q18o03l25Q6L76P03P73Q50O64M34J09k45n52
1203A163o96q62p23n51k05P3L94O69Q04P47O12M12L2k96n36p33p57o53n16j85
$$ plain form
1070 990 -330 -1571 -2501 -3051 -3011 -2467 -1483 -239 1047 2101 2789 3032 2702 1923 790 -456 -1617 -2485
1088 -2485 -2905 -2765 -2248 -1218 3 1166 2091 2731 2857 2482 1651 607 -598 -1699 -2459 -2758 -2604 -1991
1106 -1991 -1015 149 1263 2124 2642 2655 2272 1444 409 -759 -1700 -2365 -2648 -2403 -1776 -831 285 1314
1124 1314 2093 2524 2488 2055 1230 201 -855 -1718 -2331 -2474 -2210 -1570 -640 407 1365 2065 2400 2307 1878
1143 1878 1044 43 -942 -1750 -2279 -2337 -2075 -1368 -464 501 1399 2001 2327 2175 1671 872 -74 -1017 -1728 -2173
1163 -2173 -2211 -1883 -1199 -337 611 1432 1991 2189 2021 1456 654 -206 -1075 -1698 -2120 -2106 -1732 -1073 -211 679
1183 679 1406 1920 2047 1827 1316 552 -289 -1107 -1710 -2035 -1949 -1573 -870 -97 753 1417 1851 1960 1715 1163
1203 1163 467 -395 -1118 -1669 -1874 -1801 -1407 -738 66 813 1425 1837 1869 1573 1037 304 -453 -1106 -1622 -1807
1223a807J10M34O35P58P11N60L64j8k86n50o70p30o78l92j47J68L91O21P35O20
1243H29N69K28Pl06n16o49p15n71l86r8J88M02O13O81N73M97K31p0l00n09o37
1264F1o32n37l27o4J88M21N36O60O01M11K18j45k95n06o01n64n00k84o4J99M08
1285h16N55N90N79L38J73j15l12m57o11n56m41k84nK13L97N53N05N71K97J59j17
1306A216l04m63n49n49l85k16k7K47L70N30N04M55L10J17j09l42m31m79n16l72
1326i93j97J2K28L96M66M86M49K82M2j22l02m30n13m75k83j89QK42L61M94M72
1347D34L78K25J11j58k82m58m47m50k67j86O2K28L82M05M64L43K46J7j57k76l98
1368B16m50l60l14j26P2K37L40M13M10L49J58M0j09l13m05l92l62k48j40Q7K38
$$ plain form
1223 -1807 -1697 -1263 -628 130 841 1401 1765 1747 1461 911 241 -489 -1167 -1559 -1706 -1538 -1147 -526 209 829
1243 829 1398 1626 1633 1327 811 162 -553 -1124 -1510 -1608 -1420 -1018 -405 276 849 1346 1577 1507 1207 698 61
1264 61 -571 -1108 -1435 -1499 -1311 -890 -354 306 907 1318 1536 1391 1096 590 -11 -575 -1075 -1359 -1423 -1224 -816
1285 -816 -261 329 908 1246 1419 1304 992 535 -76 -632 -1073 -1357 -1362 -1149 -752 -199 306 877 1174 1333 1216
1306 1216 912 449 -100 -649 -1034 -1250 -1277 -1030 -660 -130 374 829 1139 1256 1147 805 374 -105 -621 -993
1326 -993 -1190 -1178 -950 -554 -88 398 847 1129 1171 1049 747 317 -196 -671 -954 -1143 -1135 -893 -532 -38 434
1347 434 812 1037 1148 990 708 250 -197 -647 -914 -1100 -1038 -810 -428 -23 441 784 1030 1047 890 614 216
1368 216 -234 -594 -908 -1034 -962 -725 -385 28 438 787 945 985 876 563 158 -234 -596 -844 -984 -897 -659
1389f59L59L98L21L34J74kj11k94m00l60l46k48o6O0K10L27L86L57K70J58Mj12
1411G60l01l63l31l28k56m6R0K03L32L38L45K78J48m4j42k39l78l37l02j71o9
1432h13P7K01L45L12L03K59J33Lj78k75l20l31k88j74l2J18J76K87L36K75K60
1453F74J02j5j67k63l08k84k89j80K3P2J46L38K79K98J88J54n8j33k39l36l07
1474c05k74j42l4J10K05K92L08K44K40Q8p5j40k45k93k86k15j60j4R2K14K78K89
1496A77K72J79P3m9j30k56l02k81k35p1m3J18K01K46K89K63K08%k0j79k30k63
1518c3k81k08j02mR2J92K57L01K28J55K5Oj84k60k37k92j76j33%J32K29K65K70
1541B42K10J52N3q3j60k33k55k48j66j45M0J09J91K93K17K34J59K4p0j57k27k72
$$ plain form
1389 -659 -300 98 419 753 927 925 814 520 120 -240 -586 -834 -900 -840 -630 -303 83 440 710 868 872 760
1411 760 459 96 -235 -563 -819 -865 -775 -572 -240 98 443 721 869 825 683 444 66 -271 -573 -744 -813
1432 -813 -736 -535 -190 122 425 684 817 820 642 367 47 -284 -572 -746 -778 -660 -484 -197 139 414 674
1453 674 776 761 594 331 23 -261 -550 -730 -707 -635 -489 -151 128 426 614 768 710 577 338 2 -305
1474 -305 -579 -721 -755 -645 -440 -148 160 404 644 732 657 517 272 -21 -307 -522 -682 -696 -604 -390 -112 177
1496 177 449 628 701 652 522 266 -36 -317 -552 -623 -666 -548 -347 -101 188 451 659 659 639 460 230 -33
1518 -33 -314 -522 -624 -628 -536 -344 -87 214 442 597 622 628 444 184 -53 -345 -521 -654 -654 -522 -293 -28 242
1541 242 452 604 657 574 414 181 -74 -322 -488 -633 -593 -484 -293 0 217 451 610 634 564 407 180 -92
1563i2k71j34q3MJ30J95K33K61J92J30L1o9j96k04k27k35j77p1L5R7J96K68K28
1586B41J84J24K8p6j87k27k38k04j32p3J9J12K05K19K78J65J04L4p9j73k10k56
1608a42j84j67o2K1J83J81K20J83K11R9qo7j71j87k47k30p5p6K6J10J96K21K58
1631B93J36Q6K0r4j66k13j91k29j47m2M3J49J91J86K10J63R7J6j18j20k05k29
1653a64j47j59k1L5J00K16K07J78J78R3k2q1j59j94k10k09p7l6L7J04K31J64J87
1676B51K04M4K6r2j82k22j72j85r8n8M0J28K04J92J82J43Q1j8p2j68k15j70j68
1699c25r5p7P1J38J83K24J55J17M3K1j16j22j98k02j22j11n3N6J40J68K10J47
1721B52J53N4m8o3j60j72j78j50j09k1M0J33J66K05J62J40M9pj09j39j66k14j36
$$ plain form
1563 -92 -363 -497 -580 -576 -446 -251 -18 243 435 565 596 527 331 127 -100 -335 -512 -583 -548 -451 -255 13 241
1586 241 425 549 577 501 314 87 -151 -355 -487 -560 -541 -429 -224 -5 273 438 542 576 497 324 114 -142
1608 -142 -326 -493 -555 -534 -351 -170 50 233 444 543 535 468 297 110 -137 -367 -442 -518 -492 -382 -186 35 293
1631 293 429 515 535 441 275 62 -129 -358 -505 -547 -504 -355 -164 22 232 395 492 508 390 270 65 -164
1653 -164 -311 -470 -491 -456 -356 -140 67 245 423 516 494 413 254 60 -150 -359 -436 -472 -435 -331 -100 64 251
1676 251 455 499 525 433 251 29 -143 -328 -426 -484 -444 -316 -112 80 262 405 486 468 396 228 13 -157 -325
1699 -325 -420 -497 -426 -288 -105 119 274 391 434 455 339 217 19 -183 -305 -416 -469 -413 -273 -105 105 252
1721 252 405 459 411 348 188 16 -162 -312 -421 -442 -402 -269 -103 102 264 404 453 446 337 198 32 -182 -318
1744c18q3j9M6J12J55J95J54J27P5m1r3j30j79j68j77j03LJ01P5J90J52K06R2
1767C72M8o9l0j35j96j67j24j23oQ4J17J58J56J83J29%m0o2j43j73j35j29r4o
1791c85Q0P1K05J67J11J30N3q3n9j80j52j53j48l2l0Q2J03J82J86J20Q1P4n6j16
1815B51j45j55j61j01q3J4R5J13J60J28J61J11ok9q6j76j50j46j13k9l4R5R6J65
1839b5J97R4Q7J7l6o4j65j83j09j26l4oJ05R3J60J55J49P3Rp0o7j72j63j45j03
1864c29k3jJ01J26J54J00J60O7J5n5r0j92j30j27j19pK4Q8J23J34J59J01O3Pk8
1889C21j43j04j68j36j11j9K1J07J22J47J48J05J03m3m1j16j57j53j51q7K3M0
1911b92O9J39J67J19J30J7jq8j04j35j42j36o7o3P2J04J64J31J22R7N9l3n9j03
$$ plain form
1744 -318 -401 -420 -374 -262 -107 88 242 369 444 403 310 180 1 -167 -344 -447 -444 -343 -268 -78 74 280 372
1767 372 420 351 321 186 -10 -177 -301 -424 -430 -346 -229 -71 85 268 397 397 357 295 152 -21 -156 -285 -379 -385
1791 -385 -305 -234 -29 138 249 379 432 349 290 110 -42 -195 -343 -375 -405 -323 -220 -38 148 268 349 423 367 251
1815 251 106 -49 -210 -311 -394 -380 -285 -172 -12 116 277 388 382 353 267 91 -59 -205 -318 -347 -381 -286 -190 -25
1839 -25 172 266 353 370 334 270 105 -78 -187 -313 -347 -353 -248 -155 5 160 309 382 391 321 254 82 -81 -226 -329
1864 -329 -352 -353 -252 -126 28 128 288 355 370 315 225 33 -97 -224 -343 -350 -326 -238 -115 19 178 279 342 349 321
1889 321 178 74 -94 -230 -341 -360 -339 -232 -110 37 185 290 393 350 309 193 36 -117 -268 -355 -332 -292
1911 -292 -223 -84 83 202 332 349 348 260 156 21 -121 -257 -324 -387 -315 -211 -47 84 206 303 362 329 270 167
1935A67j81j40j11p8PK6J16J22J53J29R9L9J5r7j59j18j68n7j18N8M0J03J46J33
1959A26J04J07J3k7o8j52j25j41j12m6nQ5Q1J39J55J10L8M8o0n0j56j37j40q8
1983c01n1JJ04J01J57J14Q0J22Pm6j17j09j20j50p7m8RQ5J25J45J22R6O0N2j00
2008B61q5j23j24j24j13mL1R3Q7J30Q5J48R2l0j1j41j18j31j36j12j7L4P9J42
2032h7J09J23J52LJ9o2j03q9j31j74q1k1N1J12J08J44R0J45K2l5o9l8j67j80n7
2057b16r7LL2R3J47Q6J37R9L6Qq9p8j63j33r2p4rP4Q7J06J34J05P6P1m7l1j61
2084A04j10r7j44j6qj1J05J35J54J06O4K0j1q2j35j05j19q0n1l8P3J20P4J52P5
2109A75Q5O1o0m6j47j14j18o0o7K7L0O1J09J61J24M8L3k4q8q9j40j04q5l4oN7
$$ plain form
1935 167 -14 -154 -265 -343 -336 -310 -194 -72 81 210 309 348 363 266 107 -11 -179 -236 -354 -296 -256 -153 -7 126
1959 126 230 337 350 323 255 103 -22 -163 -275 -321 -326 -241 -160 -21 134 244 282 330 270 220 64 -73 -213 -301
1983 -301 -352 -351 -247 -146 11 125 205 327 334 288 171 62 -58 -208 -285 -333 -324 -239 -114 31 153 249 309 361 261
2008 261 176 53 -71 -195 -308 -312 -281 -188 -101 29 114 262 354 324 313 172 54 -77 -213 -325 -342 -308 -229 -87
2032 -87 22 145 297 300 319 257 154 65 -66 -240 -321 -342 -291 -179 -71 73 163 308 330 295 226 188 21 -159 -216
2057 -216 -313 -310 -278 -185 -38 48 185 284 320 328 239 161 -2 -135 -227 -301 -310 -236 -149 -43 91 196 272 343 296 265 104
2084 104 -6 -103 -247 -263 -271 -282 -177 -42 112 218 282 302 291 209 74 -31 -150 -230 -281 -319 -246 -126 -52 100 175
2109 175 260 321 261 215 68 -46 -164 -224 -291 -264 -234 -173 -64 97 221 269 302 278 190 101 -39 -143 -228 -262 -268 -211
2135b11R9R6J66O3N4J8k1o4j12j34j14j07j9M2J3J06J49Q1J12N5L3l4r0r8j68
2160h5p8o9n3mO7J16J06J38J22M1k7k9p5j53q7j00o3l9L1O8P4J54J03N6P5L2j06
2187B15m9j31j14o9p3j1l2Q0J03R9J33N7O9kp2p4p5j30n5j18k7K3Q9O9J54M9R0
2214A98O4ko3n1j32j07r0o9NK3O6Q1J33P4J12L2k6n8n7j21j21r7l7k0Q5rJ38J03
2242E4J32L6L7Qn6r0q5j20r4n9rK2Q2J10Q9J17N7N2Pj08n9j11j26q5n5jN0Q3J26
2271DP3O6J02Jk1n4j00j00p2j04o4K5N2Q6Q4Q7J10L9P9p0p3r1q5r9p0j6KM3O5
2300a01P2J14J14N6k5K0j24j4j33j15n1p9M3O7P1P3Q9J18N2j8Qr4q8j43l2j09
2326b29J0pO5P3J16O0R0O0ml1q2j08p0r8k4k2MJJ17J08O7N9J07m0l3m5j21j02
$$ plain form
2135 -211 -112 -16 150 213 267 285 264 200 88 -46 -160 -267 -286 -244 -231 -125 24 105 217 272 305 271 181 83 -85
2160 -85 -163 -232 -285 -289 -222 -106 0 138 260 301 274 245 170 17 -70 -170 -233 -272 -241 -173 -99 55 158 214 289 321 215
2187 215 166 35 -79 -148 -221 -232 -264 -184 -81 18 151 208 277 275 203 129 54 -76 -131 -249 -276 -253 -164 -95 59 108 198
2214 198 262 260 197 146 14 -93 -183 -252 -247 -224 -158 -77 56 130 242 274 248 190 133 12 -109 -206 -243 -263 -178 -187 -49 54
2242 54 186 222 259 267 211 121 36 -84 -178 -237 -246 -224 -142 -32 57 174 231 283 290 182 123 12 -114 -199 -254 -255 -205 -122 4
2271 4 77 143 245 246 225 171 71 -29 -101 -205 -269 -244 -192 -106 -22 65 175 214 293 223 150 59 -26 -125 -195 -211 -209 -166 -101
2300 -101 -29 85 199 255 230 250 126 112 -21 -136 -187 -266 -223 -156 -85 -12 77 195 247 229 237 143 55 -88 -120 -229
2326 -229 -219 -226 -161 -88 28 88 178 238 234 203 121 13 -57 -155 -179 -201 -197 -196 -79 29 96 155 262 222 189 144 23 -79
2354g9m8p9QJ0K1J16O7J12O8M5qn2r2o9q4j02l7k1L1R5L1J23N7Q1L2Mn9q7j06
2383b2p7o2k5j8j7J09Q1O2J00M2L8l8j0m2j08q8r5l4J4N7K7Q6R4K4Q5N7m6k3j08
2412F3r2o7r2Kj3J6J10N9Q1R8N2NK4j03n5j02j11o1l0J0O7N6Q8P4P9K1K1k0m0
2441A40q8r1r3k3n5J5L7P6R6P5L3P1J1o4m0p0p4q5l4n6M7K8Q0R7P5K3P5Qm4p5
2471I5n1q7q3k8j4KN4Q0P4P5K4N7jj0q5o5j11m9l3jj9M5O2J16L8J00j7Ml4l3j11
2502fq9k7l1j7M1K7P7M7Q2L4N3K5p9l5q6n7q5rn8J2Q4N9O0Q4N3K3Mo2l4q8m6o2
2534a06j2j9MRR8Q7K7N4L5l2j0n6p0o6n8l6kJ4M2O6O8Q6PM6j2q5l2o2o2k6m7j5
2566a65L9O1O1K6P0N3Qqp4k0r2n3l6j9j1P2N8PP7Q5rL2n2k1l8p3k9r7K7j4J8N9
$$ plain form
2354 -79 -127 -206 -198 -188 -167 -51 16 128 196 241 233 181 89 20 -64 -166 -203 -224 -193 -98 -67 56 113 194 226 230 171 84 -22
2383 -22 -99 -161 -186 -204 -221 -112 -31 31 131 173 211 173 163 121 13 -75 -170 -204 -190 -133 -106 -20 74 98 183 240 194 171 63
2412 63 -29 -96 -188 -186 -199 -183 -73 -14 67 165 217 222 246 143 88 -14 -125 -186 -216 -206 -139 -83 5 79 158 179 200 180 140
2441 140 52 -39 -132 -155 -210 -195 -158 -82 14 89 122 193 204 140 100 30 -44 -129 -163 -219 -172 -144 -64 33 108 131 206 214 170 95
2471 95 44 -43 -126 -154 -168 -166 -112 -32 42 117 141 198 197 187 102 37 -74 -123 -156 -157 -176 -131 -69 47 85 185 168 172 138 105 -6
2502 -6 -95 -122 -153 -170 -129 -102 -25 22 104 138 191 216 137 102 16 -41 -126 -135 -193 -181 -97 -38 22 106 159 182 186 124 90 2 -44 -106
2534 -106 -118 -137 -133 -124 -26 61 88 142 177 145 135 79 9 -57 -115 -151 -153 -139 -97 -31 37 123 130 176 164 79 47 -15 -77 -103 -150 -165
2566 -165 -126 -65 -4 22 92 145 153 145 71 51 -41 -94 -130 -149 -160 -88 -30 -23 54 139 130 162 110 89 51 -22 -51 -148 -121 -135 -117 -58
2598e8N4O8Q9J4j3l6oo9n9o9l0o7K2P3K9M2P1Q4j5L6k1p3j2r5m9o7J3j9L2Q6O3
2629A8O6L1K1j1jp2n6k5p6k0PJ3JP1M8J00QL5j3j7m2n7m2q0pJoM9N4L1O6K5L4
2662A54J4m8o4j6j02m2m0j6M4L7P1K7P0J8L3l4Ro0o4m4o5j0rML8Q3kR6M2mRm7
2694H2k2o3o3j2n7oL0P3K4P6P7Nj8L6p8l0m9n8k0l9J0QP3KO7M7OJ2Pm6o3m7k6
2727f2j6k6m2N6OO2N9K6L2M2l8n0l9m6m7jm5J7kO3N9O1L7L2l3pk2m8m8k0p7rN
2760a21L6M4M6O1N1lK4j0j5r7o4J3p1Ql4P7K0L6L3P4K0j5ql3j2j06n5k4qL0K5
2791g8K3M2P2P8m0J8l3l7rr8k6k1J2l2O5M3L6L8N2J5j0ro3j4m6l4n5J0K9J1O7
2822FP1mL8K9k2l0o1k7o2m4Pl6O2RN1R1jK4pK4l4k7n4q4nm4j7M0P9J1N1R5jl3
$$ plain form
2598 -58 -4 64 153 167 154 118 112 43 -16 -85 -115 -182 -160 -87 -58 -16 55 139 124 160 139 66 54 -41 -90 -157 -144 -163 -131 -45 18
2629 18 84 115 136 125 124 52 -4 -29 -105 -125 -118 -105 -104 -33 15 115 123 158 145 128 86 29 -13 -93 -100 -99 -105 -56 -2 29 95 120 154
2662 154 168 120 56 40 -62 -104 -144 -160 -116 -79 -8 19 89 107 140 106 115 55 -9 -53 -118 -128 -137 -133 -95 -12 -14 82 124 120 129 82
2694 82 60 -3 -66 -78 -135 -141 -111 -38 -14 62 139 144 126 162 84 54 5 -53 -73 -112 -102 -94 -21 -19 48 95 101 113 120 74 11 -36 -62
2727 -62 -78 -104 -146 -90 -84 -22 37 63 95 137 99 49 10 -36 -83 -84 -129 -112 -114 -51 8 69 106 138 105 98 76 28 -20 -40 -117 -126 -121
2760 -121 -85 -41 5 66 117 114 138 128 113 16 -48 -35 -106 -98 -132 -55 -35 1 34 108 128 113 105 72 60 -46 -101 -125 -133 -103 -78
2791 -78 -55 -13 59 137 97 115 82 45 36 -62 -88 -109 -97 -129 -64 -21 15 53 105 120 110 101 38 24 -22 -56 -111 -101 -72 -61 6
2822 6 77 73 111 140 118 88 27 0 -62 -106 -99 -135 -73 -64 -13 78 77 101 94 118 84 57 3 -81 -86 -130 -147 -107 -28 -17 34 129 128 95
2856I5M6p1l5q1k8l0rj2M5J4P9L6N4MJ5Pn9o4l6o2L5n8mM7N3L9QO3J4RNm6o2l7
2890b6k4n7J1k7O0J8O8K5M6KK3o7pk1n4m4n8J7qM7J7J00K1N6J5n3nl1m8m8n3j2
2922a17KJ6L1Q0K0K4L2K5j1k1k9m3l6m6j3kK3J3L2P5K2O0K9l6n1j8o4j2o5j8k5
2953a23M4P7LL9L9K1j1L4l6n4l0l7n2om0N9K9K7P0M3k1L4K9q7lq6l6k3k6L6M1
2984d6pM5O0K5J9J4qm9j8l0o6J0n7QP2K1QK4R5k3J4n1J0k4p8l8l6J5J7K4K6M4
3016B0L9N0k5L0l2o0Km6l3n1j7QO0K8M0O0Ljpqk8l7k1n2rk9O4K6K3M9J9L6oQN
3051A08m7m9n6%k2m8M8J7N5K2K8M0J9l6k5o8Jk7n5k2j0L4M2M3L1M8mJ3J7o6l2
3082aj7l1k2k6K1rO2M9%O1k3M9o5J4n6j2k6j3l2L8rJ5N5J6J0M6j4oj4k8l0k7l8
$$ plain form
2856 95 141 70 35 -46 -74 -104 -113 -125 -80 -66 13 49 103 107 122 129 70 6 -30 -92 -57 -115 -119 -72 -19 20 28 91 105 114 119 73 11 -26
2890 -26 -50 -107 -96 -123 -63 -45 23 48 94 96 119 52 45 24 -30 -74 -132 -115 -123 -76 -59 41 62 118 133 80 75 44 -4 -52 -105 -117
2922 -117 -115 -99 -68 12 32 56 88 113 102 81 52 9 -27 -73 -86 -88 -65 -52 -20 55 77 137 166 130 79 61 -3 -15 -80 -98 -123
2953 -123 -79 -2 1 40 79 100 89 123 87 33 3 -34 -86 -92 -132 -73 -44 -17 53 96 75 109 138 51 48 -38 -74 -97 -123 -87 -46
2984 -46 -53 -8 52 77 96 110 102 53 35 5 -61 -51 -108 -100 -28 -7 1 25 120 97 111 60 70 46 -32 -70 -106 -91 -74 -50 -24 20
3016 20 59 109 84 114 82 22 24 -22 -55 -106 -123 -115 -55 -27 13 73 76 75 68 60 32 -5 -26 -78 -87 -116 -52 -26 -3 46 65 101 95 103 108
3051 108 61 12 -44 -44 -66 -114 -66 -49 6 28 56 96 115 79 54 -14 -13 -40 -95 -117 -127 -93 -51 -8 23 71 67 80 97 31 -1
3082 -1 -18 -49 -71 -97 -76 -85 -23 26 26 87 64 113 48 62 6 -6 -32 -45 -77 -39 -48 -33 22 38 48 94 80 74 60 32 2 -25 -63
3115f3j0L4j5L7K0L4oM7j3m2j2ml6l4%Pl1O0K0K7%M0L6l7j2k2k1j4m0k0l3M2J
3148f0M0L1L2K2j4L4rk6k4n0Nk9k9L1J6O0j4K6P3k5j2k1l4qn6Oj6RJ0J4L5J1J4
3181D2K3L7n4j1j0Np6k1j4j4L1L3QK3N3qM7m7j4Nj7m5kk4Ql1N0J2K6J0L6kl9Q
3215B8Kj2m8l6J3pM3%L6M2k4L4lj3rn3J0k7l4%nL1J0K1lO8J6j3j3nn3l6K1k6j3
3250e8ML5k3M5KK5M2k0oj2o1Pk8J0k4mM7K7j4K1K5K8J1m9K1m4k1m3jJ5kj4O8j
3284HK7L2k5K0n6J0j3m0j9J8j5OM4j0L2LK4jL2l2m4m4J5k9l4K2M0PK7J4J1M9j5
3317F4l9lJ1l0l3lk7KL1pJ7L6J6Lj5J6K2m4l4Ok6OpJK4K4L6k5K2OLk6k2Lj7m7
3353e6RK1lL8J7kM5k6J5qql4m3j5K0l5JL9J7%M4K6k8K0l6j7jpl4j8L0l1K4M6P
$$ plain form
3115 -63 -73 -39 -54 -17 3 37 31 78 65 23 11 7 -29 -63 -63 -56 -87 -27 -7 20 20 60 96 59 47 25 4 -10 -50 -70 -103 -61 -60
3148 -60 -20 11 43 65 51 85 76 50 26 -24 -19 -48 -77 -46 -30 30 16 42 115 90 78 57 23 15 -41 -35 -51 -42 -32 -18 17 28 42
3181 42 65 102 48 37 27 32 -44 -65 -79 -93 -62 -29 -21 2 55 47 94 47 33 38 21 -24 -26 -50 -42 -73 -23 -11 15 25 61 59 20 28
3215 28 30 18 -30 -66 -53 -60 -17 -17 19 61 37 71 68 55 46 -7 3 -24 -58 -58 -63 -32 -22 -1 -4 64 80 67 54 49 -4 -40 -19 -45 -58
3250 -58 -54 -19 -42 3 5 30 72 52 46 34 -27 -20 -48 -38 -62 -66 -19 8 -6 15 40 68 79 30 51 7 -14 -57 -58 -43 -45 -59 9 8
3284 8 35 67 42 62 6 16 3 -37 -56 -38 -53 -47 -3 -13 19 22 46 45 77 45 1 -43 -28 -57 -91 -69 -29 -22 5 19 30 79 64
3317 64 25 22 33 3 -30 -33 -60 -58 -27 -34 -17 19 35 38 23 39 61 17 -17 -11 -37 -31 -38 -37 -13 11 47 22 44 50 53 27 5 8 -9 -56
3353 -56 -47 -26 -29 9 26 24 69 43 58 50 42 8 -35 -50 -30 -65 -64 -25 -8 -8 36 62 34 54 18 1 0 -7 -41 -59 -29 -60 -36 10 17
3388A7K9J2j6K3pk6k4j7l3J7j8NjL8L5KJJ9Oj4m4lk6JK0p0L2J2M1PK3rMK1k5m4
3424a2Pj1l7L8k4Pk0O8j9K8K6j5J7l1nl0npLj8oK3L6L1j2j0N9n1l4L8m1k7Qj3
3458c9pJ7NL6%J7J8pk1M6l6j7k2%l9J0J1qK7L8J3L0l5j2j9rk9mRrjlRO6k2QM6
3495F7l3%jl4K4j9k1k1J1K8oj5L3K0J6J9n0j0Nk2j2nL9j4QLPnL1k9JK7j9l3pk3
3531d0J7nMK4L0k1OL6m3k4O0k0m4O%rj9rN2j5kM1L0k0pj2kJ3m2oL0l2L6k8%L9
3567B4j9qM7l4J0j9k6KKMJ0k8J0L3l9M7j7O2l3Lj5k8K3jj7nk6L1M0rK7m3J8Mk7
3602Cj4L2k9Mo1M2K5Ql8M8k0K8Njl6J2Nk8Nk5K3J5KRj1J1J6mMJ5k5j2ojm0RJ7
3639a3L7j4J6Nrk4J4rK6k6j2k6J2J2k2L1JRL1l7K8J1m2K6o3K3k2K4j2M5k6OM3
$$ plain form
3388 17 46 58 42 65 58 32 8 -9 -42 -25 -43 -38 -39 -1 34 36 37 56 62 48 4 1 -25 -24 -4 -74 -42 -30 11 18 41 32 36 57 32 -12
3424 -12 -5 -16 -53 -15 -39 -32 -52 16 -3 25 51 36 53 22 17 -13 -18 -25 -22 -40 -46 -23 13 44 32 22 81 30 -4 34 -7 -34 -26 -39
3458 -39 -46 -29 -24 12 12 29 47 40 19 65 29 12 -10 -10 -49 -39 -28 -36 -9 29 42 72 37 25 6 -3 -32 -36 -27 -36 -37 -40 -31 35 13 21 67
3495 67 34 34 33 -1 23 4 -17 -38 -27 1 -5 -20 13 33 49 68 18 8 13 -9 -21 -26 13 -1 7 10 17 12 43 14 15 42 23 -10 -17 -40
3531 -40 -23 -28 -24 0 30 9 15 51 8 -16 44 24 -20 -14 -14 -23 -42 -51 1 -14 -16 25 55 35 28 16 14 27 -15 -21 9 -23 13 -15 -15 24
3567 24 5 -3 44 10 20 1 -25 -23 -21 -17 -7 -35 -25 8 -31 16 -1 61 28 31 16 -12 11 10 -7 -12 -38 -7 33 24 51 8 26 30 3
3602 3 -11 21 -8 -4 -65 -23 2 10 -28 20 0 28 33 32 -4 8 13 -15 -10 -35 -12 3 5 14 3 14 30 26 30 45 20 8 2 1 -39 -30 -13
3639 -13 24 10 26 31 22 -2 12 3 29 3 -9 -35 -23 -11 -33 -2 -1 8 39 2 30 41 -1 25 -38 -15 -37 -13 -25 20 -6 0 43
3672D3k1L3k3OJ6l2m2%pJ8j2J8J6j6L5j7j7M0Nnn7K4J6m5K7j0pj4L9L5j9lK8k2
3706C0L2l2l7Ql0k1L6j7O1l4L9j4Ok7M4o0j2K5j1K5m6%N1j7jL4J6j9K4kk5J4n6
3739a6k5L5l1J7J8RoK2j8L4j3qJ8l0ok7jj9O7j8jJ2pk0N1k0km3K5kk9m1L8lJ3
3774b7J8K3lJ0J6m4M4m7J0j6%%mJ0MPRK5l1K3j1l4L8pJ0k8nj9K0J2J2lk1N0RL
3810E3n6K0Km6PJ0l4O5l3K6l0K9J9l9PJ2K5o1nj4L0k4PK2QL0k9K8k7L1%m1Mnj6
3845b5K2K1m5L8knJ6L4o1k6O4l3K5k4k2Ok5K2J1K0nrML5kkm0QMj1l6PJ4jM4n6
3881c5O4j5j7M5n1K9l2Pk3Rmm2P2j2Oj8K3J6LJ5m6j3J2j2kk0J2K1L6qPm5M9k5
3915Frok3N5n6L0l7M5j6K0%J3l4K0Kk7L6l8Nj3K1j1j2M5k5K4JQj3L9k5k7pmjn
$$ plain form
3672 43 22 55 32 38 54 22 -20 -20 -27 -9 -21 -3 13 -3 32 15 -2 38 43 38 -19 5 21 -24 3 -7 -14 -28 11 46 27 24 52 30
3706 30 62 30 -7 1 -29 -50 -14 -31 30 -4 35 21 27 0 44 -16 -28 -3 -14 11 -35 -35 16 -1 -2 32 48 29 53 51 26 40 -16
3739 -16 -41 -6 -37 -20 -2 7 1 23 5 39 26 18 36 6 0 -27 -28 -47 20 2 1 13 6 -14 37 17 15 -28 -3 -5 -34 -75 -37 -40 -27
3774 -27 -9 14 11 21 37 -7 37 -10 0 -16 -16 -16 -20 -10 -6 1 10 35 4 27 16 -18 20 13 23 -5 -10 -29 -9 3 15 12 -9 41 50 53
3810 53 -3 17 19 -27 -20 -10 -44 21 -12 14 -16 13 32 -7 0 12 37 -24 -29 -43 -13 -37 -30 -8 0 30 1 29 2 33 33 -8 -4 -9 -25
3845 -25 -3 18 -27 11 9 4 20 54 -7 -33 31 -2 23 -1 -23 -17 -42 -20 -9 11 6 -3 1 36 34 32 -8 0 4 -7 -43 -36 -22 -23 21 -35
3881 -35 29 14 -3 42 -9 20 -12 -5 -28 -19 -23 -65 7 -5 1 -17 6 22 25 40 -6 -19 -7 -19 -21 -41 -29 -8 28 20 27 -18 31 6
3915 6 -3 -9 -32 23 -33 -3 -40 5 -11 9 9 22 -12 8 10 -17 19 -19 -14 -27 -6 -17 -29 16 -9 15 16 24 11 50 25 -2 -9 -13 -14 -19
3951a9J7%RoJ3K9nj5J2pk7OLm2RN3n6L7km%L3j0j8Pk9mRk7K5JJ9nmQmK7lRl1m
3992Dpk3J3k2M0j6MJ2lK4m0L9k1JJm0L0orK8j0j7J9OOK1j4rJ0%Ll1J8j2l3J8K2
4029FKJnJ6j7J7oOk0J0m1J7J1j9L5pjK9ko4L3K0j7m7J2L6l0K8k%mL5kj6J4j4K
4066A6k5k6qPJ6Lj0M3k2J0j1J6OolmJ7l7Lj2NmN5k8K8k2K5l7J9oLMl1Pm5M6k5
4103c3O0j6Pj4Jmll1K7j6L5k5jPrl5O9k2L4k3J1kk6m0M9K1k0j4KJ8J4o1Q2j8k9
4138emK5OK0l9po%rk6O5j0L0k1k3K0l5j0K8Mj9mM0l0K1k0K0j2J5qK0j4l3mL3m0
4174c2K6Qj3K2QpJ8m4K6J6Nm1J1jk4j2L1MlK6Pj6K5j2J2m5PJ5j9MLj8J3Oj9J9
4210FJ3J1kk6mJ1J3l3Qj1j9N8rj8K5j7j3J9pJ8l6j8M9m3k8M5l6L9J2J8l7L4j0
$$ plain form
3951 -19 -2 -2 7 1 14 43 38 23 35 28 1 7 10 -32 -23 30 -26 11 9 5 5 38 28 10 17 -12 -16 -7 -34 -9 -8 11 6 2 10 6 33 30 39 8 4
3992 4 -3 -26 -13 -35 5 -11 -7 5 2 26 -14 25 4 5 6 -34 -4 -10 -19 9 -1 -18 1 7 13 34 20 11 21 21 24 -7 11 -1 -34 -16 6
4029 6 8 9 4 20 3 20 14 20 0 10 -31 -14 -3 -22 13 6 5 34 32 -32 1 21 4 -43 -31 5 -25 3 1 1 -3 32 30 14 28 14 16
4066 16 -9 -35 -43 -36 -20 -17 -27 16 -6 4 -7 9 15 9 6 2 19 -18 -15 -27 -22 -26 29 1 29 7 32 -5 14 8 11 15 -16 -9 -54 -8 -33
4103 -33 27 11 18 4 5 1 -2 -33 -6 -22 13 -12 -13 -6 -15 -50 19 -3 31 8 19 17 -9 -49 0 21 1 -13 -11 7 21 -40 42 24 -5
4138 -5 -9 16 22 42 3 -4 -10 -10 -19 -45 20 10 40 19 -4 16 -19 -29 -1 3 -16 -20 20 -10 11 -9 11 -1 14 6 26 12 -21 -25 8 -32
4174 -32 -6 2 -11 11 19 12 30 -14 12 28 33 -8 3 2 -22 -34 -3 1 -2 24 31 15 40 28 40 -5 2 17 -2 2 5 -13 0 6 -13 6
4210 6 19 30 28 2 -2 9 22 -11 -3 -14 -33 25 16 -2 23 6 -7 12 5 23 -13 -31 18 -25 -53 -8 -44 -5 7 25 -12 22 12
4243A2J8j0m9L3m2oM4j0knj1M9k5O1m7K6Ok2j0j3Qkj5OJL0J0nLn7P0k7Qm7j0J0
4279b0j8L0Qk5%K6l5M5klJ2l8J9Qm9L3K6j4jJ0NM2n4J9j6j1Jm8K0N7m0K2j1J9
4313A7j5jJ7l6L3k1J7mj8Nj1L2k8PJ0J5j7J3Rj5j1J9j9k6J1LLnJ6mK7n5K6K9k3
4348@mJ8l0K1m6N3l3K2j2K2K9k2K2m2J9n4L8J3l5k3J6L2K4k0j0rN7k4k0jL2j5
4380A8l8LK1Mm4K1lQOL3j1j6Rl8J8qL9n5J7J0j5K8J3l3M0k8lN0m7l0L1pk6L8p
4415bj1P0o6QK7j8k5L0l1J8l3M4l7J9L6m8K3J3j4J2rPj7l0M3J0k4ol3J4K6QjK
4449Ek2nN3l5j8MJ1k4jJ5J4j2l1M8jN1l4Lk2j5J9Rl2Pj4K6k1M1oKnK6k0j7M9m7
4485Al5J2KJ3K9n9N9k1L2j3j0j1j3R%J9k9J8k4K6jj4K8Lj5lKL1l9kj4j8L4qk1
$$ plain form
4243 12 30 20 -29 4 -38 -44 0 -10 -12 -17 -28 21 -4 57 10 36 42 20 10 -3 5 3 -12 -6 -5 25 35 30 33 -24 46 19 27 -20 -30 -20
4279 -20 -38 -8 0 -25 -25 1 -34 11 9 6 18 -20 -1 7 -42 -9 17 3 2 12 17 59 5 24 8 -3 -2 -50 -30 27 -13 9 -2 17
4313 17 2 1 18 -18 15 -6 11 7 -11 -6 -17 15 -13 -6 4 19 2 15 24 9 -2 17 -2 -28 -17 -14 -11 -16 0 -4 23 -32 -6 23 0
4348 0 -4 14 -16 5 -41 12 -21 1 -11 11 40 18 40 -2 17 -37 1 14 -21 -44 -28 4 28 8 -2 -11 46 22 2 1 33 18
4380 18 -20 -17 4 8 -36 -15 -18 -10 -4 29 18 2 11 -27 -9 -17 22 -33 -16 -6 -21 7 20 -13 27 -1 -4 46 -1 -31 0 -7 -33 5 -2
4415 -2 -13 57 -9 -1 26 8 -17 13 -18 0 -33 11 -26 -7 29 -19 4 17 3 15 6 13 -4 -34 9 19 -5 -11 -44 -30 -4 4 3 5
4449 5 -17 -22 31 -4 -22 -18 -7 -31 -32 -17 -3 -15 -46 2 1 52 18 21 -1 -16 3 12 -20 -13 -27 -1 -22 19 13 15 10 36 16 -1 48 1
4485 1 -34 -22 -20 -7 22 -37 22 1 33 20 10 -1 -14 -5 -5 14 -15 3 -21 5 4 -10 18 21 6 3 5 36 -3 -5 -19 -37 -3 -11 -32
4520c2J4J6qRPL6j7j7%Qj3j8Qk0K9j5M1J1k9PJ1j8J4Lkj6oOj4kJ2OKJ1l3oOQQ
4559Gl6j7J7jL3Pl7K5L0j5pOnk1NLJ2k2j0K3lM1jk9k8O0o8L2M6n3NlJ5j7rK5j4
4596dJ1l3M9j7KL1l0j3J9m1J2%lL4l3M4Mj8L8k2m3K6m4L6j3KLrkL1LJ4k7Ommk0
4633a5LK3JK0k5rnK8L9p2L7l8OJ9pJmKnJ7qJ8l9J0lL2j3J4J3l9J3l2k4L9K4j6
4669EjlJ8m4O9k3KoNj9j0oJ6n6L5K5J9j3k5L5m3J5J7k2lOj7J0NK0k5J5K8m6NJ3
4705Aj8J1kJ7j9J9j2Ol1L2%j8K4J1%j4L1o1K8k2KLPMmnPK3j1l6PJ9m1N2k2j0N
4742a7pM2j4J1jJjJ6k9J6j2l0OJ8j9K0jJ5k5N1k0Qkoj0K9n3L9%l1Kl2L9j5MK2
4778A4RKlkl1j5qN0j2noJ9rJ8j4J6Jk7m2O0l2J7K0n6QK2k2M0l4K8K7l7j0K6j2
$$ plain form
4520 -32 -18 -2 -10 -1 6 42 25 8 8 16 3 -15 -7 -27 2 -13 28 39 10 17 28 10 24 27 25 9 3 9 -5 -7 5 11 13 24 -9 -15 -9 -1 7
4559 7 -29 -46 -29 -30 3 10 -27 -2 28 13 6 12 7 -14 -9 -6 6 -16 -26 -3 -6 35 34 5 -23 37 -31 1 47 -6 -1 -4 11 -6 -15 10 -4
4596 -4 7 -26 23 6 8 39 9 -4 15 -26 -14 -14 -17 17 -16 28 32 14 52 30 -13 13 -31 5 -8 -6 -3 -12 -14 17 20 34 7 13 9 5 -15
4633 -15 -12 11 12 32 7 -2 -7 21 60 -12 25 -13 -7 12 5 6 2 4 -1 16 8 26 -13 -3 -6 26 13 27 40 1 14 -18 -42 -3 21 5
4669 5 4 1 19 -25 44 21 23 17 22 3 -7 -13 3 -53 -18 7 26 13 -12 23 -20 -5 12 -10 -13 -7 -24 -14 -9 11 -14 1 29 -17 -12 1
4705 1 -17 -6 -8 9 -10 9 -3 3 -28 4 4 -14 10 21 21 7 38 -23 5 -17 -15 -12 -5 -1 -5 -10 -3 20 9 -27 -20 -1 -42 10 -12 -22 -17
4742 -17 -24 18 4 15 14 15 14 30 1 17 5 -25 -19 -1 -20 0 -1 14 -11 40 20 28 26 20 10 39 -14 25 25 -6 -4 -36 3 -12 -8 14
4778 14 23 25 22 20 -11 -26 -34 16 4 -1 -7 12 3 21 7 23 24 -3 -45 15 -17 0 20 -36 -28 -6 -28 12 -22 6 33 -4 -14 12 0
4813@J8j8n3O9k5L5l3J7l7K1K1RJ7m9J4J9m7RJ4J7rnj2pK1K6n0K6qoNl3M0k9K8
4848EM6l8mJj0J8nnj9L6k4j1k5J3N1n7L8k1K9j1lJ2j3rnj2L9l0K9qj5pM8j4J9
4883C8k7j7M4l5J5l1K6j7kk4QL6j7J5kJ9qm6M3pk2K7j4JJ9oj2K8rl6Q4o6rJ9m6
4918c1J1jJ9k2%J6j3M2kj4Jmj4K1j4J2Lm0M3J6m2K3jl3L4OKrjQj9K2l4L7m4oQ4
4955E6p2J6k0J5K9k8%J9j9j5J5k7K9j1%J6J5l4K4k0J8j9nk5K0J4l3M3L2Kk9J2
4987A8qK9l0k2K0L5m0nj2M6n8K7N1n2RJ5k4J5Lk4L0m9%L0j6K5rQkJj5NJj4k0J0
5023b2J4K4j7oJ3qK7rJ4l1lj6pRK8j7J9n6K8K2k6K1pjK5K9m4mkJ2j0Rom2K7Qm
5060iKJ4j8j7K2OLj3KJ4K3k3K4m9L0k5NNJj3JJ5Pm6J3J2k8L9LpJ8Jk8M8l0J8l6
$$ plain form
4813 0 18 0 -53 16 -9 26 -7 10 -27 -6 15 24 41 -8 6 25 -22 -13 1 18 9 4 -8 -15 6 32 -18 8 0 -6 -1 -34 6 -23 5
4848 5 51 13 9 10 0 18 13 8 -11 25 1 -10 -35 -22 29 -28 10 -11 18 7 4 16 3 -6 -11 -23 16 -14 15 7 -8 -15 33 19 38
4883 38 11 -6 38 3 18 -13 13 -4 -6 -30 -22 14 -3 12 10 29 21 -25 18 11 -11 16 2 3 22 16 4 32 23 -13 71 5 -4 15 -31
4918 -31 -20 -21 -2 -24 -24 -8 -21 21 19 5 6 2 -12 9 -5 7 10 -30 13 29 -13 10 9 -24 10 16 18 9 8 16 -3 19 -15 22 -22 -28 56
4955 56 -16 0 -20 -5 24 -4 -4 15 -4 -19 -4 -31 -2 -13 -13 3 18 -16 8 -12 6 -13 -18 -43 -23 -9 -42 1 33 35 6 18
4987 18 10 39 9 -13 7 42 2 -3 -15 31 -27 0 51 -1 8 23 -1 14 17 -7 23 -26 -26 4 -12 13 4 12 10 11 -4 1 2 -12 -32 -22
5023 -22 -8 16 -1 -7 6 -2 25 16 30 -1 -4 -20 -27 -18 10 -7 12 -44 -16 6 -20 1 -6 -7 18 47 3 -1 -3 9 -1 8 2 -40 -13 -5 -9
5060 -9 -7 7 -11 -28 -6 0 3 -10 -8 6 29 6 30 -19 11 -14 -9 -4 -3 -16 -15 0 7 -39 -26 -14 -42 -3 0 -7 11 12 -16 32 2 20 -16
5097a6PkQQm2K5J1QJ1j6KLQkJ2k9pPjk1RK7oJ3J3j0lKj2k1lJ5lNJ4K1k7Ok4J6
5137FJ3j8j5L1l8Jj1L0l2M5j7j8J9L1j2j1Lm8K9K7pk0K7l3M9m8K2J1Rj3j1K6m7
5170b0jK4J0k3Jk4L3K1j6J0j8J0Jjj9L1k6j5J1J1j2l1M6pLJ8l0L8m0%QK9l6K1
5204GL2n7K0rMnQLk7K1k4J0J3rKk4K0K6k9J9jMJ9l8J0Nj0mL3n0J8K4j0KJ1lK2
5241C3m1MomlJ0L9m4J3L5l3Jj8L9m7K5l0L5o4K0MM2k8l%M1k6rRK2Mk8%J0l2M2
5277A2k6OL2l9J9nNOpJ1KjKk4J5l6J3jLJL1j2Mk2L4k7pM0m6qJ1j6L6KK6j7J3k9
5315AjJ2j7P%m6J3L3k8J8k0L5kJ1J8j0mm4J5j9L1l3J9NJ8j5M2k2j8J0kK6l9L0
5349B4j6jJ7Lm1L4J7l7lQj5L0m6L4K3l8j4K7qlkKK5J0l5j2M2m3J4j7OJ1l4mN4
$$ plain form
5097 -16 -9 -11 -3 5 -37 -12 -1 7 18 2 4 7 15 13 25 -4 -11 -4 -5 -26 -17 10 4 17 30 20 17 19 7 -14 -17 -2 -5 0 14 35 8 14 -10 6
5137 6 19 1 -14 17 -21 -20 -31 -1 -33 12 -5 -23 -4 27 15 4 7 -41 -12 15 8 -12 15 -18 31 -17 5 16 25 12 1 27 -20
5170 -20 -21 3 13 -10 -9 -33 0 21 5 15 -3 7 8 7 -12 19 -7 -22 -11 0 -12 -43 3 -4 -1 17 -13 25 -15 -15 -7 22 -14 7
5204 7 39 -18 2 -7 -3 -8 0 3 -24 -3 -27 -17 -4 -13 -11 -35 -15 11 -18 1 0 4 23 -15 -5 0 -10 -14 19 -31 -13 11 1 3 14 11 33
5241 33 -8 -4 -10 -14 -17 -7 32 -12 1 36 3 4 -14 25 -22 3 -27 8 -56 -36 -32 10 -18 -21 -21 20 -6 -15 -6 16 20 -8 -8 2 -30 12
5277 12 -14 -8 24 -15 4 -1 4 10 3 14 16 15 17 -7 8 -28 -15 -16 -13 -12 19 7 11 -11 23 -4 -11 29 -17 -25 -14 -30 6 8 34 17 30 1
5315 1 0 12 -5 2 2 -44 -31 2 -26 -8 -28 7 5 16 34 24 20 -24 -9 -28 3 -30 -11 -6 12 -3 39 17 -1 9 7 33 -6 24
5349 24 8 7 24 27 -14 20 37 0 -3 5 -10 20 -26 8 31 -7 -21 6 -2 -5 -7 -5 20 30 -5 -17 25 -18 -4 -21 -15 -4 -38 -42 12
5384A2k8K7Jj7LK8J3n4M7m5K0rK4j0m1J3L2l6J3J6OK3m4L2l7k2J3LK4j4M0l4K2
5417B1nj9J9%k1j4lj2nK7PMK4rK2m8L2k0K4l2j4L7ml3K0J2mNJ2l2J0PKj3j4K1
5453DMj7oQK9l3J9Kk5NM0j6Ol6J3LK1nrj8mJ1N2n4K8J6l5nJ8mmJnJ3k5L1j7k0
5491a4J6k6M5j7jqknj1rJ8M0k4M1k1l1LN3m8j4L2j0j4L0m1RK2l6M4j3lj6J2k2
5525b1L4k9qL3j4k2M6pj2Kk3N4j8j7Kl6K1k5L2J8Lj3j6L3l6J5J7%k7P0n1nj3K6
5559A3JJ4k9J6J3Pm8K4ljJj2J3PKj8mL2m0K4J6moom4K8K9l4OQl1J8k2L0K3l2J0
5596Aj2L6k6k4M2om7K8Nm8L0L3rLomqOOk3LPj5M8kj2k8M1k0J4Mj5NMJ8j6%Rkk2
5636bK7Pn3O0j0j0l1M5k0mJ0l4lK7K1k1j%j0J4m0M5K1n9K6k8K0l7K9lL4j2m7M9
$$ plain form
5384 12 -16 11 12 -5 -2 26 39 -15 32 -13 7 -2 22 12 -29 -16 16 -20 -7 9 15 38 -6 26 -11 -33 -20 -17 7 -7 33 -1 21
5417 21 16 -3 16 16 -5 -19 -22 -34 -39 -12 -5 -1 23 14 36 -12 20 0 24 -8 -22 15 11 -22 -2 10 6 11 23 -9 1 8 10 -3 -17 4
5453 4 8 -9 -15 -7 22 -11 8 10 -15 -10 30 14 20 -16 -3 0 21 16 7 -11 -15 -4 48 -6 22 38 3 -2 16 12 8 9 4 17 -8 23 6 -14
5491 -14 2 -24 21 4 3 -5 -7 -12 -23 -32 -14 26 2 43 22 -9 -6 47 -1 -15 17 7 -7 23 -18 -9 13 -23 21 8 5 -11 1 -21
5525 -21 13 -16 -24 9 -5 -27 19 12 0 2 -21 33 15 -2 0 -36 -15 -40 -8 10 13 0 -16 17 -19 -4 13 13 -14 56 5 0 -13 13
5559 13 14 28 -1 15 28 35 -13 11 8 7 8 -4 9 16 18 0 -4 28 -12 12 28 24 18 12 -32 -4 25 -9 -3 5 -26 -8 -30 0 23 -9 1
5596 1 -11 25 -1 -25 17 11 -36 -8 -3 -51 -21 12 3 6 0 -4 -12 -6 0 -23 -20 -13 -28 20 18 6 -22 19 -1 13 17 2 7 11 29 13 13 22 20 -2
5636 -2 25 32 -21 39 29 19 -12 33 13 9 19 -15 -18 9 30 9 8 8 -2 12 -28 17 38 -21 5 -23 -3 -40 -11 -14 20 8 -39 10
5670A0j3OJ8kqj4j1K4K4k4j2j5PMk0L6LPj8J1j2Jj4%J5J6j9KJ4k8M8m9J8k9M2
5705A8j9j1J4J1k6L8m2L9n%k0j7K4j3oK9j8Jj5jJ3MK1Rl9J6Jk4L4Lj7j3KJ3RK8
$$ plain form
5670 10 -3 3 21 19 11 -3 -14 10 34 10 -2 -17 -10 -6 -26 10 13 20 2 13 1 2 -12 -12 3 19 0 2 16 -12 36 -13 5 -24 18
5705 18 -1 -12 2 13 -13 25 -17 22 17 17 -3 -20 4 -9 -15 14 -4 -3 -18 -19 -6 -2 19 28 -11 5 6 -18 16 19 2 -11 -9 4 13 41
$$ [...]
8191A3
##END NTUPLES=NMR FID
##END=
