##TITLE=1H_LR-793-O-C2-K
 DMSO-d6
 8 sc, 
 25.12.2024
##JCAMPDX= 6.0         $$ Bruker NMR JCAMP-DX V2.0
##DATA TYPE= NMR FID
##DATA CLASS= NTUPLES
##ORIGIN= UXNMR, Bruker Analytische Messtechnik GmbH
##OWNER= root
$$ XWIN-NMR		Version 3.5
$$ Wed Dec 25 13:05:50 2024 Russian Standard Time (UT+4h)  she@DPX200
##.OBSERVE FREQUENCY= 200.1315
##.OBSERVE NUCLEUS= ^1H
##.DELAY= (6, 6)
##.ACQUISITION MODE= SIMULTANEOUS
##.ACQUISITION SCHEME= undefined
##.AVERAGES= 8
##.DIGITISER RES= 18
##SPECTROMETER/DATA SYSTEM= spect
##.PULSE SEQUENCE= zg30
##.SOLVENT NAME= CDCl3
##.SHIFT REFERENCE= (INTERNAL, CDCl3, 0, 15.7039)
##AUDIT TRAIL= $$ (NUMBER, WHEN, WHO, WHERE, WHAT)
$$ ##TITLE= Audit trail, XWIN-NMR		Version 3.5
$$ ##JCAMPDX= 5.01
$$ ##ORIGIN= Bruker BioSpin GmbH
$$ ##OWNER= she
$$ F:/spectra/data/she/nmr/H-F/1/audita.txt
$$ ##AUDIT TRAIL=  $$ (NUMBER, WHEN, WHO, WHERE, WHAT)
(   1,<2024-12-25 12:58:35.96 +0400>,<she>,<DPX200>,
      <created by zg, POWCHK disabled, PULCHK disabled
       configuration hash MD5:
       00 E9 B6 7A A2 85 ED C7 34 08 36 98 17 FE 4E 26
       data hash MD5: 16K
       71 6A 30 AD C5 C0 06 CE 08 45 9A 99 FA 97 95 83>)
$$ ##END=
$$ 
$$ hash MD5
$$ 59 FC A2 E9 24 8A 99 26 FF 2E 7C 94 6B 24 12 2F
##$RELAX= 
##$RELAX= 
##$RELAX= 
##$RELAX= 
##$RELAX= 
##$RELAX= 
$$ Bruker specific parameters
$$ --------------------------
##$DU= <F:/spectra>
##$EXPNO= 1
##$NAME= <H-F>
##$PROCNO= 1
##$TYPE= <nmr>
##$USER= <she>
##$AMP= (0..31)
100 100 100 100 100 100 100 100 100 100 100 100 100 100 100 100 100 100 
100 100 100 100 100 100 100 100 100 100 100 100 100 100 
##$AQSEQ= 0
##$AQ_mod= 1
##$AUNM= <au_zg>
##$AUTOPOS= <>
##$BF1= 200.13
##$BF2= 200.13
##$BF3= 200.13
##$BF4= 200.13
##$BF5= 200.13
##$BF6= 200.13
##$BF7= 200.13
##$BF8= 200.13
##$BYTORDA= 1
##$CFDGTYP= 0
##$CFRGTYP= 5
##$CHEMSTR= <none>
##$CNST= (0..31)
1 1 145 1 1 1 1 1 1 1 1 1 1 1 1 1 1 1 1 1 1 1 1 1 1 1 1 1 1 1 1 1 
##$CPDPRG= <>
##$CPDPRG1= <>
##$CPDPRG2= <>
##$CPDPRG3= <>
##$CPDPRG4= <mlev>
##$CPDPRG5= <mlev>
##$CPDPRG6= <mlev>
##$CPDPRG7= <mlev>
##$CPDPRG8= <mlev>
##$CPDPRGB= <>
##$CPDPRGT= <>
##$D= (0..31)
0 1.2 0 0 0 0 0 0 0 0.06 0 0.03 0 0 0 0 0.0002 0 0 0 0 0 0 0 0 0 0 0 0 
0 0 0 
##$DATE= 1735117115
##$DBL= (0..7)
120 120 120 120 120 120 120 120 
##$DBP= (0..7)
150 150 150 150 150 150 150 150 
##$DBP07= 0
##$DBPNAM0= <>
##$DBPNAM1= <>
##$DBPNAM2= <>
##$DBPNAM3= <>
##$DBPNAM4= <>
##$DBPNAM5= <>
##$DBPNAM6= <>
##$DBPNAM7= <>
##$DBPOAL= (0..7)
0.5 0.5 0.5 0.5 0.5 0.5 0.5 0.5 
##$DBPOFFS= (0..7)
0 0 0 0 0 0 0 0 
##$DE= 6
##$DECBNUC= <off>
##$DECIM= 24
##$DECNUC= <off>
##$DECSTAT= 4
##$DIGMOD= 1
##$DIGTYP= 9
##$DL= (0..7)
0 120 120 120 120 120 120 120 
##$DP= (0..7)
150 150 150 150 150 150 150 150 
##$DP07= 0
##$DPNAME0= <>
##$DPNAME1= <>
##$DPNAME2= <>
##$DPNAME3= <>
##$DPNAME4= <>
##$DPNAME5= <>
##$DPNAME6= <>
##$DPNAME7= <>
##$DPOAL= (0..7)
0.5 0.5 0.5 0.5 0.5 0.5 0.5 0.5 
##$DPOFFS= (0..7)
0 0 0 0 0 0 0 0 
##$DQDMODE= 0
##$DR= 18
##$DS= 0
##$DSLIST= <SSSSSSSSSSSSSSS>
$$ [...]
##$SUBNAM2= <"">
##$SUBNAM3= <"">
##$SUBNAM4= <"">
##$SUBNAM5= <"">
##$SUBNAM6= <"">
##$SUBNAM7= <"">
##$SUBNAM8= <"">
##$SUBNAM9= <"">
##$SW= 24.0689530833862
##$SWIBOX= (0..15)
0 0 2 0 0 0 0 0 0 0 0 0 0 0 0 0 
##$SW_h= 4816.95568400771
##$TD= 16384
##$TD0= 1
##$TE= 0
##$TE2= 300
##$TE3= 300
##$TEG= 300
##$TL= (0..7)
0 120 120 120 120 120 120 120 
##$TP= (0..7)
150 150 150 150 150 150 150 150 
##$TP07= 0
##$TPNAME0= <>
##$TPNAME1= <>
##$TPNAME2= <>
##$TPNAME3= <>
##$TPNAME4= <>
##$TPNAME5= <>
##$TPNAME6= <>
##$TPNAME7= <>
##$TPOAL= (0..7)
0.5 0.5 0.5 0.5 0.5 0.5 0.5 0.5 
##$TPOFFS= (0..7)
0 0 0 0 0 0 0 0 
##$TUNHIN= 0
##$TUNHOUT= 0
##$TUNXOUT= 0
##$USERA1= <user>
##$USERA2= <user>
##$USERA3= <user>
##$USERA4= <user>
##$USERA5= <user>
##$V9= 5
##$VALIST= <valist>
##$VCLIST= <CCCCCCCCCCCCCCC>
##$VD= 0
##$VDLIST= <DDDDDDDDDDDDDDD>
##$VPLIST= <PPPPPPPPPPPPPPP>
##$VTLIST= <TTTTTTTTTTTTTTT>
##$WBST= 1024
##$WBSW= 4
##$XGAIN= (0..3)
0 0 0 0 
##$XL= 0
##$YL= 0
##$YMAX_a= 321718
##$YMIN_a= -303631
##$ZGOPTNS= <>
##$ZL1= 120
##$ZL2= 120
##$ZL3= 120
##$ZL4= 120
##$ABSF1= 10
##$ABSF2= 0
##$ABSG= 5
##$ABSL= 3
##$ALPHA= 0
##$AQORDER= 0
##$ASSFAC= 0
##$ASSFACI= 0
##$ASSFACX= 0
##$ASSWID= 0
##$AUNMP= <proc_1d>
##$AZFE= 0.1
##$AZFW= 0.1
##$BCFW= 1
##$BC_mod= 2
##$BYTORDP= 1
##$COROFFS= 0
##$CY= 11.3945322036743
##$DATMOD= 1
##$DC= 2
##$DFILT= <>
##$DTYPP= 0
##$F1P= 15.6554695791079
##$F2P= 12.8336369535428
##$FCOR= 0.5
##$FTSIZE= 0
##$FT_mod= 4
##$GAMMA= 1
##$GB= 0.15
##$INTBC= 1
##$INTSCL= 1
##$ISEN= 128
##$LB= 0.24
##$LEV0= 0
##$LPBIN= 0
##$MAXI= 10000
##$MC2= 0
##$MEAN= 0
##$ME_mod= 0
##$MI= 1.114404
##$NCOEF= 0
##$NC_proc= 0
##$NLEV= 6
##$NOISF1= 3.799351
##$NOISF2= 2.8
##$NSP= 1
##$NTH_PI= 0
##$NZP= 0
##$OFFSET= 15.70392
##$PC= 1
##$PHC0= -26734.56
##$PHC1= 13.78744
##$PH_mod= 1
##$PKNL= yes
##$PPARMOD= 0
##$PSCAL= 0
##$PSIGN= 0
##$REVERSE= no
##$SF= 200.130013532006
##$SI= 16384
##$SIGF1= 3
##$SIGF2= 2
##$SINO= 400
##$SIOLD= 16384
##$SREGLST= <1H.CDCl3>
##$SSB= 0
##$STSI= 0
##$STSR= 0
##$SW_p= 3612.71676300578
##$SYMM= 0
##$S_DEV= 0
##$TDeff= 0
##$TDoff= 0
##$TI= <>
##$TILT= no
##$TM1= 0
##$TM2= 0
##$TOPLEV= 0
##$USERP1= <user>
##$USERP2= <user>
##$USERP3= <user>
##$USERP4= <user>
##$USERP5= <user>
##$WDW= 1
##$XDIM= 8192
##$YMAX_p= 0
##$YMIN_p= 0
$$ End of Bruker specific parameters
$$ ---------------------------------
##NTUPLES= NMR FID
##VAR_NAME=  TIME,          FID/REAL,        FID/IMAG
##SYMBOL=    X,             R,               I
##VAR_TYPE=  INDEPENDENT,   DEPENDENT,       DEPENDENT
##VAR_FORM=  AFFN,          ASDF,            ASDF
##VAR_DIM=   8192,          8192,            8192
##UNITS=     SECONDS,       ARBITRARY UNITS, ARBITRARY UNITS
##FACTOR=    0.0002076,     1,               1
##FIRST=     0,             0,               0
##LAST=      1.7004516,     0,               0
##MIN=       0,             -303631,         0
##MAX=       1.7004516,     321718,          0
$$ Real data points
##PAGE= N=1
##DATA TABLE= (X++(R..R)), XYDATA
$$ [...]
749b982o675J677Q507P769M79p030q450l001N317R123M794l723q545o025J204
$$ -2982 -9657 -7980 527 8296 8775 1745 -6705 -9706 -4389 4734 9528 5805 -2740 -8765 -7561
764g561P530P672R61o540q250k842M746Q297M848k686q294o400J099P278P126
$$ -7561 -31 7641 8602 2062 -6188 -9030 -4284 4013 8861 6175 -2119 -8519 -7420 -142 6984
779F984J197n793p986l119M391Q075M499k454p287o135K91O733P204J318n439
$$ 6984 8181 2388 -5598 -8717 -4326 3749 8248 5794 -1493 -7628 -7337 -604 6600 7918 2479
794B479p416l178L678P552M886k151p141n818L45N988O599J785m828p277l261
$$ 2479 -4937 -8115 -4437 3115 8001 5850 -1291 -7109 -6764 -776 5823 7608 2780 -4497 -7758
809g758L552O976M587j540o499n982j41N953O415J600m285o619l451K860O838
$$ -7758 -4206 2770 7357 5817 -682 -6664 -6805 -852 5563 7163 2878 -3741 -7192 -4332 2506
824B506M549j608n896n458m47M921O491K014m195o488l091K490O085M559q32n810
$$ 2506 7055 5447 -449 -5907 -6354 -1433 5058 7072 2877 -3611 -6702 -4212 1873 6432 5600 -210
840b10n483l16M736N662K043l284o223l460K357N881M288p30n097n273r33M436
$$ -210 -5693 -6009 -1273 4389 6432 3148 -3075 -6535 -4178 1703 5991 5261 164 -5109 -6042 -1606
856a606N918J881l284n566l283J703N419M522n16n037m948p09L727N443K304k882
$$ -1606 4312 6193 2909 -2657 -5940 -4237 1182 5704 5188 151 -4797 -5506 -1779 3664 5968 3086
872C086n624l315J808N061M078r2m492n033r98L815N100K005k379n043l404J305
$$ 3086 -2538 -5853 -4045 1016 5094 5002 510 -4523 -5521 -1706 3394 5399 3020 -2023 -5427 -4122
888d122M924M079j67m130m659j195L192N134K288k425m900l037J167M137M134
$$ -4122 802 4881 4714 584 -4075 -5270 -2078 3056 5344 2919 -1981 -5018 -3851 286 4420
903D420K08l935m598r76K977M498K340j850m710l359J100M273L753J80l379m315
$$ 4420 4628 693 -3905 -4881 -1904 2594 4934 3084 -1626 -4985 -3885 388 4141 4321 942 -3373
919c373j417K703M596K157j793m137l114N46L943L881K86l388m064j221K217M257
$$ -3373 -4790 -2087 2509 4666 2873 -1264 -4378 -3832 111 3992 4278 890 -3174 -4395 -2178 2079
935B079K452j480m178l026N73L495L566O61k862m125j521K274M006K333j246l860
$$ 2079 4531 3051 -1127 -4153 -3580 -85 3481 4142 1280 -2845 -4366 -2092 1914 4247 3001 -859
951h59l153L71L485L600M87k719l724j597J878L934K365j111l587k907M2L159
$$ -859 -4012 -3641 -156 3444 3931 1212 -2512 -4109 -2231 1703 4068 2957 -630 -3537 -3495 -336
967c36L443Q70k606l731j624J906L574K335p87l418l071J10K893L258R31k240
$$ -336 3107 3977 1371 -2360 -3984 -2078 1496 3831 3044 -374 -3445 -3335 -442 2816 3747 1507
983A507l446j885J628L470K465q57l059k953k25K716L395R26k282l175j745J254
$$ 1507 -1939 -3824 -2196 1274 3739 2882 -177 -3130 -3355 -639 2756 3682 1400 -1775 -3520 -2266
999b266L296K464n98l037k826k08K422L186J074j922l324j726J230L146K324m68
$$ -2266 1030 3494 2896 -141 -2967 -3175 -753 2433 3507 1585 -1739 -3465 -2235 911 3235 2767
1015B767k794k761l87K469K947R54j606l094j749R61L011K400l89k707k645m78
$$ 2767 -27 -2788 -3175 -706 2241 3195 1589 -1505 -3254 -2293 718 3118 2729 22 -2623 -3101
1031c101K205L008J093j577l007j772R81K715K297j96k469k652n66K079K744J241
$$ -3101 -896 2112 3205 1628 -1379 -3151 -2170 545 2842 2646 177 -2475 -3041 -962 1782 3023
1047C023j434k851j859Q69K798K180j26k328k611o39J899K809J244j388k642j768
$$ 3023 1589 -1262 -3121 -2252 546 2726 2600 272 -2339 -2978 -1079 1730 2974 1586 -1056 -2824
1063b824O10K451K277j8k188k531o74J849K612J242j141k625j754N24K366K169
$$ -2824 -2214 237 2514 2496 308 -2223 -2897 -1048 1564 2806 1665 -960 -2714 -2190 176 2345
1079B345J65k044k426q22J617K586J266r23k476j899M49K302K162J45j934k324
$$ 2345 2510 466 -1960 -2782 -1165 1421 2687 1764 -712 -2611 -2162 140 2302 2447 513 -1811
1095a811p72J441K390J346r51k266j740L12K090K143K41j761k338q55J342K303
$$ -1811 -2583 -1142 1248 2594 1643 -623 -2363 -2051 39 2182 2423 662 -1676 -2531 -1189 1114
1111A114J402p60k237j781J84J991K066L62j561k243r31J187K282J292o55k068
$$ 1114 2516 1756 -481 -2262 -2078 -87 1979 2341 780 -1463 -2394 -1207 1075 2367 1712 -356
1127c56j782J22J889K051L51j560k091q94J061K093J356n47j959j816J13J732
$$ -356 -2138 -2016 -127 1924 2275 715 -1376 -2270 -1209 884 2240 1693 -266 -2082 -1969 -237
1143b37J967N02j360k156r42J054K017J324m87j922j653J2J590J903M88j237j948
$$ -237 1730 2232 872 -1284 -2226 -1172 845 2169 1682 -240 -1893 -1881 -291 1612 2100 863 -1085
1160a085j018Q20J950J352l16j892j584j77J587J849N30j213j829j030P68J798
$$ -1085 -2103 -1283 667 2019 1703 -189 -1773 -1950 -363 1486 2016 803 -1026 -2056 -1288 510
1176E10J369k05j718j704q6J351J869N54j031j960j055Q13J792J294l31j482j616
$$ 510 1879 1674 -44 -1748 -1834 -483 1386 1940 909 -1051 -2106 -1293 499 1793 1462 -20 -1636
1193a636k18J311J780N71q78j793j063N90J688J344j43j557j499k63J308J630
$$ -1636 -1854 -543 1237 1808 930 -863 -1926 -1336 352 1696 1553 -4 -1503 -1766 -458 1172
1209A172N67q96j532j082M71J613J270r0j441j475k91J161J629O49q09j706r39
$$ 1172 1739 843 -689 -1771 -1300 313 1583 1493 52 -1423 -1714 -553 1076 1725 916 -790 -1729
1226a729M47J558J296j32j347j415l39J025J534P30p01j529j017L60J471J251
$$ -1729 -1282 276 1572 1440 93 -1322 -1661 -636 898 1628 927 -602 -1619 -1259 212 1463
1242A463k3j186j431m47J024J512P04o85j447r74K89J249J361M1j153j384l79
$$ 1463 1440 254 -1177 -1624 -600 912 1616 931 -516 -1490 -1201 48 1409 1450 297 -1087 -1466
1259a466Q37J448P55o22j465r19K32J313J146J62j086j340l91P21J458O80m74
$$ -1466 -629 819 1574 952 -513 -1432 -1200 113 1259 1421 335 -1005 -1396 -675 783 1463 989
1276I89j306j083K36J213J252P0j045j319l54P33J249P80n77j174r07J08J076
$$ 989 -317 -1400 -1164 49 1301 1371 326 -993 -1347 -614 635 1415 838 -336 -1243 -1135 -59
1293e9J200K00r55j251m97P13J298O77l83j181r68J10J047J125J79q52j178n45
$$ -59 1141 1341 386 -865 -1362 -649 649 1326 943 -238 -1206 -1096 -49 1076 1255 403 -775 -1320
1311a320O90J127P92l00j143j034J7J034J150K10q72j076m75N19J100Q12l19j048
$$ -1320 -630 497 1289 989 -154 -1188 -1171 -137 1013 1223 351 -725 -1200 -681 419 1231 912 -136
1329a36r76J3R67R80L18p19j054o49N59J093P14k33j024q95o2R59R67K73p22r55
$$ -136 -1112 -1099 -132 848 1166 447 -607 -1256 -697 396 1110 877 -147 -1042 -1104 -145 822 1095 373 -582
1349e82n32L80R80Q52k24q86r96k8Q11R70L90p01j036n49M83R86P02j76r37q50
$$ -582 -1114 -734 246 1098 874 -12 -1008 -1036 -225 745 1135 434 -602 -1151 -668 318 1020 844 -93 -943
1369i43j5P31J002L09n77j049n32L46J012O78q0q18r36K3O08R88K40n11q77o36
$$ -943 -958 -227 775 1084 507 -542 -1074 -728 284 962 882 64 -872 -849 -241 747 987 476 -401 -1037
1389a037L61Q84P08p3p83q59j41O56Q61L44m60r03n44L07Q62O18j0o90q36j61
$$ -1037 -676 208 916 843 60 -799 -940 -284 577 921 461 -442 -986 -679 183 801 791 101 -735 -896
1409h96N93Q87L60m32q77n54K72Q50O35p3p23o86j88N50Q21L47l84p75n19J35
$$ -896 -303 584 944 512 -365 -919 -647 203 838 765 42 -644 -832 -282 539 886 502 -273 -792 -657
1429f57P16P83J2p48p20j74M99P99L69l32q25m83J21P61N59N9n43q19j73N19P47
$$ -657 59 842 854 106 -614 -788 -289 510 879 547 -278 -761 -640 121 680 739 196 -623 -796 -277 470
1450D70L22k82p41n36N2P33O91J5o04o27j77L52P16L40j89p16n63J22O09O01K01
$$ 470 792 510 -231 -767 -715 18 709 724 120 -507 -684 -332 384 724 535 -181 -744 -622 -13 588 789
1471G89n39p64k41M59P22L25k26p07n13J6N88O75J16m48o48l80L91P03M40k62
$$ 789 250 -514 -755 -296 426 751 525 -182 -695 -679 -91 584 700 252 -396 -776 -385 318 758 496
1491D96o43n00j7N67O48R9m46o49l24L45O72M30j19p17m61PN40O10R1l88o34l84
$$ 496 -147 -647 -664 -97 551 650 204 -445 -769 -424 248 678 559 -158 -619 -612 -72 538 629 241 -393 -777
1513g77L55O51L86j63n58n03m0N00O45J11l87o10k18K22N42N03j76n70m29L2L36
$$ -777 -422 229 615 452 -106 -609 -649 -149 496 607 220 -390 -608 -386 156 659 483 -87 -516 -484 -148
1534a48O18J06k86o48k94L51N20L40j16m08n63n2N14N31J51l08o29k96K46N54
$$ -148 470 576 290 -358 -652 -301 219 559 443 35 -528 -580 -66 465 616 308 -321 -617 -371 183
1554A83M07r9m91m31p4M01M99J41k16o01k52J94M69L98n3m78m42p4L93M25J97
$$ 183 590 491 0 -431 -505 -104 395 536 320 -281 -533 -339 130 528 475 -3 -445 -519 -126 299 496
1575D96k95l92l57J70N24K89K3m64l25j63K73N79K54l64m00l25Q7M72M35o1m54
$$ 496 201 -191 -548 -378 146 435 458 -6 -331 -494 -221 358 612 248 -152 -477 -390 82 517 456 2
1596Bm11qK69M61J74k45m46l35K22L61M23m6l20m88m1K62M65J04j60l80k91M9
$$ 2 -409 -417 -148 313 487 242 -204 -539 -317 44 467 421 101 -387 -428 -166 299 403 243 -137 -428 -379
1618c79M53L14L5l77m23o8K54M57K09k06m48k09O1L83L66n2l34m22r2K52M59J60
$$ -379 74 388 423 46 -377 -445 -191 266 475 269 -179 -388 -327 56 422 370 36 -386 -478 -226 233 393
1640C93o5m40k66k6M42L47J7l60l80j84K05N43K56k23m32k56R0L18L43P9l72l40
$$ 393 328 -112 -378 -404 38 385 402 42 -338 -522 -317 226 482 259 -173 -429 -339 -21 322 401 29 -311
1662c11%J63K77K52o0m32k77O0L01L31N1k90l35j11J95L38K19j86k77k73jK96
$$ -311 -311 -148 129 381 321 -111 -388 -328 -27 304 355 65 -270 -381 -186 152 371 185 -92 -365 -366 -70
1684g0L34P7k50l58m3J63K26K63q6l30k65P1K59K44J62l63k51j34K09K56K77r9
$$ -70 264 341 91 -267 -310 -147 79 342 256 -74 -339 -268 -9 235 397 34 -217 -351 -142 114 391 292
1706B92m01k12j6L62J98R8j94l24j49J02K83L05j40k00l01OK70L47K7k70k43j55
$$ 292 -109 -321 -337 25 223 321 127 -197 -346 -244 39 344 204 4 -297 -291 -21 326 353 83 -160 -315
1728c15J07L42J49p0k73k32l1L47K12Q7j59l61j39J73K65K37p9k42l31O7K33K97
$$ -315 -208 134 283 213 -60 -292 -323 24 236 323 164 -197 -336 -163 102 339 260 18 -313 -246 -13 284
1750B84k3j02l15j43J36K40J76m0k15k11l7K20K04J43k27k12j33P2L04J92m3l64
$$ 284 261 159 -156 -299 -163 77 253 213 -2 -213 -250 -30 174 317 90 -122 -255 -183 121 313 270 -94
1772i4j05q7J71L05P2q2l35j30R8J97K03Ok63k82M8K34J56J52j06l37j41J38K12
$$ -94 -199 -286 -115 190 262 180 -155 -285 -187 10 213 219 -44 -326 -278 -44 112 264 158 -179 -320 -182 30
1795C0K40%k71k19k0J33K75O0j05k41j02oK92J55J4j94k45j1Q3L08J08j70j60
$$ 30 270 270 -1 -220 -240 -107 168 228 123 -118 -220 -226 66 221 235 41 -204 -215 -132 176 284 114 -46
1818d6j95N6K84K15j29j73j95m0J49J95J04p5j75j68jK72P0L4j56k40k6J58J80
$$ -46 -241 -185 99 314 185 12 -183 -223 -74 121 225 150 -25 -193 -194 78 148 182 26 -214 -240 -82 98
1841I8J42p3j93k00K5K86J10kk05j80m7J28J49K09j54k50o8R8J68J48k5j02k06
$$ 98 240 167 -26 -226 -201 85 195 193 -12 -192 -239 -111 38 247 93 -157 -225 -127 41 189 164 62 -144
1864a44m7J61J60J16j35j58j57N0J55J72l7n9k35L8N3J69J63j45r7j85N4J00J66
$$ -144 -191 -30 130 246 111 -47 -204 -154 1 173 136 77 -158 -120 -67 102 265 120 23 -162 -108 -8 158
1887A58qj18j12q5O9K01J9J9j83j11p4K38J01M4m0k41r0J29J49J20J5l01n1j4
$$ 158 150 32 -80 -165 -96 105 124 143 -40 -151 -225 13 114 158 118 -123 -213 -84 65 185 200 -101 -152 -166
1911a66J66J61m0p8j11r6Q0J91J10q8k28j6k2J02Q3J59j77j06r2J5K04J3N6r8
$$ -166 0 161 121 43 -68 -164 -84 107 217 129 -99 -115 -137 -35 48 207 30 -76 -168 -153 51 64 120 22
1935B2j87J00L2J40K7q7j60o1J31R8R9n7j24n1j19J75J22M9p9j33j73J09J51J04
$$ 22 -165 -65 -33 107 134 47 -113 -174 -43 55 154 97 -27 -78 -197 -22 100 149 70 -63 -236 -127 24 128
1959A28q0n1j12k1N5J10J30j10p0j26L9J53L8%j21j5n2R4J04P4m6j50j13R8R7
$$ 128 48 -3 -115 -136 -81 29 159 49 -21 -147 -108 45 83 83 -38 -53 -105 -11 93 167 121 -29 -142 -44 53
1984E3M9k2l7n3j11J07J38Lm0r4j24PJ45N0k3o8o8LK9J25k6oj03l8J9J48n2J21
$$ 53 102 80 43 -10 -121 -14 124 127 87 -7 -131 -124 21 71 48 -20 -88 -85 -56 69 43 37 -66 -104 -85 63 11 132
2012A32j87j7lk8J29O8nj22p9M7Q7J2N2r3n9ON6Q5Q2r0o7j34N0N6J29k9j5j09
$$ 132 -55 -72 -75 -103 26 94 89 -33 -112 -65 22 34 86 -7 -66 -60 -4 81 163 73 6 -128 -78 -22 107 78 63 -46
2040d6m1J7J62rNr7r3J8J15j3L9J8r2j14P7Q5Q3o8q9j16J03P1N7ll5j10o2J08
$$ -46 -87 -70 92 83 88 -9 -102 -84 31 18 57 75 -17 -131 -54 31 114 46 -43 -159 -56 15 72 69 34 -76 -138 -30
2068c0J03j9Nl5j59M8J08LL3j12o5M5J4J10M1k6j37K1j03J45Q0N2j07q4n7M2J40
$$ -30 73 54 59 24 -135 -87 21 24 57 -55 -120 -75 -61 49 90 64 -73 -52 -155 -10 70 122 15 -69 -126 -84 56
2095E6K6Rr1m7J4N2K0pnJ1j05j3L4J03M5j33n7L6Q0J4Q0n9j05o4Q6m1K7Q4p1k9
$$ 56 82 91 0 -47 -33 19 39 32 27 38 -67 -80 -46 57 102 -31 -88 -52 28 42 122 63 -42 -106 -20 -61 -34 50 -21 -50
2125e0r1J35J06l5n9n6o5J06m2J02l9o1M1p6O8pP4mq2m0k9Q1P7J6q5m0n2Q9K4
$$ -50 -141 -6 100 65 6 -50 -115 -9 -51 51 12 -49 -8 -84 -16 -23 51 47 -35 -75 -104 -23 54 70 -15 -55 -107 -18 6
2154FL7K4p0p9M0O1O0j8o1m6J6n7R5Q7m2r1o6J02m1M6K5p6k3j1J3O0N3N7j22m4
$$ 6 43 67 -3 -82 -42 19 79 61 0 -46 -30 -87 8 95 53 -38 -104 -2 -43 3 28 -48 -71 -82 -69 -9 44 101 -21 -65
2184f5J2J23q8L5n8K1m0J4Q2kJ1q8RJ0O0M3J0n4r7m2N0J56o8j8N5j07k6J17O4
$$ -65 -53 70 -18 17 -41 -20 -60 -46 36 34 45 -43 -34 -24 36 79 89 35 -62 -104 -54 102 34 16 71 -36 -62 55 119
2213A19n3m5m5L8m1J39n6rm7q4N1L2pk6J6Kj13M1J27n6L4m9n5MM4M9M8Kr2q7L2
$$ 119 66 21 -24 14 -27 112 56 47 0 -84 -33 -1 -8 -34 -18 -16 -129 -88 39 -17 17 -32 -87 -83 -39 10 58 60 -32 -119 -87
2244h7J50l4l6K3o4k2O2PN0L5j14NLrJ41o1l5o0L6N3k1kJ0p1m3P3OJ61o8j55J3
$$ -87 63 29 -7 16 -48 -70 -8 -1 49 84 -30 -25 -22 -31 110 49 14 -46 -10 43 22 20 30 -41 -84 -11 -5 156 88 -67 -54
2275e4M7k1J25p1Lk8p7K9OJ04k1K8j38N0L5K9M9j00n2M1o3J10j1Qq6L9o8N3J1
$$ -54 -7 -28 97 26 29 1 -76 -47 -41 63 42 70 -68 -18 17 46 95 -5 -57 -16 -79 31 20 28 -58 -19 -87 -34 -23
2304b3O1j3q6MjO5K1N7k0n2p2P2M4J0lo2J5k1m0O6K9q8L9m3kJ14N0r1j4j03P3
$$ -23 38 25 -61 -57 -58 7 28 85 65 13 -59 13 57 67 64 2 17 -4 -44 22 51 -37 2 -41 -43 71 121 30 16 -87 -14
2335a4O1K0j1m6j0M9L8r2M2N9j41kj7N8M0mo8l8J1k6M3P5J2o9K2j8L0j0J2L3M1
$$ -14 47 67 56 10 0 49 87 -5 37 96 -45 -47 -64 -6 34 30 -38 -76 -65 -91 -48 27 39 -30 -8 -26 4 -6 6 39 80
2366H0j24qM7R9m8p0K5o7O5n3O9k2m0P6o3R5l4M4p1oPnQ4l8m0j6m3oJ77p2j5k6
$$ 80 -44 -52 -5 94 46 -24 1 -66 -1 -54 15 -7 -47 29 -34 61 27 71 0 -6 1 -4 80 42 2 -14 -57 -63 114 42 27 1
2398Am7k1J9L6QL1m6n6J2O2K1Jq4j1N4O8p6R8n0rm4L8LnP7q9j4l3Q3k0K4lq6O
$$ 1 -46 -67 -48 -12 -4 27 -19 -75 -63 -1 20 21 -63 -74 -20 48 -28 70 20 11 -33 5 8 3 80 -9 -23 -56 27 7 31 28 -58 -52
2432e2lk9Q7L1n7J06j62L8Q2o8Q0k4p1P0o2J00p4P1p6l7L0J1K1n0L2m7L5M3j3
$$ -52 -55 -84 3 34 -23 83 -79 -41 41 -27 53 29 -42 28 -34 66 -8 63 -13 -50 -20 -9 12 -38 -6 -53 -18 25 12
2461A2M2j24m4J03n2M1R1q6M2m6qL2K5l8L0J9p4jJ03m3K7nn7k3R1l8m4lK1J1J2
$$ 12 54 -70 -114 -11 -63 -22 69 -17 25 -21 -29 3 28 -10 20 39 -35 -36 67 24 51 46 -11 -34 57 19 -25 -28 -7 4 16
2492A6m1O5m0N3j05M5K4K8Qk5m1J6k0O6m1J2n1j2P1n1k0J1M8m7k9jQ5n0PPlL2
$$ 16 -25 40 0 53 -52 -7 17 45 53 28 -13 3 -17 49 8 20 -31 -43 28 -23 -43 -32 16 -31 -60 -61 24 -26 -19 -12 -15 17
2524A7m8M4o4M3l4K6Mq4Q2J4m3O4n0J1M7jJ4l2k9J2O3o5LO0o7j4Q0j22J48j24
$$ 17 -31 13 -51 -8 -42 -16 -12 -96 -14 0 -43 21 -29 -18 29 28 42 10 -19 -7 56 -9 -6 54 -13 -27 53 -69 79 -45
2554d5M0n9N3k5L4K9k5jl0K0M7J6Po4m9M2L1j06J04K3q3J6j2J3J7l3mjL6J4km
$$ -45 -5 -64 -11 -36 -2 27 2 1 -29 -9 38 54 61 -3 -52 -10 21 -85 19 42 -41 -25 -37 -24 -7 -40 -44 -45 -9 5 3 -1
2586a%L1l5k8M5L5p9K7j2J3J1M6p7K6J4%pJ3n1P9m0o5O2M0o3N2qj11M9L0K8k4
$$ -1 -1 30 -5 -33 12 47 -32 -5 -17 -4 7 53 -24 2 16 16 9 22 -29 50 10 -55 7 47 -16 36 28 -83 -34 -4 24 0
2618@J4p5J03m2k3m4J08q2N6p1k4M1J25p7n3M8l5L6mK4m1J1j8M6l4q7J29p3m0
$$ 0 14 -61 42 0 -23 -67 41 -41 15 -56 -80 -39 86 9 -44 4 -31 5 1 25 -16 -5 -23 23 -11 -98 31 -42 -82
2647h2M4R4q9J12p3J2j08R2K9o1M9p5O8ON2k6n3o8P6Kj0P1r8J02j10N3o3O5L8
$$ -82 -38 56 -33 79 6 18 -90 2 31 -30 19 -56 12 18 70 44 -9 -77 -1 1 -9 62 -36 66 -44 9 -54 11 49
2676D9m7l%mj7K9k8Q2m3o5N3n8O9q3P3m2K5l3OK8M0o7mK8K0l4O8m2mk0l3Q7M5
$$ 49 2 -1 -1 -5 -22 7 -21 61 18 -47 6 -52 17 -66 7 -35 -10 -43 -37 -9 31 -36 -40 -12 8 -26 42 0 -4 -24 -57 30 75
2709G5m0rl0mM7m5J1l0O4KJ5o3P7m1k4Ok2L6k8j8J12p9k6l2M1J05j21j2O3k5k7
$$ 75 35 26 -4 -8 39 -6 5 -25 39 41 56 -7 70 29 5 11 -11 25 -3 -21 91 12 -14 -46 -5 100 -21 -33 30 5 -22
2740b2kj7l4L0K5L3nk2m9O8M5o3o2Q6j5L3p1K5Q0p4k2L6k5j3kP2Lj5q0K5K0j8
$$ -22 -24 -41 -75 -45 -20 13 8 -14 -63 5 50 -13 -75 11 -4 29 -42 -17 63 -11 -33 3 -22 -35 -37 35 38 23 -57 -32 -12 -30
2772c0j2J0M4%Ok9N5r7K7pJ16p6q6J08k8Kl3jkJ8lJ7j6j8oO0qo5M6K4k4rJ4l1
$$ -30 -42 -32 12 12 18 -11 44 -53 -26 -33 83 7 -79 29 1 3 -30 -31 -33 -15 -18 -1 -17 -35 -41 19 11 -54 -8 16 -8 -17 -3 -34
2806c4MkL0K4n2M3L4Jj30J32m2L5qj1q3L7J36j39j3P3Qq2N7n0jJ37j08L1p5L5
$$ -34 -30 -32 -2 22 -30 13 47 48 -82 50 8 43 35 24 -59 -22 114 -25 -38 35 43 -39 18 -32 -33 104 -4 27 -48 -13
2836a3j7K5l4M7m2M1O6k1m9j3j8pN2n8N4O9j30J02k5r5N2pNN9J6j33P7l7N5k7
$$ -13 -30 -5 -39 8 -34 7 73 52 3 -10 -28 -35 17 -41 13 82 -48 54 29 -66 -14 -21 -16 43 59 -74 3 -34 21 -6
2866flL6l9M2j8L5o6M3l6P0j00l6J01m7N2k2QJ6l2RK4m5J9k8k2O6K1l6m8L1L9
$$ -6 -9 27 -12 30 12 47 -19 24 -12 58 -42 -78 23 -24 28 6 14 30 -2 7 31 -14 5 -23 -45 21 42 6 -42 -11 28
2897B8K2n4k5LK0Ll7M3nm3M0M7p0M1J5l9kJrLL1p3N2j2L1l4J1LN4Lm8l7qM4l3
$$ 28 50 -4 -29 -26 -6 -3 -40 3 -2 -45 -5 42 -28 13 28 -11 -13 -12 -21 -18 13 -60 -8 -20 11 -23 -12 -9 45 48 0 -37 -45 -1 -34
2932c4O0l9K3l1L4K2m5M8k7M2q6K5L2o9N1K7J5n4Jl4L8j3L2m2N6n6O8j13O5N7
$$ -34 26 -13 10 -21 13 35 -10 38 11 53 -33 -8 24 -45 6 33 48 -6 -5 -39 -1 -14 18 -24 32 -24 44 -69 -4 53
2962E3n4J4k3N1k6j1k7M1j5k6lR3p8M3j4p0O3J8j0qp9O0k7L6o4J05j15O1M4n2
$$ 53 -1 13 -10 41 15 4 -23 18 3 -23 -26 67 -11 32 18 -52 11 29 19 11 -68 -8 -35 1 -63 42 -73 -12 32 -20
2992b0N0%k4l6M5j00N1NK5j8NJ1j6j7L6L3j0ql5MN7p1j5LQ8p2j1O5j08Q7o7P7
$$ -20 30 30 6 -30 15 -85 -34 -29 -4 -22 -17 -6 -22 -39 -3 30 20 12 -23 -19 38 -33 -48 -45 43 -29 -40 25 -83 4 -63 14
3024A4k7K6l5N4j14k1P9kk1O9nn4m2N2L2jK1J3Qm3m1O5m4K3j1L9K1l2n9M6J6l8
$$ 14 -13 13 -22 32 -82 -103 -24 -26 -47 22 17 -37 -79 -27 5 4 25 38 46 3 -38 27 -17 6 -5 34 55 23 -36 10 26 -12
3056a2J9Rl0k8O4k7m3J7Q8l8l2j1oO3mj5j0Lpn8L3k7L7K4j2l5mQ2J2l9m1j0nO7
$$ -12 7 16 -14 -42 22 -5 -48 -31 57 19 -13 -24 -30 33 29 14 4 7 0 -58 -25 -52 -15 9 -3 -38 -42 40 52 13 -28 -38 -43 24
3090B4n3k0k8N2R7m1n0O5o2L2j6J6l6ll2P8Kj05R8m2M3Jj8k2J1j6M0j4l1M1L0
$$ 24 -29 -49 -77 -25 72 31 -19 46 -16 16 0 16 -20 -23 -55 23 25 -80 18 -24 19 20 2 -20 -9 -25 15 1 -30 11 41
3121D1k4Ol6J0k1K2L9m6m7L0lpj2J9N9q1J3L0L2p0L5J1m1PQ0j00k8P9j1K4l0j1
$$ 41 17 23 -13 -3 -24 -2 37 -9 -56 -26 -29 -36 -48 -29 30 -51 -38 -8 24 -46 -11 0 -41 -34 46 -54 -82 -3 -14 10 -20 -31
3153c1L9JJ4m1N0j0L5o0J9Lj1l5Q5r2K6j4l7j1P7k5K6L0q2L9nNpP1n3m0PJoL7
$$ -31 8 9 23 -18 32 22 57 -3 16 19 8 -27 58 -34 -8 -22 -59 -70 7 -18 8 38 -44 -5 -10 -5 -12 59 6 -34 -27 -26 -32 5
3187El9o4Q2K7m7k1L8N2k3K7j07P8Qj0L5m1Jn3P9k7k0QOJ3l7LL3j7N3n0M4k9l0
$$ 5 -34 -98 -16 11 -36 -57 -19 33 10 37 -70 8 16 6 41 0 1 -52 27 0 -20 -12 -6 7 -30 -27 6 -11 42 -8 36 7 -23
3220b3P1N0j50J21l0k5No4O7m4l2M7J7q7O1L3q0L6K8l0j0J1O7m4oq5Q9j3jJ15
$$ -23 48 98 -52 69 39 14 19 -45 22 -22 -54 -7 10 -77 -16 17 -63 -27 1 -29 -39 -28 39 -5 -11 -96 -7 -20 -21 94
3250I4j09N1k8n9N5j2mj1qk8M1O4q2M5o5RO0k0O6Mj30O3j7nKm0Q9l7K7k2Q5l2
$$ 94 -15 36 8 -51 4 -8 -12 -23 -31 -59 -18 46 -36 9 -56 -47 13 -7 59 63 -67 -4 -21 -26 -24 -64 25 -12 15 -7 78 46
3282D6p5Q3n1Rk5m6J6NP1n8qP6r2O5j1n1P8m1j5m8J10J6o2l3LK5m2N7K1r2O6N9
$$ 46 -29 54 3 12 -13 -59 -43 -38 33 -25 -33 43 -49 16 5 -46 32 -9 -24 -72 38 54 -8 -41 -38 -13 -55 2 23 -69 -3 56
3314E6q1N2r0MQ0j3o0Q4k1K5j5n0M6jm1l9O1k2L8p1K9J09j7k9J7n0Q9r7k4M5M6
$$ 56 -25 27 -63 -59 21 8 -52 32 11 36 21 -29 17 16 -25 -64 -3 -25 13 -58 -29 80 63 34 51 1 90 -7 -31 14 60
3345F0k7q1RN0Qj3l1Kl1K1Q8r5l5J00po1M3M4k2j15R8Lo1O4p5j6J22J1k6k3Jj6
$$ 60 33 -48 -39 11 19 6 -25 -23 -54 -33 55 -40 -75 25 18 -43 0 44 22 -93 5 8 -53 11 -64 -80 42 53 27 4 5 -11
3377a1M2k2L6j5jL7m1J5p9R2p2K5p4J02k1m5O9p1L1J8n1OK9Kk0J0J9o3K1J2j4
$$ -11 31 9 45 30 29 66 25 40 -39 53 -19 6 -68 34 13 -32 37 -34 -3 15 -36 -30 -1 1 -19 -9 10 -53 -32 -20 -34
3408c4k0K7N9j6k6rN3n2QJ1Oj5K4RK0J2j26lP1k4KL0l3P2o6O0l4o5N8n7O9K8J4
$$ -34 -54 -27 32 16 -10 -19 34 -18 -10 1 7 -8 16 25 45 57 -69 -72 -1 -25 -23 7 -26 46 -20 40 6 -59 -1 -58 11 39 53
3441E3o5J18m2j27J07n2k8J9L0m8nJ04J1p9Rj0l9JL7j2P4k3n8K2%j1n4O4m5N8
$$ 53 -12 106 64 -63 44 -8 -36 -17 13 -35 -40 64 75 -4 5 -5 -44 -43 -6 -18 56 33 -25 -3 -3 -14 -68 -4 -49 9
3471Ik4rL9m0P5n0j2P3p4Nl5O8m1N2p5K6J9Mm0M4M9j9M1o5k0LjO6n2K4k9k9J7
$$ 9 -15 -24 15 -25 50 0 -12 61 -13 -8 -43 25 -16 36 -39 -13 6 10 -30 14 63 44 85 20 0 3 2 68 16 40 11 -18 -1
3504aj8OJ2k1J2J8l8Ok8O0jNJn1M7m6J24p9l8O6m8L0n0M8m7N0l3L1j9o2N6M1J0
$$ -1 -19 -13 -1 -22 -10 8 -30 -24 -52 8 7 12 13 -38 9 -37 87 8 -30 36 -12 18 -32 16 -31 19 -14 17 -2 -64 -8 33 43
3537D3qq9J00n2J3k7j4RJ6k3N8j9J6j4K6l2k2k6J20j1n2K3m1QK9p7K9lM7J2j03
$$ 43 35 -54 46 -6 7 -20 -34 -25 -9 -32 26 7 23 9 35 3 -19 -45 75 64 12 35 -6 2 31 -46 -17 -20 27 39 -64
3568f4O1K0n2k5J4O8J1m7NL2k1p8N0N3L9q5k8O9j4q6O8j0lL1l9j6L3N4l6n4KL6
$$ -64 -3 17 -35 -60 -46 22 33 -14 -9 23 2 -76 -26 27 66 -19 -47 22 8 -78 -10 -20 -23 8 -31 -47 -14 40 4 -50 -48 -12
3600a2Q1q1O3jo3K5K3k6nK3%m4J5J1l4N5J4l2M9k3j9l1k0M5m0J5J4L3Lj1pn3L5
$$ -12 69 -12 51 50 -13 12 35 9 4 27 27 -17 -2 9 -25 30 44 12 61 38 19 -12 -32 13 -27 -12 2 35 38 27 20 -33 2
3633Bj8M3q4M4l0Q4o4k3k7M4J0Lj2P6n6k0M0M9o1pk9L1Ook6K9mqML0Jn0L0n2P1
$$ 2 -16 27 -57 -13 -43 41 -23 -46 -73 -29 -19 -16 -28 48 -8 -28 12 61 0 -7 -36 -5 1 -5 -31 -2 -6 -14 -10 20 21 -29 1 -51 20
3668B0Qj1l0K3KK7l6N5o1kk4M8k1Jk3L2om6Q4m3m3O8j12J3Q3PK3m9L3m9O6p9L6
$$ 20 28 17 -13 10 12 39 3 58 -3 -5 -29 19 -2 -1 -24 8 2 -44 40 -3 -46 22 -90 -77 6 13 36 -13 20 -29 37 -42 -6
3701fKm7N0m6ol2L7N8Lj4Kk2K8K4PJ1m0J4n1K0J5M3m2K1NL5r4NJ4k8P1Jn3Jj1
$$ -6 -4 -51 -1 -47 -53 -85 -48 10 13 -1 1 -21 7 31 38 49 9 23 -28 -8 7 50 8 29 34 69 -25 -20 -6 -34 37 38 -15 -14 -25
3736b5nN6qK1m2m1L2M2p2J6O2p6K4j1K7J8mp6P9j2q7R3l4N6n5N5l5m4l4Q8L0r0
$$ -25 -30 26 18 39 -3 -44 -12 30 -42 -26 36 -40 -16 -27 0 18 14 -62 17 5 -82 11 -23 33 -22 33 -2 -46 -80 8 38 -52
3768e2J2Q5k0j2l7M2n2R0m5nLo5L9K6rj4M0k3j4k0J7O7r0M3n6M4n1M9k9L4l5l
$$ -52 -40 45 25 13 -24 18 -34 56 11 6 9 -56 -17 9 0 -14 26 3 -11 -31 -14 53 -37 6 -50 -6 -57 -8 -37 -3 -38 -41
3800d1P3p1M5jj5J9m8J15p9j4L2o8M8j5K3k3l5N2j5KK6l1N3m8Q5J4m6o9L3J5J4
$$ -41 32 -39 6 5 -10 9 -39 76 -3 -17 15 -53 -5 -20 3 -20 -55 -3 -18 -16 10 -21 32 -16 69 83 37 -32 1 16 30
3831C0l4P6j01J22j21K8N1q9Q4rl5O7m1lk4p6P1q0J20k4m5r6J05lK8j0L6J5q5
$$ 30 -4 72 -29 93 -28 0 51 -38 46 37 2 69 28 25 1 -75 -4 -84 36 12 -33 -129 -24 -27 1 -9 27 42 -43
3860d3M7j6lM8n3MO7m9K2j4n0lK5N3q9M1Q1q0m4J5P1k9L9o8P1n0j3L4o8O6n2O5
$$ -43 4 -12 -15 33 -20 -16 51 2 24 10 -40 -43 -18 35 -54 -13 68 -12 -56 -41 30 1 40 -28 43 -7 -20 14 -54 12 -40 25
3892B5k8Rm1O7J4j4K0Oq5K4J3j00N1P0mM1j7n5l4R6l1o9OL9Q0q0k7L7nn5K1j7
$$ 25 -3 6 -35 32 46 32 52 58 -27 -3 10 -90 -39 31 27 68 51 -4 -38 58 27 -42 -36 3 83 3 -24 13 8 -47 -26 -43
3924d3J7K0j0q4J46q4M9k6l3J04p6N2n8P1n7JK1lM5j8j03J8k8P6J2K0m7M2l9j2
$$ -43 -26 -6 -16 -100 46 -38 11 -15 -48 56 -20 32 -26 45 -12 -11 10 7 52 34 -69 -51 -79 -3 9 29 -18 24 -15 -27
3954b7LN1l9Kl1P6m5j1oK8ml1L9j07P9loK3Nl1jj6N1opMN6m7l0R2o5M4k0j8m2
$$ -27 -24 27 -12 -10 -41 35 -10 -21 -27 1 -3 -34 5 -102 -23 -26 -32 -9 -4 -35 -36 -52 -1 -7 -14 -10 46 -1 -31 61 -4 40 20 2 -40
3989d0M8k7k4M6L1l3m7J5J7K3l2O9p5oP3J1m3K6p9P1k4K4l8kK4Qk0k2N3o3k3l
$$ -40 8 -19 -43 3 34 1 -46 -31 -14 9 -23 46 -29 -35 38 49 6 32 -47 24 0 24 -14 -16 8 16 -4 -26 27 -36 -59 -62
4021f2O0n2P6n8N5j4Kp8L6P6o4Oj4L7n2O1j5J2J2K1j5o8ON1l1k7j6J08q3oO4m1
$$ -62 -2 -54 22 -36 19 5 7 -71 -35 41 -23 -17 -31 6 -46 15 0 12 24 45 30 -38 -32 19 -12 -39 -55 53 -30 -36 28 -13
4053a3Mo1R4rO6n9jKL8Lq2J9L6j4k7L1n4J7ll2qK5J3L4m7R0n2p3j8P1L6lp8l5
$$ -13 -9 -70 24 15 81 22 21 23 61 64 -18 1 37 23 -4 27 -27 -10 -13 -45 -53 -28 -15 19 -28 62 10 -63 -81 -10 26 23 -55 -90
4087i0J12kj6q9O5J9J5k7j1l3K5O2m0MJ1o0L8n0N5k0N7K4n4j4P3n4K4o3O2J7n1
$$ -90 22 20 4 -85 -20 -1 14 -13 -24 -57 -32 30 -10 -6 5 -55 -17 -67 -12 -32 25 49 -5 -19 54 0 24 -39 23 40 -11
4118a1J5oJ3k6j4J1L9k4NNK3O6r8K1O3j58J4K5n0P1j0K9J3j5qk2K9k3k4ml0M5
$$ -11 4 -2 11 -15 -29 -18 21 -3 2 7 30 96 -2 19 82 -76 -62 -37 -87 -16 -26 3 16 1 -7 -29 0 -23 -47 -51 -81 -36
4150c6O6m9K5J1o5P5nl3J2J7Nq4P6p6K0P3k3%J2k5M6q7M7pMN9j3o1N2j0mKJ5q8
$$ -36 30 -19 6 17 -48 27 22 -11 1 18 23 -61 15 -61 -41 32 9 9 21 -4 42 -45 2 -5 -1 58 45 -16 36 26 22 24 39 -49
4184d9L6j8L6L1p7JQLONoj9j3L7Omj4K3n3L6l9ML3L8k9K7kK9m6M4o3N7o9PP8p9
$$ -49 -13 -31 5 36 -41 -40 -32 -29 -23 -18 -24 -43 -56 -19 -13 -17 -31 -8 -61 -25 -64 -60 -27 11 -18 9 7 36 -10 34 -29 28 -41 -34 44 -35
4220c5P6k6p4Q6p1M6l4N9j09O0J1lQN6p6J0N1m3L2j2O4j21M5n3J9o4O1K6l9M6
$$ -35 41 15 -59 27 -44 2 -32 27 -82 -22 -11 -14 -6 50 -26 -16 35 -8 24 12 76 -45 0 -53 -34 -98 -37 -11 -50 -4
4250dOk7R4m1n2Km2P0l3L5J4o7O7k3J5k1lJ5O5j20N6Rp4N2%n4M3k2M1j5N6Pl1
$$ -4 2 -25 69 28 -24 -22 -64 6 -27 8 22 -45 22 -1 14 -7 -10 5 70 -50 6 15 -59 -7 -7 -61 -18 -40 1 -14 42 49 18
4283A8Nj9l9L4N8n5j7N2o4O4k0Jl9N9J3n8m1M9k4j0j9K2J0L3j9nkl3Q0l6m5N9
$$ 18 23 4 -35 -1 57 2 -15 37 -27 37 17 18 -21 38 51 -7 -48 1 -23 -33 -52 -30 -20 13 -6 -11 -13 -46 34 -2 -47 12
4315A2k9M0j2j3l3J0Ll3mM6mL5kk0J2o7LR0r1M3J04p3l5OnP2o9L7k9JK8r2L9k7
$$ 12 -17 23 11 -2 -35 -25 -22 -55 -59 -13 -17 18 16 -4 8 -59 -56 34 -57 -14 90 17 -18 -12 -17 55 -14 23 -6 -5 23 -69 -30 -57
4349e7J11j09L8%K3k6Q8r7l7J8Q1p7P7o0M6p0J13q5m8Q1n8NK7o9P7O0q0M4j8R
$$ -57 54 -55 -17 -17 6 -20 68 -29 -66 -48 33 -44 33 -27 19 -51 62 -23 -71 10 -48 -43 -16 -85 -8 52 -28 16 -2 7
4379GK0m0J7M1n8l6R5j6o1J17j29K1j5P3m9L0Lj3k2oJ6N6k4jj1M3n1l1P3n0j3
$$ 7 27 -13 4 45 -13 -49 46 30 -31 86 -43 -22 -37 36 -13 17 20 7 -15 -21 -5 51 27 26 15 58 7 -24 49 -1 -14
4410a4PL4r0O2j3J7M8m6k7J8KJ2l4N3q6O8K7n7O3j47J03k3J4O9p9J4K2m5j4O2
$$ -14 -7 27 -63 -1 -14 3 51 5 -22 -4 -2 10 -24 29 -57 11 38 -19 44 -103 0 -23 -9 60 -19 -5 17 -28 -42 20
4440B0K3p8K8O5j34O2KrRK0o1K8L4qK2L2n5K5n8M3p7R3j4jN2o5l5Q1m1J0j1j11
$$ 20 43 -35 -7 58 -76 -14 -12 -21 -12 8 -53 -25 9 1 23 55 0 25 -33 10 -67 26 12 11 63 -2 -37 44 3 13 2 -109
4472a09J08l5n8R2K8j8k1Pm0K3L6J5lj10J02Om5O0o3M1Lm1N1n4M5r5J49o6m5O1
$$ -109 -1 -36 -94 -2 26 8 -13 -6 -46 -23 13 28 25 -85 17 23 -22 38 -25 16 19 -22 29 -25 20 -75 74 8 -37 24
4502B4nm1N3n1L7N0%l8l2J4n4j3NJ33j4p1L1Qnq5O5ok7J2J2K6j8j8K9o8Q2L9r3
$$ 24 19 -22 31 -20 17 67 67 29 -3 11 -43 -56 -51 82 68 -3 28 36 31 -54 11 5 -22 -10 2 28 10 -8 21 -47 35 74 -19
4535a9K9Jol0N4k0J6r7J34p2j2nk3N7q9Q9n7N5m5M6J0k1k6L1J2rmL2N0n9J7m9
$$ -19 10 11 5 -25 29 9 25 -72 62 -10 -22 -27 -50 7 -82 7 -50 5 -40 6 16 -5 -31 0 12 3 -1 31 81 22 39 -10
4567a0K9J6j07R9q5L7M6Mk4M1j7m3M7m4mJ4j0l5jl2O7O2m1p1R6p9R4q8K4oRO5
$$ -10 19 35 -72 27 -58 -21 25 29 5 46 29 -14 33 -11 -15 -1 -11 -46 -47 -79 -12 50 9 -62 34 -45 49 -39 -15 -21 -12 53
4599E3r8J7M1Nk1j8K7j0n6J09J6l5Mj8M6j16R0l7L5j02K2Q0j5lK6o3KJ1k5k1M7
$$ 53 -45 -28 13 18 -3 -21 6 -4 -60 49 65 30 34 16 62 -54 36 -1 34 -68 -46 34 19 16 42 -21 -19 -8 -33 -54 -7
4630gL3l5L2p8M2J3j4j0O0k5K3p1P4r1K7M4p8M8LnK4n2J2j2qj0O1Kj7pN5p7N0
$$ -7 26 -9 23 -55 -13 0 -14 -24 36 11 34 -37 37 -54 -27 17 -61 -13 -10 -15 9 -43 -31 -43 -51 -61 0 2 -15 -22 33 -44 6
4663Fk2Pj7j7M0j4RR8n7k5j8K5j2Rm0pJ4L2j0n3L2L6l2J2j0L3n1Q2j2k9j4rJ0
$$ 6 -16 -9 -26 -43 -3 -17 -8 90 33 8 -10 15 3 12 -28 -35 -21 11 1 -52 -20 16 -16 -4 -14 19 -32 50 38 9 -5 -14 -4
4696dLN2q9L8O3o2j2K9J2j8l5nrk7K7O5j6j0N3o9P8o4j0m1L6j9qO9j0J1n6J7K6
$$ -4 -1 51 -38 0 63 1 -11 18 30 12 -23 -28 -37 -64 -37 28 12 2 55 -14 64 0 -10 -51 -15 -34 -42 27 17 28 -28 -11 15
4729A5K8m6O2r1O6o3K6L9j8m4nk2Q0Q7j12p9J24r8Q6m2n5O5RP4r9m4PMM0n6k1
$$ 15 43 -3 59 -32 34 -29 -3 36 18 -26 -31 -53 27 114 2 -77 47 -51 35 -7 -62 3 12 86 -13 -57 -50 -46 -6 -62 -83
4760h3J35n1k0rO4Km5k3j3J09l7q9K4N7Jk1l6M6K2l2l1M8k0Q1p7l4M9o0J13r0
$$ -83 52 1 -19 -28 36 38 -7 -30 -43 66 29 -60 -36 21 22 1 -35 11 33 1 -30 18 -2 79 2 -32 17 -43 70 -20
4790b0j8Lk9R8L9j05K3%L0k5J1qJ1k4K9l4j9R4j10OJ1l4ML4j2O9o1O3o6JqL8m
$$ -20 -38 -35 -64 34 73 -32 -9 -9 21 -4 7 -1 10 -14 15 -19 -38 56 -54 -48 -37 -71 -67 -33 -45 24 -37 26 -40 -39 -47 -9 -13
4823a3K1Rp4M5K7o0K9k6L8m2N5n0K0K6K2k0K4n8L5J3J9l7L6p3J7J7onL2K4k5j2
$$ -13 8 17 -57 -12 15 -45 -16 -42 -4 -46 9 -41 -21 5 27 7 31 -27 8 21 40 3 39 -34 -17 0 -6 -11 21 45 20 8
4855Hm1O4j3K7j6m2L0l4oJ9J2N7m5o3K4K8m5O2p9J2O6j14J08k9m0R6o2MM1K9M
$$ 8 -33 31 18 45 29 -13 17 -17 -23 -4 8 65 20 -43 -19 9 -36 26 -53 -41 25 -89 19 -10 -50 46 -16 -12 29 58 62
4886F2n0K5k7o0K8rP9K7p5n5J09j03N2JP6n4l7J9qO7p0K4k7m%N4o5Oj9P4k8K5
$$ 62 12 37 10 -50 -22 -31 48 75 0 -55 54 -49 3 4 80 26 -11 8 0 67 -3 21 -6 -10 -10 44 -21 -15 -34 40 12 37
4918C7o4J4lJ9ml6oQ7Mm7Rp1M7Q7j20pN8k4Jo6Q2K9n4N9o0L0Qjl8N9j5m5M8J7
$$ 37 -27 -13 -16 3 -1 -37 -43 44 48 1 10 -61 -14 73 -47 -54 4 -20 -19 -85 -3 26 -28 31 -29 1 9 8 -30 29 14 -31 17 34
4952C4l2k1M6%l6qL4KJ7j8rlj9k7K1P4k3j9p6J5L8M8O3j11nnj0P3o1QK4m3RoL6
$$ 34 2 -19 27 27 -9 -17 17 19 36 18 9 6 -13 -40 -19 55 32 13 -63 -48 -10 38 101 -10 -15 -20 -30 43 -18 -10 14 -29 -20 -26 10
4987A0l8k3L3m1O5M4n6Qj29J39J7QL6m8q7L7K3k7J9m2P8J1L7j9k3n7O4J3k6K9
$$ 10 -28 -51 -18 -59 6 50 -6 2 -127 12 29 37 73 25 -62 -25 -2 -29 -10 -52 26 37 74 55 32 -25 39 52 26 55
5017E5kp3l1O1K6p6N4l8K5J5m5L5m5OL5N1l6n3K4pL9l2%nP2Nj15P4j0P5j33O7
$$ 55 53 -20 -51 10 36 -40 14 -24 1 16 -29 6 -39 -33 2 53 17 -36 -12 -19 20 -12 -12 -17 55 60 -55 19 9 84 -49 18
5049A8J4m4jL7l2J9q8O6K2q4N9L2K7m2J8J8k8J7J7ol7k7pQ8l2Kj8k1M9k6n4M3
$$ 18 32 -12 -13 24 -8 11 -77 -11 11 -73 -14 18 45 3 21 39 11 28 45 39 2 -25 -32 56 24 26 8 -13 36 10 -44 -1
5081ar2P7l%j9n6Q4J7m2L1j8O4o1Qo0P2j3j9O3l2j0K2mj23J68n6m6P3l8nk2O4
$$ -1 -93 -16 -19 -19 -38 -94 -10 7 -35 -4 -22 42 -19 -11 -71 1 -12 -31 32 0 -10 12 8 -115 53 -3 -49 24 -14 -19 -41 23
5113B3k1J8j4Nj2P2o3rL2r5Q1j4N5OQm3k9P3m8J0o%o4J9k2Q6n0j4L2m1j6N1k0
$$ 23 2 20 6 11 -1 71 8 -1 31 -64 17 3 58 64 72 29 0 73 25 35 29 29 -35 -16 -38 48 -2 -16 16 -25 -41 10 -10
5146a0Pl5J7L5o3Q7l5N4o9JN1p0L6M0l9k3m9J58j28J2j1M1J9n3L9j4j1M3LJ0p
$$ -10 -3 -38 -21 14 -49 38 3 57 -12 -11 40 -30 6 46 7 -16 -65 93 -35 -23 -34 7 26 -27 12 -2 -13 30 33 43 36
5177C6k5Qk0l1J5O5k0J5k8p3O6j3J1K9j2n4j7jO1o3L4l8L5QLMrM8p8lQ4n6j6O1
$$ 36 11 19 -1 -32 -17 48 28 43 15 -58 8 -5 6 35 23 -31 -48 -49 12 -51 -17 -55 -20 -12 -9 -5 -14 34 -44 -47 37 -19 -35 26
5211B6l2K2l6pk5N0o5J34l3l9RN5n1m2J7M4k0j0k1M9j0j5K1o2J1M7M0j32L0L6
$$ 26 -6 16 -20 -27 -52 -2 -67 67 34 -5 4 59 8 -34 -17 27 7 -3 -24 25 15 0 21 -41 -30 17 57 -75 -45 -9
5241ik8O8l8M4l5n5M6QK0k5K1l3l3Q6n0L3k1l3j9K0K1l4K8o1K0N9O7q3m1nP0O2
$$ -9 -37 31 -7 37 2 -53 -7 1 21 -4 17 -16 -49 37 -13 20 -1 -34 -53 -33 -12 -46 -18 -79 -59 0 67 -16 -57 -62 8 70
5273G0j00N1J0k4j5L0qL4k4J2m6o0J09K9l8m1j8M8k7M2j4J2nn0O5q4O9k8JM1m6
$$ 70 -30 21 31 7 -8 22 14 48 24 36 -10 -70 39 68 30 -11 -29 19 -8 34 20 32 27 -23 42 -42 27 -1 0 41 -5
5304em7J8R1k1o2M0N8r4qL0Nl3N2r5L9J4K0j8J2nK1K8l6m7L8n7L8l6M8Q9m3n5
$$ -5 -52 -34 57 36 -26 14 72 -22 -30 0 5 -28 24 -71 -32 -18 2 -16 -4 -9 12 40 4 -43 -5 -62 -24 -60 -12 77 34 -21
5336b1J7n4N7ON7n0k1j5M0j8j2O6r8P8o8jJ0M0m5N7l4k4J1O7k6pqMj7jj3K8m1
$$ -21 -4 -58 -1 5 62 12 -9 -24 16 -2 -14 52 -46 32 -36 -37 -27 13 -32 25 -9 -33 -22 45 19 12 4 8 -9 -10 -23 5 -36
5369c6J4OJ5N2q1O1n5J9P0m6J6j09P0M2o5nM7MNq2L9N6Ok6l0NL4l2M6K7r9L2P
$$ -36 -22 -16 -1 51 -30 31 -24 -5 65 19 35 -74 -4 38 -27 -32 15 19 24 -58 -19 37 43 17 -13 -8 26 -6 40 67 -32 0 7
5402Gl0J7N8m3m9nK1J0R0l6q5L3N2o7m3J19q0N4K0qJ1l1k0Mlj4ORL9L5o3mL8o6
$$ 7 -23 -6 52 9 -40 -45 -24 -14 76 40 -45 -12 40 -27 -70 49 -31 23 43 35 46 15 -5 -1 -4 -18 -12 -3 36 71 8 4 42 -24
5436b4PLJ1l5M6K1n1K7rM3Jo5Q0m3%Lo1K2J20n4j2jJ1j8K8p0L0L8l4j9K1l8k8
$$ -24 -17 -14 -3 -38 8 29 -22 5 -4 39 40 -25 55 12 12 15 -46 -24 96 42 30 29 40 22 50 -20 10 48 14 -5 16 -22 -50
5469e0j3J30n7j5qk7J5jmM1JJ7J1l0n0K6J1k7K0N5l4l1k6P2p7J6K7k1p1J99j49
$$ -50 -63 67 10 -5 -13 -40 -25 -26 -30 11 12 29 40 10 -40 -14 -3 -30 -10 45 11 -20 -46 26 -51 -35 -8 -29 -100 99 -50
5500e0NN6j4l5J24j10M6l5Oj1M5M2j7l1ql6n3J12o0M2p3L9P5J7p5oJ3l9qK7m3
$$ -50 -45 11 -3 -38 86 -24 22 -13 -7 -18 27 69 52 21 13 -23 -76 36 -24 18 -55 -16 59 76 1 -5 8 -31 -39 -12 -55
5531e5J12q2K2P7r5K4p7P3K7m2O4j04K4M5n0K8K9qm6K6nnj8N4m0K2m1L8K7L4m0
$$ -55 57 -25 -3 74 -21 3 -74 -1 26 -16 48 -56 -32 13 -37 -9 20 12 -34 -8 -13 -18 -36 18 -22 0 -41 -3 24 58 18
5562A8k9j9M1k3K5Pj0K8n8J9L5m3%k3M1K6jMk5lLN1q4M5m4P2k6j3j1Mn1L3Nm1
$$ 18 -11 -30 11 -12 13 20 10 38 -20 -1 34 -9 -9 -32 9 35 34 38 13 10 13 64 -20 25 -19 53 27 14 3 7 -44 -11 -6 -47
5596d7O1m0NN1n5l3L8j1J5R7q4Mm9O1jj7O7o1K9n3k5K6J1l3k5O8n6P5Qkn8J5O
$$ -47 14 -26 -21 30 -25 -58 -20 -31 -16 81 -3 1 -48 13 12 -5 62 1 30 -23 -48 -22 -11 -44 -69 -1 -57 18 26 24 -34 -19 -13
5629a3N7L2n7p5J32n6l0k0j2Q3j01J12n4k8J9LJJ9q7J21o2Jj7KO2o1k4N4J0j5
$$ -13 44 76 19 -56 76 20 -10 -30 -42 41 -60 52 -2 -30 -11 -8 -7 12 -75 46 -16 -15 -32 -30 32 -29 -53 1 11 -4
5659dL9k3q0L4NRNK7k9k3Ll8L2LM5Mq3O3p8J17km5L9J2o7pL4l5J9K4l2J3R4n3
$$ -4 35 12 -68 -34 -29 -20 -15 12 -17 -40 -37 -75 -43 -40 5 9 -74 -11 -89 28 26 -19 20 32 -35 -42 -8 -43 -24 0 -32 -19 75 22
5693B2o7O7M1q6n3P2j6M0j7K0q3j2P0L6Kn3M3KN9j18J4N2j3o6J9K2kkL8%j1m6
$$ 22 -45 22 63 -23 -76 -4 -20 20 3 23 -60 -72 -2 34 36 -17 26 28 87 -31 -17 35 22 -44 -25 -3 -5 -7 31 31 20 -26
5725b6P3l5L0k6qj04J36rJj1n5j1N4q8P2k7k0R3J2n8K6m5N7k7N3m9o5J11o9r3
$$ -26 47 12 42 16 8 -96 40 31 32 21 -34 -45 9 -79 -7 -34 -54 39 51 -7 19 -26 31 4 57 8 -57 54 -15 -108
5755a08P2KQ5n8n9lJ26j16P5l2J2o5O4J2q9J05nMljp1J3L3n0lkJ12j20O0L8k3
$$ -108 -36 -34 51 -7 -66 -69 57 -59 16 -16 -4 -69 -5 7 -82 23 18 22 19 18 -53 -40 -7 -57 -60 -62 50 -70 -10 28 5
5786EL9r2j2M6%NN3m3j3M6m9j8J2LJ05j17M3M9o8Qk6qM0M7n7J3m7N1mM0n8k7M2
$$ 5 44 -48 -60 -14 -14 -9 44 1 -12 34 -15 -33 -21 -18 87 -30 13 62 -6 2 -24 -32 8 55 -2 11 -36 15 11 51 -7 -34 8
5819Hk5L6k3ljM6n1l9j1N8M2n5k7K0J6M8o0oM6n5PJ4R5m6n4L5L6m8m2Q3k0q9P3
$$ 8 -17 19 -4 -7 -8 38 -13 -52 -63 -5 37 -18 -45 -25 -9 39 -21 -27 19 -36 -29 -15 80 34 -20 15 51 3 -39 44 24 -65 8
5852HJ0k8K8Pk3m8N5l2K1m9P4MK7k2l5L5k3K1j2J3q2R1m2k5P9n4M2l2qk7k1K6
$$ 8 18 -10 18 25 2 -46 9 -23 -2 -51 23 27 54 32 -3 32 9 30 18 31 -51 40 -2 -27 52 -2 40 8 0 -27 -48 -22
5884b2m7J09o4m3O3K9m8K4n8L4k6O3j7j3K3K1j4J3k3K4k0PQL0m9M5n8l2O5%n9
$$ -22 -69 40 -24 -67 -4 25 -23 1 -57 -23 -49 14 -3 -16 7 28 14 27 4 28 8 15 23 53 4 49 -9 -41 24 24 -35
5915c5MK1J3pK1%l1J20j54l5Q3J3q2M7L9ok0K9Ln0PlN3k6j5l2M7%j9kK0n3PQ6
$$ -35 -31 -10 3 -4 17 17 -14 106 -48 -83 0 13 -69 -22 17 11 -9 20 23 -27 -20 -23 30 4 -11 -43 4 4 -15 -17 3 -50 -43 43
5949D3m4L6k8m9K5mK7l0O7j08L2L0K1K2nm7P6l8Qj13J01M1p1k0O2J5n4O8n6l9
$$ 43 -1 35 7 -42 -17 -21 6 -24 43 -65 -33 -3 18 40 35 -12 64 26 34 -79 22 63 -8 -28 34 49 -5 63 7 -32
5979c2PJ8K2l2J9K3Kj9k3nj0O6l3L6l9m6J1J5L9j2J7l6j9M7r3P9n8O6OP8o8J6
$$ -32 -25 -7 15 -17 2 25 27 8 -15 -20 -30 36 3 39 0 -46 -35 -20 19 7 24 -12 -31 16 -77 2 -56 10 16 94 26 42
6011D2On4RJ4k8P5r2J8N8l8%K3K6k9m4J6K1m6j1N7J2n3P1m4K5l4NK4l0J7Mj8l8
$$ 42 48 -6 3 17 -11 64 -28 -10 48 10 10 33 59 30 -14 2 23 -23 -34 23 35 -18 53 9 34 0 5 29 -1 16 20 2 -36
6044c6l6M1qNPO2l6l7M0Ml3Q9j35L5qj1Q1p3J5N2oL5l1j1LJ3n8J04m0k6L8o3M9
$$ -36 -72 -31 -39 -34 -27 35 -1 -38 2 6 -27 62 -73 -38 -46 -57 24 -49 -34 18 12 47 16 5 8 21 -37 67 27 1 39 -24 25
6077B5q0Q0N4q1n0JN2jj9L3n8M4K2o3N1pL3k5oo1O3m2M7l5LL0k7l3k5O0L5kll9
$$ 25 -55 25 79 -2 -52 -51 1 0 -19 14 -44 0 22 -41 10 3 36 11 5 -56 7 -35 12 -23 -20 10 -17 -50 -75 -15 20 18 15 -24
6111b4M4Jj27J02j9K5J1l0J7l6%O0n5L2q8R9m6k8M7J3Q2o1oj8q7J28lk7L5lj8
$$ -24 20 21 -106 -4 -23 2 13 -17 0 -36 -36 24 -31 1 -87 12 -34 -62 -15 -2 80 19 13 -5 -92 36 33 6 41 38 20
6142B0n4K7k4M6K7n4kj7K8n5P8K6q8j0J5kK7nqP5m6K2m2k2P0K9r1l9j3J21j1n5
$$ 20 -34 -7 -31 15 42 -12 -14 -31 -3 -58 20 46 -42 -52 -37 -39 -12 -17 -25 50 4 26 -16 -38 32 61 -30 -69 -82 39 28 -27
6174b7K8K9p3M6p1JQ8k3j9mKlLkO2OJ4o8n8J09J1p6L4L1q1L0J5O9j03M2L3m3j9
$$ -27 1 30 -43 3 -68 -67 21 -2 -21 -25 -23 -26 -23 -25 37 43 57 -11 -69 40 51 -25 9 40 -41 -11 4 73 -30 12 45 2 -17
6207a7JJ8O2j54N0jr4J44Rn0M6o7Q3N5j49N5j5M8mOp4J06k9j0p8J28l6L0l9n3
$$ -17 -16 2 64 -90 -40 -41 -135 9 18 -32 14 -53 30 85 -64 -9 -24 24 20 26 -48 58 29 19 -59 69 33 63 24 -29
6237b9j8LL0J5j8PQl0k5N0MK7m7L3O1r0M6j1K8n3N3m4j3J7J9k4k6M2M4o7l3NL1
$$ -29 -47 -44 -14 1 -17 -10 -2 -32 -57 -7 -3 24 -23 10 71 -19 27 16 44 -9 44 0 -13 4 23 -1 -27 15 59 -8 -41 -36 -5
6270eRp1J9M1k1O0l1k8J2M5k6o1P8p6K9K0n1L8LN7Jjp8M5mM7on6Q1l2m5m8N3J
$$ -5 4 -67 -48 -7 -28 32 1 -27 -15 30 4 -57 21 -55 -26 -6 -57 -19 -16 41 42 41 -37 8 4 51 45 -11 70 38 -7 -55 -2 -1
6304aM3p5J5P4p9k4P2k1pk3J8L2o0KqQ8p8J9l2P4m2k4M7j5l0j6P2Kj7p4J06l6
$$ -1 42 -33 -18 56 -23 -47 25 4 -3 -26 -8 24 -36 -34 -42 46 -32 -13 -45 29 -13 -37 10 -5 -35 -51 21 23 6 -68 38 2
6336BM4p4J7Rn3O9m7K7RMK7n3O7k8Lml4rKN0n4J9kjkM4oj1k2l2j2J13m9J7q2R8
$$ 2 46 -28 -11 -2 -55 14 -33 -6 3 7 34 -19 48 20 23 19 -15 -24 -22 28 -26 -7 -9 -10 -12 32 26 15 -7 -39 -51 62 13 30 -52 46
6372D6Lr0P1p4JJ08j12k8L7j5oL7L2q9P1K2O3l9o7r2Q4J8Q5j18NO9n3L6l3K0q
$$ 46 49 -41 30 -44 -43 65 -47 -75 -38 -53 -59 -22 10 -79 -8 14 77 38 -29 -121 -37 -19 66 -52 -47 22 -31 5 -28 -8 -16
6403a6k6K4j5L0Oj1M9K3p5K3lm9L2L9j5mo1L0N2j2k7L2n7K0j9NPj5L8M1n8jQj6
$$ -16 -42 -18 -33 -3 3 -8 41 64 -11 12 9 -40 -8 31 16 12 -49 -19 33 21 -6 26 -31 -11 -30 -25 -18 -33 5 46 -12 -13 -5 -21
6437b1L8K5J0o0l5O3o3LR1j07N6m5J02m7m8N0l6J2L7n5K7rJj7l5M1K1L4j34J24
$$ -21 17 42 52 -8 -43 20 -43 -40 51 -56 0 -45 57 10 -38 12 -24 -12 25 -30 -3 -12 -11 -28 -63 -22 -1 33 -101 23
6467B3m3L0OO3p0k0N4m2L7o2M6o3O0n2L0p2J57j12j6LN4K5k8mJ6m9Mj6lM5j1m1
$$ 23 -20 10 16 79 9 -11 43 1 38 -24 22 -41 19 -33 -3 -75 82 -30 -46 -43 11 36 8 4 20 -29 -25 -41 -44 1 -10 -51
6499e1L6J1k1%lL7J6m1M7n3K5J7n4Q2n0K0m5j6P2L5q2L0k8L6k3j8K6l3n7Q3jj9
$$ -51 -15 -4 -25 -25 -28 9 25 -16 31 -22 3 20 -34 48 -2 18 -27 -43 29 64 -18 12 -16 20 -3 -21 5 -28 -85 -2 -3 -22
6531b2nM2p4J4K5nL9K7l7J7r0Q0n3N1k6K8M8k7j27J12J7o7M2k5L3j4K4o9O6p7
$$ -22 -27 15 -59 -45 -20 -25 14 41 4 21 -69 11 -42 9 -17 11 59 32 -95 17 34 -33 9 -16 17 3 27 -42 24 -53
6561e3N9j6j7M3l2J1n6J25j05Jk4J20j1q5R8Qk6l7N8q6j1O6j6qm5P7l4K4lj6l8
$$ -53 6 -10 -27 16 -16 -5 -61 64 -41 -40 -64 56 45 -40 58 66 40 3 61 -25 -36 30 14 6 -39 38 4 28 25 9 -29
6592b9L7N0q7M0m0m0J00K0m2p2O6J4k7n2K9N9m3k9M4j5L3no6J03j02k2J31Ljo1
$$ -29 8 58 -29 11 -29 -69 31 51 9 -63 3 17 -10 -62 -33 26 -17 -46 -2 -17 16 11 -55 48 -54 -76 55 58 57 -4
6622dn1O0j5J1l7Jl4J36n0j2rpM1Ll4l4O7k8K8kkLj0j4K4q2O2k6j1R3p6J9r7J44
$$ -4 -55 5 -10 1 -36 -35 -69 67 17 5 -4 -11 30 33 -1 -35 32 4 32 30 28 31 21 7 31 -51 11 -15 -26 67 -9 10 -87 57
6656E7n9j1j3p0R5k3N1k8J0m3j2K3J2m7rK9j8R1n1pK6P1q7j3K6rm0L2K3p0K9P0
$$ 57 -2 -13 -26 -96 -1 -24 27 -1 9 -34 -46 -23 -11 -58 -67 -38 -56 35 -16 -23 3 74 -13 -26 0 -9 -49 -17 6 -64 -35 35
6688C5k2J6l8QN1J6l5m9K7RK3K7j29K2JJ5K1m2JR7l4qrl9N5r1O6k0K6J7j5o4N6
$$ 35 13 29 -9 -1 50 66 31 -18 9 18 41 68 -61 -39 -38 -23 -2 -44 -43 54 20 12 3 -36 19 -72 -6 -26 0 17 2 -62 -6
6721fj7K2qK5q3N4L2k3l6O6m2L3l7k6K3N5J8o4Km8N9j2K6j8KN5q8J17p6m8mJ04
$$ -6 -23 -1 -9 16 -67 -13 19 -4 -40 26 -16 17 -20 -46 -23 32 50 -14 -12 -60 -1 -13 13 -5 -3 52 -36 81 5 -43 -47 57
6753E7p1Np8M5N5oj3N7q7N6j9l7JN2k0k0nk2L2M6L3q8N2j1m8PJJ9j6l4L9j3O5
$$ 57 -14 -9 -87 -42 13 7 -6 51 -36 20 1 -36 -35 17 -3 -23 -28 -50 -18 28 61 -27 25 14 -34 -27 -26 -7 -23 -57 -18 -31 34
6786C4%po5O7K2n1j4kL9j6J0J5L1j10P1J7l8l7N8l3L3K1L6l9j7L3l1k8nM1j2l8
$$ 34 34 27 -38 29 51 0 -14 -16 23 7 17 32 63 -47 24 41 3 -34 24 -9 24 45 81 42 25 58 27 -1 -6 35 23 -15
6818a5j6j6OqP2L6p7M6m4moJ1Om2L1k7K3Pk1N7q4J07ok0n2N2lK2k2p4J01k5k6
$$ -15 -31 -47 -41 -49 23 59 -18 28 -16 -20 -26 -15 -9 -51 -20 -47 -24 -17 -38 19 -65 42 36 16 -36 16 13 35 13 -61 40 15 -11
6851a1J7J8q4P9n7R5r1j7N8K6k4J8K7l5l9j8OJ7M7j03K6QNpL5M7l0m1N6J5m4k4
$$ -11 6 24 -60 19 -38 57 -34 -51 7 33 9 27 54 19 -20 -38 -32 -15 32 -71 -45 -37 -32 -39 -4 43 13 -28 28 43 -1 -25
6883b5L0o0L2J8l8k3k7J07K8p9R5p7K6Km5J13m0j13Q3l5k4R2on0o0M8R1m2r3J11
$$ -25 5 -55 -23 -5 -43 -66 -93 14 42 -37 58 -19 7 9 -36 77 37 -76 7 -28 -52 40 34 -16 -76 -28 63 21 -72 39
6913C9r2M9K6l0N1j00N3K3l6MK0L5k9L4p8k0P8j9JMK0l0m0K3k0NK2L6p1K6o3Q0
$$ 39 -53 -4 22 -8 43 -57 -4 19 -17 -13 7 42 13 47 -31 -51 27 8 9 13 33 3 -37 -14 -34 -29 -7 29 -42 -16 -79 1
6945Am5J3qj2P0on2n0R3q0Q7K1q6N2j3k4Q5j8j5k0k3K4l9N5lj1K4JJ2K9l5L7q8
$$ 1 -44 -31 -39 -51 19 13 -39 -89 4 -76 11 32 -54 -2 -15 -39 46 28 13 -7 -30 -6 -45 10 7 -4 20 21 33 62 27 64 -24
6978b4O9k4k6J4j0q6R3k4mJ0j0Ll2J12l4l7rl1Q4q2J06p7M9p9M8m8M8J2OKqk4
$$ -24 45 21 -5 9 -1 -87 6 -18 -22 -12 -22 -19 -51 61 27 -10 -19 -50 34 -48 58 -19 30 -49 -1 -49 -1 11 17 19 11 -13
7010a3K9j9lN0m6J8j7L1n2M2j8Q2m6L7k9m7J2J5m0O7n0L8nm7J3j9O6l6l9Q9r1
$$ -13 16 -3 -6 44 -2 16 -1 30 -22 20 2 84 38 75 46 -1 11 26 -14 53 3 41 36 -11 2 -17 49 13 -26 63 -28
7041b8K4J4j19P0R2m9J2j1J0Jl6L5p1R9k6o0K4k9k7N1J6J5j0p7P1K5k5m5P0l7
$$ -28 -4 10 -109 -39 53 4 16 5 15 16 -20 15 -56 43 17 -43 -19 -48 -75 -24 -8 7 -3 -80 -9 16 -9 -54 16 -21
7071b1n2L5l1J3O3N4q1L6o5J21o5M9q2kmP0k1k0M8o8O3j01P1qRn1M6k2L4m0L8
$$ -21 -73 -38 -69 -56 7 61 -20 16 -49 72 7 56 -26 -28 -32 38 17 -3 45 -23 40 -61 10 2 11 -40 6 -16 18 -22 16
7102A6l6P6j45N6J04o9k6l1RO1k8J0M0q2J1K6k0R%P3m5k1j5N7k6j2N0m8L4RQk0
$$ 16 -20 56 -89 -33 71 2 -24 -55 -46 15 -13 -3 37 -45 -34 -8 -28 -19 -19 54 9 -12 -27 30 4 -8 42 -6 28 37 45 25
7134B5l0j4N7j3j8K4n8J7J5j0O5j6n6L9K1l5nN3l5k2P9q3k5M5n1k3O7j2L0kp3
$$ 25 -5 -19 38 25 7 31 -27 -10 5 -5 60 44 -12 27 48 13 8 61 26 4 83 0 -25 20 -31 -54 13 1 31 29 -44
7165d4P1o4J1k6K4P5n5M1p4M7k6l9M2j3RL7ko3K5P1rm7K2m3NM5Ok5N0n%o4jJ4
$$ -44 27 -37 -26 -52 -28 47 -8 33 -41 6 -20 -59 -17 -30 -21 16 14 -49 -24 47 38 -9 13 -30 -25 20 26 1 51 46 46 -18 -19 -5
7199eJ1j3J6RL4m2o4O5l9M3l7l7N2l4O1m2M1L6p0JPM7j7Jj1L0m0q0R4m1N9p8O5
$$ -5 6 -7 9 18 52 10 -54 11 -28 15 -22 -59 -7 -41 20 -22 19 55 -15 -14 -7 40 23 24 13 43 3 -77 17 -24 35 -43 22
7232B2Jl2L0l4J4qN6p6L4J0nK0kk3O8m7k6P%j9J7k2O7q5R3l6j3rL2o2K7J9j4l7
$$ 22 23 -9 21 -13 1 -7 49 -27 7 17 12 32 30 7 75 28 2 9 9 -10 7 -15 52 -33 60 24 11 2 34 -28 -1 18 4 -33
7266c3n3M1nP2m9M3j2j5K1j3%j3nkm5O5J8p2P2n4Q2k5j3MK5m6%K4j0k9J1pM2m
$$ -33 -86 -45 -50 22 -27 16 4 -11 10 -3 -3 -16 -21 -23 -68 -3 15 -57 15 -39 43 18 5 9 34 -12 -12 12 2 -27 -16 -23 19 15
7300A5rMK6l9K7qK3j6j09O5L6MLn1rR1o9NO7o8kQ4m7j1RJ9q0O3p2K0l4Q6r7Q6
$$ 15 6 10 36 -3 24 16 39 23 -86 -21 15 19 22 -29 -38 53 -16 -11 56 -12 -14 70 23 12 21 40 -40 23 -49 -29 -63 23 -74 12
7334A2rJ3j4p2L6n2K3M7k9P0L2j08O2j1m9M8m8L6l0J10n4j0N9k6k9l1L3m9P4k
$$ 12 3 16 2 -70 -34 -86 -63 -16 -45 25 57 -51 11 0 -49 -1 -49 -13 -43 67 13 3 62 36 7 -24 9 -40 34 32
7364C2m4O2j6j9K3Nm7K7Nm2O6l8M1l9k6n5P0K4m3oj0J07r1K3Oj0k0K7Rll0j5l1
$$ 32 -12 50 34 15 38 43 -4 23 28 -14 52 14 55 16 -10 -65 5 29 -14 -20 -30 77 -14 9 15 5 -15 12 21 18 -12 -27 -58
7397e8N3j3L4J8k2l0K6k5K7k5K1n6L0O5m3k5K1j3Q9o8Nm3O3l7j5P5n4k2NJ4k3
$$ -58 -5 -18 16 34 12 -18 8 -17 10 -15 6 -50 -20 45 2 -23 -2 -15 74 6 11 -32 31 -6 -21 54 0 -22 -17 -3 -26
7428b6L4j4j5k8N8pmm0JO4l6mK0Oj5L1lo8JK6L2l9P6j6%o9J1Rj9nO3p2kP9M1l9
$$ -26 8 -6 -21 -49 9 2 -2 -42 -41 23 -13 -17 3 9 -6 25 22 -46 -45 -19 13 -26 50 34 34 -35 -24 -15 -34 -39 24 -48 -50 29 70 31
7464C1n8L2L3r2j4P6L6j3m2L0j3K9q1Q6m2l4M4K5l5J6j5J5m6J1O6o3k8O6L1n5
$$ 31 -27 5 38 -54 -68 8 44 31 -11 19 6 35 -46 40 -2 -36 8 33 -2 14 -1 14 -32 -21 45 -18 -46 20 51 -4
7494dm1K9l7Q4k1m1m9NP4k4L9r6Q2J0K1q8R9j1j0Kj2j0K2j5L4Lj0m5j7Q8o5k6
$$ -4 -45 -16 -53 31 10 -31 -80 -75 -1 -25 14 -82 0 10 31 -57 42 31 21 23 11 1 23 8 42 45 35 -10 -27 61 -4 -30
7526c0K3j8j1J15l7l6j4j9M7q1R3m1k6LJ9K7n4R3m5j1k0rJ7N5m3n3K5N9l5j6J5
$$ -30 -7 -25 -36 79 42 6 -8 -27 20 -61 32 -9 -35 -32 -13 14 -40 53 8 -3 -23 -32 -15 40 -3 -56 -31 28 -7 -23 -8
7557hK6k5M1l9J2k7J9L0m5rj9O4j5o4Q7q8NP9r1Q8lq8R7l6QQl6N3j7r4R7NP2j76
$$ -8 18 -7 34 -5 7 -20 -1 29 -16 -25 -44 20 5 -59 28 -60 -55 24 -67 21 18 -70 27 -9 -1 7 -29 24 7 -87 10 15 87 -89
7591h9Q9L5l1J3o2J4j4L8QM0o5N4o1M7JN5l6k0q3P6l9o1N0JO0m3o5J5kP9l4l3
$$ -89 0 35 4 17 -45 -31 -45 -7 1 41 -24 30 -31 16 17 72 36 16 -67 9 -30 -91 -41 -40 20 -23 -88 -73 -75 4 -30 -63
7623f3R1p5O7k4nqK5m0N6Mn4L9M0o9L0oKRm4K8k5L9J9k2j7%kk8K4j2r8J61n4l0
$$ -63 28 -47 20 -4 -9 -17 8 -32 24 28 -26 13 53 -16 14 8 10 19 -25 3 -22 17 36 14 -3 -3 -5 -33 -9 -21 -119 42 -12 -42
7657d2R5l7L5q8nm9Q8Jm0K7l8L7KN8o9k3j6R6p6k2N1LJ2J9n2M3k6RK6Kn1K3M0
$$ -42 53 16 51 -37 -42 -91 -3 -2 -42 -15 -53 -16 -14 44 -25 -48 -64 32 -44 -66 -15 -12 0 19 -33 10 -16 -7 19 21 -30 -7 33
7690C3n3j7J02j09M5k9oN4p6N0k5K3N1K1q4J0N9n8J8n0M3J5k4M3k6oj4J6nl1N
$$ 33 -20 -37 65 -44 1 -28 -34 20 -56 -6 -31 -8 43 64 -20 -10 49 -9 9 -41 2 17 -7 36 10 4 -10 6 1 -30 -25
7721b5K0l1J1k1jj5N8m0J5K4K5j8J3k3rk6MN0L0m1j2l0N1K0p3Q9o8J0k5%M9J1
$$ -25 -5 -36 -25 -46 -47 -62 -4 -44 -29 -5 20 2 15 -8 -17 -43 -39 11 41 0 -12 -42 9 29 -44 45 -23 -13 -38 -38 11 22
7753B2l4Pk8L6nj6N4kPn3jK6m8P1J9o0k4K6J7N8r9K1O1k6k2K6K7j01N9m3m6O2
$$ 22 -12 -5 -33 3 -2 -18 36 34 41 -12 -13 13 -35 36 55 -5 -29 -3 14 72 -27 -6 55 29 7 33 60 -41 18 -25 -71 -9
7785iM8Kr3M5lOk3K7Km8L5O5n6O0m9n7J06r9M5M8l9J4n5L9m8M3j6J4k5j0K6kL8
$$ -9 39 41 -52 -7 -10 -4 -27 0 2 -46 -11 54 -2 58 9 -48 58 -41 4 52 13 27 -28 11 -37 6 -10 4 -21 -31 -5 -7 31
7818C1N7j00M4j9k6K0j4Rm1K6m8oP2l0M0K0m3qjk8R0l2l6M6j8m7Q1k4m3k5M4K8
$$ 31 88 -12 32 13 -13 7 -7 2 -39 -13 -61 -67 5 -25 15 35 -8 -16 -17 -45 45 13 -23 23 5 -42 39 15 -28 -53 -9 19
7850A9Jm3k6O6m9LL3j2K6k1K6m3nM5k4m4M6K9l2K5l8L6j3M0pj02J30j03k6L9M
$$ 19 20 -23 -49 17 -32 -29 4 -8 18 -3 23 -20 -25 20 -4 -48 -2 27 -5 20 -18 18 5 45 38 -64 66 -37 -63 -24 -20
7881b0Rk9O8nk3J4M1j7j3l1mK2kk1L4l6M5o3Q2o4j3JO4k5O2l9o4J1K4L9m8P9p8
$$ -20 -11 -40 28 23 0 14 55 38 25 -6 -10 12 10 -11 23 -13 32 -31 51 -13 -26 -25 39 14 76 37 -27 -16 8 47 -1 78 0
7914@Lk7N8r5N9jl6P1j4n2N9k4K1o0R5l3l7%J0QO4r2K5J3jk2Mk1KL7j0J9K6m3
$$ 0 3 -24 34 -61 -2 -3 -39 32 18 -34 25 1 22 -38 57 24 -13 -13 -3 5 69 -23 2 15 14 -8 -4 -25 -23 14 4 23 49 6
7948Fq6K9K3%K5j3n8N1j1J4k0R1r6J2O8qj8l7oJ2J2l7L6M9Lm5M6p3N0J6j5k6n0
$$ 6 -80 -51 -28 -28 -3 -16 -74 -23 -34 -20 -40 51 -45 -33 35 27 9 -28 -34 -22 -10 -47 -11 38 41 -4 42 -31 19 35 20 -6 -56
7981e6LJ24j06K7O0j6l5Rn1L2M7l8m6k3N4j5JL6m0PQ3j00NP9j01N6l0%rJ7N0k9
$$ -56 -53 71 -35 -8 52 36 1 10 -41 -9 38 0 -46 -69 -15 -30 -29 7 -33 -26 57 -43 -38 41 -60 -4 -34 -34 -43 -26 24 -5
8013ej9R3q3j%m9O8o8M2J2P9j09KPKl0R5j7rK1o4%L4k1j4M6o6N0KJ3K1pq9Q2K8
$$ -5 -24 69 -14 -15 -15 -64 4 -64 -22 -10 69 -40 -38 -31 -29 -59 36 19 10 31 -33 -33 1 -20 -34 12 -54 -4 -2 11 32 25 -64 18 46
8048D6l6k8K4rl5NN2q5L4O4l7MQn6J9RL9k4J9n4M0P2o4J0Nk8M2m5J4Q8m0J3j7
$$ 46 10 -18 6 -3 -38 -33 19 -66 -32 32 -5 -1 7 -49 -30 -21 18 -6 13 -41 -1 71 7 17 22 -6 36 -9 5 93 53 66 49
8081D9K1mp4%LQL4l7L1l2J7NL1lo2O8ko7M9O9j34K1N9l2lr1O8l3L7L6n6O1r3L5
$$ 49 70 66 -8 -8 -5 3 37 0 31 -1 16 21 52 49 -13 55 53 -14 35 104 -30 -9 50 18 15 -76 -8 -41 -4 32 -24 37 -56 -21
8115b1N2Rn2l4N1j7%J8j4Nm1J03p3n8J9N8j5%ML6k8J0Lkj6J04j01P1m7J4j0K7
$$ -21 31 40 -12 -46 5 -12 -12 6 -8 -3 -44 59 -14 -72 -53 5 -10 -10 -6 30 2 12 15 13 -3 101 0 71 24 38 28 55
8147E5n3r4O5O1j4NL7o0oj1J3l5N1j8L8p9l3P1LrRj1k7J13Kp6Oj7NpM3J3l3p5
$$ 55 2 -92 -27 34 20 25 62 2 -4 -15 -2 -37 14 -4 34 -45 -78 -7 -4 -13 -4 -15 -42 71 73 -3 3 -14 -9 -16 27 40 7 -68
8181f8N3N5m4kK1p5J1J2j5P2
$$ -68 -15 40 -4 -6 15 -60 -49 -37 -52 20
8191B0
$$ Imaginary data points
##PAGE= N=2
##DATA TABLE= (X++(I..I)), XYDATA
0@%%%%%%Qj6J6k4L2l2M0n6O4q0J04j20J43j67J92k24K56k96L44l92M48n14N83
$$ 0 0 0 0 0 0 0 8 -8 8 -16 16 -16 24 -32 32 -48 56 -64 79 -88 104 -120 136 -160 184 -208 240 -274 309
29C09o61P47q36R38j053J175j310J461j621J798j998K214k452K715l004L330l693
$$ 309 -352 395 -441 497 -556 619 -691 770 -851 947 -1051 1163 -1289 1426 -1578 1752 -1941
46a941M097m560N089n699O419p273Q311r612J1283j3534J6749k1742L0649n1386
$$ -1941 2156 -2404 2685 -3014 3405 -3868 4443 -5169 6114 -7420 9329 -12413 18236 -33150
60c3150J85766J09333l59998j81067K1477K51962K34159P3487k04754k79528j21318
$$ -33150 152616 261949 -98049 -279116 -257639 -5677 228482 301969 97215 -182313 -303631
71c03631J57410K61813J68449p0448k45191k29629O389K26632K49118N2128j71970
$$ -303631 -146221 115592 284041 213593 -31598 -261227 -254838 -28206 220912 273040 101070
82A01070k59527j20447J23547K59743J55499o6621k19173j92163j6532J88195
$$ 101070 -158457 -278904 -155357 104386 259885 193264 -25909 -218072 -234604 -46409
92d6409K35879O7975j61562k34078j09104R5955K22712J68708m1640k19821j93516
$$ -46409 189470 257445 95883 -138195 -247299 -151344 71368 240076 198436 -21385 -214901
103b14901J768J75979J96953O4194j23583k14531j15565Q6891K04372J44604k7796
$$ -214901 -213133 -37154 159799 223993 100410 -114121 -229686 -142795 61577 206181 178385
114A78385j78573j85354k5832J63676K00117N7848j19812j89113j08087O4614
$$ 178385 -188 -185542 -211374 -47698 152419 210267 90455 -98658 -206745 -142131
124a42131J90160J46525k9828j68581j55755k3398J24389J79028P9818j01304
$$ -142131 48029 194554 164726 -3855 -159610 -183008 -58619 120409 200227 98923
134I8923j90856j03186O6666J67608J31070j1166j50417j60453k4601J27422J59742
$$ 98923 -91933 -195119 -128453 39155 170225 159059 8642 -151811 -176412 -48990 110752
145A10752O1246q0036j58715j06756M3731J57925J28353j0040j32396j44074l6028
$$ 110752 171998 91962 -66753 -173509 -129778 28147 156500 146460 14064 -130010 -166038
156a66038J08308J60014O5372q3274j49075q9242L6951J33612J22361J902j23139
$$ -166038 -57730 102284 167656 84382 -64693 -153935 -116984 16628 138989 140891 17752
167A7752j35226l0343R2573J36735P0027o0407j43383r6182L7217J30537J07847
$$ 17752 -117474 -147817 -55244 81491 151518 91111 -52272 -148454 -111237 19300 127147
178A27147l3j05321j24646l6105Q5730J29161O0187n3827j20221q9828J8617J16569
$$ 127147 127114 21793 -102853 -138958 -53228 75933 136120 82293 -37928 -127756 -109139 7430
190G430J10911M497j01008j14457l3822P2914J20380O3604n1141j17705p8714
$$ 7430 118341 122838 21830 -92627 -126449 -53535 66845 130449 79308 -38397 -117111
201a17111K2139R9270R6505J3918q5483j11579l6941O8104J09646N8718l9228
$$ -117111 -94972 4298 100803 114721 29238 -82341 -119282 -51178 58468 117186 77958
212G7958j06150q2249J6464R9284R1074O413p7381r6410l7146N5789J02620N8532
$$ 77958 -28192 -110441 -93977 5307 96381 102794 25413 -70997 -108143 -52354 50266 108798
224A08798l6057r5934p4027Q196Q5211R0505J4587p4910r4970l2264N3199R1658
$$ 108798 72741 -23193 -97220 -89024 -3813 86692 101279 26369 -68601 -100865 -47666 43992
236D3992N4804k9227q9418p0902Q735P7417P9385J6709o0660q8572l9102M6686
$$ 43992 98796 69569 -19849 -90751 -82016 -4599 74786 91495 30835 -57737 -96839 -50153
248e0153Q9472N2763k7019q1124o7124M131P2520P6899J4081n7645p8245l4851
$$ -50153 39319 92082 65063 -16061 -83185 -79054 -6534 70365 84446 26801 -51444 -86295
260h6295L7101P9689N4142k0330p6459o4417J843O4716P2613J8569n2912p7356
$$ -86295 -49194 30495 84637 64307 -12152 -76569 -74726 -10010 62603 81172 28260 -49096
272d9096l3126L7735P3082M7116j6811o7102o1185j639N9376O7892J8484m5267
$$ -49096 -82222 -44487 28595 75711 58900 -8202 -69387 -71026 -11650 56242 74726 29459
284B9459p0772l6085L0936P1423M7886j6704o4102n5835j656N3280O3366J8772
$$ 29459 -41313 -77398 -46462 24961 72847 56143 -7959 -63794 -65450 -12170 51196 69968
296F9968m1833o5282l3095K6088O3135M7375j0171n9748n6393l440N0710N9869
$$ 69968 28135 -37147 -70242 -44154 18981 66356 56185 -3563 -59956 -63396 -12686 47183
308D7183J8672l7701o1916l2501K4993N9400M2462r172n2284n1814p312M4530
$$ 47183 65855 28154 -33762 -66263 -41270 18130 60592 51420 -864 -52678 -59990 -15460
320a5460N8227K0494l4333n8473l2441K1170N6168M2538q069n0499m8364n879
$$ -15460 42767 63261 28928 -29545 -61986 -40816 15352 57890 49821 -678 -49042 -54921
332e4921M0641N2509K0195k9628n4250l1890J7797N1633M1308m354m6553m8458
$$ -54921 -14280 38229 58424 28796 -25454 -57344 -39547 12086 53394 49040 2487 -45971
344d5971p586L9207N0666J8659k7888m9928k9985J5580M7718L8743l287m2031
$$ -45971 -53557 -14350 36316 54975 27087 -22841 -52826 -37246 10472 49215 45928 3897
356C897m4877r533L4156M8743K0897k5283m8650k9765J4260M5016L7126k432l9435
$$ 3897 -40980 -50513 -16357 32386 53283 28000 -20650 -50415 -36155 8861 45987 43555 4120
369D120m2086q941L1043M4301K0384k1164m4948l0124J1269M2539L6747o64l6951
$$ 4120 -37966 -46907 -15864 28437 48821 27657 -17291 -47415 -36146 6393 43140 42476 5525
382E525m1080j0005K9429M2673J9315k0029m1348k7729R148L8193L4892J396l3432
$$ 5525 -35555 -45560 -16131 26542 45857 25828 -15520 -43249 -34101 4092 38984 40380 6948
395F948l9386j1377K6410M1139K0325j7942m0173k7617Q492L6479L2910J432l0523
$$ 6948 -32438 -43815 -17405 23734 44059 26117 -14056 -41673 -33181 3298 36208 37640 7117
408G117l6509j1309K3386L7864K0224j4971l7373k7661O133L4732L2712K442k9231
$$ 7117 -29392 -40701 -17315 20549 40773 25802 -11571 -39232 -33099 1633 34345 36787 7556
421G556l5213j1219K1661L5844J9259j3357l4398k6005M556L1058L1108M321k6196
$$ 7556 -27657 -38876 -17215 18629 37888 24531 -9867 -35872 -31316 -258 30850 35171 8975
434H975l4213j2520J9933L4884J9586j2299l3138k5124L971K9143K9168M666k3569
$$ 8975 -25238 -37758 -17825 17059 36645 24346 -8792 -33916 -29945 -802 28366 33032 9463
447I463l1696j2818J7252L2338J9805j0068l1085k5197K486K7790K8847N068k2542
$$ 9463 -22233 -35051 -17799 14539 34344 24276 -6809 -32006 -29520 -1730 27117 32185 9643
460I643l0400j2268J5859L0063J8853q308k8315k4154Q40K5163K7696O381k0415
$$ 9643 -20757 -33025 -17166 12897 31750 23442 -4873 -29027 -28187 -3024 24672 31053 10638
473A0638k9429j3017J4684K9216J8657p904k7007k2906N08K3143K5804O778j8100
$$ 10638 -18791 -31808 -17124 12092 30749 22845 -4162 -27068 -26560 -3417 22387 29165 11065
486A1065k7382j3346J2416K7317J8836o146k5737k2695l34K2128K5269O746j7153
$$ 11065 -16317 -29663 -17247 10070 28906 22760 -2977 -25672 -26006 -3878 21391 28137 10984
499A0984k6002j2801J1182K5287J7966m765k3244k1962j671K0173K4495P539j5909
$$ 10984 -15018 -27819 -16637 8650 26616 21851 -1393 -23355 -25026 -4853 19642 27181 11272
512A1272k5294j2844J0579K4439J7255m548k2016k0595j851J8293K2863P952j4012
$$ 11272 -14022 -26866 -16287 8152 25407 20859 -1157 -21752 -23603 -5310 17553 25505 11493
525A1493k3644j3093Q935K2934J7280l394k1094k0270k037J7726K1678P448j3005
$$ 11493 -12151 -25244 -16309 6625 23905 20511 -583 -20853 -22890 -5164 16514 23962 10957
538A0957k2089j2510P632K1212J6710k204j9118j9666l172J6084K1228Q078j2114
$$ 10957 -11132 -23642 -16010 5202 21912 19708 590 -19076 -22248 -6164 15064 23142 11028
551A1028k1427j2320P266K0146J5854j871j7727j8493l460J4346J9933Q423j0328
$$ 11028 -10399 -22719 -15453 4693 20547 18676 949 -17544 -21004 -6658 13275 21698 11370
564A1370k0185j2587N796J9238J5760j197j6927j7897l580J3681J8839Q016r401
$$ 11370 -8815 -21402 -15606 3632 19392 18195 1268 -16629 -20209 -6528 12311 20327 10926
577A0926j8585j2280M812J7494J5357J0j5457j7443m379J2492J8257Q365q738
$$ 10926 -7659 -19939 -15127 2367 17724 17734 2277 -15166 -19545 -7053 11204 19569 10831
590A0831j7877j1656M330J6308J4594K69j4146j6355m645J0986J7050Q746p162
$$ 10831 -7046 -18702 -14372 1936 16530 16799 2653 -13702 -18347 -7361 9689 18435 11273
603A1273j6984j2079L423J5841J4162N18j3234j5582m606J0155J6066Q323o425
$$ 11273 -5711 -17790 -14367 1474 15636 16154 2920 -12662 -17268 -7113 8953 17276 10851
616A0851j5492j1565K299J4294J4075J479j2306j5213m973R366J5350Q422n946
$$ 10851 -4641 -16206 -13907 387 14462 15941 3635 -11578 -16551 -7185 8165 16587 10641
629A0641j4888j0978K273J3303J2896J728j0950j4261n395Q131J4697Q468m909
$$ 10641 -4247 -15225 -12952 351 13247 14975 4025 -10236 -15631 -7500 7197 15665 10756
642A0756j4047j1095J518J2838J2595J760j0283j3394n305P311J3744Q270m245
$$ 10756 -3291 -14386 -12868 -30 12565 14325 4042 -9352 -14657 -7346 6398 14668 10423
655A0423j2910j0717P28J1479J2442K655r611j3216n380O759J2989Q144l717j2225
$$ 10423 -2487 -13204 -12476 -997 11445 14100 4489 -8727 -14107 -7348 5641 13785 10068 -2157
669b157j0196N43J0664J1551K659q323j2389n912N943J2534Q148l167j1534r952
$$ -2157 -12353 -11810 -1146 10405 13064 4741 -7648 -13560 -7617 4917 13065 9898 -1636 -11588
683a1588K5R960J1330K690p924j1582n429N099J1439P981k298j0894r734l62R268
$$ -11588 -11563 -1603 9727 12417 4493 -7089 -12518 -7419 4020 12001 9703 -1191 -10925 -11287 -2019
698b019J0785L288p221j1422n675M995J0986P426k040r826r320p14Q457J0271
$$ -2019 8766 12054 4833 -6589 -12264 -7269 3717 11143 9103 -723 -10043 -10757 -2300 7971
712G971L322o472j0472n885M075J0396P810j749r442q958r58P774R770L573n922
$$ 7971 11293 4821 -5651 -11536 -7461 2935 10745 8996 -446 -9404 -10362 -2588 7182 10755 4833
727D833j0067n474L573R434P422q03q672r112j220P320R482L536n183r642n730
$$ 4833 -5234 -10708 -7135 2299 9721 8918 246 -8866 -10086 -2766 6716 10252 5069 -4573 -10303
742a0303L219R199P039q95p768q237j780O475R220L721m891q923n609K509Q412
$$ -10303 -7084 2115 9154 8259 491 -7746 -9526 -3051 6169 9890 4999 -3924 -9533 -7024 1388
757A388P426l37p743q156j600O035Q364L868l968q622n623K254P885O843R2o713
$$ 1388 8814 8477 734 -7422 -9022 -2987 5377 9245 5277 -3345 -8968 -6714 1171 8014 8106 1393
773A393p973k220N540Q425L689l682p891n569J628P511O731J72o396p325k110
$$ 1393 -6580 -8800 -3260 5165 8854 5172 -2719 -8288 -6660 851 7582 7754 1358 -5967 -8077
788h077M619P724M257l222p784n298J327O797O537Q03n878p394k238M575P131
$$ -8077 -3458 4266 8523 5301 -2483 -7781 -6454 343 6880 7683 1805 -5589 -7827 -3252 3879
803C879L868k536o919n560R26O477O247O89n091o847k716L932P184L914k482o516
$$ 3879 7747 5211 -1708 -7268 -6342 135 6382 7071 1980 -4867 -7583 -3651 3533 7447 4965 -1551
819a551n043N24N700O235R81m970o409k341L258O372M161j749o436n237O24N446
$$ -1551 -6594 -6070 -370 5865 6846 1876 -4533 -6874 -3616 2756 6917 5168 -1268 -6505 -5881 -435
835d35N625J337m233o415k732L259O150L757j599n484n010r6N215N670J189m107
$$ -435 5190 6527 2294 -4121 -6853 -3594 2556 6313 4714 -770 -5780 -5876 -661 5009 6198 2091
851B091n742k685K573N962L981j457n536m640Q3M382N303J722l640n774k661K444
$$ 2091 -3651 -6336 -3763 2199 6180 4723 -813 -5453 -5370 -988 4315 6037 2397 -3377 -6038 -3594
867c594N398L725q08n077m881k71M475N138J483l161n323k932K043N440L673r51
$$ -3594 1804 5529 4721 -356 -5237 -5508 -1033 4105 5588 2427 -2896 -5828 -3785 1655 5328 4377
883D377m620m285n71L760N075J693l078n136k571J745M830L839n33m670m254l37
$$ 4377 -243 -4528 -5099 -1339 3736 5429 2351 -2785 -5356 -3611 1219 5058 4525 -145 -4399 -4736
899d736L449M527J768k400m876k901J698M652L397m07l885m255r03L449M671J616
$$ -4736 -1287 3240 5008 2608 -2268 -5169 -3471 1181 4578 4171 286 -3969 -4872 -1423 3248 4864
915D864k345m424k723J101M350L600l12l738m032p11K804M294J981k074m476k720
$$ 4864 2519 -1905 -4628 -3527 823 4423 4111 373 -3659 -4370 -1566 2728 4709 2635 -1841 -4561
931d561J304L894L389J18l542m042q89K781M157J762j768l954k897R06L876L352
$$ -4561 -3257 637 4026 4144 602 -3440 -4329 -1548 2609 4371 2603 -1351 -4248 -3342 534 3886
947C886J8l188l703j261K536M122J936j784l873k566O12L456L384K43k953l672
$$ 3886 3904 716 -2987 -4248 -1712 2410 4346 2562 -1311 -3877 -3265 191 3575 3818 865 -2807
963b807j141K227L674K113j385l717k773O26L383L096M05k726l599j287K126L644
$$ -2807 -3948 -1721 1953 4066 2681 -1036 -3809 -3183 200 3296 3701 975 -2624 -3911 -1785 1859
979A859J845j188l284k701K32L098L238M52k540l438j249J751L428K179j169l304
$$ 1859 3704 2516 -768 -3469 -3237 -139 3099 3551 1011 -2427 -3676 -1925 1503 3682 2513 -791
995g91k581L09K755L085O61k369l275j364J718L203K058q39l051k745O2K832L004
$$ -791 -3372 -3063 -308 2777 3438 1069 -2206 -3570 -1852 1351 3409 2570 -481 -3226 -3164 -332 2672
1012B672O05k106l138j450J403L236K002p54k930k462r8K470K950P71k003l118
$$ 2672 3277 1171 -1967 -3417 -2014 1222 3224 2470 -460 -2922 -3020 -550 2400 3171 1168 -1950
1028a950j342J322K990K103o28k780k483j70K316K806R42j790k980j523J162K914
$$ -1950 -3292 -1970 1020 3123 2495 -285 -2768 -2938 -622 2184 3126 1336 -1644 -3167 -2005 909
1044I09K036m75k616k439k72K256K744Q09j709k695j430R34K722K100m84k480
$$ 909 2945 2470 -146 -2585 -2857 -601 2143 2952 1243 -1452 -2882 -1948 774 2874 2390 -90
1060i0k352k86K025K661R84j580k720j508J026K573J884k28k316k387l50J971
$$ -90 -2442 -2728 -703 1958 2942 1362 -1358 -2866 -1840 733 2617 2389 73 -2314 -2664 -693
1076f93K500R56j362k459j712Q66K481J959j81k176k304m74J809K492J046j296
$$ -693 1807 2763 1401 -1058 -2770 -1904 577 2536 2355 179 -2125 -2599 -790 1702 2748 1452
1092A452k491j532P09K303J905n6k000k195n77J552K457J075j160k308j620O18
$$ 1452 -1039 -2571 -1862 441 2346 2290 290 -1905 -2482 -930 1527 2602 1442 -866 -2486 -1868
1108a868K186J869L4j885k167n36J459K270J074r67k210j570M10K137J846J27
$$ -1868 318 2187 2221 336 -1831 -2367 -908 1362 2436 1469 -741 -2311 -1901 236 2082 2209
1124B209j725k144o49J322K250J129q40k237j529M11J918J850K13j643k141o75
$$ 2209 484 -1660 -2309 -987 1263 2392 1552 -685 -2214 -1803 115 1965 2178 535 -1606 -2281
1140b281J224K124J142p61k017j600K59J885J869J54j409k025p40J108K030J142
$$ -2281 -1057 1067 2209 1448 -569 -2169 -1910 -25 1844 1998 589 -1436 -2176 -1068 962 2104
1156B104o65j846j572J40J706J778L50j383j970p95J086J934J108n42j870j479
$$ 2104 1439 -407 -1979 -1839 -133 1645 1995 612 -1358 -2153 -1067 867 1975 1433 -437 -1916
1172a916J68J563J759L69j374j833p85R02J908J154m70j676j527L5J505J702L67
$$ -1916 -1748 -185 1574 1943 569 -1264 -2049 -1147 761 1915 1445 -231 -1758 -1723 -218 1484 1851
1189A851j210j783p11Q31J662J177l85j622j491OJ334J711N63j217j724q89P62
$$ 1851 641 -1142 -1853 -1022 640 1817 1432 -190 -1681 -1675 -341 1370 1933 716 -1008 -1897 -1135
1206a135J720J229m22j541j357j35J369J587M42j004j658q71O32J642J153k99
$$ -1135 585 1814 1392 -149 -1506 -1641 -272 1315 1757 753 -905 -1776 -1144 498 1651 1352
1222A352j443j335j45J259J557M87r76j584q08N13J566J157k57j333j444j03J220
$$ 1352 -91 -1426 -1571 -312 1245 1732 756 -828 -1636 -1123 443 1600 1343 10 -1434 -1537 -317
1239c17J429N77r24j509q44N04J476J083j26j314j312j64J022J541M29p40j405
$$ -317 1112 1689 765 -744 -1588 -1084 392 1475 1349 35 -1277 -1441 -419 1122 1551 811 -594
1256e94r27M01J453J085q4j251j324k33J087J315N80p06j357r07M00J239J107
$$ -594 -1521 -1120 333 1418 1334 83 -1241 -1474 -387 928 1508 802 -555 -1462 -1062 177 1284
1273A284j8j105j220l36Q35J446N83p00j299q55L09J203J177m7j109j175l11P97
$$ 1284 1266 161 -1059 -1395 -560 886 1469 769 -530 -1385 -1076 127 1304 1257 148 -1027 -1338 -541
1291e41J265O81o06j291r05L16J243R80J15j025j166m72Q83J308N07m91j196q59
$$ -541 724 1405 799 -492 -1397 -1081 162 1142 1257 232 -934 -1406 -523 785 1292 801 -395 -1254
1309a254K29J132R78R2r13j178l76O50J315N87m83j143q29J77J033J029J28r09
$$ -1254 -1025 107 1085 1177 264 -914 -1290 -640 675 1262 779 -364 -1193 -1016 17 1046 1174 265
1327B65j067m58O76J176N94l43j133q25Q1R93J030J62q59j063m02O36J044O16
$$ 265 -802 -1260 -584 592 1186 843 -290 -1115 -1034 -41 989 1151 292 -771 -1173 -537 507 1123
1345A123k87j087p40P0Q48J005J98p66j055m40N67J000O45k41j116p10P9Q50R49
$$ 1123 836 -251 -991 -921 -73 932 1130 364 -691 -1131 -564 436 1081 840 -276 -986 -907 -57 892
1364H92J67o54j068l87M06R98O65j67r96q50Q9P86R53K17o52j029l64M49R38O00
$$ 892 1059 405 -663 -1050 -644 354 1019 852 -144 -994 -905 -119 834 1051 399 -630 -994 -545 393 993
1384I93k33q44q20N4P27Q34K49n79r19m71M49R19O28k37q36p86N0O64Q17K67n07
$$ 993 760 -84 -904 -850 -123 711 960 381 -538 -1009 -560 359 987 750 -86 -872 -822 -158 659 926 419
1405D19q94m53K91R55O04k01p15q11m8O29R09K80n22q96m04L22P85O20j12p55
$$ 419 -475 -928 -637 318 922 721 6 -805 -853 -224 685 965 443 -453 -857 -535 250 870 758 3
1425Cp76k7N87Q17L36n35q33m89K82Q13O82j31p67o87j20O75P37L10m91p57m40
$$ 3 -773 -800 -213 604 940 405 -428 -917 -635 178 860 729 -38 -725 -845 -170 567 877 386 -371 -811
1446h11J90P50N95j5o52p27j31O08O56L69m38o93n07K69O15O50j7o69o69j17M74
$$ -811 -621 129 724 709 57 -670 -801 -193 463 832 394 -299 -806 -537 78 728 711 42 -627 -744 -270
1467b70O64L99l31p02n67K46N82O59o0n45o12k10M06P17L44k86o85m00O8N79O11
$$ -270 394 793 462 -240 -807 -561 21 680 620 75 -537 -747 -341 376 720 434 -251 -651 -583 -4 607
1488F07O9n19o51j84M35N66L84k63o86m31J34O06N08L5m94n43k95M14O21L40j74
$$ 607 676 157 -494 -678 -243 323 707 444 -242 -673 -539 67 575 610 116 -427 -722 -308 313 653 479
1509D79o30n14O8N85O51Pm57o24j57L33N72L87k57n58m64L2N57N06J08m09o35
$$ 479 -151 -665 -597 -12 639 646 189 -435 -592 -259 313 700 443 -115 -579 -547 10 516 624 215 -420
1530d20j69J87P20L46k04n46n45J24N49M80jk92n29l01L20N12L02n7o11m20M7
$$ -420 -589 -402 318 664 460 -86 -631 -507 42 522 521 229 -300 -601 -281 231 533 476 -135 -555 -508
1551e08L95N91J74m08n68k57L12M65K97o9m63m89kM97M15J93l70n04l04K98N42
$$ -508 -113 478 652 244 -324 -581 -269 196 493 424 -39 -528 -530 -33 382 575 205 -299 -603 -305 237
1572B37L04j65m04m15o1M48M72O6k82m74k70K05N09L84r0n98l46L9L25N18Q0k97
$$ 237 541 376 -28 -443 -504 -56 416 482 200 -274 -544 -339 170 554 464 -134 -480 -441 -116 402 482 185
1594A85m22l11K37N44J72j7l86m48m3L17N56O7k70m25k90K50L52M40j49m26l59
$$ 185 -237 -548 -311 233 405 388 2 -446 -489 -172 384 451 181 -244 -534 -284 68 508 359 -67 -426
1615d26K0K77M81J47k56m16l24J58M17L69k7m31l40r9L33M08J25j76m55k45J30
$$ -426 -406 -129 352 499 243 -173 -497 -339 78 447 420 -11 -351 -450 -117 291 416 240 -215 -460 -330
1636c30M62K73k9l52l46j47L23M29J88k29m39j84N8M03L46j10l50l32Q4J26M39
$$ -330 132 405 376 24 -322 -469 -146 283 471 242 -197 -381 -323 80 426 316 -34 -366 -282 -156 283
1657B83J53j97m26j76P8L87K72q2j92n08m9L60L11J55j41l58k08O4L54K66l9l32
$$ 283 436 239 -187 -363 -285 102 374 292 100 -408 -457 -97 214 369 228 -130 -338 -274 80 346 307 -25
1679b5j79j22K01L41K17j75l92k57J22L79J98M0l27l26k2K01L34Q7k4l44k71K0
$$ -25 -204 -326 -125 216 433 258 -134 -391 -269 110 308 348 21 -305 -327 -126 208 295 271 -73 -344 -324
1701c24L51K63R3l05l53J9J13L70J42j82l26j31L6K62K51M9j94l88L1J45K43K20
$$ -324 27 290 383 78 -275 -256 -143 227 369 187 -139 -270 -234 28 279 328 134 -254 -223 -78 165 385
1723C85j91l26k11Q6K45K40Q0k50l49j7J42L29J43j21k65j36n8K51L51m2j90k42
$$ 385 194 -132 -343 -257 -12 228 308 58 -291 -308 -166 163 306 185 -80 -216 -274 -23 328 286 96 -146
1745a46j58J51K65J86r9k69k24l4L33K89kj45l28j35J56L14J68j43k34k31j1K53
$$ -146 -304 -153 112 298 199 -70 -294 -328 5 294 292 147 -181 -316 -160 154 322 179 -55 -286 -297 -44
1767d4K67L5j38k33j86J89K48J29q9k40j70L0J44K80M8j92k75j00J07K59K02r4
$$ -44 223 258 120 -113 -299 -110 138 267 178 -62 -232 -202 -58 222 270 78 -197 -297 -190 69 271 177
1789A77j95j96L8J76J60J02j75k72j12J67K42O8rj66j78J3J05K36R7j78j77r7
$$ 177 -18 -214 -176 0 160 262 87 -185 -297 -130 112 180 171 5 -173 -160 -55 181 278 100 -77 -174
1811a74O2J50J80k8j85k07lK07J18J11j43j78j43P8K65J03L2k74j56M5J22J45
$$ -174 -112 38 218 190 5 -202 -205 2 120 231 88 -90 -233 -155 110 213 245 -29 -185 -140 -18 127
1833A27Q0n8k85n9Q2R8J79N3j86k03j4J89K05j7n4k36j28N0K05J72K1k62j14n2
$$ 127 207 149 -136 -195 -113 -15 164 217 31 -172 -186 3 208 191 137 -99 -227 -177 28 200 221 -41 -155 -207
1857b07J30K61Op0j71r6J3K06J07%j79j26n6J51J03J82j12j72k63J22J90J28k0
$$ -207 -77 184 190 120 -51 -147 -134 72 179 179 0 -126 -182 -31 72 254 142 -30 -293 -171 19 147 127
1880A27j52j62JJ19J73O3p0k41o8O6J95J13K2j44k08oQ6J98Q4o2k43oj6J56J71
$$ 127 -25 -187 -186 -67 106 169 99 -142 -210 -144 51 164 186 42 -166 -172 -86 112 196 134 -109 -115 -131 25 196
1905A96o3m4j95k9Q8J21J38j39j38r5L9J76J27m2j20q3j11R8J65R7j5j92j08Q9
$$ 196 133 89 -106 -135 -47 74 212 73 -65 -160 -121 55 182 140 20 -63 -174 -76 89 186 171 -21 -129 -40
1929d0K3J15P3j88n4j33J76R9R8m8j64j05OJ53R9L2j59n0p8K8K17N7j10o3j62
$$ -40 -17 98 171 -17 -71 -204 -28 71 169 121 -43 -148 -142 11 110 142 -17 -67 -145 -117 100 157 47 -16 -178
1954a78J9J45J67O3j18k70nR1K13K4p2j04o3nJ38Q0l0j3j44o7R6J43k3P3j91k2
$$ -178 -159 -14 153 216 98 -172 -177 -86 127 151 79 -25 -88 -93 45 125 95 82 -62 -129 -33 110 87 160 -31 -53
1980e3j11J46J56O4j01j89KK6R6J0P7q9j42k3R9J31L8r7j64k9Q1J65J0L3j60q1
$$ -53 -164 -18 138 202 101 -88 -86 -60 36 46 123 34 -108 -131 -32 99 137 40 -124 -153 -72 93 103 136 -24 -105
2006a05JJ43k1J47j01p7j19M5R9M8Rj04p1J3P0L6J25j39o1m2M3R4N2K3p8l0q6
$$ -105 -104 39 18 165 64 -13 -132 -87 12 60 69 -35 -106 -93 -23 13 138 -1 -62 -104 -61 33 85 108 30 0 -86
2033h6P1J26L6j67np3M0O1J38m2q7j07l0J05M9P5q3q1o4j2J49P9J5j08j20K8O4
$$ -86 -15 111 147 -20 -25 -98 -58 3 141 99 12 -95 -125 -20 29 104 21 -60 -124 -136 13 92 107 -1 -121 -93 -29
2060b9J1J27o9m3j68J18Q8l1J04r4o6m8N4J11k8Ol4j8p1M5J00L4q6l5j14J06Q2
$$ -29 -18 109 40 -3 -171 -53 35 4 108 14 -52 -100 -46 65 37 43 9 -9 -80 -35 65 99 13 -22 -136 -30 52
2087E2M9p4o8mN0jR5Nq7r5M5L0j4J01n2o4m1RQ7M1J8o1J2q7l1P6J21l0q3J4p7
$$ 52 101 27 -41 -45 5 4 99 104 17 -78 -33 -3 -17 84 32 -32 -73 -64 23 64 82 21 33 -54 -85 -9 112 82 -1 13 -64
2118f4LJ44k0o5Jr3K8Q0N1j5m7k0p9J13RJ9l1j08K5L6J01J7m6l2q0K2KJ48j3j4
$$ -64 -61 83 63 -2 -1 -94 -66 14 65 50 3 -17 -96 17 26 45 14 -94 -69 -33 68 85 39 7 -73 -51 -49 99 86 72
2148G2j66P2pj9P9M0p7n5J1O9mj8M0j13m1P2O5N4m8k4p0K5O1PL3oj08l0M7O0K5
$$ 72 -94 -22 -29 -48 31 71 -6 -61 -50 19 15 -3 37 -76 -117 -45 20 74 26 2 -68 -43 18 25 58 52 -56 -86 -39 21 46
2179D6mm7p3O0J0N2m2J3p7N1Kj6J18k0j06jL0N0r1R7J0o1p7N4k6J15orj24jJ16
$$ 46 42 -5 -78 -18 -8 44 2 15 -62 -11 -9 -25 93 73 -33 -34 -4 46 -45 52 62 1 -76 -22 -48 67 61 52 -72 -73 43
2210D3M1n4k3p6L9l8K4O8O0k6j26m6L2O4J27m6n9q6O8M2J24q4o3M5o4K8QK0l5
$$ 43 84 30 7 -69 -30 -68 -44 24 84 58 -68 -114 -82 -18 109 63 4 -82 -14 28 152 68 5 50 -14 14 22 42 7
2239Gj2o0J5O6L0n9oJ05j90R1O7K5l3m1j6k3O2M5J5j08M0r9Q9P9n0j2k5o5K1N1
$$ 7 -5 -65 -50 16 46 -13 -19 86 -104 -13 54 79 46 5 -11 -34 28 73 88 -20 20 -79 10 89 39 27 2 -63 -42 9
2269IJ6O5m9n9nmm8J36j8m9l7J3J1O7pnm4l5N5k7P2j1o4m0KM7J9N1m4m6l0R2j3
$$ 9 25 90 41 -18 -23 -27 -75 61 43 -6 -43 -30 -19 48 41 36 -8 -43 12 -15 57 46 -18 -58 -56 -9 10 61 17 -29 -59 33 20
2302B0ONl5j4j4L1O1qk8lo3P2l0J00j30jL9O0n3K3K6l7p6L0m1M9J12p4q9P0m3
$$ 20 26 31 -4 -18 -32 -1 60 52 24 21 -42 30 0 100 -30 -31 8 68 15 38 64 27 -49 -19 -60 -11 101 27 -62 8 -35
2333c5J3L1j3J8m7qn4J17j8J3%j15O4K9J4NL4m8k0J2M6n2L0n5M2k2J3J7j0N0j11
$$ -35 -22 9 -4 14 -33 -41 -95 22 4 17 17 -98 -34 -5 9 14 48 0 -20 -8 38 -14 16 -39 3 -19 -6 11 1 51 -60
2364f0pQ3l8KP1j05N6N6m2m4R6l2J8p5K7MN8n8JQNl4O1K6r4mn0N3N7k9j1M4j29
$$ -60 -67 16 -22 -20 51 -54 2 58 16 -28 68 36 54 -21 6 10 68 10 11 19 24 -10 51 77 -17 -21 -71 -18 39 10 -1 43 -86
2397h6O5J8l4M9Pk5p6LQ1J0K6n9mL4j8k4L7J1p1J2K9O2qK0%q4m9nJ11K5m6o6m8
$$ -86 -21 -3 -37 12 19 -6 -82 -79 2 12 38 -21 -25 9 -9 -33 4 15 -56 -44 -15 47 39 59 59 -25 -74 -79 32 57 11 -55 -103
2430a03M7L8K7k7K8LLl2qJ6R7q7Okl8L8J7j4rn9L1M3l2O7q7L%k2K6M4j7p0N3j7
$$ -103 -56 -18 9 -18 10 13 16 -16 -24 -8 89 2 8 6 -32 6 23 9 0 -59 -28 15 -17 50 -37 -34 -34 -56 -30 14 -3 -73 -20 -37
2464c7N2L7r2K4Pl0J9L6J2k1rr1R4R3n8MJq6j5Q4L5Qo6j7okK5n3N2j1n8N5j7Q1
$$ -37 15 52 -40 -16 -9 -39 -20 16 28 7 -2 -93 1 94 36 40 41 -45 -60 24 59 67 1 -16 -22 -24 1 -52 0 -11 -69 -14 -31 50
2498E0Jk4p6qN6N7j9Op4K7k1r7R8M0jm5L9l8OO8lj3l9J0nM1jk0o3L0J2J2J4k0
$$ 50 51 27 -49 -57 -1 56 37 43 -31 -4 -25 -122 -24 16 15 -30 9 -29 -23 45 42 29 -10 0 -5 36 35 15 -48 -18 -6 6 20 0
2532@O4k6q5L8K0M3l5Nnj05R1K2j4lKK6k3k9M9k7j6ml5N1M2J7j07pk7N4NRM2n0
$$ 0 64 38 -47 -9 11 54 19 24 19 -86 5 27 13 10 12 38 15 -14 35 8 -8 -12 -47 4 46 63 -44 -51 -78 -24 -19 -10 32 -18
2566a8L7M2o4L9m1M1l8P%o6J78j79nJ04l7k9J5n2RL6K3j7K2K4Nj9m8K0m2J09q5
$$ -18 19 61 -3 36 -5 36 -2 5 5 -61 117 -62 -67 37 0 -29 -14 -66 -57 -21 2 -15 7 31 36 17 -31 -11 -53 56 -29
2597b9R5n7m2R9l2%j7o7O8mOjL2Mr6k2J6O2O1k0n6n9mJ14o5K6k3l9M2M4m4L7o9
$$ -29 66 9 -33 66 34 34 17 -50 18 14 20 19 51 55 -41 -63 -47 15 76 56 0 -59 -63 51 -14 12 -11 -50 -8 36 -8 29 -40
2630d0j0Pll5L7O6j4J1o4pJ15p2m5Q6Nn3N7m7l6N6n1K5M6n7O3l2N0r4K4j4Q6j8
$$ -40 -50 -43 -46 -81 -44 22 8 19 -45 -52 63 -9 -54 32 37 -16 41 -6 -42 14 -37 -12 34 -23 40 8 58 -36 -12 -26 60 42
2662D2n6LL6nl0k6N7K7j15R1l9O0l9j7o1J9P3l6lM3Nj5K3l9oLK6K1m9N8Qk6N5
$$ 42 -14 -11 25 20 -10 -36 21 48 -67 24 -15 45 6 -11 -72 -53 20 -16 -19 24 29 14 37 -2 -8 -5 21 42 -7 51 59 33 88
2695H8o7l1pJ1M4jj0lOm0pJ0j3J4Q7j15O4l2P2l1n4J9p9M7n0J60o9kl3o6P6M1
$$ 88 21 -10 -17 -6 38 37 27 24 30 -10 -17 -7 -20 -6 81 -34 30 -2 70 39 -15 4 -75 -28 -78 82 13 11 -22 -88 -12 29
2727B9k4k9m2j8P5R3q8L5o6O6p3rM3k0QL8l6K7n3R1o0J1oJ7lO7n8rJ6n7O3j1k8
$$ 29 5 -24 -66 -84 -9 84 -4 31 -35 31 -42 -51 -8 -28 -20 18 -18 9 -44 47 -13 -2 -8 9 6 73 15 6 22 -35 28 17 -11
2760a1km8P1Pm8O7o6N6k7o2M4P4q0Q4p8l7J06r0J8K5m7J02n9M8rj7q8R7m3m8M3
$$ -11 -13 -61 10 17 -31 36 -30 26 -1 -63 -19 55 -25 59 -19 -56 50 -40 -22 3 -44 58 -1 47 38 21 -67 30 -13 -61 -18
2791a8K6N4k8l3o2Q0j1l3N0n0J4l8J12o8L7k5O1n4Jk4jL3QK6p0pJQ3j02M0l5O0
$$ -18 8 62 34 1 -61 19 8 -25 25 -25 -11 -49 63 -5 32 7 68 14 15 -9 -10 23 31 57 -13 -20 -19 64 -38 2 -33 27
2823B7j6L0L6o0K8j3k9J0l3k1M7j0Q0o0l1r3J13l1k9jQ6J7l3k3j2rK7m1J0Q9l8
$$ 27 11 41 77 17 45 32 3 13 -20 -41 6 -4 76 16 -15 -108 5 -26 -55 -56 30 47 14 -9 -21 -30 -3 -44 -34 55 17
2854A7J2Np5N4j4q7J28L9l0m1K0k4M3k6k3J9m3L9o4J44q7m6j2Q1l4k7M3l4L9O3
$$ 17 29 34 -41 13 -1 -88 40 79 49 8 28 4 47 21 -2 17 -26 13 -51 93 6 -40 -52 29 -5 -32 11 -23 16 79
2884G9k0j4J2Kn5m8N8K7q1M4o0N3PJ2kRm5mL3j0R1j31O3M2m0qj3J1m6K3PK7P6
$$ 79 59 45 57 59 4 -44 14 41 -40 4 -56 -3 4 16 14 23 -22 -26 7 -3 88 -43 20 62 22 14 1 12 -34 -11 -4 23 99
2917I9m2n2m5J2Q7p9pK4m2L7nN5k6Ol9OL3l7Nj1O5q4J6J8j3O1o5M9Nj06J07l8
$$ 99 57 5 -40 -28 59 -20 -27 -3 -45 -8 -13 42 16 22 -17 -11 22 -15 -10 -21 44 -40 -24 -6 -19 42 -23 26 31 -75 32 -6
2949fK7j7M2kl0j5K7j7rk8N0o2K9k0K0P0o8LJ6K4n6N4n2N1p0K4N1j4nM0p0M4J7
$$ -6 21 4 46 44 14 -1 26 9 0 -28 22 -40 -11 -31 -11 59 -9 -6 10 34 -22 32 -20 31 -39 -15 36 22 17 57 -13 31 48
2982D8p1M7nk9P7k3l1rk9O5m8K1LN6j02j5M0n6N8L7m9j1k3N8j1M6o9pK2OKJ4l1
$$ 48 -23 24 19 -10 67 44 13 4 -25 40 -8 13 16 72 -30 -45 -5 -61 -3 34 -15 -26 -49 9 -2 44 -25 -32 -10 -4 -2 12 -19
3015a9J4N9o2k1J28p4m7K9o4K1L2LN4mqn8P2J5p5rK5qN8p7k6Q5n5K2M1o2J9m8
$$ -19 -5 54 -8 -29 99 25 -22 7 -57 -36 -4 -1 53 49 41 -17 55 70 -5 -14 11 3 61 -16 -42 43 -12 10 51 -11 8 -40
3047d0J9K6j3mL1pmNk5KL0ML3p0l7Q9q8R1n5K1K8L1l4p4O5n0J1M0M8l3kn5n4Q7
$$ -40 -21 5 -8 -12 19 12 8 13 -12 -10 20 24 57 -13 -50 39 -49 42 -13 8 36 67 33 -41 24 -26 -15 25 73 40 38 -17 -71 16
3081A6J2o7Q2j5j7l4o3P8j3l0K5rQ4l4QQJ7l7o8J8kmmRjL1M3o0K0Lj2J2l5Q3n3
$$ 16 28 -39 43 28 11 -23 -86 -8 -21 -51 -26 -35 49 15 23 31 48 11 -57 -39 -41 -45 -49 -40 -41 -10 33 -27 -7 -4 -16 -4 -39 44 -9
3116ikN6m7P0Mq4J0j5K2k8R4p1L6p4M5j3q9J03l0Kk2M8J3Ml5qQK9K8p3M6j5L0
$$ -9 -11 45 -2 68 72 -12 -2 -17 5 -23 71 0 36 -38 7 -6 -95 8 -22 -20 -42 6 19 23 -12 -20 -12 17 45 -28 18 3 33
3149C3n2mQ8p7K4m9k1N2j2O4j9M1o9jm5L1m3J00j04N1K5j7k2M9n3J0l4K6J4n3
$$ 33 -19 -23 65 -12 12 -37 -58 -6 -18 46 27 68 -1 -2 -47 -16 -59 41 -63 -12 13 -4 -26 23 -30 -20 -54 -28 -14 -67
3179f7L6L2J4M6p7M3o3L4l3N2p3L4N6K7M5j77N4%K4j8J1k0O2m1j6R6o6M3kk7p0
$$ -67 -31 1 15 61 -16 27 -36 -2 -35 17 -56 -22 34 61 106 -71 -17 -17 7 -11 0 -20 42 1 -15 81 15 58 56 29 -41
3210d1Q4j06J25Ln7K6Pp7Q9j6o6NP5n9K2J3L2n4K5n9L1o6P3m4pOk5J34n9k8j6
$$ -41 43 -63 62 65 8 34 41 -36 53 37 -29 -24 51 -8 14 27 59 5 30 -29 2 -64 9 -35 -42 -36 -61 73 14 -14 -30
3241c0M8nLj5J4l2N0n6J3O5j24R4m4M0o7JN4n9M6k4M2J9km8Lj8L6j9j4J21n0j2
$$ -30 18 13 16 1 15 -17 33 -23 -10 55 -69 25 -19 21 -46 -45 9 -50 -4 -28 14 33 31 -17 -14 -32 4 -15 -29 92 42 30
3273C0J9l1n1k0L9J9Qj9RQn1M7m1P8j5m4rk2K6K7q0P2L3q3L6ML2o2O8q6R7p7L1
$$ 30 49 18 -33 -53 -14 5 13 -6 3 11 -40 7 -34 44 29 -15 -24 -46 -20 7 -73 -1 32 -51 -15 -11 21 -41 27 -59 38 -39 -8
3306hP3m4o5J12q5P5j9o4N9n9L2m7R9q4R0n9j8PN2k9L6p1N3k8j3J7l1M2o6P2K7
$$ -8 65 21 -44 68 -17 58 39 -25 34 -25 7 -40 59 -25 65 6 -12 -5 47 18 54 -17 36 8 -5 12 -19 23 -43 29 56
3337E6k3l1Omq3P7L3%o9J8M6p5O1k0m3O3p5R8r0%O0Lj7k7L2j6k6Q1l5qJ4j7J5
$$ 56 33 2 8 4 -79 -2 31 31 -38 -20 26 -49 12 -8 -51 12 -63 35 -55 -55 5 8 -9 -36 -4 -20 -46 35 0 -8 6 -11 4
3370DJ0L3o0P9j10N3K0k8O2p0N8m7K4l9L2N4j55J87j18Lj2PM0m1m2P5p7qR7r0
$$ 4 14 47 -13 66 -44 9 29 1 63 -7 51 4 28 -11 21 75 -80 107 -11 -8 -20 -13 27 -14 -56 19 -58 -66 31 -59
3400e9L0n2J09o2k2M9rO7K5om0jl0L5k6mlJ7K8o3L9k2l5k4L8K8J7n1j4Q1m7J4
$$ -59 -29 -81 28 -34 -56 -7 -16 51 76 70 30 29 -1 34 8 4 1 18 46 -17 22 0 -35 -59 -21 7 24 -27 -41 40 -7 7
3432Gl1Qj9J7O0J0l9KM4r1J6k0K5J7J1p1K2j8P4J0o8J11j15L4jK0m5PJ11j12k1
$$ 7 -24 -16 -35 -18 42 52 13 15 59 -32 -16 -36 -11 6 17 -54 -32 -50 24 34 -34 77 -38 -4 -5 15 -30 -23 88 -24 -45
3463d5M7J0j6kK8l7k3L5Q4m3m8RK9o6j8RQ2o8J9j0P0l4j6K7L7o2K5Nn0L3p2M0
$$ -45 2 12 -4 -6 22 -15 -38 -3 81 38 -10 -1 28 -38 -56 -47 35 -33 -14 -24 46 12 -4 23 60 -2 23 28 -22 11 -61 -21
3495b1M8j8N9m6k3L9l5Rn6%R1l2J7l4k7mO1n9K4l4j3N6l3JM6%j14O4K3j6QJ5k6
$$ -21 27 9 68 22 -1 38 3 12 -44 -44 47 15 32 -2 -29 -33 28 -31 -7 -41 -54 2 -31 -30 16 16 -98 -34 -11 -27 -19 -4 -30
3528c0j2O4Lpk2K0M0o9J2m0R4o4mJ0oM1NMj0j7Mj8Kk8Q1q6j4M8JpKKP3j80Q7j3
$$ -30 -42 22 25 18 -4 16 56 -13 -1 -41 53 -11 -15 -5 -11 30 35 39 29 12 16 -2 0 -28 53 -33 -47 1 2 -5 -3 -1 72 -108 -21 -34
3564c4J2oP3l9J5j1j3J6l5Oj8J7l2Q4M0j13N6o1k2M6N3l0N3o7J1Oj5j7j6N4%Q
$$ -34 -22 -28 45 6 21 10 -3 13 -22 -16 -34 -17 -49 35 75 -38 18 -43 -65 -19 34 4 57 -10 1 7 -8 -25 -41 13 13 21
3596B1n7K2O%P2l5m1K7o8P9k0qk6K2k5Ln1J8Q4p8j7J01n7L1j3j4L0Mm2K4J4Jk8
$$ 21 -36 -14 -8 -8 64 29 -12 15 -53 26 6 -2 -28 -6 -31 -28 -79 -61 23 -55 -72 29 -28 3 -10 -24 6 10 -32 -8 6 7 -21
3629b1M8L0q1M6Oo2J6N3L5j5p5J6J3r8P5m6J7J6n4M3Q1q3P7ll2n3J12k5j8K8k9
$$ -21 27 57 -24 22 28 -34 -18 35 70 55 -20 -4 9 -89 -14 -60 -43 -27 -81 -38 43 -40 37 34 2 -51 61 36 18 46 17
3660A7O6l2n3m5N6K6ml8%L6Rn8M1kp2N3mrmJ5N3r2O5j18J04qo7rO8J3l1J7M1o8
$$ 17 83 51 -2 -47 9 35 31 -7 -7 29 38 -20 21 19 -53 0 -4 -13 -17 -2 51 -41 24 -94 10 2 -65 -74 -6 7 -24 -7 34 -34
3694c4J31j21J1k4K3krN9o2J8L8j3m8M2J2K0o9N3K7o6N0J9p7L1qj1K6L9jq6P5
$$ -34 97 -24 -13 -37 -14 -16 -25 34 -28 -10 28 15 -33 9 21 41 -28 25 52 -14 36 55 -22 9 1 -10 16 55 54 -32 43
3725D3o0J15j56J29l0o5L3l9J8j7L2Q%k4K0j0M1J2n7KPJ6O1o4j2K2n4O0M3p3j1
$$ 43 -17 98 -58 71 41 -24 9 -30 -12 -29 3 11 11 -13 7 -3 38 50 -7 -5 2 18 79 15 3 25 -29 31 74 1 -10
3756a0N2m5J0L8nno2RrM8Rm4j0L9J3J05j26ql8O5J9l9K7l2L2l1J1Kq1J21r3P0
$$ -10 42 -3 7 45 40 35 -27 -18 -27 21 30 -14 -24 15 28 133 7 -1 -39 26 45 6 33 1 33 2 13 15 -66 55 -38 32
3788C2L1j08R5k9l2J6K4p2O5nK7Qj2p8L6L0j8mpN2n9M2m3K4l6J6j9L0J9l3nM4
$$ 32 63 -45 50 21 -11 5 29 -43 22 17 44 52 40 -38 -2 28 10 6 -1 51 -8 34 -9 15 -21 -5 -24 6 25 -8 -13 31
3820C1k1j3L0jL6p4k0N0kj0l6N3k1K5ol1qK0K7l7l0K4K4o4Q8q2N5k7Q4q0N5p7
$$ 31 10 -3 27 26 62 -12 -32 18 16 6 -30 23 2 27 21 -10 -18 2 29 -8 -38 -14 10 -54 34 -48 7 -20 64 -16 39 -38
3852c8Q0Np7M5m8L6m6Q9n7K3K0n9N9m5l6M2K4M0q4pJ4N4l7j6qL0PomK2m1KQ7l5
$$ -38 42 47 -30 15 -33 3 -43 46 -11 12 32 -27 32 -13 -49 -7 17 57 -27 -34 -20 34 -3 -19 -27 3 10 4 0 22 -19 -17 70 35
3886C5o5K8m1J0J34p1l2J0j6jK0Mn4M0lJ5l3L6r0P1j01J32Jk4rm3K4m4N6RK5n7
$$ 35 -30 -2 -43 -33 101 30 -2 8 -8 -9 11 15 -39 1 -2 13 -20 16 -74 -3 -104 28 29 5 -4 -47 -23 -67 -11 -2 23 -34
3918c4pP5l9O1j0l4j11J19k3mj0L5NmJjj5j0O2n0M2n4L4L1j6M7j07JP2r2L5k6
$$ -34 -41 34 -5 56 46 12 -99 20 -3 -7 -17 18 23 19 20 19 4 -6 56 6 48 -6 28 59 43 90 -17 -16 56 -36 -1 -27
3950b7m1J23m1m1O0q2J4j4l1O7N0k0M8p7n8N6n1Q3l4k0m2N0P9p1l2J13m6J9m6
$$ -27 -68 55 14 -27 33 -49 -35 -49 -80 -13 37 17 65 -12 -70 -14 -65 18 -16 -36 -78 -28 51 -20 -52 61 15 34 -12
3979a2j0J4N3m7OK0lK3mm8O3j10M8N6k4J2n7P0p4M2m7OK1Lk4M5k1M5m9N5K3o8
$$ -12 -22 -8 45 -2 4 24 21 44 40 -8 55 -55 -7 49 25 37 -20 50 -24 18 -29 -23 -2 1 -23 22 1 46 -3 52 75 7
4011Gj1J5n9M7j6pKL1om9L0m0O2jk9L8n3NK5J4l6O8k7Lj0J9l6M5p9L7JNM4n1J
$$ 7 -4 11 -48 -1 -17 -24 -22 9 3 -46 -16 -56 6 5 -24 14 -39 -34 -9 5 -31 37 10 13 3 22 -14 31 -48 -11 -10 -5 39 -12 -11
4046a1KN5o5L3j6k6Qk4M1q0Q9J0m0KM9o7KJ0J0QL3l0J5l6k1RJ4K3rj5P8Qp5L0
$$ -11 -9 46 -19 14 -2 -28 -20 -44 -3 -83 6 16 -24 -22 27 -40 -38 -28 -18 -10 23 -7 8 -28 -49 -40 -26 -3 -12 -27 51 59 -16 14
4080A4qN8n4J4mk8K8m5PL8q2R2j8n6R0Kk2j7m4k4O5j4JL3J5m2K0p4J28o4L2p9
$$ 14 6 64 10 24 20 -8 20 -25 -18 20 -62 30 12 -44 46 48 26 9 -35 -59 6 -8 -7 26 41 -1 19 -55 73 9 41 -38
4112c8N4J9O1j00k6j4j1Q8j6k4l8JL5k3M4ml7M1L%j0l5L3j9O8n2ML7n1L0m7jN9
$$ -38 16 35 96 -4 -30 -44 -55 33 17 -7 -45 -44 -9 -32 12 8 -29 12 15 15 5 -30 3 -16 52 0 4 41 -10 20 -27 -28 31
4145C1r4L0Q0r5J8M8j8K6k4k4J7NNK0lm2PRM4r1J02k5o8L6JkM4n4j8L0j3L4m9
$$ 31 -63 -33 47 -48 -30 18 0 26 2 -22 -5 0 5 25 22 -20 -13 -4 40 -51 51 26 -42 -6 -5 -7 37 -17 -35 -5 -18 16 -33
4178c3J2K8K1j52N5O3M0ok5p1K6L5L4n1k8J7R9l4m%K4r3j1N7M4q3J2M6k6L2J2
$$ -33 -21 7 28 -124 -69 -6 34 28 3 -68 -42 -7 27 -24 -52 -35 64 30 26 26 50 -43 -54 3 47 -36 -24 22 -4 28 40
4209D0j11Q3j1M2N0r7J4m0L9qn1O6Jj4k0L0m1M8Ql2L3m0K1o3N7J9K4l8K3j16J14
$$ 40 -71 12 1 43 93 -4 10 -30 9 1 -50 16 17 3 -17 13 -28 20 28 -4 29 -11 10 -53 4 23 47 9 32 -84 30
4240C0n0lN0k0Lm5rJ22j16JO7L8j14j4O2J0m5oL1LM8q1M0jK3K7o1JP4q6k4N9j3
$$ 30 -20 -23 27 7 10 -35 -44 78 -38 -37 30 68 -46 -60 2 12 -33 -39 -8 -5 43 -38 2 1 24 51 -10 -9 65 -21 -45 14 1
4273A%J5k8N6n0M8n9m3R1L8r1L5m8J9K0j6n5P3J1n7j8M9o5J09oj24J14K6o3M1
$$ 1 1 16 -12 44 -6 42 -17 -60 31 69 -22 13 -35 -16 4 -12 -67 6 17 -40 -58 -9 -74 35 29 -95 19 45 -18 23
4303B3k3R1j09K7J0ol9JL2m3J3K1J7l4L0j3j5mN7o9j7O3j5J9k0K6L0n3KJ4J0k
$$ 23 0 91 -18 9 19 13 -26 -25 7 -36 -23 -2 15 -19 11 -2 -17 -21 36 -33 -50 13 -2 17 -3 23 53 0 2 16 26 24
4335B4m5N9k2Rk3KnL8j7O4j30O0%M3q7K0M7o6J7m8P4Q4j41O1m2%M3k8l5Q0o1L0
$$ 24 -21 38 16 25 2 4 -1 37 20 84 -46 14 14 57 -30 -10 37 -29 -12 -60 14 98 -43 18 -24 -24 19 -9 -44 36 -25 5
4367El3oJ3K4K4M2q6L1m8J1k5Q0k1m5N4k3j3m3J4j8J23r7L7M2J8r9k5R2n7%M8
$$ 5 -28 -34 -21 3 27 69 -17 14 -34 -23 -48 32 11 -34 20 -3 -16 -59 -45 -63 60 -37 0 42 60 -39 -64 28 -29 -29 19
4398A9L6o0L9prnQoj0n7P5l3O8l9Oj07J5J28j06J12J5j20N5q9M2K7K1J4J0o7K
$$ 19 55 -5 34 27 18 13 21 15 5 -52 23 -10 58 19 25 -82 -67 61 -45 67 82 -38 17 -72 -30 -3 18 32 42 -25 -23
4429b3R6j41P9nn6P7RKK4m8J4k5k4k6K5Q5j4k8j2L7RJ7o2J4k1OqK1J7n6P6r4Q4
$$ -23 73 -68 11 6 -50 27 36 38 62 14 28 3 -21 -47 -22 63 49 21 9 46 55 72 10 24 3 9 1 22 39 -17 59 -35 49
4462D9m8l3P0m0O9n1o3J3M3M1l9rk7K9L1k9k0k1N2k4NK8l7K9oo7O1p3N3n9M6J0
$$ 49 1 -32 38 -2 67 16 -47 -34 9 50 11 2 -25 4 35 6 -14 -35 17 -7 -2 26 -11 18 12 -55 6 -67 -14 -73 -27 -17
4494a7Q0o9O3j4n4k3O3j7K4p4RJ8pQ4p9kLJ0l3m8J04rj6M5k1p0rO0qN0k4j0k7
$$ -17 63 -6 57 43 -11 -34 29 12 36 -38 -29 -11 -18 66 -13 -15 -12 -2 -35 -83 21 12 -4 41 20 -50 -59 1 -7 43 19 9 -18
4527a8L8J8l9N6o7l5M3M5n1M0m3kJ0NK6m9L1j7M4k0Kl4L0k5L7k1L7l1o0L3J7J4
$$ -18 20 38 -1 55 -12 -47 -4 41 -10 30 -13 -15 -5 0 26 -23 8 -9 35 15 17 -17 13 -12 25 4 41 10 -50 -17 0 14
4559A4l1K4J4Ln0mK1k8L6m9Q8nl7K0K7p1PlJM0j4lL1k7n2k3K4M0N8k0o7mM6K2
$$ 14 -17 7 21 24 -26 -30 -9 -37 -1 -50 38 33 -4 16 43 -28 -21 -24 -23 17 3 0 31 4 -48 -71 -47 -7 51 31 -36 -40 6 28
4593B8n2k3N4J0J5l3Q0m3p1L2j4J8J3mj2m3P0l5L3K1o3M5k3j0N2j1n8Q4q7M4k6
$$ 28 -24 -47 7 17 32 -1 79 36 -35 -3 -17 1 14 10 -2 -45 25 -10 23 44 -19 26 3 -7 45 34 -24 60 -27 17 -9
4624il8K6mK4o5M3mK0k0N6l5jO3l9o1P4Kj0k4J0m0K9rk1j6J6O0m7J1K9o7L5M2
$$ -9 -47 -21 -25 -1 -66 -23 -27 -7 -27 29 -6 -7 56 17 -44 30 32 22 -2 8 -32 -3 -12 -33 -49 -33 27 -20 -9 20 -47 -12 30
4657C0k2N4m1kl1n7J24o8K9J0l7J7OK2k3lQk7k1N1L1j04M2N4n9M1%K0r9O9QK5
$$ 30 8 62 21 19 -12 -69 55 -13 16 26 -11 6 12 34 11 8 16 -11 -32 19 50 -54 -12 42 -17 24 24 44 -55 14 22 47
4689D7n3J7m0K8o1QO1Kl5M3o5P9n4K1J6l1k7J5O4m9L2K9Jl0Mk7J5Mn4L2j4J5K0
$$ 47 -6 11 -29 -1 -62 -54 7 9 -26 17 -48 31 -23 -2 14 -17 -44 -29 35 -14 18 47 48 18 22 -5 10 14 -40 -8 -22 -7 13
4722A3j0j8L2n3Q8o8QM3m1K7n9L5L4q7O6j9j0L1l1J9l2M2m9N9l2mK7J9m2k5J02
$$ 13 3 -15 17 -36 52 -16 -8 35 -6 21 -38 -3 31 -56 10 -9 -19 12 -19 0 -32 10 -39 20 -12 -16 11 30 -12 -37 65
4753F5o4l1K9l3R9j31K6K4j1L6J6j6Ln4M4J6nk4J4o4Q2M0p6jj9P7j1l6j1K4l5
$$ 65 1 -30 -1 -34 65 -66 -40 -16 -27 9 25 9 12 -42 2 18 13 -11 3 -61 21 61 -15 -16 -35 42 31 -5 -16 8 -27
4784b7J1J9k5J8J8j6Q2r6P3l6j4Lk2l5jL1Q0o5%OKK7r0J4OM2j5M9RL8j30K6N7
$$ -27 -16 3 -22 -4 14 -2 80 -16 57 21 7 10 -12 -47 -48 -17 63 -2 -2 4 6 33 -57 -43 -37 5 -10 39 48 86 -44 -18 39
4817C9o4KK0L2qq9Q8r5R4J3m7Op2R6m2M0oJ3L6p9L2k1nJj0K5l0L3K6j8MJ7j8J1
$$ 39 -25 -23 -3 29 21 -68 20 -75 19 32 -15 -9 -81 15 -27 13 7 20 56 -23 9 -12 -17 -16 -26 -1 -31 2 28 10 14 31 13 24
4851B4n2M6jp4P9j0jm7R2q9M1Mj4L0%o6kM6j5Q4p8l1M5o4L6K5j9mM9m5N1m9k8
$$ 24 -28 18 17 -57 22 12 11 -36 56 -33 8 12 -2 28 28 -38 -40 6 -9 75 -3 -34 11 -53 -17 8 -11 -15 34 -11 40 -9 -37
4884c7O5l1o7R8l8j4M8J%n8%O2k6J1k4J5rl6K2Q2r4O8L6q8K9kP1m1k2l4M6l9j7
$$ -37 28 -3 -70 28 -10 -24 24 25 25 -33 -33 29 3 14 -10 5 -4 -40 -18 64 -30 38 74 -14 15 13 84 43 21 -13 33 -6 -23
4917b3k0JQ1m2O5ko1K5p8k9L6N0K3m5N1m0LO0m4Pn6j1N1m4K3j5K4J3Qkm5M4k4
$$ -23 -43 -42 39 -3 62 60 -1 24 -54 -83 -47 3 26 -19 32 -8 -5 55 11 18 -38 -49 2 -42 -19 -34 -10 3 11 9 -36 8 -16
4950a6J6Lk2l6L1J6M9J1p8M9p5O1m7N0l6N7m8o2R4M4j04O5kn1J5mM1k2j1%%j6
$$ -16 0 3 -19 -55 -24 -8 41 52 -26 23 -52 9 -38 12 -24 33 -15 -77 17 61 -43 22 20 -31 -16 -20 21 -1 -12 -12 -12 -28
4982b8l8R7k2m9o2J53q2J0J03j15P2q0N4l0j9O1J1k7j1L6J2j2l3Q8q3k8M5m8m2
$$ -28 -66 31 9 -40 -102 51 -31 -21 82 -33 39 -41 13 -17 -36 25 36 9 -2 34 46 34 1 89 6 -22 23 -25 -67
5011f7L6J0M0k5LM1jk8l9qK1k4N7pn5N9m5j2R2n4rj1j7Q0o4K9k4K4R9j31NJ17
$$ -67 -31 -21 19 -6 -3 38 37 9 -30 -38 -17 -41 16 9 -46 13 -32 -44 48 -6 -15 -26 -43 37 -27 2 -22 2 101 -30 -25 92
5043I2l9p5Q3p5l3M0lN8l4j4O5o8J0K1m2L3n3Q3m7K3Pm2j3L6m8K6NL5J7q0J8M2
$$ 92 53 -22 61 -14 -47 -7 -10 48 14 0 65 -3 7 28 -14 19 -34 49 2 25 32 -10 -23 13 -35 -9 -4 31 48 -32 -14 28
5075B8q1L8J10j13L7o7N6Ml4O4j1MM6j19M3j4j6J9m3N5n9J0J21j21K3N9k5j30
$$ 28 -53 -15 95 -18 19 -48 8 12 -22 42 31 35 81 -38 5 -9 -25 -6 -49 6 -53 -43 78 -43 -20 39 14 -116
5103a16O4O4k5l0J7JlR5o8K9j1m9Q0m1M2M2j42O2K6j08M2K2l3M0oM3kr6P0k8M7
$$ -116 -52 12 -13 -43 -26 -25 -28 67 -1 28 17 -32 48 7 49 91 -51 11 37 -71 -29 -7 -40 0 -6 37 35 -61 9 -19 28
5134B8l9O0r0K6J6m8N5m6RO8q1R6o0J9L0k8j1k5L2K0j7o4Q8q9K8j3L6Rj6J8N2
$$ 28 -11 49 -41 -15 1 -47 8 -38 -29 39 -42 54 -6 13 43 15 4 -21 11 31 14 -50 38 -51 -23 -36 0 9 -7 11 63
5165F3K8n0p5K9K2K9p1J7K7MJ4m9L0%jk5O0j12LJ15p5K1J0m0O6n3k8J22j40M4
$$ 63 91 41 -34 -5 17 46 -25 -8 19 23 37 -12 18 18 17 -8 52 -60 -57 58 -17 4 14 -26 40 -13 -41 81 -59 -15
5195a5nK2J4m1N1jk1J3J6l1K5M3o4rk0M9l8K1j5k1RN5%n6kQ7l5m1M5l6L2m0O1
$$ -15 -20 2 16 -25 26 25 4 17 33 2 27 70 6 -3 -23 26 -12 9 -6 -27 -18 37 37 -19 -21 66 31 -10 35 -1 31 -9 52
5228E2Kr8P7j7M3l8k2K5p4N3rpJ7l1O3m9O1l9j1j%m4L0L2k8l8Q3m9K0l5mL9mR
$$ 52 54 -44 33 16 59 21 -1 24 -50 3 -6 -13 4 -27 36 -13 48 9 -2 -3 -3 -47 -17 15 -13 -51 32 -17 3 -32 -36 3 -1 8
5262Hk7J00j53L1Q4p5O3jk7m0J8N1l9J02j08M3m0qN1N1p6j2J6K2K4p6l6J10n0
$$ 8 -19 81 -72 -41 43 -32 31 30 3 -37 -19 32 -7 95 -13 30 -10 -18 33 84 8 -4 12 34 58 -18 -54 56 6
5291FJ0Jj6k9O7j5n6j0nO0j01J09L3q3j7K6PRNk2L2m4M5q5J53j13K2Km4O3l6P7
$$ 6 16 17 1 -28 39 24 -32 -42 -47 13 -88 21 54 -29 -46 -20 -13 -4 1 -21 11 -33 12 -73 80 -33 -11 -9 -53 10 -26 51
5323E1Rpp8J3j2J5J9Jl1J8L9Lk8k2R3l6qJ8j01P1PQo9M5m9L1k2O2Jp3L3j0J5K6
$$ 51 60 53 -25 -12 -24 -9 10 11 -20 -2 37 40 12 -10 83 47 39 57 -44 27 34 42 -27 18 -31 0 -22 40 41 -32 1 -9 6 32
5357C2p9J00l5J7n0k7N7k3O7o2Pn1P3no2Q9r1N8Ml1oQJ9r1L9L3k3J3mR1n4L2m5
$$ 32 -47 53 18 35 -15 -42 15 -8 59 -3 4 -47 26 21 -41 48 -43 15 19 -12 -18 -10 9 -82 -43 -10 -33 -20 -24 67 13 45 0
5390@k5M1mJ7j5m1N9L3j3n0k1J10j62Q5p2P5J5m9k5P8j0k0J8jl4O7r7L0N1n0j6
$$ 0 -25 16 12 29 14 -27 32 65 52 2 -19 91 -71 14 -58 17 32 -17 -42 36 26 6 24 23 -11 56 -41 -11 40 -10 -26
5421b6p0N9P1p4M3qJ9o9J04q9K3N4m1K1o5N8j3J4K7%j06J11r7K6k2M6LMK8r9R8
$$ -26 -96 -37 34 -40 3 -5 14 -55 49 -40 -17 37 -4 17 -48 10 -3 11 38 38 -68 43 -54 -28 -50 -4 -1 3 31 -68 30
5452C0K2n2l0L6%J06r0o5l1L0N6J2lp3M2l0P3m1j3L3n8P8o3N2j15K7M9J7nJ4m
$$ 30 52 0 -30 6 6 112 22 -43 -74 -44 12 24 21 -52 -10 -40 33 -8 -21 12 -46 32 -31 21 -94 -67 -18 -1 -6 8 4
5483Dk5l3O6k2J7J0o7M3ml1N0LK5j8j9P0r3K3J4Ok2L3n4O9o7L8k5L2k9j6l0J05
$$ 4 -21 -54 12 -10 7 17 -50 -7 -11 -42 8 11 36 18 -1 69 -24 -1 13 19 -3 30 -24 45 -22 16 -9 23 -6 -22 -52 53
5515E3k3K2k9j2J3L6m0m6J15j10k7N9J3j6o4R0L0p3Jj8N3k8npl6K4l0P9Pl1k2
$$ 53 30 52 23 11 24 60 20 -26 89 -21 -48 11 24 8 -56 34 64 -9 -8 -26 27 -1 -6 -13 -49 -25 -55 24 31 0 -22
5546b2O7J1q7rM6oK8J7L1j19M0J0nL5j5o0O1n2jK2Pn2P2m6O4n8P0r1l6J03M9j00
$$ -22 45 56 -31 -40 6 0 28 45 76 -43 -3 7 2 37 22 -38 23 -29 -30 -8 -1 -53 19 -27 37 -21 49 -42 -78 25 74 -26
5578b6N5n0Q4q2L1J0%l2PO0p4K1k2k5klL4P3j5m0K0Jj09R6j7m3J13m8p5N2k6M8
$$ -26 29 -21 63 -19 12 22 22 -10 -3 57 -17 4 -18 -43 -45 -48 -14 59 44 4 24 25 -84 12 -5 -48 65 17 -58 -6 -32 16
5610A6m4K1m5J15m0K9o1N2m3K7M9o5N0n8l9n8M0J07l7Rl8k1M3j01J24K9o7o5L0
$$ 16 -28 -7 -52 63 23 52 -9 43 0 27 76 11 61 3 -36 -94 -54 53 16 25 -13 -34 9 -92 32 61 -6 -71 -41
5639d1n5J05L2o7N2j5n6%K8l6R4J9k2l1J5k7J9mj0L7j8P9r3j9J5j9L3M2l8o6M7
$$ -41 -96 9 41 -26 26 11 -45 -45 -17 -53 41 60 38 7 22 -5 14 10 0 37 19 98 5 -14 1 -18 15 57 19 -47 0
5670@j8L3J0l6RJ7M4p6K2oM0J2j28J71m2m3k7L2n6O2p1L7OQL6ro0k3Q7oo1P6n9
$$ 0 -18 15 25 -11 -2 15 59 -17 5 -1 39 51 -77 94 52 9 -18 14 -42 20 -51 -14 -8 0 36 27 -33 -56 31 25 -36 40 -19
5703a9Lj1K7l5L2L5k9P7n9LJk4JJ2j9j9K5K5j8k1J4m3O4k0J9K0J3o3K4j1L6m9
$$ -19 -16 -27 0 -35 -3 32 3 80 21 24 25 1 2 14 -5 -24 1 26 8 -13 1 -42 22 2 21 41 54 -9 15 4 40 -9
5735iM7L3l0n1K6M3j09k9J40o7K9J6m5m9J05K5l1r1N2k1N0J3k8Jn8J43j36O%J8
$$ -9 38 71 41 -10 16 59 -50 -79 61 -6 23 39 -6 -55 50 75 44 -47 5 -16 34 47 19 20 -38 105 -31 -25 -25 -7
5765gj4M8m2J5j5oK5L2mo5NJ2Pk2NQ5k9N2r8RRPl1M1J8l3j2k5M0K7o4K2K9n6P
$$ -7 -21 27 -15 0 -15 -21 4 36 32 -33 -28 -16 -9 -31 -26 59 30 82 -16 -7 2 9 -22 19 37 4 -8 -33 7 34 -30 -8 21 -35 -28
5800b8N9k0K1k6k7l7M1Jnk4L4nl3Q1k1j8M2j06J19p3jL6M8o8j1L7J4n9O9p9N4
$$ -28 31 11 32 6 -21 -58 -17 -16 -21 -45 -11 -16 -49 32 11 -7 35 -71 48 -25 -26 10 58 -10 -21 16 30 -29 40 -39 15
5831A5n5N9q2M6K2L4m2Nk8L7L6q6J9M3o8PQ6m7J9nm6Q8%j06M7L1Pn4K5K7p8L9
$$ 15 -40 19 -63 -17 5 39 -3 2 -26 11 47 -39 -20 23 -45 -38 48 1 20 15 -31 57 57 -49 -2 29 36 -18 7 34 -44 -5
5863eN2q5J3n5J06o4P8l0j6N5K8o2L3j7n6L9n9j4L0J3M4L2q5P0Pn8L0l3jM2k6
$$ -5 47 -38 -25 -80 26 -38 40 10 -6 49 77 15 48 31 -25 14 -45 -59 -29 -16 28 60 -25 45 52 -6 24 -9 -10 32 6
5894Fp1RN4M6o4K0l6%K1J03q9Nk7L6j0Mj2nN6p9NQ4l6o4R1q6%K8L8n8N2RK3j02
$$ 6 -65 -56 -2 44 -20 0 -36 -36 -15 88 -1 4 -23 13 3 7 -5 -10 46 -33 -28 56 20 -44 47 -39 -39 -11 27 -31 21 30 53 -49
5928d9N1On8J3N3njM3j47J48q3oN8p1P0J8l5j2Pj7OL2m3M1Jm9M7J4J5q4M5M1p2
$$ -49 2 8 -50 -37 16 11 10 53 -94 54 -29 -35 23 -48 22 40 5 -7 0 -17 -11 21 -22 19 20 -29 18 32 47 -37 8 49 -23
5961b3o0O9K0J2OL1m2n2M3P8r9O0p0N9k8l2K3j7J9j4m8j1J25k4l4q4J58p8lJN4
$$ -23 -83 -14 6 18 24 55 13 -39 4 82 -17 43 -27 32 4 -28 -5 -22 -3 -17 -65 -76 49 25 -9 -93 65 -13 -16 -15 39
5992C9l2m7L0q0L8N3K4n3l4K0J9J2J3K7o7K2L7k3K1k8P2o1J6l9m3K4pQ4n1K0%
$$ 39 7 -40 -10 -90 -52 1 25 -28 -62 -42 -23 -11 2 29 -38 -16 21 -2 19 -9 63 2 18 -21 -64 -40 -47 37 -14 6 6
6023FJ6mj9K2n4n9R5L7j0l7l5M9L8p2JJ1N1l5%m9R2Qq2RJ0K7N1n8M%K1j5K1j6
$$ 6 22 18 -1 21 -33 -92 3 40 30 -7 -42 7 45 -27 -26 -15 36 1 1 -48 44 52 -30 -21 -11 16 67 9 13 13 34 19 40 24
6057B4l9K2k6O6l0p3K2k2R3l2l0M3l0k8O6Pk9jrL1K0j2n5l1L4k9K7l3Q5k9m0M7
$$ 24 -15 7 -19 47 17 -56 -34 -56 37 5 -25 18 -12 -40 26 33 4 3 -6 25 45 33 -22 -53 -19 -48 -21 -54 31 2 -38 9
6089Ij9Kn6j7L6O4%RL4n5M5l1K0o7K4p0O5KqQ1L0r1L1j3m6P3r5K8Q7l6n2J9m5
$$ 9 -10 -8 -64 -81 -45 19 19 28 62 7 52 21 41 -26 -2 -72 -7 -5 -13 68 98 7 38 25 -21 52 -43 -15 72 36 -16 3 -42
6122d2P7p3kR8l9Mk6qOK9k2n3OK5M0qPpj9n3M8Nl0M9l0l2K2L9K4l1l0LN5r8R9
$$ -42 35 -38 -40 58 19 23 -3 -11 -5 24 2 -51 -45 -20 20 12 19 12 -7 -60 -12 -7 -37 12 -18 -50 -28 11 35 4 -26 -23 32 -66 33
6157C3J2k5j4k4O5o3P1k7j2q7J0L3N9l1K7j4j2j0P5q2N1pl4K5k0O0n3J6qL2n6
$$ 33 45 20 6 -18 47 -16 55 28 16 -71 -61 -28 31 0 27 13 1 -9 66 -16 35 28 -6 19 -1 59 6 22 14 46 -10
6188a0k6j6L6l8O7Km0j6O2k8L2Rm4M2%J1k7m8M1p0M4j1j0O9k6l3M7n8J7k4M4q
$$ -10 -36 -52 -16 -54 13 15 -25 -41 21 -7 25 34 -10 32 32 43 16 -32 9 -61 -17 -28 -38 31 5 -28 19 -39 -22 -46 -2 -10
6220a0J9Pj7k0J8lL5r2O2k5P6o1L0K1o4P3m3n2Q9Jl0mn0M8n0J5PL2o4J2N8kn8
$$ -10 9 16 -1 -21 -3 -6 29 -63 -1 -26 50 -11 19 40 -24 49 6 -46 43 44 14 10 -40 8 -42 -27 -20 12 -52 -40 18 16 -42
6253d2l0J22jq2M6o3N0k3K2j7l5P4n5K9k4J02j08O5n7L3K8p3jJ4J7L3K6n0pj3
$$ -42 -72 50 49 -33 13 -50 0 -23 -1 -18 -53 21 -34 -5 -29 73 -35 30 -27 6 34 -39 -40 -26 -9 24 50 0 -7 -20
6283b0N1j5K6m4kPK9K5n2q4Q7j6l8O1m5N4j03N8N5L0p8L0l7k2n9J23L7o3L5n9
$$ -20 31 16 42 -2 -4 3 32 57 5 -79 8 -8 -46 15 -30 24 -79 -21 34 64 -14 16 -21 -43 -102 21 58 -5 30 -29
6313b9lM0Kk2l4N1Pqj5K9j4rP3l1o5j0K1K2L2q5M7LJ5J9j9j4k2P8j26M6O0j5k6
$$ -29 -32 8 10 -12 -46 5 12 4 -11 18 4 -5 68 37 -28 -38 -17 5 37 -48 -1 2 17 36 17 3 -19 59 -67 -21 39 24 -2
6346bl1K1M6l5Qjk0M0ML0p6P3q2M2L9p3L7Ll8M7n3M6j4ML4r0J5j9P6k1N0r4N3
$$ -2 -33 -12 34 -1 7 6 -14 26 30 60 -16 57 -25 17 56 -17 20 23 -15 32 -21 25 11 15 49 -41 -26 -45 31 10 60 -34 19
6379A9k2l3l0J04N6j21QK6jNJ4pN5p4K5J3n5J0MmRN9j7p0N9j6m1K5K6j0L3j2j7
$$ 19 -3 -36 -66 38 94 -27 -19 7 6 11 25 18 73 -1 24 37 -18 -8 -4 -8 1 60 43 -27 32 16 -25 0 26 16 49 37 20
6412B0q2J05L0p6j9K7j0j9P6k1l3m9O6k4l7J21o7J0n2M7j5P0o8n3N0N3j4j7jm1
$$ 20 -62 43 73 -3 -22 5 -5 -24 52 31 -2 -51 15 -9 -46 75 8 18 -34 13 -2 68 0 -53 -3 50 36 19 18 -23
6442b3P8o4K5J4j5j4J5j7Q7o9mk8L3J5m%K2m3k5j1J2ML4k5L1J9r5J00q2L2L3j6
$$ -23 55 -9 16 30 15 1 16 -1 86 17 13 -15 18 33 29 29 51 8 -17 -28 -16 -12 22 -3 28 47 -48 52 -30 2 35 19
6474A9j4L7j3j09Q2Oj5j8krNN6j8o0O8k9l3lK7L0J3n8L3J0k9j0PlN0k6J1K4kJ
$$ 19 5 42 29 -80 2 8 -7 -25 -27 -36 -31 25 7 -53 15 -14 -47 -50 -23 7 20 -38 -5 5 -24 -34 -27 -30 20 -6 5 29 27 28
6508B8m9l8L4p1R3j2j4L5L3p8O7q5Q5j5l5O4k4K7m3l1O8k0k4QqK0l9K7jK9%K8
$$ 28 -21 -59 -25 -96 -3 -15 -29 6 39 -39 28 -57 28 13 -22 42 18 45 2 -29 39 19 -5 3 -5 15 -24 3 2 31 31 59
6540E9r1o5J24J4l8j0kN4n8J8P8j08JO3J4l6k4o0M1mN1m3j0J00l6Olk3O8j16O6
$$ 59 -32 -97 27 41 3 -7 -9 45 -13 5 83 -25 -24 39 53 17 -7 -67 -26 -30 21 -22 -32 68 32 38 35 12 80 -36 30
6571C0%o7K4m4K0P4m6K9Lkl5O0m0n6L9nJ6l9K7L2r4Q6L1n1J2k1rL8k1o0J62r9
$$ 30 30 -37 -13 -57 -37 37 -9 20 23 21 -14 46 6 -50 -11 -16 0 -39 -12 20 -74 12 43 -8 4 -17 -26 12 -9 -69 93 -6
6603fJ3m6K4Q8k5qk2j7k5M0M0m5K0j3m8K4pj7%k3J19r2O1N3n9Pj4l5Rl0K8Jk5
$$ -6 7 -39 -15 73 48 40 18 1 -24 16 56 11 31 18 -30 -6 -13 -30 -30 -53 66 -26 35 88 29 36 22 -13 -4 -34 -6 -5 -30
6636c0Q7r3O0J2o6j4J4N3l9Ll7P0lm3J8l0Q1j09J18n0P3o5J6Kj06P2k2M0J3nj9
$$ -30 57 -36 24 36 -30 -44 -30 23 -16 -13 -50 20 17 -26 -8 -38 43 -66 52 2 75 10 26 28 -78 -6 -28 12 25 20 1
6667AM0K4q6J8J1L0k9oL4m9M5k8L6k9k3L7l9L4k8K7m1O6m0J9m1K8O6j13O2pn7
$$ 1 41 65 -21 -3 8 38 9 3 37 -12 33 5 41 12 -11 26 -13 21 -7 20 -21 45 5 24 -17 11 77 -36 26 19 -38
6698c8J0N5K1j18J15J0n2K3QMK5p1%Rlql9M5N8o9PL5J7m5J2k7N6r2jR3k7O%n7
$$ -38 -28 27 48 -70 45 55 3 26 34 38 63 -8 -8 1 -2 -10 -49 -4 54 -15 -8 27 44 -1 11 -16 40 -52 -53 40 13 19 19 -38
6732c8J04q3N5n3kP5l9l5kJ8j4N9Oq0L4l9KNO6n8J0mj5O6p2O6q4M8L6Po4NN4p2
$$ -38 66 -17 38 -15 -17 58 19 -16 -18 0 -14 45 51 -29 5 -34 -32 -27 39 -19 -9 -13 -28 38 -34 32 -52 -4 32 39 -25 -20 34 -38
6766c8J26m9p3M1J8J3j5pqJ4K9j7Pp2K1L6k5M1O7j30J4R5o3ql6rPj5K0j5OkM0
$$ -38 88 39 -34 7 25 38 23 16 8 22 51 34 41 -31 -10 26 1 42 109 -21 -7 88 25 17 -19 -28 -21 -36 -16 -31 -25 -27 13
$$ [...]
8191C6
##END NTUPLES=NMR FID
##END=
