##TITLE=1H_LR-790-E-K1
 D2O
 8 sc, 
 6.11.2024
##JCAMPDX= 6.0         $$ Bruker NMR JCAMP-DX V2.0
##DATA TYPE= NMR FID
##DATA CLASS= NTUPLES
##ORIGIN= UXNMR, Bruker Analytische Messtechnik GmbH
##OWNER= root
$$ XWIN-NMR		Version 3.5
$$ Wed Nov  6 16:28:24 2024 Russian Standard Time (UT+4h)  she@DPX200
##.OBSERVE FREQUENCY= 200.1318
##.OBSERVE NUCLEUS= ^1H
##.DELAY= (6, 6)
##.ACQUISITION MODE= SIMULTANEOUS
##.ACQUISITION SCHEME= undefined
##.AVERAGES= 8
##.DIGITISER RES= 18
##SPECTROMETER/DATA SYSTEM= spect
##.PULSE SEQUENCE= zg30
##.SOLVENT NAME= D2O
##.SHIFT REFERENCE= (INTERNAL, D2O, 0, 15.7039)
##AUDIT TRAIL= $$ (NUMBER, WHEN, WHO, WHERE, WHAT)
$$ ##TITLE= Audit trail, XWIN-NMR		Version 3.5
$$ ##JCAMPDX= 5.01
$$ ##ORIGIN= Bruker BioSpin GmbH
$$ ##OWNER= she
$$ F:/spectra/data/she/nmr/H-F/1/audita.txt
$$ ##AUDIT TRAIL=  $$ (NUMBER, WHEN, WHO, WHERE, WHAT)
(   1,<2024-11-06 16:27:00.45 +0400>,<she>,<DPX200>,
      <created by zg, POWCHK disabled, PULCHK disabled
       configuration hash MD5:
       00 E9 B6 7A A2 85 ED C7 34 08 36 98 17 FE 4E 26
       data hash MD5: 16K
       60 B9 A1 05 F3 C8 EC 6B 0F 23 EB E3 D4 BF DB B7>)
$$ ##END=
$$ 
$$ hash MD5
$$ 73 A0 0F FC E1 D8 73 92 A1 37 68 44 DB 3C 1F 81
##$RELAX= 
##$RELAX= 
##$RELAX= 
##$RELAX= 
##$RELAX= 
##$RELAX= 
$$ Bruker specific parameters
$$ --------------------------
##$DU= <F:/spectra>
##$EXPNO= 1
##$NAME= <H-F>
##$PROCNO= 1
##$TYPE= <nmr>
##$USER= <she>
##$AMP= (0..31)
100 100 100 100 100 100 100 100 100 100 100 100 100 100 100 100 100 100 
100 100 100 100 100 100 100 100 100 100 100 100 100 100 
##$AQSEQ= 0
##$AQ_mod= 1
##$AUNM= <au_zg>
##$AUTOPOS= <>
##$BF1= 200.13
##$BF2= 200.13
##$BF3= 200.13
##$BF4= 200.13
##$BF5= 200.13
##$BF6= 200.13
##$BF7= 200.13
##$BF8= 200.13
##$BYTORDA= 1
##$CFDGTYP= 0
##$CFRGTYP= 5
##$CHEMSTR= <none>
##$CNST= (0..31)
1 1 145 1 1 1 1 1 1 1 1 1 1 1 1 1 1 1 1 1 1 1 1 1 1 1 1 1 1 1 1 1 
##$CPDPRG= <>
##$CPDPRG1= <>
##$CPDPRG2= <>
##$CPDPRG3= <>
##$CPDPRG4= <mlev>
##$CPDPRG5= <mlev>
##$CPDPRG6= <mlev>
##$CPDPRG7= <mlev>
##$CPDPRG8= <mlev>
##$CPDPRGB= <>
##$CPDPRGT= <>
##$D= (0..31)
0 1.2 0 0 0 0 0 0 0 0.06 0 0.03 0 0 0 0 0.0002 0 0 0 0 0 0 0 0 0 0 0 0 
0 0 0 
##$DATE= 1730896019
##$DBL= (0..7)
120 120 120 120 120 120 120 120 
##$DBP= (0..7)
150 150 150 150 150 150 150 150 
##$DBP07= 0
##$DBPNAM0= <>
##$DBPNAM1= <>
##$DBPNAM2= <>
##$DBPNAM3= <>
##$DBPNAM4= <>
##$DBPNAM5= <>
##$DBPNAM6= <>
##$DBPNAM7= <>
##$DBPOAL= (0..7)
0.5 0.5 0.5 0.5 0.5 0.5 0.5 0.5 
##$DBPOFFS= (0..7)
0 0 0 0 0 0 0 0 
##$DE= 6
##$DECBNUC= <off>
##$DECIM= 24
##$DECNUC= <off>
##$DECSTAT= 4
##$DIGMOD= 1
##$DIGTYP= 9
##$DL= (0..7)
0 120 120 120 120 120 120 120 
##$DP= (0..7)
150 150 150 150 150 150 150 150 
##$DP07= 0
##$DPNAME0= <>
##$DPNAME1= <>
##$DPNAME2= <>
##$DPNAME3= <>
##$DPNAME4= <>
##$DPNAME5= <>
##$DPNAME6= <>
##$DPNAME7= <>
##$DPOAL= (0..7)
0.5 0.5 0.5 0.5 0.5 0.5 0.5 0.5 
##$DPOFFS= (0..7)
0 0 0 0 0 0 0 0 
##$DQDMODE= 0
##$DR= 18
##$DS= 0
##$DSLIST= <SSSSSSSSSSSSSSS>
$$ [...]
##$SUBNAM2= <"">
##$SUBNAM3= <"">
##$SUBNAM4= <"">
##$SUBNAM5= <"">
##$SUBNAM6= <"">
##$SUBNAM7= <"">
##$SUBNAM8= <"">
##$SUBNAM9= <"">
##$SW= 24.0689170037331
##$SWIBOX= (0..15)
0 0 2 0 0 0 0 0 0 0 0 0 0 0 0 0 
##$SW_h= 4816.95568400771
##$TD= 16384
##$TD0= 1
##$TE= 0
##$TE2= 300
##$TE3= 300
##$TEG= 300
##$TL= (0..7)
0 120 120 120 120 120 120 120 
##$TP= (0..7)
150 150 150 150 150 150 150 150 
##$TP07= 0
##$TPNAME0= <>
##$TPNAME1= <>
##$TPNAME2= <>
##$TPNAME3= <>
##$TPNAME4= <>
##$TPNAME5= <>
##$TPNAME6= <>
##$TPNAME7= <>
##$TPOAL= (0..7)
0.5 0.5 0.5 0.5 0.5 0.5 0.5 0.5 
##$TPOFFS= (0..7)
0 0 0 0 0 0 0 0 
##$TUNHIN= 0
##$TUNHOUT= 0
##$TUNXOUT= 0
##$USERA1= <user>
##$USERA2= <user>
##$USERA3= <user>
##$USERA4= <user>
##$USERA5= <user>
##$V9= 5
##$VALIST= <valist>
##$VCLIST= <CCCCCCCCCCCCCCC>
##$VD= 0
##$VDLIST= <DDDDDDDDDDDDDDD>
##$VPLIST= <PPPPPPPPPPPPPPP>
##$VTLIST= <TTTTTTTTTTTTTTT>
##$WBST= 1024
##$WBSW= 4
##$XGAIN= (0..3)
0 0 0 0 
##$XL= 0
##$YL= 0
##$YMAX_a= 136448
##$YMIN_a= -117423
##$ZGOPTNS= <>
##$ZL1= 120
##$ZL2= 120
##$ZL3= 120
##$ZL4= 120
##$ABSF1= 10
##$ABSF2= 0
##$ABSG= 5
##$ABSL= 3
##$ALPHA= 0
##$AQORDER= 0
##$ASSFAC= 0
##$ASSFACI= 0
##$ASSFACX= 0
##$ASSWID= 0
##$AUNMP= <proc_1d>
##$AZFE= 0.1
##$AZFW= 0.1
##$BCFW= 1
##$BC_mod= 2
##$BYTORDP= 1
##$COROFFS= 0
##$CY= 11.3945322036743
##$DATMOD= 1
##$DC= 2
##$DFILT= <>
##$DTYPP= 0
##$F1P= 15.6554695791079
##$F2P= 12.8336369535428
##$FCOR= 0.5
##$FTSIZE= 0
##$FT_mod= 4
##$GAMMA= 1
##$GB= 0.15
##$INTBC= 1
##$INTSCL= 1
##$ISEN= 128
##$LB= 0.24
##$LEV0= 0
##$LPBIN= 0
##$MAXI= 10000
##$MC2= 0
##$MEAN= 0
##$ME_mod= 0
##$MI= 1.114404
##$NCOEF= 0
##$NC_proc= 0
##$NLEV= 6
##$NOISF1= 3.799351
##$NOISF2= 2.8
##$NSP= 1
##$NTH_PI= 0
##$NZP= 0
##$OFFSET= 15.70392
##$PC= 1
##$PHC0= -26714.77
##$PHC1= 17.78744
##$PH_mod= 1
##$PKNL= yes
##$PPARMOD= 0
##$PSCAL= 0
##$PSIGN= 0
##$REVERSE= no
##$SF= 200.130013532006
##$SI= 16384
##$SIGF1= 3
##$SIGF2= 2
##$SINO= 400
##$SIOLD= 16384
##$SREGLST= <1H.CDCl3>
##$SSB= 0
##$STSI= 0
##$STSR= 0
##$SW_p= 3612.71676300578
##$SYMM= 0
##$S_DEV= 0
##$TDeff= 0
##$TDoff= 0
##$TI= <>
##$TILT= no
##$TM1= 0
##$TM2= 0
##$TOPLEV= 0
##$USERP1= <user>
##$USERP2= <user>
##$USERP3= <user>
##$USERP4= <user>
##$USERP5= <user>
##$WDW= 1
##$XDIM= 8192
##$YMAX_p= 0
##$YMIN_p= 0
$$ End of Bruker specific parameters
$$ ---------------------------------
##NTUPLES= NMR FID
##VAR_NAME=  TIME,          FID/REAL,        FID/IMAG
##SYMBOL=    X,             R,               I
##VAR_TYPE=  INDEPENDENT,   DEPENDENT,       DEPENDENT
##VAR_FORM=  AFFN,          ASDF,            ASDF
##VAR_DIM=   8192,          8192,            8192
##UNITS=     SECONDS,       ARBITRARY UNITS, ARBITRARY UNITS
##FACTOR=    0.0002076,     1,               1
##FIRST=     0,             0,               0
##LAST=      1.7004516,     0,               0
##MIN=       0,             -117423,         0
##MAX=       1.7004516,     136448,          0
$$ Real data points
##PAGE= N=1
##DATA TABLE= (X++(R..R)), XYDATA
$$ [...]
2119b85J426K4j055j548L44J263J089j96j398j318J056J674M99j418j158l02J060
2136b43J570n95j163o36L88R29J043n90j210m15K82J351O57j158j463K36J039
2153B2J111j78j307j069J086J023K89n56j240k36J140O20L96j162j319N07J088
2170B15J016l56j260r24L53J615K84l97j563k61J185J043l64q04p12L17J398L06
2188A091p64q46m62K84J371O12j042j293Q0Q28J221l97q21p17N7J238J194j351
2206B83j091q0O49Q59N98r95p94q7L99Q08L67j070q53L73J028P85l92j439l28
2225i80J402M37k16r56q98N12J060M07n88o19o46N10J170L75p25p34o21O19J727
2244A236k58j200m41l95J379J231j151j198k49N69J257K00j091n06P5L43R37J79
$$ plain form
2119 -285 1141 1165 110 -1438 -1094 169 1258 1062 -336 -1654 -598 1076 1575 157 -1001 -1303 -243
2136 -243 1327 732 -431 -1067 -679 250 1293 703 -507 -922 -640 711 1368 210 -1253 -1017 22
2153 22 1133 955 -352 -1421 -335 688 977 421 -819 -1055 85 705 1101 -61 -1380 -873 215
2170 215 1231 875 -385 -1309 -956 659 943 546 -1017 -1278 -93 950 586 -218 -930 -613 785 1091
2188 1091 327 -519 -981 -697 674 1286 244 -1049 -969 -141 1080 683 -138 -855 -798 440 1634 283
2206 283 -808 -888 -239 620 1218 223 -571 -658 -259 549 916 -154 -1007 -634 394 1179 787 -652 -980
2225 -980 422 859 643 -313 -1211 -699 361 768 180 -439 -1085 -575 595 970 245 -489 -1110 -491 1236
2244 1236 978 -222 -663 -1058 321 1552 401 -797 -1046 -477 780 980 -111 -617 -542 -199 738 917
2262I17j294m20M90M84P81m19j049o62J348P28o5j064j153P49J231L47o66p56
2280d73o82J205M51J54k42p04m29P00Q64J25j158r29L39J184O43o96r64n67R79
2299b00J003J01j198j3l63Q03N37K4j066k80J22Q12R38n15j441J71L86O46M84
2318I51p22j232N52R43M84m72j302q1M09J271J10n92p50j83N24J181k82l90j318
2337h99J2J307N34m57j004m34N42J155J96r13p57j57R81Q93k34j344j42O36J36
2356E1O82k56r26j53K56R80M61p89j130K54P70Q23l15j181p09R18O79K60m18q36
2376e79l29O25O49K00n62o05J56N12R35l04r28p92L05J541J5p69o24k91N20J214
2396H89p53k79m31Q2R87L04m40j000mK72Q91O6l49q78l83J187Q04j72j252n92
$$ plain form
2262 917 -377 -797 -307 177 958 539 -510 -1172 176 904 839 -225 -1378 -629 602 949 283 -473
2280 -473 -1155 50 501 655 413 -291 -720 -20 844 969 -189 -1118 -779 405 1048 352 -612 -1179 -200
2299 -200 803 904 -294 -307 -670 133 670 694 -372 -652 -530 282 1220 705 -736 -565 -179 467 951
2318 951 229 -1003 -451 492 976 504 -798 -879 -470 801 911 319 -431 -614 -90 1091 809 419 -899
2337 -899 -887 420 954 497 -507 -941 -399 756 952 39 -718 -875 106 999 765 -579 -721 -85 51
2356 51 733 477 -449 -602 -346 634 1095 306 -824 -570 200 1023 708 -473 -1182 -264 415 675 257 -579
2376 -579 -908 -283 366 566 4 -601 -445 67 1002 698 -230 -1022 -717 824 839 70 -554 -845 -325 889
2396 889 136 -143 -574 -492 495 799 359 -641 -645 -373 518 584 235 -643 -1026 161 965 793 -459 -1051
2416a051N08J016P58j184r61P9J025O83k68q48n21N38K79P96l16o00j021M12J121
2435D45L60m69q64k50O52P52j33j124l05L37J220j64j87p45o06J082Q70l86l70
2454A15r52PR16O15K22j418o25N87R68N03r38r31q5R82P85k71o95o70K25J179
2474E19M11m28p67m23L27Q98L98p53p44n42R09J197m00j087p19Q75J081P4r75
2493a49n76j51R73N21K18r21m58m74J337L89q4o74q70N62J068N93q11p93p27R88
2513c9N92K32r46q88O81O92N36l69o56n90K76J206J85p46o51o19J079J078m56
2532E97q54p35P16R20P02r96j296J07Q40Q62k58o27q51K08O23P60l2j064l84K11
2552e51P41O18k46j313k91Q97P14J81r48m79k34J457L73m85q62m65M95R04N26
$$ plain form
2416 -1051 -543 473 1231 47 -914 -835 190 873 605 -243 -764 -226 53 849 533 -67 -1088 -676 445
2435 445 805 336 -528 -778 -126 626 493 -631 -936 -599 621 457 270 -475 -1081 1 871 485 115
2454 115 -837 -830 86 701 923 -495 -1120 -533 435 938 0 -931 -1016 -34 751 480 -215 -885 -660 519
2474 519 930 502 -265 -688 -361 537 935 182 -562 -1104 -195 1002 602 -485 -1204 -329 752 826 -149
2493 -149 -725 -876 97 618 836 -85 -543 -1017 320 709 625 -49 -919 -357 711 1304 493 -300 -1027 -39
2513 -39 553 785 -161 -1049 -368 324 860 491 -165 -755 -479 727 912 166 -485 -1104 -25 1053 597
2532 597 -257 -992 -276 644 1346 350 -946 -839 1 863 605 -22 -873 -665 -42 718 686 -378 -762 -551
2552 -551 190 808 562 -751 -1042 -145 569 750 -198 -677 -911 546 919 434 -428 -893 -398 506 1032
2571A032r06o23j72R87J80J12j066k47N1J138L65l95j152Q2O56J036k46r83o61
2590h12K07R04N64k40r61l36K80Q29J83l33q13k19Q08N56L65j019j076K98J080
2609B65M75Q1j420j87O28P51O0p47m87o3J020L38j76p83q33M27J405j6m14p79
2629d55n62R07R87j13j100l41P1Q76R34r59o21k07L46P27N02r75p12J09M39J069
2649I22k5j427l60N66O36M25j69j610j2Q61O60J00m24j205O38P48O74o96l07j204
2669a209P76J058k7q2j007r02J238J188m71p14m65o1J057Q39r81n66m20L51J086
2688F88M64j110o49P8L67Q87R3p29r08O3J107N24m33j384K20R24J01N40j105n36
2708g98K83O61N80l10p35n24N98O41K14M4j466m69J468P13k25m66j403N47J149
$$ plain form
2571 1032 126 -497 -669 318 498 610 -456 -703 -652 486 851 456 -696 -614 42 1078 832 -151 -812
2590 -812 -605 299 863 623 -338 -674 -394 435 618 285 -528 -747 61 617 982 -37 -1113 -815 265
2609 265 740 821 -599 -786 -158 593 653 -94 -581 -644 376 714 538 -245 -1078 -651 754 738 324 -455
2629 -455 -1017 -110 877 764 -336 -677 -606 270 1204 245 -376 -583 -237 490 992 17 -695 -586 -147 922
2649 922 897 -530 -890 -324 312 737 568 -1042 -1054 -193 467 567 143 -1062 -424 324 998 302 -5 -1209
2669 -1209 -433 625 598 516 -491 -1393 -155 1033 562 -152 -617 -678 379 1218 237 -329 -749 -398 688
2688 688 1152 42 -607 -529 -162 725 818 89 -819 -756 351 875 442 -942 -722 202 303 843 -262 -798
2708 -798 -515 146 726 416 -319 -843 -245 396 610 654 -812 -1281 187 900 675 209 -1194 -647 502
2727E02N28o57n96l99L35J180n1r74k49j85M08J410m51j052m51j62J349P38o19
2746F04j238j94O64R25L10j435p39Q16O66L12j51j025k73Q49qQ68k44j682k1J035
2766C9O97r9o57j054N51R66K95l45p74m57Q73Q65m16p29k24k02J044L63l61o58
2786b83m90M91P13N54j048l56l50L82J324o8j357l50K40P77P85m84j178K99Q0
2805c19O46O36j120o51N2O56L51L54m91j297O54J097M09m37j194k69R50P90j44
2824F73r56n45J70Q81L28k44m29o23K58J247K99r07j083K2Q80J122l88p90r01
2843i86K46J328L79r40j178M80L46J011J1p60p36O33K52P18j37q95o05K52J044
2862D63N69n62j346L0Q74M59L90o66j376P10P55O31o85q38k82P64K78O65o24o90
$$ plain form
2727 502 1030 373 -223 -622 -287 893 842 -132 -381 -566 -158 1252 801 -251 -702 -864 485 1223 604
2746 604 -634 -828 -164 761 1071 -364 -1103 -287 379 691 540 -485 -758 91 83 951 707 -975 -996 39
2766 39 736 637 -20 -1074 -523 443 738 393 -381 -838 35 900 484 -245 -469 -671 373 736 375 -283
2786 -283 -773 -282 431 985 -63 -419 -769 -387 937 869 -488 -838 -598 179 964 480 -698 -399 -319
2805 -319 327 963 -157 -808 -756 -100 251 605 114 -1183 -529 568 977 540 -654 -923 27 817 673
2824 673 -283 -828 -658 223 551 307 -122 -745 -487 760 1059 152 -931 -909 -29 1093 705 -85 -986
2843 -986 -740 588 967 27 -1151 -671 -325 686 697 -63 -799 -166 86 804 667 -228 -833 -581 463
2862 463 1032 470 -876 -846 28 487 877 211 -1165 -455 300 931 246 -592 -874 -110 168 833 209 -481
2882d81n5K92R84j6q63m57J07J106K97p91n18n92R80J086l41r41k46k33R52M83
2902G53l78p92j58J40R33M40n61q41j07P04N04J32j004n08K45O54O65q03r22P8
2922h26O86O42Q2r05l58R4R26N03k23q49o50M29J034L2k30j104k09J021N54l38
2942C11o20l96K66J024m1l27p70q0K99J156k11o07m31l85O79O14M06j133m81K09
2962e18J041K43m70o99j62N02Q59k85o97l53M13N07O18n99o22n47L28R16L02j49
2982F28j099N6P08O74l15r36j97L8J104K26q75k88l67O70M27k16r4o51Q4P54O11
3003I42o53l14q93J10J467J32p88o98rO13P68k75p35o80O41P41M29n36p14L8J42
3024b72O48J57k67p05j81O38M77M47j038k29m3Q34J98l08j225M98R5N94K17m12
$$ plain form
2882 -481 -536 -244 740 724 -139 -596 -489 617 914 123 -395 -987 -7 1079 738 -203 -449 -682 270 753
2902 753 375 -417 -575 -435 498 938 377 -464 -571 133 637 769 -235 -743 -498 156 821 18 -904 -826
2922 -826 -140 502 584 -321 -679 -585 341 844 621 -228 -878 -449 585 617 387 -717 -926 95 649 311
2942 311 -309 -705 -439 585 544 217 -553 -633 -334 822 611 4 -427 -812 -133 481 887 -246 -727 -518
2962 -518 523 766 296 -403 -565 -63 796 511 -186 -539 -126 381 999 400 -222 -769 -441 475 777 628
2982 628 -471 -415 293 967 652 -284 -481 -443 661 887 12 -276 -643 27 454 238 144 -507 -423 331 942
3003 942 289 -25 -918 -808 659 791 3 -695 -704 -91 677 402 -333 -1013 -372 369 798 262 -452 -414 -272
3024 -272 376 533 266 -439 -620 18 495 942 -96 -325 -368 466 664 356 -869 -371 -276 318 535 123
3044A23p29J4P13O70l21p70j59J53O66O4l71o71p8O09O72k08o21l50L6J024N24
3065I90q76m49l35Q22K68P0j92q10O5L76P75j31m27o74K16P41L7m18p18L73M94
3086A97O46n10o45m47M81M99M55l14q22K6L15L81Kk25r99K83Q85O59l35r39J29
3107b78r9P61L22p99l51M6N26O1K41o53l43K16L20N99j77m23l11P5O57K55l48
3128B97q81j1Q58N34l58p14j15Q6P99M0m26l21J08L04M9J18l4p88L5P08m0Jk33
3151A6o07L52N24L16q39l62r4N13J090m48o10l81j0N58M02m00M1o42N31L30J67
3172D47l84m25M6J59Q77m61k83q13O26L86M58o50n12L78J92L25mn58k50j0O22
3193A66P8ql66n07N87K35J36n28j78L7O60k91P8k96j66Q4L51P8m5m11l4OP79K80
$$ plain form
3044 123 -606 -592 121 791 470 -300 -459 -306 360 424 53 -618 -696 -87 585 377 -244 -594 -558 466 990
3065 990 114 -335 -670 152 420 490 298 -512 -447 -71 704 573 146 -528 -312 429 466 48 -670 -297 197
3086 197 843 333 -312 -759 -278 221 676 362 -460 -434 -119 262 264 39 -960 -677 208 867 532 -407 -278
3107 -278 -377 384 706 -93 -444 -398 128 189 430 -223 -566 -350 -30 569 392 -31 -342 -267 390 645 297
3128 297 -584 -595 263 797 439 -275 -390 -304 495 535 109 -212 -104 200 249 367 333 -455 -420 288 248 249 16
3151 16 -591 -239 285 601 -238 -600 -694 -181 909 461 -149 -530 -540 18 420 20 61 -581 -50 280 447
3172 447 63 -362 -316 -157 720 259 -24 -837 -211 175 633 -17 -529 -151 41 366 362 -196 -446 -456 166
3193 166 244 236 -130 -637 -50 185 321 -207 -385 -348 312 21 99 -197 -363 -279 72 150 105 -306 -340 -334 445 725
3217G25n00n22J34J35N15l33m29j16K98K02L16m72m78K02L57K98R5p75j35J28
3237c55N16J60J03o56N5m2N62J83m91l90k42M58O26n94j12k51J68N42L83n40k02
3258a19j2K16j42M28l47k86OJ76M02l3m07o4R0J95K40k14l09r5L11K16l56J32
3280B8l74k21P64K23l13m28O8n0P00j62J46p12K14P49k18m34j97k00M23L75m4
3301C37k75j99J07k4J80M0m05j45m7J68P04j13j98m10L48P9M80o30j84l54L63
3322a78O49k40k02m24L91J41L40p62L7J76J71K01K8l29l17L60m0L77j54l60k02
3343c37K80J60J32l78q5M6L77Q6n6r9n65L55K56j29K5R7k64j40L40J90l85n7Q4
3366f7K21K6J71l70m12M76r7N84l77j57O4L6M1J25o5l95K46j4J48j70p0O9l1K90
$$ plain form
3217 725 225 -297 -163 -28 487 154 -275 -391 -93 109 425 -47 -525 -323 34 332 427 -348 -483 -355
3237 -355 161 321 424 -232 -177 -219 343 526 35 -355 -597 -139 487 -107 -219 -470 -302 240 623 83 -119
3258 -119 -131 85 -57 371 24 -262 -256 -80 322 289 -118 -182 -92 103 343 129 -180 -275 36 252 -104 28
3280 28 -346 -567 197 420 107 -321 -253 -303 397 235 381 -331 -117 632 414 -20 -217 -417 6 381 337
3301 337 62 -137 -30 -54 126 166 -239 -384 -431 -263 441 328 130 -280 68 147 627 -3 -187 -541 -178
3322 -178 471 231 29 -395 -4 137 477 -285 -248 -72 99 300 328 -1 -318 42 2 379 225 -135 -337
3343 -337 -57 103 235 -143 -228 -182 195 281 225 126 -439 -84 172 43 68 165 -99 -239 101 291 -94 -151 -67
3366 -67 154 180 351 -19 -431 45 -52 532 155 -2 62 98 139 264 199 -196 50 36 184 14 -56 13 -18 272
3390B72n6k82n88M98j14O70k89k35k01L47J80j38o7j34Q4J71K99k52k6o17M95
3411A7j90O39m50k13J3K67J57k71j90l8J52J41k02L43j43J68j42j62K54k93j04
3432b47J51L42j80K14k16j23o9K35L9j50j74k03L57k57M07o7J23k96Q9K89l77
3453a13L1j45K22k90N82o1m48k5K16m2L13k54l01K25J65K18o7n60L84J68l63K1
3475a24J01K4j00J43n3L3Q5m07P1L6K78J48o30J49J25L3J61P6n46J30J43jJ58
3498C3k47L13l25L48JQ3j19j48o0K36k7j76J47O3j3l21J78r6p1L44K55j75k57
3521c4K38j19k27K91l35j41R6J49P6j66M02j98k81K24j68L44k03k24J21q6J55
3542h6N7L04l50R5K8J12l27J60lR0P1m26N27n05K50J91j40j96J54p1l4K87J37
$$ plain form
3390 272 216 -66 -654 -156 -270 400 111 -124 -325 22 202 64 -3 -137 -53 118 417 165 139 -478 17
3411 17 -173 466 16 -197 -184 83 240 -31 -221 -259 -107 34 -168 175 32 200 58 -104 150 -143 -247
3432 -247 -96 246 66 280 64 -59 -128 107 146 -4 -178 -381 -24 -281 126 59 182 -114 -25 264 -113
3453 -113 -82 -227 -5 -295 287 226 -222 -247 -31 -73 240 -14 -315 -90 75 293 226 -334 50 218 -145 -124
3475 -124 -23 1 -99 44 -9 24 109 -298 -227 -191 87 235 -395 -246 -121 -88 73 149 -397 -267 -124 -125 33
3498 33 -214 99 -226 122 123 206 87 -61 -121 115 88 -88 59 122 109 -212 -34 -130 -201 143 398 223 -34
3521 -34 204 85 -142 149 -186 -327 -231 -82 -6 -172 230 32 -249 -25 -193 151 -52 -276 -155 -241 -86
3542 -86 -29 275 -75 20 48 160 -167 -7 -10 80 151 -275 252 -253 -3 188 48 -148 6 -65 -99 188 325
3565C25l42j38O6J53j62J92j55K58n2k46J54Qj89o0K40L86r29M37k67J56K16J39
3587A90m52J73ko4k45M05P0j18K6K37j84m7Q6l30K69K8nO4j59K7R7l10K14K55
3611B25k16O0J81j81J37m07J38Lj61J33k9L9q1K62L3l93Q6K68j17nK21K45l14
3634A27J88j74L8P6n26J05r1K16l6R1q0K56r5Q6j23o3J82K30k69l85K79j9L69
3657C82m39o8J35j11pJ69q4J17j67j00J73J82k09q8K34l36J48J33j24M8n8J93
3679A23K3j69j35N2Q2Jj21PK80j18K7K21k03j06N2K4L17l15O9m31N19l57K05k12
3703a65Q1j52O0J54l8p1o4L89q2k77J6n4k24M10j09J85p0J33k78m6N59j43l40
3726a26J17K10j79J8o9O4j82J35Kj61q6L18j34j5L36j33m23J28M02K00j13j84
$$ plain form
3565 325 -17 -155 -89 64 -98 94 -61 197 145 -101 53 61 -128 -188 52 438 -491 -54 -321 -165 51 190
3587 190 -262 -89 -91 -155 -400 5 75 -43 -17 220 36 -11 75 -255 14 42 37 101 -58 -31 66 -244 -30 225
3611 225 9 69 250 69 206 -201 -63 -60 -221 -88 -117 -78 -159 103 136 -257 -171 97 -20 -25 196 441 127
3634 127 315 141 179 255 -271 -166 -257 -41 -77 14 -66 190 95 181 58 -5 177 407 138 -247 32 13 382
3657 382 -57 -125 10 -101 -108 61 -23 94 -73 -173 0 182 -27 -115 119 -217 -69 64 -60 -12 -70 123
3679 123 146 -23 -158 -106 -24 -23 -144 -137 143 25 52 273 70 -36 16 40 357 42 111 -320 199 -158 47 -165
3703 -165 -84 -236 -176 -22 -60 -131 -195 194 112 -165 -149 -203 -427 -17 -126 59 -11 122 -156 -202 357 214 -126
3726 -126 -9 201 22 40 -29 35 -147 -12 -10 -171 -257 61 -73 -88 248 115 -308 -180 222 422 309 125
3748A25j94L6r9K09n5N2J54n26J67N2Q6J5q9j17M54m50m9L04k59J14KOP4j71j4
3773a73M97n2l53j32M5K91k52M24j61L8l2j86l7j0j50K3L21K02n61M53r2k86M01
3796B18k27J14k07J49j11J79l0J78m10K25j70K41L1P5l64J96j04j2J09r7q8j65
3818b70K12m2L78l24l6R3k93K7J60J61k33K0RL07q7m54L43O5k30J62j64N89n19
3841a26K48j56K19l64O10j93m04O2J3kj53O92l16m10L27rj36K72M0j54m10O86
3863C36j34j73Q6j99K30q0K66q2m24K63q6J42j16J38j05k61L16M2J73m81K00J39
3885A90m18J14K52k12P4J48O3k87q8LP6lN8J09m45N02o9m45M72r6q7l5L81o9k5
3910A63k51O0J8n8K82k74q3o6Q3K44j15k33J53J1j47J01L66L9n85N60j01O0k2
$$ plain form
3748 125 -69 -33 -132 77 22 74 228 -298 -131 -79 7 22 -67 -184 270 -180 -229 75 -184 -70 -68 -62 12 -159 -173
3773 -173 324 272 -81 -213 -168 123 -129 295 134 172 140 -46 -83 -93 -243 -220 101 303 -258 195 103 -183 218
3796 218 -9 105 -102 47 -64 115 85 263 -147 78 -92 149 180 255 -109 87 -17 -29 80 -17 -105 -270
3818 -270 -58 -100 278 -46 -82 11 -282 -255 -95 66 -167 -147 -138 169 82 -372 -29 36 -194 -32 -196 393 -126
3841 -126 122 -34 185 -179 431 238 -166 -104 -91 -93 -246 446 130 -280 47 38 -98 174 214 60 -350 336
3863 336 202 29 115 -84 146 66 332 250 -174 89 3 145 29 167 62 -199 117 159 332 -149 51 190
3885 190 -228 -114 138 -74 0 148 211 -76 -164 -161 -85 -88 -30 79 -366 136 67 -378 94 -2 -89 -124 257 188 163
3910 163 -88 -28 -10 -68 214 -60 -143 -209 -126 118 3 -230 -77 -66 -213 -112 254 293 -292 268 167 227 205
3933B05j24j09n5L14m19L09k49%NM34l73j37K57k04M24p4r3k43J74K00k81J26
3955H7k72M0K47J24n0k61j99k0K43K20j1k06l09p4P31k26J93n39J36Q9J88pk29
3978a05L05l65Q1P9r4L41j54o20L99K02r0j2J10n1J44P2j61l41L05P0P4k25k31
4001b67L58j58J36K77m12J06j02J40R1j36K47n57L63P7k69N74o06j77N37j05j09
4022HJ23j05O3k60J22J61k32k9J21j28J64K09m48N57k40J31j57Q1p1r9k9K34m8
4045A28l36K34k4P0L45m27k61j3K76Q7J13k79%J84Mr0Nk13K58j98M7K38j78n2
4069h2R1j45K01j89k03M18j56j0N16n23K04qn3J56k44m71L76N5l7L47j99K29m35
4092a62q0J91K64j47o0J45m79P31m65l53L46L1l4J05Q4k81N9Pj8L07q5j33j39
$$ plain form
3933 205 81 -28 -83 231 -188 121 -128 -128 -123 311 -62 -199 58 -146 278 204 111 -132 42 242 -39 87
3955 87 -185 -145 102 226 176 -85 -284 -304 -61 159 148 -58 -367 -441 290 64 257 -282 -146 -57 131 124 -105
3978 -105 200 -165 -84 -5 -99 242 88 -532 -133 69 -21 -33 77 26 170 242 81 -260 45 115 189 -36 -267
4001 -267 91 -67 69 346 -66 40 -62 78 169 33 280 -277 86 163 -106 468 -138 -315 222 117 8
4022 8 131 26 89 -171 -49 112 -120 -149 -28 -156 8 217 -231 326 86 217 60 141 70 -29 -58 176 128
4045 128 -208 26 2 72 417 -10 -271 -284 -8 79 192 -87 -87 97 101 11 16 -197 61 -137 -90 148 -30 -82
4069 -82 9 -136 65 -124 -327 91 -65 -75 441 -82 122 114 61 217 -27 -498 -122 -67 -104 243 44 273 -162
4092 -162 -242 -51 213 66 6 151 -328 403 -62 -415 -69 -38 -72 33 117 -164 -105 -98 -116 191 106 -27 -166
4115a66L51k46n8k90j5L02M68k16m55n8N00%j79K53l17M43k99O9Q0k63p0j65M43
4138A12p9m8j80N5p8K31O6J61m91L78K89k57L5m02Q7J5o8q8L35M81q17M60k94
4161i7L15l06k54K97O2K50j39j87J14k35M33j14k73J55l9J74J68m18J38k42k3
4182b21K37j99n7K05j96J40K51j14j06K46k93j77M73j33m0jK21l16n4L90m72M25
4204B09k47N8J4l8J4K06l20L53j50k21L7K89k46r6L75j76j68K46J6J47l52K04
4226A54R2k65N5O9j02n5k61M98q7m32N82k88J57R7l35j12J35J8N2l16M56j06o7
4249f1R8K56l06L6l48K09L35m22L22m25J94K29J08o2l91J00K05n0J69j58r1r8
4271a51p5L60j93J18k21K87J58l61L23k29R5j92J84j67J63j96Q7J07K24j4l94
$$ plain form
4115 -166 185 -61 -119 -409 -424 -122 346 130 -325 -383 117 117 -62 191 -126 317 18 87 167 -96 -166 -331 112
4138 112 33 -15 -195 -140 -218 13 79 240 -251 127 416 159 194 -208 -121 -106 -174 -262 73 554 -263 197 -97
4161 -97 218 -88 -342 -45 17 267 128 -59 55 -180 253 139 -134 21 -18 156 324 -94 44 -198 -221
4182 -221 16 -183 -240 -35 -231 -91 160 46 -60 186 -107 -284 189 56 16 15 236 -80 -134 256 -216 209
4204 209 -38 20 34 -4 10 216 -104 249 99 -122 -85 204 -42 -138 237 61 -107 139 155 302 -50 154
4226 154 246 -19 36 105 3 -52 -313 185 98 -334 248 -40 117 214 -121 -233 -98 -80 -28 -344 112 6 -61
4249 -61 37 293 -13 23 -325 -116 219 -203 119 -306 -112 117 225 163 -228 -128 77 27 196 38 -53 -151
4271 -151 -226 134 -59 59 -162 125 283 -78 245 16 111 -81 103 -64 99 -97 -10 97 321 307 -87
4292h7Ok95N94k20Jk65Q6J91J24J37l28K94m49K60k16r5J9n3N44J22k10k64J10
4315Fj68K34j73l26L91k83L64K04k71j81N06k09j20J65j13j9q4r3M47j37l29J36
4337e3j82K12L5P6q6l9K54m25M61j82k00q5N1K83m2k64L2J57J7M05m32K6j62L1
4361a12J19M33l56l27K0M51P9J13m73j15L76j15j18P5j01l2L22l0k57J46l37M80
4383B41l22L42J41m98L4j16M25k17R5k43J61J53k9M5k53J70l74K35L1m2j02j33
4405b56M14N8k02K50l22j2J70K53k31l32K36k69M4K36l16L80k71K54J29j7ll98
4427b05J75l4L62k86j64k41Q9N18j22k91P8J8Q9pj9m9p1J60M3K62k64j66o7K33
4451D1M8J08j04j05o2K14l4p8j75n8K3L05p1j36l81J90K92M8J20j52k64L1L61
$$ plain form
4292 -87 -81 -376 218 -2 -1 -266 -180 11 135 272 -56 238 -211 49 -167 -262 -243 -296 248 370 160 -104 6
4315 6 -162 72 -101 -427 -36 -319 45 249 -22 -203 303 94 -26 139 26 7 -77 -170 277 140 -189 -53
4337 -53 -235 -23 12 88 2 -37 217 -208 253 71 -129 -214 -163 120 78 -186 -154 3 20 425 -7 19 -143 -112
4361 -112 7 440 84 -243 -223 228 307 420 -53 -168 208 93 -25 50 -51 -83 239 209 -48 98 -239 241
4383 241 -81 261 402 -96 -62 -178 247 30 125 -118 43 196 167 212 -41 129 -245 -10 21 -21 -123 -256
4405 -256 158 216 14 264 -58 -70 100 353 122 -210 26 -243 -199 37 -279 101 -170 84 213 196 193 -205
4427 -205 -30 -64 298 12 -152 -393 -304 214 92 -199 -121 -103 -14 -21 -40 -89 -160 0 43 305 41 -125 -192 41
4451 41 89 197 93 -12 -74 140 106 28 -147 -205 -182 123 52 -84 -465 -275 17 65 185 33 -231 -200 161
4474A61j06j26j42j27L63K78k65Lj26l86N62k2M9o07K57K62Q2J21k80m9NQ5K62
4497B54l11K47l33K29J32j42k10K02l69J99K62J73m28K4j21L78j61J65l63q8M47
4518A86k92K94k80K0k2K25q6k6k59J94l35K17L19p0Nl64L69L6j21m26M20j25L96
4541B75k8J30n27k48L15K2J87j79j51o4J00R7n2r7K31j97L09K59j97l68O7k0J31
4564eJ25l45J78l00J24L26rj04l39J80M94K6k36m10J17J72J14M9l02o8N2P5M02
4587C16l0m49K08J23N7K59n93R7j68j3M42l39J07o0l69O73j92j79j59p5P4L93
4609A23j8p8J01j21R2K78j82m64j65M07N7J88K73o08O6r7J79J91l62k13J49J79
4631b5R7K21q13L25J0N01l52L00n02j25K59N7J03Q1n73J40K93J83j55O1o15N31
$$ plain form
4474 161 55 -71 -213 -340 23 301 36 39 -87 -473 89 67 116 -491 -234 28 110 231 -49 -98 -93 -8 254
4497 254 -57 190 -143 86 218 76 -134 68 -301 -102 160 333 -95 -71 -192 186 25 190 -173 -261 186
4518 186 -106 188 -92 -72 -94 131 45 19 -240 -46 -381 -164 155 85 90 -274 95 131 10 -416 4 -121 275
4541 275 247 377 -150 -398 -83 -61 126 -53 -204 -268 -168 -71 -123 -220 11 -186 123 382 185 -183 -116 -136 -5
4564 -5 120 -225 -47 -347 -223 103 94 -10 -349 -169 325 351 115 -295 -178 -6 108 157 -145 -213 -161 -86 316
4587 316 286 -163 45 168 225 484 -109 -12 -180 -193 249 -90 17 -43 -412 261 69 -110 -269 -344 -270 123
4609 123 105 27 128 7 99 377 195 -269 -434 -27 30 218 491 -117 -51 -148 31 222 -140 -353 -204 -25
4631 -25 72 293 -520 -195 -185 316 -36 264 -238 -363 -104 -47 56 137 -436 -296 -3 180 25 86 -529 2
4653BJ55j18j8k99M55k69M53n38L85m53K24J76o8j80J56k66J35L19k51j48J1k27
4675c64K29K81q7l74K73j21L67P8k14j49l33J7Q63j18k01m74J57K41R2j93j20
4696a50Q4J56qJ17k4l06J19pM13k72l73M49k35j12K42K63m54j07K51j45K62P0
4718B33n03K6N76l34K81m99k35L25L72p4j54j14M7L88k97R4l97j81LM03R7r0j49
4741a82l20N56P0J8k83m6K4J88K21l14j91K60J42k19P8j82L39m12L19J00k92J4
4763a12j34K6M13J81o87K55m15M07K42j73J99o68K96M76l13J62j67k08J75j23
4783a68L30j26j66J5p3O27l80k19k88M34P5R6J0n18K00J99K60j29R0l28P8L17
4805C36l84L4k59L1L86m61O52O0q14J92K17J98j08k23j42j5L72K82l43M6j58k9
$$ plain form
4653 2 157 39 21 -278 177 -92 361 -177 208 -245 -21 155 87 -93 63 -203 -68 251 0 -148 -137 -364
4675 -364 -135 146 59 -315 -42 -163 204 282 68 -81 -414 -397 466 348 147 -327 -170 71 163 -30 -150
4696 -150 -66 90 82 199 175 -131 -12 -19 394 122 -251 198 -37 -149 93 356 -98 -205 46 -99 163 233
4718 233 -270 -244 332 -2 279 -220 -455 -130 242 168 14 -100 -53 335 38 132 -265 -446 -443 -40 57 -33 -182
4741 -182 -502 54 124 142 -141 -187 -163 25 246 -68 -259 1 143 -76 2 -180 159 -253 66 166 -126 -112
4763 -112 -246 -220 193 374 -313 -58 -473 -66 176 3 202 -466 -170 306 -7 155 -12 -220 -45 -168
4783 -168 162 36 -130 -115 -188 439 59 -160 -448 -14 61 157 167 -351 -151 48 308 179 269 -59 19 336
4805 336 -48 -14 -273 -242 144 -317 335 395 -419 -227 -10 188 80 -143 -285 -300 72 354 11 57 -101 -130
4827a30N2K03j0K04r7j77r6%K0k13j86K63N74k11k80k01M55K22k29k18j61L76
4849A60L5Q9l46O5k23k6L07K78j52k31o56O33K67K46m63k88MJ35K47j84J25j64
4871a42k9K34J96m40J66lK63j37P0j03j69m6K54L55m25J34j78j85K49j8j24j35
4893b13L77N2J38j69k68j00L78l66J84K99l31q3kK54l0l10j4K36l38M62k3n16
4915c83J19M70j35rp2l95L17M22J47l18j86l95N97M04o15J28k90n3L90J56p5L86
4937F10p27j55L59k01J62l75J12K89ML03m47j83K60k54L91J5j01k13J10N09n08
4958d0J24l63L73O6J91m53j69O4K97j04L31m93K88k64PK32P4k44j30rK35m9L17
4981B81l44j77M68j58J90l55j28l0K72J81k00k06j22N32k09L91q1l72K4l2j01
$$ plain form
4827 -130 -78 125 115 319 222 45 -51 -51 -31 -244 -430 -167 407 196 -84 -285 170 392 163 -55 -216 160
4849 160 195 284 -62 3 -220 -246 61 339 187 -44 -700 -67 200 446 -17 -305 -301 -166 81 -103 22 -142
4871 -142 -171 63 259 -181 -15 -18 245 108 178 75 -94 -140 114 469 44 178 0 -185 64 46 -78 -213
4893 -213 164 216 354 185 -83 -183 195 -171 13 312 -19 -102 -104 150 120 -190 -204 32 -306 156 133 -383
4915 -383 -264 206 71 62 -10 -405 -88 334 481 163 -23 -418 179 583 -32 96 -194 -247 143 299 224 610
4937 610 -117 -272 87 -114 48 -327 -215 74 78 381 -66 -249 11 -243 148 163 62 -151 -41 468 -40
4958 -40 84 -279 94 160 351 -102 -271 -207 90 -14 317 -176 112 -152 -145 87 161 -83 -213 -222 13 -36 281
4981 281 -63 -240 228 70 260 -95 -223 -253 19 200 0 -206 -328 204 -5 386 305 -67 -43 -75 -176
5002a76O63m08k38q3L71J50k03j39p4Q3K59q7j44J26k39Q6K74Q7l16q8j14L08
5024I8l6m1J75k67n5R3K2K64j18j30j91Q5P6K10j33m9Ok38J10M18l17Kj25M38
5048B97l44m7k04m9L17J02l56J28o1K89j63J18K04m70j01Q91l41k32J50m3l84
5069b99J24M99J2o01K20K74j62L9j16Ll12M83l97Q4j55O91l00j52J09k6j41N57
5091D34n04P6n0J16j3n37P24j52p2M6m5m5J33J84l60k27O8K61o5M11n66j10K03
5114i0L45n2k34O1k1J90K30m38p1K21m34K35J50l79r3J56L98J08m10j34j42K52
5136a52L62Nl6j79J61r8P3J36m17j09N42l10J9J28k52L06n45M72j01K23k78q7
5158a37L3J62K64r0k19O4M6K72n1m26MJ43J23o3k17l28K22R6K25k3q4k25L14k4
$$ plain form
5002 -176 487 79 -159 -242 129 279 76 -63 -137 -54 205 118 -26 100 -139 -53 221 308 -8 -96 -210 98
5024 98 62 21 196 -71 -126 -33 -11 253 135 5 -186 -101 -25 185 52 3 9 -229 -119 299 -18 -16 -141 297
5048 297 -47 -94 -298 -347 -30 72 -284 -156 -217 72 -91 27 231 -239 -340 551 210 -22 128 85 -299
5069 -299 -175 324 336 -265 -45 229 67 106 -10 -7 -319 164 -233 -149 -304 387 87 -65 44 18 -123 434
5091 434 -70 6 -44 72 59 -478 246 94 22 68 23 -22 111 295 -65 -292 -224 37 -28 383 -183 -293 -90
5114 -90 255 203 -31 30 9 199 429 -9 -80 141 -293 -58 92 -287 -380 -224 174 282 -128 -262 -404 -152
5136 -152 210 215 179 0 161 63 136 272 -145 -254 288 -22 -3 125 -127 179 -366 106 5 228 -50 -137
5158 -137 -104 58 322 232 13 77 123 395 344 -82 -78 65 188 125 -92 -420 -198 -102 123 100 16 -209 105 81
5182H1J15j87M8p8K49m60R1j09K95O2K04q5J55n02J66O2l1K17l78J48l88Q5K40
5205@k8k24J46Q2l5K52k69KL19j43O4k64K47j86q6L54R0J05k11k79l43M40LL9
5229G5J45n12M82k70j70J32L42l45q7o7N50j44j93N2K37k26j09o0P8J18N43o81
5251a10m3L31j95o7K04P2m95L24n8M9J88q3j94k78M91j30R7J5k98J17N30l11j68
5274a2q6K0j60M8O11o57K24l8j55K73P9k0l54k11N90j70L7j02Q1MJ25p2j42j57
5298b44N26r3j85p7J1K76l80N3M87l60k26L98k37k5M23k02l65J44J48J90r7j60
5320EK70l38k7R0K71k87P0K6PO2m17L40l66N46o7k47k70L16k95M34K74O3m78o2
5344h0O7l5J81j56Q0r6J3J4L02k81m8L00j99R2K13o27J30o2N42jl65j09J64K9
$$ plain form
5182 81 196 9 57 -21 228 -232 -141 -250 45 107 311 226 381 -121 45 107 76 293 -85 63 -325 -240 0
5205 0 -28 -252 -106 -24 -59 193 -76 -74 245 102 166 -98 149 -37 -123 231 321 426 215 -64 -407 33 36 75
5229 75 220 -292 190 -80 -250 -118 224 -121 -208 -275 275 131 -62 -10 227 1 -108 -168 -90 28 571 -110
5251 -110 -153 178 -17 -84 120 192 -303 21 -37 12 200 117 -77 -355 136 6 103 118 -180 -63 467 156 -12
5274 -12 -98 -78 -238 -190 421 -236 -12 -50 -205 68 147 127 -227 -438 152 -18 19 -83 -2 2 127 55 -87 -244
5298 -244 282 189 4 -73 -62 214 -166 -113 374 14 -212 186 -51 -76 347 145 -220 -76 72 262 165 5
5320 5 275 -63 -90 0 271 -16 54 80 87 149 -268 72 -294 252 185 -62 -332 -16 -311 123 397 460 -18 -80
5344 -80 -13 -48 133 -23 57 -39 -26 -12 290 9 -39 261 62 154 367 -260 -130 -192 350 349 -16 -125 39 68
5368F8J12j95K92l43J75J4k24j72K36k7L62j83m7nJ8K23l93J83j34n37O76m01
5390c02L73L07p46O00m04j55L79k05k8J62K25qj07J77n29L9J03Q2M05k55O2j33
5412D2O3K3l11j40K03r5K47J07N3m04O3J54K05J59n69P2M5J98J01J24n00r8L34
5435G6R8M0o38j20L29M33k68j5j01K39Lj07L88j22j88k3j0J41q2l13J87l12N58
5458A93j99nj24L67m04N1J39m4j78J92n5L11J84p96K91m1j7K13K0j11N1J38n5
5481A21L9k08l02N0M44K6j53j49j56L70q2m4K8Jl11Q4L42K5j3j38J0K73o7J57
5505C47j15l95K21j51N14m95r2J00p6L55j06J23j99N4k53J27J43j13m86M39l1
5526h9J41m5k69p6O93j36n1l21l17N88M7o7k23n8j86L71J03L43o83M18m29N05
$$ plain form
5368 68 180 -15 277 -66 109 123 -101 -273 -37 -64 298 115 68 63 81 304 -89 94 -40 -577 99 -302
5390 -302 71 378 -368 232 -172 -327 52 -153 -181 -19 206 198 91 268 -261 -222 -119 -37 368 113 175 42
5412 42 105 128 -183 -323 -120 -215 32 139 192 -212 -149 5 210 369 -200 -128 -83 115 216 340 -160 -258 76
5435 76 174 214 -424 -544 -215 218 -50 -65 -166 73 76 -31 357 235 47 24 14 155 73 -240 -53 -365 193
5458 193 -6 -11 -135 232 -172 -121 18 -26 -204 -12 -67 244 428 -368 -77 -118 -135 78 98 -13 38 176 121
5481 121 160 -48 -350 -300 144 170 17 -132 -288 82 0 -44 -16 -15 -326 -242 100 125 112 -26 -16 257 190 347
5505 347 232 -163 58 -93 421 -74 -166 -66 -142 213 107 230 31 85 -168 -41 102 -11 -497 -58 -89
5526 -89 52 7 -262 -338 355 219 168 -153 -470 118 165 98 -125 -183 -369 2 105 448 -235 183 -246 259
5548B59J32l80j53L17k06K25m10K55J3m8J05N5j6l50K78q1K34l35L51n23Q9o3
5570b52M64O9n52K56m87P40k43R3m61O9L3Q24k40pk87j71J29J31M25p37K86m97
5592d15N41k28K14j91P2QK62j46j67k59j9M87o4J47k96o8j59O14m46L14l21n1
5614a71j02N68k88J19j60j80M11n3J44l98J27N7R0K37l81j77L24j76M25k51n29
5635c64J04P8L61j4k52m12K71O9L82ml44l22M54j24K90m02J5K32n6K67l1l16J92
5658G4m70O08n08L92N8l38N0J44l3qj9o2J90p8K50K40m38k07K11j0J69k3m80M5
5682b43M26J2j57j81o0l7K34K66k98k04oK83j26O3J42m79M19J62r9Kj53j62L77
5705A81k8p6n1j86k2K44L25l45j01l63L30J73K83m31k0n9J79N3l30L3K48j82L76
$$ plain form
5548 259 391 11 -142 175 -31 194 -216 39 52 4 109 164 148 -202 76 -5 229 -106 245 -278 -189 -252
5570 -252 212 281 -271 -15 -502 238 -5 88 -373 -304 -271 553 313 306 19 -152 -23 108 533 -204 82 -415
5592 -415 126 -102 112 -79 -7 1 263 117 -50 -309 -328 159 95 242 -54 -122 -281 333 -113 201 -120 -171
5614 -171 -273 295 7 126 -34 -214 197 144 288 -110 17 74 164 401 20 -157 167 -9 416 165 -364
5635 -364 -260 -182 179 165 -87 -499 -228 -159 223 219 -125 -447 7 -117 173 -229 -214 18 -38 229 198 -118 74
5658 74 -396 212 -296 96 154 -184 -134 10 -23 -31 -50 -112 78 0 250 490 52 -155 56 46 215 192 -288 -243
5682 -243 183 195 38 -143 -203 -240 -6 260 -38 -242 -248 35 -91 -28 114 -365 54 216 117 119 -34 -196 181
5705 181 153 77 26 -160 -182 62 387 42 -59 -422 -92 81 364 -67 -87 -146 33 86 -244 -211 37 -145 231
5728B31p6m7p1l63L05K02j35j44l5l80P84o2k66j03p1K41P7M3k41K36j25K21k40
5751a9j00j80J45K8L7J16K98m56j55L43j3K62n46J72j9pJ80M2m19J37j5M73q8
5774B16j85k92n1N90j28j4p0l0k64O65j93K9m98R8J03N9N03l66k93k6J16R3L29
5797C91l32j74K32O7j63j88O1J34k4K22q8M1k73K2KN83m36l07K27k26Q48l96m24
5820b01j01L38M0L63l44j91j13J51n7j5N24n31j1p7L87J96k34m17J95J33J87p2
5842A50n28N42l11j07P15m45j81j17K23L61j87L6k68p8K06K00J14k93l94M45K27
5863C10Rl52l91J87L92%k18Lj96J64K23j10L37n91k9J70L45q4k36Q0j26M02P7
5886C66Rl16k99K5L39l3J14j54j82K25r9K51m90J05L4K87l67M33m30l3R4M12j50
$$ plain form
5728 231 155 108 37 -326 -21 181 46 -98 -133 -513 271 209 -57 -160 -231 10 87 130 -111 125 0 221 -19
5751 -19 -119 -299 -154 -126 -89 27 325 -131 -286 57 44 306 -240 -68 -87 -94 86 128 -291 -154 -169 304 216
5774 216 31 -261 -312 278 150 136 66 36 -228 437 244 273 -225 -127 -24 35 538 172 -121 -147 -31 62 391
5797 391 59 -115 117 184 21 -167 -106 28 4 226 138 179 -94 -72 -70 513 77 -230 -3 -229 619 223 -201
5820 -201 -302 36 76 439 95 -96 -209 -58 -115 -130 394 -137 -148 -225 162 358 124 -293 -98 35 222 150
5842 150 -378 164 -147 -254 461 16 -165 -282 -59 302 115 151 -117 -195 11 211 325 32 -362 83 310
5863 310 319 -33 -424 -237 155 155 -63 -60 -256 -92 131 21 358 -233 -262 -92 253 169 -67 13 -113 289 366
5886 366 375 59 -240 -215 124 91 205 51 -131 94 -5 246 -244 -139 -105 182 -185 248 -182 -215 -121 291 141
5909A41j30j74R0K08R3J9k90k60L51k11O86l59j60j23L5J90j37K26o95J71L74
5930D5J13Km14R8j06M36K12l25j41N6L29J9m06R1o9m4M25m7j89j13j80J69J84
5953A45L72m97l84j35J028m91j31M8l22K81R3K86m77J53jL63r8Pm83J9O3M47l82
5976i6L05k66J5K62l1K37n44j4j34P79j57l71k67L8L31K84k15p2l04j05L61K40
5998B76n7j63m14J0L96J65K57p59J6K82J8L66j76o46L9J32M11j27Rl12J93O4J75
6021A55n0l76OK17J46K35m1n47r7L42M37k26l50l13O01L03j66j22j66j52J12L15
6043B63M9k45j17NoL32n09J33k14m0L29M74m90Nn2K16o9K22m87L8k52P48r5R9
6067C37l51m97M45J36q0Q1j69K30Q7j2j33k6k04J12L69j16j89q0k30J71M64j82
$$ plain form
5909 141 11 -163 -73 135 228 247 -43 -303 48 -163 523 164 4 -119 -84 106 -31 195 -500 -329 45
5930 45 158 160 -254 -156 -262 174 386 61 -80 -24 305 324 -82 9 -60 -104 321 274 85 -28 -208 -39 145
5953 145 517 20 -364 -499 529 38 -93 -45 -367 -86 7 293 -184 -31 -32 331 233 240 -243 -224 -161 286 -96
5976 -96 209 -57 -42 220 189 426 -118 -132 -266 513 356 -15 -282 -244 87 371 156 84 -220 -325 36 276
5998 276 219 56 -358 -348 48 213 470 -289 -273 9 27 393 217 -429 -390 -258 153 26 35 -277 -84 -20 155
6021 155 105 -271 -265 -48 98 333 292 -255 -352 -10 427 201 -149 -462 139 442 276 154 -12 -164 -52 263
6043 263 312 67 -50 -45 -51 281 -228 -95 -309 -349 -20 454 -36 -31 -83 133 64 286 -201 -163 -415 333 238 337
6067 337 -14 -511 -66 70 -10 71 -98 132 219 207 74 48 -156 -44 325 209 20 -60 -290 -119 345 163
6089A63j62j39n7Q2J0M64l79m28L01N42On36k78O04k30P5K17l32j77K60K38o2
6111A82j76j3K4J34O4P2m99l15O70m5L46l79j70m65N03J02K94k07j26j11K94J8
6133A97p4j59j74Q3K49K71l93j43k85K24K98J72j76o04L12J06L14l91J47k13J77
6154f2J81K45l47N7l16J40L45l27LLk8QL67m64Q3j93L36J72M3j06m40P7J06K52
6178A35Q6l63K9O5K06M6J75m01p9n7R7L87j60k91nm9j63O13n01K1m2J29R9O8O7
6203A12O5J09p8j52k28L4K4K11J02o3j87l30L62J70Q8l32l75P2K47R2K99k26j65
6226a49K38k53L18l52p3J27J44M0K14j79k56l98M90R6M06n93J47J22L64o03O2
6247h8R3m57N91k42R4l2J04k07Q2L67l32r0k28J39P01l95j13J1l86J46K99Q1n50
$$ plain form
6089 163 1 -138 -195 -113 -103 361 -18 -446 -145 397 403 -133 -411 193 -37 38 255 -77 -254 6 244 182
6111 182 6 -7 17 151 215 287 -212 -527 143 98 444 65 -105 -570 -67 35 329 122 -4 -115 179 197
6133 197 123 -36 -210 -127 122 393 0 -143 -428 -204 94 266 90 -514 -202 -96 218 -173 -26 -239 -62
6154 -62 119 364 17 74 -242 -102 243 -84 -81 -78 -106 -98 269 -195 -112 -305 31 203 246 140 -300 -223 -117 135
6178 135 221 -142 -113 -48 158 204 379 -22 -101 -158 -61 326 166 -125 -130 -179 -342 271 -230 -209 -251 -122 -23 45 112
6203 112 177 286 208 56 -172 -138 -114 97 199 136 -51 -381 -19 151 239 -93 -468 -396 -149 -57 242 16 -149
6226 -149 89 -164 154 -198 -271 -144 0 40 254 75 -181 -579 -89 7 413 -180 -33 89 453 -150 -88
6247 -88 5 -452 139 -103 -9 -41 63 -144 -62 305 -27 -117 -345 -206 495 100 -13 -2 -388 -242 57 138 -412
6270d12l06N67J40R4K07m37j58L26m3J6K04k46k85L00M29l09P4l42K64O6K88n41
6292a04JM1RP3J09k72L0Q8J87O0r0j74M8J5j6K23j17k00J84m66K77J98l2n02J64
6317b66L84K86m35n2n6M5K00K99q4l23K5l24J98O07m02l28J47K15J20L16m03m17
6339b48M44K68o61R6k37N04j8r2Q9m03M94l80n5L09l69M29j33k93K83OJ18l94
6361b43q2L00K00k55M71l59J05M1P0o57J6j7N54J4j89L6Jj2l21M69l06j39J86
6384a17M07k18K3R3k68j80K45L62j68j94m46K97L89k04J3j92J94l45J63M97m80
6405a29j10q1J49L16j93N9j20N9K74M2j50n11j2K42K69j99J62m23L26L91l41K86
6427C06l39n9k00M72P7k26n33M47K71O9m68k23L81J47j8K84n36j76K83m8J33L68
$$ plain form
6270 -412 -718 -151 -11 83 290 -147 -305 21 -22 -6 198 -48 -333 -33 396 87 161 -181 83 149 437 -104
6292 -104 -103 -62 -53 20 129 -143 -113 -25 162 222 132 -42 6 21 5 228 111 -89 95 -371 -94 104 72 -430 -266
6317 -266 118 404 -31 -83 -139 -94 106 405 321 -2 23 -301 -103 504 102 -226 -79 136 256 572 169 -248
6339 -248 196 464 -197 -101 -338 166 148 56 145 -258 236 -144 -199 110 -259 170 37 -256 27 33 151 -243
6361 -243 -325 -25 175 -80 391 32 137 178 248 -409 -393 -410 144 158 -31 5 6 -6 -327 142 -164 -303 -117
6384 -117 290 72 95 188 -80 -260 -15 347 179 -15 -461 -164 225 21 34 -158 36 -309 -146 351 -129
6405 -129 -239 -320 -171 145 -48 11 -109 -50 224 266 116 -395 -407 -165 104 -95 67 -356 -30 361 20 306
6427 306 -33 -92 -292 180 257 31 -502 -55 216 285 -183 -406 -25 122 104 388 -148 -324 -41 -89 44 412
6449D12n54J27m3k5p6J67k7o94J94M05K89l60J23Q8J95j25P0j98j62J3K98J3J39
6472B69m18n7L2K04K83k22J10j66K41K2J38m42J20j75J46j22n5j85J86j54P08
6493D63o4o56K94O6j84P3k8J93l29j9K73p0J03l21o7M13J22l56R5k16M8K76K20
6516C29R2q23K22L66o1L58m65k43K11l14N36k65k88J44K9J16R4J79n72J79J67
6537ik22L23j13j35j93M72K3j69k17K53k63O04l38pK13k87J76O1j66q7m8M13k37
6560D7K44l19K76l97j38L86K1J5m01P0L16L4l53M19k31j40L73l19K53l81K37o
6582Fj08L94k29L9k51K91k30M6o8k8k11P74l19o0n71M07r5K33J53k90j92J06L96
6605A93k25Nj32K59j63P3K22m18j67L26J62m2M5n0k63K8K31j9J42p9k86J31J9
$$ plain form
6449 412 -142 -15 -58 -83 -159 8 -19 -713 -519 -114 175 -185 -62 26 221 96 166 -32 -194 -181 117 130 269
6472 269 -149 -206 -174 30 313 91 201 35 276 298 436 -6 114 -61 85 -37 -92 -277 -91 -245 463
6493 463 399 -257 37 103 -81 -8 -36 157 -172 -191 82 12 115 -206 -273 140 262 -94 1 -215 -167 109 329
6516 329 421 -402 -180 186 125 483 18 -225 -14 -328 208 -57 -345 -201 -172 -56 38 217 -355 -176 -9
6537 -9 -231 92 -21 -156 -349 123 146 -23 -240 13 -250 354 16 9 222 -65 111 172 6 -81 -129 284 47
6560 47 291 -28 248 -149 -287 99 120 135 -266 -196 120 154 -199 220 -11 -151 222 -97 156 -225 12 6
6582 6 -102 292 63 102 -149 142 -88 -42 -110 -138 -349 425 106 46 -525 -118 -213 20 173 -117 -309 -203 193
6605 193 -32 -27 -159 100 -63 10 232 -186 -353 -27 135 93 138 88 -175 -147 84 65 207 128 -158 -27 -8
6628hJ06j77K1j22N3J30l68K39P1o5J42M45m04j67p3K92K00K59n88r4J01O1J17
6651A71k59P1j47J11J52j14J14j51j19P4L86j83O9l89n9M36n1j9n62J46N15kJ35
6674C25j57l41O7L84k55k3J53m47J30J83J98r1j73k79M37j10K25j99l75J92M76
6695C20OJ50m69qj03M54k58k14O9k15L18K93k14k36p4N2J91j8R8j12j94R3L59
6718B88J39m79K30o38O64o0J0j65m94K86J80J54k54P3j34L99l3J28m19l3L5Q7
6740c6K55l01p3o3J04J73L43l20j03j05J51J80q5k26L14n40L88q3j46J94k87M63
6762A97J48k07j41p7K1KJ25j84L43M2j44k22M7K26l54J41J00o3O1O2l39L6J1N83
6786D14k19j23m24K90M59j78J40l08j53M2M92m54K09l67J0L24J21J24n39k4M9
$$ plain form
6628 -8 98 -79 -58 -180 -127 3 -365 -126 -55 -120 22 467 63 -104 -177 115 315 574 -14 -108 -7 54 171
6651 171 -88 -17 -164 -53 99 -15 99 -52 -171 -97 289 106 175 -214 -273 163 112 93 -469 -323 192 190 325
6674 325 168 -173 -106 278 23 0 153 -294 -164 19 217 126 -47 -326 111 1 226 27 -348 -156 320
6695 320 326 476 7 -1 -104 350 92 -122 -53 -268 50 343 129 -107 -181 -129 62 44 142 30 -164 -71 288
6718 288 427 -52 178 -460 204 144 154 -11 -505 -219 -39 115 -139 -66 -200 199 166 294 -125 -158 -123 -36
6740 -36 219 -82 -155 -218 -114 59 402 82 -21 -126 25 205 120 -106 208 -332 56 -27 -173 21 -266 197
6762 197 345 138 -3 -80 -59 -57 68 -116 227 269 125 -97 -50 176 -178 -37 63 0 61 123 -216 -180 -169 414
6786 414 195 72 -352 -62 397 219 359 51 -102 -60 432 -22 187 -180 -170 154 275 399 -140 -164 -115
6807a15J72j14K95k91K0j19M08r1l20J68L7r1K52P9n05K79MP3mj55p2r8m1N10
6831B81J64m50k44L88j65P0j58j38l8M58j11J66M6m67J92q7K32n2j77J15k7L91
6853C89K40p67k2Q2K39r4J58l77q2K8N61K7m71J53l08j73O68K79m60j52J50J11
6875A79R8k45j80j93L81l52M67k3k06N5n4N84n79J56k35l88N45J34P4l30k6K84
6897A46k1Ll94K10pK57K43q3j95m57j2O93l45J46n22M02n5j1M7N7p0J27p2j06
6921a9J14k77K16Q1l7p8M6k18j86L08J45j43k93L51k70K24L53m37j70K81j12O32
6943E11m79j1j02Q3K03m38K85k23K7r2N46po87K75q2J10L47p3l37n3K4M54k31
6966E0L03n86J85L68k38J00r5q9m67K29L14J68n93J39K24l44O29l84j06K13j93
$$ plain form
6807 -115 57 -57 238 -53 -33 -152 256 165 -155 13 50 -41 211 290 -215 64 68 141 137 -18 -90 -188 -229 281
6831 281 445 -5 -249 139 -26 44 -114 -252 -290 168 57 223 269 -198 -6 -93 139 87 -90 25 -2 389
6853 389 629 -138 -160 -78 161 67 225 -152 -234 -206 355 382 -89 64 -244 -417 251 530 70 -82 68 179
6875 179 277 32 -148 -341 40 -312 155 132 -74 -19 -73 511 -68 88 -147 -535 10 144 218 -112 -138 146
6897 146 125 128 -266 -56 -63 194 437 354 159 -298 -310 383 38 184 -338 64 9 -2 45 102 32 159 87 -19
6921 -19 95 -182 34 115 78 0 46 -172 -358 -50 95 -48 -341 10 -260 -36 317 -120 -290 -9 -121 511
6943 511 32 21 -81 2 205 -233 52 -171 -144 -236 310 303 -384 -109 -191 -81 266 193 -144 -197 -173 281 50
6966 50 353 -233 -48 320 82 182 87 -2 -469 -240 74 242 -351 -212 12 -332 297 -87 -193 20 -173
6987a73K05L98q98N66l51K01J57j51j41k1L60O4n3k20j28j42K09M66m82J77p0
7008b7k56M76J41j87o82M66j55M17j94M9l05p5J51O32j68n19k3J13J83K60j70
7029A27k31J07P2K23k29kP2O7k13j74L89J82p85M54M25l15j92m35L24j43O31k01
7051A53l24j22M91k27K35k67l15J69N8ln2K14j36N4o0N72m57L21k21J9P1j77K41
7074B37l16j14K00N86m22j50k83L98j8M0q1j46K5J54k06J7M3l46K02L79k0k22
7096d3p0J94k06M24p4l33j37K34r9K68J14l48N4L7p3P5K93o81M95M0n2nk10L8
7120f5KJ19K34n4m35J17j09K08M62m15p0k00l5K15R9Q2o08L31j27M03k14J28m8
7143B0j78K19J75k8j86k97L89K13Rm69M4O3N1M06j23m72K38K71n65J27J46l02
$$ plain form
6987 -173 32 430 -468 98 -253 -52 105 -46 -187 -208 152 216 163 -57 -185 -327 -118 348 -134 43 -27
7008 -27 -283 193 334 147 -535 -69 -224 193 -1 48 -257 -332 -181 451 283 -236 -259 -146 37 297 127
7029 127 -104 3 75 298 69 67 139 206 -7 -181 208 390 -395 59 484 169 -23 -458 -134 -277 354 153
7051 153 -171 -293 198 -29 206 -61 -376 -207 -149 -152 -204 10 -126 -72 -132 440 -17 304 83 102 173 -4 237
7074 237 -79 -193 7 593 171 21 -262 136 118 158 77 -69 -44 110 -96 -79 -36 -382 -180 199 179 -43
7096 -43 -113 81 -125 299 225 -108 -245 -11 -110 158 272 -76 -22 15 -58 17 310 -371 124 164 112 107 -103 -65
7120 -65 -63 56 290 236 -199 -82 -191 17 479 64 -6 -206 -241 -26 73 155 -453 -122 -249 154 -60 68 20
7143 20 -158 61 236 208 22 -275 114 327 336 -133 -89 -26 25 431 308 -164 74 345 -220 -93 53 -249
7165b49K67j32K35j17n8o9j8mP38o30k79K5N77k26J34k33l69N04j60P48n58k54
7187a28K35j97N8j48KK07j52J90J47k74N51q50L62J67J69l49j26kK60k57M66k73
7209E8M9n34N04n0K62l38k58K06J14l9l2k36QK26K95k26k46J58J6L27m27J40K73
7232B50m87J01K11J60j77l64J44M7J4M37m84m55P25k2MN9n3k92J11M03R8l25k95
7255a90J66K1K95j62k09k20M22N3K90l37l71L03N1p6K3l16Q7K11q1R0q2k99J10
7278b21N4M28j30K04l65J94p7L4J65n87L20rM93l21k04k39N2L09K55l35R8k39
7300a21K44J2p4j7k71Q0P0J45lK09l67K45j49k10M64m21n9L02l1K67j60l40j06
7323b91L02l5M71l35j93J70L43k09j68j15k20kj66N54r1k57J63j27L28k6l63J30
$$ plain form
7165 -249 18 -114 121 4 -54 -123 -141 -145 593 -37 -316 -291 286 60 194 -39 -408 96 -64 684 126 -128
7187 -128 107 -90 -32 -180 -178 29 -123 67 214 -60 491 -359 3 170 339 -10 -136 -138 122 -135 331 58
7209 58 107 -427 77 27 289 -49 -307 -101 13 -26 -58 -294 -286 -60 235 9 -237 -79 -63 264 -163 -23 250
7232 250 -237 -136 75 235 58 -306 -162 -115 -101 336 -148 -603 122 100 104 163 110 -182 -71 332 430 105 -190
7255 -190 -24 -3 292 130 -79 -299 123 176 466 129 -242 61 112 36 59 -257 -170 41 -40 50 -32 -331 -221
7278 -221 -167 261 131 335 -30 164 87 121 286 -301 19 10 503 182 -22 -261 -209 100 355 20 118 -121
7300 -121 123 135 61 44 -227 -147 -77 68 65 274 -93 152 3 -207 257 -164 -223 79 48 315 155 -185 -291
7323 -291 11 -24 447 112 -81 89 432 223 55 -60 -280 -282 -448 106 15 -242 -79 -206 122 96 -267 -137
7345a37N3J69J01P2l92j55J65Q5L62k82k07R7M66k9P2o19K91m97O05k17J64n46
7367c79M29j96L24j24P9l52N1K98k83Q1K86k04l99L98L65m61Pj96L08K95k03l36
7389b12J77R0J60r6M8o04J37L34R4j60J48k52k8M55k73J9J74j10j79L55j88O4
7411A53j34l54K95J89N5j50l2P2L42m32K74k83p2K2J86Q6k25k65L5J48J18J76
7433B04l13r7J83J30K43l26m17r3O60j94J68Q4K5k85j6O0M7l08L96k5K65l05j10
7456b4k69K83q2R2M02o66L1L49K08k21N3k58J55k56L20k03j5K72m10K21K69m63
7478b12O2K40k89O78m5k31n44J89J89J34r0r7O6J50m20M91j60l19O3K6J90M94
7500E65n34R6j08k80K60K81n23K70k36J77r3K01j1J0j0m5j75j56L23K5L06l30
$$ plain form
7345 -137 -84 85 186 258 -134 -289 -124 -39 323 41 -166 -69 397 368 440 -179 112 -385 220 3 167 -379
7367 -379 50 -146 178 54 133 -219 -168 130 -153 -72 214 10 -389 9 374 -87 -80 -276 32 327 124 -212
7389 -212 -35 55 215 119 167 -437 -300 34 128 -32 116 -136 -164 291 18 37 211 101 -78 277 89 153
7411 153 19 -335 -40 149 204 54 22 94 436 4 278 -5 -77 -55 131 217 -8 -273 -238 -90 28 204
7433 204 -109 -206 -23 107 350 24 -393 -486 174 -20 148 232 257 -28 -44 16 63 -245 151 126 391 86 -24
7456 -24 -293 -10 -92 0 402 -264 -233 116 324 103 156 -102 53 -203 117 -86 -101 171 -239 -18 251 -212
7478 -212 -150 90 -199 479 434 203 -341 -152 37 171 81 -16 50 200 -220 271 111 -208 -145 -119 71 565
7500 565 31 127 19 -261 -1 280 -243 27 -209 -32 -125 76 65 75 65 20 -155 -311 12 37 343 13
7522A3k51J42R8k7q2K85mm28N1K10m5J59Q4l17N1K25J16m94K38n8o4J85j82M45
7546C50m26k48J53J64l3j11O1J0K88m9o7l24j07N70m8k80J9Q1k28M60k86L19k56
7569A2l0j05K17L03m11j24j54L82J4K18k21l02K23J9P0m23qN90l11K12J6k71j53
7592b37J08q4L66J97m94K75j11k25N52n05m3K30P6k35J06P9l2n2K15K26m36l97
7614d21M02j15p3j4J77n9k5J37J95L1l39m0R1J9J78j03J17J19k92J58m9j40j59
7637b05L34j73K01J40p4j94j14j66M77k03N5l2j9j40L38m71J05K72k17K02k52
7658a36J23k3L29k93N7o1k73J34M39o0l13L56j77N5k66J74qL1Q8P9k6N1k04p2
7682Dj68M91k88j11M41o95J5L38Nj08k98R5M30J24J56m21j50R6P6Q7J38p8n3l12
$$ plain form
7522 13 -238 -96 2 -25 -107 178 174 -254 -203 7 -38 121 205 -112 -61 164 280 -214 24 -34 -98 87 -95 350
7546 350 -76 -324 -171 -7 -40 -151 -90 -80 208 159 92 -232 -339 231 183 -97 -78 3 -225 235 -51 268 12
7569 12 -18 -123 94 397 -14 -138 -292 90 104 322 101 -201 22 41 111 -312 -320 270 -41 171 187 -84 -237
7592 -237 -129 -213 153 350 -144 131 20 -205 347 -158 -201 29 105 -130 -24 55 23 -29 186 412 -24 -421
7614 -421 -19 -134 -207 -221 -44 -103 -128 9 204 235 -104 -144 -53 -34 144 41 158 277 -15 143 94 -46 -205
7637 -205 129 -44 157 297 223 29 -85 -251 226 23 78 46 27 -113 225 -246 -141 131 -86 116 -136
7658 -136 -13 -36 293 0 57 -4 -277 -143 296 236 -77 279 102 157 -109 65 57 88 176 255 229 280 76 4
7682 4 -164 327 39 -72 369 -326 -311 27 32 -76 -374 -279 151 275 431 10 -140 -44 32 119 257 179 126 -186
7706a86N58m42j87L09l01O85n07Q1k97J92q6J86L20o13J64J06M87n21K68J01m28
7727a11J56Q0K36j46m60K06j3K20L8k61O1l12L68N8m8Q3j14J97l45M8J99k37m1
7750a38o3j3L15j05n5j23L24O9l03r7J48J53j91J14K56l32k17J24L57O2Lj83J34
7773B39n28N96j63p3k4r8J07m57M46k26k6M65j37k18K60k30q2J63j4r3J74M5J02
7796B28q1J44p19L04O5k43M89j38l7J12o8j29J80j23l59K54K87J30k78j92N7J0
7818a07m5mK82q5J65k18Q2k06J23p4k97K39nM22j88j1k09O6Q7M1k68j83N0K27
7842a16M5J93k73J47P7k23J4K95M1J0j54l9j65N7j0L54K66n93J05j14k26J81M01
7865B73j42l81r9O01l7q2M2l0m66J67nL85ok23k6J78K28O2m17K50p30L40M71k86
$$ plain form
7706 -186 372 -70 -257 52 -249 436 -71 10 -287 -95 -181 5 325 -288 -124 -18 469 -52 216 317 -111
7727 -111 45 125 361 215 -245 -39 -52 168 206 -55 6 -306 62 120 72 155 41 238 -107 -59 140 -97 -138
7750 -138 -201 -214 101 -4 -59 -182 142 211 -92 -189 -41 112 -79 35 291 -41 -258 -134 223 285 288 105 239
7773 239 -289 307 144 71 47 -51 56 -401 45 -181 -207 258 121 -97 163 -67 -149 14 0 -93 81 126 228
7796 228 147 291 -428 -124 -59 -302 187 49 12 124 56 -73 107 -16 -375 -121 166 296 18 -174 -117 -107
7818 -107 -152 -156 126 41 206 -12 70 -136 -13 -87 -384 -145 -150 272 84 73 -136 -70 17 58 -210 -393 -343 -116
7842 -116 -71 122 -151 -4 73 -150 -136 159 200 210 56 17 -148 -91 -101 253 519 -74 31 -83 -309 -128 273
7865 273 131 -250 -349 252 215 133 175 145 -321 -154 -159 226 220 -3 -29 149 377 439 22 272 -458 -118 353 67
7889F7J9l61K97Q1K14n05K11m0J10J41J8l69K24k4J00J46k83l36K08K13N0k40
7911e9j04P6m7k16N88j63j89P4j54R7mm5J36l71K24L93m42L61n28K36J51q8j35
7934b09Q6P5l11O80k18k5k41J38J89k88J35k36o4L50J96n0l33J64KK60l89L36
7956B47m12J1l7J27J80j86K83j90l0L80j16j42j3j97J13L67j84j55k39j7O66o34
7978a78L85n5l46K20J50l04Q1n16M60J16j11K58N7l9l72K06N8M6j12k34N38m30
8000a22J14j90L14k76K53L3R6m31M97r1j40n8l7M3J4l67K91L82o57J3M82k14m5
8023i6J60k07O8R0n9J64j89j59J1L9J52k0j76J4J53O3k09K66M5rn3K22m98J19
8047a09l19L06J38q5OK64J3m20J03K16R4m11J13O4N3K3k39L71j56j03P0K42j40
$$ plain form
7889 67 86 -275 22 103 317 -188 23 -17 93 234 252 -117 107 83 183 329 46 -290 -82 131 181 -59
7911 -59 -163 -87 -134 -350 238 75 -114 -40 -194 -97 -101 -146 -10 -381 -157 236 -206 155 -373 -137 14 -74 -209
7934 -209 -123 -48 -359 321 103 78 -163 -25 164 -124 11 -225 -289 61 257 207 -126 38 40 300 -89 247
7956 247 -165 -154 -191 -64 116 -70 213 23 -7 373 257 115 102 -95 18 385 201 46 -193 -210 456 -178
7978 -178 207 152 -194 26 176 -128 -47 -563 -103 13 -98 160 217 178 -194 12 70 116 4 -230 308 -122
8000 -122 -8 -198 116 -160 93 126 222 -209 288 197 57 -1 -38 5 19 -348 -57 325 -332 -319 163 -51 -96
8023 -96 64 -143 -75 15 -44 120 -69 -228 -217 -178 -26 -46 -222 -208 -55 8 -201 65 110 101 48 270 -228 -109
8047 -109 -428 -122 16 -69 -63 201 214 -206 -103 113 207 -204 -91 -27 26 49 -190 181 25 -78 -8 234 94
8070I4l23L69k65J9O7J35n41L83O5L28m29K6K34J19k32j35L21k61k48M75L7J03
8092C41m65k62M17o6J82L3k11k8L47k15j05R7j08K20q4P%j81m2K56R7l96M65k92
8116Gj53K73k34J69J48L6j95k46J4K49J82l37n2K74k9l76j90M84j51O41o49K46
8138A11k0k91M06j1q2l93J65P08o14J3l15K00L47j10LR2l38K25M5K10l16J04l97
8161b58K46M6k44J26L4J01j79K00K3J85J3m06K99p3j49p7q7J7K28m9k37M57n39
8184c23J89M5Q1P3j45J69q5
$$ plain form
8070 94 -229 140 -125 -106 -39 96 -445 -62 3 331 -98 -72 162 281 49 -86 235 -26 -274 201 238 341
8092 341 -124 -386 31 -35 147 180 -31 -59 288 73 -32 65 -43 177 93 100 100 -81 -123 133 230 -166 299 7
8116 7 -146 127 -107 62 210 246 51 -195 -181 68 250 -87 -139 135 106 -270 -460 24 -127 514 -135 111
8138 111 91 -200 206 195 113 -280 -115 593 -21 -8 -323 -123 224 114 117 209 -129 96 141 351 35 139 -258
8161 -258 -12 34 -210 -84 -50 51 -128 72 95 280 293 -113 186 113 -36 -113 -200 -183 45 -4 -241 216 -323
8184 -323 -134 -89 -8 65 -80 89 4
8191D
$$ Imaginary data points
##PAGE= N=2
##DATA TABLE= (X++(I..I)), XYDATA
0@%%%%%%%qJ6j6J6k2L0l3M1m9N8p3Q7j03J20j37J59j85K12k42K75l12L55m03M52
31B38n09N74o40P15p99Q87r85J095j212J343j489J646j821K017k236K484k765
48a457L087l461L898m421N059n857O890q280J0265j3349J8821l1347J06676K7930
62A14454k07837N4269q088M1650J27680q9664j28783Q0063l952K7404R3181j02531
74b154p5830Q0267l7658M5700J16252j39736j04264J10339K0754L4732M1779j56861
86f6680m6660J44570J7666l599j4245j28309L8882J32791n2393j0658J8966j14460
98h4129L4302J25930m9204j8801J865r9900N8138J22822n5096m2501k7054n4234
110h7862J16167Q0758j19835k9561J9682l2729R9288M3876j27492p366L9643k5956
$$ plain form
0 0 0 0 0 0 0 0 0 -8 8 -8 8 -14 16 -17 24 -25 33 -40 47 -56 64 -73 86 -99 113 -129 146 -166 189 -214 238
31 238 -271 303 -337 378 -421 466 -519 576 -636 707 -782 864 -957 1060 -1176 1308 -1457
48 -1457 1630 -1831 2067 -2354 2705 -3152 3738 -4542 5723 -7626 11195 -20152 86524 114454
62 114454 -93383 -39114 -47202 -5552 122128 32464 -96319 -16256 -20208 7196 100377 -2154
74 -2154 -77984 2283 -35375 10325 126577 -13159 -117423 -7084 13670 48402 90181 -66680
86 -66680 -113340 31230 48896 45297 31052 -97257 -58375 74416 22023 11365 30331 -84129
98 -84129 -49827 76103 26899 8098 9963 -89937 -31799 91023 35927 -6574 -33628 -87862
110 -87862 28305 109063 -10772 -40333 -20651 -53380 45908 89784 -37708 -45074 -5431 -31387
122c1387P7015K3977j09431k800K6076j96R1834k1388j31150L2389N6854k522
134I271O0491n0818j14504P0706O7603k6530K3242m6953o8993P5817L7930k4219
146A3043K6243o2129n8143R6239L5207l6515Q651o7121l0448J19664K2301p1429
158d437j0303l3121J4703R7475k3106o7794J2356k0071J8350P9539l9373n6781
170c2563K2033k2431K4554Q0757n0244p0183K0361Q276M4911M6018q3665n2797
182f4973N2676K1228K7248Q625q5864j2243P0089j095M850Q691o7808l829N9975
195A7570o96R113n162p2554J1452P1464m9q335k9397n8638N0084P3236l3531l0801
209f244j5762k3746N7429M2747n0502k0414j035j3636M9749K7126m7823j5039
$$ plain form
122 -31387 45628 69605 -39826 -42626 -16550 -16746 75088 53700 -77450 -45061 11793 9271
134 9271 69762 18944 -95560 -24854 42749 16219 39461 -7492 -76485 -668 37262 13043
146 13043 39286 -22843 -80986 15253 50460 13945 22596 -44525 -74973 44691 66992 -4437
158 -4437 -14740 -47861 -33158 64317 41211 -26583 -14227 -34298 -15948 63591 24218 -32563
170 -32563 -10530 -32961 -8407 72350 22106 -48077 -27716 -19440 25471 71489 -12176 -64973
182 -64973 -12297 8931 36179 44804 -41060 -53303 16786 15691 20541 29232 -38576 -42405 17570
195 17570 16874 25987 20825 -51729 -40277 31187 31138 22803 -6594 -65232 -15148 58088 24557 -6244
209 -6244 -22006 -45752 11677 54424 3922 -16492 -17527 -31163 18586 45712 -2111 -17150
221a7150m718n345N9812J7007o5276j7084J1823J6474N1817j4519p0846L889L2655
234a461J5440K5749l0891n2387K4090K8878N492J6929l2687m3227L0279L0471
246A6675M528N617m2880l1886M6402L2744r061j3826l9435n960N5471J5372k4983
259H778j4233k5493Q197M9773J616k8246j1964j8654J7063M8612q151l6748j2871
272b2321m338L1847L7875k9299l9536K193J2857K9428J6588l8070k6319J4495
284a4600J3911K1194O831l7358j9740J8604J7561K0357m405m5150j0781L2430
296a146K2523N996k3947l8710J2223M0174P835j2066k3399j9860K2269K9608l431
309A8069j2714j8552j3308K3137K7904o054j8735k2169l815L5800K3584k1226
$$ plain form
221 -17150 -21868 -27213 32599 49606 -15670 -32754 -20931 -4457 47360 32841 -38005 -34116 -1461
234 -1461 13979 39728 8837 -43550 -19460 9418 14910 31839 -848 -44075 -13796 16675
246 16675 21203 26820 -16060 -47946 -1544 31200 22139 8313 -31122 -37082 18389 33761 8778
259 8778 -5455 -30948 -22751 27022 28638 392 -11572 -30226 -13163 35449 27298 -9450 -22321
272 -22321 -26659 5188 43063 13764 -25772 -23579 -10722 18706 35294 -2776 -29095 -14600
284 -14600 -689 20505 27336 -10022 -29762 -11158 6403 26760 22355 -22795 -33576 -1146
296 -1146 21377 27373 3426 -35284 -23061 17113 24948 12882 -10517 -30377 -8108 21500 18069
309 18069 5355 -13197 -26505 -3368 24536 18482 -253 -22422 -26237 9563 33147 11921
321A1921k8629j0625J6593L5997K770l3648j8052P388J9885K1400r660k7883p348
334a9891R714J7672J6548j2638k8423n443J6711K3004R269k6210k8370Q917K8101
347H961J6433r888l0394j2141K2361K2720J227j6517k0822j222K1746J6131l104
360A5491j7558j8998L928K5854J5010j1934k4452j2788J7979K8601J179k4144
372a832j9877L932K4414J6474j1728k2033q535J0165K0236Q227j3385j9487n538
385a8967J4669K1385M002k2516k0478M745K4749J6339j1923k6345q342J8167K1597
398A7082J564j8618j7716L101J7260J4114l838j7144j3228M746J9255J3453r567
411A0464k2558r854J5766K3777L255k2209k0473N954K3645J3265j1234k2049o510
$$ plain form
321 11921 -16708 -27333 -10740 25257 28027 -5621 -23673 -16285 3600 25000 15340 -12543 -19891
334 -19891 -10177 7495 24043 11405 -17018 -22461 -5750 17254 26523 313 -28057 -19140 8961
347 8961 25394 15506 -14888 -27029 -4668 18052 19279 2762 -18060 -19282 2464 18595 15491
360 15491 -2067 -21065 -17137 8717 23727 11793 -12659 -25447 -7468 21133 22312 -1832
372 -1832 -21709 -17777 6637 23111 11383 -10650 -19185 -9020 11216 19443 6058 -13429 -18967
385 -18967 -4298 17087 21089 -1427 -21905 -17160 7589 23928 12005 -14340 -22682 -4515 17082
398 17082 18646 28 -17688 -14587 2673 16787 12949 -4195 -17423 -12677 6578 20031 10464
411 10464 -12094 -21948 -6182 17595 20850 -1359 -21832 -15878 7767 21032 9798 -12251 -18761
424a8761J3759J6582L838j1892j5653k598J2698J5203K995j5545j8326J980K1378
437E658J4863q273k4015j0544J7321K2652K75j9091j6690L950K0068J0451p982
450H643j4810p982N858J5448P669q292j4548q263R733K0577L882j7408j7910J814
464a5589K0679J5854j0158k2687n915J3170J7146L266j5970j3523K644J2106J0907
477A1930P6j4536j0964L090J3892J2456m694k0187r696J3535J8046M473j5938
490A483j8943L790J9987R464p023j6016q029R833J4885J857p263j1639o447J0911
504c150J4488J396j1700j4354j385J8736J3447q506j7290q088J0354J9375J860
517A5183j6375j1182J869J1502J2107m150j4040n460K902J0667J0708n752j5887
$$ plain form
424 -18761 -5002 11580 15418 3526 -12127 -14725 -2027 13176 16171 626 -17700 -15720 5658
437 5658 20521 12248 -11767 -22311 -4990 17662 17937 -1154 -17844 -13894 6174 16625 8643
450 8643 -6167 -14149 -8291 7157 14826 6534 -8014 -16277 -6544 14033 17915 507 -17403 -15589
464 -15589 5090 20944 10786 -11901 -17816 -4646 12500 15766 -204 -13727 -11083 1023 11930
477 11930 12006 -2530 -13494 -10404 3488 15944 11250 -8937 -18633 -5098 12948 17421 1483
490 1483 -17460 -13670 6317 15781 8758 -7258 -15287 -5454 9431 11288 4025 -7614 -14061 -3150
504 -3150 11338 12734 1034 -13320 -14705 4031 17478 8972 -8318 -16406 -6052 13323 15183
517 15183 -1192 -12374 -10505 997 13104 8954 -5086 -10546 -7644 3023 13731 7979 -7908
530g908n492Q003J4671P158j5335j6885M239J5218J0941m275j8623p269J2548
543c009J1557J972p026j2875j672J1338P904J362p724j3671K66J5920Q198l733
557H807j3711j1394J0090J8933j57j2477j0994j649J5065J1391p768j0891m535
570i290J977J2512O785q018r926l759L374J4622N727j3688j1329R28J0009J4423
584A4347m207j8625m275R398R942O131j0292j3400L025R054N495K733r557j1074
598a1305M424R749O010O05j3744j0326J0638J2508J854o904j4074k071J6811P841
612A2016o844p938p563L301J4389J817p961m944n385M574J3226P7r186o302l770
627a0493R724J4085n796j3631m038L892J2843P005j3509j0369M110N874P916J473
$$ plain form
530 -7908 -13400 -5397 9274 16432 1097 -15788 -11549 3669 14610 10335 -8288 -15557 -3009
543 -3009 8548 10520 3494 -9381 -11053 285 8189 9551 1827 -11844 -11578 4342 12540 8807
557 8807 -4904 -16298 -6208 12725 12568 91 -10903 -12552 2513 13904 6136 -4755 -9290
570 -9290 -7313 5199 11984 3966 -5960 -9719 -6345 8277 14004 316 -11013 -10085 -76 14347
584 14347 10140 -8485 -12760 -3362 6580 12711 2419 -10981 -7956 1098 6593 9326 -231 -11305
598 -11305 -6881 2868 8878 9483 -4261 -14587 -3949 8559 10413 3509 -10565 -12636 4175 12016
612 12016 5172 -2766 -10329 -7028 7361 9178 1217 -3727 -9112 -4538 8688 8765 -421 -6723 -10493
627 -10493 -769 13316 7520 -6111 -10149 -6257 6586 13591 82 -10287 -6177 -303 7613 9086
641I086j2556n460N611M089P380K32j3580n542Q431P002N683n476j5729M73J3514
656C158N623j289r651j0255P638J3098j680m465o161n903R200Q787l151l653o512
671e216m775J1206R429n875p269o346L62J5946M863j2963o891J08N802J1605k243
686G743j2711j484K964M011Q590m007j1343l7L621M858Q202o957j3116K579P885
701G98O117K418j2118r422R270Q379J083k536j0514k724J1016M009j954j189r182
716f549j669J1025L969k777m051q983K030J4210J319p557n717m875Q577J1745
730A0697n621r025j016j96O933P434p037o698K94N52O727O304q296p405J068L120
746b165R303K210j3267n624O969N607M953l177j2732N78R653K496j48l449q349
$$ plain form
641 9086 -3470 -8930 -3319 770 8150 8382 -5198 -10740 -2309 4693 10376 4900 -10829 -10356 3158
656 3158 8781 7492 -2159 -12414 -4776 8322 6642 2177 -3984 -9887 -687 8100 4949 1296 -5216
671 -5216 -9991 1215 10644 4769 -2500 -8846 -8484 7462 12325 -638 -7529 -7421 -1619 9986 7743
686 7743 -4968 -6452 -3488 523 9113 5106 -6237 -6274 -2653 2205 10407 3450 -9666 -7087 798
701 798 6915 9333 -2785 -12207 -2937 5442 6525 3989 -6525 -9249 1767 5776 3822 2633 -6549
716 -6549 -8218 2807 6776 3999 -52 -9035 -7005 7205 8524 967 -4750 -9625 -1048 10697
730 10697 5076 -3949 -4965 -5161 1772 9206 2169 -4529 -4235 -3683 3044 9348 1052 -6353 -5285 -2165
746 -2165 7138 9348 -3919 -9543 -2574 3033 7986 4809 -7923 -7345 2308 4804 4656 1207 -7142
761g142K775P240Q83J274m702r510M762R497O66j823p710o356R956R423m454o615
777a836m748M11J0499L723p866l294j710J209Q753J155p144k587r51J714R436
792F764L27r788l609J820O272P380n330j1054J573N244N004K630p980p880O134
807b493N096R28J123o421n189N275M452K082n02q432l850P926N302j96m243q291
823g433R41J1259K478n599m088m178M360P907r60n332k667k317M739P524k722
838C912n329k918r87O809P114n876p734l22L011P262K355q753n392L397M520L937
854E006l80p952k227M311K778L551j646q062j285N680M445J441m857q271J928
869e540Q890K448k346o573m272O127O985j619l624m114j811N958M655k680k841
$$ plain form
761 -7142 -4367 2873 3756 5030 328 -9182 -4420 5077 5743 3920 -3790 -10146 -190 9233 4779 -1836
777 -1836 -6584 -6173 4326 8049 183 -3111 -4821 -3612 5141 6296 -848 -3435 -4386 -2672 6764
792 6764 7091 -2697 -6306 -4486 1786 9166 3836 -7218 -5645 -401 4603 7233 -747 -8627 -2493
807 -2493 2603 3531 4654 -1767 -6956 -1681 2771 4853 4351 -4081 -7931 -5 5297 5101 858 -7433
823 -7433 -6492 4767 7245 1646 -2442 -6620 -2260 5647 4687 -645 -3312 -5629 -890 6634 3912
838 3912 -1417 -4335 -5322 1487 8601 2725 -5009 -5331 -2320 4942 7297 -1456 -6848 -3451 1069 5006
854 5006 4626 -3326 -5553 -1242 1536 5087 3441 -4621 -5906 -226 4219 5660 803 -7468 -5540
869 -5540 3350 5798 3452 -3121 -7393 -1266 5719 4100 476 -3638 -5449 509 5164 2484 -357
884c57l709q04O625N013l912n611l274L087Q737R26p798m627J259N406N346k869
900C438p096r43L302L255L140l501n492LK934L750L317n496o433J413N829M291
916E711j182p873m040N997O268O0m306n808L81O076L653k013l480l988R00N899
932B255K408k242m064m270L138P098J199n126n130p33O269N609k953o517k211
947e270K671N835K374m704m779j96L111M451J685n327m892J435M226M106o20o967
963b861k845L520N672K035m184o451K23N650M243j404m567l684J639N252K480
978D718k023m789k971L164N653J186m385n280n15O083M685j825n952l198L008
993b441N750K035l984n092l82L466M544K84m145m146J1M606M393q57o147l589
$$ plain form
884 -357 -4066 -4870 1755 6768 2856 -2755 -6029 -2942 5795 6721 -1077 -5704 -4445 961 6307 3438
900 3438 -3658 -4601 -1299 1956 5096 1595 -3897 -3894 -960 2790 6107 611 -5822 -4409 1420 5711
916 5711 4529 -3344 -7384 -1387 4881 4941 635 -5173 -4792 1284 4937 2924 -556 -4544 -3644 2255
932 2255 4663 2421 -1643 -5913 -2775 4323 5522 396 -4734 -5467 802 6411 3458 -3059 -5270
947 -5270 -2599 3236 5610 906 -3873 -4069 -958 3493 5178 -149 -5041 -3606 620 4726 4106 -2861
963 -2861 -5706 -2186 3486 5521 1337 -5114 -4891 759 5002 3598 -969 -4653 -3014 2238 4718
978 4718 2695 -2094 -5065 -1901 3752 4938 553 -4727 -5242 841 5526 3701 -2251 -5449 -2441
993 -2441 3309 5344 1360 -3732 -4114 -648 3896 4180 35 -4111 -4100 506 4899 4042 -2105 -5694
1009e694L096O218K331m380o362K7N360M131p69n290l487J915M899K259k259m211
1025b216k420K702M955J731l536n665p86N498N326q70o506m196K857O686K207
1040E767m391n466l58M014M711o11l940l702O32M113L639q58m930l879K539N279
1056B559L004l641o652o45N480N188j343n594l958K682N260K682l235m583j501
1071d297K530N024J041l549m467r48M586M834l77n745m155K215O111K633l556
1086A880n873o04M472M324qm711l473M43M691K823q33m803l085K123N021L057
1102E444l412o097r63M686N593p63n436m033K075N192K471l021m315j333K513
1117a399M433J375l420m224r86L665N088k71n383m729K341O173L190l644o262
$$ plain form
1009 -5694 -2598 3620 5951 1571 -4791 -4764 596 4727 3958 -1332 -4819 -2904 1995 4254 1995 -2216
1025 -2216 -4636 -1934 3021 4752 1216 -4449 -5235 263 5589 4719 -1787 -5983 -3126 3560 5767
1040 5767 1376 -4090 -4448 -434 4277 3666 -274 -3976 -3344 769 4408 3550 -1380 -5259 -2720 2559
1056 2559 5563 1922 -4730 -5375 105 5293 3950 -1644 -5602 -2920 2340 5022 1787 -2796 -4297
1071 -4297 -1767 3257 4298 749 -3718 -4666 -80 4754 4377 -1368 -5523 -3308 2803 5436 1880
1086 1880 -3993 -4597 -125 4199 4191 -520 -3993 -3550 1141 3964 3131 -1672 -4757 -2634 2387 5444
1102 5444 2032 -4065 -5028 -342 5251 4488 -948 -4981 -2906 2286 4757 1736 -2579 -3912 -1399
1117 -1399 3034 4409 989 -3235 -4221 -556 4532 4261 -1122 -5851 -3510 2663 5853 2209 -4053
1132d053j198M909M682n77m482l599J477M491K369j455l808k901J250M919K672
1147D696k283n110k884M774N987m50n613m335J676O299L078m416m909o13L689
1162d14L973K09l735l576L18K958L744N80m460m001P87N244L742k322p033j704
1178e690N015N175J06n316m945K850N286K044k419m695j723L044L956R24k118
1193A494m014k058L923M716N3m208n144P53O787L135l743m810j764M052N265j3
1209D424n275k814N25L269M072j201m856k131J563L342M323k736n955j530L948
1224a032N217J189n900n159K557N220K741j854n784j972M357L164M70j595m946
1239c327q34M414L312n1l041n553O43O600L005l088m793k931M388O170j158m628
$$ plain form
1132 -4053 -5251 -342 4340 3763 -719 -4318 -2841 1650 4019 2564 -1244 -4145 -2895 2024 4696
1147 4696 2413 -2697 -5581 -807 5180 4730 -883 -5218 -3542 2757 5835 1419 -3490 -4103 -414
1162 -414 3559 3768 33 -3543 -3225 -267 3477 4057 -403 -4404 -3617 1627 5369 3047 -3986 -5690
1178 -5690 -675 4500 4606 -710 -5655 -2805 2481 4525 2106 -2589 -4312 -1268 2688 3612 1494
1193 1494 -2520 -4578 -655 4061 4114 -94 -5238 -4485 2302 5437 1694 -3116 -4880 -828 4437 4424
1209 4424 -851 -3665 -3140 129 4201 3000 -1856 -3987 -2424 918 5241 2505 -3450 -4980 -1032
1224 -1032 4185 5374 -526 -5685 -3128 2092 4833 2979 -2805 -4777 -420 2744 3214 1619 -3327
1239 -3327 -4161 253 3565 3514 473 -5080 -4437 2163 5168 2080 -2713 -5644 -1256 4914 3756 -872
1255h72k720j57M704M128l261l715j064P4M323L823l591m313j329J661O153J593
1271E437o023m471J942M605M236k157p564o53M508L008J087k880n320J046L918
1286G19J577J027k813n615J735N386J798l51n735m133N503O109j327l846m750
1301d716J13O969K994m240l103j664J060N657J149m140j539k291J415O587K78
1316D529n383k456l80M096N875k975p288m13L259M163K324n225n412K814L489
1331A017J888R32n033l694L443L134J768rn873l470N636L751J77k209o552j46
1347e240Q037J680k981l072l603L043O371j034l462j687k552L338N978k250l729
1362a163j501j269M574N536m024n536k58J585N441K240o552l875K848J903M165
$$ plain form
1255 -872 -3592 -3749 955 5083 1822 -1893 -2957 -2883 1440 5263 1672 -2641 -3970 -2309 3844 5437
1271 5437 -586 -5057 -3115 1490 5726 3569 -3995 -4648 -140 2868 3955 1075 -4245 -3199 719
1286 719 2296 3323 510 -5105 -3370 2016 3814 3463 -2272 -6405 -902 5207 3880 34 -4716
1301 -4716 -4603 2366 5360 1120 -1983 -3647 -2587 3070 4219 79 -1460 -3751 -2336 4251 4529
1316 4529 -854 -3310 -3690 406 6281 3306 -3982 -4395 -1136 3027 5351 126 -5286 -2472 1017
1331 1017 2905 3837 -1196 -4890 -1447 1687 3455 3446 -2427 -5897 -261 3490 3667 1458 -5094 -5240
1347 -5240 2797 4477 1496 -1576 -5179 -2136 4235 3201 -261 -1948 -4500 -1162 4816 2566 -1163
1362 -1163 -2664 -3933 641 6177 2153 -3383 -3641 -2056 3385 5625 -927 -4802 -1954 -51 4114
1377D114l69o355j495L355J549L063j011o314q83M368K308K403l800p093K587
1392c573O274R05q13m535m409N258N375j927k086l039k041N581L423k989j117
1407B87l283j324O665K368l807k960k226J234P695M65o589k439R22K749N721k671
1423B807o376N01K173K283L291l316n460J550J820K601K957m769n488K935L538
1438A047K380J51o473l029N793L997n40k198n268l98O865J085j752j495m239J076
1454b998O355K40k324k201l709K199P408j328l841k638j706N314N042m386m422
1469b995J27Q19M738K271n388l324J600J254L982J175n627k517J858K395M130
1484D498j080p196p41M496K588J636l167o304K096N477M54l46l006m093L137M272
$$ plain form
1377 4114 3745 -2610 -4105 -750 799 3862 2851 -3463 -4346 22 2330 4733 933 -6160 -3573
1392 -3573 2701 3606 2793 -1742 -6151 -893 4482 2555 469 -2570 -4611 970 4393 1404 287
1407 287 -2996 -4320 2345 4713 906 -2054 -4280 -3046 4649 5114 -1475 -3914 -2992 -243 5478 2807
1423 2807 -3569 -3068 -895 1388 4679 1363 -4097 -2547 -727 1874 4831 62 -5426 -2491 1047
1438 1047 3427 3578 -2895 -5924 -131 3866 3326 1128 -4140 -4538 2327 3412 1660 165 -4074 -2998
1454 -2998 3357 3597 1273 -928 -4637 -2438 4970 3642 -199 -2837 -4543 771 5813 1427 -2995
1469 -2995 -2868 -2049 2689 4960 -428 -3752 -2152 -898 3084 4259 -1368 -3885 -2027 368 4498
1484 4498 3418 -3778 -4519 -23 2565 4201 1034 -5270 -3174 2303 2757 2411 -595 -4688 -1551 2721
1500B721l94p13l289l370M360M956j529k107m344j338O746L537m089l139j854
1515c846J435O434K20n327j316k90K314M576j344m634j238J095K301M584k293
1530B671o289N8K558L963K059m923n081K708M221J042l3n367j954M102K572P0
1546B377o88m211j325M151K306Q5j549m873k19N996J943k305l568k594K930N735
1562D191r23l690k564o54L891L731k359l342n81lL528K975k759l775p51J359M520
1579B794J913n475l380K090K793L321j005n952j118L638K626Q86k164m370R19
1594b484L018J688N41k568l677J464L571K005r42m466k833L636M960o04l048l750
1610c489K51M363K955k760k395j895J110M103J331k822k184j400J601M146P18
$$ plain form
1500 2721 2327 1614 -1675 -5045 -685 4271 2742 635 -3709 -5047 1699 5236 1147 -1992 -3846
1515 -3846 -2411 4023 4243 -1084 -2400 -2690 -376 4200 2856 -1778 -3016 -1921 380 4964 2671
1530 2671 -3618 -3560 -1002 2961 5020 97 -4984 -2276 1945 2987 2954 -2413 -4367 -265 2307 2377
1546 2377 1689 -2522 -3847 304 2610 2695 1146 -3727 -3946 2050 3993 1688 -1880 -4474 -1544 4191
1562 4191 3268 -422 -2986 -3640 251 3982 1623 -1719 -2300 -2303 1225 4200 1441 -2334 -3085 -1726 2794
1579 2794 4707 -768 -4148 -2058 735 4056 3051 -2901 -4019 -381 2245 3131 967 -3403 -2484
1594 -2484 534 2222 2763 195 -3482 -2018 1553 3558 2616 -1850 -4683 -1047 3913 3309 261 -3489
1610 -3489 -3238 1125 4080 1320 -1075 -2970 -1860 2243 3574 752 -1432 -2832 -1231 2915 3633
1625C633m036k880J19L747L604k183m918n32K721L199J277l904l273J419K600
1640E93J456Q26l682k684J693K614K249r12m097j741L198L180O44l049l716K73
1656c155M909J995k350k973j581J889L710R1k157k204j070K428L176k24k672k637
1672b825J45L510K915j976l488j511K044M231L60l871k777J034K904K458j157
1687A996l228j431J271K748J479j260l531j066K538K781J166l610l076Q09L603
1702A189K149j737l318j610K278L657p9k347k450k39K745K021m62k245k180J43
1718b485L343J947j148l315j706K373L779L71l218l333J409K818K341j681l075
1733a580r45J370K843P30j563k799n00J916K518J019l028k679K28L196K790j618
$$ plain form
1625 3633 -403 -3283 -3164 583 4187 2004 -2914 -3446 -725 2474 3751 -153 -3426 -2007 593
1640 593 2049 2875 -807 -3491 -1798 816 3065 2153 -1944 -3685 -487 2693 3337 288 -3428 -3155
1656 -3155 1754 3749 1399 -1574 -3155 -1266 2444 2535 378 -1826 -2896 -468 2708 2484 -188 -2825
1672 -2825 -2680 830 3745 1769 -1719 -3230 -1186 3045 3405 -466 -3243 -2209 695 3153 1996
1687 1996 -1232 -2663 -1392 1356 2835 1575 -1956 -3022 -484 2297 3463 -147 -3223 -2414 1189
1702 1189 3338 1601 -1717 -3327 -1049 2608 2529 182 -2268 -2507 238 2259 1797 -448 -2628 -2485
1718 -2485 858 2805 1657 -1658 -3364 -991 2788 3159 -59 -3392 -1983 835 3176 1495 -1580
1733 -1580 -2525 -1155 1688 2418 855 -1944 -2444 -528 1990 3009 -19 -2698 -2470 726 3516 1898
1749A898l644j840K833L028L83k821k256J42K932J904r56k444j812J127K521J506
1765B501j134l154j151K020L220L88k606k906J07L721K312j977l091q35J662K748
1781A825M21j849k187l86K143K125n4k054k403N41K556K355j348l177j542J954
1797a080L729J48k965k250K67L053J720j200k408j280J238K210R96j487k198r11
1813b418J630K805N21k615k323O8L392J955j429l105j312J981K427O43j858k137
1829a775j92K011J911O1k248j642R4K822J503j109k738j772K205L069M26k724
1845i8k307M48K893J706j379k555p54J193K479K37j429j877o51J463K054O90k040
1862G3k304L79K643J940r35l572r75J934K905n3k231j840K38K628J086l72j750
$$ plain form
1749 1898 -1746 -3586 -753 2275 2658 -163 -2419 -2277 655 2559 1603 -841 -2653 -1526 995 2501
1765 2501 1367 -1787 -2938 -918 2302 2690 84 -2822 -2715 1006 3318 1341 -1750 -2585 -923 1825
1781 1825 2246 397 -1790 -2176 -33 2092 2038 -16 -2419 -1878 678 3033 1685 -1492 -3034 -1080
1797 -1080 2649 2797 -168 -2418 -2151 902 2622 1422 -986 -2266 -1028 1182 2178 691 -1507 -2418
1813 -2418 -788 2017 2538 -77 -2400 -2332 1060 3015 1586 -1519 -2831 -850 1577 2220 362 -1775
1829 -1775 -1967 44 1955 2016 -232 -1874 -1780 1042 2545 1436 -1302 -3074 -869 2200 2626 -98
1845 -98 -2405 -1957 936 2642 1263 -1292 -2046 -853 1626 1863 434 -1443 -2094 -631 1423 2113 73
1862 73 -2231 -1852 791 2731 1796 -1776 -2751 -817 2088 2035 -196 -2036 -1798 830 1916 1544 -206
1879b06j697Q26K039Q97q50k248o73J017K604L04k108j985J01K420K025j041k927
1896a502q32J417K495L50j492k349K63J791J260L31j647j552r1J779J839p34k624
1913a298j175J686K468P36k114k595N76K159K011j328k032j162J008J978L86o26
1929F78j785j024J430K204L04j453k591L94K399J782j161k446j014J456K054P78
1945B005k098j559M8J855J264k61j769j191M46J809J143m50j974r75Q24K135O88
1962A940j692k380L10K316J493q57j889j339J557J780M58j085j736n8J018J216
1978A052N12j167j814o0J898J781p80k480j129J466K261L85j810j603K30J851
1994E93R31n43j406j202R30J372K92m5j562q75N73J942P55j534k022l49K658J266
$$ plain form
1879 -206 -1903 -1077 962 1859 1009 -1239 -1912 -895 1709 2013 -95 -2080 -1979 441 2466 1425 -1502
1896 -1502 -2334 -917 1578 1928 436 -1913 -1650 141 1401 1732 85 -1467 -1558 221 2060 1326 -1298
1913 -1298 -2473 -787 1681 2417 303 -2292 -1716 443 2454 1126 -906 -2068 -1060 918 1304 678
1929 678 -1107 -2131 -701 1503 1807 354 -2237 -1843 556 2338 1177 -1269 -2283 -827 1227 2005
1945 2005 -93 -1652 -1604 251 1515 1254 -515 -1706 -1260 549 1692 1242 -732 -1707 -883 1252 1940
1962 1940 248 -2132 -1822 494 1987 1130 -759 -2098 -541 1239 1697 612 -1124 -1182 -164 1052
1978 1052 1564 397 -1417 -1477 421 2202 1422 -1058 -2187 -721 1540 1925 115 -1488 -1258 593
1994 593 1524 981 -425 -1627 -697 675 967 922 -640 -1515 -942 1000 1755 221 -1801 -2150 508 1774
2012A774m85k335r11J353J805N32j506j272p2R76J455o3j122j513k3J426J423
2029A442L5k025j360J112K181N37j627j576j33J479J541p77j333r91O33J707L97
2046A242l94j742n76Q61J056N98q54j387l05J837J134k91j705r76O73K208M45
2063A824j501j530l2J037J509m35p17j373l9J678R43p69r39j095L77K076R40j841
2081A13j437o4J420J547p21j403q67R46J019P27q54j470j1P30J103P64j063j777
2099a298J30J274J288k31j775j015O86J788O78j089j826K01J133J541n14j059
2115h8o72l09J516N56k53j005o03K20J559M21j025j223o15J281J726k57j831q83
2133a485N77J617N61q43j211l70P16J120rn85p52k88Q82J393n11j139j092P30
$$ plain form
2012 1774 1289 -1046 -1957 -604 1201 1733 227 -1045 -1117 -141 1314 1251 129 -1384 -1407 19 1442
2029 1442 1477 -548 -1908 -796 1385 1922 295 -1281 -1414 65 1606 829 -504 -1495 -862 845 1242
2046 1242 848 -894 -1470 -609 447 1045 191 -1196 -1501 336 1470 1179 -526 -1502 -829 1379 1824
2063 1824 323 -1207 -1239 -202 1307 872 155 -1218 -1257 421 1364 595 -344 -1439 -1062 1014 1954 113
2081 113 -1324 -1388 32 1579 858 -545 -1412 -466 553 1280 426 -1044 -1055 -325 778 1542 479 -1298
2099 -1298 -1168 106 1394 1163 -612 -1627 -941 847 1525 436 -1390 -1189 -56 1485 971 -88
2115 -88 -760 -1069 447 1003 750 -255 -858 -638 921 1342 317 -906 -1521 -240 1486 1229 -602 -1485
2133 -1485 -908 709 1270 427 -784 -1154 -438 682 673 88 -664 -952 -70 1323 812 -327 -1419 -689
2151f89J164Q41q52j620K0R49J782n64j165j009M80P62Q56j56j090n86J99J373
2169F95N10o71j514k41P84J646j04j362q99K9J931J020j456j122j35M77J333J59
2187A080j241q68K42P48Q06M55j772p21N58J373N22n68j370k72Q64Q50K01r70
2205h3j277P41J091M83m58r12p30J005N17L45o29p08m39J076Q78j30o93j187K43
2224h67J667L30p88q69j16K85J197O5p57q84J58M99J043j9j022n76J83N85R06
2243A020m25j334l63R81R24L93j033j480L22J063R33j35j294o39R87K76N12l07
2261D01q05r54J309R24q1n41j157k28J690M95l30j141r69R81R65J58q88m76P8
2280e69N36R23m64p20j95j11O53P14k67j153j14N49P71N90r82j145N00L84P43
$$ plain form
2151 -689 475 1316 464 -1156 -1136 -187 1595 1031 -134 -1143 -663 99 955 799 -291 -877 -678 695
2169 695 1205 534 -980 -1221 -437 1209 1105 -257 -1156 -1127 804 1824 368 -754 -889 -412 921 1080
2187 1080 -161 -1029 -787 -39 767 1222 -550 -1271 -713 660 1182 614 -756 -1028 -164 686 887 -83
2205 -83 -1360 -619 472 955 497 -415 -1145 -140 377 722 93 -615 -1054 22 900 770 77 -1110 -867
2224 -867 800 1130 342 -527 -643 -358 839 904 147 -737 -579 -80 963 944 -78 -654 -471 114 1020
2243 1020 595 -739 -1102 -121 803 1196 163 -1317 -995 68 1001 866 -428 -1067 -80 196 708 401
2261 401 -404 -1358 -49 875 794 253 -904 -1132 558 1053 723 -418 -1387 -406 559 717 -171 -647 -569
2280 -569 -33 890 426 -294 -489 -600 53 767 500 -653 -767 -218 553 1143 161 -984 -484 -100 643
2299F43P2j274m76P57Q52J71m87q42Q7J55O57J64m03r31J32J122J77o3p57r40
2319a184J175R75k41q21n33k20R66L12p7p07k59k70J181O37n61n27o64J80J043
2338D05N63o53r28j08O69O91J34j001r43Q64P67M70o41j039lJ020R9M45p80p72
2358g41n7Q37O50r0p01r79K91J247L73j101o62j54J158O28l66n70m28J7J022L03
2378F77m10n95n38O93Q22K37n33p46l98O37Q72Mr13o95L41J164L28j029p59R3
2398g48Q20O78j29p50p01K22Q99O99l75n10r03L85R80M30p48r72l04J123N28K67
2418H91j078p70L47R77L28l42p36n37M79Q34K82j32j221o1O83J110k72j036m09
2437f63M2J331j46l20j080J76O39J012m92o91q00N79N59Q63n77o81o62L92Q17
$$ plain form
2299 643 715 -559 -1035 -278 574 745 258 -584 -497 -342 315 479 76 -855 -723 399 576 513 -244 -1184
2319 -1184 -9 966 725 -96 -629 -849 117 429 352 -355 -614 -884 297 934 373 -154 -818 -638 405
2338 405 968 315 -613 -721 -52 639 773 -228 -1171 -307 460 930 289 -750 -753 267 366 811 31 -741
2358 -741 -798 39 689 599 -102 -1081 -790 457 830 -271 -933 -1087 71 699 333 -237 -665 -648 374 677
2378 677 267 -328 -866 -173 649 886 353 -393 -791 -154 718 722 -191 -886 -545 619 947 -82 -841 -748
2398 -748 72 750 621 -129 -830 -608 291 990 615 105 -798 -413 567 997 249 -723 -1027 96 624 891
2418 891 -187 -957 -610 367 695 353 -383 -920 -441 393 675 543 -678 -739 -56 1054 782 -254 -663
2437 -663 -621 710 564 244 -836 -660 -21 991 499 -192 -992 -413 146 1009 432 -249 -911 -519 298
2456B98N40o10j027M3M08J246J01j206n72K01J305K82o99o03m72O48Q90J09o93
2475A89p00N7M41N53Q9j109k75m6J225N53p95o43l75N39J212o6j277l45M1Q50
2495A18N72K33j522j82L08Q62L38l81j036K5O11Q96l00j156m07L80J000N13m92
2514C80j110k7N68J239k06q55p85R8N51J171l47o79n66j67P75J063n31j210l76
2533a014J038R35q8r08j138O57P76M10l67o60l44K65R62L58n92j312k0R69N39
2552D66K9k09j371K48J458M15q21o55n14P18J307l96o32r39K80P07P89m64o69
2571b53l02p4J153L20j99j288n39P78J119M69j566l37L00N65N42k39j285l1M72
2590c95P81M45m89j237L65O21K65N62r20p58M7J027N76k60j020r77J078J037J14
$$ plain form
2456 298 838 228 -799 -756 -348 898 999 -207 -779 -578 727 1009 310 -293 -765 -117 773 882 189
2475 189 -511 -454 -13 540 629 -480 -755 -801 424 977 182 -461 -836 -297 915 849 -428 -773 -732 118
2495 118 690 923 -599 -781 -473 389 727 346 -690 -665 -54 842 542 -614 -1021 -641 359 872 380
2514 380 -730 -757 -189 1050 844 -11 -796 -698 -147 1024 677 -2 -568 -735 40 1103 572 -638 -1014
2533 -1014 24 959 871 -37 -1175 -518 258 668 301 -359 -703 -438 524 882 290 -1022 -1042 -73 466
2552 466 495 286 -1085 -837 621 1036 215 -440 -954 -236 1071 675 43 -896 -616 91 880 416 -253
2571 -253 -555 -629 524 844 645 -643 -1182 -404 715 1184 -382 -719 -419 146 688 449 -836 -867 -395
2590 -395 386 831 342 -895 -530 91 356 918 -2 -760 -713 314 890 630 -390 -1367 -289 748 862
2609H62j007m59j89J086R36r24m17n62N0J308M82r29n01l06L44J078J64r40o05
2628e29r4N73J215n69j166m39J031K04P79r67r22N35L41P51pr28m61J85O04N78
2648G14O3j324o65R63R50L37r58q49k82J473L16k39o34p30O46O99N31o13p10o24
2668i36R13Q61n21l13m43l11J270Q48r01j116n3L21J051M63j462m15O19k7P49
2687E97L63j282m60M01N33N91k40j107k23O60N55N03p40j218L54J188J23J77j281
2706e06o18Q72O51m1n2r87j85Q81O17%o58q70k0J425M07m35r02o41N02J356K16
2727A012j617J57p5O26P02k43j323j24N28L06O02m23j087K40P61M96M09r60q03
2746h16j7J308N44l34j419l20J101N46J17q25n27n66J518M32l61m30q53L26J091
$$ plain form
2609 862 -145 -604 -793 293 1229 305 -112 -674 -624 684 1166 237 -264 -570 -226 852 1016 76 -529
2628 -529 -623 -50 1165 596 -570 -1009 22 226 1005 38 -884 -349 -8 743 736 -192 -653 -468 136 714
2648 714 777 -547 -1212 -249 701 1038 80 -769 -1051 422 738 499 -135 -865 -219 480 1011 398 -312 -936
2668 -936 -23 838 317 4 -439 -750 520 1368 467 -649 -702 -381 670 1133 -329 -744 -125 -152 597
2687 597 960 -322 -782 -381 152 743 503 -604 -827 -167 388 891 151 -1067 -713 475 598 775 -506
2706 -506 -1124 -252 399 358 306 -681 -866 15 632 632 -26 -896 -916 509 916 481 -421 -1062 -560 796 1012
2727 1012 -605 -448 -523 103 805 562 -761 -885 -357 -51 551 128 -959 -719 42 538 947 -13 -816
2746 -816 -833 475 1019 685 -734 -1054 47 593 710 -115 -642 -1208 310 742 381 -49 -902 -576 515
2765E15L13j45p63o62M38J322k95q03p09n1J214N92m85q26m64KR08Q29q17p81
2785f68rO12P91L37j022q57K79P06N91k13j298q4R55M85M27q51j121K93J283L0
2805F66k36q55m89O36L85N35m77q02l83R19O99L7n74j098J02J349P66j040o18
2824d78n75R63J007l4j021m93J86K70R44o52k73l70L7P19O65n51r13j68K40J250
2844G53j30n75p85M48P84M01m16r71p7M27N97K77l87p34K8N68J33N30p77j133
2864a039O86P79N36p07p82m43R86O82j5p15r05M26Q54L82l54l98r08P83M03M60
2884G11r06m1m47O93P62o6r26o23K65Q89O24m79r23l18O71M94J94o18n05J6N81
2905D8O21k82q45k93K56Q77L41m41j030oO87P18Nn62o60j56J150Q8j13j55q53
$$ plain form
2765 515 828 683 -80 -742 -304 1018 723 -80 -789 -840 374 966 481 -345 -809 -807 101 930 113 -668
2785 -668 -677 -65 726 1063 41 -816 -537 169 760 547 -751 -835 120 605 1032 181 -940 -647 636 666
2805 666 430 -425 -914 -278 107 642 165 -637 -1020 -101 598 635 61 -1037 -935 414 1180 140 -478
2824 -478 -1053 -90 917 883 -138 -631 -445 -175 769 117 -156 -526 -489 230 895 344 -569 -737 -497 753
2844 753 623 48 -737 -289 495 896 480 -491 -568 -141 456 733 346 -388 -360 208 341 871 94 -1039
2864 -1039 -353 426 962 255 -527 -970 16 698 683 -32 -937 -511 343 725 371 -27 -935 -152 251 711
2884 711 -195 -236 -683 10 772 706 -220 -843 -578 311 935 456 -467 -785 -114 380 574 -44 -549 -533 48
2905 48 669 387 -458 -751 -495 382 723 282 -748 -754 -67 651 656 94 -566 -722 428 516 403 248 -605
2926f05L30N47N41q23l33l16N20R89j60q23j97r6P82M70m38p73j88M23O39K12
2946G01q06m18K48L83O69J64j210l72J61Q68K42k81o44n94Q16R48j82q57m71M36
2966a99O61K45m04p74j20L65P69J36k56j177l2Q27P11l99m35n10RR40L64k06j110
2987e95m20P95J120j03q96q27M86O03L67j27n64j57k16R95K53n73m60j76J04R79
3007E88j56q30l85M71M24L06j05p91l22P87Q77k17j039kk09O36N24m31k45p7l05
3028e01J181K22l40r61j87M25P88p7p31n89L01R83j98L6o16p3J08K95N01l36n13
3049b82k93N71O17k38m72n05J35Q44O06p39o42j05M42M01J48p96m44N81M68j07
3069A90K64p90k27K51Q11N31q50n85j39O09M26k8p88m86L92P49M81n02q84j26
$$ plain form
2926 -605 -275 272 813 -10 -343 -659 -139 850 690 -133 -330 -426 356 826 388 -385 -573 -150 489 701
2946 701 -105 -523 -275 108 777 941 -269 -641 -480 388 630 349 -295 -889 -73 875 693 -164 -635 -199
2966 -199 462 707 303 -471 -591 -226 543 679 423 -754 -786 41 752 353 -82 -592 -583 357 721 515 -595
2987 -595 -1015 -220 900 797 -99 -926 -440 163 530 403 -161 -318 -534 461 714 141 -319 -495 -391 588
3007 588 432 -398 -783 -312 112 418 313 -478 -800 -13 864 647 -392 -394 -603 33 557 126 -119 -196 -501
3028 -501 680 902 562 -399 -586 -161 627 550 -181 -770 -469 514 316 352 -264 -337 -229 66 567 231 -282
3049 -282 -575 -4 613 375 -97 -602 -467 377 983 244 -398 -503 -61 340 488 -308 -752 -171 297 190
3069 190 454 -336 -563 -312 499 1030 180 -405 -544 65 491 463 -325 -811 -419 330 811 309 -575 -701
3089g01M76N58k0l57l71L6N04M83l25o67J44j97O12M14n52q40K15N07P82j48l59
3110A94o76O04K91Q2n15l04k07L45K55O63p93k88k68L18J110l36l84q78M53L74
3130D0P67n43m98j88K31N15K45n43m86J94L83K83J08n82l19K97K59K63l74n19
3150d67l72N18P05P0n80n62O09K30L62j81m36J61q7K82J67j92m71k02M11N55k
3171E18q02l97M02N08J41q1q44N68J87L59n10Pl26k8L58N07k25m19o9R2N87O2
3193E95m39k13l36L22N36Nn74o04O18K75L03k98m44j37N03n5Ql27M0J12L82K33
3215E05k59m65J11J12K28M1O2p86k48O53M37J53q71Q7L14K73k49k73j66o9K60
3236a50O79J08n20m20J7L86Q8L10p99J61k61P66J23k76o48O1N06K60L04p61k70
$$ plain form
3089 -701 -225 333 313 -44 -415 -379 125 608 283 -384 -240 -437 175 589 37 -803 -588 -81 701 553 194
3110 194 -482 122 413 495 -20 -324 -531 -186 69 732 -61 -349 -617 -299 811 475 91 -787 -334 40
3130 40 807 264 -234 -422 -191 324 569 26 -460 -266 117 400 508 -74 -393 -96 163 426 52 -467
3150 -467 -839 -321 384 454 -126 -688 -79 151 513 332 -104 57 -30 252 419 227 -244 -446 -35 520 518
3171 518 -284 -681 -279 229 370 289 -555 13 200 559 49 56 -270 -298 60 567 342 -77 -146 -54 533 595
3193 595 156 -57 -393 -71 465 470 -104 -708 -90 185 488 190 -254 -391 112 57 65 -262 -222 -110 272 505
3215 505 246 -219 -108 4 232 273 335 -451 -699 -46 391 544 -327 -240 74 347 98 -175 -341 -410 -150
3236 -150 529 637 117 -303 -286 100 188 498 -301 -140 -401 365 488 212 -436 -375 131 391 695 -66 -336
3257c36J59K14m2J19m72j38J99N15J13j81n25k52O47N81m35l64l52P20K53j93
3277B30n5n85L93k09N15q5o18j39M06N3N86k28k62j95l8M88j89J99n85k72O13
3298B3K86M8n14NK67O5k69L14n24Q8K01K01nk55j14J18L48J13l33j85l83L25N54
3321C74q8j61k74mj8O39r6o53K3J29M08m1m02J80j07p4J4M31k75j58q0R5N30J27
3345E19r93J24K30K32R9Ml56K68n00J033j08k44n67j48M21M10l55j97k2j39N50
3366B61N5l8n49j37L22M50l58o4k26J09J61Q7J05j57l24K85N1J78k28l92M2O24
3388B57j45K30p36n1L86L32K2l00k40L03o0r2L03k63j18M57m66L08%m83L04J25
3410G3J08j56J03n95M43j1J56N2l57J59O5j12K10J17j02j30j1J05J1l00j66L21
$$ plain form
3257 -336 -177 37 -5 114 -358 -496 -297 218 331 150 -375 -627 20 601 166 -198 -550 170 423 230
3277 230 175 -410 -17 -226 289 204 -414 -553 -147 -94 492 264 2 -193 -231 257 68 267 -318 -590 23
3298 23 309 357 -157 -152 115 180 -89 225 -299 -211 -10 191 186 -69 -183 -65 283 396 63 -122 -505 -180 374
3321 374 286 125 -149 -153 -171 468 372 -281 -258 -129 279 238 -164 16 -91 -165 -151 280 5 -153 -233 -138 392 519
3345 519 -474 -350 -120 112 211 215 -141 127 -373 660 552 308 -259 -407 14 424 69 -128 -150 -289 261
3366 261 316 278 -271 -408 -86 364 6 -58 -284 -175 -14 73 178 21 -303 -18 33 211 -17 -409 -367 257
3388 257 112 342 -394 -445 -59 273 295 -5 -245 58 -2 -94 209 -54 -172 285 -181 127 127 -356 -52 73
3410 73 181 25 128 -467 -24 -35 121 173 -184 -25 40 -72 138 255 153 23 12 117 128 -172 -338 -17
3432a7n1L13j72j83j08K96N7Q7k46J5j82L00j35L32o69L98j65J25K29k53j06q7
3454b22R3J06J89l92L3K31K23R8n5l47M8p7n9J86J34j95j68L96P9j83j98jK47
3477A66k55n0K36m40K24L46l04P0j4k49M83k99M50j13j46k42K13Q8j01j3k95K57
3499A2l7k18J77o2L4J38k80K24k91O62o12J58N79k80p0k56m5J48j15J39J55j66
3521fL34j78k17M6J59p2K8N9k24K81J4Jo8k42P4J15k45K92j69k36M2p6L99j63
3545e2J18O3l5j5k10LJ18L70k93q6k41L33k45J92j14l5K29J31j18k99L43R3j9
3568B31O3m91j0L08l07L73j51K0K2j13K46l36J5M5P5n4j9k9J64R6m12K32j51J81
3592bJ00p4k13J7M64n82M12j07K14l78Q6L2L0L52n16K42m1k25K32j1k14L23p8
$$ plain form
3432 -17 -68 245 73 -110 -218 78 135 222 -24 -9 -191 109 -26 306 -363 35 -130 -5 224 -29 -135 -222
3454 -222 -129 -23 166 -226 -193 38 261 359 304 -43 5 -72 -131 55 189 -6 -174 222 301 118 -80 -81 166
3477 166 -89 -139 97 -343 -119 227 -77 -7 -21 -270 213 -86 364 251 105 -137 76 164 63 50 -245 12
3499 12 -25 -243 -66 -128 -94 44 -236 -12 -303 359 -253 -95 484 204 134 -122 -167 -19 -134 5 160 -6
3521 -6 328 150 -67 -21 138 66 94 153 -71 210 224 225 157 -85 -11 104 -141 151 -18 -254 -212 -288 111 -52
3545 -52 66 129 94 79 -131 -128 -10 360 67 -19 -260 73 -172 20 -94 -129 100 231 113 -186 157 250 231
3568 231 294 -197 -207 101 -206 167 16 36 58 -55 191 -145 -130 -85 -10 -64 -83 -112 52 148 -264 -32 -183 -2
3592 -2 98 24 -189 -172 292 -290 122 15 229 -149 -63 -31 -1 351 -165 77 36 -189 43 32 -182 141 63
3615F3l41O78m76J61p7j00J71j17q9M73l15K3L7L2o2n9o6L64L9l98k51L04J10
3638A04m53M20k58J40J16q6N6l12J10K36k19l27Q17j47n85K11L45k54M2j71P2
3659a43L37k98J32j62k46L61K44k41J6J33p9J69j50M4p5k16K65p0L7K04k88J85
3681A59Mr7J05l65L63o22J37O43n92O30n29J36J04J86l32J99m9l34N02m4l67K05
3703D2k4nJ74p4J67o38L15k23L17O5r6o9j47j21J51J14p6N5K3j20N0J6j63M44
3727A77k89R5N0J10l06J04K9n6o6r6J95M6j22J10l2k9p8M68m7k65k2K18j09j19
3751c4K08k41k39M37r2K30m75J40K46k45J89j96J7L93l56k7L09k68j81M8j12J85
3773f4K34j50J73k58p5J21JK11k94j59K27L90r6q13O68j52L29n46J58p6l48N00
$$ plain form
3615 63 -278 400 -76 85 8 -92 79 -38 -127 346 31 54 91 123 61 2 -64 300 339 -59 -310 -6 104
3638 104 -349 71 -187 -47 69 -17 39 -273 -163 73 -146 -473 344 197 -388 -177 168 -86 -44 -215 -143
3659 -143 194 -104 28 -134 -380 -19 225 -16 0 133 54 223 73 117 42 -174 91 21 58 262 -26 159
3681 159 163 66 171 -194 169 -453 -316 327 -265 365 -164 -28 76 262 -70 129 80 -254 248 204 -163 42
3703 42 18 13 187 113 280 -358 -43 -266 51 116 20 -49 -196 -317 -166 -52 -128 -73 -50 -170 -120 -104 -267 177
3727 177 -112 -17 33 143 -163 -59 -30 -86 -152 -248 -53 -7 -129 -19 -51 -80 -158 310 263 -2 -24 194 85 -34
3751 -34 174 -67 -306 131 39 269 -206 -66 180 -65 124 -72 -55 338 -18 -45 264 -4 -185 -137 -249 -64
3773 -64 170 20 193 -65 -140 -19 -18 193 -101 -260 -33 357 261 -552 116 -36 293 -253 -95 -171 -519 -19
3795a9J59j01j96oL5J14J02K48k03o0K21k74j29j27J01PJ08q8J38J24q7j02J28
3818I3m8J92j00r8j44J83Nl25K90P8k11J24r4m48M67p1M69k08j04r3N9j94K28
3841E0q7l01K41k03M49l9q8k84M06n6N8Q5l08Q3q8J72Q0k77N6oP0pK38k16j37
3866a09R0J06J51j96k04j9k42J90K23j02o5J30l13R21n60q5J25j5K63l42J21k74
3888b06O21j2n43K75j67k12J26J01K89l75M7j87J00L48J40o49J97j9K23j16M9
3909C0O5l39J36M10j84m5l59J80N2K65j1O2m28K4K07K00k5l06J20J99m48K06j26
3932a15K07k18M2M14m44k7L1K19k13J99l69N31l72O8j70J24J81l78L93m34N95
3953B64l15J24j48J2J24N9k44O8j82M62l62J50o9k36k0N56P0l88R2k74L05J2J1
$$ plain form
3795 -19 140 39 -157 -163 -128 -14 88 336 133 73 294 20 -109 -236 -135 -128 -20 -108 30 154 67 -35 93
3818 93 45 237 137 39 -105 78 83 -242 48 126 -85 39 -55 -503 -36 -107 362 154 50 -43 16 -178 50
3841 50 -37 -338 -97 -300 149 110 22 -262 144 88 146 231 -77 6 -82 90 170 -107 -51 -57 13 6 244 28 -109
3866 -109 -19 87 238 42 -162 -181 -423 -233 -10 -112 -177 -47 -360 561 1 -84 41 26 289 -53 68 -206
3888 -206 415 403 -140 135 -32 -244 -118 -17 272 -103 -56 -243 -143 205 345 -304 -107 -126 97 -19 30
3909 30 95 -244 -108 302 118 73 -286 -106 -54 211 200 262 -166 -142 65 265 240 -66 54 253 -195 11 -115
3932 -115 92 -126 -84 330 -114 -141 -110 109 -104 95 -274 257 -115 -47 -217 -93 88 -290 103 -331 264
3953 264 -51 73 -75 -63 61 120 -124 -56 -238 224 -138 12 -57 -293 -313 243 313 -75 17 -257 48 60 71
3976G1l54r5L82J23J57j89k71J11j42M01m41L86m52J25J01m8J78j8P6k20l5J96
3998D2j15P5m3n9j2N6j3K8J76n8j8lP5l09J54L10k97N4j66J44K17j55k06j24J04
4023a43j26N85L5p32L48o7J72q5k01j29L45j97M38l64K59Q7m48K40k20L59k9p6
4045E1j71J28R9L62m76K02j59j5L80m56r6p4K71K9r1O6l58K36M15o2k31j85K72
4068A37J26J56j79l84N50r2m61K50k49Q1n4j91N93j50j17l07L55Q2l1j79J03L6
4090G5k42J5K45J54m2J9k0J51j37k65l42M58k63M96r0m04j0J58L92j06j23j60
4112d1K12L77l73l45K21J17j95mK14k04k08J86o7K17j25K57j37l75M18J32j43
4133A34o4m27Q8J87J01j53L49k08K18J6j67k65L34l64N4L25j34j0m09J43N43j77
$$ plain form
3976 71 -283 -378 4 127 284 95 -176 -65 -207 194 -247 139 -313 -188 -87 -135 43 25 101 -119 -154 42
3998 42 -73 2 -41 -100 -112 -56 -69 -41 135 77 59 56 131 -178 -24 286 -11 43 -123 21 238 83 -123 -247 -143
4023 -143 -269 316 351 -381 -33 -100 72 -13 -214 -343 2 -195 243 -121 138 225 -223 17 -203 156 127 51
4045 51 -120 8 107 469 -7 195 36 21 401 -55 -151 -225 46 75 -16 50 -308 -72 343 281 50 -135 137
4068 137 263 419 240 -144 406 314 -147 103 -146 -65 -119 -310 283 133 16 -291 64 146 115 -64 39 75
4090 75 -167 -152 93 247 205 224 204 355 218 -47 -389 69 -194 302 212 -192 -202 -44 348 242 119 -41
4112 -41 171 548 175 -170 51 168 -27 -31 183 -21 -229 -43 -110 107 -18 239 102 -273 145 277 134
4133 134 70 -357 -269 -82 19 -134 215 7 225 241 74 -191 143 -221 -167 158 24 14 -395 -252 291 114
4155A14p9j3k40L0O7K14j39K87j86R5J71l39j86P3l0K57j6l54J03j04L45N1j68
4178d7M6J76p7j07K17l35K56r7L3j7K4N6l15j6J84N5k31j1J45J68l7q2j11K75
4202A52m99N83k16o2J96k97j67L76l05M18K1k69K27l80%K9J56M4K0o8J03m74R
4225d03O32m45M21n0l61L40N1K66m64q3p4J78k3K45j54l87L78MM4o0k51K76J13
4248A93l08p1K4M74k35j4L47j60l17o0N3L33J29p3j07k00K37l26N26l66k00K02
4270H1J81j45k78K4N9rO82n03j29j70p3L19J02m7j82N3L8J56k82Q7L05n74N09
4293B04j19K3j04k99M96j93J46m2qj32J8L40j45k19j91O9K05O6R8l50k8K5n9L61
4317A62j34M9k80J40L30l73J15l75M60l87N78k3k80J10o6J76K8o19J96K65J62
$$ plain form
4155 114 35 22 -218 -188 -121 93 -46 241 55 150 321 -18 -204 -131 -161 96 80 -274 -171 -275 70 121 -47
4178 -47 -1 175 98 -9 208 -127 129 32 65 48 72 128 -187 -203 -19 36 -195 -206 -61 107 70 -12 -123 152
4202 152 -347 236 20 -42 154 -143 -310 66 -239 179 200 -69 158 -222 -222 -193 -37 7 27 -41 62 -412 -403
4225 -403 229 -216 205 155 -206 134 185 451 -13 -96 -170 8 -15 230 76 -311 67 71 115 55 -196 80 193
4248 193 -115 -186 -162 312 77 63 410 250 -67 -127 -74 259 388 315 208 8 245 -81 445 79 -121 81
4270 81 262 117 -161 -137 -78 -87 595 92 -37 -207 -280 39 141 94 -88 -35 3 159 -123 -36 269 -305 204
4293 204 85 108 4 -295 201 8 154 112 104 -28 -10 330 185 -34 -225 -156 49 115 213 -137 -165 -140 -199 162
4317 162 28 77 -203 -63 267 -106 9 -366 94 -293 285 262 -18 92 26 202 230 -389 -193 72 234
4338B34Q0n89N7M8J20J28M7k14J00M5j4J09K32l75l1j16j74L06O2l23J36M47j86
4361A29r7l61J22r0K31L16m76N44o24J07Q43l31l96l04K10L43j4j06Pp7m8P4M13
4384D15l83M0k06j22N81k35J7o1k70L02P0k76J3j18J80K23lm15L73k05J24j09
4406f5L35k40k02k74O91j02k91J63j74M34j67k01J13j75J59n3K34j23j22O8l15
4427c07N56l37K87k15m46M72L09l19K88j60l64K50L0k04K09j65l10Q45r5k16j80
4448g2o8K34J16J9k60L4k64L07J5k52k4o9K79L19j80k53m68O21J5rl41J64l04
4471d41J03L13K59k07j62j79K53K54J25l30M7j36N06L7m74l0j28J96o7Q9j78J86
4493C6K46j71l53L45j34j53J50J96K05j64m56J35L9J13k7R7l83M41k4K0l36J51
$$ plain form
4338 234 314 -275 -218 -170 -50 78 125 -89 11 56 42 151 383 8 -23 -139 -313 -7 55 -268 -132 315 129
4361 129 32 -329 -207 -297 -66 250 -226 318 -306 -199 644 313 -83 -387 -177 166 152 46 53 -24 -72 2 415
4384 415 32 72 -134 -256 325 90 107 46 -224 78 148 -128 -115 -233 -53 170 167 -248 125 -80 44 -65
4406 -65 270 30 -172 -446 245 143 -148 15 -159 275 108 -93 20 -155 4 -49 185 62 -60 8 -307
4427 -307 249 -88 199 -16 -462 10 319 0 288 128 -236 14 44 -160 49 -116 -426 419 324 108 -72
4448 -72 -140 94 210 229 -31 3 -261 46 61 -191 -215 -284 -5 314 134 -119 -587 34 49 40 -301 -137 -441
4471 -441 -338 -25 234 27 -135 -314 -61 193 318 -12 35 -101 405 442 -32 -62 -190 6 -61 28 -150 36
4493 36 282 111 -242 103 -31 -184 -34 162 367 203 -253 -118 -79 34 7 104 -279 162 138 158 -178 -27
4515b7r1M10k30L72m66k79J23L30K6k07J41m41L88P2M20o33K49m39O44k91J55
4536B26r1p39O42O2L07n18j29r5N34l92M99k34Lk2L88m90L43n6m90O5K71N8m20
4559b78P3K48K31J79n55J06j98K51n3J42j43n95L86nL47k75Q8l73M75j34R4R3
4581A04L13o43J93J91k19j76j90M01J38J44J6k92R8l89K75N43m41J07k66rK92
4602A90k80J62j82P5K8K79L9n42P9J70j2j35J43j78K22jj92M25m44j19J42K72
4624A41q1J5o9l40L08K05K05m17j93L9K33J08j46j34j01J85K02J97l10k79J58
4645g4j03Q2K96n78K30m8M92j92O5k29J7L5Q5J1m0p9m20N03M14l40K60n59j6L18
4669A30j20Q9m58K53L20j67J86r5j82k18K93J87k85L3J45o7m8N56l70n21O4N71
$$ plain form
4515 -27 -118 292 62 434 -32 -311 -188 142 168 -39 102 -339 49 121 541 -92 157 -282 362 71 226
4536 226 135 -604 38 100 407 -111 -240 -335 199 -193 306 72 75 53 441 -49 294 238 -252 -187 84 142 -278
4559 -278 -205 43 274 453 -102 4 -194 57 4 146 3 -592 -206 -211 136 -139 -51 -424 51 -83 11 104
4581 104 417 -226 -33 158 -61 -237 -427 -26 112 256 272 -20 78 -311 -36 507 66 173 -93 -102 190
4602 190 -90 72 -110 -35 -7 272 311 -231 -152 18 6 -129 14 -164 58 57 -135 290 -154 -273 -131 141
4624 141 60 75 6 -334 -26 179 384 -33 -226 -187 46 154 8 -126 -227 -42 160 357 47 -232 -74
4645 -74 -177 -95 201 -377 -147 -195 297 105 170 -59 -42 -7 78 89 49 -30 -450 53 467 127 387 -172 -188 130
4669 130 10 99 -359 -106 214 47 233 138 -44 -262 31 218 -67 -34 111 44 -4 552 182 -339 -275 296
4691B96J79l99k79k1K89L3P93q05k29j0J80K57k83j03p4k4L23J76j63l61K10N3
4713C8l9O8K05l20k53M92J08J47o37l67K99M08J74n2n85O6L88K2k6J50l87k4J70
4736D5M9L9j92O2n61O21J87m8j83n41N57J49J35l99j04Q4J35M69k58k20j55J55
4758B6j57M39j2l96k73L85Pj1j01j39J2P1K10J72n19J26O3J75L76l02k59K58j57
4781fK6K60l89K4L8j23Q10n29k31j07M62n5%j96o0o6K43K73l51j22R6j00o6N35
4805C66k41l61K7J96L1j10M1R7n5J46L1j13k98n3L30L15n25m6J88Ko2J82L28p41
4829c25M62m85O53K18m28m44J71M07k02J3l33J38K18J25K97o75J56j71j12M92
4849A75o8k21J25o5N2k7K98m89M9J33n1N93l90j93l44K2M27J6k86Q1J12J71K52
$$ plain form
4691 296 475 76 -203 -224 65 98 891 86 -143 -153 27 284 1 -102 -176 -200 123 299 136 -225 -15 38
4713 38 -1 67 272 -48 -301 191 299 446 -191 -558 -259 149 323 271 -314 -248 140 162 136 286 -101 -125 45
4736 45 94 133 -59 3 -558 63 250 202 19 -522 35 184 319 -80 -184 -100 35 504 246 26 -129 26
4758 26 -131 308 296 -100 -373 12 19 8 -93 -232 -220 -149 61 233 -286 -160 -97 78 454 152 -107 151 -6
4781 -6 20 280 -109 -85 -47 -170 640 111 -120 -227 235 180 180 -16 -76 -142 101 374 23 -99 -3 -103 -169 366
4805 366 125 -236 -209 -13 18 -92 -51 46 -9 137 168 55 -243 -296 34 349 -176 -222 -34 -32 -94 88 416 -325
4829 -325 137 -348 305 523 95 -349 -178 229 27 40 -293 -155 63 188 485 -190 -34 -205 -317 175
4849 175 107 -114 11 -54 -2 -29 269 -220 -171 -38 -89 504 114 -79 -423 -401 26 42 -244 -163 -51 120 372
4872C72l44M1k41J13L8L73K7m04l90L81M4q4j3J23m44N47J16l34o2k37O64J49
4894D35n28O2j03%K08L58m55K3P6m44N44K35l41k56k10J77L89k13k47L40j92J99
4916E7J20m42j2MQ5J70K44o2l94J13J80M1n7q5j55P8J29J57%k39L53K75Qk45j94
4941A29l54L44QJ98l56k25N04n79J38L9L12n02L90pK8K48J4m44k07M70J76m70
4963a46K14k71L22j86j06L92l71K56R1p4j64J17P3j89J22L92k86l54j7L53p2R9
4985A95K0k00l07M29q0Q0j15l7J18N7J35n4l68Oo0K09J77m35K55j28J78L10j36
5008B49l36m7o2M72l81L06j27l16J80J48L63m53j85N26l76K42p3k27m01P95l07
5029a0P2r8j14J73J60l03m6nJ52K3j55J92J24k36K54J06r1N5j05j91L8K76p0J3
$$ plain form
4872 372 28 69 -172 -59 -21 352 379 -25 -415 -34 10 -74 -87 36 -408 139 255 -79 -141 -378 286 435
4894 435 -93 -31 -134 -134 74 432 -23 0 76 -368 176 411 70 -186 -396 -219 170 -43 -290 50 -142 57
4916 57 177 -265 -277 -273 -188 -18 226 164 -230 -117 63 104 47 -38 -193 -115 14 171 171 -68 285 560 568 323 129
4941 129 -225 119 127 325 -31 -256 248 -331 -193 -154 158 -344 46 39 67 315 329 -115 -322 148 324 -146
4963 -146 68 -203 119 -67 -173 219 -152 104 195 121 -43 74 147 -42 80 472 186 -168 -185 168 96 195
4985 195 215 15 -292 137 57 137 22 -15 103 160 295 241 -127 -121 -181 28 205 -230 25 -103 75 385 249
5008 249 -87 -134 -196 276 -105 201 74 -242 -62 86 449 -4 -189 337 -39 203 130 -97 -498 297 -10
5029 -10 62 -36 -150 23 183 -120 -166 -171 -19 4 -151 41 165 -71 183 289 198 253 148 -43 -5 271 201 214
5053B14j47K68k74J49l0Q7n96N4L43J35k93o2n3L26J45k63K04l51O7qJ54K45m36
5076a22J9r3Q4K93k55J82j31m3N3K33n9J37n95O17m59j64L06M0L37l40J25j35
5098C0j0l3p4N8K11L3k14J15j01M2p9K8j73q1k0K79J36k26k97L65R0o7k80M5L9
5123a84j02L78k89K63k17K3L11q4K14o75J04L92P3k82j26J47r9JN15k29j05j72
5145a43K06K07l40K78k57K81j83K19l21K12l48K21j39K68L9j52L1J42j27r3L30
5166C31l13j24J36r8k08L77k28K30q2j00j5J54j84j59K60N3m07K45K42Q7l76L45
5188A66k68p0L56k80K90k84j1k93M11m1j54K08r4o8K68J10n36K42p9J51k17K45
5210E2Q1l54L12j00k54M69k64J93k63OM10l95M5j36j25L94M29n74n7K09j17k1
$$ plain form
5053 214 67 335 61 210 180 267 -329 -275 68 203 -90 -152 -205 121 266 3 207 -144 -77 -85 69 314 -122
5076 -122 -103 -196 -112 181 -74 108 -23 -66 -13 220 161 298 -297 320 -139 -303 3 43 380 40 165 30
5098 30 20 -13 -87 -29 182 215 1 116 15 57 -22 6 -167 -248 -268 11 147 -79 -376 -11 79 12 -268 -223 -184
5123 -184 -286 92 -197 66 -151 -128 183 99 313 -362 -258 134 207 -75 -201 -54 -153 -152 363 134 29 -143
5145 -143 63 270 -70 208 -49 232 49 268 -53 159 -189 32 -107 161 200 48 79 221 94 1 331
5166 331 18 -106 30 -68 -276 101 -127 103 21 -79 -94 60 -124 -283 -23 30 -377 -132 110 197 -179 166
5188 166 -102 -172 184 -96 194 -90 -101 -394 17 -24 -178 30 -64 -132 136 246 -290 -48 -127 24 -193 52
5210 52 133 -221 91 -9 -263 206 -58 135 -128 -122 288 -107 -62 -198 -323 71 500 -74 -131 78 -39 -60
5232f0J88J25j22N2J55j38n0j44j36J3M34l3l40R2l93M29j19K72k41k67M69q2
$$ plain form
5232 -60 128 253 131 183 338 200 150 6 -130 -117 317 284 -56 36 -357 72 -47 225 -16 -283 186 104
$$ [...]
8191A03
##END NTUPLES=NMR FID
##END=
