##TITLE=1H_LR-790-D-K
 D2O
 8 sc, 
 2.11.2024
##JCAMPDX= 6.0         $$ Bruker NMR JCAMP-DX V2.0
##DATA TYPE= NMR FID
##DATA CLASS= NTUPLES
##ORIGIN= UXNMR, Bruker Analytische Messtechnik GmbH
##OWNER= root
$$ XWIN-NMR		Version 3.5
$$ Sat Nov  2 13:49:45 2024 Russian Standard Time (UT+4h)  she@DPX200
##.OBSERVE FREQUENCY= 200.1318
##.OBSERVE NUCLEUS= ^1H
##.DELAY= (6, 6)
##.ACQUISITION MODE= SIMULTANEOUS
##.ACQUISITION SCHEME= undefined
##.AVERAGES= 8
##.DIGITISER RES= 18
##SPECTROMETER/DATA SYSTEM= spect
##.PULSE SEQUENCE= zg30
##.SOLVENT NAME= D2O
##.SHIFT REFERENCE= (INTERNAL, D2O, 0, 15.7039)
##AUDIT TRAIL= $$ (NUMBER, WHEN, WHO, WHERE, WHAT)
$$ ##TITLE= Audit trail, XWIN-NMR		Version 3.5
$$ ##JCAMPDX= 5.01
$$ ##ORIGIN= Bruker BioSpin GmbH
$$ ##OWNER= she
$$ F:/spectra/data/she/nmr/H-F/1/audita.txt
$$ ##AUDIT TRAIL=  $$ (NUMBER, WHEN, WHO, WHERE, WHAT)
(   1,<2024-11-02 13:48:45.21 +0400>,<she>,<DPX200>,
      <created by zg, POWCHK disabled, PULCHK disabled
       configuration hash MD5:
       00 E9 B6 7A A2 85 ED C7 34 08 36 98 17 FE 4E 26
       data hash MD5: 16K
       38 8B 74 D7 57 BF B0 7D 18 5B CC 9B C9 70 3F 5E>)
$$ ##END=
$$ 
$$ hash MD5
$$ CF D5 3C 87 E5 59 2A 67 1A C0 76 37 AB 1F 38 36
##$RELAX= 
##$RELAX= 
##$RELAX= 
##$RELAX= 
##$RELAX= 
##$RELAX= 
$$ Bruker specific parameters
$$ --------------------------
##$DU= <F:/spectra>
##$EXPNO= 1
##$NAME= <H-F>
##$PROCNO= 1
##$TYPE= <nmr>
##$USER= <she>
##$AMP= (0..31)
100 100 100 100 100 100 100 100 100 100 100 100 100 100 100 100 100 100 
100 100 100 100 100 100 100 100 100 100 100 100 100 100 
##$AQSEQ= 0
##$AQ_mod= 1
##$AUNM= <au_zg>
##$AUTOPOS= <>
##$BF1= 200.13
##$BF2= 200.13
##$BF3= 200.13
##$BF4= 200.13
##$BF5= 200.13
##$BF6= 200.13
##$BF7= 200.13
##$BF8= 200.13
##$BYTORDA= 1
##$CFDGTYP= 0
##$CFRGTYP= 5
##$CHEMSTR= <none>
##$CNST= (0..31)
1 1 145 1 1 1 1 1 1 1 1 1 1 1 1 1 1 1 1 1 1 1 1 1 1 1 1 1 1 1 1 1 
##$CPDPRG= <>
##$CPDPRG1= <>
##$CPDPRG2= <>
##$CPDPRG3= <>
##$CPDPRG4= <mlev>
##$CPDPRG5= <mlev>
##$CPDPRG6= <mlev>
##$CPDPRG7= <mlev>
##$CPDPRG8= <mlev>
##$CPDPRGB= <>
##$CPDPRGT= <>
##$D= (0..31)
0 1.2 0 0 0 0 0 0 0 0.06 0 0.03 0 0 0 0 0.0002 0 0 0 0 0 0 0 0 0 0 0 0 
0 0 0 
##$DATE= 1730540924
##$DBL= (0..7)
120 120 120 120 120 120 120 120 
##$DBP= (0..7)
150 150 150 150 150 150 150 150 
##$DBP07= 0
##$DBPNAM0= <>
##$DBPNAM1= <>
##$DBPNAM2= <>
##$DBPNAM3= <>
##$DBPNAM4= <>
##$DBPNAM5= <>
##$DBPNAM6= <>
##$DBPNAM7= <>
##$DBPOAL= (0..7)
0.5 0.5 0.5 0.5 0.5 0.5 0.5 0.5 
##$DBPOFFS= (0..7)
0 0 0 0 0 0 0 0 
##$DE= 6
##$DECBNUC= <off>
##$DECIM= 24
##$DECNUC= <off>
##$DECSTAT= 4
##$DIGMOD= 1
##$DIGTYP= 9
##$DL= (0..7)
0 120 120 120 120 120 120 120 
##$DP= (0..7)
150 150 150 150 150 150 150 150 
##$DP07= 0
##$DPNAME0= <>
##$DPNAME1= <>
##$DPNAME2= <>
##$DPNAME3= <>
##$DPNAME4= <>
##$DPNAME5= <>
##$DPNAME6= <>
##$DPNAME7= <>
##$DPOAL= (0..7)
0.5 0.5 0.5 0.5 0.5 0.5 0.5 0.5 
##$DPOFFS= (0..7)
0 0 0 0 0 0 0 0 
##$DQDMODE= 0
##$DR= 18
##$DS= 0
##$DSLIST= <SSSSSSSSSSSSSSS>
##$DSPFIRM= 0
$$ [...]
##$SUBNAM2= <"">
##$SUBNAM3= <"">
##$SUBNAM4= <"">
##$SUBNAM5= <"">
##$SUBNAM6= <"">
##$SUBNAM7= <"">
##$SUBNAM8= <"">
##$SUBNAM9= <"">
##$SW= 24.0689170037331
##$SWIBOX= (0..15)
0 0 2 0 0 0 0 0 0 0 0 0 0 0 0 0 
##$SW_h= 4816.95568400771
##$TD= 16384
##$TD0= 1
##$TE= 0
##$TE2= 300
##$TE3= 300
##$TEG= 300
##$TL= (0..7)
0 120 120 120 120 120 120 120 
##$TP= (0..7)
150 150 150 150 150 150 150 150 
##$TP07= 0
##$TPNAME0= <>
##$TPNAME1= <>
##$TPNAME2= <>
##$TPNAME3= <>
##$TPNAME4= <>
##$TPNAME5= <>
##$TPNAME6= <>
##$TPNAME7= <>
##$TPOAL= (0..7)
0.5 0.5 0.5 0.5 0.5 0.5 0.5 0.5 
##$TPOFFS= (0..7)
0 0 0 0 0 0 0 0 
##$TUNHIN= 0
##$TUNHOUT= 0
##$TUNXOUT= 0
##$USERA1= <user>
##$USERA2= <user>
##$USERA3= <user>
##$USERA4= <user>
##$USERA5= <user>
##$V9= 5
##$VALIST= <valist>
##$VCLIST= <CCCCCCCCCCCCCCC>
##$VD= 0
##$VDLIST= <DDDDDDDDDDDDDDD>
##$VPLIST= <PPPPPPPPPPPPPPP>
##$VTLIST= <TTTTTTTTTTTTTTT>
##$WBST= 1024
##$WBSW= 4
##$XGAIN= (0..3)
0 0 0 0 
##$XL= 0
##$YL= 0
##$YMAX_a= 154105
##$YMIN_a= -110787
##$ZGOPTNS= <>
##$ZL1= 120
##$ZL2= 120
##$ZL3= 120
##$ZL4= 120
##$ABSF1= 10
##$ABSF2= 0
##$ABSG= 5
##$ABSL= 3
##$ALPHA= 0
##$AQORDER= 0
##$ASSFAC= 0
##$ASSFACI= 0
##$ASSFACX= 0
##$ASSWID= 0
##$AUNMP= <proc_1d>
##$AZFE= 0.1
##$AZFW= 0.1
##$BCFW= 1
##$BC_mod= 2
##$BYTORDP= 1
##$COROFFS= 0
##$CY= 11.3945322036743
##$DATMOD= 1
##$DC= 2
##$DFILT= <>
##$DTYPP= 0
##$F1P= 15.6554695791079
##$F2P= 12.8336369535428
##$FCOR= 0.5
##$FTSIZE= 0
##$FT_mod= 4
##$GAMMA= 1
##$GB= 0.15
##$INTBC= 1
##$INTSCL= 1
##$ISEN= 128
##$LB= 0.24
##$LEV0= 0
##$LPBIN= 0
##$MAXI= 10000
##$MC2= 0
##$MEAN= 0
##$ME_mod= 0
##$MI= 1.114404
##$NCOEF= 0
##$NC_proc= 0
##$NLEV= 6
##$NOISF1= 3.799351
##$NOISF2= 2.8
##$NSP= 1
##$NTH_PI= 0
##$NZP= 0
##$OFFSET= 15.70392
##$PC= 1
##$PHC0= -26350.77
##$PHC1= 14.18743
##$PH_mod= 1
##$PKNL= yes
##$PPARMOD= 0
##$PSCAL= 0
##$PSIGN= 0
##$REVERSE= no
##$SF= 200.130013532006
##$SI= 16384
##$SIGF1= 3
##$SIGF2= 2
##$SINO= 400
##$SIOLD= 16384
##$SREGLST= <1H.CDCl3>
##$SSB= 0
##$STSI= 0
##$STSR= 0
##$SW_p= 3612.71676300578
##$SYMM= 0
##$S_DEV= 0
##$TDeff= 0
##$TDoff= 0
##$TI= <>
##$TILT= no
##$TM1= 0
##$TM2= 0
##$TOPLEV= 0
##$USERP1= <user>
##$USERP2= <user>
##$USERP3= <user>
##$USERP4= <user>
##$USERP5= <user>
##$WDW= 1
##$XDIM= 8192
##$YMAX_p= 0
##$YMIN_p= 0
$$ End of Bruker specific parameters
$$ ---------------------------------
##NTUPLES= NMR FID
##VAR_NAME=  TIME,          FID/REAL,        FID/IMAG
##SYMBOL=    X,             R,               I
##VAR_TYPE=  INDEPENDENT,   DEPENDENT,       DEPENDENT
##VAR_FORM=  AFFN,          ASDF,            ASDF
##VAR_DIM=   8192,          8192,            8192
##UNITS=     SECONDS,       ARBITRARY UNITS, ARBITRARY UNITS
##FACTOR=    0.0002076,     1,               1
##FIRST=     0,             0,               0
##LAST=      1.7004516,     0,               0
##MIN=       0,             -110787,         0
##MAX=       1.7004516,     154105,          0
$$ Real data points
##PAGE= N=1
##DATA TABLE= (X++(R..R)), XYDATA
0 0 0 0 0 0 0 0 0 0 0 0 -2 8 -8 8 -8 10 -16 16 -21 24 -30 33 -38 45 -50 58 -67 77 -87 97 -109 123 -139 156
34 156 -173 194 -214 237 -266 294 -325 360 -400 441 -490 543 -602 671 -750 838 -944 1072
52 1072 -1222 1413 -1656 1982 -2448 3162 -4411 7233 -28095 57162 129791 29564 -47593 -20991
66 -20991 63541 77933 28212 -35572 -69794 -74930 -33484 22569 34663 -17144 -50022 -3265
78 -3265 82526 103674 37368 -46007 -65144 -20326 27917 17853 -45964 -90772 -46715 48580
90 48580 91583 43182 -19195 -19109 22989 39295 15775 -18308 -48469 -69030 -45834 23743 66661
103 66661 20317 -53228 -38014 62763 111655 34903 -71526 -82005 -7829 42528 15420 -39559
115 -39559 -56218 -23339 29678 63680 51424 12 -40051 -24047 28168 47626 670 -64696
127 -64696 -74170 -11545 56769 56584 -7912 -55100 -21514 53848 74361 10880 -58775 -55800 1947
140 1947 34536 13744 -20184 -29858 -16696 7558 34452 43025 9909 -39238 -41644 15049 58623
153 58623 23271 -51260 -68285 -5636 56249 44022 -17294 -48504 -18948 30291 45448 18002
165 18002 -20669 -36171 -17649 17625 36324 13697 -32954 -51296 -12545 45423 53020 -3190
177 -3190 -55433 -35094 35408 66795 18330 -49507 -55720 679 43817 25519 -22315 -41342
189 -41342 -16636 19198 35867 25881 -2263 -26675 -22726 12514 38758 15760 -39772 -59217
201 -59217 -12938 45562 45264 -9082 -43542 -14298 37743 48362 9075 -31830 -35838 -11837 11862
214 11862 15341 349 -20945 -26498 -701 38109 48308 10282 -36831 -36661 11374 43726 12935
227 12935 -46734 -59240 -7833 46024 41679 -4687 -30652 -9105 27485 36039 10250 -21900
239 -21900 -37052 -26389 2565 24778 14889 -18814 -33379 -104 48974 51588 -739 -46634
251 -46634 -31958 17595 34722 -1522 -42977 -38625 2866 34325 29887 5083 -11573 -9702 5938
264 5938 20453 17272 -9559 -39270 -36885 2530 36056 23977 -19115 -34112 2561 46758 41796
277 41796 -7668 -43111 -27597 10905 23888 788 -24915 -25403 -3009 21887 31660 18272 -8811
290 -8811 -24559 -9660 21625 27614 -7872 -46582 -37160 13837 45225 20114 -24700 -29751 8910
303 8910 39468 25604 -12176 -31764 -20225 2293 14400 8984 -7207 -20668 -13132 14655 36277
316 36277 23071 -15686 -34820 -10741 26480 27185 -11694 -42230 -25561 18002 37171 13582
328 13582 -18627 -21236 3116 23166 18738 -2679 -20623 -22377 -7683 13837 21304 2764 -24466
341 -24466 -22899 12778 41195 22405 -22940 -38224 -5422 29881 22878 -14053 -33738 -14938
353 -14938 15049 24630 11137 -7405 -15576 -7599 10276 21733 10167 -17126 -30980 -11224 21771
366 21771 28545 -1224 -30771 -20855 17226 36841 14079 -22994 -29543 -2254 22889 16576 -7822
379 -7822 -21696 -13961 4734 17633 16214 934 -16969 -17471 6034 27576 16697 -19030 -35791
392 -35791 -9464 27134 28094 -6416 -31219 -15348 18500 28744 7732 -16270 -19260 -4144 11200
405 11200 14280 3157 -13001 -20290 -6009 18430 25706 3193 -24659 -21546 10180 31330 12874
418 12874 -22338 -31123 -3583 24320 20553 -6271 -21927 -11233 10314 19266 10808 -6216 -16943
431 -16943 -12583 4931 18693 11501 -12435 -25854 -8746 22075 28574 685 -27988 -19697 13887
444 13887 29267 8050 -21258 -23815 -626 17492 13896 -1361 -11966 -11009 -312 14493 17909
457 17909 1951 -20321 -20585 4666 26309 14083 -18094 -28567 -4082 25073 23341 -4776 -23261
470 -23261 -12933 11107 20231 6802 -11987 -17283 -6546 8538 15131 7127 -9132 -17686 -5911
483 -5911 16344 23243 2432 -23985 -21729 8126 27627 11118 -20095 -25390 -857 21470 16890
496 16890 -4347 -15428 -8973 4311 12662 10147 -2126 -15870 -15702 2667 20435 14118 -11655
509 -11655 -24039 -5943 21995 24477 -2143 -24398 -16030 9822 21369 6104 -14974 -18339 -2208
522 -2208 13326 14631 3668 -9040 -12561 -2913 12153 16338 1012 -19945 -20425 3688 24148
535 24148 14103 -14353 -24282 -1755 23437 20345 -5207 -20510 -11698 7180 12979 4432 -7337
548 -7337 -12396 -7236 6167 17183 11853 -6746 -18731 -6976 15268 19762 -2585 -24025 -18547
561 -18547 7864 22645 9932 -12514 -16428 299 16669 14540 -1019 -13643 -12632 -1340 8298
574 8298 9733 -238 -13051 -13074 4746 22171 16319 -8959 -23540 -7735 17879 18504 -5947 -24216
588 -24216 -14458 9827 19173 7389 -7976 -10425 -1735 8842 11709 4244 -9826 -17577 -8232 10637
602 10637 16902 1349 -16973 -13907 9290 23975 11819 -12826 -20520 -4078 13940 12230 -5851
615 -5851 -16364 -9454 5590 13541 9325 -442 -8175 -7395 2281 12819 9467 -8391 -21483 -10473
629 -10473 13251 20214 1494 -18128 -12843 10141 21288 8203 -11681 -16381 -4423 7932 9933
642 9933 281 -9495 -10995 -861 12183 15728 2921 -13729 -14073 2979 17977 9855 -13097 -22538
656 -22538 -5327 17016 17739 -2417 -16534 -7579 9793 14693 4290 -7723 -10954 -6114 2915
669 2915 9471 6188 -5702 -13835 -5325 12822 17456 1755 -15970 -13884 4930 16649 7303 -11352
683 -11352 -17111 -3428 12239 12969 -241 -10358 -8358 2489 9693 8053 -619 -10500 -11247 -175
697 -175 13570 12047 -6465 -20056 -7938 15967 20173 -1225 -19581 -11310 9436 16395 4058
710 4058 -9847 -11759 -2993 6177 9669 4205 -7261 -11790 -2870 11766 13735 -396 -13774 -11099
724 -11099 4292 14543 7259 -9252 -16471 -4669 12633 14457 -856 -13195 -7670 6613 11776
737 11776 3965 -5419 -7807 -6194 -267 7489 9042 -2004 -14425 -8022 12061 19913 2484 -17318
751 -17318 -13911 6232 15856 4489 -11638 -13359 -2357 8210 10657 3831 -5740 -8935 -1036 10068
765 10068 11217 -1708 -13807 -12017 2395 13025 8307 -6846 -14317 -3824 14111 16967 -16
778 -16 -15908 -11406 5774 12552 2039 -10111 -9580 -717 6243 7622 5600 -1047 -8106 -6152 6847
793 6847 13040 1581 -15197 -14965 3165 15570 7733 -8390 -11521 -206 11775 10736 673
806 673 -9084 -9208 -1933 6378 6449 -1643 -9986 -7384 3622 13465 10206 -3379 -12992 -6049 9622
821 9622 14112 -129 -16647 -13830 4723 15474 7093 -8075 -10246 862 9720 8304 612 -6412
835 -6412 -8617 -4107 4483 8919 1827 -10151 -10678 3761 15774 9825 -6821 -13530 -2887 10003
849 10003 9867 -3054 -11911 -7937 2822 8823 5864 -1633 -6054 -3809 3213 8545 5734 -4165 -11810
864 -11810 -7273 5676 12055 2819 -11792 -11940 3492 15513 9327 -7201 -12771 -2914 8692 8359
878 8359 -1951 -8783 -7359 -371 6399 7913 1907 -7061 -8346 1738 12585 8690 -6879 -14984
892 -14984 -5733 9993 11564 -1491 -11836 -7539 5051 12198 5376 -4948 -7862 -2361 4189 6389
906 6389 1557 -5259 -8776 -3815 5398 9973 3360 -7836 -9677 1705 12715 8664 -6500 -14251
920 -14251 -4545 8457 9626 -1210 -9185 -5770 3121 7874 5443 -250 -6032 -6434 71 8221 6991
935 6991 -4322 -12616 -6307 8367 12920 2264 -10754 -9152 4298 12102 5390 -6670 -10362 -3242
949 -3242 6017 6995 733 -5801 -6298 -501 6207 8185 1936 -6898 -8508 -285 9451 7601 -5118
964 -5118 -12625 -4970 8757 11580 458 -9656 -6723 4038 9111 3436 -4070 -6265 -3813 1648
978 1648 5685 4607 -2247 -7729 -5011 5948 11560 3057 -9811 -10465 1914 11521 5872 -6545
992 -6545 -10989 -2665 7278 8054 800 -5838 -5596 595 6164 5750 -540 -6900 -6689 243 7893 6296
1008 6296 -2779 -10027 -5001 7352 11228 2015 -9608 -9056 2686 10167 4579 -5639 -8343 -1812
1022 -1812 4494 5830 2336 -2479 -5383 -3293 3900 8583 2983 -7460 -9680 123 10634 6733
1036 6733 -5240 -10953 -2895 7946 8759 -3 -7328 -6235 1464 6230 4445 -1801 -6560 -4758 1590
1051 1590 6535 5186 -2600 -7596 -4376 5282 9636 2783 -8232 -9611 877 10047 6051 -5472
1065 -5472 -9245 -1722 6563 6613 582 -4768 -4310 -1034 3331 5128 1647 -5711 -8022 -291 8245 7689
1081 7689 -2960 -10102 -3921 7166 9715 399 -8905 -7430 2035 7467 3955 -3079 -6294 -2668
1095 -2668 3002 5836 3697 -2647 -6442 -3661 3817 7306 2264 -7441 -8533 476 9829 7029 -3987
1110 -3987 -8983 -2765 6640 7510 -131 -6955 -5398 401 4661 3801 -293 -4219 -4459 67 6218 6388
1126 6388 -1861 -8569 -5618 4885 9183 1943 -8036 -8051 2200 8914 5125 -3859 -7195 -2294 3960
1141 3960 5215 1020 -3256 -5234 -2807 4080 6691 2424 -5458 -6928 406 8154 6466 -3565 -9870
1156 -9870 -4232 5820 8017 553 -6773 -5675 2086 6693 4236 -1741 -4983 -3353 1276 4114 3659
1171 3659 -1717 -6368 -4350 3591 8524 3283 -6401 -7991 577 8467 5544 -4461 -8192 -2460 4946
1186 4946 5572 1074 -3794 -3979 -272 3899 5237 1423 -4879 -6519 -829 6162 5917 -1893 -8123 -4018
1202 -4018 5243 8791 2224 -7072 -6971 1384 6781 3732 -3565 -6651 -2643 2838 4578 2410 -1663
1217 -1663 -4361 -2362 3009 6450 2216 -5560 -8076 -862 7322 5993 -2967 -8035 -2842 5929 7022
1232 7022 559 -5299 -4670 444 3880 3096 -607 -4213 -4103 241 5280 5374 -1033 -6456 -4454 3848
1248 3848 7475 2060 -6269 -7534 246 7340 4806 -3014 -6668 -2174 4261 5914 1239 -3434 -4120
1263 -4120 -1820 2617 4332 1608 -3674 -6044 -870 6552 6805 -1660 -8032 -4053 5293 7580 809
1278 809 -6331 -5648 1191 5544 3188 -1422 -4481 -2841 1309 4119 3205 -1487 -5198 -3596 2575 6317
1294 6317 2358 -5177 -6930 -363 6957 5602 -2126 -7258 -2881 4587 6179 631 -4959 -4185 284
1309 284 3504 3435 552 -3247 -3902 -979 4767 5590 -820 -6963 -4902 3977 7489 1705 -6028 -6037 1099
1326 1099 6421 3911 -2077 -4786 -2429 2436 4406 2120 -2372 -4618 -2395 2370 5001 2196 -3813
1341 -3813 -6107 -1029 5950 6005 -1531 -7473 -4092 4093 6583 737 -5894 -4742 923 4565 2944
1356 2944 -489 -2978 -2592 -109 3857 4014 -904 -5809 -4251 2973 6677 1920 -5276 -6303 133
1371 133 6354 4531 -2227 -5831 -2717 2887 4763 877 -3495 -4146 -573 2666 3340 1412 -2368 -3982
1387 -3982 -1073 4395 5382 -688 -6948 -4779 3609 6945 1382 -5703 -4953 1269 5501 3863 -1097
1402 -1097 -3944 -2321 1240 3111 2174 -1574 -4764 -3054 2427 5702 2518 -3638 -5670 -252 5546
1417 5546 4745 -1523 -6839 -3617 3658 5774 709 -4435 -3710 1099 4057 2942 44 -2660 -3441 -743
1433 -743 3009 4082 -774 -5720 -4518 2597 6466 2579 -4638 -5302 434 5274 3381 -2144 -4546
1448 -4546 -2891 1678 3758 1987 -1604 -3290 -1576 2550 4559 2062 -3093 -5282 -1468 4091 4850
1463 4850 -933 -6304 -3827 3559 6545 1942 -4637 -4575 677 4371 2619 -1692 -3654 -2672 413 3046
1479 3046 3156 -214 -3826 -2913 2501 5557 2349 -4302 -6058 -157 5055 3891 -2062 -4982 -2057
1494 -2057 3170 4585 1398 -2837 -3388 -791 2212 2957 685 -2481 -3734 -650 3488 4332 173 -5053
1510 -5053 -3757 2021 6028 1982 -4407 -5438 87 4790 3503 -1709 -3979 -2064 2018 3068 1619
1525 1619 -817 -3145 -2642 1285 4464 2041 -3107 -5132 -885 5279 4826 -1376 -5526 -2836 3145
1540 3145 5023 918 -3738 -3868 -30 3017 2596 -69 -2487 -2851 -137 2581 3121 -187 -3934 -3805
1556 -3805 1594 4718 2652 -3435 -5334 -496 4724 3960 -1751 -4691 -2094 2070 3894 1186 -1700
1571 -1700 -2619 -1477 1691 2999 1711 -2168 -4437 -1187 3454 4575 -622 -4986 -3347 2455 5204
1586 5204 1622 -3857 -4131 -122 3662 2865 -1034 -3421 -2047 790 2783 2387 -381 -2698 -2487 1106
1602 1106 4260 2443 -2918 -4795 -1457 4198 4488 -1247 -4781 -2492 2956 4341 980 -2658 -3104
1617 -3104 -610 1551 2377 693 -1904 -3133 -1050 2872 4119 243 -3801 -3530 1795 4609 1634
1632 1634 -3363 -4870 -117 3797 3287 -887 -3256 -2350 1365 3149 1604 -1383 -3019 -1824 694
1647 694 2930 1937 -1706 -3921 -1388 3623 4369 74 -4762 -3393 2045 4611 1310 -3227 -3417 -54
1663 -54 2944 2482 135 -1953 -1975 -201 2002 2923 41 -3401 -3243 916 4662 2509 -2522 -4781 -491
1680 -491 4264 3660 -874 -3746 -2605 1775 2954 1581 -2105 -3108 -884 1810 3055 1032 -1354
1695 -1354 -2670 -1446 2279 3528 485 -3810 -3869 1247 4707 2275 -2799 -3915 11 3801 2785
1710 2785 -1117 -2629 -1742 353 1858 1609 -77 -2403 -2474 886 3771 2360 -2178 -4107 -950 3250
1726 3250 3822 -788 -3884 -2548 1775 3778 1458 -2285 -2886 -556 2304 2171 -162 -2142 -2339 -488
1742 -488 2511 2937 420 -2727 -2759 454 3885 2180 -2705 -4479 -805 3479 2954 -954 -3307 -1451
1758 -1451 1466 2704 1048 -526 -1843 -1351 449 2503 1908 -1633 -3339 -1343 2648 3679 348
1773 348 -3351 -2774 1090 3561 1902 -2371 -3710 -712 2424 2559 -155 -2152 -2045 -71 2276 2141
1789 2141 -167 -2620 -2696 72 3451 2346 -1977 -4270 -1163 3596 3330 -259 -3852 -2537 1564 3187
1805 3187 813 -1900 -2448 -445 1313 2000 859 -1132 -2308 -761 2201 2832 126 -3079 -3357 1004
1821 1004 3620 2115 -1542 -3130 -422 2825 2556 -345 -2508 -1864 425 1555 1185 -393 -1647 -1732
1837 -1732 625 2874 2370 -900 -3351 -1880 2436 3292 74 -3595 -2877 1314 3734 1685 -2059 -2658
1853 -2658 -86 1992 1791 306 -1976 -2152 -736 1562 2004 516 -2289 -2383 579 3368 2179 -1903
1869 -1903 -3420 -1062 2797 2526 -571 -2732 -1635 1328 2740 1394 -910 -1554 -865 429 1680 1325
1885 1325 -836 -2592 -1425 1959 3065 672 -2801 -2811 538 3439 1949 -1937 -3031 -908 2035
1900 2035 2113 17 -1878 -1448 208 1881 1423 -215 -2003 -1761 34 2543 1851 -1400 -2747 -1289
1916 -1289 2390 3473 370 -3331 -2233 1114 2771 974 -1862 -2376 -540 1366 1721 1179 -946 -1482
1932 -1482 -588 1494 2152 267 -1940 -2792 21 2939 2092 -1260 -2903 -1044 2561 2491 -147 -2337
1948 -2337 -1918 373 1600 1137 -275 -1452 -1417 488 2131 1919 -561 -2503 -1720 1666 2901 346
1964 346 -2936 -2643 575 3063 1612 -1356 -2201 -504 1766 1702 157 -1546 -1904 -497 1471 1751 353
1981 353 -1535 -1562 168 2429 1737 -1080 -2990 -1447 1939 2306 192 -2532 -1851 1015 2550 1205
1997 1205 -814 -1354 -668 411 1207 780 -928 -2010 -1226 1126 2475 1031 -2106 -2106 434 2680 1876
2014 1876 -1298 -2518 -1025 1582 2113 29 -1507 -1500 152 1333 1536 101 -1581 -1877 78 1754
2030 1754 1488 -207 -2503 -1433 1486 2844 618 -2296 -2434 691 2482 1085 -1183 -2127 -471 1189
2046 1189 1253 492 -609 -1066 -683 919 1756 631 -1547 -2262 -202 2091 1830 -918 -2264 -764 2026
2063 2026 2269 176 -2005 -1968 91 1548 1094 -297 -1491 -793 435 1314 1416 -342 -2116 -1501 869
2080 869 2157 924 -2094 -2175 501 2549 1659 -919 -2261 -508 1224 1576 55 -1397 -1338 -603 803
2097 803 1494 163 -1134 -1193 -263 1853 1493 -610 -2405 -1816 1210 2174 243 -1841 -1339 490 2129
2114 2129 998 -946 -1568 -659 328 1310 322 -625 -1558 -920 910 1998 990 -1353 -1759 147 2501
2131 2501 1595 -872 -2603 -778 1084 1774 300 -1311 -1165 412 1207 1030 -253 -1621 -1452 -241
2147 -241 1278 1244 -413 -1785 -1472 1113 2444 579 -1619 -1806 -88 1707 934 -988 -2011 -960
2163 -960 940 1133 384 -451 -1214 -533 1011 1330 347 -1248 -1905 -514 1631 1674 -829 -2040 -833 979
2181 979 2023 355 -1489 -1394 0 1313 796 -455 -1272 -1121 614 939 937 -112 -1658 -1024 726 1630
2199 1630 874 -1644 -2057 46 1888 1503 -492 -2040 -454 1224 1438 206 -1018 -1109 9 655 659
2216 659 497 -983 -1423 -89 1264 1235 -95 -1604 -1170 1009 1646 481 -1454 -1328 -46 1493 1006
2233 1006 -510 -1104 -572 832 790 384 -271 -754 -478 643 1214 477 -1117 -1702 -256 1670 1473 -719
2251 -719 -1712 -647 931 1687 456 -1131 -1187 269 981 772 -51 -803 -1057 -44 955 1091 -199 -1202
2269 -1202 -742 356 1525 579 -1277 -2230 10 1617 1309 -910 -1430 -535 913 1429 346 -550 -1040
2286 -1040 2 427 1071 170 -523 -1266 -500 1334 1328 -87 -1463 -877 861 1748 448 -1077 -1199 276
2304 276 1402 549 206 -921 -523 382 1058 407 -210 -941 -897 210 1268 719 -1083 -1894 -290 1340
2322 1340 1431 -297 -1420 -711 838 1628 -240 -1012 -1148 -151 548 834 272 -971 -923 -222 702 1219 -33
2341 -33 -1312 -833 443 1741 541 -1186 -1242 63 1116 1040 -300 -769 -757 343 639 271 -753 -788
2359 -788 -770 358 1248 754 -1097 -1569 -243 1159 1079 144 -1365 -762 710 1244 426 -1060 -942 105
2377 105 914 803 -98 -609 -667 -3 628 945 -69 -1088 -1369 167 1391 924 -922 -1513 -154 1223
2395 1223 1010 -568 -1098 -713 497 1091 402 -823 -935 -417 241 981 781 -342 -956 -321 585 962
2413 962 -196 -1101 -985 76 1248 778 -688 -1075 -393 920 714 -115 -1082 -685 430 866 331 -127
2431 -127 -880 -572 283 1076 1038 -453 -1372 -629 871 1263 -94 -1454 -1073 796 935 329 -795 -587
2449 -587 -205 875 722 -91 -728 -664 -207 777 793 183 -1028 -943 343 925 643 -630 -1336 -214 768
2468 768 839 -145 -903 -590 210 809 254 -78 -501 -718 206 506 621 -302 -941 -606 783 1418 269 -994
2488 -994 -981 439 1451 112 -621 -1050 -464 821 1059 -42 -521 -416 256 479 756 21 -829 -1136 316
2507 316 1035 854 -255 -967 -269 940 1174 -101 -727 -548 603 899 230 -323 -541 65 244 874 678
2526 678 -260 -428 -569 481 1147 60 -443 -844 169 1109 763 -446 -741 -505 808 921 283 -538
2544 -538 -554 283 787 463 -154 -488 -729 270 408 692 -336 -1282 -560 576 902 303 -821 -936 282
2563 282 873 371 -538 -947 -196 602 762 174 -369 -381 -43 22 557 607 -464 -1143 -109 938 840 -583
2583 -583 -919 -325 891 884 -142 -705 -688 98 747 562 -33 -637 -554 -28 568 483 -369 -856 -563 449 1186
2604 1186 217 -691 -981 300 816 593 -533 -897 -247 564 471 -285 -620 -626 316 498 489 105 -350 -688 -147
2625 -147 682 795 -258 -844 -482 441 1154 -4 -884 -943 -3 968 519 -451 -608 -155 313 945 130 -181
2645 -181 -753 -499 94 816 288 -288 -807 -323 581 602 -287 -862 -525 887 488 214 -423 -480 -24 428
2665 428 852 217 -504 -372 -215 681 796 91 -801 -535 24 804 667 -823 -947 254 426 267 -352
2684 -352 -471 -295 22 444 7 -79 -413 -181 26 304 439 -80 -752 -29 769 334 -230 -619 -390 329
2704 329 716 250 -405 -708 -95 548 632 -59 -369 -472 142 626 775 113 -453 -518 236 626 474 -293 -754
2725 -754 -115 607 838 -303 -587 -384 487 696 43 -452 -146 68 466 411 -99 -187 -641 -113 499 1015
2745 1015 -133 -581 -482 318 911 409 -376 -966 -145 634 946 -164 -303 -526 201 313 273 38 -525 -205
2765 -205 -180 572 272 -320 -908 -152 298 802 -25 -506 -580 131 1018 410 -392 -690 -255 614 189 187 -157
2786 -157 -815 317 440 801 331 -497 -630 -101 909 133 -282 -978 -384 603 808 -133 -708 -353 -104
2805 -104 655 309 -330 -722 -34 215 467 179 48 -649 -332 401 940 514 -778 -601 342 828 693 -501
2825 -501 -545 -76 76 625 -103 -633 -418 54 643 224 -64 -488 -680 86 374 592 -74 -622 -441 483
2845 483 742 -16 -535 -604 277 150 241 -446 -520 -168 355 668 85 -50 -663 -169 175 845 293 -531 -380
2866 -380 -175 635 619 -96 -587 -389 463 557 -414 -561 -135 338 334 329 136 -367 -654 212 481 408 126 -649
2888 -649 -438 250 890 144 -508 -613 101 761 184 -258 -686 -184 605 252 224 -145 -471 -365 178 741
2908 741 162 -601 -397 -150 391 757 151 -710 -409 266 649 95 -623 -557 -37 489 103 215 -436 -283
2928 -283 273 361 188 -65 -540 -201 377 637 234 -267 -594 139 642 749 -236 -759 -633 309 278 288 -265
2949 -265 -338 -153 259 320 160 -475 -552 107 479 774 90 -779 -430 223 681 491 -426 -476 -125 722 437
2970 437 -81 -814 0 446 377 243 -36 -386 -382 467 640 331 -328 -642 -7 714 807 15 -310 -130 368
2991 368 796 451 -423 -672 -283 285 357 -170 -225 -282 120 551 557 -30 -291 -274 196 574 285 -528 -455 110
3013 110 738 595 -76 -357 -397 312 574 128 -244 -170 -305 311 590 244 -349 -315 -175 401 376 -149 -403
3034 -403 -843 405 656 139 -401 -603 -23 535 507 -94 -667 -424 145 488 323 -97 -292 -342 -96 659
3054 659 730 -228 -401 -373 600 623 27 -618 -428 48 299 423 -40 -477 -170 493 356 269 -358 -305 -55 354
3076 354 440 180 -545 -526 57 487 466 -584 -997 -140 596 514 -272 -352 -734 160 574 416 -300 -411 -497 23
3098 23 629 294 -226 -804 -157 708 622 -38 -349 -386 320 906 360 -583 -702 -161 286 667 279 -374 -398
3119 -398 -421 511 514 71 -482 -562 -311 525 594 53 -423 -111 232 572 -250 -667 -312 93 606 308 -415 -571
3141 -571 -90 -77 733 269 -104 -773 -450 257 681 5 -688 -601 305 789 556 -454 -866 -36 544 494 142
3162 142 -657 -184 -58 504 555 -45 -533 -760 201 744 420 -94 -639 -430 669 863 -99 -642 -408 242
3182 242 777 547 -142 -610 -52 253 535 -48 -405 -694 -247 438 591 101 -581 -714 36 754 922 -162
3202 -162 -706 -393 265 734 -100 -544 -427 380 476 502 -170 -607 -253 201 355 370 -298 -925 -628 414 858
3223 858 113 -151 -550 63 584 636 -180 -750 -600 381 437 227 -537 -370 20 196 668 78 -532 -1069 75
3244 75 483 298 -298 -608 -429 360 725 61 -775 -887 468 710 299 -269 -721 -129 72 800 212 -292
3264 -292 -688 -234 337 545 10 -529 -878 85 495 366 -144 -845 -275 447 522 -171 -624 -453 -34 710
3284 710 506 53 -579 -345 -135 713 836 118 -793 -317 161 914 320 -507 -553 202 1002 818 -267 -523
3304 -523 -7 276 520 224 -398 -310 -269 407 553 -95 -397 -831 -363 762 269 -243 -698 -572 450 811
3324 811 80 -715 -680 27 342 405 -56 -118 29 265 295 470 28 -354 -349 212 611 588 -357 -697 -29 862
3346 862 493 -368 -793 -340 240 784 71 -565 -533 -340 476 162 122 -675 -414 -335 654 874 -94 -517 -303
3367 -303 49 658 566 -579 -583 223 558 451 -666 -238 -251 -92 619 344 -102 -581 -58 206 719 20 -785
3388 -785 -471 206 808 478 -133 -864 -221 426 412 534 -346 -648 15 238 679 -1 -166 -177 59 750 436
3409 436 -380 -793 -463 323 983 178 -238 -605 -179 801 633 -86 -577 -401 34 516 251 -321 -391 -285
3429 -285 275 371 -14 -547 -727 -339 476 653 168 -788 -371 432 695 208 -594 -682 -262 683 375 -475 -504
3450 -504 -239 86 380 281 -206 -707 -140 460 695 319 -767 -669 14 591 844 -455 -589 -667 481 1010
3470 1010 245 -456 -397 -141 416 326 162 -423 -470 -41 439 839 -106 -919 -344 325 792 201 -396 -592 -265
3491 -265 636 779 -48 -612 -27 394 474 362 225 -484 -325 414 636 553 -367 -603 294 785 678 -124 -495
3512 -495 -262 -114 979 365 -440 -728 -91 626 745 -195 -631 -271 -374 602 580 -122 -586 -420 180 801
3532 801 515 -406 -1038 -111 750 358 19 -859 -495 76 654 246 -141 -692 -328 246 185 145 -524 -664 -35
3553 -35 486 448 66 -646 -745 362 1044 533 -662 -703 -223 501 387 -141 -773 -670 140 548 543 153 -468
3574 -468 -360 363 619 398 -842 -957 53 299 1200 -223 -531 -706 191 753 274 -240 -438 -155 462
3593 462 181 77 -383 -443 -15 841 516 -50 -550 -838 38 968 558 -169 -846 -61 556 625 -146 -511 -520
3614 -520 283 824 69 -255 -638 -351 245 560 47 -203 -525 -48 657 837 -116 -421 -448 187 653 630 -216
3635 -216 -928 -17 594 302 134 -258 -524 199 505 489 -176 -887 -353 130 1095 259 -113 -944 -351 722
3655 722 702 62 -878 -242 325 608 398 -485 -685 53 371 731 -91 -270 -337 -161 492 642 35 -459 -785
3676 -785 323 617 418 -569 -690 -210 409 931 -63 -811 -572 68 509 554 149 -699 -746 160 687 420
3696 420 -566 -855 -427 422 919 182 -658 -653 343 876 592 -500 -486 -129 762 558 65 -624 -661 -184 408
3717 408 442 276 -592 -688 147 495 388 -212 -745 -516 671 750 -143 -565 -453 -78 406 279 118 -701 -259
3738 -259 471 547 297 -279 -646 -197 211 381 89 -553 -993 72 531 507 -475 -608 -381 412 650 -237
3758 -237 -688 -758 -52 373 338 -55 -311 -466 -2 972 327 -838 -974 -558 404 739 99 -549 -745 175
3778 175 523 576 -280 -725 -289 52 481 11 -381 -643 49 220 430 200 -433 -531 282 641 289 -169 -728
3799 -728 -396 398 846 -44 -852 -584 423 453 456 -220 -595 -335 -225 590 3 -193 -678 49 441 894 315
3820 315 -495 -853 -1 440 248 -232 -1101 -425 504 433 306 232 -719 169 455 518 109 -886 -258 19 453
3841 453 647 -592 -783 -357 505 738 102 -778 -703 160 497 427 -293 -718 -307 39 463 108 -306 -315 -461
3862 -461 440 394 -64 -772 -887 90 708 443 -86 -697 -200 938 849 100 -562 -507 339 481 295 -21 -399
3883 -399 -297 -131 551 511 -196 -289 -439 281 863 132 -319 -706 12 593 137 -100 -658 -351 731 623
3903 623 139 -339 -288 -250 275 670 -173 -793 -974 218 566 637 -388 -683 -312 577 650 96 -600 -738 -71
3924 -71 446 333 -37 -708 -185 92 640 319 -148 -363 -265 336 471 -287 -495 -482 127 806 682 50 -607
3945 -607 95 549 607 8 -404 -808 -50 184 600 -107 -545 -125 337 562 376 -318 -605 -268 614 712 106
3966 106 -633 -774 27 738 220 -282 -873 -46 341 483 124 -415 -316 -126 493 612 368 -349 -620 258
3986 258 599 792 -176 -512 -256 233 690 50 -542 -328 -71 663 271 -155 -542 -678 51 285 299 -157
4006 -157 -466 -613 756 1038 272 -644 -755 232 605 812 62 -398 -436 288 539 283 -621 -425 -2 409
4026 409 712 151 -630 -693 91 706 522 -388 -845 -796 10 704 -179 -534 -711 77 387 275 148 -615 -451
4047 -451 450 544 519 -264 -524 -537 169 744 379 -238 -772 18 722 991 -491 -762 -184 565 724 -264 -566
4068 -566 -625 -276 708 528 -33 -751 -519 50 331 452 -62 -522 -447 508 1010 292 -733 -735 -134 719 460
4089 460 -67 -495 -386 82 615 169 -566 -532 -51 120 573 345 -559 -673 -89 583 649 -293 -908 -116 269
4110 269 649 512 -518 -599 343 703 505 -64 -516 -413 -94 348 -29 208 -614 -454 341 604 172 -544
4130 -544 -1072 -183 716 388 -2 -664 -633 104 409 -105 -461 -688 -110 532 708 176 -360 -815 41 531
4150 531 292 144 -687 -490 274 913 446 -1146 -738 -205 460 224 -168 -614 -293 215 467 174 -384 -461
4170 -461 -112 192 802 193 -425 -651 176 693 522 -69 -670 -427 264 439 306 51 -512 -110 316 255
4190 255 34 -285 -763 98 266 826 137 -745 -533 434 715 237 -431 -574 -39 525 589 -178 -466 -155
4210 -155 289 651 346 -580 -400 -192 102 595 43 -428 -368 -266 319 520 87 -776 -181 275 761 346
4230 346 -528 -628 -38 278 524 4 -316 -176 227 512 252 -648 -563 -490 510 843 157 -334 -1024 13
4250 13 704 634 -120 -286 -517 335 873 310 -235 -529 45 166 404 -81 -573 -528 -463 527 617 -220 -692 -654
4272 -654 121 652 257 -683 -545 -351 328 773 138 -585 -406 163 552 545 99 -660 -409 173 705 265 -153
4293 -153 -543 -284 599 682 -86 -411 -314 298 567 298 -425 -512 -115 211 443 -43 -436 -274 -134 171 511
4314 511 -45 -474 -234 176 764 495 -513 -511 266 576 701 71 -597 -855 526 451 373 -210 -165 17 364
4335 364 635 196 -306 -855 -324 537 390 -44 -453 -795 362 698 577 -666 -697 -88 648 323 -119 -709
4355 -709 -329 238 326 309 -204 -257 -628 388 675 315 -49 -605 -278 905 620 -172 -460 -651 443 799
4375 799 85 -42 -495 -137 415 373 -180 -345 -179 -94 434 537 -3 -729 -380 286 776 347 -325 -761 -130
4396 -130 566 450 117 -585 -299 469 553 255 -200 -669 -486 313 427 129 -522 -670 -35 276 703 -222
4416 -222 -640 -421 -24 855 495 -504 -714 -375 310 208 27 -653 -512 201 511 401 64 -411 -594 -107
4436 -107 510 553 -253 -289 -195 461 622 121 -687 -757 60 685 548 -546 -450 -703 303 499 378 -189 -554
4457 -554 -217 337 409 15 -178 -613 125 473 171 -741 -420 38 581 393 29 -381 -214 -233 482 563 -4
4478 -4 -436 -221 59 656 164 -178 -647 -477 636 982 159 -973 -425 95 425 458 -502 -384 -114 306
4498 306 341 172 -522 -310 -30 331 428 -209 -659 -509 278 372 -82 -474 -512 -11 435 344 -75 -507 -395 228
4520 228 457 389 -151 -672 -225 125 364 95 -306 -640 -319 686 713 -8 -780 -627 378 1034 166 -201
4540 -201 -538 12 419 410 -22 -790 -247 -354 273 131 -8 -311 -374 379 658 215 -249 -595 -59 704 506
4561 506 -158 -852 -191 278 449 425 -363 6 -246 97 902 219 -288 -518 -407 533 493 114 -460 -443 -94
4582 -94 590 267 -65 -788 -151 651 379 -108 -632 1 239 428 107 -245 -387 -150 -37 509 159 -492
4602 -492 -520 5 447 473 314 -623 -530 52 588 441 -529 -105 -458 163 487 -59 -431 -515 -184 123 683
4623 683 356 -923 -186 16 280 203 -308 -517 -334 514 392 230 -454 -179 149 563 161 -297 -887 85
4643 85 -39 446 324 -293 -442 -342 420 644 -76 -555 -691 76 723 428 -449 -701 166 580 681 -331
4663 -331 -360 -367 168 471 450 -8 -633 -392 289 560 -12 -92 -776 -175 879 897 91 -857 -257 -143 569 350
4685 350 -330 -491 -40 364 439 -75 -608 -562 -107 -7 562 320 -586 -485 -350 822 373 -286 -766 -256
4705 -256 597 697 121 -386 -605 195 432 33 -445 -560 -277 231 538 412 -287 -588 -320 417 652 -61
4725 -61 -515 -724 271 631 86 -358 -510 88 613 587 118 -319 -423 -190 441 524 16 -410 -578 15 455
4746 455 314 -221 -522 -156 511 361 413 -863 -254 45 176 61 -19 -270 -136 251 232 64 -317 -663 -62
4767 -62 472 493 -222 -290 -381 116 809 424 -105 -529 -139 317 514 -232 -481 -215 141 356 308 -166 -629 -560
4789 -560 264 154 364 -519 -556 -143 188 599 23 -275 -422 -150 288 261 -173 -761 -35 431 409 -103 -332
4810 -332 -315 -33 316 198 30 -218 -696 -99 474 43 -155 -545 115 559 412 -314 -503 -437 145 338 -113
4831 -113 -91 -346 -400 -16 525 302 -323 -467 -234 514 574 14 -821 -438 126 965 288 -238 -572 64 371
4852 371 188 -173 -307 -244 -145 461 42 -89 -386 -176 223 326 355 36 -742 -114 344 480 -115 -633 -873
4873 -873 -116 748 290 -208 -394 -33 105 480 135 -369 -505 298 361 520 180 -576 -474 287 387 593
4893 593 -328 -618 -458 304 637 93 -376 -501 223 393 103 227 -764 -552 168 286 250 -81 -747 -213
4913 -213 350 427 23 -553 -250 -290 437 362 -167 -583 -128 413 243 -44 -475 -401 -147 286 572 -156 -323
4934 -323 -538 72 585 252 -111 -581 -63 333 480 129 -436 -471 209 284 239 -91 -634 -182 191 633 282
4955 282 -158 -361 -216 464 482 -96 -205 -618 353 449 680 -283 -345 -274 103 435 165 -273 -300 327 22 544
4977 544 177 -415 -143 123 693 469 -588 -454 173 235 288 -35 -758 -470 -89 212 205 -202 -270 -133 347
4998 347 368 33 -74 -292 -148 153 316 -52 -332 -243 65 573 484 -128 -675 -158 171 634 -17 -374 -378 -10
5020 -10 600 320 -396 -633 -198 75 626 60 -76 -205 -353 189 624 507 -385 -619 106 578 170 -127
5040 -127 -483 -167 325 442 50 -523 -694 -264 395 275 -372 -431 -21 -206 479 302 -295 -211 -247 395 594
5061 594 -3 -99 -354 -38 558 450 -223 -438 -210 -70 497 -2 -361 -68 -316 529 653 105 -205 -248 -99
5082 -99 465 371 29 -283 -238 303 454 346 -573 -287 11 425 305 -213 -348 -686 -363 301 504 15 -498
5103 -498 -544 -82 423 168 -314 -199 208 355 -306 -397 -291 -335 321 418 153 -434 -489 -209 436 277 -116 -159
5125 -159 -364 224 239 459 53 -490 -309 275 579 -185 -362 -483 -117 338 173 -338 -333 85 124 339 249 -306
5147 -306 -482 -321 121 240 413 -442 -358 35 495 123 -170 -797 -315 356 205 96 -461 -316 302 604
5167 604 655 -177 -389 -457 -226 383 -58 -338 -545 86 252 378 340 -468 -534 -138 377 169 -191 -182 -203 139
5189 139 222 97 23 -48 23 332 37 -22 -227 -299 131 352 501 -349 -399 -288 248 401 180 -181 -253 17 680
5212 680 255 -158 -257 -389 228 418 106 -42 -299 -128 447 250 181 -244 -430 -24 408 480 -194 -552 46
5233 46 91 177 230 -31 -169 -54 342 31 -97 -120 -430 -113 486 429 -286 -138 -9 215 297 346 -452 -399 -159
5256 -159 454 285 -246 -40 -76 123 544 302 -108 -382 -184 372 420 117 -532 -336 -37 412 415 -178 -579
5277 -579 -460 275 278 -158 -409 -430 1 232 242 -215 -59 -286 -202 135 83 17 -481 -91 177 347 -225 -361
5299 -361 -453 86 164 285 -163 -363 225 -54 311 91 -44 -445 -216 309 440 133 -347 -284 154 471 600
5320 600 -64 -328 -531 221 553 -4 -243 -292 -360 480 559 -93 -526 -264 69 500 273 -87 -264 -265 156 287
5342 287 -283 -190 -359 -159 514 135 -51 -415 -181 243 532 -11 -462 -485 -162 -119 424 318 -120 -457 85
5363 85 469 446 -432 -512 -303 198 342 -25 -66 -556 -82 225 259 182 -274 -401 376 446 345 -36 -208 -135 91
5386 91 510 130 -82 59 271 329 180 -76 -370 -108 -54 563 -3 -231 -13 252 340 133 147 -317 -262 -12
5408 -12 566 104 -60 -49 -109 253 768 -10 -563 -272 128 250 81 -83 40 -390 180 196 9 -240 -244 -212
5430 -212 98 249 -2 -163 -464 -122 306 93 -411 -505 94 325 294 365 10 -19 -82 270 149 39 -456 -449
5452 -449 5 649 376 71 -677 -525 233 551 153 -552 -613 0 448 458 -193 -491 -118 209 119 357 -355
5473 -355 -398 -45 365 -35 -24 -162 -159 64 207 205 -161 -332 -230 -32 453 36 -398 -88 -50 339 427 -106 42
5496 42 -101 72 498 -54 -68 -75 37 67 404 110 199 -610 -232 101 467 100 -545 -298 272 371 350 -481 -114
5519 -114 153 498 437 209 -106 -187 -31 -221 43 -50 -270 -330 276 192 119 -234 10 -300 90 611 -75 7
5541 7 -345 145 -82 110 -399 -51 246 213 494 21 -91 -427 -293 468 446 -101 -265 -249 142 213 412 -75
5563 -75 -505 152 343 204 -118 -67 -206 225 541 -70 -2 -1 -104 73 398 206 -368 -384 27 501 184 34
5585 34 -289 -30 -77 364 184 -137 -104 -368 324 129 132 -161 -219 -19 331 37 -106 -151 -223 126 322 -112 -258
5608 -258 -313 -139 394 96 -203 -147 61 365 225 21 -156 -408 -91 298 333 192 -135 -107 -227 223 306 -87
5630 -87 -446 -63 112 189 329 -249 -345 156 184 110 -186 -134 -252 -109 263 231 -159 -60 190 250 397 198 148
5653 148 -408 -366 295 112 238 -356 -254 70 165 -103 -170 -381 -100 73 51 -148 -160 -106 -206 118 509 -80
5675 -80 -325 -288 264 403 360 -179 -286 -74 241 387 -147 -133 -266 -31 144 162 78 -407 -244 174 121 75 62
5698 62 10 -171 -104 110 47 -367 -93 -2 408 149 -395 -154 139 189 110 -69 6 48 -83 258 425 -28 -323
5721 -323 -183 -23 366 120 -418 -174 -248 68 126 163 -395 -303 -14 331 278 117 -513 -385 22 208 237 -412
5743 -412 44 -141 133 403 225 -4 -80 107 194 105 -50 -365 -34 251 433 27 10 -319 -16 213 190 -171
5765 -171 -8 -163 261 333 197 -143 -273 -109 249 310 -17 -250 -120 -97 15 143 -419 -342 -347 484 -126 25
5787 25 -286 -326 110 -91 209 344 -46 -97 -41 81 -104 -369 -415 -177 328 244 7 22 121 -149 180 186 295
5810 295 219 207 228 340 99 -2 -241 6 289 324 -263 -250 -480 78 214 372 -277 38 40 -78 27 42 -314
5833 -314 -91 74 129 356 -158 42 -340 297 181 107 -29 -240 91 255 221 337 -357 -357 53 350 -125 45
5855 45 -67 72 179 125 -46 -216 -85 -222 442 289 114 -369 -104 320 243 -295 104 -46 -38 193 570 -5
5877 -5 -127 -169 98 248 -116 -37 -230 -154 197 188 138 -199 71 -71 121 92 283 -332 -221 18 98 172 103 -450
5901 -450 -81 149 -137 95 -170 -462 -205 123 122 -194 -230 -361 -220 209 105 -284 -331 14 10 104 199 -178 -235
5924 -235 273 256 123 -245 -241 54 -62 140 82 -37 -343 110 351 442 112 96 49 85 234 223 -179 10 -498
5947 -498 5 164 -56 -141 -3 141 -153 58 -45 -136 -414 31 327 108 158 0 -173 -126 133 -164 -210 58
5969 58 -157 365 116 -437 -212 -41 1 107 -306 214 -322 -19 218 359 184 132 -303 -3 260 170 14
5990 14 -195 76 -229 51 93 -383 -84 -52 43 144 303 -39 -317 38 147 302 -211 -94 213 186 -20 -59
6012 -59 -301 -280 54 167 401 171 3 -28 179 205 296 -228 -214 -170 44 158 36 -169 -129 44 198 397 358
6035 358 -253 -53 30 -75 68 -288 -75 323 105 -168 -42 -513 -319 -109 180 190 8 -113 71 277 209
6056 209 -585 -308 113 84 -30 165 -141 11 235 151 -104 -203 10 -78 -59 98 1 -278 188 -273 -226 507
6078 507 151 -40 -144 -18 -4 27 -5 -48 -393 165 191 23 -58 -185 -279 58 174 254 -50 -64 -113 -235 355
6101 355 90 175 -239 -14 -10 97 138 -49 279 -172 13 -153 272 -59 207 180 5 260 -210 -354 192 234
6123 234 218 96 -138 -206 -104 316 54 -322 -245 70 218 27 -190 -77 -125 107 290 -93 -87 -283 26 -59
6145 -59 -196 153 42 -58 -12 88 210 -13 -421 72 -44 -106 -202 -312 -448 -497 -105 73 161 -93 36 -167
6167 -167 162 156 375 -84 -345 2 -199 97 57 -193 34 123 97 -131 -17 -61 41 259 230 -67 54 -114
6189 -114 308 95 -254 -52 -199 86 384 -94 296 -113 -114 188 6 -180 58 -24 -148 63 145 84 243 64
6211 64 -152 137 49 -358 -50 -159 112 60 58 -64 -157 101 167 174 57 7 80 46 535 36 -72 134 -94 141
6235 141 209 198 178 -101 5 -66 63 -141 -100 -153 0 431 77 88 -90 -93 66 308 -238 49 79 105 79 47
6259 47 -186 37 15 -212 -27 34 236 -15 -65 -125 -321 19 -100 49 38 87 26 234 -281 52 238 183 -52
6282 -52 -211 -10 -26 102 180 -69 -213 -360 234 69 221 -151 -108 -302 12 121 -108 -202 -313 38 286 156
6304 156 -252 157 99 -224 37 330 -118 -427 -249 137 190 142 -139 -94 94 347 34 -306 66 2 229 -90
6326 -90 214 -145 -353 -161 181 74 -348 28 21 209 -64 64 -153 -347 -176 197 76 82 -205 -377 351 379
6348 379 -150 -78 137 -193 -103 207 5 -68 -211 -93 216 111 -137 -108 -375 114 78 -106 5 129 -13 244
6370 244 60 112 -196 -460 251 209 191 158 107 -260 91 -205 -84 -53 9 72 -156 129 123 -262 -160 265 341 3
6394 3 -49 -99 -283 59 191 74 -353 -238 -10 221 420 298 -63 3 -295 -14 254 -173 -109 11 4 156 -99
6417 -99 -81 221 -246 -7 90 -203 -278 319 193 -185 143 -42 1 298 3 182 309 -61 -50 -349 323 148
6439 148 30 157 -198 -35 200 -121 -290 -233 -210 210 -94 -112 -315 -131 158 94 -120 260 50 -83 107
6460 107 188 -27 -226 -311 25 -77 -87 4 -316 -63 165 62 222 -411 -61 -34 121 270 77 -1 190 119
6482 119 90 41 111 115 -151 -53 244 -141 -26 22 251 23 47 273 -192 4 212 328 -91 -126 -248 128 203
6505 203 138 -166 -117 -114 -207 -157 58 -272 -77 -81 45 224 105 -30 -254 -214 38 -44 116 137 -240 139 162 -126
6529 -126 197 -158 52 -45 509 39 29 -226 -24 27 102 16 -106 -137 -47 127 178 -443 -83 83 150 78 16 -166
6553 -166 -88 105 27 49 155 -716 79 46 265 42 -241 -3 -41 84 -169 127 170 -63 113 124 -35 -50 -145
6576 -145 -166 82 27 219 26 -402 59 92 186 102 -33 -332 -319 -19 -154 -294 -384 -202 134 -87 211 81
6598 81 105 -94 39 441 114 -189 -7 147 363 74 -64 -76 -273 42 7 -34 -16 251 -101 86 182 -247
6620 -247 -353 69 -100 65 -72 -17 -335 -327 179 -53 126 0 -96 109 -55 -29 79 -52 8 -434 254 99
6642 99 -162 -41 10 340 85 71 -185 -9 -33 57 154 -39 -719 40 48 274 175 -71 -236 -108 174 42 282
6665 282 -426 -220 -144 212 22 -102 -47 35 96 195 131 139 -143 -138 -107 95 120 115 -142 136 148 299 -57 -238 -230 40
6691 40 -47 -19 97 -57 382 -28 6 35 -160 95 107 300 143 -80 -31 -2 -66 -130 -109 -345 -38 -282 57 -100
6715 -100 69 -10 193 30 286 208 -36 -414 -159 146 144 120 -310 -104 220 -23 -67 60 -575 66 179 16
6737 16 360 -226 -29 42 -15 -180 -232 -118 -287 70 174 33 -138 -74 -66 328 113 179 145 26 249 272 75
6760 75 -438 -239 -4 88 -10 169 -148 -190 -203 -189 278 -39 -247 -519 -209 290 -246 -189 -327 134 -77 29
6782 29 119 4 110 -261 120 -256 73 -224 229 176 324 302 80 -71 -38 7 -2 -176 -105 -349 179 295 259
6805 259 -61 15 -304 110 50 180 -46 -115 88 203 281 -203 -58 -61 40 24 -55 -113 -90 41 239 155 -198 -94
6829 -94 -105 178 283 -1 48 -167 -208 -107 226 55 57 -352 311 139 178 60 -194 -189 175 -55 -226 -24 -311
6852 -311 -464 46 178 237 -83 51 -176 -70 102 -29 231 -195 20 218 328 -87 -162 -228 -238 205 -33
6873 -33 -131 -143 232 308 -240 91 -226 -88 11 224 -270 -316 -110 48 372 70 44 -44 -130 -234 395 135 -392
6896 -392 -375 -283 98 187 -14 -13 139 -135 165 300 59 -14 -217 -8 218 -2 -110 -346 -69 -94 -235 86
6918 86 -87 -309 -102 124 -123 -17 -56 -349 -278 222 353 -223 -164 -200 98 -216 146 198 -429 79 -83 121
6940 121 -120 -227 -136 -190 -11 -133 -374 -156 -26 223 247 -21 -48 -140 -204 218 -60 -123 -122 85 21 91 27 -115
6964 -115 -535 185 -102 -43 4 2 -63 35 76 233 -394 -315 -131 -193 91 -65 -210 -205 -242 94 300 -77 -123 144
6988 144 337 356 47 -102 227 -94 168 305 246 -132 -273 133 409 122 128 -151 22 69 50 -7 74 -72 -80
7011 -80 211 -64 92 3 69 33 -42 -51 -98 18 -444 114 140 134 -252 -112 -127 286 -229 143 -77 409 266 -22
7035 -22 -100 63 5 265 158 -55 -114 -52 -268 -97 231 -13 -78 -104 162 -32 333 105 9 167 158 90 403 -27
7059 -27 -174 159 -135 87 185 -170 -74 136 261 247 181 -72 -206 -126 126 -49 -94 -73 -186 201 -164 173 -292
7082 -292 -220 67 172 137 -45 -155 -243 117 123 -13 63 -447 7 -125 2 -91 -234 -157 18 225 347 -116 63
7105 63 16 44 -48 18 -5 -31 188 -7 41 15 -194 -206 10 170 137 -305 53 58 43 -51 -132 168 -319 -196 209
7130 209 -65 -73 -365 200 66 -43 245 -15 -389 105 48 140 -102 -12 -46 293 70 218 133 -100 129 101 175
7153 175 -47 -208 -27 -101 -5 178 -85 159 -387 141 5 -172 -39 -364 -251 216 297 487 -164 -182 -64
7174 -64 -206 143 160 -277 51 123 -161 57 -15 -194 -124 224 209 85 -76 -149 202 421 103 39 -122 -129 96
7197 96 182 131 -8 227 -79 320 91 70 -73 -32 -2 364 -41 -72 284 -50 300 -58 137 -138 -132 -112 -186 -140
7221 -140 -216 -393 -332 -284 236 -130 -28 77 -228 -124 361 247 137 -234 -200 269 15 38 -153 -163 -134 186
7243 186 -237 -115 -453 -195 209 -207 156 140 -14 71 315 175 -5 59 81 137 67 416 -229 -225 299 183 136
7266 136 -174 -135 -358 32 232 113 -121 29 114 202 279 -92 -228 -27 179 3 -115 -145 -290 293 30 26
7288 26 -294 -273 -295 24 63 243 19 -68 -60 13 147 -27 -56 -284 206 91 201 -79 -68 -210 393 51 195
7311 195 68 -238 -186 20 207 132 -177 -304 120 182 348 -39 -291 -71 175 239 149 -36 -101 -227 59 169
7333 169 -68 -381 -145 -187 240 292 143 -4 -97 -46 34 81 -59 -619 -90 21 185 -79 6 103 -93 299 235
7356 235 143 -75 -25 33 110 133 -210 -235 -220 230 207 -4 38 -239 -233 195 205 193 -249 -199 -60 325 299 -265 -141
7381 -141 -247 -18 76 -218 -171 -13 305 219 192 -71 -413 -160 245 362 66 -356 76 -115 235 164 -18 -94
7403 -94 -290 -118 97 264 191 -159 -269 243 422 306 -152 -139 419 158 -300 -288 -333 -180 -55 57 27 -373
7425 -373 -362 -1 108 132 35 -135 158 385 147 -156 -145 -326 -102 257 463 202 -254 -18 81 126 246 -157
7447 -157 -518 -202 1 -129 -48 -230 -86 92 385 251 -122 -281 -116 -22 175 118 -185 -384 -214 369 200
7468 200 313 -232 -133 -51 355 315 -51 0 -237 182 114 85 -205 -363 -41 128 265 10 -166 -187 -93 341 164
7491 164 81 -512 -243 323 327 -145 -239 -99 -75 341 -80 130 -140 -208 -147 165 397 27 -60 172 162 540 -3
7514 -3 -181 -584 216 191 78 -7 -340 -443 -4 362 325 -100 -417 -131 -380 368 -39 -275 -233 -215 112 94 -285
7537 -285 -256 219 152 349 234 -97 13 -239 145 126 187 2 -102 70 -96 -136 145 -302 -164 87 209 -226
7559 -226 -318 -254 -96 355 -55 135 -114 -245 138 -34 -254 -172 -453 -192 -146 184 -184 -126 -200 207 123 259
7581 259 287 -149 -16 -85 294 -113 -268 -427 -45 -52 339 -69 -287 -296 307 308 -44 -56 -321 -252 31 147 21
7604 21 -210 -280 -293 372 346 -103 12 -27 193 110 50 -541 -195 -189 -68 308 -265 -411 -30 80 382 97 -235
7627 -235 10 -79 136 113 464 -234 -165 82 171 407 -139 -479 -237 -99 290 -127 -555 -300 97 -20 124
7648 124 -53 -279 200 -216 47 17 -122 -91 -298 221 265 98 -380 -149 71 -34 281 -224 -302 -263 -57 45
7670 45 425 -105 -89 -235 78 254 300 -156 -452 124 491 183 -46 -456 -331 54 312 -222 -233 86 -52
7691 -52 98 -17 -269 105 -294 -13 115 290 -75 -283 -6 -220 307 -294 -328 -285 -231 242 176 -89 -346 -251
7713 -251 183 186 56 138 -334 -185 240 223 -183 -400 -75 -99 186 267 -131 -334 -122 183 15 -114 -304 -164
7735 -164 -130 79 37 -86 -224 -348 24 18 415 120 -164 -260 -34 138 -255 -426 -183 94 327 179 -35 -165
7757 -165 -304 218 225 186 -115 -157 -25 138 508 62 62 -147 -28 224 -19 -192 -565 -437 63 221 63 -114
7779 -114 35 9 96 219 242 -232 -93 144 -30 118 -307 -141 -189 429 139 128 318 -176 -267 105 337 -55
7801 -55 -292 -385 265 329 331 10 -548 -119 149 -36 -129 205 -325 -115 74 374 82 -205 -24 -126 306 300 278
7824 278 -366 390 177 59 -93 -259 -242 200 337 -21 27 -159 -103 -89 184 82 -341 -420 153 457 -70 -53
7846 -53 -464 -304 367 180 145 -448 -609 131 -25 274 -3 -364 -70 -144 302 -7 89 -30 -182 230 403
7867 403 31 -112 -640 5 156 80 31 -562 -345 -67 364 59 -313 -80 36 60 410 -201 -79 -216 30
7888 30 479 562 355 -212 -390 205 275 248 -349 -447 -78 106 444 233 4 -109 98 41 321 68 -302 -79
7910 -79 115 13 30 -212 -269 -87 320 540 38 -294 133 190 358 230 -86 -66 167 11 68 -186 -365 -140
7932 -140 104 167 374 -84 -341 -83 217 200 365 -50 -417 -203 -83 273 -130 -242 -316 -179 193 -40 164
7953 164 -518 -185 -53 279 227 -619 -284 -20 95 8 -205 -367 -210 194 265 -25 -393 -190 -173 341 48
7974 48 -284 1 -116 -50 95 142 -30 -223 -91 134 269 187 94 -390 -116 126 315 -79 -256 337 -79 222
7996 222 166 -51 -252 -58 -18 539 -37 -565 14 -280 417 329 50 -354 -285 -110 424 203 153 -221 -82 332
8018 332 513 135 -60 -136 84 123 262 2 -374 53 -27 316 80 -229 -426 237 372 299 -133 -374 213
8039 213 323 98 181 -192 62 111 111 139 42 -291 -489 48 226 93 -187 -159 -141 124 -122 101 -155 -174 -356
8062 -356 255 73 -110 -106 -100 84 349 -44 -199 -113 -11 82 358 273 -398 -136 -197 241 191 -129 -132 -18 164 413
8086 413 272 -299 -195 -111 18 316 51 -104 -434 -176 193 69 295 49 106 -99 221 332 -49 -310 83
8107 83 565 214 -26 -370 -135 29 277 16 -139 -282 -130 262 78 -13 -472 -233 -65 99 482 213 -134
8128 -134 -11 102 166 372 105 -178 21 -180 170 -213 -418 -76 74 232 0 -66 -438 -220 155 157 -21
8149 -21 -81 -192 -134 42 318 -118 -193 -410 334 240 55 -21 -223 -62 -48 541 342 -172 -213 15 156 334 69
8172 69 -91 -84 348 269 282 -302 -394 -27 -153 65 -49 -361 -277 -22 277 319 -333 -210 75
8191G5
$$ Imaginary data points
##PAGE= N=2
##DATA TABLE= (X++(I..I)), XYDATA
0 0 0 0 0 0 0 0 0 -2 8 -8 8 -8 10 -16 16 -24 24 -32 35 -42 50 -58 67 -76 88 -102 116 -131 149 -167 188
31 188 -211 238 -265 296 -330 367 -407 451 -501 553 -614 678 -752 833 -925 1028 -1145 1279
49 1279 -1438 1624 -1846 2121 -2471 2927 -3555 4482 -5985 8852 -16296 77574 154105 -4839
63 -4839 -73056 -29045 58122 40095 -31232 -85635 -73822 -36824 20126 59357 50472 -6042 -25895
76 -25895 24048 84221 59710 -30937 -96518 -74137 -4317 37313 12922 -41004 -52485 13976
88 13976 92634 93024 10861 -53563 -36987 13539 19307 -17192 -46593 -49246 -33946 7041 61849
101 61849 72721 10400 -51920 -20879 66611 76314 -23701 -110787 -77618 21796 60941 13035
113 13035 -40244 -32599 18228 59447 59351 18089 -35924 -55098 -19942 28603 29639 -23496 -66779
126 -66779 -41005 34004 78878 45607 -27791 -55074 -3708 59156 49068 -28509 -79359 -44004
138 -44004 26777 47802 8889 -27044 -21412 5941 27395 34386 21189 -15853 -47676 -29762
150 -29762 26925 49916 -135 -61596 -50253 25617 69839 31054 -36143 -48751 -532 44207
162 44207 36583 -6915 -38714 -33506 -1064 29156 28783 -4188 -38917 -34151 14413 55989 37794
175 37794 -24761 -57216 -16376 48912 53706 -11445 -66577 -43949 24159 53181 14723 -33895
187 -33895 -34361 5551 36881 33686 5877 -22130 -32032 -14192 18749 29964 -2562 -45578 -40339
200 -40339 17175 60343 35811 -24828 -44523 -1651 43455 32436 -18563 -49151 -31145 6081
212 6081 25613 16691 -3899 -16650 -9767 17547 40129 28088 -17348 -50298 -30065 21306 38011
225 38011 -3339 -50711 -37923 24836 63179 33455 -22055 -37119 -2450 29685 21162 -14471
237 -14471 -38187 -32258 -5333 23051 31012 10465 -19205 -20582 16194 47850 27393 -30318 -58428
250 -58428 -22930 28982 32343 -11499 -41743 -17657 29757 45987 21050 -12092 -22742 -10192
262 -10192 6878 12523 1028 -22779 -34699 -14880 25567 43884 16072 -25016 -27018 14269
274 14269 44162 19624 -33249 -51288 -16796 25037 26980 -4465 -24682 -11845 16254 31636
286 31636 23016 -1157 -23896 -26301 -3787 21788 16276 -19567 -41498 -14418 36387 48496 7780
299 7780 -34670 -25125 18005 36457 7404 -31549 -36033 -8603 16952 20143 5695 -9793 -13782
312 -13782 432 23296 28704 3699 -30445 -34199 -104 30674 17986 -21956 -37475 -6009
324 -6009 35161 37059 1027 -28226 -19194 10808 23084 6577 -17003 -24450 -12851 7494 21897
337 21897 17701 -5001 -23285 -11217 22228 35209 3625 -36453 -34745 7366 35077 14871
349 14871 -24037 -30295 39 28316 24239 540 -17072 -15811 -1070 13887 14839 -2283 -23571
362 -23571 -23436 3894 30220 22372 -11647 -30536 -9234 27006 31350 -2071 -33632 -25567 9529
375 9529 27515 10661 -16580 -21068 -3290 16068 19492 7703 -9162 -19230 -10375 12563 23245
388 23245 3627 -26578 -28404 5244 34357 21517 -17151 -31107 -4358 26679 24319 -5305
400 -5305 -25385 -16677 5187 16828 10304 -4588 -15535 -12332 5885 22770 17631 -8513 -27334
413 -27334 -13802 18511 28285 107 -30060 -24585 10333 30761 14175 -15223 -22651 -2372 17756
426 17756 17666 343 -15083 -17055 -3874 12100 16973 2979 -17736 -19739 3613 27667 20737
439 20737 -12031 -30534 -11309 22063 25967 -3870 -28141 -18243 10693 22680 9833 -9158
451 -9158 -14361 -5331 7607 14818 9308 -7782 -22048 -12646 13499 25315 4440 -24104 -22739
464 -22739 8161 29910 15744 -15508 -25682 -5437 18117 18001 -2227 -18262 -14075 2510 15046
477 15046 13227 -776 -13982 -13271 2702 19252 15841 -8650 -26079 -13364 17193 26509 1525
490 1525 -25357 -19711 10495 26339 10801 -13735 -17963 -3224 10751 12095 2678 -9319 -15053
503 -15053 -7255 10883 20143 6061 -17149 -19897 3742 25149 16198 -13724 -27263 -8772 17679
516 17679 20184 -1792 -19701 -13617 7060 18329 10994 -4680 -13816 -9348 3325 13588 9572
529 9572 -7583 -20881 -11508 13437 25102 6635 -20121 -19812 7400 26131 11913 -15768 -23578
542 -23578 -4873 14272 13578 -781 -10940 -9367 1067 12294 14423 3284 -13578 -17324 -687
555 -687 17496 13335 -10560 -24107 -8579 17930 23261 2503 -17858 -13767 7116 18102 7461
568 7461 -10877 -17349 -7998 5861 11846 6811 -4256 -11949 -5803 11192 19778 5791 -17981 -22603
582 -22603 -463 21033 13634 -13061 -23429 -4320 19865 20338 186 -14102 -9887 2765 10597
595 10597 6735 -4087 -13788 -12758 1332 16062 14420 -4222 -16960 -6671 15223 20380 948
608 948 -21074 -19150 3237 17687 8426 -10735 -15329 -1442 13450 14458 3248 -7322 -10351
621 -10351 -4812 4984 10187 2000 -13094 -17045 -414 20269 17541 -5493 -19937 -7262 15628
634 15628 18000 -1650 -19292 -15104 3100 13315 7942 -4264 -10315 -5758 6053 13824 9772
647 9772 -5387 -16732 -10327 8266 16387 2731 -17387 -17508 4806 22239 13313 -9841 -18206
660 -18206 -3135 13780 12098 -3293 -13137 -9824 273 7937 9137 1902 -8273 -10347 1939
673 1939 15094 12256 -6286 -18801 -9252 10836 16240 1004 -15824 -13221 4165 16478 10055
686 10055 -5848 -12775 -4682 7326 10166 3078 -6615 -10873 -6469 5859 13889 6544 -11146 -16829
700 -16829 175 19932 15187 -9428 -21759 -5789 15138 15100 -3021 -14735 -9199 3635 10541
713 10541 7687 -1043 -9732 -8567 2835 13359 8732 -6836 -15601 -6094 9486 14165 1585 -13528
727 -13528 -12845 3085 16483 10990 -6559 -15178 -4202 10717 10456 -1482 -9880 -7928 -1115 4879
741 4879 8229 4983 -5338 -12236 -2049 14628 15322 -5413 -20406 -9799 11853 15749 -1302
754 -1302 -14549 -9464 5255 13013 8290 -1988 -9163 -7477 2819 10287 5633 -7517 -14379 -5805
768 -5805 9258 14296 4015 -10249 -11527 2312 15883 10964 -8025 -18711 -7413 11160 12447
781 12447 -2029 -12307 -6256 5718 9731 6006 294 -5468 -8028 -2782 7895 9159 -4030 -15897
795 -15897 -8584 10887 17151 3274 -11918 -10137 4550 12824 6022 -6376 -12076 -6843 3566
808 3566 8427 4721 -4188 -8805 -2414 8469 12778 3862 -9743 -13402 -1928 11535 10031 -6072
822 -6072 -16738 -7419 12111 16548 2541 -12103 -9115 4631 10746 4160 -5658 -9418 -6206 478
836 478 7439 7356 -1274 -9763 -5660 8661 14725 3621 -12643 -13275 1392 12405 6322 -7467 -12355
851 -12355 -3187 8528 10319 3135 -5718 -6550 -1216 5204 6650 521 -8071 -10412 -1926 9603 10648
866 10648 -1592 -11908 -6839 8644 15520 3290 -12566 -12730 1318 11256 5564 -5735 -9733
879 -9733 -3594 5107 8607 5021 -2192 -8314 -5319 4676 11183 3146 -11079 -13477 93 13106
893 13106 9527 -5641 -12529 -3189 10346 11226 340 -9191 -8227 364 6782 4786 -1782 -6398 -5884
908 -5884 1378 8433 8641 -877 -9749 -6974 5701 11896 2975 -11206 -12807 1052 11930 7859
922 7859 -4803 -9665 -2635 7052 8446 1769 -4777 -7102 -3950 3344 7516 3071 -7061 -10210 -319
937 -319 12242 10838 -3305 -12518 -5737 7973 11473 398 -10662 -9318 1604 8921 6150 -2285
951 -2285 -6640 -3465 3351 7582 5067 -2634 -8932 -5891 3565 9381 3535 -8058 -10695 301 12328
966 12328 9659 -4085 -11434 -4036 7327 8629 -115 -7281 -6249 -497 4864 6055 2082 -4426
980 -4426 -6845 -972 8472 8759 -2088 -11726 -7689 5788 11583 2293 -9787 -8990 2023 10529 6471
995 6471 -3120 -7955 -3753 3873 6567 2881 -4168 -7200 -3581 4032 8107 3365 -5513 -8710 -709
1010 -709 9433 8741 -2672 -11636 -6119 6750 10214 1053 -8772 -7181 1975 6859 4503 -1105 -4179
1025 -4179 -4150 54 5276 6012 -915 -8869 -7062 4223 11229 3620 -8281 -9812 1427 10505 6740
1040 6740 -4226 -8977 -3742 4619 6735 1680 -4594 -6050 -1585 4590 6827 2137 -4977 -6717 -849
1055 -849 7419 7502 -1858 -10112 -6844 4746 10413 2936 -8064 -8491 1984 8731 5127 -2941 -6299
1070 -6299 -3438 1789 4653 3512 -1297 -6699 -5005 3206 9519 4719 -5993 -9282 -248 9470 7747
1085 7747 -3934 -10407 -4591 5335 8006 1548 -5856 -5677 261 5444 5410 493 -5296 -5911 -898 5669
1101 5669 6039 -1566 -8420 -5383 4436 10322 3692 -7112 -8714 258 8651 5700 -3769 -7743 -3274
1116 -3274 3895 5722 2353 -2701 -4605 -2498 2898 5999 3015 -4831 -8447 -2525 7131 7801 -1553
1131 -1553 -9398 -5135 5560 9552 2276 -7170 -7098 559 6023 4248 -1416 -4998 -3917 710 5612
1146 5612 5540 -651 -6573 -5080 3199 8062 2842 -6424 -9001 -205 8067 6765 -2603 -7912 -3229
1161 -3229 5059 7527 1007 -4912 -5367 -1321 2825 4178 1046 -3577 -5178 -851 5636 7067 -167
1176 -167 -8195 -6319 3727 8560 2140 -7009 -7550 783 7154 5252 -1762 -5179 -2807 1876 4507
1191 4507 2779 -1837 -5604 -4279 1887 6588 3834 -4313 -7411 -721 7428 7225 -1878 -8892 -5269
1206 -5269 3739 7376 1411 -5868 -5785 470 5295 4484 189 -3667 -3883 -766 4095 4615 -765 -6601
1222 -6601 -5992 2792 8589 3887 -5591 -7642 280 7631 5569 -2731 -7284 -3442 3232 4721 1601
1237 1601 -2812 -3895 -2044 2861 5659 2949 -3409 -6402 -1704 5381 6025 -1085 -7826 -5240 4056
1252 4056 8182 2913 -5207 -6077 515 6229 4120 -1871 -5614 -3411 1172 4104 3317 -307 -4906
1267 -4906 -4131 2117 6880 4070 -4276 -8085 -1480 7215 6400 -2627 -7808 -3319 3758 6270 1450
1282 1450 -3730 -4078 -684 3169 4013 1175 -3871 -5332 -1360 4571 5202 -66 -6254 -4668 2856 7896
1298 7896 3489 -5132 -7209 -737 6182 4943 -2008 -6474 -2775 2245 4411 1858 -1501 -3490 -2483
1313 -2483 1758 4846 3253 -3431 -6773 -2241 5890 6500 -1130 -7405 -4217 4045 6965 1793 -4406
1328 -4406 -5103 -290 4174 3718 -304 -3552 -3694 -104 3945 4269 -507 -5103 -3953 1563 6362 3500
1344 3500 -4072 -7452 -1476 6021 5929 -1999 -6457 -3283 3373 5216 1409 -2630 -3381 -1296 2281 3666
1360 3666 2076 -2671 -5641 -1732 4450 5902 -511 -6486 -4499 3147 6973 2618 -4460 -5952 -570
1375 -570 5064 4175 -1506 -4505 -2709 1602 4023 2770 -737 -3333 -3177 1022 4584 3285 -3037 -6741
1391 -6741 -2155 5331 6265 -892 -6700 -3614 3773 6081 1549 -3465 -4305 -857 2336 2984 554 -2816
1407 -2816 -4264 -693 4078 4956 104 -5185 -4491 1758 6133 2652 -4491 -6592 -1056 5666 5190 -1289
1423 -1289 -5109 -2453 2991 4471 1254 -2043 -3059 -2218 985 3318 2344 -2102 -5016 -1467 5036
1438 5036 5987 2 -5953 -4198 2792 5467 1549 -4702 -4635 -546 3749 4012 70 -3152 -2982 428
1454 428 3223 3494 -433 -4517 -4039 1175 4960 3037 -2971 -5711 -1368 5497 5932 -726 -6253 -3736
1470 -3736 2830 5209 1005 -3500 -3658 -511 2371 3631 1704 -1830 -3780 -1486 3539 4790 -198
1485 -198 -5546 -4343 2201 5864 2536 -3736 -4706 -173 4615 3802 -988 -3892 -2746 841 2951 1941
1501 1941 -1351 -2909 -2584 1124 4369 3115 -1703 -5004 -2525 3937 5271 -202 -5555 -4204 2168
1516 2168 5978 2040 -3343 -3890 -191 3189 2803 -44 -2595 -3189 -955 2928 3833 358 -4169 -3666
1532 -3666 1608 5459 3270 -3230 -5433 -1082 4532 4198 -1011 -4843 -2645 2220 4029 1781 -1653
1547 -1653 -2842 -1204 1078 2894 1802 -1740 -4040 -1861 3058 4735 691 -4703 -4523 1700 5543
1562 5543 2469 -3656 -5011 -482 3863 3447 -359 -3216 -2488 240 2443 2739 -101 -3343 -3274 633
1578 633 4475 3439 -2332 -4938 -1190 4337 4866 -548 -4881 -3425 1978 4696 1668 -2793 -3769 -573
1594 -573 2301 2989 1033 -1777 -3001 -1058 2316 3526 862 -4039 -3792 911 5196 3100 -2998 -4861
1610 -4861 -838 4186 3688 -1053 -3986 -2735 778 2741 1698 -859 -2824 -2044 779 3790 2625
1625 2625 -1548 -4682 -1973 3227 4286 -6 -4585 -3542 1654 4735 2425 -2586 -3842 -443 2715
1640 2715 3001 -96 -2720 -2594 -358 2370 2771 500 -2572 -3160 638 4138 3642 -1921 -5125 -1870
1656 -1870 3459 4285 -251 -4361 -2961 2176 3789 1776 -1813 -2914 -1393 1177 2400 1561 -1736
1671 -1736 -3882 -2006 2548 4187 496 -3895 -3367 1295 4824 2354 -2813 -4138 -984 2822 3086
1686 3086 -143 -2885 -2360 530 2611 2085 -510 -2087 -2370 418 2665 2195 -1238 -3925 -1913 2992
1702 2992 4690 333 -4185 -3415 1479 4227 1464 -2384 -2907 -444 1825 2038 889 -1299 -2069 -1319
1718 -1319 1789 3282 585 -3219 -3554 576 4134 2466 -1936 -4224 -1293 2770 3544 84 -3236
1733 -3236 -2888 675 2791 1968 -1197 -2415 -1611 906 2479 1415 -886 -2950 -1945 1991 3604 859
1749 859 -3715 -3550 1057 4161 2274 -2198 -3555 -461 2761 2574 93 -1848 -1889 -341 1576 2287
1765 2287 431 -2032 -2751 163 3344 2814 -1373 -3949 -1827 2288 3401 335 -3515 -3061 1077 3371
1781 3371 1790 -1093 -2380 -1097 848 2016 962 -1161 -2907 -1506 1704 3222 989 -2684 -3197
1796 -3197 402 4005 2521 -2247 -4171 -1236 2473 2637 -364 -2617 -1313 848 2077 1878 -338
1811 -338 -1821 -1881 39 2175 1918 -1176 -3679 -1901 2199 3818 942 -3066 -2588 672 3419 1740
1827 1740 -1531 -2667 -885 1580 2258 773 -877 -1725 -705 1658 2784 686 -2467 -3136 -533 3097
1843 3097 2508 -1101 -3961 -1665 2834 3716 691 -2824 -2373 668 2484 1207 -1175 -2187 -1306 686
1859 686 2271 1541 -594 -2557 -1352 1855 3043 224 -2571 -3118 467 3314 1923 -1552 -3241 -389
1875 -389 2426 2507 119 -1623 -1597 -292 1095 1657 260 -1558 -2079 16 2515 2881 -171 -3437 -1660
1892 -1660 1798 3484 542 -2967 -2717 613 2869 1684 -1150 -2223 -1004 1081 1738 789 -1341 -2327
1908 -2327 -1464 1173 2833 1052 -2405 -2986 56 3155 2390 -1288 -3679 -1410 1685 2605 18 -2429
1924 -2429 -1836 792 2092 1200 -26 -1496 -1502 14 1548 1338 -588 -2128 -1665 1508 2859 1151 -2211
1941 -2211 -2419 319 2827 1497 -1589 -2792 -1411 1506 1987 552 -980 -1553 -410 1053 2182 725
1957 725 -1515 -2867 -590 2177 1970 -685 -2997 -1340 2030 3278 669 -2050 -2675 319 2009 1185
1973 1185 -991 -1786 -1144 667 1727 1631 -528 -1511 -969 1220 2474 1080 -1920 -3142 -144 2540
1989 2540 1978 -1135 -2630 -721 2004 2368 77 -1816 -1746 -357 945 982 21 -1276 -1563 -193 2065
2006 2065 2453 23 -2298 -1914 1442 2845 344 -2264 -2537 155 2299 1710 -444 -2240 -1054 777
2022 777 1847 507 -957 -1714 -840 730 1806 922 -1410 -2279 -203 2319 2330 -495 -2865 -1377 1893
2039 1893 2719 95 -1895 -2035 501 1885 1245 -334 -974 -1283 -44 1255 1193 27 -1762 -1668 830
2056 830 2541 957 -1767 -2073 -339 2137 1733 -851 -2191 -1396 1065 1771 555 -1168 -1274 -239
2072 -239 985 1358 573 -1068 -1698 -779 1359 1861 -203 -2333 -1844 1480 2827 709 -1965 -1938 258
2089 258 1918 1171 -855 -1452 -716 576 1685 1240 -229 -1263 -701 529 1965 558 -1713 -2171 -388
2106 -388 1752 2182 -320 -2356 -877 1336 2316 176 -1482 -1869 30 988 854 -82 -713 -1124 -1
2123 -1 1250 1515 -91 -2160 -1854 385 2066 521 -1669 -2318 158 2102 1838 -388 -1689 -543 777
2140 777 1411 136 -968 -1340 -1024 521 1298 737 -736 -1599 -448 1423 1983 -26 -2075 -1839 1189
2157 1189 2055 449 -1429 -1600 -102 1444 1270 -363 -1128 -913 -315 1013 1081 -343 -1382 -1206 510
2174 510 2206 1170 -980 -2031 -296 1630 1430 -454 -1682 -1146 780 1472 130 -1041 -1054 -347 922
2191 922 1134 463 -1007 -1323 -341 1427 1348 97 -1903 -1437 492 2109 1030 -1492 -1810 228 1681
2208 1681 1606 -678 -1272 -769 -185 1006 865 -340 -951 -597 610 1412 863 -1015 -1785 -406 1448 1389
2226 1389 -120 -2112 -969 1049 1497 573 -949 -1429 -71 1321 1143 -1 -796 -1008 -281 1010 954
2243 954 324 -1208 -1397 32 1985 662 -1429 -1736 -208 1569 1572 -539 -1721 -1035 578 1140 247
2260 247 -512 -819 -500 589 1388 584 -331 -1485 -476 937 1525 104 -1724 -1198 543 1884 468
2277 468 -1222 -1502 -44 1276 985 121 -1440 -716 231 628 1067 217 -1014 -976 520 1457 838 -973
2295 -973 -1705 -312 1016 1405 -172 -1593 -1292 619 1654 464 -909 -1049 -513 977 1135 404 -586
2312 -586 -1188 -491 893 871 183 -1196 -1023 739 1779 897 -1047 -1519 -271 1183 1194 -437 -1300 -767
2330 -767 197 1060 336 -101 -644 -671 352 1026 742 -439 -1528 -413 1207 1479 129 -1376 -1043 584
2348 584 1512 608 -801 -1307 -311 1078 733 -298 -723 -1064 166 594 626 246 -1183 -1109 280 1705
2366 1705 1014 -815 -1531 -335 1165 1170 -225 -1414 -1004 583 1082 660 -573 -784 -465 378 939 495
2384 495 -271 -1075 -424 716 1206 259 -1019 -1314 524 1700 868 -1097 -1444 -196 922 1048 16
2401 16 -967 -521 416 347 606 20 -659 -763 24 1294 795 -750 -1296 -605 1204 991 -113 -1178 -1262
2420 -1262 84 1169 761 -661 -936 -280 555 686 522 -326 -670 33 376 993 -52 -944 -1098 84
2438 84 1579 1181 -650 -1268 -449 630 796 375 -1305 -813 574 962 650 -187 -749 -643 394 709
2456 709 468 -324 -938 -956 369 1128 378 -1242 -759 219 1269 469 -594 -848 -434 621 595 -71 -563
2475 -563 -380 -205 549 541 318 -784 -768 39 757 940 -343 -1538 -489 875 1175 399 -573 -1019 242
2494 242 1198 559 -504 -827 -331 371 785 257 -356 -1084 -202 447 958 299 -893 -1393 -73 1138 648
2513 648 -746 -1184 -458 595 850 -44 -719 -367 -88 616 478 291 -465 -494 -16 825 295 13 -857 -585
2533 -585 810 1119 235 -614 -774 112 1217 412 -194 -895 -483 749 838 291 -480 -674 -363 213 873
2552 873 297 -453 -866 -285 652 646 -1 -1035 -571 558 954 -36 -932 -907 57 278 71 -133 -495 -360
2572 -360 203 583 634 60 -659 -554 102 666 170 -824 -1314 -263 1056 721 -136 -898 -248 620 574 132
2592 132 -405 -404 -178 520 497 286 -410 -632 0 738 1169 -191 -973 -537 -119 1087 460 -971 -955 281
2612 281 1059 576 -29 -646 -294 41 370 510 -367 -715 -550 261 592 169 -672 -713 -11 507 371 7
2632 7 -912 -630 234 876 388 -515 -536 -130 332 567 55 -382 -263 80 353 472 -94 -622 -663 127 1244
2653 1244 726 -667 -783 -197 452 659 -75 -334 -429 253 788 -11 -201 -297 -417 342 251 441 -621 -785
2673 -785 -129 400 837 -47 -705 -735 268 927 491 -788 -862 -163 441 572 -149 -522 -403 304 536 434
2693 434 -350 -764 -525 516 825 612 -122 -539 -109 391 706 -77 -847 -413 360 543 230 -258 -379 -346
2713 -346 120 393 456 11 -696 -219 291 813 15 -502 -660 70 834 231 -290 -974 -11 643 505 -34
2733 -34 -653 -517 -43 92 102 -187 -463 -233 144 647 460 -177 -537 -287 523 691 19 -715 -502 67 1244
2754 1244 25 -508 -650 -60 11 683 252 -421 -602 44 373 612 295 -332 -914 -71 917 474 -84 -775
2774 -775 -366 300 372 -215 -626 -672 301 268 716 8 -298 -402 50 255 398 -157 -353 -86 351 850 101
2795 101 -754 -406 83 496 589 -186 -518 -134 629 464 -223 -421 -414 -30 660 458 77 -601 -372 -22 294
2816 294 456 132 -592 -431 396 842 137 -869 -385 425 416 277 168 -438 -42 248 405 99 -332 -515
2836 -515 15 231 229 19 -262 -546 115 965 424 107 -770 -367 356 222 114 -437 -481 728 386 461 -7
2857 -7 -212 -430 -208 129 269 379 -449 -492 233 861 314 -614 -619 132 688 397 143 -717 -186 448 451 123
2879 123 -514 -656 -403 581 617 64 -252 -383 -229 500 683 -155 -565 -733 132 622 290 -675 -503 -80
2899 -80 221 483 -146 -319 -252 101 442 665 182 -288 -600 178 854 260 -503 -1119 -236 570 360 -331 -514
2920 -514 -273 501 902 -34 85 -532 -60 293 370 297 -669 -461 -197 460 604 -63 -712 -413 243 1044 218
2941 218 -518 -839 -51 619 440 48 -559 175 44 317 429 16 -318 -293 119 408 370 -276 -871 -162 377
2962 377 560 -100 -600 -728 465 659 161 -594 -465 -143 283 471 187 -129 -414 -204 114 583 -279 -595
2982 -595 -801 212 457 562 -220 -626 -111 689 288 145 -604 -433 294 405 270 105 -247 -265 57 317
3002 317 109 -211 -308 -244 413 541 -88 -449 -869 176 914 572 -460 -965 -129 508 499 -389 -578 -453 -75
3023 -75 341 150 -82 -440 -758 -129 662 764 -105 -567 -697 595 684 104 -330 -287 114 648 262 -593 -509
3044 -509 -38 303 262 -45 12 -869 77 648 504 -152 -337 -727 -95 994 385 -445 -1014 35 268 628
3064 628 -137 -494 -300 319 476 77 -40 -360 27 273 577 488 -79 -567 -381 473 674 204 -584 -659 -68
3085 -68 964 376 -219 -748 -46 442 462 274 -454 -565 -154 586 278 176 -344 -635 83 535 819 -71
3105 -71 -358 -283 352 519 150 -152 -376 -5 382 651 -316 -978 -153 61 302 428 -306 -318 -292 69 538
3126 538 387 -695 -971 -186 617 533 -200 -628 -507 494 588 52 -833 -601 40 386 493 42 -381 -658
3146 -658 230 766 678 -92 -736 -279 469 726 146 -280 -654 31 831 78 -72 -487 -204 236 629 103
3166 103 -232 -218 -187 155 374 253 -581 -656 264 892 732 -441 -777 -824 524 846 -23 -750 -755 12 543
3187 543 413 -344 -471 -181 -41 384 226 -364 -494 -340 325 978 263 -523 -753 -174 867 912 -258 -765
3207 -765 -397 628 750 289 -427 -442 -75 151 563 285 -701 -562 42 603 600 -209 -767 -528 630 877
3227 877 281 -634 -847 46 677 499 -281 -51 -240 87 479 324 -310 -389 -216 436 706 304 -281 -610
3247 -610 -229 1102 832 -340 -938 -361 529 854 477 -432 -773 -447 546 266 25 -661 -261 -48 484
3266 484 410 -249 -646 -517 442 733 418 -920 -334 -55 241 556 41 -640 -514 382 394 343 -169 -635 29
3287 29 492 545 197 -642 -476 -251 997 665 -138 -673 -453 296 952 575 -303 -343 16 149 717 -228 -484
3308 -484 -407 -5 607 534 -326 -775 -742 107 790 389 -604 -848 -346 758 644 -442 -673 -373 235 661
3328 661 199 -473 -702 60 493 403 366 -358 -683 -195 399 526 -279 -664 -139 126 827 622 -313 -918 126
3349 126 588 451 -170 -687 -146 321 756 435 -44 -624 -415 5 764 107 -315 -748 -76 845 884 190
3369 190 -556 -340 229 411 117 -193 -982 -148 352 183 168 -246 -455 73 386 526 -67 -655 -339 -26
3389 -26 773 495 -724 -787 -409 605 846 -22 -803 -466 64 593 193 -232 -629 125 327 737 467 -87
3409 -87 -545 -203 445 664 82 -636 -418 222 741 652 -881 -946 -211 350 622 100 -517 88 222 397 628
3430 628 -184 -658 -679 225 368 411 -212 -756 -253 691 653 120 -1067 -519 270 846 259 -134 -692 -356 322
3451 322 440 206 -706 -792 -588 488 476 191 -329 -447 269 803 688 -514 -852 105 447 685 -179 -902
3471 -902 -569 155 808 394 -309 -303 -488 438 546 509 -270 -333 -344 606 531 117 -917 -495 379 497 580 -240
3493 -240 -622 -353 581 555 -131 -405 -120 -167 231 608 0 -368 -439 -150 533 334 -396 -967 -188 396 819
3514 819 129 -651 -1129 149 449 -101 -468 -302 -377 241 545 371 -127 -139 -399 480 845 116 -430 -585
3534 -585 201 962 431 -675 -879 4 473 766 -122 -566 -699 231 1057 522 -30 -554 -398 96 594 422
3554 422 -411 -737 -328 632 625 -177 -978 -802 299 664 493 -105 -978 -90 101 465 298 -377 -407 -100 613
3575 613 620 243 -280 -516 75 1003 769 -432 -878 -262 214 1009 223 -598 -531 171 701 473 -528 -581 -438
3596 -438 255 486 421 -129 -799 -218 445 871 33 -492 -643 -156 960 288 -165 -684 -215 484 711 99
3616 99 -201 -306 -186 577 363 139 -466 -615 138 947 423 -382 -602 -366 463 738 -209 -723 -477 133
3636 133 568 691 -668 -794 -296 399 402 589 -334 -576 -62 239 629 442 -451 -969 -215 804 462 -319
3656 -319 -1000 -181 559 704 89 -443 -137 17 542 303 -156 -698 -485 341 1036 372 -547 -525 -630 271
3676 271 799 193 -676 -622 162 498 540 -321 -611 -428 335 684 49 -187 -423 -239 577 578 -84 -664 -276
3697 -276 -287 564 267 -621 -1043 -240 618 953 -186 -730 -130 -107 381 455 -306 -738 -452 403 570 72 -17
3718 -17 -405 -565 153 780 -69 -619 -824 -147 863 550 -359 -757 -317 155 591 -435 -430 -312 -185 106
3738 106 544 112 -529 -651 53 797 555 -192 -715 -135 643 896 142 -524 -803 -94 798 318 -17 -568
3758 -568 -355 326 696 331 -418 -461 -202 450 472 81 -480 -556 1 563 476 -670 -593 -357 456 509 -112 -736
3780 -736 -218 -174 361 301 -195 -561 -113 303 648 276 28 -779 -563 466 555 11 -620 -843 6 827 195
3801 195 -332 -591 31 506 580 257 -309 -215 -238 369 482 180 -345 -429 279 723 408 -175 -593 -331 345
3822 345 586 50 -688 -580 183 875 416 -205 -650 -210 5 979 216 11 -833 -429 478 661 321 -554
3842 -554 -714 244 843 671 -399 -894 -515 462 751 89 -434 -810 -44 394 759 -31 -362 -352 -11 677
3862 677 591 -162 -663 -84 158 689 563 -785 -548 -13 832 292 -199 -998 -234 299 241 129 -189 -1060
3882 -1060 19 447 587 213 -131 -411 -2 828 462 -185 -787 -234 201 1039 278 -360 -594 -222 351
3901 351 470 -180 -575 -361 368 820 550 -265 -962 -271 530 867 282 -610 -1037 149 824 581 -369 -760
3921 -760 -632 471 792 114 -214 -390 -176 324 151 91 -228 -499 -194 432 585 -444 -798 -484 546
3940 546 899 124 -629 -739 -60 227 291 -204 -973 -382 -8 682 302 -354 -395 -164 240 911 361 -516 -702
3961 -702 -203 924 493 -384 -544 -350 441 572 213 -470 -781 147 485 515 -49 -515 -724 -33 702 613
3981 613 -109 -557 -552 326 709 222 -394 -746 -206 727 626 -93 -713 -298 295 631 176 250 -516 -385 131
4002 131 661 124 -401 -352 141 921 771 218 -581 -516 545 818 143 -647 -610 64 408 691 -143 -459 -143
4023 -143 282 359 426 358 -522 -534 235 953 579 -486 -710 -263 682 504 -222 -154 -611 272 344 199 -391 -142
4045 -142 110 307 235 -16 -291 -449 -63 255 699 135 -505 -684 285 792 417 -549 -931 -327 671 301
4065 301 268 -422 -560 207 699 514 -292 -601 -277 299 381 445 -508 -757 -160 649 393 -115 -1065 -710 -85
4086 -85 472 374 -749 -875 -171 598 472 176 -280 -213 104 532 216 4 -708 -223 155 1054 605 -557
4106 -557 -774 -19 609 426 -120 -710 -244 213 477 286 -489 -499 -65 401 896 305 -566 -441 -203 318
4126 318 893 -164 -517 -529 365 764 195 -269 -500 -306 589 346 153 -350 -571 441 580 557 -1 -782
4146 -782 -474 290 583 481 -522 -728 -17 395 930 -114 -467 -540 223 498 187 -441 -647 131 492 644
4166 644 -255 -695 -412 31 378 515 -272 -678 -676 365 696 345 -675 -605 -227 501 665 -254 -698 -295
4186 -295 162 452 540 -214 -574 -264 425 715 546 -190 -553 -175 647 430 131 -606 -584 363 836 339 -423
4207 -423 -557 -309 610 449 -2 -250 -179 265 458 687 -228 -456 -436 112 829 621 -384 -530 -369 504
4227 504 640 -83 -655 -532 124 876 -162 -102 -560 -179 200 457 265 -187 -529 -128 535 279 -25 -352
4247 -352 -542 155 878 410 -471 -694 -307 273 368 -163 -284 -637 -267 327 282 -414 -446 -396 -87 340 397 -396
4269 -396 -671 -298 772 804 182 -851 -625 -53 928 389 -258 -633 -62 468 300 308 -201 -213 -139 403 310
4290 310 -244 -495 -775 -220 575 407 -451 -610 -96 622 849 -37 -317 -274 139 705 812 8 -484 -374
4310 -374 34 452 132 -164 -541 -196 402 480 -3 -532 -598 -122 680 184 -357 -572 -290 566 409 -235 -165
4331 -165 -324 157 419 474 -230 -219 -371 -74 660 375 -92 -385 -333 610 779 378 -704 -207 80 408 246
4352 246 -532 -766 -173 339 473 278 -450 -326 20 135 547 341 -762 -862 -47 302 250 -356 -566 -75
4372 -75 644 935 -381 -897 -462 -44 467 262 -132 -781 -482 145 560 415 -453 -685 -340 367 697 191
4392 191 -457 -559 358 494 244 -383 -616 -442 610 256 -26 -406 -306 5 444 608 -287 -618 -614 277
4412 277 709 462 -312 -811 -622 325 521 22 -636 -615 267 603 758 8 -329 -150 410 93 492 -420
4432 -420 -640 -243 364 357 145 -650 -460 40 459 256 -348 -513 -128 408 719 30 -263 -433 -60 353 207
4453 207 -578 -311 -550 62 549 344 -7 -906 -257 527 814 233 -436 -415 124 752 542 -219 -702 -150
4473 -150 318 389 68 -289 -506 -163 407 740 -222 -530 -377 -7 721 298 -259 -891 -228 385 658 2
4493 2 -684 -309 54 629 283 -29 -478 -380 111 340 -221 -223 -564 -28 105 567 -4 -371 -499 68 537 386
4515 386 -319 -670 -55 -16 236 35 -402 -570 218 315 650 185 -514 -501 -122 460 192 -445 -572 -277 358
4536 358 507 133 -556 -507 44 609 518 -49 -713 -426 103 579 101 2 -496 -298 269 565 258 -271 -254
4557 -254 -137 619 560 -454 -615 -93 369 569 -8 -423 -746 -6 558 136 -218 -147 -248 87 335 585
4577 585 -387 -541 -487 228 357 -41 -663 -642 259 886 385 -157 -683 45 373 670 60 -379 -493 -102 523
4598 523 288 72 -490 -159 -370 649 367 -561 -657 -17 535 421 62 -342 -615 131 427 288 145 -409
4618 -409 -224 256 581 -132 -85 -554 -514 507 615 283 -689 -586 174 357 539 -141 -497 -74 672 507
4638 507 -54 -320 -413 -131 221 120 -170 -470 -547 -157 329 800 -129 -735 -81 292 372 97 -586 -518 14
4659 14 611 171 -70 -291 -116 607 518 112 -184 -485 -151 310 595 170 -254 -512 -24 654 697 -283 -779
4680 -779 -256 189 847 -212 -753 -348 39 773 525 -97 -132 -27 436 781 317 31 -900 -581 202 488
4700 488 54 -298 -559 -157 770 388 -400 -794 -157 582 498 60 -469 -873 316 628 249 164 -189 -783
4720 -783 235 653 262 -291 -557 -482 525 909 -84 -538 -298 118 354 401 -88 -271 -7 -81 527 299
4740 299 -334 -517 -421 401 758 48 -374 -731 -196 660 542 -52 -847 -269 279 658 195 -164 -315 198
4760 198 568 197 -324 -565 -772 238 263 599 -328 -860 -161 424 473 -138 -322 -535 27 358 268 -265 -805
4781 -805 -475 -9 500 -193 -24 -337 -297 386 204 134 -361 -620 -42 500 190 -562 -673 -234 164 956 352
4802 352 -264 -390 -30 609 362 -122 -375 -270 58 440 302 -73 -772 -202 512 487 381 -497 -469 157 494
4823 494 134 -330 -664 -83 336 300 200 -488 -325 14 509 341 90 -398 -400 -26 309 214 -222 -605 -318
4844 -318 37 744 48 -801 -963 125 567 69 -170 -489 -259 136 654 77 -99 -346 163 221 506 49
4864 49 -471 -440 -40 527 466 -268 -618 -233 302 745 -149 -305 -390 41 277 565 367 -519 -416 -193 133
4885 133 527 -209 -490 -227 396 765 29 -444 -631 147 483 515 -418 -441 -203 199 487 194 -238 -585 -66
4906 -66 402 359 199 -393 -404 114 589 570 -134 -396 -549 268 711 324 -704 -343 -87 295 253 295 -147 -510
4928 -510 -29 624 287 -505 -431 138 -102 290 82 -201 -508 -251 511 415 -256 -557 -175 319 642 122 -488
4949 -488 -323 -140 421 191 -213 -363 -418 -155 226 401 -354 -345 -424 -179 481 241 -402 -574 131 453 501 -429
4971 -429 -330 -53 221 421 449 -189 -390 -319 -10 273 377 -248 -588 27 549 602 217 -413 -197 307 684
4992 684 -102 -206 -392 239 812 92 -5 -476 -206 167 415 469 135 -604 -317 74 803 48 -440 -394 410
5013 410 862 379 -172 -840 -228 401 350 177 -417 -666 -82 319 458 -37 -122 -145 67 473 762 -149 -715
5034 -715 -301 144 777 139 -318 -651 171 546 245 -291 -427 -310 56 158 -117 -483 -565 -116 131 287
5054 287 222 -474 -440 -29 331 225 -274 -647 -542 262 648 47 -475 -223 55 714 399 50 -148 -108 -28
5075 -28 512 693 -413 -779 -257 318 549 -257 -633 -534 46 586 491 124 -593 -272 227 700 187 69 -611
5096 -611 -248 213 479 15 -355 -501 -130 538 587 52 -532 -306 224 539 20 -370 -678 -82 310 -24
5116 -24 -59 -444 102 47 137 -64 46 -313 -269 470 568 -75 -633 -544 -130 439 78 -24 -2 -119 181 608 -28
5139 -28 -106 -360 47 2 354 -111 -219 -207 -101 536 367 167 -730 -159 340 551 194 -356 -71 -135 504 530
5161 530 50 -283 -443 189 368 -47 -354 -604 -291 568 246 27 -206 -250 -26 722 184 -204 -465 -458 327
5182 327 423 161 -438 -420 31 479 193 -124 -161 48 -13 333 160 -217 -714 -86 -9 657 56 -264 -307 -56
5204 -56 414 552 -191 -488 -189 240 45 -120 -419 -252 -241 438 591 192 -162 -212 265 511 195 -31 -151
5225 -151 -279 454 379 -119 -606 -323 -93 -53 291 -57 -158 -89 119 95 118 -184 -80 -344 317 30 54 -200
5247 -200 -475 -118 200 469 -183 -287 -184 179 392 101 121 -696 -74 -11 215 95 -269 -526 -48 528 237
5268 237 -29 -485 -287 87 408 102 -310 -704 -168 321 180 -295 -417 -188 238 331 245 -43 -575 -208 134
5289 134 542 368 -411 -350 -103 241 -62 -88 -433 -98 310 766 320 -95 -448 220 389 -17 -526 -306 -560
5310 -560 -125 128 390 -246 -290 -189 172 927 88 21 -521 1 517 205 -27 -537 -155 207 759 193 -486
5331 -486 -317 -200 296 424 288 -433 -289 -304 254 21 102 -297 -122 5 128 331 -573 -308 157 164 302
5352 302 -7 -273 -67 352 377 179 -54 -49 -231 423 302 126 -265 -262 6 165 337 -197 -578 -221 -3 495
5374 495 340 -501 -359 -24 100 169 -42 -389 6 123 317 102 -85 54 -159 418 311 116 -432 -431 362
5395 362 570 628 73 -599 -319 323 321 -214 -395 -345 -312 191 127 106 -204 -353 -269 395 522 -110 -275 -347 171
5418 171 371 193 -154 -232 217 422 227 -83 -240 -433 400 321 275 139 -435 -87 215 248 151 13 -947 7
5440 7 303 149 -129 -312 -228 201 363 63 -32 -423 -40 100 281 251 171 -384 -110 240 268 -187 -584 -281
5462 -281 -41 416 -71 -144 -114 -66 5 132 91 -170 -336 203 177 245 -170 -375 130 -12 391 54 -270 -303 340
5485 340 319 259 -165 -357 -550 -10 295 363 -136 -275 143 242 237 294 -287 -360 234 651 -137 -213 -428 -379 113
5508 113 355 522 42 -324 345 163 213 133 -290 -189 78 290 280 -480 -29 -359 277 363 100 -458 -393 -173
5530 -173 211 366 -145 -195 -505 173 483 48 -40 -434 -477 459 387 27 -232 -225 -19 395 277 125 -263 -221
5552 -221 -50 16 154 32 -307 -146 306 746 -123 -406 -225 288 636 195 -340 -373 -307 30 221 -40 -411
5573 -411 -3 -71 419 77 144 -200 -286 83 324 543 156 -6 -154 490 546 134 -462 156 176 217 219 -309 -6
5596 -6 -85 455 455 185 -142 26 205 202 -81 86 -224 33 59 607 191 -182 -465 -98 203 211 -64 -272 -447
5619 -447 -584 48 333 -44 -66 -145 332 574 343 -249 -243 143 1 235 -59 -436 19 -50 166 118 -102 -326
5641 -326 -69 311 468 197 -348 -338 69 -18 193 388 -123 -563 24 335 280 -467 -613 -128 431 189 71
5662 71 -479 -433 55 211 254 32 -81 -238 183 172 264 205 -178 55 241 232 -230 -65 82 26 348 244 -257
5685 -257 -207 108 166 438 252 -246 -173 -32 10 193 -142 -459 -342 -200 230 93 -97 -138 -308 294 283 205
5707 205 -258 -231 -120 104 175 -384 -292 -42 438 246 157 -349 -277 -273 295 125 240 -216 -149 -46 403 382 -185
5730 -185 -13 19 247 63 -120 -160 -514 97 155 119 -150 -342 245 190 285 71 -211 -83 -366 145 119 271
5752 271 -59 -129 295 603 22 -317 -121 -156 202 -49 94 -168 -182 -238 63 -47 120 -305 -514 -19 161
5773 161 113 -40 -136 160 470 61 149 -32 -114 -264 317 111 -195 -153 -289 208 30 154 -161 -226 -285 95
5795 95 62 -130 -301 -180 -162 329 218 -197 -202 -91 -44 345 -9 94 31 148 -2 381 118 8 -196 72
5817 72 355 100 -239 -89 -160 232 367 -24 -213 -255 224 161 -38 -394 -327 -101 352 80 207 -126 -151 -179
5839 -179 185 337 -115 -40 -303 52 359 143 -143 -99 57 -14 -86 360 -132 -334 -196 265 16 206 -99
5860 -99 -313 -234 131 124 37 -439 -280 313 82 -7 -333 -156 140 153 61 51 22 21 200 124 68 30 -135 -124 383
5885 383 293 -112 -34 -377 61 64 116 -223 -255 -30 210 204 11 -147 -446 -330 -33 299 116 -436 -447 -37 17
5908 17 354 -351 -290 -145 163 447 180 -341 -200 166 309 391 -227 -346 -185 255 297 171 24 -207 249
5929 249 -43 287 262 -326 -320 -41 157 60 165 -136 -404 353 50 224 -362 -249 44 497 145 -105 -131 -440
5951 -440 -6 -26 106 -181 -273 -110 204 -12 236 180 -84 -69 455 365 3 -52 -200 178 183 249 -191 -348 81
5974 81 86 293 -37 147 -383 14 6 441 80 -265 -309 308 -22 31 -103 -103 279 204 21 -306 -141 39 146
5997 146 146 34 -96 -145 -354 166 148 -11 10 -279 -96 449 233 11 -207 -14 280 470 93 108 -104 -87
6019 -87 -68 -180 -301 -353 35 -49 222 -29 -258 -338 -251 324 147 314 -136 -469 -80 71 326 -84 -340 -395
6041 -395 -213 80 -117 -114 -102 -278 165 106 -63 -289 47 201 233 283 -90 -255 -255 -184 -15 -325 -154 -83 80
6064 80 33 -68 70 -17 -322 -385 169 70 137 -112 -144 127 183 173 -102 -81 12 533 170 32 -202 44 148 -14
6088 -14 35 49 -169 -318 354 138 -56 -250 -322 156 135 103 203 -419 -55 74 285 47 -18 -12 -168 -59 -4
6111 -4 24 -520 -121 62 11 -126 40 -137 172 260 193 96 -352 -136 -80 48 309 -72 -367 -106 -89 60 -99
6134 -99 -112 -319 255 50 308 -3 -438 11 -219 353 209 -24 -135 -228 -137 147 -130 98 97 114 114 421 -229
6157 -229 -237 -151 -141 190 -403 -203 -17 190 84 27 144 -14 158 -153 181 191 -151 -435 101 40 -6 405 169
6180 169 63 -14 333 126 -27 89 -178 344 69 353 54 -14 -143 292 356 -4 10 -66 -212 27 98 -139
6202 -139 289 -264 -224 237 29 -308 133 -316 -169 250 219 203 -10 -68 64 -30 35 -103 -253 126 -61 76
6224 76 -324 -493 -206 -141 238 12 117 287 -207 137 288 219 3 -491 502 -26 101 -192 -336 -56 -56 -64
6246 -64 23 -283 26 -21 242 65 -320 -72 -47 -110 29 118 -6 139 161 130 199 198 -304 -207 -181 -27 249 -34
6270 -34 86 -120 26 210 203 -420 -306 -249 -117 193 156 219 -352 -32 11 -195 18 409 -367 223 167 37 -111
6293 -111 -353 10 282 445 -179 -276 117 73 220 357 -80 223 88 560 173 -82 -322 -60 279 280 86
6314 86 210 -117 19 392 338 -2 -514 -327 -208 332 -6 65 -193 101 131 -100 118 -214 -370 -37 103
6335 103 232 -14 -326 -207 76 -45 -9 86 -194 -2 57 -16 -30 -69 -20 13 461 13 146 -253 -82 49 -76
6358 -76 33 21 -262 -204 20 -226 43 17 -74 100 125 80 41 -375 -172 290 -50 -5 -40 -312 196 -75 122
6381 122 25 119 62 348 350 185 -10 -151 -198 -263 262 19 63 -222 83 28 175 -171 -87 -153 223 333 -130 372
6405 372 -184 -37 -7 279 -118 -373 -200 649 -114 -47 142 -379 -103 359 60 -59 -198 -71 16 21 -170 278
6427 278 3 -288 98 86 -168 -137 -194 -29 251 -180 367 -65 -91 -74 145 -96 -185 -291 -31 352 382 -18
6449 -18 -352 -157 -261 75 -68 -68 -223 -156 50 379 288 123 -297 -263 -45 256 75 -384 -333 -266 157 119 -293
6472 -293 -379 -267 128 403 13 -29 -239 -114 154 266 171 -313 -619 -74 -49 60 240 -88 -224 7 12 -84
6494 -84 34 -70 -53 177 84 150 -213 -380 -146 241 297 212 -239 104 75 312 369 -304 -21 237 -36 -144 -117
6517 -117 162 -74 -47 542 -4 131 -401 211 -116 139 46 -144 162 -18 149 398 -117 -97 22 -377 -50
6538 -50 218 -152 233 39 8 132 67 -209 -263 -194 80 391 -68 200 -116 -86 -133 60 132 137 -425 70 423
6561 423 -14 -278 -80 -318 -36 -109 -87 -210 284 74 450 -49 5 -13 -149 75 219 -374 -494 38 130 154
6583 154 98 12 -92 -188 77 241 306 35 -619 79 120 175 193 -182 17 -364 197 -147 -87 27 -205 75 252
6606 252 47 -132 -298 157 5 66 62 -28 -77 10 157 -52 -105 68 -34 -24 121 42 37 213 380 177 -22 94
6630 94 -28 -120 225 261 148 -298 -80 37 147 -121 -71 -3 -255 97 -71 55 -323 -197 148 39 -129 -117
6652 -117 170 -42 -138 128 -136 -297 -174 -112 -135 282 -30 -214 -481 62 -169 130 -65 -35 -367 -42 198
6673 198 -83 -183 -150 -242 -186 301 -235 -129 -97 41 259 68 -240 176 -127 172 -148 361 -22 -15 41 308
6695 308 -81 -249 -74 -4 -167 233 298 -234 -234 -43 -60 -247 384 62 -82 212 29 9 250 -60 -319 190
6717 190 -46 95 -3 -238 -53 -11 194 -137 -118 -239 -277 359 283 318 66 305 8 -155 204 -55 -19 -170
6739 -170 -209 275 242 -158 -183 53 219 -55 93 -178 -62 -206 46 139 -162 -262 6 135 230 48 -172 -224
6761 -224 113 234 263 -233 2 4 -119 279 74 -95 -205 -126 14 -79 -314 -233 -44 -11 52 141 -171 -187 69
6784 69 93 79 -98 133 -96 -166 -36 -99 -19 -273 -108 159 51 67 -26 -462 250 155 189 -58 17 -39 -11 89
6808 89 -219 -198 -275 -84 140 356 80 150 -367 77 214 105 -131 -236 -258 -55 166 172 66 -277 -208 159 239
6831 239 219 -74 -16 119 150 37 9 -37 -188 -256 243 173 54 139 -33 -159 95 128 34 -59 -184 40 401 150
6855 150 44 56 -91 228 166 -351 -291 -216 181 263 88 -251 59 -64 -83 270 -204 -133 328 158 288 186
6877 186 -263 -160 140 -147 -99 287 37 445 200 150 422 177 -101 6 -31 118 -95 -365 -146 178 237
6898 237 198 -125 -157 -105 -168 39 140 -150 -91 39 43 308 -103 -112 -769 258 -29 85 -250 -130 96 150 149 60
6922 60 417 -19 -156 300 332 142 -2 109 98 47 370 81 -282 66 137 246 165 -321 -109 139 95 109 -195
6945 -195 -187 -228 164 162 274 -277 -244 -174 106 519 -16 135 -318 116 6 56 74 -90 59 177 375 -23 -51
6968 -51 -493 153 333 109 89 -133 -11 -18 251 -71 7 11 -115 275 233 -97 42 -229 -86 37 -174 -331 -136
6991 -136 -223 26 164 20 -27 -442 -263 316 -61 2 70 -41 -74 95 125 25 -209 121 6 -3 -81 -412 -172
7014 -172 155 137 -7 -55 -130 -239 -88 215 -154 -252 -96 60 -87 141 252 147 -168 39 -33 311 354 -123
7036 -123 -110 -14 180 20 -160 -7 -174 180 263 247 123 -61 106 175 90 -119 -468 41 102 126 116 41 -176
7059 -176 56 111 -115 -195 81 -284 78 272 91 -73 57 -37 -21 -13 -312 -173 -67 32 312 75 -4 -487 -346
7082 -346 -49 79 214 -210 -266 235 177 -17 -160 -69 -110 -220 61 225 154 -63 -186 -183 39 149 115 -421 -238
7105 -238 266 -129 123 -219 -96 -111 161 -37 -50 1 288 -192 77 190 -209 -399 -119 202 118 -233 -246 -80
7127 -80 -74 140 114 14 -322 -81 185 286 -23 -73 -67 11 197 293 187 49 -204 -103 207 -33 -431 -311 -148
7150 -148 54 103 139 -337 -2 -81 139 338 -106 -276 97 189 128 -222 -23 -353 161 243 57 23 -55 -43 -35 284
7174 284 -18 13 -266 146 71 504 156 -220 -249 -141 114 61 177 -51 -92 111 114 -147 -156 -240 233 235 -25 76
7198 76 -337 17 319 47 305 9 -39 -9 -166 142 71 160 -466 139 40 142 -73 -204 -18 99 190 -101
7220 -101 -103 80 -176 347 247 162 3 -146 -144 201 361 -281 -28 160 251 389 -124 220 -63 -109 110 51 29
7243 29 23 -260 29 284 98 130 54 73 91 86 -26 -262 -257 -93 267 66 -6 92 71 48 183 124 358 -164 66
7268 66 31 -125 7 -16 206 -112 202 127 -14 -182 -109 132 -449 137 15 -202 -16 359 112 163 -510 -531
7290 -531 -80 18 23 -347 47 -73 33 -60 93 -314 -14 -336 -69 57 198 -278 54 100 378 -239 -137 -292
7312 -292 168 122 408 559 -533 177 -167 52 158 -194 -454 -345 124 200 16 -20 -91 263 140 -17 129
7333 129 333 147 26 212 163 -132 330 -336 73 388 199 -32 -18 139 216 363 -30 -268 -322 131 230 -235
7355 -235 -97 -11 -54 123 100 271 -289 -33 -284 282 157 -50 -249 -120 328 203 -173 -295 -54 79 236
7376 236 105 66 -194 -80 -40 288 -15 -491 114 53 282 289 -126 -63 -80 284 48 -10 -54 87 -62 -140 253
7399 253 -55 146 -96 67 -2 201 -72 -91 56 -68 63 -9 -91 -430 -111 64 115 238 4 -299 91 129
7421 129 296 -58 34 -336 111 37 -177 -235 -157 16 227 165 326 -174 -157 35 93 140 -223 -216 81 237 713
7444 713 -28 -626 -410 -275 -17 52 123 -18 -284 -146 -33 89 8 -328 -185 -87 -94 47 -30 -201 -41 260
7466 260 247 -360 -95 -466 36 -6 -46 -299 205 19 -91 46 -36 -26 -388 111 144 194 -31 -199 -258 -101 455
7489 455 -33 78 -367 -5 316 91 -133 -78 -244 190 -47 114 -111 -344 -153 446 102 210 -200 -284 -312
7510 -312 81 468 -291 -188 147 51 188 -372 -260 -94 47 48 39 -51 183 27 200 308 -260 67 -248 -142
7532 -142 311 264 -131 -378 -152 -43 157 406 167 -252 -163 331 25 -100 -140 197 85 375 175 77 -96
7553 -96 -337 -252 143 258 60 -134 -53 201 162 213 37 -136 -156 479 149 89 11 -19 431 70 135 -7 -480
7576 -480 -295 304 188 190 -262 -202 -251 101 62 -124 -302 2 13 185 302 -93 227 -145 -57 112 142 -163 -154
7599 -154 -216 90 -34 -74 -200 -151 -32 464 -99 -233 -71 68 147 215 -48 -435 301 -3 256 87 -33 21
7621 21 -316 -32 409 27 -100 -134 373 354 35 -88 175 -234 211 330 23 -31 -116 -41 136 334 -342 -92
7643 -92 -175 104 369 491 -128 -423 -229 263 127 86 -71 -488 76 476 270 -70 -368 -284 -97 103 151 -277
7665 -277 -375 -279 37 -65 -237 -86 -196 -280 -6 471 174 -473 -111 378 139 481 -291 -415 -167 5 275
7686 275 -110 -9 -19 112 183 283 -48 -54 -346 0 481 162 48 -351 -140 272 231 -141 -392 -357 12 137
7708 137 31 -412 -129 164 471 47 -59 -176 84 -37 56 -46 -286 -54 -86 -62 220 343 -159 -285 -82
7729 -82 298 328 160 -224 39 43 284 145 301 63 166 118 171 303 -41 -441 -154 319 310 45 -536 -129 76
7752 76 199 -112 -128 -191 -56 218 12 -102 -256 -463 121 129 19 -130 -256 -186 153 122 -83 192 -134 9
7774 9 42 174 -106 -684 -284 300 -83 430 4 -306 -150 -37 352 262 52 -243 90 78 -188 -279 -9 -320
7796 -320 -53 328 101 -64 -473 -29 224 342 -92 83 15 -285 175 245 148 -80 -235 39 137 36 50 -136
7818 -136 -21 -43 492 86 15 -144 304 101 -25 129 -145 -38 -34 304 -159 -81 -229 97 274 73 -102 -272
7840 -272 64 -77 390 242 109 -236 101 266 458 56 -346 -82 -208 123 106 200 -618 -467 94 121 52
7861 52 -167 -70 -432 155 200 -175 -194 -95 -88 250 300 -60 -119 -395 62 98 238 -253 -222 438 277 170 -84 -215
7885 -215 227 65 278 451 -130 -247 190 260 96 -312 -161 -435 73 358 9 44 -155 -121 20 278 182
7906 182 -185 16 -165 6 80 200 -156 -4 10 18 253 -250 -420 222 274 -146 272 -144 -149 -180 44 391 -98
7929 -98 -377 -311 -123 71 -61 22 -364 -288 56 208 -175 -217 117 -16 7 150 -107 -167 -169 -16 380 -4 -332
7952 -332 -243 -172 302 190 5 -139 -51 176 60 229 -85 -288 151 165 218 127 -158 -287 74 172 362 -7
7974 -7 103 3 -118 118 63 -166 -292 -228 327 831 90 -197 -467 299 -78 -117 -195 -515 -101 221 380 25
7996 25 -109 -42 106 -148 221 221 -335 -188 329 217 -31 -32 -344 -435 310 24 203 -167 -100 -118 384 117 -198
8019 -198 -251 -97 60 359 -18 113 -150 182 255 107 -216 -249 46 -448 24 167 55 -303 -25 167 349
8040 349 -88 287 25 -84 254 269 -20 -196 -335 -74 367 54 162 -425 283 300 219 70 -293 -129 -195
8061 -195 123 -260 -82 -493 -362 167 420 215 -339 -206 -35 309 -30 -459 -366 -201 146 561 -18 -197
8081 -197 -251 14 214 83 55 34 -389 191 476 342 16 -321 -180 -150 -3 139 -179 -212 -277 23 262 -31
8103 -31 46 -489 235 40 115 -123 -442 -373 329 137 -31 -130 -246 -3 134 214 -91 -67 67 -119 80 266
8125 266 74 -282 -108 499 227 -106 -115 -207 -141 344 78 -167 -207 -248 16 54 206 -372 -337 12 202 143 -21
8148 -21 -441 -366 -245 307 292 -517 -147 -426 186 435 128 -318 -312 140 -3 102 5 -208 -223 -12 -213 179
8170 179 -27 -315 -292 179 279 -35 -297 -537 52 360 328 -71 4 -497 -23 242 -288 95 -323 -311 617
8191F17
##END NTUPLES=NMR FID
##END=
