##TITLE=1H_LR-790-C-MK2
 D2O
 8 sc, 
 2.11.2024
##JCAMPDX= 6.0         $$ Bruker NMR JCAMP-DX V2.0
##DATA TYPE= NMR FID
##DATA CLASS= NTUPLES
##ORIGIN= UXNMR, Bruker Analytische Messtechnik GmbH
##OWNER= root
$$ XWIN-NMR		Version 3.5
$$ Sat Nov  2 13:54:43 2024 Russian Standard Time (UT+4h)  she@DPX200
##.OBSERVE FREQUENCY= 200.1318
##.OBSERVE NUCLEUS= ^1H
##.DELAY= (6, 6)
##.ACQUISITION MODE= SIMULTANEOUS
##.ACQUISITION SCHEME= undefined
##.AVERAGES= 8
##.DIGITISER RES= 18
##SPECTROMETER/DATA SYSTEM= spect
##.PULSE SEQUENCE= zg30
##.SOLVENT NAME= D2O
##.SHIFT REFERENCE= (INTERNAL, D2O, 0, 15.7039)
##AUDIT TRAIL= $$ (NUMBER, WHEN, WHO, WHERE, WHAT)
$$ ##TITLE= Audit trail, XWIN-NMR		Version 3.5
$$ ##JCAMPDX= 5.01
$$ ##ORIGIN= Bruker BioSpin GmbH
$$ ##OWNER= she
$$ F:/spectra/data/she/nmr/H-F/1/audita.txt
$$ ##AUDIT TRAIL=  $$ (NUMBER, WHEN, WHO, WHERE, WHAT)
(   1,<2024-11-02 13:53:32.15 +0400>,<she>,<DPX200>,
      <created by zg, POWCHK disabled, PULCHK disabled
       configuration hash MD5:
       00 E9 B6 7A A2 85 ED C7 34 08 36 98 17 FE 4E 26
       data hash MD5: 16K
       FF 86 91 F0 F4 1E 17 BC 4E 4D 2B 61 7A D9 8F 87>)
$$ ##END=
$$ 
$$ hash MD5
$$ D2 F8 82 EF 7F D2 6E 0C 2D 39 8D BC F0 84 29 A9
##$RELAX= 
##$RELAX= 
##$RELAX= 
##$RELAX= 
##$RELAX= 
##$RELAX= 
$$ Bruker specific parameters
$$ --------------------------
##$DU= <F:/spectra>
##$EXPNO= 1
##$NAME= <H-F>
##$PROCNO= 1
##$TYPE= <nmr>
##$USER= <she>
##$AMP= (0..31)
100 100 100 100 100 100 100 100 100 100 100 100 100 100 100 100 100 100 
100 100 100 100 100 100 100 100 100 100 100 100 100 100 
##$AQSEQ= 0
##$AQ_mod= 1
##$AUNM= <au_zg>
##$AUTOPOS= <>
##$BF1= 200.13
##$BF2= 200.13
##$BF3= 200.13
##$BF4= 200.13
##$BF5= 200.13
##$BF6= 200.13
##$BF7= 200.13
##$BF8= 200.13
##$BYTORDA= 1
##$CFDGTYP= 0
##$CFRGTYP= 5
##$CHEMSTR= <none>
##$CNST= (0..31)
1 1 145 1 1 1 1 1 1 1 1 1 1 1 1 1 1 1 1 1 1 1 1 1 1 1 1 1 1 1 1 1 
##$CPDPRG= <>
##$CPDPRG1= <>
##$CPDPRG2= <>
##$CPDPRG3= <>
##$CPDPRG4= <mlev>
##$CPDPRG5= <mlev>
##$CPDPRG6= <mlev>
##$CPDPRG7= <mlev>
##$CPDPRG8= <mlev>
##$CPDPRGB= <>
##$CPDPRGT= <>
##$D= (0..31)
0 1.2 0 0 0 0 0 0 0 0.06 0 0.03 0 0 0 0 0.0002 0 0 0 0 0 0 0 0 0 0 0 0 
0 0 0 
##$DATE= 1730541211
##$DBL= (0..7)
120 120 120 120 120 120 120 120 
##$DBP= (0..7)
150 150 150 150 150 150 150 150 
##$DBP07= 0
##$DBPNAM0= <>
##$DBPNAM1= <>
##$DBPNAM2= <>
##$DBPNAM3= <>
##$DBPNAM4= <>
##$DBPNAM5= <>
##$DBPNAM6= <>
##$DBPNAM7= <>
##$DBPOAL= (0..7)
0.5 0.5 0.5 0.5 0.5 0.5 0.5 0.5 
##$DBPOFFS= (0..7)
0 0 0 0 0 0 0 0 
##$DE= 6
##$DECBNUC= <off>
##$DECIM= 24
##$DECNUC= <off>
##$DECSTAT= 4
##$DIGMOD= 1
##$DIGTYP= 9
##$DL= (0..7)
0 120 120 120 120 120 120 120 
##$DP= (0..7)
150 150 150 150 150 150 150 150 
##$DP07= 0
##$DPNAME0= <>
##$DPNAME1= <>
##$DPNAME2= <>
##$DPNAME3= <>
##$DPNAME4= <>
##$DPNAME5= <>
##$DPNAME6= <>
##$DPNAME7= <>
##$DPOAL= (0..7)
0.5 0.5 0.5 0.5 0.5 0.5 0.5 0.5 
##$DPOFFS= (0..7)
0 0 0 0 0 0 0 0 
##$DQDMODE= 0
##$DR= 18
##$DS= 0
##$DSLIST= <SSSSSSSSSSSSSSS>
$$ [...]
##$SUBNAM2= <"">
##$SUBNAM3= <"">
##$SUBNAM4= <"">
##$SUBNAM5= <"">
##$SUBNAM6= <"">
##$SUBNAM7= <"">
##$SUBNAM8= <"">
##$SUBNAM9= <"">
##$SW= 24.0689170037331
##$SWIBOX= (0..15)
0 0 2 0 0 0 0 0 0 0 0 0 0 0 0 0 
##$SW_h= 4816.95568400771
##$TD= 16384
##$TD0= 1
##$TE= 0
##$TE2= 300
##$TE3= 300
##$TEG= 300
##$TL= (0..7)
0 120 120 120 120 120 120 120 
##$TP= (0..7)
150 150 150 150 150 150 150 150 
##$TP07= 0
##$TPNAME0= <>
##$TPNAME1= <>
##$TPNAME2= <>
##$TPNAME3= <>
##$TPNAME4= <>
##$TPNAME5= <>
##$TPNAME6= <>
##$TPNAME7= <>
##$TPOAL= (0..7)
0.5 0.5 0.5 0.5 0.5 0.5 0.5 0.5 
##$TPOFFS= (0..7)
0 0 0 0 0 0 0 0 
##$TUNHIN= 0
##$TUNHOUT= 0
##$TUNXOUT= 0
##$USERA1= <user>
##$USERA2= <user>
##$USERA3= <user>
##$USERA4= <user>
##$USERA5= <user>
##$V9= 5
##$VALIST= <valist>
##$VCLIST= <CCCCCCCCCCCCCCC>
##$VD= 0
##$VDLIST= <DDDDDDDDDDDDDDD>
##$VPLIST= <PPPPPPPPPPPPPPP>
##$VTLIST= <TTTTTTTTTTTTTTT>
##$WBST= 1024
##$WBSW= 4
##$XGAIN= (0..3)
0 0 0 0 
##$XL= 0
##$YL= 0
##$YMAX_a= 111776
##$YMIN_a= -91379
##$ZGOPTNS= <>
##$ZL1= 120
##$ZL2= 120
##$ZL3= 120
##$ZL4= 120
##$ABSF1= 10
##$ABSF2= 0
##$ABSG= 5
##$ABSL= 3
##$ALPHA= 0
##$AQORDER= 0
##$ASSFAC= 0
##$ASSFACI= 0
##$ASSFACX= 0
##$ASSWID= 0
##$AUNMP= <proc_1d>
##$AZFE= 0.1
##$AZFW= 0.1
##$BCFW= 1
##$BC_mod= 2
##$BYTORDP= 1
##$COROFFS= 0
##$CY= 11.3945322036743
##$DATMOD= 1
##$DC= 2
##$DFILT= <>
##$DTYPP= 0
##$F1P= 15.6554695791079
##$F2P= 12.8336369535428
##$FCOR= 0.5
##$FTSIZE= 0
##$FT_mod= 4
##$GAMMA= 1
##$GB= 0.15
##$INTBC= 1
##$INTSCL= 1
##$ISEN= 128
##$LB= 0.24
##$LEV0= 0
##$LPBIN= 0
##$MAXI= 10000
##$MC2= 0
##$MEAN= 0
##$ME_mod= 0
##$MI= 1.114404
##$NCOEF= 0
##$NC_proc= 0
##$NLEV= 6
##$NOISF1= 3.799351
##$NOISF2= 2.8
##$NSP= 1
##$NTH_PI= 0
##$NZP= 0
##$OFFSET= 15.70392
##$PC= 1
##$PHC0= -26350.25
##$PHC1= 13.98743
##$PH_mod= 1
##$PKNL= yes
##$PPARMOD= 0
##$PSCAL= 0
##$PSIGN= 0
##$REVERSE= no
##$SF= 200.130013532006
##$SI= 16384
##$SIGF1= 3
##$SIGF2= 2
##$SINO= 400
##$SIOLD= 16384
##$SREGLST= <1H.CDCl3>
##$SSB= 0
##$STSI= 0
##$STSR= 0
##$SW_p= 3612.71676300578
##$SYMM= 0
##$S_DEV= 0
##$TDeff= 0
##$TDoff= 0
##$TI= <>
##$TILT= no
##$TM1= 0
##$TM2= 0
##$TOPLEV= 0
##$USERP1= <user>
##$USERP2= <user>
##$USERP3= <user>
##$USERP4= <user>
##$USERP5= <user>
##$WDW= 1
##$XDIM= 8192
##$YMAX_p= 0
##$YMIN_p= 0
$$ End of Bruker specific parameters
$$ ---------------------------------
##NTUPLES= NMR FID
##VAR_NAME=  TIME,          FID/REAL,        FID/IMAG
##SYMBOL=    X,             R,               I
##VAR_TYPE=  INDEPENDENT,   DEPENDENT,       DEPENDENT
##VAR_FORM=  AFFN,          ASDF,            ASDF
##VAR_DIM=   8192,          8192,            8192
##UNITS=     SECONDS,       ARBITRARY UNITS, ARBITRARY UNITS
##FACTOR=    0.0002076,     1,               1
##FIRST=     0,             0,               0
##LAST=      1.7004516,     0,               0
##MIN=       0,             -91379,          0
##MAX=       1.7004516,     111776,          0
$$ Real data points
##PAGE= N=1
##DATA TABLE= (X++(R..R)), XYDATA
$$ [...]
$$ plain form
2218 -624 -1038 -583 563 865 95 -267 -841 136 899 500 -278 -506 -439 652 706 -58 -261 -810 -220 503
2238 503 966 -246 -396 -373 -93 804 570 -609 -751 -310 220 639 -76 -742 -737 -167 294 395 -297 -709
2258 -709 -288 -133 481 623 -463 -992 -134 411 557 165 -627 -788 200 823 219 13 -564 -311 930
2277 930 388 129 -362 -537 -93 218 420 -306 -663 -484 37 704 203 -200 -439 -390 432 935 -156 -509
2297 -509 -617 182 682 623 -136 -557 -245 394 575 329 -585 -548 -327 293 939 23 -774 -775 581 384 579
2318 579 -515 -1181 -169 402 498 99 -505 -367 -230 909 227 76 -491 -502 111 360 154 -160 -531 -275
2338 -275 669 636 -203 -416 -631 249 861 310 -385 -309 -259 196 744 349 -535 -716 -144 212 437 -190 -742
2359 -742 -490 94 605 509 -144 -1207 -91 442 390 107 -705 -61 -171 397 383 -160 -406 -484 -28 427 406
$$ packed form
2218f24m14M55J146L02p70l62n74R77P63l99p78k28O7J091N4p64k03n49N90P23
2238E03M63j212j50K3K80Q97k34j179j42M41N30M19p15o66NN70M61J01o92m12
2258g09M21J55O14J42j086n29Q58N45J46l92p92j61R88O23o04k06n77K53J241
2277I30n42k59m91j75M44L11K02p26l57J79N21O67n01m03k39M9Q22N03j091l53
2297e09j08P99N00n9p59m21L12O39J81k46r14L7K21O20O46r16p97jJ356j97J95
2318E79j094o66J012N71R6l99o04J38J37J139o82j51n67j1O13K49k06l14l71K56
2338b75R44l3q39k13k15Q80O12n51o95P6N0M55N48l95q84j81N72L56K25o27n52
2359g42K52N84N11r6o53j063J116N33n2k83q12O44j10N68j4n43k46p8M56M55k1
$$ plain form
2380 406 -166 -858 -262 179 792 165 -784 -403 51 336 34 -146 -625 138 445 568 215 -619 -384 46
2400 46 202 494 -43 -608 -506 238 592 536 -244 -438 -48 234 335 417 -450 -627 2 548 561 -104 -611
2421 -611 -135 247 234 480 -175 -601 -350 551 577 341 -852 -400 221 432 430 -327 -597 -413 229 545 -9
2442 -9 27 -109 -95 174 430 81 -451 -534 47 676 717 -448 -527 -100 228 743 17 -451 -390 204 401 240
2464 240 -195 -727 -350 64 617 329 -229 -392 -65 205 424 -38 -356 -528 384 844 158 -129 -766 -305
2484 -305 506 479 209 -549 -293 262 291 285 -49 -373 -232 -97 530 104 -73 -235 -269 314 877 5 -340 -215
2506 -215 106 700 284 127 -363 -183 -22 259 121 -356 -540 290 163 536 64 -377 -495 163 294 178
2526 178 -290 -146 13 467 103 134 -388 -626 212 510 265 -61 -164 -344 -105 395 271 -421 -218 -242 355
$$ packed form
2380D06n72o92N96M41O13o27r49L81M54K85l02j80m79P63L07J23l53q34K35M30
2400D6J56K92n37n65J02P44L54n6p80j94L90K82J01Q2q67j77O29N46J3o65n07
2421f11M76L82j3K46o55m26K51R01K6k36j193M52O21K11kp57k70J84O42L16n54
2442iL6j36J4K69K56l49n32q3N81O29M1j165p9M27L28N15p26m68O1N94J97j61
2464B40m35n32L77M14N53k88n58j63L27K70K19m62l18j72R12M60o86k87o37M61
2484c05Q11k7k70p58K56N55K9ol34l24J41J35O27m26j77j62l4N83N63q72l45J25
2506b15L21N94m16j57m90J80J61K81j38m77j84Q30j27L73m72m41j18O58J31j16
2526A78m68J44J59M54l64L1n22k38Q38K98k45l26j03j80K39N00j24o92K03k4N97
$$ plain form
2547 355 182 -233 -527 -370 377 337 110 -317 -327 -272 292 390 -400 -205 -341 167 550 129 -392 -272 -385
2568 -385 -25 362 55 -301 -405 18 349 661 -4 -454 -493 29 344 458 -40 -483 -286 160 198 198 -541
2589 -541 -350 -92 241 216 180 -288 -240 54 270 357 -414 -290 21 609 544 -242 -652 -208 365 361 201 -224
2611 -224 -388 -30 122 485 65 -183 -392 -367 457 554 75 -432 -462 178 527 76 -89 -131 -337 322 367 107
2633 107 -193 2 -81 192 65 28 -114 -49 312 554 215 -341 -363 -246 188 467 -14 -679 -273 -54 393
2654 393 158 -398 -219 181 263 -99 97 -163 8 55 165 334 -459 -511 -216 219 335 294 -219 -356 30
2675 30 216 310 -13 -343 -168 90 285 449 -361 34 -131 12 530 71 -76 -497 -362 173 712 -372
2695 -372 -119 -140 17 539 -148 -26 -300 -189 226 126 46 -498 -259 -264 57 276 -90 -209 27 -37 100 51
$$ packed form
2547C55j73m15k94J57P47m0k27m27j0N5N64R8p90J95j36N08L83m21n21J20j13
2568c85L60L87l07l56j04M23L31L12o65m50l9N22L15J14m98m43J97M46L8%p39
2589e41J91K58L33k5l6m68M8K94K16Q7p71J24L11N88o5p86m10M44N73mj60m25
2611b24j64L58J52L63m20k48k09K5Q24R7m79n07l0O40L49m51j65m2k06O59M5k60
2633A07l00J95q3K73j27l7j42O5L61K42l39n56k2J17M34K79m81o65M06K19M47
2654C93k35n56J79M00Q2l62J96k60J71M7J10J69p93n2K95M35J16m1n13j37L86
2675C0J86R4l23l30J75K58J95J64q10L95j65J43N18m59j47m21J35N35N39j084
2695c72K53k1J57N22o87J22k74J11M15j00q0n44K39nL21K19l66j19K36o4J37m9
$$ plain form
2717 51 -167 -438 140 520 224 204 -517 -381 -16 152 -74 106 -396 -237 351 421 94 339 -184 -24 218
2738 218 418 256 -156 -567 343 285 160 342 -167 -172 123 448 235 238 -360 121 233 147 -135 -52 -223 289
2760 289 176 207 -192 -360 -264 184 644 38 -111 -389 330 392 71 -335 -248 89 342 150 127 -149 137 -53
2782 -53 123 266 -63 -509 -114 161 217 235 -253 -216 71 493 20 96 -203 -12 314 18 167 55 -83 -115
2804 -115 207 120 156 -103 49 215 333 440 204 -620 173 334 669 -216 -402 40 -185 143 287 -68 -158
2825 -158 -78 -183 -35 60 -60 -176 5 103 182 134 96 -217 -67 40 255 6 -305 -299 175 -117 -209 -210 -144 -234
2849 -234 338 476 192 147 -337 -158 395 -64 -214 -136 -121 49 195 -159 -108 48 157 61 -42 145 -147 -77
2871 -77 -387 79 37 -45 -397 -205 -55 20 203 -64 -170 -184 207 251 166 -233 -31 -167 278 -62 -161 -74 339
$$ packed form
2717E1k18k71N78L80k96k0p21J36L65J68k26J80n02J59N88P0l27K45n23J60K42
2738B18K00j62m12m11R10n8j25J82n09nK95L25k13Ln98M81J12q6k82Q3j71N12
2760B89j13L1l99j68R6M48M60o06j49k78P19O2l21m06Q7L37K53j92k3k76K86j90
2782e3J76J43l29m46L95K75N6J8m88L7K87M22m73P6k99J91L26k96J49j12j38l2
2804a15L22q7L6k59J52J66J18J07k36q24P93J61L35q85j86M42k25L28J44l55r0
2825a58Q0j05J48R5j20j16J81R8P9m8l8l13J50J07K15k49l11OM74k92r2jO6r0
2849b34N72J38k84m5m84J79N53m59j50P8J5J70J46l54N1J56J09r6j03J87k92P0
2871g7l10M66m2q2l52J92J50P5J83k67j06j4L91M4q5l99K02j36M45l40r9Q7M13
$$ plain form
2894 339 169 327 -58 -97 -337 46 134 197 173 -202 -266 107 206 27 -144 161 176 307 225 177 -320 -103 290
2917 290 331 88 375 -266 -66 -284 87 -118 -69 -118 40 105 -75 -341 -460 12 24 431 481 -165 -387 -19
2939 -19 255 128 -238 -277 -119 151 296 67 -51 36 -109 -234 149 63 -161 -292 -77 213 525 -160 -138 -173
2961 -173 146 174 -15 20 -453 110 -86 497 0 -128 -311 368 -19 21 -18 181 -19 208 -137 211 -32
2982 -32 69 -205 74 -94 26 -139 -326 54 -83 280 15 -381 135 7 174 -124 -118 -180 8 319 80
3003 80 -43 -227 -190 -211 121 135 71 1 -16 -170 337 -90 -249 -34 -208 386 76 -95 1 -70 61 357 29
3026 29 -6 -260 -244 462 62 190 -105 -380 -156 54 65 -207 182 33 207 27 -34 -397 -290 30 -182 122
3048 122 -88 -41 -37 140 -16 -126 -115 -122 38 -96 135 264 -134 245 -199 -75 71 194 -121 286 203 -229
$$ packed form
2894C39j70J58l85l9k40L83Q8O3k4l75o4L73R9j79j71L05J5J31q2m8m97K17L93
2917B90M1k43K87o41K00k18L71k05M9m9J58O5j80k66j19M72J2M07N0o46k22L68
2939a9K74j27l66l9J58K70J45k29j18Q7j45j25L83q6k24j31K15K90L12o85K2l5
2961a73L19K8j89L5m73N63j96N83m97j28j83O79l87M0l9J99k00K27l45L48k43
2982c2J01k74K79j68J20j65j87L80j37L63k65l96N16j28J67k98Oo2J88L11k39
3003H0j23j84L7k1L32J4o4p0j7j54N07m27j59K15j74N94l10j71R6p1J31K96l28
3026B9l5k54J6P06m00J28k95k75K24K10J1k72L89j49J74j80o1l63J07L20k12L04
3048A22k10M7MJ77j56j10J1pJ60j34K31J29l98L79m44J24J46J23l15M07q3m32
$$ plain form
3070 -229 -71 -339 -297 -4 87 186 -53 47 -404 -128 78 142 -135 -173 192 240 430 -138 -272 -212 -179 149 66
3093 66 128 -24 -75 -185 37 446 -512 -52 -237 226 267 341 20 -240 -171 163 -254 -168 58 -19 -71 21 30 96
3117 96 -184 170 70 -307 -141 -361 30 385 8 339 -7 -48 65 -236 174 -91 -44 -167 -264 235 -43
3138 -43 -70 60 81 23 149 219 -47 29 24 64 -117 -100 317 -165 104 68 137 -213 -48 -254 -103 151 9 36
3162 36 -11 81 114 147 -10 41 -21 350 209 99 158 -249 10 27 164 253 153 -34 193 40 188 -209 34
3185 34 -4 231 69 196 -395 -70 -9 -168 17 153 -243 -75 -52 -23 40 -292 -34 16 -72 -217 -71 -475 -82
3208 -82 62 6 91 142 -185 -117 -83 28 158 -197 45 227 -1 -69 95 47 38 -48 -21 107 66 -67 90 30 -36
3233 -36 364 142 35 70 78 139 206 -114 -253 -66 -138 229 118 -59 88 47 80 307 -183 -372 53 29 58 -92
$$ packed form
3070b29J58k68M2K93R1R9k39J00m51K76K06O4k77l8L65M8J90n68j34O0L3L28q3
3093F6O2j52n1j10K22M09r58M60j85M63M1P4l21k60O9L34m17Q6K26p7n2R2RO6
3117I6k80L54j00l77J66k20L91L55l77L31l46m1J13l01M10k65M7j23r7M99k78
3138d3k7J30K1n8J26P0k66P6nM0j81J7M17m82K69l6O9l50J65k06J51K54j42K7
3162C6m7R2L3L3j57N1o2L71j41j10N9m07K59J7J37Q9j00j87K27j53J48l97K43
3185C4l8K35j62J27n91L25O1j59J85J36l96J68K3K9O3l32K58N0q8j45J46m04L93
3208h2J44n6Q5N1l27O8L4J11J30l55K42J82k28o8J64m8rq6K7J28m1j33J57o0o6
3233c6M00k22j07L5QO1O7l20j39J87p2L67j11j77J47m1L3K27m90j89M25k4K9j50
$$ plain form
3257 -92 -192 -87 -190 233 57 -130 78 48 17 -167 -29 -376 29 150 -92 -90 61 -45 -30 -20 128 53 -261
3280 -261 99 -75 337 83 124 71 -328 -240 128 -5 -147 -134 -306 74 400 84 -135 114 65 -3 302 462
3302 462 120 178 -68 263 59 -144 -287 96 77 1 34 -196 -155 25 57 -19 -46 221 37 -106 86 265 -186
3325 -186 -149 -267 -202 92 -151 -64 -173 83 -58 -330 -191 -344 146 118 -4 15 177 81 -112 382 -179 -207
3347 -207 -83 -220 42 -281 34 -46 -176 -161 19 -67 166 -382 -257 -105 255 200 -17 -176 -77 224 104 364
3369 364 12 -37 14 -385 50 -51 -152 -159 -278 4 193 88 112 -199 -84 101 -172 -173 -78 -137 48 -119 -329
3392 -329 -137 -203 -362 -10 -10 -13 -90 -45 -117 211 79 -233 -12 27 224 5 508 30 9 -85 241 65 -167 -94
3416 -94 143 92 19 -251 -435 287 273 -29 193 -36 -104 -243 91 29 79 -52 -183 88 117 106 -300 34 -5
$$ packed form
3257i2j00J05j03M23j76j87K08l0l1j84J38l47M05J21k42KJ51j06J5J0J48p5l14
3280b61L60j74M12k54M1n3l99Q8L68j33j42J3j72L80L26l16k19K49m9o8L05J60
3302D62l42N8k46L31k04k03j43L83j9p6L3k30M1J80L2p6k7K67j84j43J92J79m51
3325a86L7j18O5K94k43Q7j09K56j41k72J39j53M90k8j22J9J62r6j93M94n61k8
3347b07J24j37K62l23L15q0j30J5J80q6K33n48J25J52L60n5k17j59R9L01j20K60
3369C64l52m9N1l99M35j01j01pj19K82J89j05K4l11J15J85k73jR5n9J85j67k10
3392c29J92o6j59L52%lp7M5p2L28j32l12K21L9J97k19N03m78k1r4L26j76k32P3
3416i4K37n1p3k70j84P22j4l02K22k29o8j39L34o2N0j31j31K71K9j1m06L34l9
$$ plain form
3439 -5 348 165 15 134 -324 37 11 70 -211 -169 -108 -186 125 -177 300 172 -232 332 54 97 -201 216 -110
3462 -110 -58 91 -131 -215 269 272 206 26 -107 201 190 323 218 174 -86 5 4 193 42 -243 -146 -289 115 -4
3486 -4 -107 97 -289 156 5 -247 22 -126 -178 -53 69 -98 142 56 -495 -2 257 -80 -187 -261 77 167
3508 167 -122 0 49 -287 -282 -354 140 137 91 -269 185 473 16 -237 -252 -109 60 86 171 -116 -297 30 356
3531 356 88 -281 80 -183 5 100 -134 -132 -92 306 -185 89 29 89 -144 148 457 307 -64 -18 -2 -135 295
3554 295 -63 177 -133 -114 17 192 -76 90 -141 279 271 -201 -63 112 -283 -256 -99 169 68 -113 -120 215
3576 215 -145 -76 -30 -51 29 -18 291 -369 -133 83 87 63 13 -258 -121 215 -24 446 -160 -78 169 -7 169
3599 169 -229 -237 -29 157 169 -149 -251 -438 -96 409 -121 -114 -172 -194 301 402 113 -117 -292 -72 236 264 58
$$ packed form
3439eL53j83j50J19m58L61k6N9k81M2O1p8L11l02M77j28m04N64k78M3k98M17l26
3462a10N2J49k22q4M84Lo6j80j33L08j1J33j05m4k60R1jJ89j51k85R7j43M04j19
3486dj03K04l86M45j51k52K69j48n2J25J22j67K40q6n51M93K59l37j07p4L38R0
3508A67k89J22M9l36Np2M94lm6l60M54K88m57k53j5J43J69K6Q5k87j81L27L26
3531C56k68l69L61k63J88R5k34KM0L98m91K74o0O0k33K92L09j50l71M6J6j33M30
3554B95l58K40l10J9J31J75k68J66k31M20qm72J38J75l95K7J57K68j01j81pL35
3576B15l60O9M6k1Q0m7L09o60K36K16Mk4n0k71J37L36k39M70o06Q2K47j76J76
3599A69l98qK08J86J2l18j02j87L42N05n30Pn8k2M95J01k89k30j75K20L08K8k06
$$ plain form
3622 58 -198 -543 16 120 190 171 -198 -8 78 371 122 -27 -31 -10 25 142 6 -56 -183 -105 33 158 159 -419
3646 -419 -28 51 180 -185 -293 -357 10 -12 145 33 159 31 168 -44 208 -76 -29 -29 182 252 -106 -291
3668 -291 -155 117 256 455 26 -132 6 130 206 232 -37 260 -142 -351 569 300 -51 -288 -199 56 284
3689 284 -98 -214 -252 -92 -144 -10 -491 -503 -226 107 504 91 -216 -208 -30 4 185 -40 -368 -389 47 415
3711 415 131 -354 -232 101 -142 -13 -74 -354 -248 20 166 -44 -25 -194 -337 9 120 164 -98 -232 -168
3732 -168 205 301 5 -98 -242 -10 201 290 78 -93 -245 188 63 78 -364 -236 11 289 30 -206 35
3753 35 106 276 90 17 -264 -237 -190 -162 204 -49 -281 -155 48 299 134 -163 -73 -494 85 37 122 -192 -386
3776 -386 -161 74 203 -15 -17 -403 194 -80 478 112 -270 -213 114 344 202 -342 -256 98 130 289 84 -378
$$ packed form
3622E8k56l45N59J04P0j9l69J90Q6K93k49j49mK1L5J17j36o2j27P8J38J25Jn78
3646d19L91P9J29l65j08o4L67k2J57j12J26j28J37k12K52k84M7%K11P0l58j85
3668b91J36K72J39J99m29j58J38J24P6K6k69K97m02k09R20k69l51k37Q9K55K28
3689B84l82j16l8J60n2J34m81j2K77L33L97m13l07QJ78L4J81k25l28k1M36L68
3711D15k84m85J22L33k43J29o1k80J06K68J46k10J9j69j43L46J11M4k62j34O4
3732a68L73R6k96j03j44K32K11Q9k12j71j52M33j25J5m42J28K47K78k59k36K41
3753C5P1J70j86p3k81K7M7K8L66k53k32J26K03K51j65k97R0m21N79m8Q5l14j94
3776c86K25K35J29k18kl86N97k74N58l66l82N7L27K30j42n44Q6L54L2J59k05m62
$$ plain form
3798 -378 257 85 -108 43 51 -395 -27 67 547 219 -147 -368 -360 286 -60 -105 -179 -274 77 330 51 -92 -319
3821 -319 166 133 145 -143 -306 -324 -68 383 383 -160 -308 -358 286 381 -135 -421 35 94 61 688 -37 -310 -375
3844 -375 191 194 212 -407 -206 -178 275 405 -22 -335 -328 -59 61 188 10 -191 -375 -50 166 22 -101 -120
3866 -120 -58 35 231 96 -256 -334 -1 183 133 -74 -400 -71 306 3 1 -47 24 53 132 179 -1 -321 -172 -137
3890 -137 404 30 -240 -148 152 188 306 292 -337 -272 -111 234 285 74 -111 -139 150 308 240 23 -70 -63 40
3913 40 254 -555 58 -379 -173 -94 153 -157 -390 -107 109 414 -112 -344 -410 -127 382 474 86 -305 -195
3934 -195 -8 32 119 -716 -425 -164 30 -23 181 -436 -202 -29 347 302 12 -461 -519 30 169 260 -290 -379
3956 -379 8 319 77 -122 -132 -440 273 612 225 -129 -285 -190 252 423 131 -157 -107 545 51 458 85
$$ packed form
3798c78O35j72j93J51Qm46L68R4M80l28l66k21QO46l46m5p4r5L51K53k79j43k27
3821c19M85l3J2k88j63j8K56M51%n43j48n0O44R5n16k86M56N9l3O27p25k73o5
3844c75N66LJ8o19K01K8M53J30m27l13PK69J20J27j78k01j84L25K16j44j23j9
3866a20O2R3J96j35l52p8L33J84n0k07l26L29L77l03km8P1K9P9M7j80l20J49L5
3890a37N41l74k70R2L00L6J18j4o29O5J61L45N1k11j85k8K89J58o8k17r3PJ03
3913D0K14q09O13m37K06P9K47l10k33K83K16L05n26k32o6K83N09R2l88l91J10
3934a95J87M0Q7q35K91K61J94n3K04o17K34J73L76m5k90m73n8N49J39R1n50q9
3956c79L87L11k42j99j0l08P13L39l87l54j56R5M42J71k92k88N0O52m94M07l73
$$ plain form
3977 85 -728 -135 246 274 204 -285 -321 165 533 381 -229 -365 -229 408 270 237 -185 -311 -61 175 39 226
3999 226 -110 -451 -325 297 334 -191 -413 -380 265 276 470 -31 -340 -447 150 210 -101 -332 -634 189 509
4020 509 807 -171 -76 -238 376 711 77 -182 -220 267 377 498 -131 -46 -262 9 194 75 -87 -574 -210
4041 -210 379 363 94 -115 -484 84 399 132 -54 -310 -337 -14 535 -74 -228 -201 -280 183 711 -20 -215
4062 -215 -384 -18 177 134 -117 -197 -299 -78 738 319 -160 -87 -191 601 529 -78 -363 -241 124 216 305 -277
4084 -277 -312 -42 396 302 108 -384 -445 0 227 442 -87 -317 -600 414 685 117 28 -757 -54 21 597
4105 597 -241 -432 -503 52 189 369 216 -277 -159 133 351 -28 -128 -317 -24 233 495 287 -554 -319
4125 -319 250 613 187 -269 -548 -232 138 266 255 -292 -576 174 569 428 82 -410 -57 283 471 491 -202
$$ packed form
3977H5q13N93L81K8p0m89l6M86L68j52o10j36J36O37j38l3m22j26K50K36j36J87
3999B26l36l41J26O22L7n25k22L3O45J1J94n01l09j07N97O0l11k31l02Q23L20
4020E09K98r78R5j62O14L35o34k59l8M87J10J21o29Q5k16K71J85j19j62m87L64
4041b10N89j6k69k09l69N68L15k67j86k56k7L23N49o09j54K7p9M63N28p31j95
4062b15j69L66J95m3k51q0j02K21Q16m19m79P3j04P92p2o07k85J22L65R2Q9n82
4084b77l5K70M38r4j94m92o1M45K27K15n29k30k83J014K71n68q9p85P03P5N76
4105E97q38j91p1N55J37J80j53m93J18K92K18l79j00j89K93K57K62k08q41K35
4125c19N69L63m26m56k79L16L70J28j1n47k84P50L95j41l46m92L53L40J88K0o93
$$ plain form
4146 -202 -599 -147 213 367 35 -566 -544 126 263 -93 -13 -542 -99 186 520 55 -446 -501 -309 530 403
4167 403 -464 -448 -300 479 380 -103 -431 -287 -88 216 598 -51 -472 -292 35 407 275 -94 -377 16 309
4188 309 345 110 -309 -531 15 491 551 191 -485 -181 5 374 641 -200 -585 7 58 397 300 -275 -404
4209 -404 51 567 164 -24 -454 -490 199 592 152 -141 -627 -383 600 253 54 -361 -375 -23 589 94 -39
4230 -39 -650 -308 83 637 186 -335 -467 -234 178 381 -215 -483 -398 -84 161 269 -314 -585 -28 82 245
4251 245 72 -211 -170 8 418 544 149 -471 -569 272 408 198 -314 -646 -21 666 585 40 -407 -309 117
4272 117 367 182 174 -522 -187 49 688 158 -465 -772 -61 647 272 196 -797 -558 222 641 184 -346 -257
4293 -257 -47 400 465 -41 -464 -35 67 177 633 -329 -549 -333 391 177 57 82 -748 -24 380 533 164
$$ packed form
4146b02l97M52L60J54l32o01K2O70J37l56Q0n29M43K85L34m65n01n5J92Q39j27
4167D03q67J6J48P79r9m83l28J44J99L04L82o49m21J80L27L72j32l69k83L93K93
4188C09L6k35m19k22N46M76O0l60o76L04J86L69K67q41l85N92N1L39r7n75j29
4209d04M55N16m03j88m30l6O89L93m40k93m86K44R83l47j99m15j4L52O12m95j33
4230c9o11L42L91N54m51n21j32K33M12K03n96k68Q5L14K45J08n83k71N57J10J63
4251B45j73k83M1J78M10J26l95o20r8Q41J36k10n12l32O25O87q1n45m47R8M26
4272A17K50j85qo96L35K36O39n30o23l07P11P08l75p6r93K39P80M19m57n30Q9
4293b57K10M47O5n06m23M29J02J10M56r62k20K16P24k14j20K5q30P24M04J53l69
$$ plain form
4314 164 -23 -250 160 124 365 -218 -453 -289 245 524 208 -491 -287 -42 622 585 -186 -678 -325 306 610
4335 610 477 -445 -541 16 265 249 37 -407 -255 68 315 111 -175 -161 -244 254 456 0 -280 -559 -48
4356 -48 483 482 66 -613 -554 251 456 312 14 -352 -287 23 300 433 -559 -527 -28 339 25 -2 -504 -848
4378 -848 -181 683 169 -408 -513 -24 354 464 -113 -410 -427 251 277 596 -42 -356 -399 11 354 210 -574
4399 -574 -423 -306 234 617 -138 -365 -406 456 467 204 -170 -424 -249 356 513 -69 -408 -445 15 486 469
4420 469 -222 -514 -271 -23 767 -3 -422 -605 16 646 490 -34 -584 -244 394 493 315 -435 -394 -331 388
4441 388 469 260 -428 -421 -53 848 640 -223 -665 -286 418 403 416 -458 -531 -58 280 763 145 -515 -175 225
4463 225 326 351 36 -482 -264 135 327 261 -266 -600 398 413 227 -265 -413 -374 124 606 349 -642 -332
$$ packed form
4314A64j87k27M10l6K41n83k35J64N34K79l16o99K04K45O64l7p71m92L53O31L04
4335F10j33r22r6N57K49j6k12m44J52L23K47k04k86J4q3M98K02m56k80k79N11
4356d8N31jm16o79N9Q05K05j44k98l66O5L10K77J33r92L2M99L67l14k7n02l44
4378h48O67Q64n14n77j05M89L78J10n77k97j7O78K6L19o38l14m3M10L43j44p84
4399e74J51J17N40L83p55k27m1Q62J1k63l74k54J75O05J57n82l39l7M60M71j7
4420D69o91k92K43K48P90p70m19j83O21O30j56n24n50L40O38R9j78p50M1O3P19
4441C88Q1k09o88PL68R01k08q63m42L79P04j5J3q74p3M73L38M83o18o60L40M00
4463B25J01K5l15n18K18L99J92o6n27l34R98J5j86m92j48L9M98M82k57r91L10
$$ plain form
4484 -332 27 405 68 -81 -348 -246 104 483 537 15 -761 -289 324 433 -46 -646 -532 -12 639 488
4504 488 -207 -541 -310 272 563 373 -133 -212 -413 328 615 89 -417 -613 101 503 205 -111 -791 -268
4524 -268 72 686 283 -310 -257 -329 343 532 148 -503 -242 -76 662 491 240 -312 -339 240 555 114 -269
4545 -269 -482 -12 403 199 236 -488 -538 221 671 198 142 -266 134 166 506 56 -501 -99 202 359 548
4566 548 24 -479 -288 414 440 228 -172 -461 30 323 531 -167 -287 -335 228 176 362 49 -361 -93 418
4587 418 363 72 -472 -317 108 407 511 -90 -704 -330 -101 338 241 -132 -347 -37 291 573 138 -340 -203
4608 -203 -24 342 298 -81 -648 -233 78 606 36 -298 -397 -54 456 592 131 -448 -275 84 635 232 -33
4629 -33 -250 -381 122 624 -34 -24 -561 161 204 371 -203 -625 -596 108 560 -84 -377 -188 -237 315 392 -104
$$ packed form
4484c32L59L78l37j49k67J02L50L79N4n22p76M72O13J09m79o00J14N20O51j51
4504D88o95l34K31N82K91j90n06p9k01P41K87n26n06j96P14M02k98l16o80N23
4524b68L40O14m03n93N3p2O72J89l84o51K61J66P38j71k51n52k7N79L15m41l83
4545b69k13M70M15k04L7p24n0P59M50m73n6m08M00L2L40m50n57M02L01J57J89
4566E48n24n03J91P02K6k12m00k89M91K93K08o98j20m8N63n2J86l13m10K68N11
4587D18n5k91n44J55M25K99J04o01o14L74K29M39r7l73k15L10L28K82m35m78J37
4608b03J79L66m4l79n67M15L11N28n70l34r9L43N10J36m61n79J73L59N51m03k65
4629c3k17j31N03N02o58J0n37P22M3J67n74m22K9P04M52o44k93J89m9N52P7m96
$$ plain form
4651 -104 -481 -361 -149 262 374 -200 -835 -400 5 794 11 -444 -559 246 102 524 -250 -340 -374 309 625
4672 625 192 -168 -342 -173 378 438 61 -549 -622 135 76 484 -333 -409 -502 477 570 24 -519 -547 13 463
4694 463 392 -135 -280 -332 98 573 559 -165 -443 0 269 680 213 -435 -617 199 616 415 -73 -730 -265
4715 -265 355 770 370 -295 -510 -147 365 294 66 -311 -536 13 533 580 116 -734 -319 -69 507 207 -408
4736 -408 -286 -254 427 382 -392 -509 -434 -7 384 -111 155 -432 -383 -125 860 112 -426 -420 55 271 138 14
4758 14 -438 -435 230 240 163 -296 -642 -11 350 376 -114 -241 -473 -35 286 290 -117 -464 -132 253 560 -29 -223
4781 -223 -354 -229 170 618 71 -554 -297 -82 359 272 -491 -495 -233 358 155 -511 62 -491 400 195 648
4802 648 -190 -644 -21 216 616 34 -600 -425 -92 73 373 -385 -522 -438 161 437 584 -10 -576 -251
$$ packed form
4651a04l77J20K12M11J12n74o35M35M05P89p83m55j15Q05j44M22p74r0l4O83L16
4672F25m33l60j74J69N51O0l77o10p3P57n9M08q17p6r3R79R3n46n43k8N60M50
4694D63p1n27j45n2M30M75j4p24k78M43K69M11m67o48j82Q16M17k01m88o57M65
4715b65O20M15m00o65k15L63N12p1k28l77k25N49N20M7m64q50M15K50N76l00o15
4736d08J22L2O81m5p74j17P5M27L91m95K66n87M9K58R85p48n38OM75K16j33j24
4758A4m52LO65J0p7m59l46O31L61K6m90j27k32M38L21Mm07l47L32L85L07n89j94
4781b23j31J25L99M48n47o25K57K15M41q7p63mK62N91k03o66N73n53Q91k05M53
4802F48q38m54O23K37M00n82o34J75L33J65L00p58j37Q4N99K76J47n94n66L25
$$ plain form
4822 -251 455 565 124 -418 -265 73 351 110 -334 -818 -425 190 315 283 -474 -348 -115 292 536 -43
4842 -43 -420 -301 8 353 435 130 -353 -557 511 391 246 -685 -399 -55 539 607 -43 -260 -79 59 185
4863 185 159 -404 -341 -1 284 312 316 -132 -624 -59 435 344 -237 -478 -591 -25 585 238 -497 -424 -533 353
4885 353 416 -371 -472 -394 87 182 422 -275 -445 -169 377 291 212 -283 -340 153 481 409 -92 -501 -606 128
4907 128 584 63 -285 -637 19 514 260 265 -159 -352 28 703 468 -86 -646 -322 26 371 293 -228 -481
4928 -481 -389 362 412 -264 -457 -491 43 489 70 -133 -830 -389 128 457 117 -65 -327 -42 317 476 -142
4949 -142 -846 -556 282 733 380 -41 -602 -149 159 364 121 -267 -697 18 487 439 112 -551 -452 -57 413
4970 413 167 -306 -384 -311 534 595 -30 -387 -320 344 481 318 -179 -407 -99 7 196 282 -560 -331 -124 548
$$ packed form
4822b51P06J10m41n42J53L38K78k41m44m84L93O15J25l2p57J26K33M07K44n79
4842d3l77J19L09L45Q2l05m83k04J068j20j45r31K86L44N94O8o50k17J81J38J26
4863A85k6n63O3L40K85K8Mm48m92N65M94r1n81k41j13N66O10l47p35P3j09Q86
4885C53O3p87j01P8M81R5K40o97j70K76N46q6p9m95n7M93L28p2n01m09j05P34
4907A28M56n21l48l52O56M95k54Nm24j93L80O75k35n54n60L24L48L45p8n21k53
4928d81R2P51N0o76j93l4N34M46m19k03o97M41N17L29l40j82k62K85L59J59o18
4949a42p04K90Q38M51l53m21n61M53L08K05k43l88m30P15M69m8l27o63R9L95M70
4970D13k46m73p8P3Q45O1o25l57O7O64J37j63m97k28L08J06J89Q6q42K29K07O72
$$ plain form
4992 548 496 -109 -637 -166 64 308 338 -254 -666 -211 219 428 135 -296 -519 -117 181 212 241 -509 -71
5013 -71 207 354 184 -130 -184 -41 288 680 -128 -413 -607 119 668 143 -91 -619 44 198 414 326 -293
5034 -293 -356 -91 578 419 18 -369 -194 -2 432 378 -395 -681 -250 -27 661 77 -458 -135 50 1 470
5055 470 -5 -529 -131 379 304 121 -139 -563 -12 177 246 -225 -633 -446 168 505 304 -319 -591 -189 257
5076 257 -38 86 -571 -316 -77 427 264 10 -394 -202 224 513 202 -377 -351 -132 604 241 173 -495 -388
5097 -388 -185 146 531 -316 -475 -338 243 107 155 -404 -259 -314 315 749 -186 -619 -360 12 689 376 -613
5118 -613 -456 72 334 225 -63 -231 -381 -133 559 118 -162 -454 -206 130 267 452 -314 -456 -221 274
5138 274 455 -251 -334 -255 -48 451 433 -93 -611 -184 125 555 120 -290 -493 24 292 539 43 -296 -633
$$ packed form
4992E48n2o05n28M71K30K44L0n92m12M55M30K09k93m31k23M02K98L1K9p50M38
5013g1K78J47j70l14n4J43L29L92q08k85j94P26N49n25k34n28O63J54K16q8o19
5034b93o3K65O69j59m01l87J75J92M34n4p73k86M31K23O88n84n35L23J85m9M69
5055D70m75n24L98N10p5j83k60m24N51J89O9m71m08J87O14L37k01o23k72M02M46
5076B57k95J24o57K55K39N04j63k54m04J92M26K89l11n79K6K19P36l63o8o68J07
5097c88K03L31L85q47j59J37N81j36M8n59J45n5O29M34r35m33K59L72O77l13r89
5118f13J57N28K62j09k88j68j50K48O92m41k80k92K48L36J37J85p66j42K35M95
5138B74J81p06q3P9K07M99j8n26n18M27L09M30m35m10k03N17K68K47m96l39l37
$$ plain form
5159 -633 254 175 340 -300 -355 -318 95 395 263 -374 -431 -275 122 169 -97 -590 -96 441 370 -167 -246 -376
5181 -376 81 157 388 9 -484 -526 109 483 471 -123 -536 115 340 202 73 -303 -59 -175 539 353 -86
5202 -86 -171 -155 214 476 411 -344 -166 -472 487 480 -122 -176 -171 193 741 -120 -296 -511 -250 123 705 417 -459
5225 -459 -494 188 643 363 294 -235 -259 -93 389 271 -294 -504 -179 223 331 -186 -281 -182 236 259 510 -273
5247 -273 -94 -150 108 593 396 -358 -117 137 310 495 -51 -596 -266 -49 184 407 -136 -321 -186 227
5267 227 505 30 -324 -371 30 391 324 45 -408 -245 104 606 273 -323 -414 -353 -9 338 52 -224 -489
5288 -489 82 100 400 98 161 -249 444 411 162 157 -212 -88 343 665 -215 -259 -213 317 221 173 -223 -497 62
5311 62 119 365 171 78 -494 18 284 118 75 -509 -170 226 321 354 -111 -521 -134 326 643 122 -247 -217
$$ packed form
5159f33Q87p9J65o40n5L7M13L00j32o37n7J56L97M7k66m93M94N37p1n37p9j30
5181c76M57P6K31l79m93m2O35L74j2n94m13O51K25j38j29l76K44j16P14j86m39
5202h6q5J6L69K62o5p55J78l06R59po02n4NL64N48q61j76k15K61L73N82k88q76
5225d59l5O82M55k80o9n29k4J66M82j18n65k10L25M02J08n17r5R9M18K3K51p83
5247b73J79n6K58M85j97p54K41K54J73J85n46n45L30K17K33K23n43j85J35M13
5267B27K78m75l54m7M01L61o7k79m53J63L49N02l33n96r1O1L44L47k86k76k65
5288d89N71J8L00l02O3m10O93l3k49nl69J24M31L22q80m4M6N30r6m8l96k74N59
5311F2N7K46j94r3n72N12K66j66m3n84L39L96R5L3m65m10L87M60L17n21l69L0
$$ plain form
5333 -217 150 635 143 -191 -643 -72 218 678 21 59 -314 -89 253 317 48 -508 -584 252 606 26 -216
5354 -216 -491 -98 235 710 368 -310 -654 -44 424 -23 -132 104 -262 24 166 69 -40 -307 -280 394 407
5375 407 81 -207 -390 193 367 100 -143 -146 -296 264 455 45 -50 -255 135 549 188 -39 -473 -203 148
5396 148 274 -126 -220 -213 -160 124 440 121 -608 -317 -83 346 286 -154 -68 -294 -30 336 58 24 -85 226
5418 226 442 303 6 -247 -405 237 662 207 -513 -360 -390 105 506 -132 -102 -478 126 707 99 320 -399
5439 -399 -441 134 207 2 -183 -411 -144 39 351 88 -220 -387 441 551 334 -15 -420 87 -58 413 302
5460 302 -236 -505 123 272 404 -56 -428 -262 -259 144 125 -139 -549 -203 267 487 -98 -98 -457 -149 428 400
5482 400 -287 -387 -555 181 482 635 -248 -552 -27 379 288 -25 -305 -712 -62 546 261 -271 -202 -113 -74
$$ packed form
5333b17L67M85m92l34m52N71K90M60o57L8l73K25L42O4k69n56p6Q36L54n80k42
5354b16k75L93L33M75l42o78l44O10M68m47j09K36l66K86J42r7j09k67K7O74J3
5375D07l26k88j83N83J74k67k43lj50N60J91m10r5k05L90M14l61k27m34K70L51
5396A48J26m00r4PN3K84L16l19p29K91K34M29o0m40Q6k26K64L66k78l4j09L11
5418B26K16j39k97k53j58O42M25m55p20J53l0M95M01o38L0l76O04N81o08K21p19
5439c99m2N75P3k05j85k28K67J83L12k63l08j67Q28J10k17l49m05N07j45M71j11
5460C02n38k69O28J49J32m60l72J66LM03j9k64m10L46M70K20n85%l59L08N77k8
5482D00o87j00j68P36L01J53q83l04N25M06r1l13k80m07O50O08k85n32O9Q9L9
$$ plain form
5503 -74 228 52 -221 -205 141 463 511 -266 -335 -144 -95 282 84 -375 -567 36 105 441 31 -38 -304 152
5525 152 97 275 88 -450 46 94 434 35 -183 -360 -184 87 416 -206 -822 -525 219 525 235 161 -410
5546 -410 -48 110 94 295 -264 -117 -208 358 153 -88 -278 -398 -8 385 374 51 -334 -281 447 598 -209
5567 -209 -613 -30 58 406 268 -136 -550 -211 109 386 20 -326 -285 39 215 46 -10 -495 -294 248 375
5588 375 135 112 -481 -114 185 388 81 -319 -192 -19 454 209 -229 -600 -571 309 153 -11 -153 -415 -76
5609 -76 328 114 -6 -483 -297 -183 512 356 -477 -101 -83 120 92 98 -128 -265 -78 -233 -11 205 -315 -232
5631 -232 124 574 455 -40 -345 -219 141 166 23 -350 -388 -44 437 332 -175 -305 -44 212 162 -63 -287
5652 -287 -116 108 251 444 194 -296 -200 113 507 -125 -260 -381 -49 233 340 27 -511 -112 84 163 442
$$ packed form
5503g4L02j76k73J6L46L22M8p77o9J91M9L77j98m59j92O03O9L36m10o9k66M56
5525A52n5J78j87n38M96M8L40l99k18j77J76K71L29o22o16K97P44L06k90p4n71
5546d10L62J58j6K01n59J47r1N66k05k41j90j20L90L93j1l23l85N3P28J51q07
5567b09m04N83Q8L48j38m04m14L39L20K77l66l46M1L24J76j69n6m85K01N42J27
5588C75k40k3n93L67K99K03l07m00J27J73M73k45m38l71K9Q80j56j64j42k62L39
5609g6M04k14j20m77J86J14O95j56q33L76J8K03k8Ok26j37J87j55K22K16n20Q3
5631b32L56M50j19m95l05J26L60K5j43l73l8L44M81j05n07j30K61K56n0k25k24
5652b87J71K24J43J93k50m90R6L13L94o32j35j21L32K82J07l13n38L99J96P9K79
$$ plain form
5673 442 -81 -377 -253 -105 81 278 -404 -361 202 146 305 267 -440 -263 545 384 449 -269 -651 4 133
5694 133 200 72 -164 -277 7 449 259 154 -73 -446 300 480 77 47 -149 259 300 32 58 -192 -164 -84
5716 -84 44 225 -71 -432 -495 212 408 101 -367 -532 -158 -5 359 21 -269 -67 -338 360 76 -174 -359
5737 -359 -191 545 514 -226 -131 -265 139 264 315 33 -369 -419 239 246 225 -345 -196 65 326 300 175 -367 -194
5760 -194 -141 55 -49 -183 -442 -504 227 431 175 -117 -234 -154 465 219 -53 -296 -341 -40 577 72 -78
5781 -78 -203 7 351 445 55 -501 -160 -408 161 133 216 -227 -164 2 173 402 -280 -391 -25 47 -38 230
5803 230 -282 -180 -10 411 19 -503 -394 -243 157 546 280 -503 -202 -85 456 310 58 -388 -283 -101
5823 -101 370 334 186 -378 73 252 190 -274 -223 -192 -170 257 237 -94 -431 -439 317 552 336 84 -182 -57 282
$$ packed form
5673D42n23k96J24J48J86J97o82M3N63n6J59l8p07J77Q08j61O5p18l82O55J29
5694A33O7j28k36j13K84M42j90j05k27l73P46J80m03l0j96M08M1k68K6k50K8Q0
5716h4J28J81k96l61o3P07J96l07m68j65L74J53L64l38k90K02k71O98k84k50j85
5737c59J68P36l1p40R5j34M04J25N1k82m02n0O58Pk1n70J49K61K61k6j25n42J73
5760a94N3J96j04j34k59o2P31K04k56k92j17Q0O19k46k72k43m5L01O17n05j50
5781g8j25K10L44R4l90n56L41k48N69k8Q3m43O3J66J71K29o82j11L66P2q5K68
5803B30n12J02J70M21l92n22J09J51M00L89k66p83L01J17N41j46k52m46J05J82
5823a01M71l6j48n64M51J79o2m64N1L1K2M27k0l31l37qP56K35k16k52k66J25L39
$$ plain form
5846 282 425 382 -302 -486 203 294 241 -28 -448 -183 436 165 105 -299 -316 -89 -157 84 -213 -181 -78 0 464
5869 464 201 -182 -195 47 17 -72 -106 113 60 11 394 215 -330 -48 -91 32 397 178 33 -74 -104 23 466
5892 466 -250 -151 -369 97 256 196 -166 -332 17 47 439 45 -425 -295 -49 534 186 144 -408 -356 293 375
5914 375 -205 -354 -438 -29 207 227 135 -284 -527 10 325 201 82 -290 -219 242 49 33 -106 -561 57 269
5936 269 68 -25 -200 -149 281 383 -24 -250 -506 -112 206 160 96 -389 -228 -59 361 595 67 -293 -338 30
5958 30 386 27 -168 -390 -84 173 137 -180 -384 -56 46 404 -62 -250 -140 -273 107 275 175 -199 -271
5979 -271 -187 62 28 -35 -70 -88 -286 -67 288 -403 -360 -277 81 428 -11 -211 -321 -312 488 294 -2 -122 -208
6002 -208 21 339 48 -41 -189 -211 117 186 -59 -529 -188 -7 -114 365 21 -456 -119 374 468 126 -443
$$ packed form
5846B82J43m3o84j84O89R1n3k69m20K65O19k71o0m04j7K27o8K41k97L2J03P8M64
5869D64k63l83j3K42l0q9l4K19n3m9L83j79n45K82m3J23L65k19j45j07l0J27M43
5892D66p16R9k18M66J59o0l62j66L49L0L92l94m70J30K46N83l48m2n52N2O49Q2
5914C75n80j49q4M09K36K0r2m19k43N37L15j24j19l72P1M61j93j6j39m55O18K12
5936B69k01r3j75N1M30J02m07k26k56L94L18m6o4m85J61J69M20K34n28l60m5L68
5958C0L56l59j95k22L06K57l6l17k04L28J02L58m66j88J10j33L80J68j00l74p2
5979b71Q4K49l4o3l5j8j98K19L55o91M3Q3L58L47m39k00j10RQ00j94k96j20q6
6002b08K29L18k91q9j48k2L28O9k45m70L41J81j07M79l44m77L37M93R4l42n69
$$ plain form
6023 -443 -82 -37 364 0 -238 -312 63 92 107 39 -21 -155 36 -10 53 -111 -10 -130 173 89 -80 -115 -334
6046 -334 89 472 286 8 -433 -520 282 310 159 21 -370 -344 149 366 414 -398 -315 -384 230 37 -70 -48
6068 -48 -199 53 226 349 -225 -339 -36 106 421 -108 -227 -159 -137 306 262 -110 -190 -346 -188 192 226 -83
6090 -83 -136 353 -168 136 -95 -366 -331 145 318 274 -373 -189 -169 -216 178 161 -372 -506 -217 20 505 156
6112 156 -45 -277 48 475 65 -195 -323 -274 29 422 185 -304 -245 -154 387 376 167 -670 -28 126 412
6133 412 277 -113 -337 -101 198 221 -439 -25 -125 222 228 71 44 -391 -8 -4 189 170 -213 -144 -273 219 42
6156 42 -103 -747 -40 -104 177 32 -422 -283 -214 118 325 -173 -140 -77 44 543 -39 -94 -56 -157 266 65
6178 65 132 127 -225 -49 272 446 133 -12 -309 -9 210 351 -128 -313 -180 -127 174 16 -418 -263 -235 247
$$ packed form
6023d43L61M5M01l64k38p4L75K9J5o8o0j34J91m6O3j64J01j20L03q4j69l5k19
6046c34M23L83j86k78m41q7Q02K8j51j38l91K6M93K17M8q12Q3o9O14j93j07K2
6068d8j51K52J73J23n74j14L03J42L15n29j19O8K2M43m4l72q0j56J58L80L4l09
6090h3n3M89n21L04k31k71L5M76J73m4o47J84K0m7L94j7n33j34K89K37M85l49
6112A56k01k32L25M27m10k60j28M9L03L93k37m89N9R1N41j1k09q37O42J54K86
6133D12j35l90k24K36K99K3o60M14j00L47Oj57k7m35L83MJ93j9l83O9j29M92j77
6156D2j45o44P07o4K81j45m54J39O9L32K07m98L3O3J21M99n82n5L8j01M23k01
6178F5O7nl52J76L21J74l13j45k97L00K19J41m79j85J33N3L01j58m34J55K8M82
$$ plain form
6200 247 408 160 -113 -40 -32 379 250 -57 -447 68 190 181 -21 -148 -514 162 176 227 -68 -172 -135 229 235
6223 235 272 -79 -93 -180 240 130 -139 -180 -367 142 243 31 -289 -227 -182 4 435 -49 -323 -69 -305 194
6245 194 11 -260 -327 -239 59 449 -137 -198 -443 -197 84 422 -47 -301 -519 323 384 98 -243 -406 -225
6266 -225 326 216 -58 -263 -60 201 362 439 59 -94 -186 10 228 326 -27 -171 -118 198 178 59 -256 -545
6288 -545 81 91 133 -163 -91 -246 21 120 293 -289 -201 -78 269 -38 -42 -393 -523 320 188 384 181 -597
6310 -597 6 165 239 -48 -270 -103 -23 437 149 54 -532 -241 -31 93 174 -244 -366 -344 368 453 52 -187
6332 -187 -79 120 111 338 -216 -375 -220 38 -91 271 99 -537 56 163 272 90 -212 -309 197 361 397
6353 397 -255 -126 -13 -14 267 -91 -280 -88 108 78 -106 -393 -341 -248 251 474 290 -262 -23 17 218 384
$$ packed form
6200B47J61k48k73P3QM11j29l07l90N15J22rk02j27l66O76J4N1k95j04L7L64O
6223B35L7l51j4q7M20j10k69m1j87N09J01k12l20O2M5J86M31m84k74K54k36M99
6245A94j83k71o7Q8K98L90n86o1k45K46K81L38m69k54k18Q42O1k86l41j63J81
6266b25N51j10k74k05K03K61J61P7l80j53r2J96K18R8l53j44N3L16k0j19l15k89
6288e45O26J0M2k96P2j55K67R9J73n82Q8J23L47l07ml51j30Q43j32J96k03p78
6310e97O03J59P4k87k22J67Q0M60k88r5n86K91K10J24Q1m18j22K2P12Q5m01k39
6332a87J08J99rK27n54j59J55K58j29L62j72o36N93J07J09j82l02r7N06J64L6
6353C97o52J29J13jK81l58j89J92J96l0j84k87N2R3M99K23j84n52K39M0K01J66
$$ plain form
6375 384 258 -294 -169 -337 227 -29 26 -218 29 142 255 133 -51 -186 -273 411 81 179 -269 -279 270
6396 270 85 39 -99 -166 -46 48 475 168 -300 -431 313 266 187 -220 -369 242 -158 454 169 -22 -166 -134
6418 -134 236 241 -92 -547 -226 -4 185 242 -86 -328 -267 53 261 75 -334 -442 -202 141 192 113 -354 44
6440 44 77 202 95 -435 -119 -245 129 5 -80 62 -135 109 51 323 -122 -244 -182 -92 247 11 -480 -250
6462 -250 -42 396 174 151 -358 -349 287 247 -25 -241 -27 -258 -51 396 137 -455 -544 -67 164 370 161 -286
6484 -286 -413 485 225 22 -246 89 -84 332 642 142 -47 -391 54 604 -18 117 -355 -345 11 170
6504 170 -32 -160 -461 -181 120 60 232 -162 -289 109 761 144 10 -22 32 447 502 158 -104 -191 24 265
6526 265 519 -116 -150 47 191 205 -87 64 -426 167 240 252 16 -609 -242 138 240 345 -59 -385 -316 236
$$ packed form
6375C84j26n52J25j68N64k56N5k44K47J13J13j22j84j35q7O84l30R8m48j0N49
6396B70j85m6j38o7J20R4M27l07m68j31P44m7p9m07j49O11m00O12k85j91j44L2
6418a34L70Nl33m55L21K22J89N7l28k42O1L20K08j86m09j08K40L43N1p9m67L98
6440D4L3J25j07n30L16j26L74j24q5J42j97K44n8K72m45j22O2R0L39k36m91K30
6462b50K08M38k22k3n09RO36m0k72k16K14k31K07M47k59n92q9M77K31K06k09m47
6484b86j27Q98k60k03k68L35j73M16L10n00j89l44M45N50o22J35m72J0L56J59
6504A70k02j28l01K80L01o0J72l94j27L98O52o17j34l2N4M15N5l44k62q7K15K41
6526B65K54o35l4J97J44J4k92J51m90N93P3J2k36o25L67L80J02J05m04l26O9N52
$$ plain form
6548 236 391 40 -93 -201 131 256 318 -313 -497 -56 -195 495 272 -356 -556 172 327 334 22 -80 -376
6569 -376 103 363 445 153 -376 -234 -41 266 278 -533 -228 68 275 354 127 -777 -84 273 308 -27 -229
6590 -229 18 -269 79 340 54 -432 -319 191 471 34 -24 -114 243 251 124 170 -339 -626 -28 565 495 110
6612 110 -405 -287 -36 -20 68 -83 -108 -295 -88 367 342 -319 -375 -113 230 269 177 -435 -4 112 170 -10 -340
6635 -340 -123 -413 217 421 -57 -573 -284 235 105 324 109 -272 -429 126 598 -264 -119 -570 135 -32
6655 -32 180 -320 -196 -276 219 271 244 19 -237 8 115 368 111 69 51 -133 126 255 189 -22 -54 145 406
6678 406 -91 -169 -230 74 179 195 -152 -332 -143 331 387 150 -71 -340 -193 173 330 496 -229 -133 45 362
6700 362 382 -99 -222 -326 107 54 194 -542 -110 -346 73 -45 -11 -359 -7 59 157 297 147 -479 -232 237
$$ packed form
6548B36J55l51j33j08L32J25O2o31j84M41j39O90k23o28k00P28J55Pl12j02k96
6569c76M79K60Q2k92n29J42J93L07J2q11L05K96K07P9k27r04O93L57L5l35k02
6590b29K47k87L48K61k86m86J13N10K80m37n8r0L57Qj27M6n09k87N98N93p0l85
6612A10n15J18K51J6Q8j51k5j87K07M55k5o61n6K62L43L9r2o12M31J16N8j80l30
6635c40K17k90O30K04m78n16K89N19j30K19k15l81j57N55M72q62J45m51P05j67
6655c2K12n00J24q0M95N2k7k25k56K45J07K53k57m2j8j84K59J29o6k11l2J99K61
6678D06m97p8o1L04J05J6l47j80J89M74N6k37k21k69J47L66J57J66p25R6J78L17
6700C62K0m81j23j04M33n3J40p36M32k36M19j18L4l48L52O6R8J40j50o26K47M69
$$ plain form
6722 237 321 -15 -69 -633 -113 80 434 545 -302 -28 1 161 53 -97 -202 -253 181 256 205 -85 -483 29
6744 29 181 432 -268 -544 -101 85 286 257 -352 -325 -328 470 407 -78 -134 -377 45 420 -21 -169 -617 -47
6766 -47 386 -142 168 -275 -320 117 169 109 -144 -664 -391 128 590 105 -7 -290 -61 412 271 25 -461
6787 -461 -509 157 214 222 -74 -376 -76 -89 268 -74 -116 -210 -40 -104 138 -19 -425 -208 172 402 207 -36 -134
6810 -134 239 217 456 166 34 5 -51 371 51 -151 -109 -310 -97 267 239 -358 -354 -140 242 49 2 -113 -231
6833 -231 53 30 221 -228 -112 18 288 353 -88 -201 -518 -21 457 66 197 -290 -280 10 800 104 -230
6854 -230 -353 -309 181 122 16 -386 -356 -323 121 470 302 -480 -203 46 153 209 -98 -608 -21 318 -146 -119
6876 -119 -302 -629 -205 229 -276 -90 -203 -318 179 417 -11 -85 -165 -126 289 34 28 -493 18 289 485 280
$$ packed form
6722B37Q4l36n4n64N20J93L54J11q47K74K9J60j08j50j05n1M34P5n1k90l98N12
6744B9J52K51p00k76M43J86K01k9o09K7lP98o3m85n6k43M22L75m41j48m48N70
6766d7M33n28L10m43m5M37N2o0k53n20K73N19M62m85j12k83K29M73j41k46m86
6787d61m8O66N7Qk96l02L00j3L57l42m2r4J70o4K42j57m06K17L80K30j95k43r8
6810a34L73k2K39k90j32k9n6M22l20k02M2k01K13L64k8n97MK14L82j93m7j15j18
6833b31K84k3J91m49J16J30K70O5m41j13l17M97M78l91J31m87J0K90P90o96l34
6854b30j23M4M90n9j06m02L0L3M44L49j68p82K77K49J07N6l07n10N87L39m64K7
6876a19j83l27M24M34n05J86j13j15M97K38m28p4q0L9M15k55on21N11K71J96k05
$$ plain form
6898 280 -48 -201 23 293 452 314 -15 -282 49 244 165 -133 -297 28 153 624 -214 -225 -332 -22 363
6919 363 72 128 -58 -92 276 311 545 -72 -402 -126 173 357 -5 -334 -137 183 83 74 112 -269 -358 211
6941 211 145 145 -321 -387 -87 161 80 -202 -288 -95 32 297 268 -348 -130 -62 76 282 48 -109 -100 -340 -7
6964 -7 118 -156 -332 -334 193 345 393 -619 -235 -296 89 -1 158 -440 -450 -319 75 178 62 -380 -464 186 225
6987 225 241 31 -547 51 217 391 -153 -165 12 -217 298 161 -172 -506 -126 88 555 309 -84 -207 58
7008 58 443 286 -117 -434 -449 464 386 -11 -115 -346 -378 450 61 184 -29 -166 60 -86 422 286 69
7029 69 -144 415 71 214 -254 -80 -110 377 351 78 -328 -181 -55 201 564 152 -207 165 177 256 110 -103
7051 -103 -77 -140 404 -69 -204 -391 -367 417 118 46 53 -564 -89 47 190 -90 65 -546 3 324 185 94
$$ packed form
6898B80l28j53K24K70J59j38l29k67L31J95p9k98j64L25J25M71q38j1j07L10L85
6919C63k91N6j86l4L68L5K34o17l30K76K99J84l62l29J97L20j00rL8l81q9N69
6941B11o6%m66o6L00K48q1k82q6J93J27K65k9o16K18O8J38K06k34j57Rk40L33
6964gJ25k74j76kN27J52M8j012L84o1L85r0J59n98j0J31L94J03j16m42q4O50L9
6987B25J6k10n78N98J66J74n44j2J77k29N15j37l33l34L80K14M67k46l93j23K65
7008E8L85j57m03l17j5R13p8l97j04k31l2Q28l89J23k13j37K26j46N08j36k17
7029F9k13N59l44J43m68J74l0M87k6k73m06J47J26K56L63m12l59L72J2P9j46k13
7051a03K6o3N44m73j35j87K4P84k99p2Po17M75J36J43k80J55o11N49L21j39r1
$$ plain form
7073 94 -267 -164 172 509 82 -308 -337 185 90 578 325 -336 -162 128 343 -16 -42 -256 81 96 491 96
7095 96 -42 -242 43 387 183 57 -257 -104 242 445 9 -85 67 21 -16 -129 -74 -254 -51 192 -69 193
7117 193 -72 -256 -248 -13 403 14 -157 -264 -175 -47 422 -212 -365 -427 282 241 93 -287 -621 -222 197 163
7139 163 123 -358 223 36 52 204 -181 -131 -13 92 -24 400 -179 -234 -211 334 107 -337 -230 -392 -75 94
7161 94 407 -228 -50 -136 1 324 -16 134 -395 213 357 287 424 -266 -139 61 602 42 -53 33 -162 -76
7183 -76 41 -179 -267 -202 240 200 -63 -87 -194 -66 330 402 169 34 -454 27 188 535 148 -40 -229 31
7205 31 497 71 -272 -266 -122 108 33 -43 -321 -474 -182 -72 -14 -18 -282 -245 -226 184 72 -237 -190 -48 323 394
7229 394 90 -290 12 -237 241 155 -91 121 -427 352 205 71 -148 -168 -88 182 334 266 -529 -259 -4
$$ packed form
7073I4l61J03L36L37m27l90k9N22r5M88k53o61J74K90K15l59k6k14L37J5L95l95
7095I6j38k00K85L44k04j26l14J53L46K03m36r4J52m6l7j13N5j80K03K43k61K62
7117A93k65j84QK35M16l89j71j07Q9J28M69o34j53o2P09m1j48l80l34L99M19l4
7139A63m0m81N81j87J6J52l85N0J18J05j16M24n79n5K3N45k27m44J07j62L17J69
7161I4L13o35J78q6J37L23l40J50n29O08J44p0J37o90J27K00N41n60r5Q6j95Q6
7183g6J17k20q8O5M42m0k63k4j07J28L96P2k33j35m88M81J61L47l87j88j89K60
7205C1M66m26l43OJ44K30p5p6k78j53K92J10N8mk64L7J9M10j12l09M7J42L71P1
7229C94l04l80L02k49M78q6k46K12n48P79j47j34k19k0Q0K70J52o8p95K70K55
$$ plain form
7250 -4 245 95 -218 -149 254 -38 235 0 4 -330 107 354 277 -78 -387 -254 86 307 162 -95 -521 -182
7272 -182 126 359 87 -418 -321 313 89 13 -287 -324 -326 486 306 53 -80 -244 -110 195 -138 -231 -314 -181
7294 -181 140 472 -73 -143 -612 55 226 222 112 -148 -285 -182 263 -9 -138 -144 -350 -37 416 -2 -172 -149
7316 -149 -14 337 359 -152 -492 -232 17 337 220 -121 -419 136 228 251 91 -278 -295 68 385 229 -190
7337 -190 -36 33 118 258 297 -122 -286 -76 89 292 97 -517 -156 48 317 332 -219 -304 85 -333 170 -52
7359 -52 -384 -79 -111 -40 102 -36 -407 -123 12 206 268 41 -245 -233 154 106 112 -252 -276 -93 482 65 -37
7382 -37 -93 -85 -202 276 8 33 -179 -78 235 376 -498 -344 -30 247 418 309 -220 -168 -196 86 65 -80 -161
7405 -161 19 148 277 351 121 -340 -443 45 354 59 -329 58 35 330 313 145 -478 -206 -258 -41 306
$$ packed form
7250dK49j50l13O9M03k92K73k35Ml34M37K47p7l55l09J33L40K21j45k57m26L39
7272a82L08K33k72n05R7O34k24p6l00l7kQ12j80k53j33j64J34L05l33r3q3J33
7294a81L21L32n45p0m69O67J71mj10k60j37J03M45k72j29ok06L13M53m18j70K3
7316a49J35L51K2n11l40K60K49L20j17l41k98N55R2K3j60l69j7L63L17j56m19
7337a90J54O9Q5J40L9m19j64K10J65K03j95o14L61K04K69J5n51q5L89m18N03k22
7359e2l32L05l2P1J42j38l71K84J35J94O2k27k86J2L87m8Ol64k4J83N75m17j02
7382c7n6Qj17M78k68K5k12J01L13J41q74J54L14K77J71j09n29N2k8K82k1j45q1
7405a61J80J29J29P4k30m61j03M88L09k95l88L87k3K95j7j68o23K72n2K17L47
$$ plain form
7426 306 -38 -227 -351 130 294 76 -312 79 -121 484 246 111 -286 -253 132 159 153 167 -288 -427 184 397
7448 397 11 -13 -465 -175 394 161 -66 13 2 -56 128 303 -129 -196 -164 70 438 25 -162 -301 -264 322
7470 322 -110 266 -142 -109 28 270 209 -460 171 10 71 141 -166 -130 -115 -130 118 160 -38 -224 -543 150 148
7493 148 173 -118 -403 115 41 152 221 -291 -249 -101 324 354 -78 -29 -77 90 293 83 -305 -329 114 440 203
7516 203 -3 -27 76 -76 -24 112 125 -635 -178 175 185 111 -354 -310 -104 67 217 -250 -51 -252 127 340
7538 340 359 46 -220 28 -100 -5 -109 -260 -250 235 166 -12 101 83 -220 113 158 -170 -244 -522 -14 99
7560 99 417 24 -201 -202 291 70 160 -28 -334 326 330 151 159 103 -243 205 -77 2 -175 -90 71 351 409 289
7584 289 -6 -139 -57 132 107 -16 36 112 194 173 124 -205 -220 -112 159 149 -219 -319 -140 -233 -72 96 -8
$$ packed form
7426C06l44j89j24M81J64k18l88L91k00O05k38j35l97L3L85K7oJ4m55j39O11K13
7448C97l86k4m52K90N69k33k27P9j1n8J84J75m32o7L2K34L68m13j87j39L7N86
7470C22m32L76m08L3J37K42o1o69O31j61O1P0l07L6J5j5K48M2j98j86l19O93k
7493A48K5k91k85N18p4J11O9n12M2J48M25L0m32M9m8J67K03k10l88k4M43L26k37
7516B03k06k4J03j52N2J36J3p60M57L53J0p4m65M4K06J71J50m67J99k01L79K13
7538C40J9l13k66K48j28R5j04j51J0M85o9j78J13j8l03L33M5l28p4k78N08J13
7560I9L18l93k25jM93k21R0j88l06O60Mj79Qn6l46M48k82P9j77Q5J61K80N8j20
7584B89k95j33Q2J89k5j23N2P6Q2k1m9l29j5J08K71j0l68j00J79r3J61J68j04
$$ plain form
7607 -8 -109 97 -93 314 73 -196 -161 -177 314 275 27 -121 -297 -92 52 125 -145 -187 132 -579 308 63
7629 63 -187 -344 -179 257 83 -56 -352 -290 -56 -136 -261 -202 -247 85 -59 186 -9 -10 -63 -231 265 159 33
7652 33 25 -216 64 448 -143 -485 -94 -226 190 145 -344 -169 12 -2 -28 165 -135 -358 -105 364 113 326
7674 326 -100 -155 313 113 137 124 -12 -251 -38 240 165 -297 -170 107 25 389 -163 -87 -123 -47 151 325 41
7697 41 -319 -193 67 392 8 96 -68 161 188 251 146 -217 57 149 351 264 -4 -127 -271 95 286 -50
7719 -50 -214 -371 -9 40 39 -119 -106 -158 -68 505 359 -87 3 -71 16 234 -152 -257 -51 -45 117 334 -185 -567
7743 -567 -207 316 362 256 -77 -281 -29 255 142 113 -456 -165 -231 42 59 42 -201 224 25 253 115 -567
7765 -567 172 182 164 53 -99 -88 116 -295 188 328 -91 -215 -251 -82 260 60 -203 -63 -147 280 -101 -106
$$ packed form
7607hj01K06j90M07k41k69L5j6M91l9k48j48j76K05J44P3k70m2L19p11Q87k45
7629F3k50j57J65M36j74j39k96O2K34q0j25N9m5L32j44K45j95jn3j68M96j06j26
7652C3qk41K80L84n91l42L91j32M16m5m89J75J81j4k6J93l00k23K53M69k51K13
7674C26m26n5M68k00K4j3j36k39K13K78p5m62J27K77q2L64n52P6l6P6J98J74k84
7697D1l60J26K60L25l84Q8j64K29K7O3j05l63K74R2K02q7k68j23j44L66J91l36
7719e0j64j57L62M9jj58J3n2R0N73j46m46R0p4Q7K18l86j05K06OJ62K17n19l82
7743e67L60N23M6j06l33k04K52K84j13k9n69K91o6K73J7j7k43M25j99K28j38o82
7765e67P39J0j8j11j52J1K04m11M83J40m19j24l6J69L42k00k63J40q4M27l81n
$$ plain form
7787 -106 -112 -162 -3 -132 88 -261 -78 208 -4 263 -156 -198 -206 7 391 229 -56 -259 -151 127 294 -216
7809 -216 204 -401 48 23 -10 -32 -180 -78 223 228 -156 -715 -48 8 -171 314 -168 -434 -437 7 -15 81 -111
7832 -111 -318 -199 -93 157 52 -173 108 -156 283 -189 -244 56 -189 -45 278 320 -151 283 -254 -63 214
7853 214 -61 -185 -70 118 -16 190 -153 -231 -272 61 139 -69 15 -377 -369 -70 91 176 -411 -193 -225 61 55
7876 55 -256 78 50 -195 -60 134 -443 -133 65 295 172 -52 -393 -45 -282 11 251 -226 -476 -8 69
7897 69 -49 597 -209 -3 -23 414 114 -26 142 -63 319 324 -18 15 52 -360 46 258 -183 -219 -207 438 -53
7920 -53 76 7 -365 -406 109 15 42 -222 -435 -11 216 332 -20 -297 -8 -4 84 35 83 -228 -263 -9 201 -292
7944 -292 -126 -152 244 -49 265 -299 -72 -40 77 176 39 -171 -159 -7 91 498 83 -213 -1 112 -150 -67
$$ packed form
7787a06on0J59j29K20l49J83K86k12K67m19m2qK13L84j62k85k03J08K78J67n10
7809b16M20o05M49k5l3k2j48J02L01Nl84n59O67N6j79M85m82k66lM44k2R6j92
7832a11k07J19J06K50j05k25K81k64M39m72n5L00k45J44L23M2m71M34n37J91K77
7853B14k75j24J15J88j34K06l43p8m1L33P8k08Q4l92QK99J61Q5n87K18l2K86o
7876E5l11L34k8k45J35J94n77L10J98K30j23k24l41L48k37K93K40m77k50M68P7
7897F9j18O46q06K06k0M37l00j40J68k05L82Nl42L3L7m12M06K12m41l6J2O45m91
7920e3J29o9l72m1N15r4K7k64k13M24K27J16l52k77K89MQ8m9M8l11l5K54K10m93
7944b92J66k6L96k93L14n64K27L2J17R9j37k10J2J52R8M07m15k96K12J13k62Q3
$$ plain form
7966 -67 72 -167 -44 -57 443 160 -595 -190 -212 227 48 -204 -250 -208 -271 102 294 -234 -118 -194 95 -5
7988 -5 -171 -409 -152 -110 14 248 -357 -69 -594 -52 67 -39 -271 -141 -138 -46 26 -118 -108 -103 -27 67 26 -153
8012 -153 -360 -172 69 170 -63 269 -277 8 240 381 59 -267 -365 90 252 426 11 35 -238 -41 81
8033 81 20 31 88 423 155 267 306 -122 72 334 102 -290 -159 -126 -267 225 80 -109 -99 68 117 227 138
8056 138 -173 -157 -29 43 -1 -327 -3 -448 -31 200 34 86 -184 -218 -69 -63 173 -18 -98 -98 123 204 -36 -181
8080 -181 -241 3 298 -12 -278 -37 112 234 226 205 15 -124 -3 -89 171 -113 11 -6 272 -80 -73 -55 -228
8103 -228 73 90 319 -122 -17 -79 -27 196 253 102 -210 113 226 -147 -203 -543 -195 192 444 96 266 -77
8125 -77 -179 -9 200 6 177 95 5 -124 -119 -4 -345 -425 -61 139 347 114 -457 46 -99 106 79 -160
$$ packed form
7966f7J39k39J23j3N00k83p55M05k2M39j79k52m6M2o3L73J92n28J16p6K89j00
7988ej66k38K57M2J24K34o05K88n25N42J19j06k32J30LR2P2j44J0NP6R4m1j79
8012a53k07J88K41J01k33L32n46K85K32J41l22l26r8M55J62J74m15K4k73J97J22
8033H1o1J1N7L35k68J12L9m28J94K62k32l92J31L3j41M92j45j89J0J67M9J10q9
8056A38l11J6J28P2m4l26L24m45M17K31j66N2k70l4J49OK36j91q0%K21Q1k40j45
8080a81o0K44K95l10k66K41J49J22qk1j90j39J21q6K60k84J24j7K78l52PJ8j73
8103b28L01J7K29m41J05o2N2K23N7j51l12L23J13l73n6l40L48L87K52l48J70l43
8125g7j02J70K09j94J71q2r0j29NJ15l41q0L64K00K08k33n71N03j45K05k7k39
$$ plain form
8147 -160 -94 -93 109 -21 -38 44 -176 35 213 215 -104 -198 114 -82 -4 88 -66 -123 55 53 96 181 -115 -66 81
8172 81 224 66 -45 -521 88 149 230 -23 -185 -207 -402 339 90 35 99 -178 41 159 303
$$ packed form
8147a60O6JK02j30j7Q2k20K11J78Kl19r4L12j96P8R2j54n7J78kM3Q5k96M9J47
8172H1J43j58j11m76O09O1Q1k53j62k2j95P41k49n5O4k77K19J18J44
8191C03
$$ Imaginary data points
##PAGE= N=2
##DATA TABLE= (X++(I..I)), XYDATA
$$ plain form
0 0 0 0 0 0 0 0 0 -3 8 -8 8 -8 16 -16 18 -24 32 -33 40 -48 56 -65 74 -86 98 -114 128 -147 168 -186 208
31 208 -236 265 -295 331 -368 408 -452 502 -557 618 -685 758 -837 928 -1029 1143 -1277 1427
49 1427 -1602 1810 -2060 2368 -2758 3270 -3973 5007 -6670 9787 -17597 74761 98156 -82418
63 -82418 -27116 -40513 -14497 109356 36467 -90692 -18237 -9608 4282 81589 7880 -68571
75 -68571 -14468 -20021 24686 90678 -17126 -83706 -14221 5576 55318 68949 -61282 -85906
87 -85906 16085 42089 50500 12960 -77211 -40230 35539 32644 40370 -11469 -78327 -7299 39892
100 39892 18542 41885 -22758 -91379 11558 64696 15980 14008 -42858 -76092 42220 72541
112 72541 -3354 -16786 -45431 -38247 59576 47943 -19985 -17043 -41746 -20867 68837 35494
$$ packed form
0@%%%%%%%lJ1j6J6j6K4l2L4m2N6o5P3q8J04j21J39j60J84k12K42k75L15l54L94
31B08m44N01n60O26o99P76q60R54j059J175j303J443j595J765j957K172k420K704
49A427l029L412l870M428n126O028p243Q980j1677J6457k7384R2358K3395j80574
63h2418N5302j3397K6016J23853p2889j27159P2455Q629J3890P7307p3709p6451
75f8571N4103n553M4707O5992j07804o6580O9485J9797M9742J3631j30231k4624
87h5906J01991K6004Q411l7540r0171L6981P5769k895P726n1839o6858P1028M7191
100C9892k1350K3343o4643o8621J02937N3138m8716j972n6866l3234J18312L0321
112G2541p5895j3432k8645P184R7823j1633o7928K942k4703K0879Q9704l3343
$$ plain form
124 35494 -32223 -22884 -37816 -870 80382 21833 -56656 -32880 -11629 30414 64249 -12365
136 -12365 -60452 -17393 9971 39729 38334 -34025 -44498 -703 9672 38707 31068 -45519
148 -45519 -44096 9563 23102 40016 12225 -60513 -37707 32186 39424 22532 -20127 -57215
160 -57215 -7821 43922 29601 2611 -31796 -41927 12087 41415 16341 -5267 -33500 -34229
172 -34229 23417 45600 8880 -22106 -38149 -15944 39107 40494 -8613 -36409 -29176 9320
184 9320 44151 19990 -22384 -31499 -16974 19447 41539 7191 -30774 -28746 -6258 28925 39422
197 39422 -6273 -43273 -23367 15365 38457 21310 -26567 -40549 -3473 29800 29066 360
209 360 -30993 -25528 7920 27070 20045 -4637 -30772 -22636 14464 34184 16201 -18694 -37764
$$ packed form
124C5494o7717R339j4932L6946Q1252n8549p8489K3776K1251M2043L3835p6614
136a2365m8087M3059K7364K9758j395p2359j0473M3795J0375K9035p639p6587
148d5519J423N3659J3539J6914k7791p2738K2806O9893P238j6892m2659l7088
160e7215M9394N1743j4321k6990l4407j0131N4014K9328k5074k1608k8233p29
172c4229N7646K2183l6720l0986j6043K2205N5051J387m9107k7796P233L8496
184I320L4831k4161m2374r115J4525L6421K2092l4348l7965K028K2488L5183J0497
197C9422m5695l7000J9906L8732K3092j7147m7877j3982L7076L3273p34k8706
209C60l1353N465L3448J9150p025k4682k6135Q136L7100J9720j7983l4895j9070
$$ plain form
222 -37764 -12728 32798 37073 -5175 -37239 -26444 12986 38498 17086 -23862 -31087 -5511
234 -5511 20821 26016 3166 -22150 -21752 -1765 19875 25993 707 -29722 -23962 7820 31641
247 31641 22825 -18114 -39325 -9063 28830 30439 515 -31754 -26414 12119 29914 13659 -10806
260 -10806 -26474 -13444 16530 23708 7884 -12756 -27243 -9722 24303 26286 179 -24944
272 -24944 -27237 6408 35378 16855 -18230 -28516 -11470 20852 29345 -251 -23460 -18003 -272
285 -272 21525 21623 -6429 -23441 -15577 5026 26919 18743 -17163 -29034 -7367 19327 28506 3187
299 3187 -29983 -21769 9709 25220 15697 -11426 -27159 -7890 15922 18908 7704 -13998 -23179
312 -23179 -3150 18472 19683 3308 -22205 -24367 6801 27932 15544 -11968 -28499 -11386
$$ packed form
222c7764K5036M5526M275m2248l2064J0795L9430K5512k1412m0948p225K5576
234e511K6332N195k2850k5316L98J9987K1640O118k5286l0429N760L1782K3821
247C1641q816m0939k1211L0262L7893J609k9924l2269N340L8533J7795j6255k4465
260a0806j5668J3030K9974P178j5824k0640j4487J7521L4025J983k6107k5123
272b4944k293L3645K8970j8523l5085j0286J7046L2322Q493k9596k3209N457J7731
285b72K1797R8k8052j7012P864K0603K1893q176l5906j1871K1667K6694R179k5319
299C187l3170Q214L1478J5511r523k7123j5733J9269K3812K986j1204k1702r181
312b3179K0029K1622J211j6375k5513k162L1168K1131j2388k7512j6531J7113
$$ plain form
324 -11386 22137 25601 -536 -21242 -19974 3447 23567 14377 -8619 -18858 -12616 7497 22411
337 22411 10235 -12550 -21231 -8946 16118 24900 2214 -22683 -19632 3902 24410 16945 -12358
350 -12358 -25050 -8137 14013 21226 5629 -17734 -19145 46 16670 17740 -681 -20748 -16675
363 -16675 6796 21644 13071 -10926 -24100 -7936 17344 21102 1892 -19281 -18480 3656 20212
376 20212 12855 -6355 -18817 -11231 8761 19246 8769 -11353 -20409 -7048 16268 20812 773
389 773 -20375 -18092 5419 23084 12901 -11820 -21699 -6728 14786 18457 1797 -15619 -15334
402 -15334 322 15119 13765 -1860 -16015 -14186 4256 19003 12759 -9306 -21535 -8468 15401
415 15401 21326 1676 -19989 -17562 4741 20356 11971 -9412 -18124 -6872 10351 15918 5034
$$ packed form
324a1386L3523L464k6137k0706J268K3421K0120r190k2996j0239O242K0113J4914
337B2411j2176k2785q681J2285K5064Q782k2686k4897L051K3534K0508p465k9303
350a2358j2692J6913K2150P213j5597k3363j411J9191J6624J070j8421k0067M073
363a6675K3471J4848q573k3997j3174J6164K5280L758j9210k1173Q01K2136J6556
376B0212p357j9210j2462P586J9992J0485j0477k0122r056J3361K3316M544k0039
389G73k1148K283K3511J7665j0183k4721r879J4971K1514L671j6660j7416K85
402a5334J5656J4797j354j5625j4155J829J8442J4747o244k2065j2229J3067K3869
415A5401N925j9650k1665K427K2303J5615q385k1383q712J1252J7223N567j0884
$$ plain form
428 5034 -11543 -15633 -3483 12467 16355 1538 -16747 -15846 3292 19560 13818 -9112 -21155
441 -21155 -7634 14285 18467 2081 -16107 -15166 2966 15744 10665 -3810 -14975 -10454 6238
454 6238 15945 8574 -7676 -17549 -7478 12902 18040 1953 -16173 -16698 3206 19808 11247 -9203
468 -9203 -16996 -7199 10731 16334 2261 -12207 -12043 -2161 11199 13875 -727 -13874 -11966 1456
482 1456 16274 12915 -8526 -19074 -6968 11507 17924 3115 -17195 -14527 4098 14791 10809
495 10809 -5450 -15962 -6792 7614 12021 6829 -7226 -15154 -4110 10924 13581 3822 -13539
508 -13539 -16241 3211 16827 10777 -5686 -17439 -8812 12588 15568 1193 -10783 -13549 -533
521 -533 14217 10214 -3250 -10455 -10682 2311 15827 7815 -7281 -13371 -7925 9613 17279 1335
$$ packed form
428E034j6577m090J2150J5950L888j4817j8285R01J9138J6268n742k2930j2043
441b1155J3521K1919M182j6386j8188R41J8132J2778n079j4475j1165M521J6692
454F238R707p371j6250r873J0071K0380N138j6087j8126n25J9904J6602q561k0450
468i203p793R797J7930N603j4073j4468J64R882J3360K676j4602j3147J908J3422
482A456J4818l359k1441j0548J2106J8475O417j4809k0310K668J8625J0693l982
495A0809j6259j0512R170J4406M407n192j4055p928J1044J5034K657r759j7361
508a3539k702J9452J3616o050j6463j1753Q627K1400K980j4375j1976k766J3016
521e33J4750m003j3464p205k27J2993J3516q012j5096o090N446J7538P666j5944
$$ plain form
535 1335 -13841 -12386 541 14819 12183 -7066 -14901 -5005 6155 13576 5926 -10101 -11907 -2055
549 -2055 8021 12996 2450 -13587 -11385 2266 13075 11822 -5627 -17605 -5533 9833 13087
562 13087 4023 -12168 -13923 2396 11727 7848 -731 -12262 -9568 5920 10750 6651 -3809 -14377
576 -14377 -6884 10602 12630 2687 -10065 -14756 945 16433 8577 -5750 -12433 -8166 8359
589 8359 14335 1433 -8606 -9515 -3645 9744 11481 -1022 -9614 -9436 -345 13574 10220 -6111
603 -6111 -12937 -7076 7006 15937 2954 -12924 -10508 645 11374 10881 -4428 -12779 -4876 3761
617 3761 9877 7515 -7226 -11759 -2660 5949 11512 4665 -11900 -11899 2492 10805 10452 -2460 -16090
632 -16090 -6238 9633 9937 3903 -7430 -13136 671 10747 6261 443 -8271 -10973 3146 11959
$$ packed form
535A335j5176J455J2927J4278k636j9249p835R896J1160P421p650j6027j806R852
549b055J0076M975j0546j6037K202J3651J0809j253j7449j1978J2072J5366L254
562A3087r064j6191j755J6319R331l879q579j1531K694J5488M830m099j0460j0568
576a4377P493J7486K028r943j2752m691J5701J5488p856j4327o683M267J6525
589H359N976j2902j0039r09N870J3389J737j2503q592J78R091J3919l354j6331
603f111o826N861J4082Q931j2983j5878K416J1153J0729m93j5309q351P903Q637
617C761O116k362j4741m533R099Q609N563o847j6565JJ4391Q313l53j2912j3630
632a6090R852J5871L04o034j1333n706J3807J0076m486n818q714k702J4119Q813
$$ plain form
646 11959 5585 -2203 -11010 -9289 8442 13687 1265 -8391 -11955 -1593 13966 9190 -5405 -9949
660 -9949 -6521 4529 13031 3171 -7568 -7427 -4751 6397 12095 397 -8903 -8052 -2132 11145
674 11145 11591 -6000 -12123 -4857 3823 13348 5305 -12463 -9312 2050 6286 10257 190 -12768
688 -12768 -4861 4398 5550 8403 -1916 -13963 -3609 6999 7581 5692 -7701 -14581 2025 11992
702 11992 6222 -883 -11189 -9090 8096 10840 899 -4562 -9155 -3691 9210 7746 -670 -5082
716 -5082 -9812 -1331 11728 7226 -3415 -8619 -8259 5329 13699 1604 -8729 -8229 -2453 10062
730 10062 10571 -4849 -8714 -3888 1084 9617 6686 -7106 -7737 -2220 2832 10940 4600 -10161 -8850
745 -8850 825 7080 10405 -1207 -13613 -5265 6477 8205 5343 -6693 -11362 990 8011 5324
$$ packed form
646A1959o374p788q807J721J7731N245j2422r656l564J0362J5559m776j4595m544
660i949L428J1050Q502r860j0739J41K676J1148N698j1698r300Q51N920J3277
674A1145M46j7591o123P266Q680R525q043j7768L151J1362M236L971j0067j2958
688a2768P907R259J152K853j0319j2047J0354J0608N82j889j3393o880J6606R967
702A1992n770p105j0306K099J7186K744r941n461m593N464J2901j464q416m412
716e082m730Q481J3059m502j0641n204L60J3588Q370j2095j0333N00N776J2515
730A0062N09j5420l865M826M972Q533k931j3792o31N517N052Q108o340j4761J311
745h850R675O255L325j1612j2406Q348J1742J728k862j2036m669J2352P021k687
$$ plain form
759 5324 1492 -7313 -9037 2863 8111 5067 -589 -10145 -7406 7092 9666 2444 -5441 -11164 -1983
774 -1983 11463 7186 -3492 -7696 -6646 3067 10896 2805 -5567 -5968 -4051 4457 10060 1149 -7170
789 -7170 -6562 -1897 7651 9667 -2733 -10317 -4811 3814 10030 4858 -8370 -9501 201 6825 7421
804 7421 -682 -8633 -5497 2597 6338 5456 -2130 -8661 -4044 4226 8085 4000 -6443 -9918 -587
819 -587 8412 7522 -1025 -9469 -6849 5174 8976 2709 -4541 -7906 -2644 6511 7049 181 -5619 -6609
835 -6609 -786 7706 7150 -2252 -7906 -5567 3374 10152 3994 -6973 -8189 -724 6859 7419 -874
850 -874 -8263 -5400 2637 6887 4274 -2771 -7706 -3686 4394 6945 2941 -5297 -8802 -1013 7935
865 7935 6866 -1244 -8500 -6091 3936 8762 2593 -5126 -7222 -1543 6250 6404 -124 -5444 -5756
$$ packed form
759E324l832q805j724J1900N248l044n656r556K739J4498K574p222p885n723R181
774a983J3446m277j0678m204J050R713P829q091q372m01J917Q508N603q911q319
789g170O08M665R548K016j2400p584N506Q625O216n172j3228j131R702O624N96
804G421q103p951L136Q094L741q82p586o531M617Q270L859m085j0443l475R331
819e87Q999q90q547q444K620J2023L802o267p250l365N262R155N38o868n800r90
835f609N823Q492n56r402n654K339Q941O778o158j0967j216P465P583N60q293
850h74p389K863Q037M250k613p045m935M020Q080K551m004q238l505P789Q948
865G935j069q110p256K409J0027M826o169p719k096N679P793J54o528n320l12
$$ plain form
880 -5756 -328 6934 5672 -1889 -6714 -5151 3130 9266 3663 -6088 -7637 -1413 6679 7902 -1660
895 -1660 -8458 -4284 2756 6992 4291 -4301 -7275 -1265 3421 5833 2820 -5389 -7178 150 5859
910 5859 6207 142 -8340 -5625 3777 7436 3358 -4452 -8121 -1445 6951 5345 -582 -5580 -6068 1458
926 1458 7003 3584 -1662 -5399 -5071 3221 7956 2143 -4668 -6796 -2156 6776 7552 -1892 -7351 -4656
942 -4656 2202 7401 3578 -5029 -5921 -1314 3238 6180 1500 -5590 -5018 36 4857 6892 -711 -7561
958 -7561 -4456 3022 6956 4100 -4680 -8148 -373 6081 5513 -573 -6399 -5107 2679 5509 2537
973 2537 -1602 -5961 -3366 3893 5239 2002 -3259 -6960 -1830 6461 5899 -541 -5856 -5713 2517 8066
989 8066 2659 -4402 -6000 -2067 4884 5990 -510 -4878 -4410 -58 5037 4563 -1964 -5806 -3566 1648
$$ packed form
880e756N428P262j262p561m825J563Q281O136n603r751j549O224Q092J223r562
895a660o798M174P040M236k701q592k974O010M686K412l013q209j789P328N709
910E859L48o065q482K715R402L659m078p810l669O676Q396j606n927m998m88P526
926A458N545l419n246l737L28Q292M735n813o811k128M640Q932P76r444n459K695
942d656O858N199l823q607q92M607M552K942m680p090N72N054M821K035p603o850
958g561L105P478L934k856q780l468P775O454n68o086n826J292P786K830k972
973B537m139m359K595P259J346l237n261l701N130Q291n62o440n315J43Q230N549
989H066n407p061j598L933O951J106o500m368M68M352N095m74o527l842K240N214
$$ plain form
1005 1648 6605 3510 -4644 -6692 -920 4637 6066 -66 -6741 -4472 2136 5776 3221 -2523 -6258
1020 -6258 -1571 3804 4818 1976 -3768 -5679 -459 4943 4607 -160 -5900 -5058 2971 6851 2827
1035 2827 -3593 -5783 -1455 5378 4893 -400 -4871 -4015 689 5087 3527 -1455 -4712 -3498 1708
1050 1708 6071 2756 -3654 -5556 -1394 4812 5930 -453 -6045 -4016 1970 5977 3009 -3299 -5258
1065 -5258 -1152 3629 4606 838 -4188 -4241 -317 4068 4265 -404 -5475 -4274 1656 6028 3169 -3402
1081 -3402 -5929 -1534 4489 5343 -152 -5213 -4267 1461 5082 2725 -1917 -4625 -2660 2480 4746
1096 4746 2047 -3242 -5275 -815 4300 4683 -164 -5275 -4074 1728 5307 2839 -2860 -5348 -1186
1111 -1186 3493 4319 611 -3342 -3835 316 4170 3611 -572 -4222 -3574 1571 5202 2423 -2934 -4869
$$ packed form
1005A648M957l095q154k048N772N557J429o132o675K269O608L640k555n744l735
1020f258M687N375J014k842n744j911N220N402l36m767n740Q42Q029L880m024
1035B827o420k190M328O833m85n293m471Q56M704M398j560m982l257J214N206
1050A708M363l315o410j902M162O206J118o383n592K029N986M007k968o308j959
1065e258M106M781R77l768n026n3L924M385J97m669n071J201N930M372k859o571
1081c402k527M395O023Q54n495n061R46N728L621k357m642k708J965N140K266
1096D746k699n289k033M460N115L83m847n111J201N802L579k468n699k488M162
1111a186M679Q26l708l953m93M151L854n59m183l650O48N145L631k779n357j935
$$ plain form
1127 -4869 -1359 4485 5217 -545 -4848 -3611 1112 4818 2678 -2327 -3923 -1533 2216 3791 1490
1142 1490 -2803 -3840 -1138 3113 4354 228 -5030 -3938 1296 5379 3149 -2670 -5671 -654 3800
1157 3800 4058 470 -4167 -3615 1220 3561 2680 -555 -3673 -2871 1582 3797 1906 -1705 -5034 -1883
1173 -1883 3732 4662 72 -3705 -4524 1322 5155 2562 -2318 -3972 -1805 2759 4188 630 -2611
1188 -2611 -3061 -860 3369 3674 -691 -3513 -3121 479 4468 3023 -2749 -4343 -1207 2766 4284 515
1204 515 -4415 -3126 861 3214 3115 -859 -4217 -1661 1608 3381 2190 -2101 -4334 -713 3247 3373
1220 3373 846 -4014 -3966 1403 4439 2288 -1366 -4433 -2084 3324 3668 7 -2164 -2974 -502 3389
1236 3389 2878 -669 -2705 -3168 485 4101 1918 -1955 -3792 -2142 2548 4704 393 -3735 -3117 253
$$ packed form
1127d869L510N844P32n762m303J237M723L706k140n005j596K390L749J575k301
1142A490m293j037K702M251J241m126n258J092N234M083k230n819l001N017M454
1157C800K58l588m637N52M835K341q81l235l118Q02M453K215j891l611l329L151
1173a883N615R30m590l777q19N846L833k593m880j654K167M564J429l558l241
1188b611m50K201M229L05m365k822L92L600L989j445n772j594L136L973J518l769
1204E15m930J289L987K353r9l974l358K556L269J773j191m291k233L621L960J26
1220C373k527m860M8N369L036k151l654l067K349N408L44l661k171q10K472L891
1236C389n11l547k036m63L653L616k183l873j837J650M690K156m311m128O18L370
$$ plain form
1252 253 3633 3214 -1895 -3523 -1149 1326 2968 1794 -2375 -3518 -451 2184 3306 690 -3599
1267 -3599 -3045 692 3197 2598 -1287 -4285 -1465 2666 2825 750 -2572 -3258 212 3426 1978 40
1283 40 -2743 -2728 837 3344 1515 -1510 -3384 -1680 2648 3795 37 -2838 -3117 -103 3766 2303
1299 2303 -1661 -2901 -1235 1325 3319 1192 -2154 -2376 -732 2089 3332 476 -2841 -2622 416
1314 416 2866 2860 -1125 -4017 -1325 2316 3091 588 -3302 -3223 420 2544 2003 -330 -2643 -2106 1527
1331 1527 2414 1391 -748 -3022 -1472 2251 3057 583 -2453 -3360 164 3646 2298 -1092 -3122 -1844
1347 -1844 1862 3035 593 -2431 -2144 -652 2291 2458 29 -2459 -2016 173 2573 2547 -1053 -3164
1363 -3164 -1491 1418 3611 1268 -3102 -2402 251 2535 2387 -915 -3140 -1602 1207 2256 1523 -1159
$$ packed form
1252B53L380m19n109j628K374K475J642j174m169j143L067K635J122k616m289
1267c599N54L737K505n99l885k998K820M131J59k075l322o86L470L214j448j938
1283D0k783J5L565K507j829l025j874J704M328J147l758k875k79L014L869j463
1299B303l964j240J666K560J994k127l346k22J644K821J243k856l317K19L038
1314D16K450ol985k892K692L641P75k503l890P9L643K124n41k333k313N37L633
1331A527Q87j023k139k274J550L723Q06k474l036r07L524L482j348l390k030J278
1347a844L706J173k442l024K87J492K943J67k429k488M43K189K400k6l600k111
1363c164J673K909K193k343m370P00K653K284j48l302k225J538K809J049p33k682
$$ plain form
1379 -1159 -3251 -570 1762 2297 1039 -2275 -3207 54 3009 1938 -712 -3036 -1798 1964 2800 342
1395 342 -1719 -2360 -736 2457 2333 -374 -1805 -2026 -22 2424 1936 -729 -2452 -1883 1175 3345
1411 3345 1093 -2659 -2335 -305 2410 2976 -1033 -3400 -1505 1176 2657 1218 -1706 -2546 -477 1743
1427 1743 1943 475 -2410 -2429 369 2049 2201 -286 -2858 -1930 1390 2896 1029 -1656 -2996 -106
1443 -106 2419 2075 -99 -2112 -1872 164 2478 1295 -537 -2092 -1360 1448 3001 421 -1758 -2382
1459 -2382 -756 2533 2556 -641 -2388 -1449 879 2711 1149 -1611 -2226 -716 1485 2060 463 -1710
1475 -1710 -1939 -428 2069 2393 -445 -2574 -1838 1138 2537 1437 -1996 -2760 -338 2437 1976 4
1491 4 -2130 -1748 822 2022 1133 -322 -1956 -1617 1238 2110 929 -1295 -2567 -679 2417 2378 -567
$$ packed form
1379a159k092K681K332N35j258l314r32L261K955j071k650k324J238L762Q36k458
1395C42k061o41J624L193j24k707j431k21K004K446m88k665j723N69L058K170
1411C345k252l752L24K030K715N66m009k367J895K681J481j439k924q40K069K220
1427A743K00j468k885j9K798J680J52k487k572R28L320J506j867k685j340K890
1443a06K525l44k174k013K40K036K314j183j832j555P32K808J553k580k179o24
1459b382J626L289K3l197j747R39K328J832j562k760o15J510K201N75j597k173
1475a710k29J511K497L24k838k129P36K976J399j100l433p64K422K775m61j972
1491Dk134L82K570J200q89j455j634L39K855Q72j181k224j272J888L096l9k945
$$ plain form
1508 -567 -2333 -1797 663 2468 754 -1430 -2476 -822 1570 2009 -84 -1906 -1675 140 1907 1689
1524 1689 -296 -2167 -1563 573 2486 1152 -1558 -2272 -636 1907 2309 -386 -1868 -1789 803 2220
1540 2220 1147 -849 -2368 -842 1282 1764 533 -1124 -2184 -519 1968 2210 -75 -2484 -1622 934
1556 934 2510 1195 -1368 -2570 -277 1601 2131 0 -1960 -1481 -156 1925 1646 -597 -1911 -1273
1572 -1273 660 2527 1236 -1569 -2352 -729 1794 2330 -285 -2327 -1723 1030 2125 1358 -898 -2102
1588 -2102 -587 1273 1824 523 -1401 -1776 -111 1684 1652 -14 -2116 -1833 550 2085 1434 -1208
1604 -1208 -2716 -622 1817 2028 -16 -1915 -1705 421 1625 1189 -549 -1683 -1201 522 1979 822
1620 822 -1130 -2415 -733 1640 1925 172 -2129 -2026 327 2341 1184 -993 -1794 -1115 1240 1856
$$ packed form
1508e67j766N36K460J805j714k184j046J654K392M39k093j822K31J815J767k18
1524A689j985j871O04K136J913j334k710p14J636K543M02k695j482P9K592J417
1540B220j073j996j519J526K124M82j231j657j060J665K487K42k285k409Q62K556
1556I34J576j315k563j202K293J878N30k131j960M79J325K081k79k243j314O38
1572a273J933J867j291k805p83J623K523N36k615k042O04K753J095p67k256j204
1588b102J515J860N51j301j924l75J665J795l2j666k102K83K383J535o51k642
1604a208j508K094K439K11k044j899K10K126J204m36j738j134M82J723J457j157
1620H22j952j285J682K373K85j753k301J03K353K014j157k177q01O79K355O16
$$ plain form
1636 1856 336 -1430 -1421 -227 1513 1491 -319 -1774 -1284 575 1894 956 -1202 -2304 -869 1524 1919
1653 1919 -53 -1897 -1713 390 2183 1078 -652 -1752 -784 619 1593 651 -1040 -1812 -646 1434
1669 1434 1719 26 -1560 -1775 393 2085 1318 -978 -2084 -534 1272 1809 154 -1606 -1663 -280
1685 -280 1337 1067 -156 -1478 -1130 704 1916 1349 -649 -2000 -892 1325 1708 98 -1684 -1482
1701 -1482 297 1669 1232 -846 -1810 -741 838 1570 738 -1190 -1663 -309 1212 1540 334 -1500
1717 -1500 -1752 597 1745 1144 -1049 -2007 -742 1281 1763 154 -1427 -1580 21 1402 969 -351
1733 -351 -1537 -881 589 1666 848 -804 -1669 -758 1544 1913 93 -1731 -1548 208 1791 1136 -450
1750 -450 -1912 -782 1209 1539 268 -815 -956 80 1094 1553 96 -1150 -1356 357 1653 746
$$ packed form
1636A856j520j766RJ194J740k2j810j455M90J859J319r38k158j102J435K393L95
1653A919j972j844J84K103J793j105j730j100R68J403R74r42j691p72J166K080
1669A434K85j693j586k15K168J692p67k296j106J550J806N37j655j760n7J383
1685b80J617k70j223j322L48J834J212n67j998j351J108K217L83j610j782K02
1701a482J779J372m37k078r64J069J579P32q32j928m73J354J521L28j206j834
1717a500k52K349J148o01k193r58J265K023M82j609j581j53J601J381m33j320
1733c51j186O56J470J077q18j652q65R11K302L69j820j824J83J756J583o55j586
1750d50j462J130J991L30j271j083j41J036J014M59j457j246k06J713J296r07
$$ plain form
1766 746 -667 -1804 -690 1365 1660 -41 -1584 -1285 488 1485 1156 -468 -1462 -579 1110 1711 702
1783 702 -867 -1343 -289 1034 1723 236 -1480 -1495 294 1917 1438 -283 -1864 -666 1182 1856 529
1800 529 -1183 -1323 286 1095 788 212 -1139 -1437 428 1416 619 -522 -1621 -782 1348 1840 244
1817 244 -1560 -1668 395 1476 1019 -992 -1436 -729 818 1572 376 -894 -1051 -269 1046 1721 36
1834 36 -1235 -1174 309 1399 1238 -389 -1877 -684 1097 1427 316 -1376 -1112 -117 1116 1281 -658
1851 -658 -1242 -477 304 1090 754 -641 -1543 -760 1185 1316 453 -1441 -1596 93 1350 1148 -469 -1559
1869 -1559 -891 706 1006 309 -718 -1131 -305 1263 1048 257 -1052 -1290 356 1300 975 -640 -1290 -1062
1887 -1062 1132 1564 163 -1172 -1007 -6 1562 943 -361 -977 -547 325 1466 590 -743 -1030 -584
$$ packed form
1766G46j413j137J114K055K95j701j543K99J773R97l29j624r94Q83J689O01j009
1783G02j569m76J054J323O89j487j716j5J789J623m79j721j581J198J848O74j327
1800E29j712j40J609Q09l07n76j351k98J865R88p97j141j099Q39K130M92j596
1817B44j804j08K063J081m57k011m44P07J547P54j196j270j57P82J315O75j685
1834C6j271O1J483J090j61j627j488J193J781L30j111j692K64R95J233J65j939
1851f58n84P65P81P86l36j395r02P83J945J31q63j894j55J689J257k02j617j090
1869a559O68J597L00o97j027m13Q26J568k15p91j309k38J646R44l25j615o50K28
1887a062K194M32j401j335J65J001J568o19j304o16M30Q72J141q76j333k87M46
$$ plain form
1904 -584 885 1423 314 -1358 -865 327 1351 1539 -1050 -1928 -573 845 1664 750 -724 -1250 374
1921 374 905 899 147 -985 -1027 221 1148 580 -548 -1589 -709 999 1418 496 -1218 -1720 356 1404
1939 1404 570 -889 -1190 -978 647 1070 391 -420 -930 -510 879 1116 57 -648 -879 125 1505 878
1957 878 -890 -948 -664 575 1577 249 -1646 -994 159 798 1293 -632 -997 -624 199 1180 668 -513
1975 -513 -1454 -151 424 1101 481 -1050 -1451 558 967 663 -350 -1434 -670 910 1020 496 -563 -1180
1993 -1180 126 888 639 185 -638 -1119 161 1043 875 -337 -1116 -712 874 1468 287 -1238 -1078 -430
2011 -430 1152 1030 -526 -1049 -509 86 1029 320 -881 -1034 -311 752 811 164 -977 -871 11 856 1052
2030 1052 -280 -1247 -295 713 677 354 -797 -1040 419 799 736 223 -1340 -746 505 835 346 -214
$$ packed form
1904e84J469N38j109j672M93J192J024J88k589q78J355J418Q19r14j474n26J624
1921C74N31op52j132m2J248R27n68j128j041Q80J708M19r22j714n02K076J048
1939A404q34j459l01K12J625M23o79q11n10M20J389K37j059p05k31J004J380o27
1957H78j768n8K84J239J002j328j895O52J153O39M95j925l65L73Q23R81n12j181
1975e13r41J303N75O77o20j531m01K009M09l04j013j084P64J580J10n24j059o17
1993a180J306P62k49m54q23m81J280Q82j68j212p79M04J586N94j181j525J60O48
2011d30J582j22j556n23N40N95R43p09j201j53P23J063N9o47j141J06Q82Q45J96
2030A052j332r67R52J008l6l23j151k43J459L80o3n13j563N94J251L30m89n60
$$ plain form
2048 -214 -1424 -902 980 1209 277 -1007 -1486 -59 1236 603 -546 -866 -383 906 769 106 -457 -646
2066 -646 -372 771 820 -226 -736 -685 -354 1052 930 -578 -1055 -364 501 1254 339 -1202 -726 216 603
2085 603 856 -62 -878 -564 254 665 512 -435 -758 -106 794 1191 -96 -571 -854 192 927 669 -479
2104 -479 -1123 -321 820 1124 298 -442 -751 -476 891 785 -264 -945 -575 303 919 872 -517 -876 -113
2123 -113 355 913 30 -1079 -809 -148 1122 508 -85 -945 -285 551 598 303 -411 -833 -245 694 962 277
2143 277 -780 -746 -15 850 483 -213 -921 -342 801 772 356 -978 -655 -70 918 602 -167 -698 -749 126
2163 126 861 389 -242 -753 -490 639 1187 435 -1067 -530 -29 820 976 -540 -835 -178 110 700 191
2182 191 -535 -624 -53 488 736 375 -774 -593 -19 678 598 -347 -1266 -70 461 727 294 -695 -646 103
$$ packed form
2048b14j210N22J882K29r32j284m79J427J295o33j149l20M83J289j37o63n63j89
2066f46K74J143M9j046n10N1L31J406j22j508m77O91Q65P53r15j541M76R42L87
2085F03K53r18q16L14Q18M11j53r47l23O52R00L97j287m75k83J046P35k58j148
2104d79o44Q02J141L04q26p40l09K75J367j06j049o81L70Q78O16m7j389l59P63
2123a13M68N58q83j109K70O61J270o14n93q60O60Q36M7k95p14m22N88R39K68o85
2143B77j057L4P31Q65l67o96p08N79J143k9m16j334L23N85R88l16p69n31n1Q75
2163A26P35m72o31n11K63J129N48p52j502N37N01Q49J56j516k95O57K88N90n09
2182A91p26q9N71N41K48l61j149J81N74O97q0r45r19J196N31K66m33r89M9P49
$$ plain form
2202 103 674 170 -51 -816 -483 710 562 437 -328 -854 -678 629 560 427 -246 -955 -64 1153 655
2221 655 -410 -456 -429 626 901 -79 -624 -781 -50 587 545 -103 -541 -54 14 991 627 -359 -727 -123 514
2242 514 654 360 -587 -1124 -43 812 799 125 -884 -397 455 262 12 -406 -572 -164 280 895 265 -623
2262 -623 -899 -53 656 731 -137 -853 -474 525 531 329 -460 -376 -251 428 784 0 -428 -209 -69 775 653
2283 653 -487 -555 -375 332 859 74 -489 -778 -191 348 388 -392 -733 -350 182 627 637 -373 -660 80
2303 80 169 531 -228 -715 -732 157 702 271 -207 -446 -396 447 371 229 -594 -627 34 606 520 -148 -529 -509 128
2326 128 490 358 -194 -560 -232 533 899 334 -583 -821 -137 732 638 -388 -555 -417 261 953 277 -269
2346 -269 -505 -20 368 610 -117 -314 -522 -42 563 244 -191 -486 -435 351 515 5 -627 -631 -18 689 636
$$ packed form
2202A03N71n04k21p65L33J193j48j25p65n26J76J307o9j33o73p09Q91J217m98
2221F55j065m6K7J055K75r80n45j57P31O37m2o48m38M87O8R77l64r86l68O04O37
2242E14J40k94r47n37J081Q55j3o74j009M87Q52j93k50m18j66M08M44O15o30q88
2262f23k76Q46P09P5q68p16L79R99Ok02p89Q4J25O79L56p84m28K19J40Q44j22
2283F53j140o8J80P07N27p85n63k89N87N39M0p80l41L83N32M45J0j010k87P40
2303H0Q9L62p59m87j7Q89N45m31m78k39N0Q43p6j42q23l3O61N72q6o68l81K0O37
2326A28L62j32n52l66L28P65L66n65r17k38O84Q69r4j026j67J38O78O92o76n46
2346b69k36M85L88K42p27j97k08M80O05l19m35k95N1P86J64n10o32mO13P07n3
$$ plain form
2367 636 -194 -824 -461 627 751 325 -171 -696 -86 277 371 -223 -551 -635 -137 546 515 -478 -734 -444 107
2388 107 560 295 -581 -390 17 510 460 5 -699 -359 122 529 713 -69 -511 -238 356 789 -184 -335
2408 -335 -777 -54 629 287 91 -426 -317 85 556 211 -352 -382 -219 250 368 49 -651 -301 139 439
2428 439 277 -297 -679 -403 633 591 118 -170 -364 -168 369 711 -118 -340 -542 -63 455 505 -181 -411
2448 -411 36 132 474 -75 -431 -418 22 263 367 -115 -624 -382 369 232 148 -235 -283 49 196 363 -28
2469 -28 -364 -288 -126 853 438 -319 -383 -151 433 395 397 -577 -696 14 637 248 -374 -333 -317 159 333 20 -415
2492 -415 67 -205 46 97 -108 -445 -505 -42 272 484 -246 -322 -210 587 640 -55 -72 -384 226 354 454 39
2514 39 -498 -96 -145 -178 423 -152 -377 -270 209 329 -126 -267 -319 -202 502 359 -232 -586 -65 221 589
$$ packed form
2367F36q30o30L63J088J24m26m96n25O10L63R4n94l28q4M98O83l1r93k56K90N51
2388A07M53k65q76J91M07M93n0m55p04L40M81M07J84p82m42K73N94M33r73j51
2408c35m42P23O83l42j96n17J09M02M71l45n63l0J63M69J18l19p00L50M40L00
2428D39j62n74l82K76J036m2m73k88j94J96N37L42q29k22k02M79N18N0o86k30
2448d11M47R6L42n49l56J3M40K41J04m82n09K42P51j37q4l83m8L32J47J67l91
2469b8l36P6J62R79m15p57o4K32N84l8Kr74j19P10O23l89o22M1J6M76J74l13m35
2492d15M82k72K51N1k05l37o0M63L14K12p30p6J12P97N3o95j7l12O10J28J00m15
2514C9n37M02m9l3O01n75k25J07M79J20m55j41n2J17P04j43n91l54N21K86L68
$$ plain form
2535 589 167 -4 -277 -11 341 388 86 -97 -253 156 338 274 -286 -628 -181 206 704 79 -441 -257 170
2556 170 426 499 -283 -519 -262 464 572 201 -267 -265 -227 197 246 46 -319 -603 -3 296 416 -243 -473 159
2578 159 221 545 -272 -439 -381 159 754 361 3 -419 -267 119 442 349 -17 -513 -198 665 -92 -123 -325
2599 -325 -497 -61 493 131 -224 -138 -432 386 385 194 -458 -101 90 36 206 19 -297 -505 -101 834 -218
2620 -218 -296 -486 -263 274 281 -249 -525 -494 41 545 314 -132 -498 -204 20 354 165 -22 -468 56 105 172
2642 172 -159 -476 -311 -155 188 24 -44 -363 118 -34 283 261 -385 -456 181 -41 112 169 -352 -430 -104 448
2664 448 57 -363 -548 150 186 414 -45 13 -192 -59 330 -111 -395 -233 -29 239 420 -122 -409 34 43
2685 43 310 198 -73 -311 266 -113 303 -18 -52 -298 -312 -163 489 -137 -310 -256 117 227 137 392 -576 -492
$$ packed form
2535E89m22j71k73K66L52M7l02j83j56M09J82o4n60l42M47L87M98o25n20J84M27
2556A70K56P3p82k36K57P26J08l71m68KL8M24M9k00l65k84O00K99J20o59k30O32
2578A59O2L24q17j67N8N40N95l93l58m22J52L86L23r3l66m96L15Q63p57l1k02
2599c25j72M36N54l62l55Q6k94Q18jj91o52L57J91n4J70j87l16k08M04R35j052
2620b18p8j90K23N37Pn30k76L1N35N04k31m46l66K94K24L34j89j87m46N24M9O7
2642A72l31l17J65J56L43j64o8l19M81j52L17k2o46p1O37k22J53N7n21p8L26N52
2664D48l91m20j85O98L6K28m59N8k05J33L89m41k84J62K04K68J81n42k87M43R
2685D3K67j12k71k38N77l79M16l21l4k46j4J49O52o26j73N4L73J10r0K55r68Q4
$$ plain form
2707 -492 -158 245 148 -155 -254 -367 140 504 -166 -183 -641 325 489 -138 -326 -313 -213 204 174 92 -68 15
2729 15 -62 180 376 54 -421 -332 155 572 -2 -221 -298 -24 294 193 -95 -376 -463 -129 382 226 -224 -247
2751 -247 -152 -126 351 91 -233 -603 -236 291 349 -44 -630 -46 103 455 147 -447 -132 -165 37 163 -114
2772 -114 -97 25 15 206 159 -90 -344 79 363 72 532 -145 -726 -203 447 366 -222 -247 -147 237 659 142
2794 142 -156 -191 4 13 211 -128 -241 -21 111 86 120 -1 -299 -334 135 414 420 -83 -268 -246 299 528 -101
2817 -101 -665 -262 443 261 301 -220 -284 48 -328 120 -122 -311 -430 -135 200 197 448 -323 178 -81 228
2838 228 71 -131 -70 115 369 422 -425 -221 -259 153 149 271 -18 -318 -170 101 52 148 159 -285 -122 347 268
2861 268 135 18 -96 -156 469 7 -115 -72 -4 203 647 130 -425 -52 273 207 93 -173 -33 -154 195
$$ packed form
2707d92L34M03r7l03r9j13N07L64o70j7m58R66J64o27j88J3J00M17l0q2j60Q3
2729A5p7K42J96l22m75Q9M87M17n74k19p7K74L18j01k88k81q7L34N11j56m50k3
2751b47R5K6M77k60l24l70L67N27N8l93n86N84J49L52l08n94L15l3K02J26k77
2772a14J7J22j0J91m7k49k54M23K84k91M60o77n81N23O50q1n88k5J00L84M22n17
2794A42k98l5J95RJ98l39j13K20J32k5L4j21k98l5M69K79On03j85K2N45K29o29
2817a01n64M03P05j82M0n21o4L32l76M48k42j89j19K95L35lK51p71N01k59L09
2838B28j57k02O1J85K54N3q47K04l8M12mJ22k89l00J48K71m9R6J1m44J63M69p9
2861B68j33j17j14o0O25m62j22M3O8K07M44n17n55L73L25o6j14k66J40j21L49
$$ plain form
2882 195 249 51 -490 -85 16 74 435 -116 -266 -373 125 -12 235 -113 -627 166 299 16 266 262 -548
2903 -548 -120 166 -45 29 -253 -285 266 90 100 -107 -135 156 251 114 -236 -97 -180 106 460 -94 84 -29
2925 -29 -213 100 484 -22 94 -239 -65 427 445 -460 -364 -154 92 201 -165 -306 -190 106 136 118 142 -388
2947 -388 -219 339 -228 248 113 2 -126 115 109 -164 -307 -70 -127 52 106 29 -518 -57 -67 172 223 -53
2969 -53 -126 -28 50 444 103 -216 -131 252 44 96 -243 40 -180 -86 -150 -149 113 -65 -2 330 617 41 67 12
2993 12 -49 94 314 -160 -52 19 -4 164 -267 108 -185 -21 377 66 38 -51 -274 -69 -150 128 -98 -162 -13
3016 -13 326 196 -17 16 -11 -267 -25 354 -136 -258 -202 -181 283 18 -250 137 -252 379 1 112 -53 -164
3038 -164 -52 -34 100 -63 -292 -219 -60 -7 189 -99 -174 -247 284 395 316 -267 -303 -175 -36 -79 -326 43 -128
$$ packed form
2882A95N4j98n41M05J01N8L61n51j50j07M98j37K47l48n14P93J33k83K50mq10
2903e48M28K86k11P4k82l2N51j76J0k07k8K91R5j37l50J39q3K86L54n54J78j13
2925b9j84L13L84n06J16l33J74M92J8r05R6K10K46J09l66j41J16K96L0j8K4n30
2947c88J69N58n67M76j35j11j28K41ok73j43K37n7J79N4p7n47M61j0K39N1k76
2969e3p3R8P8L94l41l19Q5L83k08N2l39K83k20R4o4JK62j78O3L32K87n76K6n5
2993A2o1J43K20m74J08P1k3J68m31L75k93J64L98l11k8q9k23K05q1K78k26o4J49
3016a3L39j30k13L3k7k56K42L79m90j22N6K1M64k65k68L87l89O31l78J11j65j11
3038a64J12J8J34j63k29P3J59N3J96k88p5p3N31J11p9n83l6J28J39m3k47L69j71
$$ plain form
3061 -128 -363 215 15 -100 93 88 395 96 97 -13 -169 182 149 40 -247 -55 -31 -6 222 1 -379 -209
3083 -209 -29 25 -127 97 157 104 20 -112 354 -251 -171 410 -36 54 107 -151 -216 21 -81 2 163 -288 -91
3106 -91 19 75 29 49 165 -168 409 314 -164 -143 54 327 147 -258 -137 56 -57 -5 326 69 -119 -102 118
3129 118 -50 -34 -62 43 -161 65 53 81 40 -77 129 212 220 -115 129 -279 161 131 -140 -108 -255 -128 111
3152 111 240 186 -387 360 -18 -6 33 -20 -288 -136 87 115 198 -193 18 -168 52 85 124 -92 -147 156 59
3175 59 54 171 -115 -134 241 367 540 210 -394 38 207 220 -47 -153 -115 167 131 32 -258 -123 118 -79 221
3198 221 -142 -95 -205 -38 155 190 61 133 -189 52 -228 8 -90 -355 127 200 -63 -67 -140 -22 -167 205 99
3221 99 -52 -16 -372 -25 -78 165 206 111 232 -4 -80 84 41 -127 -220 -242 -13 -3 -52 -13 98 325 -48 112
$$ packed form
3061a28k35N78k00j15J93nL07k99Jj10j56L51l3j09k87J92K4K5K28k21l80J70
3083b09J80N4j52K24O0n3q4j32M66o05Q0N81m46R0N3k58o5K37j02Q3J61m51J97
3106i1J10N6m6K0J16l33N77r5m78K1J97K73j80m05J21J93j13N2L31k57j88J7K20
3129A18j68J6k8J05k04K26j2K8m1j17K06Q3Ql35K44m08M40l0k71L2j47J27K39
3152A11J29n4n73P47l78J2L9n3k68J52K23K8Q3l91K11j86K20L3L9k16n5L03r7
3175E9nJ17k86j9L75J26J73l30o04M32J69J3k67j06L8K82l6r9k90J35K41j97L00
3198B21l63M7j10J67J93L5j29P2l22K41k80K36r8k65M82P3k63mp3J18j45L72j06
3221I9j51L6l56L47n3K43M1r5J21k36p6J64m3j68r3k2K29J0m9L9J11K27l73J60
$$ plain form
3245 112 -143 222 -243 207 37 -446 87 -144 95 482 113 141 -5 159 15 135 37 115 -231 5 182
3266 182 237 -231 -134 -29 231 211 29 -12 135 440 365 208 -353 -271 174 218 141 30 -71 -232 93 34 209
3289 209 35 -81 227 -272 166 75 -106 102 14 -120 349 -85 10 -41 199 150 -147 -103 -245 -145 -73 -48 -62
3312 -62 27 -214 139 -102 -37 -3 -211 94 313 324 -231 -60 -64 48 153 -11 144 3 -190 75 223 97
3334 97 -168 -79 129 150 11 19 -350 12 220 43 107 -119 -170 13 -304 98 218 -257 -262 85 -201 -35 -75
3357 -75 -162 -334 -166 315 142 215 -246 -98 33 34 75 -246 -57 -136 86 14 -258 -322 -91 47 109 60 -130 63
3381 63 -127 -188 -249 17 275 -104 110 46 -40 -305 -167 45 116 170 169 280 -144 -317 -41 319 -109 -199 193
3404 193 -12 176 330 -154 -219 -261 -8 73 -189 -98 143 239 -16 56 -447 -221 -321 -119 137 -143 -109 -45 118
$$ packed form
3245A12k55L65m65M50j70m83N33k31K39L87l69K8j46J64j44J20r8P8l46K36J77
3266A82N5m68R7J05K60k0j82m1J47L05p5j57n61Q2M45M4p7j11j01j61L25n9J75
3289B09j74j16L08m99M38r1j81K08q8j34M69m34R5n1K40m9k97M4j42J00P2K5j4
3312f2Q9k41L53k41O5L4k08L05K19J1n55J71mJ12J05j64J55j41j93K65J48j26
3334I7k65Q9K08K1j39Ql69L62K08j77O4k26n1J83l17M02J20m75nL47k86J66m0
3357g5q7j72J68M81j73P3m61J48J31JM1l21J89p9K22p2k72o4K31J38O2m9j90J93
3381F3j90o1o1K66K58l79K14o4q6k65J38K12P1N4jJ11m24j73K76L60m28r0L92
3404A93k05J88J54m84o5m2K53Q1k62R1K41R6k55P2n03K26j00K02K56k80L4O4J63
$$ plain form
3427 118 139 239 253 -50 -175 105 120 -132 110 -120 -81 -7 -136 199 -74 -291 220 80 124 -125 -29 -95 21
3450 21 -22 129 -179 -162 130 47 149 103 -176 -36 -111 325 262 -76 -49 168 270 95 61 -250 -77 180 -98
3473 -98 430 254 -354 17 52 -139 92 -26 -313 -122 133 402 -165 -96 -44 -100 69 135 -97 -152 158 111 114
3496 114 185 128 -303 -202 -55 -2 -40 -58 -397 168 421 523 18 9 149 42 196 3 40 -483 34 132 126 2
3520 2 -127 -211 234 66 116 -276 -477 -165 27 -256 -143 -217 -198 228 162 145 -8 -17 -10 96 105 248 120 -125 -76
3545 -76 67 -171 -333 298 -246 187 100 364 -33 -357 -88 139 385 64 -322 -133 204 402 30 97 126
3566 126 105 -80 77 58 -104 -168 -162 361 -80 -41 -6 -227 31 295 192 -114 -24 -122 -8 161 -149 -67 106
3589 106 59 268 227 -259 -267 -76 67 157 71 -12 -57 -166 56 292 -126 -225 -101 -46 53 57 -315 99 -87 -134 136
$$ packed form
3427A18K1J00J4l03j25K80J5k52K42k30L9P4j29L35k73k17N11j40M4k49R6o6J16
3450B1m3J51l08J7K92q3J02m6k79J40p5M36o3l38K7K17J02j75l4l11J73K57k78
3473i8N28j76o08L71L5j91K31j18k87J91K55K69n67O9N2n6J69O6k32n5L10m7L
3496A14P1n7m31J01J47N3l8j8l39N65K53J02n05rJ40j07J54j93L7n23N17R8oj24
3520Bj29q4M45j68N0l92k01L12J92k83J13p4J9M26o6j7j53rPJ06RJ43j28k45M9
3545g6J43k38j62O31n44M33q7K64l97l24K69K27K46l21l86J89L37J98l72O7K9
3566A26k1j85J57j9j62o4ON23m41L9L5k21K58K64j03l06R0r8J14J69l10Q2J73
3589A06m7K09m1m86qJ91J43R0q6q3m5j09K22K36m18r9J24N5R9Ml72M14j86m7K70
$$ plain form
3614 136 181 -257 -86 -473 -147 120 -69 59 -58 -550 269 56 2 -136 62 350 228 -157 -223 -275 -320 -142
3636 -142 111 42 -230 -345 -51 -170 177 45 -302 -116 120 93 56 -110 -340 155 171 61 -111 -266 35
3657 35 192 159 -98 165 -539 39 213 52 -33 -174 -655 -110 321 -73 396 -302 -15 -55 -137 -18 199 -110
3679 -110 127 228 48 113 97 -243 255 245 174 41 -467 210 -58 188 -59 -32 -323 42 4 217 -248 -406
3701 -406 -200 199 135 248 -67 -290 -220 229 245 45 -129 -330 -85 221 296 -176 -323 -334 262 431 75 -122
3723 -122 147 -51 338 -106 76 -1 -296 -380 179 270 -119 -349 18 54 177 75 -85 -21 101 385 121 -61
3745 -61 73 -216 -149 82 -197 18 -149 -27 146 404 -114 -242 -148 30 -2 94 -48 -143 81 113 401 213
3767 213 -126 108 97 159 248 -264 -130 21 48 -175 56 -340 -286 -9 -54 16 122 -186 -257 -105 80 175 -84
$$ packed form
3614A36M5m38J71l87L26K67j89J28j17m92Q19k13n4j38J98K88j22l85o6n2m5J78
3636a42K53o9k72j15K94j19L47j32l47J86K36k7l7j66k30M95J6j10j72j55L01
3657C5J57l3k57K63p04N78J74j61q5j41m81N45M31l94M69o98K87m0q2J19K17l09
3679a10K37J01j80O5j6l40M98j0p1j33n08O77k68K46k47K7k91L65l8K13m65j58
3701d06K06L99o4J13l15k23P0M49J6k00j74k01K45L06P5m72j47j1N96J69l56j97
3723a22K69j98L89m44J82p7k95q4N59R1l89k30L67L6J23j02j60O4J22K84k64j82
3745f1J34k89O7K31k79K15j67J22J73K58n18j28R4J78l2R6j42r5K24L2K88j88
3767B13l39K34j1O2Q9n12J34J51K7k23K31l96N4K77m5P0J06l08p1J52J85R5k59
$$ plain form
3790 -84 -213 4 75 274 -97 -176 -208 195 128 201 -63 -117 -358 49 429 179 26 -367 -205 213 423 174
3812 174 -97 -267 11 139 435 -44 -142 -109 -76 150 -89 -132 -339 245 152 86 211 135 109 -82 199 119 32
3835 32 -463 -270 -70 368 46 -137 -353 -132 224 100 54 -30 -398 147 101 413 114 -208 -111 -89 405 346
3857 346 -221 -101 -41 306 359 -172 -65 -73 -148 279 492 -96 -394 -1 474 79 -159 -283 -420 -330 353 290
3879 290 0 -215 168 157 403 9 -218 -305 -91 -62 266 320 -497 -497 95 446 300 140 -277 -601 121 -77
3901 -77 25 -392 -572 4 404 412 60 -260 -36 -11 487 -62 -46 -491 -107 -57 205 -146 -289 -168 85 388
3923 388 105 91 122 117 323 527 462 -167 -238 -315 116 532 -227 -614 -274 276 325 304 106 -457 -117 173 241
3946 241 120 -149 -504 -85 178 323 -108 -470 -169 67 382 359 124 -285 247 433 468 332 15 -105 253
$$ packed form
3790h4j29K17P1J99l71p9l2M03o7P3k64n4k41M07L80k50j53l93J62M18K10k49
3812A74k71j70K78J28K96m79r8L3L3K26k39m3k07N84r3o6J25p6k6j91K81q0q7
3835C2m95J93K00M38l22j83k16K21L56j24m6q4l68N45m6L12k99l22R7K2M94n9
3857C46n67J20O0L47N3n31J07qp5M27K13n88k98L93M75l95k38j24j37R0O83o3
3879B90k90k15L83j1K46l94k27q7K14K9L28N4q17%N92L51j46j60m17l24P22j98
3901g7J02m17j80N76M00Ql52l20K24K5M98n49J6m45L84N0K62l51j43J21K53L03
3923C88k83j4L1nK06K04o5o29p1p7M31M16p59l87L40N50M9k1j98n63L40K90O8
3946B41j21k69l55M19K63J45m31l62L01K36L15k3k35m09N32J86L5j36l17j20L58
$$ plain form
3967 253 325 30 92 -469 -420 -210 311 349 -146 -326 -186 11 450 -94 -569 -527 -390 209 23 193 -206 -299
3989 -299 -95 115 107 -66 -341 -79 237 233 106 -156 -209 76 127 -155 -250 -458 16 335 271 125 -309 -396 -128
4012 -128 386 167 105 -213 -215 122 591 249 -202 -121 -58 449 349 -142 -598 -117 295 255 -15 -111 -287 -83
4034 -83 345 310 200 -293 -527 57 314 441 114 -484 -429 33 328 162 -507 -390 -70 442 270 -493 -269
4055 -269 -135 13 533 180 57 -405 -72 86 343 99 -140 -766 100 150 162 -96 -320 -366 255 496 78
4076 78 -358 -527 -127 376 156 -203 -313 -400 -36 149 441 -48 -436 33 212 439 40 158 -264 -168 308
4097 308 571 -85 -567 -237 59 537 135 -75 -323 -184 157 483 74 76 -534 21 533 742 17 -229 -488
4118 -488 229 452 277 -384 -618 -355 343 198 128 -802 -16 93 216 622 -45 -747 -361 389 387 481 163
$$ packed form
3967B53P2k95O2n61M9K10N21L8m95j80J40J97M39n44m75M2J37N99j86J70l99r3
3989b99K04K10qj73k75K62L16mj27k62n3K85N1k82r5k08M74L19o4j46m34q7K68
4012a28N14k19o2l18kL37M69l42m51Q1O3N07j00m91m56M81M12m0k70r6j76K04
4034h3M28l5j10m93k34N84K57J27l27n98N5M62K95j66o69J17L20N12j72p63K24
4055b69J34J48N20l53j23m62L33J58K57k44k39o26Q66N0J2k58k24m6O21K41m18
4076G8m36j69M00N03k20l59j10q7L64J85K92m89l88M69J79K27l99J18m22R6M76
4097C08K63o56m82L30K96M78m02k10k48J39L41L26m09Ko10N55N12K09p25k46k59
4118d88P17K23j75o61k34K63O98j45p0r30P86J09J23M06o67p02L86P50kR4l18
$$ plain form
4139 163 -494 -218 534 234 -286 -814 -348 -264 439 224 152 -354 -179 266 599 -32 -290 -54 -52 358 517
4160 517 -488 -560 -345 187 583 231 -361 -554 131 158 814 142 -354 -256 171 208 355 -65 -560 -146 320
4181 320 123 24 -274 -485 -30 309 61 -173 -553 -731 696 437 112 9 -309 -228 621 448 -40 -347
4201 -347 -290 6 238 174 -109 -490 -482 424 537 298 -432 -569 -338 433 538 -8 -394 -579 82 579 275
4222 275 224 -452 -12 262 781 179 -416 -321 -226 23 591 41 -464 -351 78 544 137 -256 -718 -209 304
4243 304 414 123 -155 -543 469 290 489 -211 -650 -269 210 512 -285 30 -243 -414 476 607 -60 -437
4263 -437 -504 316 621 162 -157 -364 -82 392 472 288 -364 -302 -64 502 572 -185 -874 -287 50 268 417
4284 417 -199 -148 200 597 490 372 -313 -361 160 84 469 -142 -547 -492 185 549 249 -25 -369 188 183 644
$$ packed form
4139A63o57K76P52l00n20n28M66Q4P03k15p2n06J75M45L33o31k58K36KM10J59
4160E17j005p2K15N32L96l52n92j93O85K7O56o72m96R8M27L7J47m20m95M14M66
4181C20j97r9k98k11M55L39k48k34l80j78J427k59l25j03l18Q1Q49j73m88l07
4201c47N7K96K32o4k83l81QR06J13k39p30j37K31P71J05n46l86j85O61M97l04
4222B75n1o76M40K74N19o02n95R5R5K49N68n50n05J13M29M66m07l93m62N09N13
4243C04J10k91k78l88J012j79J99p00m39L81M79L02p97L15k73j71Q90J31o67l77
4263d37o7Q20L05m59l19k07K82M74Q0j84o52O2K38N66P0p57o89N87L37K18J49
4284D17o16N1L48L97j07j18o85m8N21p6L85o11m05N5O77L64l00k74l44N57nM61
$$ plain form
4306 644 144 -308 -435 55 511 281 -224 -574 -49 521 442 -211 -231 -324 -85 603 579 -116 -219 -518 179
4327 179 691 312 -421 -179 -153 479 280 -6 -369 -712 166 299 419 -291 -1027 31 660 380 191 -423
4347 -423 -487 -71 489 314 292 -492 -341 93 74 297 -443 -440 -158 408 344 124 -388 -262 -17 472 307 136
4369 136 -642 -140 59 576 -95 -363 -482 -266 512 571 73 -287 -407 64 530 475 -463 -505 24 253 702
4390 702 6 -360 -471 164 420 549 -45 -360 -205 255 525 144 -487 -501 8 594 539 -197 -512 -376 35
4411 35 181 33 -418 -464 -292 269 527 74 -446 -529 -133 297 476 150 -387 -283 144 436 319 -550 -516
4432 -516 -193 527 519 290 -280 -403 -149 352 154 -221 -585 -371 619 430 154 -513 -419 69 404 438 -103
4453 -103 -411 -148 406 438 205 -293 -541 -268 291 596 378 -423 -571 -185 165 450 -144 -856 -369 77
$$ packed form
4306F44n00m52j27M90M56k30n05l50N25N70p9o53k0r3K39O88k4o95j03k99O97
4327A79N12l79p33K42K6O32j99k86l63l43Q78J33J20p10p36J058O29k80j89o14
4347d23o4M16N60j75k2p84J51M34j9K23p40LK82N66o4k20n12J26K45M89j65j71
4369A36p78N02J99N17o71k68j19K16P78N9m98l60j20M71M66n5r38m2N29K29M49
4390G02o96l66j11O35K56J29n94l15J55M60K70l81o31j4N09N86n5p36l15J36M11
4411C5J46j48m51m6J72N61K58m53n20q3L96M30J79l26n37J04M27K92j17q69L4
4432e16L23P20qk29n70j23K54N01j98l75l64K14R90j89k76o67R4M88L35L4n41
4453a03l08K63N54L2k33m98k48K73N59L05k18q01j48L86L50K85n94p12M87M46
$$ plain form
4473 77 504 58 -534 -576 -23 451 825 230 -503 -209 221 397 -263 -24 -85 -467 185 523 -59 -357 -610
4494 -610 122 314 576 248 -351 -388 101 515 -17 -253 -106 -176 412 683 151 -53 -443 210 329 453 -31
4515 -31 -604 -478 93 198 574 -415 -541 -84 247 816 -224 -245 -253 158 269 211 -138 -766 59 243 550
4536 550 448 -630 -259 -124 420 542 -245 -933 -482 -51 448 449 -116 -495 -297 422 664 -47 -140 -255 72
4557 72 330 -21 -186 -537 -312 553 481 217 -327 -344 77 380 592 -187 -381 -395 132 952 337 -129 -461
4578 -461 -276 92 463 -295 -381 -700 -37 556 349 -253 -752 -190 263 740 590 -435 -512 -291 353 558
4598 558 -33 -668 -375 50 695 164 -20 -246 -479 263 480 700 -528 -569 106 529 260 -226 -357 -401
4618 -401 61 395 98 -114 -671 -14 5 422 -34 -452 -341 127 516 388 132 -290 -269 112 661 485 -565
$$ packed form
4473G7M27m46n92m2N53M74L74n95p33K94M30J76o60K39o1l82O52L38n82k98k53
4494f10P32J92K62l28n99l7M89M14n32k36J47p0N88K71n32k04l90O53J19J24m84
4515c1n73J26N71J05L76r89j26M57L31N69j040k1qM11J11n8l49o28Q25J84L07
4536E50j02j078L71J35N44J22p87o88M51M31M99Jn65l79J98P19K42p11r3j15L27
4557G2K58l51j65l51K25Q65p2k64n44j7M21L03K12p79j94j4N27Q20o15m66l32
4578d61J85L68L71p58q6l19O63N93k07o02m99N62M53M77j50j025p7K21O44K05
4598E58n91o35K93M25O45n31j84k26k33P42K17K20j228m1O75M23k69m86j31m4
4618d01M62L34k97k12n57O57J9M17m56m18J11M68L89j28k56m22K1L81N49j76j050
$$ plain form
4639 -565 -558 -96 592 465 143 -462 -303 84 452 75 -368 -437 -83 149 280 -92 -512 -705 -245 426 402
4660 402 101 -617 -464 -173 436 364 -266 -411 13 156 501 93 -406 -168 3 325 318 23 -412 -692 4
4681 4 593 210 -334 -480 -58 279 699 222 -437 -12 346 675 227 -462 -573 -145 -16 223 -191 -283 -534
4702 -534 -126 448 531 -16 -547 -619 66 711 246 -498 -777 -16 620 605 26 -500 -529 254 501 304 28
4723 28 -273 -233 245 321 -1 -588 -271 -22 592 367 171 -438 32 136 228 207 -503 -608 -332 273 256 310
4745 310 -350 -588 1 749 110 63 -568 -505 234 633 231 -195 -224 -65 564 299 -83 -500 -453 -158 646
4766 646 -1 -312 -519 -105 164 118 -10 67 -386 -327 332 299 -3 -442 -338 -163 316 278 -221 -372 -340 248
4788 248 197 -2 -209 -448 416 702 411 -28 -593 -444 237 227 58 -316 -351 119 61 205 -355 -589 -636 -16
$$ packed form
4639e65PM62O88j27l22o05J59L87L68l77m43o9L54K32J31l72m20j93M60O71k4
4660D02l01p18J53K91O09p2o30j45M24J43L45m08m99K38J71L22pk95m35k80O96
4681DN89l83n44j46M22L37M20m77o59M25L58L29m48o89j11M28J29K39m14r2k51
4702e34M08N74Q3n47n31p2O85O45m65p44k79P61O36j5n79n26k9P83K47j97k76
4723B8l01M0M78P6l22n87L17K49O14k25j96o09M70J04R2k1p10j05K76O05j7N4
4745C10o60k38N89P48o39m7o31O3P39L99m02m26k9J59O29k65l82m17M7K95Q04
4766F46o47l11k07M14K69m6j28P7m53N9O59l3l02m39J04J75M79l8m99j51L2N88
4788B48n1j99k07k39Q64K86k91m39n65J49O81j0j69l74l5M70n8J44n60k34m7O20
$$ plain form
4810 -16 740 262 -409 -530 -355 446 599 305 -506 -551 -294 310 652 168 -490 -306 458 690 487 -129 -917
4831 -917 167 595 269 143 -325 -434 105 414 375 -65 -621 -168 311 32 359 -265 -350 -170 21 614
4851 614 -268 -531 -524 344 408 0 -409 -405 -390 442 310 -48 -447 -394 -123 850 377 -112 -475 -631 6 702
4873 702 337 -361 -348 -282 251 789 -18 -323 -576 -38 222 682 -245 -501 -137 167 714 319 -234 -487 -1
4894 -1 66 850 -97 -455 -558 444 531 492 -396 -559 44 285 536 52 -242 -441 27 141 496 -16 -610
4915 -610 -179 183 561 46 -305 -735 -45 493 456 217 -498 -523 -125 414 379 -422 -409 -225 170 450 50
4936 50 -297 -279 -206 485 341 214 -377 -519 151 607 -113 -373 -416 42 381 660 143 -630 -527 88 444
4957 444 320 99 -509 -209 171 331 26 -493 -798 -518 379 558 91 -271 -278 53 320 324 -183 -267 -35 146
$$ packed form
4810a6P56m78o71j21J75Q01J53k94q11m5K57O04L42m84o58J84P64K32k03o16p88
4831i17J084M28l26j26m68j09N39L09l9m40n56M53M79k79L27o24q5J80J91N93
4851F14q82k63PQ68O4m08m09MJ5Q32j32l58l99N3K71R73m73m89l63j56O37O96
4873G02l65o98J3O6N33N38q07l05k53N38K60M60r27k56L64L04N47l95n53k53M86
4894aO7P84r47l58j03J002Q7l9q88j63O03K41K51m84k94j99M68J14L55n12n94
4915f10M31L62L78n15l51m30O90N38l7k39p15k5L98N39l5q01J3J84L95K80m00
4936E0l47J8P3O91j44j27n91j42O70M56p20k60m3M58L39K79n17p73J03O15L56
4957D44j24k21o08L00L80J60l05n19l05K80Q97J79m67l62pL31K67Mn07q4K32J81
$$ plain form
4979 146 387 88 -33 -484 -117 255 452 -176 -417 -206 96 745 213 -379 -584 127 171 636 -1 -645
4999 -645 -293 274 603 -160 -174 -272 -200 169 304 152 -125 -361 -22 751 735 66 -590 -323 158 756 283
5020 283 -213 -154 -357 266 501 -30 -367 -210 -122 275 163 -271 -68 -410 316 445 194 1 -491 -350 254
5041 254 170 378 -385 -633 476 786 362 -88 -362 -97 38 452 239 -382 -262 -228 331 238 74 -221 -339
5062 -339 184 323 285 -408 -638 -159 526 118 109 -94 -448 -238 637 462 -74 -215 -187 83 62 413 -240 -535
5084 -535 -18 18 511 -62 -440 -111 -166 210 305 44 -330 -77 240 400 202 -672 -395 355 341 545 153
5105 153 -412 -414 4 549 350 40 -386 252 221 532 264 -331 -179 1 704 287 -121 -280 -2 265 493
5126 493 127 -352 -365 -21 276 259 274 -249 -476 135 523 105 -127 -369 -368 109 624 103 -106 -315 94 406
$$ packed form
4979A46K41k99j21m51L67L72J97o28k41K11L02O49n32n92k05P11M4M65o37o44
4999f45L52N67L29p63j4r8P2L69J35j52k77k36L39P73j6o69o56K67M81N98m73
5020B83m96N9k03O23K35n31l37J57Q8L97j12m34K03l42P26J29k51j93m92J41O04
5041B54q4K08p63k48J109L10m24m50k74K65J35M14k13o21J20L4N59r3j64k95j18
5062c39N23J39l8o93k30M79O85m08rk03l54K10Q75j75n36j41K8K70k1L51o53k95
5084e35N17L6M93n73l78L29n5L76R5k61l74K53L17J60j98q74K77P50j4K04l92
5105A53n65kM18N45j99l10m26O38l1L11k68n95J52J80P03m17m08j59K78K67K28
5126D93l66m79j3L44K97j7J5n23k27O11L88m18k32k42JM77N15n21k09k09M09L12
$$ plain form
5148 406 497 -90 -602 -186 144 737 206 -238 -406 -263 212 255 0 -99 -366 -33 527 648 -227 -730 -50
5169 -50 327 403 267 -27 -653 -63 347 197 90 -116 60 301 192 352 -216 -477 -436 355 592 -24 -23 -278
5191 -278 -416 582 -26 -238 -129 -359 50 597 432 -135 -295 -143 246 509 53 -383 -305 96 137 178 -81
5212 -81 -318 -106 716 348 386 -301 -404 -190 371 89 -19 -450 -416 138 451 13 -60 -342 -100 385 223
5233 223 -51 -600 -460 -16 283 287 -122 -584 -410 -36 274 419 -106 -643 -314 491 400 -29 -393 -498 -25
5254 -25 294 527 -361 -319 27 230 317 63 -595 -87 -140 402 311 -71 -591 39 -21 455 87 -543 -677 -148
5276 -148 -42 593 236 -21 -498 37 381 417 -100 -326 -177 85 366 210 -106 -535 215 20 433 -20
5296 -20 -531 -390 85 407 501 14 -531 -162 388 313 308 24 -66 -172 582 250 101 -606 -491 -39 469 422
$$ packed form
5148D06R1n87n12M16L30N93n31m44j68J43M75M3k55r9k67L33N60J21q75n03O80
5169e0L77P6j36k94o26N90M10j50j07k06J76K41j09J60n68k61M1P91K37o16Jk55
5191b78j38R98o08k12J09k30M09N47j65n67j60J52L89K63m56m36P8M01M1M1k59
5212h1k37K12Q22l68L8o87j03K14N61k82j08m31L4N54L13m38p3k82K42M85j62
5233B23k74n49J40M44K99Mm09m62J74L74L10J45n25n37L29Q05r1m29l64j05M73
5254b5L19K33q88M2L46K03Q7k54o58N08n3N42r1l82n20O30o0M76l68o30j34N29
5276a48J06O35l57k57m77N35L44L6n17k26J49K62K81j56l16m29P50j95M13m53
5296b0n11J41M75L22R4m87n45L69N50p5nk84r0j06P54l32j49p07J15M52N08m7
$$ plain form
5318 422 -284 -567 -51 225 314 -50 -116 -370 89 567 153 -112 -231 -120 320 615 11 -102 -320 -54 180
$$ packed form
5318D22p06k83N16K76Q9l64o6k54M59M78m14k65j19J11M40K95o04j13k18K66K34
$$ [...]
8191f0
##END NTUPLES=NMR FID
##END=
