##TITLE=1H_LR-790-C-MK1
 D2O
 8 sc, 
 2.11.2024
##JCAMPDX= 6.0         $$ Bruker NMR JCAMP-DX V2.0
##DATA TYPE= NMR FID
##DATA CLASS= NTUPLES
##ORIGIN= UXNMR, Bruker Analytische Messtechnik GmbH
##OWNER= root
$$ XWIN-NMR		Version 3.5
$$ Sat Nov  2 13:59:39 2024 Russian Standard Time (UT+4h)  she@DPX200
##.OBSERVE FREQUENCY= 200.1318
##.OBSERVE NUCLEUS= ^1H
##.DELAY= (6, 6)
##.ACQUISITION MODE= SIMULTANEOUS
##.ACQUISITION SCHEME= undefined
##.AVERAGES= 8
##.DIGITISER RES= 18
##SPECTROMETER/DATA SYSTEM= spect
##.PULSE SEQUENCE= zg30
##.SOLVENT NAME= D2O
##.SHIFT REFERENCE= (INTERNAL, D2O, 0, 15.7039)
##AUDIT TRAIL= $$ (NUMBER, WHEN, WHO, WHERE, WHAT)
$$ ##TITLE= Audit trail, XWIN-NMR		Version 3.5
$$ ##JCAMPDX= 5.01
$$ ##ORIGIN= Bruker BioSpin GmbH
$$ ##OWNER= she
$$ F:/spectra/data/she/nmr/H-F/1/audita.txt
$$ ##AUDIT TRAIL=  $$ (NUMBER, WHEN, WHO, WHERE, WHAT)
(   1,<2024-11-02 13:58:30.73 +0400>,<she>,<DPX200>,
      <created by zg, POWCHK disabled, PULCHK disabled
       configuration hash MD5:
       00 E9 B6 7A A2 85 ED C7 34 08 36 98 17 FE 4E 26
       data hash MD5: 16K
       43 63 71 D5 63 52 6E 5A A3 F1 34 D8 D8 D3 93 B1>)
$$ ##END=
$$ 
$$ hash MD5
$$ CE A2 4A A3 A4 1A E4 E6 C0 F4 D4 30 80 E6 39 F3
##$RELAX= 
##$RELAX= 
##$RELAX= 
##$RELAX= 
##$RELAX= 
##$RELAX= 
$$ Bruker specific parameters
$$ --------------------------
##$DU= <F:/spectra>
##$EXPNO= 1
##$NAME= <H-F>
##$PROCNO= 1
##$TYPE= <nmr>
##$USER= <she>
##$AMP= (0..31)
100 100 100 100 100 100 100 100 100 100 100 100 100 100 100 100 100 100 
100 100 100 100 100 100 100 100 100 100 100 100 100 100 
##$AQSEQ= 0
##$AQ_mod= 1
##$AUNM= <au_zg>
##$AUTOPOS= <>
##$BF1= 200.13
##$BF2= 200.13
##$BF3= 200.13
##$BF4= 200.13
##$BF5= 200.13
##$BF6= 200.13
##$BF7= 200.13
##$BF8= 200.13
##$BYTORDA= 1
##$CFDGTYP= 0
##$CFRGTYP= 5
##$CHEMSTR= <none>
##$CNST= (0..31)
1 1 145 1 1 1 1 1 1 1 1 1 1 1 1 1 1 1 1 1 1 1 1 1 1 1 1 1 1 1 1 1 
##$CPDPRG= <>
##$CPDPRG1= <>
##$CPDPRG2= <>
##$CPDPRG3= <>
##$CPDPRG4= <mlev>
##$CPDPRG5= <mlev>
##$CPDPRG6= <mlev>
##$CPDPRG7= <mlev>
##$CPDPRG8= <mlev>
##$CPDPRGB= <>
##$CPDPRGT= <>
##$D= (0..31)
0 1.2 0 0 0 0 0 0 0 0.06 0 0.03 0 0 0 0 0.0002 0 0 0 0 0 0 0 0 0 0 0 0 
0 0 0 
##$DATE= 1730541510
##$DBL= (0..7)
120 120 120 120 120 120 120 120 
##$DBP= (0..7)
150 150 150 150 150 150 150 150 
##$DBP07= 0
##$DBPNAM0= <>
##$DBPNAM1= <>
##$DBPNAM2= <>
##$DBPNAM3= <>
##$DBPNAM4= <>
##$DBPNAM5= <>
##$DBPNAM6= <>
##$DBPNAM7= <>
##$DBPOAL= (0..7)
0.5 0.5 0.5 0.5 0.5 0.5 0.5 0.5 
##$DBPOFFS= (0..7)
0 0 0 0 0 0 0 0 
##$DE= 6
##$DECBNUC= <off>
##$DECIM= 24
##$DECNUC= <off>
##$DECSTAT= 4
##$DIGMOD= 1
##$DIGTYP= 9
##$DL= (0..7)
0 120 120 120 120 120 120 120 
##$DP= (0..7)
150 150 150 150 150 150 150 150 
##$DP07= 0
##$DPNAME0= <>
##$DPNAME1= <>
##$DPNAME2= <>
##$DPNAME3= <>
##$DPNAME4= <>
##$DPNAME5= <>
##$DPNAME6= <>
##$DPNAME7= <>
##$DPOAL= (0..7)
0.5 0.5 0.5 0.5 0.5 0.5 0.5 0.5 
##$DPOFFS= (0..7)
0 0 0 0 0 0 0 0 
##$DQDMODE= 0
##$DR= 18
##$DS= 0
##$DSLIST= <SSSSSSSSSSSSSSS>
$$ [...]
##$SUBNAM2= <"">
##$SUBNAM3= <"">
##$SUBNAM4= <"">
##$SUBNAM5= <"">
##$SUBNAM6= <"">
##$SUBNAM7= <"">
##$SUBNAM8= <"">
##$SUBNAM9= <"">
##$SW= 24.0689170037331
##$SWIBOX= (0..15)
0 0 2 0 0 0 0 0 0 0 0 0 0 0 0 0 
##$SW_h= 4816.95568400771
##$TD= 16384
##$TD0= 1
##$TE= 0
##$TE2= 300
##$TE3= 300
##$TEG= 300
##$TL= (0..7)
0 120 120 120 120 120 120 120 
##$TP= (0..7)
150 150 150 150 150 150 150 150 
##$TP07= 0
##$TPNAME0= <>
##$TPNAME1= <>
##$TPNAME2= <>
##$TPNAME3= <>
##$TPNAME4= <>
##$TPNAME5= <>
##$TPNAME6= <>
##$TPNAME7= <>
##$TPOAL= (0..7)
0.5 0.5 0.5 0.5 0.5 0.5 0.5 0.5 
##$TPOFFS= (0..7)
0 0 0 0 0 0 0 0 
##$TUNHIN= 0
##$TUNHOUT= 0
##$TUNXOUT= 0
##$USERA1= <user>
##$USERA2= <user>
##$USERA3= <user>
##$USERA4= <user>
##$USERA5= <user>
##$V9= 5
##$VALIST= <valist>
##$VCLIST= <CCCCCCCCCCCCCCC>
##$VD= 0
##$VDLIST= <DDDDDDDDDDDDDDD>
##$VPLIST= <PPPPPPPPPPPPPPP>
##$VTLIST= <TTTTTTTTTTTTTTT>
##$WBST= 1024
##$WBSW= 4
##$XGAIN= (0..3)
0 0 0 0 
##$XL= 0
##$YL= 0
##$YMAX_a= 108963
##$YMIN_a= -91722
##$ZGOPTNS= <>
##$ZL1= 120
##$ZL2= 120
##$ZL3= 120
##$ZL4= 120
##$ABSF1= 10
##$ABSF2= 0
##$ABSG= 5
##$ABSL= 3
##$ALPHA= 0
##$AQORDER= 0
##$ASSFAC= 0
##$ASSFACI= 0
##$ASSFACX= 0
##$ASSWID= 0
##$AUNMP= <proc_1d>
##$AZFE= 0.1
##$AZFW= 0.1
##$BCFW= 1
##$BC_mod= 2
##$BYTORDP= 1
##$COROFFS= 0
##$CY= 11.3945322036743
##$DATMOD= 1
##$DC= 2
##$DFILT= <>
##$DTYPP= 0
##$F1P= 15.6554695791079
##$F2P= 12.8336369535428
##$FCOR= 0.5
##$FTSIZE= 0
##$FT_mod= 4
##$GAMMA= 1
##$GB= 0.15
##$INTBC= 1
##$INTSCL= 1
##$ISEN= 128
##$LB= 0.24
##$LEV0= 0
##$LPBIN= 0
##$MAXI= 10000
##$MC2= 0
##$MEAN= 0
##$ME_mod= 0
##$MI= 1.114404
##$NCOEF= 0
##$NC_proc= 0
##$NLEV= 6
##$NOISF1= 3.799351
##$NOISF2= 2.8
##$NSP= 1
##$NTH_PI= 0
##$NZP= 0
##$OFFSET= 15.70392
##$PC= 1
##$PHC0= -26349.7
##$PHC1= 10.98743
##$PH_mod= 1
##$PKNL= yes
##$PPARMOD= 0
##$PSCAL= 0
##$PSIGN= 0
##$REVERSE= no
##$SF= 200.130013532006
##$SI= 16384
##$SIGF1= 3
##$SIGF2= 2
##$SINO= 400
##$SIOLD= 16384
##$SREGLST= <1H.CDCl3>
##$SSB= 0
##$STSI= 0
##$STSR= 0
##$SW_p= 3612.71676300578
##$SYMM= 0
##$S_DEV= 0
##$TDeff= 0
##$TDoff= 0
##$TI= <>
##$TILT= no
##$TM1= 0
##$TM2= 0
##$TOPLEV= 0
##$USERP1= <user>
##$USERP2= <user>
##$USERP3= <user>
##$USERP4= <user>
##$USERP5= <user>
##$WDW= 1
##$XDIM= 8192
##$YMAX_p= 0
##$YMIN_p= 0
$$ End of Bruker specific parameters
$$ ---------------------------------
##NTUPLES= NMR FID
##VAR_NAME=  TIME,          FID/REAL,        FID/IMAG
##SYMBOL=    X,             R,               I
##VAR_TYPE=  INDEPENDENT,   DEPENDENT,       DEPENDENT
##VAR_FORM=  AFFN,          ASDF,            ASDF
##VAR_DIM=   8192,          8192,            8192
##UNITS=     SECONDS,       ARBITRARY UNITS, ARBITRARY UNITS
##FACTOR=    0.0002076,     1,               1
##FIRST=     0,             0,               0
##LAST=      1.7004516,     0,               0
##MIN=       0,             -91722,          0
##MAX=       1.7004516,     108963,          0
$$ Real data points
##PAGE= N=1
##DATA TABLE= (X++(R..R)), XYDATA
0@%%%%%%%%%%nJ3j6J6j7K0k7L3l9M7n5O4p4Q7j01J16j32J51j72J94k19K47k79
33a48L13l51L93m37M85n39N99o64P34q13R02r98J104j225J360j512J688j892K132
52A131k415K759l190L744m488N548p195J0211k6085J11051k0364q7723J0781q3608
66h9843O0459J37715o8141p9792J8031l9642O4406Q9021p4111n2709K649k7142
78e9099R2391O5309j02679n0705J3949R233R9536J7010j26885k9749M7595L8845
90A4751O2262m1179j00886J5481M3975L6251M2604p4850p1809N1528K6010K7467
102C1605M1502r6033o6673Q5118L4863P142J3079r9651l7410J07460L1654k1093
114C1563j8573p8341R806J01285J446l0085k3200o3578L9951R2304k4562l7320
$$ plain form
0 0 0 0 0 0 0 0 0 0 0 0 -5 8 -8 8 -9 11 -16 17 -22 25 -30 34 -40 47 -54 62 -70 81 -91 103 -116 131 -148
33 -148 165 -186 207 -230 255 -284 315 -349 385 -428 474 -524 580 -645 715 -797 891 -1001 1131
52 1131 -1284 1475 -1715 2029 -2459 3089 -4106 6105 -19980 91071 70707 -17016 -6235 -89843
66 -89843 -29384 108331 40190 -39602 -21571 -61213 3193 92214 18103 -34606 -31957 -59099
78 -59099 33292 98601 -4078 -54783 -40834 -31601 67935 84945 -41940 -71689 -24094 14751
90 14751 77013 35834 -65052 -49571 -5596 30655 73259 -1591 -73400 -21872 4138 31605
102 31605 73107 -22926 -89599 -4481 30382 37524 50603 -49048 -86458 21002 52656 31563
114 31563 12990 -65351 -55545 45740 47186 17101 -6099 -69677 -29726 62578 38016 696
126F96k0619m7234N8494Q6007m6525n4519j3719r723O9610N1503o4945m8737m63
139d0174J8365O8352J0172p3285k3837R702K3843O4115j2819q1713p109K8170
151a6218K8981M6308l3580p9677R299M9904K9150J3555n1600n5263L1205M9643
163B1707J9594j0186n7669k8719M6773M1334M995k2353n5984r709O0969L4665
175D5417j5722l7637m0143J5418O1424J8240l3102m1470j7687L6182M8625l420
187C6125l6602l4797l948M6705M0028k1261m3847k3296J3716N2644K6403m2309
199I561m8146m75L7015M2069j757n0717l1474K0859M0516K1578j9436m2778j4664
212c7849K6369L5553J2106k5726m2767o436L9961L6333m863m0355l7116J5170
$$ plain form
126 696 -19923 -67157 -8663 77344 30819 -23700 -37419 -47142 22468 73971 9026 -39711 -40174
139 -40174 -21809 46543 56715 -16570 -40407 -30705 -6862 57253 44434 -37279 -44388 -16218
151 -16218 12763 59071 25491 -54186 -44887 5017 34167 47722 -3878 -59141 -27936 21707
163 21707 41301 31115 -26554 -55273 -8500 32834 37829 15476 -40508 -50217 10752 45417
175 45417 29695 -7942 -48085 -32667 28757 46997 13895 -27575 -45262 -9080 39545 36125
187 36125 -477 -35274 -39222 7483 47511 26250 -17597 -40893 -27177 25467 51870 9561
199 9561 -38585 -39060 -2045 40024 38267 -12450 -43924 -23065 17451 39029 19593 -23185 -37849
212 -37849 -11480 24073 36179 10453 -32314 -38750 1211 37544 32681 -7674 -44790 -29620
224b9620N4435K1173l3633m2570r888L4591M3500n266m1578k4916J0253L2185
236H666K6343j3980l7022j6085J3485L4692K2990k4973m2951p332L0014L9352
248C3199N508m6076l5865J9345M0779K1871j9528m5581j1633L4338L0272K386
260B9015k4807l4299J927L4555K1209l057k8723l2156J2738M1850J5761j8225
272A5788l6416j9536L2813M2328n473l3279k7762K914M0326K5062k2079l0453
284a5767j3204J2892L6954J2204k8222k6869o009K0975L7053N05l8338k3293Q588
297b2531L2244K7572j9164m2426p123K4511K9553Q946l0490l1644Q323K7367K0580
310B5718k277l2533k3094J7088K8968J5187j3224l6606j2801K9706K9643J460
$$ plain form
224 -29620 24815 45988 12355 -30215 -40103 -5512 37988 32722 -8856 -33772 -23519 8666
236 8666 35009 21029 -15993 -32078 -18593 16099 39089 14116 -28835 -36167 -6153 33199
248 33199 38707 -7369 -43234 -23889 16890 38761 19233 -26348 -37981 -3643 26629 29015
260 29015 4208 -30091 -28164 6391 27600 24543 -4180 -36336 -23598 18252 34013 15788
272 15788 -20628 -40164 -7351 34977 29504 -3775 -31537 -28623 11703 36765 14686 -15767
284 -15767 -28971 -16079 20875 33079 4857 -22012 -28021 -7046 30007 30512 -7826 -31119 -22531
297 -22531 9713 37285 18121 -24305 -31428 -6917 22636 31582 1092 -30552 -22229 5138 25718
310 25718 23441 -9092 -32186 -15098 13870 29057 15833 -20773 -33574 -3868 25775 27235
322B7235k6959l1770O535L7513J7892j5058k9042j7546J9534L3503M634k1973
334D498k4837o831K6244K8410n445k7413k1429N514L2618K0213j8545l1233j0002
347b8238J8967L2099N455k8637k5315L799K5442K3858p631l0755j6774J3880K7658
360A3808J4875j8087l1601n871K3478K6685J931k7818k5368Q738K9671J6200j1597
373A5044k8934j3132J8358K6112O611j8660k5258m526K3865K3985j819k6320k2270
386b6944P911L0561J7234j6355l0271r835K2566K7965J115k6314k1455M803K5105
399F086J7444q636k3899j4303J1208K4482J1895j4567k6267q419J9849K6982K188
412B4043k5457k4380N491K9632J8199j4067k8696j0387J8514K5970L179k0961
$$ plain form
322 27235 276 -31494 -24959 12554 30446 15388 -13654 -31200 -11666 21837 26471 4498
334 4498 -20339 -27170 -926 27484 22039 -5374 -26803 -21289 11329 31542 12997 -18236 -28238
347 -28238 -9271 22828 28283 -354 -25669 -21870 3572 27430 19799 -10956 -27730 -13850 13808
360 13808 28683 10596 -21005 -26876 -3398 23287 25218 -2600 -27968 -19230 10441 26641 15044
373 15044 -13890 -27022 -8664 17448 24059 5399 -19859 -24385 -520 23465 21646 -4674 -26944
386 -26944 -19033 11528 28762 12407 -17864 -27699 -5133 22832 23947 -2367 -23822 -19019 6086
399 6086 23530 14894 -9005 -23308 -12100 12382 24277 9710 -16557 -24976 -5127 21855 24043
412 24043 -1414 -25794 -20303 9329 27528 13461 -15235 -25622 -7108 18862 22041 1080
424A080k0212L32K0095J9226l241k2222j7038O379K3685J6692j2201k7717r828
437b4970J7936K6584M897k4652k4155N790K5721J6149q890k5682j2140J5300K1339
450A3227P360j3855k2685m948J8553K0030K034j9643k2884M315K6915J5078j0622
463A2875k4568j3780J8002K6700J121j9122j9451r19K2309J8035p820j9385j2671
476a8674M846K2922J3473j4432k0602q125J2694K5643M670k3954j9242L714K0949
489C882J9767r503k6964q033J3532J9380R295j6853k1925O43J6359J5838K602
502A8020k0313j8870P874J9625J3302n632k5660j1916J8359K0717L873j5170k3767
515a9558Q39K4271J3061n989j7147j6080R233K3116O001j1106j6565j0737J5459
$$ plain form
424 1080 -19132 -18800 1295 20521 17280 -4942 -21980 -15601 8084 24776 12575 -15142 -24970
437 -24970 -7034 19550 24447 -205 -24360 -18570 7151 23300 14410 -11272 -23412 -8112 13227
450 13227 20587 6732 -15953 -20901 -2348 17682 19716 73 -22811 -18496 8419 23497 12875
463 12875 -11693 -25473 -7471 19229 20350 1228 -18223 -19142 3167 21202 13382 -6003 -18674
476 -18674 -13828 9094 22567 8135 -12467 -20592 -7898 17745 22415 -1539 -20781 -17067 3882
489 3882 23649 14146 -12818 -20851 -7319 12061 21356 4503 -17422 -16779 -420 15418 18020
502 18020 -2293 -21163 -13289 6336 19638 14006 -11654 -23570 -5211 15506 19379 4209 -19558
515 -19558 -18719 5552 18613 12624 -4523 -20603 -11370 11746 17747 6641 -9924 -20661 -5202
528e202K3588j641j6554j6460k015K2896J8134j2290j9473r367Q226K2952Q123
541B0917j9225j5954j021J2203J9596k51k0734j2413L979J6821J6385q694k4040
554a2431n960J2444J8040P987j8310k0461M022J7764J3575k549k0687j2622J1267
567g921J6496P441p581k0239o025J5096J5634L428j4228k0181K513K1254J1943
580A7630n812j9025j3529J3277K1578J821j2760j6255l640J7412J4949m295j3727
593b376j2343J632J9148J1297r036j6143r703R827K1235M102j6015j6690m25J7740
607B250J5888o370j8961r101P644J7944P675j2541j5354l083R976J7006K108j5969
621h88j2809P98J5146J5536o243k0418p640R047J7145Q941j5566j8552K885J3000
$$ plain form
528 -5202 18386 16745 191 -16269 -18284 4612 22746 10456 -9017 -18384 -10158 12794 20917
541 20917 1692 -14262 -15283 -3080 16516 16265 -4469 -16882 -12903 3918 20303 11609 -12431
554 -12431 -18391 -5947 12093 20080 1770 -18691 -14669 3095 16670 14121 -6566 -19188 -7921
567 -7921 8575 16016 8435 -11804 -17829 -2733 12901 16329 2101 -18080 -15567 5687 17630
580 17630 11818 -7207 -20736 -7459 14119 15940 3180 -13075 -16715 697 15646 11351 -2376
593 -2376 -14719 -13087 6061 17358 8322 -7821 -17524 -7697 13538 17640 1625 -15065 -15490 2250
607 2250 18138 11768 -7193 -16294 -8650 9294 16969 4428 -10926 -14009 -4033 12973 15081 -888
621 -888 -13697 -12899 2247 17783 11540 -8878 -16518 -7471 9674 18615 3049 -15503 -12618 382
635C82J2933O36j8212j1992Q719J2584Q459l517j8926p596J3205J3142M832r940
649D709j9905K09J8936J0740l744j5028j3916J0206J8513L006r119j4120o200
662a5713J4358J4364k196r884j3300j427J8062J0323o401j2494j2100P250K1530
675A2372K890j3757j1355m861J3109J9243p494j6548m109K16J3738J4706j3267
688D883j4902K80L374J4170J0216j7744j4373N419P624J3594K747k3078r146J3314
702c622R440P572n405k1042o66J6040O354K059q578j7160N248J5275M675p00j3168
717c678j3484J1884J5503J180o278j5568n798J8814J1736o411r211j2201K598
730a0914K0148M161j0922p310p589N769J9289j403j2705n404n444J0445J8409
$$ plain form
635 382 13315 13951 -4261 -16253 -7534 5050 13509 9992 -8934 -16530 -3325 9817 14649 4709
649 4709 -15196 -14987 3949 14689 10945 -4083 -17999 -7793 10720 13726 4607 -9513 -15713
662 -15713 -1355 13009 10813 929 -12371 -13798 4264 14587 8186 -4308 -16408 -9158 12372
675 12372 15262 1505 -9850 -14711 -1602 17641 10147 -6401 -10510 -10294 3444 18150 4883
688 4883 -10019 -9739 -6365 7805 18021 277 -14096 -8677 -1053 12541 15288 -7790 -16936 -3622
702 -3622 5818 13390 7985 -13057 -13723 2317 8671 10730 2152 -15008 -9760 5515 10190 9490 -3678
717 -3678 -17162 -5278 10225 11405 5127 -10441 -16239 2575 14311 7900 -1311 -13512 -10914
730 -10914 9234 13395 2473 -4837 -12426 -6657 12632 11229 -1476 -6880 -12324 -1879 16530
743A6530p704j5496l489J303J4291J2230j5530j4063L063O377J2064M629j8181
756c976q741P607O142J0129m48j8847m527J0192P308P939o926j9247J896J4352
770B853N947K363j2156j5319R547J5248n1k504j1373r613J3966J1607l420m745
784B350j1018m368J5773R970o832p677r841J795J8624M834j2261q846l678Q143
798c032J5544k631j3998n024J542R618J0771p025j2659j923L624J0986P328j1142
812A979j1964J058P620J1561J075j5345q624P436R364P399m977j6002j808J1170
826e8O941K800p569j3170K102J2252M971m67r871j0731O734J3674K625o472j0236
841f475n575J1191J1836l103r917p269R57J2098P673p278r273l830M172J1602
$$ plain form
743 16530 8826 -6670 -10159 -8856 5435 17665 2135 -11928 -8865 -2488 9576 14205 -3976
756 -3976 -12717 -5110 1032 11161 10713 -8134 -12661 -2469 4839 12778 5852 -13395 -11499 2853
770 2853 8800 11163 -993 -16312 -6765 8483 8432 5928 -5445 -15058 -1092 10515 7095 2350
784 2350 -8668 -13036 2737 12707 5875 -1802 -11643 -9848 8776 13610 1349 -7497 -11175 -3032
798 -3032 12512 9881 -4117 -9141 -7599 2019 12790 5765 -6894 -8817 -5193 5793 13121 1979
812 1979 -9985 -8927 -1307 10254 11329 -4016 -12640 -5204 4160 11559 6582 -9420 -11228 -58
826 -58 6883 9683 2114 -11056 -8954 3298 8269 7802 -2069 -12800 -6066 7608 10233 3761 -6475
841 -6475 -12050 -859 10977 7874 -2043 -9312 -8355 3743 11416 4138 -5135 -8965 -4793 6809
855F809L829r363r331r24P859J1051o57j2573p283M684J0583O634p023j2052j563
870i320P998Q515J885r120r222K389Q701O521j362r812p679N661R961M291n207
885D200j1087m190J0868R980j736r358q383K225J2055N677o658q421l876M910
899c794J0496K062q084p118j527O861R714p24j0168o698K852R427P413o405j1466
914g159k062P806Q558J758r356q595L081Q217N897j879r612n556N087Q304L641
929H130m189j0339l173Q973Q374j3q023r401K359J1376M951m820q439n006O392
944b848R850L12o339o695j858P578P950j937p617n508P19R625O566o037r465k782
960h486N902R632J509r279p044K069P119O717k557r541l574M251O681M687m823
$$ plain form
855 6809 10638 1275 -8056 -8980 -1121 9930 9273 -3300 -10583 -5899 4684 11318 4295 -7757 -9320
870 -9320 -1322 7193 9078 -42 -9264 -6875 1826 8347 6985 -2827 -10506 -4845 5116 9407 4200
885 4200 -6887 -11077 -209 9771 8035 -1323 -9706 -7481 4574 10251 3593 -4828 -8704 -3794
899 -3794 6702 8764 680 -6438 -7965 -1104 8610 7886 -2282 -8980 -6128 3299 10712 4307 -7159
914 -7159 -9221 -1415 7143 8901 -455 -9050 -5969 2248 8145 6266 -3346 -8902 -3815 4489 8130
929 8130 3941 -6398 -9571 -598 7776 7763 -260 -9661 -7302 4074 9025 4205 -4234 -9240 -2848
944 -2848 7002 7314 975 -5720 -7578 0 7950 6013 -1604 -7112 -6393 3232 9798 3761 -5704 -8486
960 -8486 -2584 7048 8557 -722 -7766 -5697 1422 8139 5582 -3959 -7533 -3282 3399 8086 3263
975C263r298j190O494O537K209q064q401K471Q967N104k861r012n199O796Q351
990F167P79n456p915r39Q490N984j905o697o131K041R206M064m351p462l838N203
1006b760R117R78p472o407j35Q056O945l875p775l391K743P817M182n937p358
1021e272j305N429P225Q57p792o472J984P353N734l345q779l382N734O912K051
1036F932n660p689J02P106N474j030o524n811K337P789L765l008p875l459N618
1051a933Q020O09o389o720L18P931N635l388p166l651L195P814K528n375n792
1066d364j695M950O722O31o551o095Q57P120N817l014q081l664M532P891K119
1081G175o391o602L18N961N766j251p085l953K183O428L524k827o619l210M477
$$ plain form
975 3263 -6035 -7225 -731 5806 8015 -49 -8450 -5979 2988 8092 5231 -3781 -8980 -2184 6167
990 6167 6946 1490 -6425 -7364 1126 7110 5205 -1492 -7623 -5582 3624 7688 3337 -4125 -7963 -2760
1006 -2760 6357 7335 -137 -6544 -6679 1377 8322 4447 -3328 -6719 -3976 3841 8023 2086 -5272
1021 -5272 -6577 -1148 6077 6934 -858 -7330 -5346 2007 7741 4396 -4383 -7765 -2031 4881 6932
1036 6932 1272 -6417 -6315 791 6265 5235 -1289 -7100 -4763 3026 6791 3783 -4092 -7551 -1933
1051 -1933 6087 6696 307 -6413 -6095 1836 7471 4083 -3083 -6734 -3539 4275 6803 1428 -4364
1066 -4364 -6059 -1109 5613 6244 -307 -6402 -5545 1575 7392 4378 -3703 -7367 -2835 5056 7175
1081 7175 784 -5818 -5500 461 6227 4976 -2109 -6062 -3879 2549 6073 3246 -3373 -6583 -2106
1096b106P080J614n717o642R0O659N607j978p472l883L525P101K172m165o923
1111e038k40M633N555K00n379n281O88O595M127j732p005l799L810P254K135n259
1127A264o437j181O794N396j699n962l979J974O960K535l114n603k508L397O442
1142D279J230m710n404o35N295O293j760o767l947K646O756L381n471n878j53
1157d845L919N780J49n704m419J623M302M462j272o950k898L683M982K920l620
1172B112o936p99O205M005M59n912n435L083O056K009k216n558k993M756N600
1187D436K63l801n376p26O028M536j793n007m193J855P260J937l845m808j921
1202e155L867O267m65n269l436j03M747N309k435n930k080J682N824L298m961
$$ plain form
1096 -2106 4974 6588 871 -5771 -5681 978 6585 4607 -2865 -6748 -3223 3878 6050 1885 -5038
1111 -5038 -5278 -645 4910 5110 -269 -5550 -4862 1733 5860 4128 -2877 -6676 -2866 4388 6523 1264
1127 1264 -5173 -6354 440 5836 4137 -1825 -5804 -3830 3130 5665 2551 -3052 -5560 -2163 4279
1142 4279 5509 799 -4605 -5240 55 6348 4588 -2179 -6126 -3480 3276 6657 1186 -4692 -4845
1157 -4845 -926 4854 5003 -701 -5120 -3497 805 5267 3995 -2955 -5853 -2170 2812 5732 2112
1172 2112 -4824 -5623 582 4587 5046 -866 -6301 -3218 2838 4847 2631 -2927 -5920 -1164 4436
1187 4436 4699 898 -4478 -5204 824 5360 3567 -1440 -5633 -3778 3482 5419 1574 -3234 -5155
1202 -5155 -1288 4979 4514 -755 -4191 -4294 453 5762 3327 -2603 -4683 -3001 2823 6121 1160
1217A160n782K55L950N166J78o605m050L356M121L020j661o682j664M488L605
1232B855J711l158o085mN337L891l52n216m935K717O421J467k501n312k846N592
1248d18N385j364l692l911j72N504L507k758l513l029J453O137J983m342m067
1263c297j544L798O016n27n948l045J067M721M150l167n897n08K982L947J964
1278D712m146m795Q90L347L629N02n199l799K400M581K294j670o425j566N105
1293a40L806L82l759n046J441N294K068j614l615l422K314N250J190k475m293
1308b619k157M035N297q69m410l342K51N756L255l382m691j476K183N305J294
1323D430m426l487L0L469L766m36m564k882J372M353K855k008n354j068K880M264
$$ plain form
1217 1160 -4622 -4367 -417 4749 4927 -1678 -5728 -2372 1749 4769 3108 -3574 -5238 -750 2855
1232 2855 4566 1408 -4677 -4681 656 4547 4195 -1021 -5956 -3239 3182 4649 2148 -3164 -6010 -418
1248 -418 4967 3603 -89 -4000 -4172 1332 4839 2081 -1432 -4461 -3008 3129 5112 770 -3297
1263 -3297 -4841 -1043 4973 4446 -1502 -4547 -3480 1241 5391 2224 -3673 -4181 -1199 2748 4712
1278 4712 566 -4229 -3339 8 3637 4139 -1060 -4859 -2459 2122 4416 2746 -3679 -5245 -140
1293 -140 3666 4048 289 -4757 -3316 1978 4046 2432 -1183 -4605 -2291 2959 4149 1674 -2619
1308 -2619 -4776 -741 4556 3687 -723 -4065 -3814 1942 5197 1815 -2876 -4352 -2169 3136 4430
1323 4430 4 -3483 -3453 16 3782 3346 -1218 -4100 -2728 1625 4480 2472 -2882 -3950 -1070 3194
1339C194J138l999m802Q90M759K719q34n128k311L116L972P42k168m089j049L746
1355a04L999k32l722m066Q26N042K786k540m098k191K337M950J207l742l570o62
1371c780M239L429r09m206k633J637L587K714k430m454j253L255L995J082m222
1386E1l949P74L973K826q80m411k511K650L601J582k278m124j235L377L818L7
1402C301l824l379Q43M421K558j529m200k402K716M356R78l693l131o86M029L569
1418C927j041l816k255R31L330L129k601l766j522K189M003J429l727m167Q88
1433c069L487L017o15m088k754K565L173J756j909m643l67L251K563O13k753m148
1449c921Q79M004K426r16l876k788K594M673N45k785l545q17L486L596j220l067
$$ plain form
1339 3194 4332 333 -4469 -3579 1180 3899 3065 -2063 -4374 -1258 2714 3456 1288 -2801 -3850 -104
1355 -104 3895 3663 -59 -4125 -3299 1743 4529 1989 -2109 -4300 -1963 2987 4194 452 -3118 -3780
1371 -3780 459 3888 2979 -1227 -3860 -2223 1364 4078 1648 -2806 -4059 -804 3191 4273 51
1386 51 -3898 -3124 849 3675 2795 -1616 -4127 -1477 2124 3706 1428 -2696 -3931 -554 3264 3301
1402 3301 -523 -3902 -3059 1362 3920 2391 -1809 -4211 -1495 2861 3839 146 -2985 -3671 358 3927
1418 3927 2886 -930 -3185 -2254 1076 4205 1604 -2162 -3684 -1495 2508 3937 210 -3957 -3069
1433 -3069 418 3435 2820 -1268 -4022 -1457 1716 3472 1563 -3080 -3447 -196 2367 2980 227 -3921
1449 -3921 -3042 962 3388 2472 -1404 -4192 -1598 3075 3620 835 -2710 -3527 -41 3555 2335 -732
1465g32k035K4M239K378k289l039j511J260M248R42l400k774q09L406M183j424
1481B667m290j767J374L578K282k913l694r7K378K306J146k798l463R70L014K264
1497B957j57l868k717J994L873R87j780m185r06L934K772m44k699l240Q99M322
1513A742J672k155k599j610J620L792M01k175k994o22K326L923k97m038k051Q01
1529b264M144J965k633l216j038J987L333R84l597k785J050K462K682o46l332
1544i04k071J369K868K304k253m162L9K557K852J99l012l012J206L007K016j054
1560A949l310j854K386K659P54j579l230q80L288K354j60k805k665P98L929J422
1576C056j907k766j616K211L778k1k764k380k4K544K642l58l195j898P69L081
$$ plain form
1465 -732 -2767 -2743 1496 3874 1585 -1454 -2965 -1705 2543 3485 85 -2689 -3498 -92 4091 2667
1481 2667 -1623 -3390 -2016 1562 3844 931 -2763 -2860 -482 1824 2970 172 -3291 -2321 693 2957
1497 2957 2800 -1068 -3785 -1791 2082 3069 1289 -2896 -3802 132 2904 2460 -239 -3479 -2580 1742
1513 1742 3414 1259 -1340 -2950 -1330 2462 2863 688 -2306 -2928 -602 3321 3024 -1014 -3065 -2264
1529 -2264 1880 3845 1212 -2004 -3042 -1055 2278 3262 -335 -3120 -2070 392 3074 2428 -904
1544 -904 -2975 -1606 1262 3566 1313 -2849 -2810 -253 2599 2798 -214 -3226 -2020 987 3003 1949
1560 1949 -1361 -3215 -829 1830 2584 1005 -2225 -3105 183 2537 2377 -428 -3093 -2295 1634 3056
1576 3056 1149 -1617 -3233 -1022 2756 2735 -29 -2409 -2433 111 2753 2395 -800 -2698 -1929 1152
1592A152K325k050l447r61K335K858N54l079k669R75K486K234o71l613j663J904
1608a330L124Q99j740k982p50K610K606K28k885l107J100L254J949j464k977j943
1624c408K711L141O72k723k670j62K883K217p99k366k077P12L011J708j806k525
1640a481j506J784L446O43l149k474O54K873K150p37l759j380J845K542R58j694
1656G15k517r33K369K483M10k321k960N03L013K319j101l152j859J638L646O45
1672B898k439k893J03K447K870r69k683j667L09L176J549j236k837j486K001K853
1688A996R44k788k178n34K821K675q13l481j561J322K759J505j770k904k68J929
1704c46K435J69k349k458J79K768K137m69k908j995J641L046O94j646k971k73
$$ plain form
1592 1152 3477 1427 -2020 -2981 -646 2212 2766 -313 -2982 -2007 479 2713 2042 -1571 -3234 -1330
1608 -1330 1794 2693 953 -2029 -2779 -169 2437 2665 -220 -3327 -2227 1027 2976 1512 -1465 -3408
1624 -3408 -697 2444 3116 393 -2277 -2439 444 2661 1862 -504 -2581 -1869 1142 2850 1044 -1481
1640 -1481 -2987 -1203 2243 2886 -263 -2737 -2083 790 2940 2203 -1556 -2936 -1091 1451 2409 715
1656 715 -1802 -2735 -366 2117 2527 206 -2754 -2251 762 3081 1980 -1172 -3031 -1393 2253 2898
1672 2898 459 -2434 -2331 116 2986 2017 -666 -2333 -2024 1152 2701 1465 -1372 -2858 -857 1996
1688 1996 2940 152 -2026 -2560 261 2936 2123 -1358 -2919 -1597 1162 2667 897 -2007 -2275 -346
1704 -346 2089 2258 -91 -2549 -2370 398 2535 2066 -842 -2837 -1196 1850 2544 898 -2073 -2346
1720b346K487K572n91k462j914N06K866J073j058k263j179J170K865Q50k143k605
1736b172M5K172K715p35k929j700J105K946J579j866l068m09J883K590J92k445
1752i7k296O16K235J888l93k893j593J237K745R35j626k660o50K640J756Kk094
1769b48k300N22L045J366j103k457j680J992K705O14j696k688p08K562K483k57
1785B152k697j997Q17L045J596j663l063n95J526K954j03j920k045K12K034J944
1801B197o8k774j856P83K856J751j947k766p86K034K987J16l061k178J172K380
1817H40J617j146k540r95J308K144J154j971k176m50K102K181k04k344k166O11
1833b035K952K019j546k945q55J981K597K94k422k181K79K423J577l15k518j963
$$ plain form
1720 -2346 141 2713 2122 -340 -2254 -1748 1118 2191 1133 -1130 -2309 -1139 1726 2576 433 -2172
1736 -2172 -2127 45 2760 2025 -904 -2604 -1499 1447 3026 1160 -1908 -2317 -434 2156 2348 -97
1752 -97 -2393 -1777 458 2346 1953 -940 -2533 -1296 1449 2384 758 -1902 -2552 88 1844 1846 -248
1769 -248 -2548 -2026 1019 2385 1282 -1175 -2855 -863 1842 2456 760 -1928 -2636 -74 2409 2152
1785 2152 -545 -2542 -1725 1320 2916 1253 -1810 -2405 -879 2075 1972 52 -1993 -1781 253 2197
1801 2197 2129 -645 -2501 -1718 1138 2889 942 -1824 -2610 -576 2411 2527 -534 -2712 -1540 840
1817 840 2457 1311 -1229 -2224 -916 1228 2382 411 -1765 -2215 -113 2068 1864 -480 -2646 -2035
1833 -2035 917 2936 1390 -1555 -2410 -429 2168 2462 40 -2141 -1862 561 2138 1823 -695 -2658
1849b658J443K498R97j133k656j259K176K815r9k142k334J06L117J641j027k605
1865a120j499J357K819R54k073k116m48J653K684j21k376k319P17K404K456j617
1881A355k951o30J616K208J003k757k268P79J801K083j76l032j134J268J666J433
1897B264q38l112o54K123J675P84j897k852J55L119J672r34k311j852J732K591
1913A665P45j617k442r41K580K210o24j635k224J48L165J630j616j938j665J250
1929a309L613J33k378j776o09K146K653r86k491j168O82K184J955j788k526PP55
1946i03K427J232k549k864R79J677K376l07l310j495K364J779Q55j357l035m28
1962b559K858J485j46j539k696Q53K649J329p51k043k486K236K695J72j386k484
$$ plain form
1849 -2658 -1215 1283 2280 1147 -1509 -2768 -592 2223 2124 -18 -2352 -2246 871 2512 1485 -1120
1865 -1120 -2619 -1262 1557 2511 438 -1678 -2126 -473 2211 2090 -286 -2605 -1888 516 2972 1355
1881 1355 -1596 -2226 -610 1598 2601 -156 -2424 -1645 156 2239 2063 -969 -2103 -835 831 2264
1897 2264 1426 -1686 -2340 -217 1458 2242 345 -2507 -2352 767 2439 1505 -806 -2658 -926 1665
1913 1665 2410 793 -1649 -2590 -10 2200 1576 -59 -2283 -2135 1030 2660 1044 -894 -2559 -1309
1929 -1309 2304 2437 59 -1717 -2326 -180 2473 1487 -1004 -2172 -1490 694 2649 861 -1665 -1658 -903
1946 -903 1524 2756 207 -2657 -1678 -1 2375 2068 -1242 -2737 -373 1406 2261 904 -2131 -2559
1962 -2559 299 1784 1638 99 -2597 -1744 905 2234 1483 -560 -3046 -810 1885 2057 671 -1813
1978a813r67L388K103j665j733j555J69L528R67j914j762p43J112K950L57k807
1994c85j572l45K319K534q59l292o69Q64K424J872k215l055Q99J536J564O89k717
2011d08j777Q00K050J334o7l051j529J993J884P98j280k974l99L034J991m84k215
2028c00k326J184K828P89j384k078j370K026K666k78j561k238l27K520K354j081
2044A424k477j155O30K989J556k681j808o72J839K801m23k678j305M25K241J475
2060B181p49k529j293J274K493J006j831k451k64K084K061J09k427k367J368K571
2076A236J179j302k634q49J957K062J49j383k583J0K493J616m15k038j652N29
2092a625L036J124j776k387r16J659L106j60k574j626P15J710K063q38k660r32
$$ plain form
1978 -1813 -2780 608 2711 1046 -687 -2242 -2073 1455 2422 508 -1254 -1997 -885 2065 2422 -385
1994 -385 -1957 -2302 17 2551 1692 -1600 -2269 -1405 1019 2891 676 -2379 -1480 56 1620 2309 -408
2011 -408 -2185 -1385 665 1999 1932 -1119 -2648 -655 1229 2027 747 -2227 -2626 408 2399 1915 -300
2028 -300 -2626 -1442 1386 2175 791 -1287 -2657 -631 2035 1757 196 -2042 -2369 151 2505 1424
2044 1424 -1053 -2208 -1578 1411 2967 286 -1522 -2194 -355 2446 2023 -655 -1960 -1535 706 2181
2060 2181 1432 -1097 -2390 -1116 1377 2383 552 -1899 -2163 -79 1982 2091 -336 -2703 -1335 1236
2076 1236 2415 1113 -1521 -2370 -413 1649 1798 415 -2168 -2158 335 1951 1536 -502 -2154 -1625
2092 -1625 1411 2535 759 -1628 -2544 -885 2221 2061 -513 -2139 -1424 286 2349 1511 -1149 -2081
2108b081J082K053J352j559k843k86K328K225k03k358k411J260K589J097j079
2123A166k550j010J987K085N7j373j903k19K276J401n83j729k033R84K434J095
2139B085j566j832j105J778L194n17k545j250k23K564J972j664k272p35Q22K680
2155A386J143j903k175o79J884K132L96k488j991J004J505K034n69l342p38J962
2171d39J979Q21j555k870M71K321J058Qj932k266J088K345J140p64k461j576K320
2188c12K054J00j455k637K8L257J512j578j828j619J198K844P01j879j630j076
2204b320J655L073k50k995j013L89J754K385j329k775o91J207K388R46k110k727
2220b413Q87J541J701K98k709j785J820J565J008q79k738n78J952J866O12j849
$$ plain form
2108 -2081 -999 1054 2406 847 -1996 -2282 46 2271 2068 -290 -2701 -1441 1148 2245 1166
2123 1166 -1384 -2394 -407 1678 1735 362 -1541 -1760 516 1917 1334 -395 -2428 -1444 990 2085
2139 2085 519 -1313 -2418 -640 2554 2037 -508 -1758 -1981 583 2555 891 -1381 -2116 -1294 1386
2155 1386 2529 626 -1549 -2228 -344 1788 2184 -304 -2295 -1291 214 2248 1679 -1663 -2401 -439
2171 -439 1540 2361 806 -2064 -1593 728 1786 1794 -138 -2404 -1316 1029 2169 1405 -1056 -2632 -312
2188 -312 1742 1842 387 -2250 -2222 1035 2547 969 -859 -2478 -1280 1564 2265 386 -1244 -2320
2204 -2320 -665 2408 2158 -837 -1850 -1461 293 2678 1349 -1426 -2117 -910 1478 2424 314 -2413
2220 -2413 -1526 15 1716 2014 -695 -2480 -660 905 1913 1034 -1704 -2282 -330 1536 2148 299
2236B99k584J39K966J374j022j818k350K063K947J56j666j636j397K220K380l09
2252A762j860j895k01K857J873j689j717j251O98L196M71k463j827p6K206K167
2268B251l40k952r62Q01K103J459j285k990J94P76K320R07k217k320N46J994J842
2285B127m71k330j719J399K226N56j189k374m17K387J454R9j746j903J6K892J023
2302B030m17k764j546J490K846O42k139j789n38K272K378q37k239j378O61K221
2318H93J023j388j651n86Q41K427O84k243k123J62K246K056o45k947j058J209
2334a100K526Q95j803k329k66J901J666L40k249j703P29J938J561n80k278j243
2350a995J177K249P41j608k636j15K387K222q85k115j711Q83K501J209j220k413
$$ plain form
2236 299 -2285 -2146 820 2194 1172 -646 -2996 -933 2014 2170 504 -1132 -2529 -309 2071 1762
2252 1762 -98 -1993 -2194 663 2536 847 -870 -2121 -1423 1773 2244 -219 -2046 -2122 84 2251
2268 2251 1911 -1041 -2003 -1202 901 2360 1075 -1915 -1721 -945 1375 2282 65 -2255 -1709 285 2127
2285 2127 1656 -674 -2393 -994 1232 1788 599 -1775 -2192 195 1649 1748 2 -1901 -1885 1007 2030
2302 2030 1613 -1151 -2697 -1207 1639 2281 142 -1647 -2185 87 2465 1628 -611 -1989 -1328 893
2318 893 1916 528 -1123 -1709 -868 1559 2243 0 -2123 -1961 285 2341 1696 -1251 -2309 -1100
2334 -1100 1426 2321 518 -1811 -2077 -176 1490 1830 -419 -2122 -1393 545 2106 1526 -752 -1995
2350 -1995 -818 1431 2172 564 -2072 -2187 200 2422 1537 -578 -2289 -1406 1095 2304 1084 -1329
2366a329q66J824K139J71k142j889N0K267J937o83k335j666J247K472J110j815
2382D92k101l80J795J946O6k255j714Q95K295J007p14k625j034J590K400N99j486
2399G76k729L9K122J833l20k718j279R34K349J250j600k245o15J811K216R8j820
2416A02j951J92J851J886k38k685j304Q56K328J174j644k227l76K094J985k91
2432A752k441j555O47K410J154j066k283p36J147K324N46j409k158l40K402J763
2448B157m55k318j721Q94K555J163j509k284o23J489K500L74k194j758J92J874
2464C36J978o86k568p91P34K397R11j494k611j48J688K436k45k588j301L2K558
2481F38J448p97k517r96J573J660J050j605k299PJ778K072L5k710j996J503K161
$$ plain form
2366 -1329 -2195 -371 1768 1939 -203 -2092 -2042 225 2162 1479 -856 -2522 -1275 1197 2307 492
2382 492 -1609 -1989 -194 1752 1818 -437 -2151 -1256 1039 2046 1332 -1293 -2327 -737 1663 2262 776
2399 776 -1953 -1914 208 2041 1721 -997 -2276 -1342 1007 2257 657 -1588 -2203 -392 1824 1922 102
2416 102 -1849 -1657 194 2080 1842 -843 -2147 -1291 1037 2211 567 -1660 -2036 58 2043 1752
2432 1752 -689 -2244 -1597 813 1967 901 -1382 -2118 -971 1353 1899 490 -1668 -2008 394 2157
2448 2157 1702 -616 -2337 -1443 1112 2275 766 -1518 -2141 -652 1848 2222 28 -1730 -1538 336
2464 336 2314 1628 -940 -1731 -997 1400 2311 817 -1794 -1942 -254 2182 1937 -651 -1952 -1920 638
2481 638 2086 1289 -1228 -2224 -651 1009 2059 454 -1845 -1838 -60 2012 2047 -663 -2659 -1156 1005
2498A005J424j504k661m10J726K266k55j608j760K25J641K097p27k343j253P77
2514a360K737O68j250k049r75J765K714j1k597j877O20K670J528j730k077q46
2530b070J369K457J50j676j522m45J674K234n29k141j783P89K160J925j616k546
2546a570p01J802K239Mj887j944N36J958J544o63k431p66R82J978R22j368k192
2563a557n93J961J587P38k471j765P42K247J321j125k413o62J515K169M4j193
2579E45k575l02K406J748j14k353j580R02K278R69j002j854j159J378K716j63
2595A840k040j597l18K305J863r30k501o00Q75K256R57j748j815m05J361K338
2611A841K70k674j483Q34J876J701j195k493j014J480K117Q36j811k481P88J454
$$ plain form
2498 1005 2429 925 -1736 -2146 -420 1846 1591 -17 -1777 -1552 89 2186 1459 -884 -2137 -1360
2514 -1360 1377 2045 795 -1254 -2229 -464 2250 2239 -358 -2235 -1615 1055 2583 853 -1224 -2070
2530 -2070 -701 1756 1906 230 -1292 -1737 -63 2171 1642 -499 -2282 -1493 667 2592 976 -1570
2546 -1570 -2271 -469 1770 1774 -113 -2057 -1521 437 1981 1318 -1113 -1879 -897 1081 2003 635 -1557
2563 -1557 -2150 -189 1398 2136 -335 -2100 -1358 889 2210 1085 -1328 -1990 -475 1694 1738 545
2579 545 -2030 -2332 74 1822 1708 -645 -2225 -1323 955 1924 922 -932 -2091 -713 2003 1840
2595 1840 -200 -1797 -2115 190 2053 1123 -1378 -1978 -1103 1153 2110 362 -1453 -1858 -497 1841
2611 1841 2111 -563 -2046 -1212 664 2365 1170 -1323 -2337 -857 1260 2096 285 -2196 -1408 46
2627D6J599L6k092j731J006J779J285n49k515j347K131K097Q7j400k066l66K877
2644H77R72p89j777j764J352K334P13j348k094o31J838K235l27k004j250k67K932
2661A002J600j817k080o81J128K649K86k011j712J3J917J915l38k716r86Q02J622
2678E93J820j280k684n42J463K139O56j946k345O43K052J682p29k260j637J930
2694d45J804K41j093k033k35J681J706j73j304k349N63K296J157p37j886j591
2710b398J867K353J5j698j720j17J745K350j125j968j082R50J560J407j392j835
2726a088r15J526J986K47j778k213N83K106K171j183k582j037J224K303P00j463
2742E87k087P0J397J774J51k102j683R09J489J519p73k117j367J332K346P78j870
$$ plain form
2627 46 1645 1681 -411 -2142 -1136 643 1928 1379 -1136 -2483 -352 1745 1832 432 -1634 -2000 877
2644 877 1849 1060 -717 -2481 -1129 1205 1918 570 -1524 -2155 -317 1918 1591 -413 -1663 -1930 1002
2661 1002 2602 785 -1295 -1976 -848 1801 2087 76 -1636 -1623 294 2209 1871 -845 -1831 -1029 593
2678 593 2413 1133 -1551 -2093 -630 1509 2165 219 -2126 -1483 569 2251 1522 -738 -2375 -445
2694 -445 1359 1600 507 -1526 -1761 -80 1626 1453 149 -2200 -1637 659 1816 1079 -807 -2398
2710 -2398 -531 1822 1837 139 -1581 -1698 47 2397 1272 -696 -1778 -828 732 2139 747 -1088
2726 -1088 -2003 -477 1509 1756 -22 -2235 -1652 454 2625 1442 -1140 -2177 -953 1350 2050 587
2742 587 -1500 -1430 -33 1741 1892 -210 -1893 -984 505 2024 1251 -866 -2233 -901 1445 2223 353
2759C53k071M5K189J639p07k494j064J151J919J292j506j869o00J174K134L72
2775A957k126j903J95K256J820q11k650p67R40K785L64j647j824k62J579J708
2791A614k25j714j654Q78J857J146q42k208j120J532J993O18j555j957l76K113
2807A00K004o86k321j515J011K282J023j222j967m40J080K138K57k073j404L52
2823a381J703J481m33k033j432J127K231J011j502k516j27K454J236j91k168j544
2839b084Q44J772J097o28j689j561J869J803J38j255k036OK019J441p44j506j883
2856b397J260K593m5r94j707n63J739J851Kj887j529j0K215J793j312j800r71
2873a762P85J999R96j845j825K40J384J835k31k426r38P61J542J630j214k327
$$ plain form
2759 353 -1718 -1673 516 2155 1448 -1046 -2110 -959 960 2252 746 -1123 -1723 -549 1585 1957
2775 1957 -169 -2072 -1877 379 2199 1388 -1262 -2029 -1089 1696 2060 413 -1411 -1673 -94 1614
2791 1614 1389 -325 -1979 -1101 756 1902 1060 -1148 -2268 -736 1257 1875 320 -1637 -2013 100
2807 100 2104 1418 -903 -2418 -1407 875 1898 676 -1291 -1731 -651 1487 1744 -329 -1733 -1381
2823 -1381 322 1803 1370 -663 -2095 -968 1263 2274 772 -1744 -1871 583 1819 1628 -540 -2084
2839 -2084 -1240 532 1629 1001 -688 -2249 -380 1423 1561 306 -1730 -1724 295 1736 992 -514 -2397
2856 -2397 -1137 1456 1411 417 -1290 -1853 -114 1737 1739 -148 -1677 -1687 528 2321 1009 -791 -1762
2873 -1762 -977 1022 2018 173 -1652 -1412 -28 1807 1576 -850 -1788 -1027 515 2145 931 -1396
2889a396k80J331J257R68j600k100L74J601J613j70k460j252J293J830P24j074
2905F59k312m31K067J722o70p81j857K54J961J139q36j914q78Q69K200N98j504
2922B86j653n41J900J798m80k242q57M31J960J562j758j424m54N55K330N70j803
2939A80j593K23J522J549l31k303j228J139K020P65j053k438l22K046J375j31
2955A420j530j814O06J943J001m13j877j531J325K197J69r82k127k50K127J544
2971A808l60j721j602M86K661M42r86j642q81J486J870J70j763j562J95J650J601
2988A852p83j679j180N29K330Q06j400j978k10J749J352n9j941j332R84J355J153
3005A548p64j962l98R12J874J84j005j897q9J830J456n29j644j066M73K258M27
$$ plain form
2889 -1396 -1676 -345 912 1880 280 -1820 -1446 155 1768 1598 -862 -2114 -821 1009 1733 659
2905 659 -1653 -2084 -17 1705 1035 254 -1603 -1349 612 1751 915 -999 -1877 -1008 1192 1790 286
2922 286 -1367 -1908 -8 1790 1310 -932 -1789 -1358 602 2164 406 -1018 -1472 -917 1413 1983 180
2939 180 -1413 -1190 332 1881 1550 -753 -1981 -842 1178 1943 890 -1548 -1870 176 1551 1420
2955 1420 -110 -1924 -1318 625 1626 1213 -664 -2195 -870 1327 1496 514 -1613 -1863 264 1808
2971 1808 1448 -273 -1875 -1389 1272 1714 728 -914 -1795 -309 1561 1731 -32 -1594 -1399 251 1852
2988 1852 1069 -610 -1790 -1261 1069 1875 475 -1503 -1713 36 1388 1329 -612 -1944 -960 395 1548
3005 1548 784 -1178 -1576 -664 1210 1394 389 -1508 -1597 233 1689 1160 -484 -1550 -1077 1181 1608
3022A608r49j787n92J634J243P18j935j652k8K510J067r40j501j244P28K010R66
3039A856r17k188n66J787J621n16j376j276M47J868J090j082j682p66J161J750
3055A211M08j280j863J32J505J211j07j839j243Q55K189Q63j286j920n64J316
3071d12K032j64j832p47n8J456J440q33j723q23P11K005O54r93k386J09J410J593
3089A439j0k105n43K63J654R23r65j763l81P94K105k73q15j411m13J455J567j96
3107A325j822j047P17J515P92q80j577j036J820J877j02j565j908O49J615J005
3123A378p61j301p50O53J515O11j057j497m01J427J567j42j354j663M13J887J003
3140A528q83j632n27J138J687K2q94j862J13J229J631k28j691j258O38J520J134
$$ plain form
3022 1608 659 -1128 -1720 -86 1157 1875 -60 -1712 -1740 770 1837 897 -604 -1848 -1120 890 1856
3039 1856 939 -1249 -1815 -28 1593 1077 -299 -1575 -1128 740 1830 748 -934 -1700 -539 1211
3055 1211 1619 339 -1524 -1392 113 1324 1217 -622 -1865 -1010 1179 2042 756 -1164 -1728 -412
3071 -412 1620 1456 -376 -1123 -1181 275 1715 882 -841 -1664 -953 1052 1706 713 -1673 -1564 -154 1439
3089 1439 1429 -676 -1219 -956 698 1621 656 -1107 -1488 -694 1411 1138 323 -1088 -1501 -46 1521 1325
3107 1325 -497 -1544 -827 688 1480 600 -977 -2013 -193 1684 1582 17 -1891 -1242 373 1378
3123 1378 617 -684 -1434 -781 734 1345 288 -1209 -1610 -183 1384 1242 -112 -1775 -1362 525 1528
3140 1528 645 -987 -1514 -376 1311 1333 439 -1423 -1310 -81 1550 1322 -369 -1627 -989 531 1665
3157A665p23k196l39J642J015Q4j267j498K99J957P58p75j467m47O47J755O1q91
3175B80j233k03J218J451k00j543j263K32K166N43k65j795m54N27J745O8j013
3192B61j731K86J386J414o79j363j054O68J483N17l23j864m32P88J713M90j625
3209f5r43m18J692O15j39j830m28J002J417N31j026j158o86J151J460o1j257j394
3227a537P93J179J094o72j770m29Q50J582L48j310r36m11J327J066j75j637p74
3244a412O43J366J007j260j359r9O15J418M76j364j334j38J636J250n45j502r04
3261a506N52J568P74j067j169m13J022J749k85j227j000K15J334Q65o27j666m51
3278a332P44J631L28j189j469M63R51R97p2j525q24Q81J045O37o02j656K7P09
$$ plain form
3157 1665 942 -1254 -1593 49 1064 1148 -119 -1617 -1318 639 1397 622 -845 -1292 -645 1110 1171 280
3175 280 -953 -1156 62 1513 1313 -230 -1493 -1261 905 1448 1183 -612 -1066 -539 1206 1274 261
3192 261 -1470 -1184 202 1616 937 -426 -1480 -812 671 1188 865 -999 -1431 -643 1070 1560 -65
3209 -65 -1008 -1426 266 881 742 -1088 -1516 -514 903 1434 408 -750 -1436 -285 1175 1114 -143 -1537
3227 -1537 -744 435 1529 857 -913 -1342 -492 1090 1438 128 -808 -1219 108 1174 999 -638 -1412
3244 -1412 -769 597 1604 344 -1015 -1114 -499 919 1395 31 -1303 -1441 195 1445 900 -602 -1506
3261 -1506 -954 614 1388 321 -848 -1261 -239 1510 1225 -2 -1002 -787 547 1412 785 -881 -1332
3278 -1332 -588 1043 1371 182 -1287 -824 127 1124 1052 -473 -1297 -416 629 1266 664 -992 -965 -256
3296b56J315K6j016j271K05J256R44k95j473o59Q38J172j5n04r60m72J149J320
3314A304n99o10j328L26J423O73q21r60p09O19J602J74j048j052O4J129J001o05
3332E83j062o00K57J390Q23q83j514r8N80J497K40j548m04o2Q54J221n10j231
3350d67n98P60R15P32j133j553J75J307R45m50q76j036O55J020O95m26j040r92
3368a367R48J164O00j082j143j25J270Q89l89j371n69O82J250J24n31p19p17P76
3386c10J173L19j282r76M69M81J228j9j414n49J35J544M57j108j091J84N36J266
3404A043k79j258n37Q12Q59N03l93j704j63Q35P19O19n43j735M18Q88O97j74j091
3423d84p93N21J150Q25q27j024l20M19J559r2r24r00L93O21R74j63j089j190R10
$$ plain form
3296 -256 1059 1085 69 -1202 -997 259 1203 908 -565 -1224 -386 786 771 267 -693 -1165 -16 1304
3314 1304 705 95 -1233 -907 516 1189 368 -592 -1301 -682 920 1094 46 -1006 -942 187 1188 583
3332 583 -479 -1079 -822 568 1391 508 -1006 -1104 -524 973 1213 -335 -739 -801 53 1274 764 -467
3350 -467 -1065 -305 610 1342 209 -1344 -1169 138 1083 633 -243 -1279 -624 396 1091 665 -375 -1367
3368 -1367 -419 745 1345 263 -880 -1005 265 1154 765 -606 -1175 -493 757 881 350 -369 -1086 -310
3386 -310 863 1182 -100 -1076 -607 -126 1102 1083 -331 -880 -745 799 1256 148 -943 -759 -223 1043
3404 1043 764 -494 -1031 -219 640 1143 750 -954 -1117 -282 437 1056 513 -1222 -804 84 781 607 -484
3423 -484 -1277 -756 394 1219 392 -632 -952 -533 1026 934 10 -890 -497 124 1098 935 -154 -1344 -434
3442d34R89N49r69p88o37J195J197o25p65p98M47R12O41l21j104l35O01O92L84
3461H31p92p63m3J166O97J6j323n75L05Q57O75q45r92l94J203M14L21r96n95j8
3481h51R22P37q5r22p71O4J467M57q24p63m22J134J049o05r46p17M58R55L44j20
3501E61j119l37N61J007K86n69j077J6K16J314j93q19n96j87J257N75n46j048
3519f98k21N14J154O1r00p52l3J329L69p4j122o04O14Q92L83o44q27m10N62J439
3539A032l32p08q76p5J316M43n7q84o97M71P78K8o2j153j06Q72P36O2q55o43L9
3560f71R39O31n56q91q0K07J180j40m82q09p4Q28J112m90q91n72L62Q42K99n28
3580B16p25j26J92J285J69j278m27J4J217L2j1j118m49O31R15M85o49r97k35O40
$$ plain form
3442 -434 555 1104 135 -653 -1290 -95 1102 477 -288 -1086 -639 273 914 593 -511 -846 -245 447 831
3461 831 39 -724 -767 399 1096 1112 -211 -786 -481 376 1051 206 -786 -1180 23 437 758 -238 -833 -851
3481 -851 71 808 723 -199 -970 -906 561 1018 194 -569 -991 143 1192 587 -359 -1076 -618 337 681 561
3501 561 -558 -895 -334 673 959 390 -687 -671 -455 859 666 -153 -749 -936 321 896 350 -698
3519 -698 -919 -405 749 810 -90 -842 -875 454 823 749 -373 -977 -363 529 912 268 -559 -969 -407 1032
3539 1032 700 -8 -884 -959 357 800 743 -141 -838 -367 411 439 377 -776 -882 -10 726 788 -67 -710 -671
3560 -671 268 899 343 -548 -628 -421 759 619 137 -672 -746 82 1194 704 -187 -759 -397 445 744 216
3580 216 -509 -635 -443 842 1011 -267 -694 -680 537 569 558 -560 -1009 -378 537 1022 373 -624 -859 -219
3600b19Q01j50o85k45p6O66P80m09j081k23M32R09J63k92j322J95O96O78J75j256
3620d63j87L84Q12J67p2j445J77N15N08N17p52p93O7O78P13n51n21o13N27R05
3640E73K47m42p63k32M47P25J72p57p03k55J184O59k11q83m10L44R16K49o40o63
3660d43l44P11R64j73q65l76n3J037K52k19o56n40L70Q88O8p64m78l05J178K63
3680E15K14j000l24L90Q98J9m15p54k22O55M05J85q95j09K15K79L85j22o49p7
3700d07l4Q34K34n05n18k96P52O24m56n84l92K74P53N91p07l23o04L15Q99M12
3720H62r13l42p5J88P42M6o35n03M2R43K60J6j012j03P12N05k13p05n5l48Q73
3741B85K42k49m94m06J25O64N92o08o53j04O37P11O8r38k80MM88M01K5r07k7L40
$$ plain form
3600 -219 582 432 -253 -498 -574 92 872 463 -618 -841 -409 500 663 371 -951 -756 -60 618 793 -463
3620 -463 -650 -266 546 713 641 -804 -627 -112 396 913 161 -632 -565 113 826 275 -246 -859 -332 573
3640 573 820 378 -385 -617 -170 555 727 -30 -733 -988 196 855 644 -239 -649 -305 611 860 220 -443
3660 -443 -787 -76 888 715 -150 -526 -579 458 710 491 -165 -705 -335 553 621 -143 -621 -926 252 515
3680 515 729 -271 -595 -205 693 712 297 -457 -679 -24 381 566 -329 -438 -223 56 441 319 -330 -407
3700 -407 -441 393 627 122 -396 -692 60 684 228 -356 -748 -474 279 870 163 -160 -764 -449 450 862
3720 862 -51 -393 -468 -280 462 508 -127 -630 -588 355 615 631 -381 -484 228 733 520 -185 -240 -588 285
3741 285 527 278 -216 -622 -497 167 759 151 -502 -606 31 742 810 -128 -408 -404 84 485 510 -397 -424 -84
3763h4M53N43o89o91R7P11L2l1m23n51J73O86M85l60p85j3K71O40j59l23o08K69
3785c57L96P68k49o92m79L62K95O43l34p56L1J74N33L43q81j67k40P12K67K09
3805E78j185j38N63P00J25m08o45k50M12R49K2j263j35N03L01P14j77r33m33M96
3825b04K27K06l43j57P8M12N17l04m57q73N83M83K24o1o21k33M81N57L1l31q57
3846f42K43N02N14k80o41l57M08P43k11j02p11k73Q10K75L28l90q90N51L11L70
3866E58M9r48m52M61O93K31n21m26j09O62J43J69n20o02J60O80M85n11m87k8N1
3887b62O31L05p53l90j67Q83L87m92l10j91O0M46O35p86l68j85N39N89J17q11
3907a23j88j91N06O78j1j050m57M49O25L93l36n19m15N55O17k51l33p90K71P93
$$ plain form
3763 -84 369 912 223 -468 -371 340 372 341 -82 -633 -460 226 711 351 -434 -447 -176 464 305 -18 -626 -357
3785 -357 39 807 558 -134 -613 -251 44 687 353 -403 -372 -198 335 678 -203 -370 -610 102 369 578
3805 578 -607 -745 -182 518 643 235 -410 -660 -248 701 723 -540 -675 -172 129 843 666 -267 -700 -204
3825 -204 23 229 -114 -271 -193 219 736 432 -25 -898 -315 168 392 331 -290 -523 -42 515 546 215 -642
3846 -642 -399 103 617 337 -304 -661 -253 490 279 177 -534 -807 3 278 606 216 -674 -123 188 558
3866 558 607 -341 -793 -332 361 592 71 -355 -464 198 341 510 -10 -612 -452 228 713 202 -285 -313 -262
3887 -262 369 674 -79 -469 -636 247 634 142 -168 -359 -299 147 782 -4 -372 -557 -18 571 688 -123
3907 -123 -311 -502 4 682 671 -379 -836 -387 238 631 295 -224 -639 -84 533 282 -51 -841 -570 223
3927B23K48k87m16l88N11N46k71j20n20j24P57Q47n33m85p96M39Q72L3j71p30
3947c65l22N10P91J4o60j86o09R67M42j76q92J02m1O04M23m72m87l35L83J151
3967H42k14r36j21l1R58J25k22o69j22N2Q17L41o22p49K44J03P83l31m21k82J48
3988c07L90L83j87p53R6K17L36L59n93l00l90O64K92L3k35p23L10P17M00l59n60
4009b10n99M63J053k5o72l89k4L40M38J15n71m84L11N31K94j26p71k10M19O36
4029E19ln11l67NL20Q06l56p08k40M73M26k57J59q18j20P01N39o61j9k79L63J48
4051A20L47n67k74k94L83R19l5r02j04l97P81N48j57n51m75K62P13J92k47m65
4071b03k41J99O26J47m03o15J5O91QK67j232J33L32N93K09l04m73m44L08P74L9
$$ plain form
3927 223 471 184 -232 -620 -109 437 166 46 -474 -598 159 1006 473 -12 -808 -369 503 536 365 -365
3947 -365 -687 -177 614 628 -32 -218 -827 140 582 406 -486 -384 -425 179 602 130 -357 -692 -309 842
3967 842 628 -308 -429 -460 498 623 401 -268 -390 -338 479 820 198 -551 -307 -204 579 248 -173 -455 -307
3988 -307 83 466 279 -474 -378 -161 175 534 -59 -359 -749 -85 207 240 5 -718 -408 309 709 350 -210
4009 -210 -809 -346 707 682 10 -379 -403 -63 375 490 -81 -565 -254 277 571 445 -326 -536 -117 519
4029 519 516 5 -362 -357 -37 769 413 -295 -535 -62 364 107 266 -552 -672 29 568 -93 -112 -391 -28 120
4051 120 467 -100 -374 -668 -285 634 599 -303 -407 -804 -23 525 368 -183 -658 -396 317 509 262 -203
4071 -203 -444 -245 381 528 125 -490 -475 216 224 491 -741 -608 -276 317 526 222 -251 -695 -387 387 426
4092D26m19p47O95M08K13k55n69m56N17O27j91R4j008k3K89R72j57q10k8L11K51
4113A40N10k92o65m9j44Q04L84p82n31O9R40K61l36l33n30L91M99K63m55p56J17
4134d95J92P39J09o76k30j65O81O33m80o62k70N90m9K95j36l42k40O47N51o02
4154I0j25p56J13R35N64n19n42m40L62Q30k4m26p82O4Q09M07k11o29m51K68P44
4175B81K66l25q89j77Q90R93n40o51m37j44P02M12l9o07j82K1O99J00j14p89J32
4196c98O9Q77n8r26k99J85Q96M22l10o91m97M84P67j45n56o11M84M87M01j35l60
4217H6o44K77M44P38p82m3o39N11P04km96o14M30P0N20l21k33m54J96N95J31k29
4239B45p31P9L99O81J63r21j53K0K78O33l63o31r5M18L19K51Rp86l31M37N21P2
$$ plain form
4092 426 7 -740 -45 363 576 321 -248 -704 -187 440 249 343 -665 -688 -399 573 416 -394 -422 -111 140
4113 140 650 358 -307 -356 -500 304 688 -94 -625 -556 384 645 309 -24 -554 -163 336 599 144 -612 -495
4134 -495 -303 436 545 -131 -361 -526 155 788 308 -354 -624 -34 -83 212 76 -266 -506 141 692 90
4154 90 -35 -791 -678 257 821 302 -240 -680 -318 512 488 62 -720 -656 153 560 349 -280 -731 -463 281
4175 281 547 222 -667 -844 46 1039 499 -152 -589 -733 -31 381 342 -265 -447 -426 273 373 259 -530 -398
4196 -398 -329 548 490 -436 -735 -550 346 768 458 -233 -730 -246 521 376 -180 -791 -307 180 581 446 86
4217 86 -558 -281 163 901 119 76 -563 -52 652 650 154 -460 -30 40 560 239 6 -448 -252 343 474 245
4239 245 -486 -407 -8 673 836 -85 -238 -218 60 693 330 -301 -396 22 341 592 601 -185 -516 -79 442 514
4261E14m57p64M41L19K53k3p96j81M85O72J93m63o66J79J92O77k46n69k70K32
4281b78Q30j22o9q20k71R18O5J71m21m12k21N71P51l07p60j60J54N83L31l69n68
4302d04l4M42M90K01q92l81j01N63P37m16m40n89O64N89J01m15m17j80N79K35
4322C32J23m10o05O10K11j21L81p81m96P67K18L25o99l23J48K94M39L2n60m22
4342e37J4J054j4j35p02j61K84L23N56o54p37J86O91K59q4n27k27m8Q13J49m05
4363I8o62K26O84l8O9p45l55M42N71Q9op85rL7Q36J87k75q06k47O13N49J45q33
4386b15k68j71N93N75j52p65r9M27P51j26o26l82M0M11O85o08m44k15K38N92P64
4407A005j119K31p80M40R00o3q89m41L35O51N56o69m79l79N53M94J50m36m62j4
$$ plain form
4261 514 57 -707 -266 53 306 283 -513 -694 -209 463 656 193 -473 -294 -102 575 329 -240 -510 -278
4281 -278 552 430 361 -459 -730 188 253 424 3 -409 -630 -59 692 385 -375 -535 -381 202 533 164 -404
4302 -404 -438 4 494 695 -197 -578 -679 -116 621 205 -235 -824 -160 429 530 115 -302 -482 97 332
4322 332 455 45 -560 50 261 140 521 -260 -756 11 229 554 -145 -468 -320 -26 413 445 -115 -537
4342 -537 -523 531 517 382 -320 -481 -197 126 682 28 -709 -523 168 427 343 -184 -411 -459 354 503 98
4363 98 -564 -338 346 308 377 -368 -723 -281 290 379 373 -412 -421 -384 452 639 364 -442 -689 -76 473 618 -215
4386 -215 -483 -654 -61 514 362 -403 -502 -75 676 550 -76 -458 -418 -7 678 70 -374 -589 -351 241 1005
4407 1005 -114 117 -663 -223 677 614 -275 -716 -381 270 826 157 -322 -701 -148 346 496 60 -402 -416
4427d16K81O11J09p77n23L68O66J62n83m14R8L06P81O5o00q24M93M15M41n29m7
4448H3p65M28N24L11o18p01m8O34P87l33n37p23M89O39N73l59q64l02O84L51N58
4469H11p85l86l30Q28N53m85k11m59R3O45L38k02p98l22Q49J32L15o76m02p9Q68
4490B97M50j36p58m05N59K67n6n1n14o4N55R7L73o45n34K37N13P36l81q76k46
4511e82N17N73P7k98q81L43J63M45K26q74k70J61N10O06n57n16m06N65P48n7k97
4532A96q76r6O45O39k33o03l31J01R75L57q23l39k17N98P31k34o01o98K61J000
4552D52K69o10o22j54N37N22M41p18p12N22K70K15J34p82l00j26Q16L80k94m53
4572b13n54N17J053j92o87q54M82N68Q61o53n95k58P5J151j07j86r36K10K28O11
$$ plain form
4427 -416 -135 476 585 -192 -715 -347 319 481 -102 -516 -418 -112 669 734 134 -690 -197 218 659 130 83
4448 83 -682 -254 270 581 -37 -738 -786 -152 635 302 -235 -958 -469 170 743 384 -480 -782 -98 253 811
4469 811 26 -360 -690 138 691 206 -5 -464 -371 274 612 410 -388 -710 139 271 586 -90 -492 -571 297
4490 297 747 611 -147 -552 7 274 218 167 -347 -411 144 241 614 -31 -565 -328 185 921 540 -336 -582
4511 -582 -65 508 585 287 -594 -251 -88 357 583 -291 -561 -400 110 716 159 -357 -763 -198 550 493 196
4532 196 -680 -776 -131 508 275 -328 -659 -558 417 774 -49 -388 -605 -7 724 490 -111 -809 -548 452
4552 452 721 111 -511 -665 -128 394 835 117 -595 -73 197 412 546 -236 -536 -662 154 534 240 -213
4572 -213 -767 -250 803 611 -76 -930 -448 120 981 328 -267 -525 -450 701 594 408 -528 -318 -90 521
4592E21k58j67l33n07R98K47M8j000l76O03R32N2p96o52K65O43L02p0q71O1J21
4613b37J81R50l86q46l53L16O85K91m36p21j13O76R33p15l61p45P06N48L08k79
4633D02q97j50Q63J34L47r56m93L83L63O46j67j010j55O64L51L39o37o23j47P26
4653a7M12L89j074m67n4J291L14n91m15m80L80Q10L04p42n04m47Q92R00n16n18
4673a33o23L32J130N7k67j319l03Q35J306k72r96k92M6M31O95k23o74n47L83R79
4693E45J68p74o95jP35Q19k52q94m83L72J057K9n38k97r77J128O37k28k29q90
4713g68l2Q52Q15j91j036o24L77P60P57m31r94m46R55P87l31l44r70N86M70O32
4733H24m77m80n09L01Q63L09p99q31J56M37P60j40o84o69M50M74M90j62r64J88
$$ plain form
4592 521 263 96 -237 -744 254 501 549 -451 -827 -224 708 760 -36 -688 -423 220 522 452 -419 -358 -237
4613 -237 -56 894 508 -338 -691 -375 310 601 165 -556 -669 7 940 225 -136 -881 -175 373 681 402
4633 402 -495 -645 218 352 699 -257 -750 -367 -4 642 475 -535 -690 -26 325 664 27 -596 -743 -17
4653 -17 395 784 -290 -757 -811 480 794 203 -212 -692 -312 498 802 60 -444 -891 1 901 385 -133
4673 -133 -756 -424 706 763 496 -823 -1126 -291 1015 743 -253 -545 -499 -68 627 404 -270 -817 -434 545
4693 545 713 -61 -756 -757 -22 797 545 -349 -832 -460 597 626 88 -209 -1186 -58 579 351 122 -768
4713 -768 -800 52 867 676 -360 -984 -607 153 910 479 -515 -961 -6 781 450 106 -864 -278 192 824
4733 824 347 -133 -642 -341 522 831 32 -799 -643 -206 554 414 -270 -939 -489 -15 475 313 -651 -463
4753d63J64Q67Q4n01n69l11P74O78L12j537o3L64O6J069n33r78j47M85J015K30
4773A006r94r08M75J108r3j12m62r78O48Q77M2n68m99k19P91O86l27p36n44P2
4793g35Q16Q02o87o57l42O89P81J63q19n04L2N27J112r46p72r2K89P22R1n07l90
4814d27j91N64O41j59n59o49M27M86N95m12o70m87M01Q68N27p85o51J17M8J036
4834G20j62n63o81J36R89M66q21n48j32O78R4M95p08o56J05O84P45j49j060j99
4854e67Q0P64O80p03q74n7P63N91L1p20p19K20Q11M44k79p55o09O41R98r6o25
4875A9n39m07M81J241m36n35o92M70Q47M48l78q44o18R05J045j51o87p77n6M70
4895a94J352p50o91l95N32R5O23k58n66m50M95J266l57r44o38L62Q12K14L3q89
$$ plain form
4753 -463 -299 568 652 151 -418 -729 45 723 1035 -502 -565 -201 -135 934 401 -577 -724 -239 776 1006
4773 1006 12 -896 -421 687 594 482 20 -958 -310 567 609 41 -458 -677 114 800 473 -263 -807 -735
4793 -735 81 883 196 -461 -803 -114 667 830 11 -493 -461 66 1178 232 -540 -632 -343 379 470 -37 -427
4814 -427 -618 -54 587 428 -131 -780 -353 133 728 316 -354 -841 -440 428 955 170 -481 -364 -316 720
4834 720 558 -5 -686 -550 439 905 84 -464 -596 82 176 671 -37 -693 -588 96 841 692 -368 -567
4854 -567 -487 277 957 254 -620 -677 86 677 708 -12 -731 -511 300 744 465 -290 -899 -258 740 644 19
4875 19 -520 -927 -446 795 359 -176 -868 -398 449 897 519 -325 -943 -38 1007 856 169 -608 -664 -194
4895 -194 1158 408 -283 -678 -146 -51 572 314 -252 -702 -207 1059 702 -242 -880 -518 294 508 541 -348
4915c48k18J69P46K95n02q12L90M17N27j69q93q69R95M13O30m19q96m40R55N42
4935E13K87q15p42L2Q65O22n30l88q63P19M84K68j11o60k83P21M68k79k30o88
4955f10P0J034L52j54j180k9j08J035K42o30n95j68O50N12j97l32q59K14J439
4974F86j18j04p85l69N05M05N90r53l81K07O04N08n62n26n96N55Q42Q2p61o29
4994h00M18N73K63Q5m99p07K50O22L82r9r09l71M83O59K83n17p42k19N21R90l35
5015C31o86k44J21O63O84o46q65j53Q46M97p1l15q37%R38M51o9j199n72R24M14
5036B12M68p57m82j6Q50K27L0l33q85L51R12J51q9r15m74L04Q59L83r68m92k56
5057i20J182K59j08k80p03M44P37J97o92o33l00N94P32J3n90p56M75L09R87l05
$$ plain form
4915 -348 -566 -397 349 644 142 -670 -280 137 664 495 -398 -1267 -272 141 771 352 -544 -984 -29 513
4935 513 800 -15 -757 -725 140 762 232 -156 -1019 -300 184 452 341 -319 -602 119 587 308 78 -610
4955 -610 -540 494 846 692 -488 -517 -625 410 652 22 -573 -741 -91 421 224 -108 -967 -753 686
4974 686 568 464 -321 -690 -185 220 810 -143 -524 -317 287 795 233 -293 -889 -334 508 590 -171 -800
4994 -800 -382 191 454 539 40 -667 -417 205 587 488 -421 -792 -309 350 633 116 -626 -845 -324 666 331
5015 331 -355 -599 -478 185 869 223 -642 -795 51 548 477 162 -675 -675 263 714 645 -554 -1126 -202 212
5036 212 680 -77 -559 -575 275 502 532 199 -686 -335 577 728 639 -276 -750 -446 413 796 -172 -664 -920
5057 -920 262 521 413 133 -570 -126 611 808 116 -517 -817 -223 509 522 -68 -824 -349 -40 947 642
5077F42j027l93N13P13J53m41q51r7Q94N30j32p51n84L56P23M31k72o22o73L66
5097e22J166K4o51p29r7J036L74M7j083k70J77O26N26l59r84N5N48R64k27n39
5117H2q29L02N37M35j02n97n38M14O39L68n57o92k02O41O58j1p60o85L29R39O36
5138A007m01j241l97J019N39N69j126m69lM25O01K63r25k89j9O25L57j62j034
5157f61l08Q53P11Po02p34J29N94P25k39p08m12N13O40J34o59k72m27Q18N18n
5178F15p51n24J46R31L71k98r28k72N04L87P08o14r98J85O21N48o6q74l48J67
5198d90Q47N74p84q41K9M37N56L68p46m78J50O16N27q1q90p03O97M41M32m61j029
5219h29J47Q94M03J09r47p00L90J121L80m48j019l8M35P97q0l56r16J94M54P47
$$ plain form
5077 642 -385 -778 -265 448 601 160 -691 -788 106 636 504 -247 -831 -475 248 679 407 -215 -888 -522
5097 -522 644 668 17 -712 -809 227 601 648 -435 -705 -528 98 624 265 -719 -664 -116 848 621 82
5117 82 -747 -445 92 527 425 -172 -710 -296 343 711 154 -538 -740 -99 559 548 -212 -897 -568 371 1007
5138 1007 606 -635 -1032 -13 526 1095 -31 -500 -503 -78 523 786 -139 -428 -447 178 535 373 -661
5157 -661 -969 -116 595 602 0 -734 -605 -11 714 475 -233 -645 -132 508 642 -17 -289 -716 102 620 615
5178 615 -136 -660 -514 417 788 490 -438 -710 -206 181 889 275 -723 -538 83 631 565 -309 -657 -490
5198 -490 357 931 147 -694 -665 -228 328 696 -50 -528 -378 238 765 684 -206 -909 -212 229 661 200 -829
5219 -829 -682 212 615 724 -223 -923 -533 588 968 520 -499 -537 -102 695 615 259 -657 -463 -9 738
5239G38k83o17n18J12J169M82p78p63l07N24J123p60n20j89l5P69P92j23j458
5258f42l23O79P81K63q90n39qM26R20q5p21o05j15J107K70P1q20k86K35J011J3
5279G42p28j098N92P97L73m8p64q01L50Q41N25n32q55j13O12O48j03k03j152M81
5299d36Q61M33m78p25n16N21P54M47m13j183K08O10N65K3j103l48M6Q89O53o40
5319A68p63j77L96J166j15o84p11K2Q53P24n47p14j50N6Q18K94l96o51l93R79
5339A75Q03m1r46r43K76J022O02q57m17n25R77M56j21m85o37k93Q06Q36j08j101
5359e21l22O05P77L60m10j210k43O34R75J41o29j121J68R64N81k58q54l80O28
5378a15N29N72p59o54k55N42Q51j93p11n64M18M89O25j19q32o05O41O04M05r42
$$ plain form
5239 738 455 -162 -680 -568 601 1083 305 -458 -765 -241 882 122 -398 -587 -622 147 939 816 -642
5258 -642 -965 -286 495 758 -132 -671 -679 -253 667 582 -139 -744 -859 248 518 589 -231 -517 -282 729 742
5279 742 14 -1084 -492 305 678 630 -134 -935 -585 256 781 249 -606 -719 -107 541 438 235 -917 -436
5299 -436 425 858 380 -345 -861 -340 414 861 448 -735 -527 83 648 671 -432 -780 -734 155 808 168
5319 168 -595 -772 -376 790 675 -9 -720 -698 155 879 332 -382 -532 -476 342 636 240 -411 -804 175
5339 175 978 937 -9 -952 -676 346 948 91 -326 -851 126 582 461 -24 -661 -954 -148 688 580 -521
5359 -521 -843 -238 539 899 489 -721 -964 -330 645 786 157 -964 -796 168 749 491 -363 -743 -115
5378 -115 414 986 227 -427 -682 -140 711 518 -193 -757 -339 150 775 656 -176 -781 -140 464 869 -73
5398g3n40k25J100M40J35j281r4O7Q05K70n27p26j05M67J100q6p90q22J25J001
5418B41O89n41o65l61K74J022L42j138m96N5Q74M04J35q41n85q2R95K62n9r60
5438d35l94Q08N90J1o19l33l40P47Q13j47o02j082P06O46M20o33p61m53J034M96
5458D72J3o40o45J90P44O61o32n48Qj86R75K55m09j001Q7N38P79o2p91m43l1R36
5480B70L63k87j236J01N00Q93K36r25m72j25O43P53n2q91n02K81P23L55L4j161
5500d99j63N16P39j58o34l02j1P92L79j38q25k71J84O96J48l48n47j27O39R19
5520I89n90q03k28j60J120P96j152l99r9J07R51L04j153m8k16N98Q05j14r75o23
5540h90M16J115Ok02j109J34M05J004P9j192n06J39R83N22o63r00j33Q58L45J09
$$ plain form
5398 -73 -613 -838 262 702 837 -444 -538 -471 334 604 77 -649 -754 -287 813 727 -63 -885 -760 241
5418 241 930 389 -276 -637 -363 659 1001 -137 -633 -578 296 700 835 -6 -591 -673 322 584 525 -435
5438 -435 -829 -21 569 580 -39 -372 -712 35 848 701 99 -983 -277 369 789 156 -605 -1058 -24 472
5458 472 485 -155 -800 -610 134 795 163 -385 -377 -563 412 667 258 -743 -656 -118 661 599 -192 -635 -666 270
5480 270 633 346 -890 -789 -289 604 840 -85 -557 -682 -39 714 662 -229 -731 -450 273 628 662 -499
5500 -499 -662 -146 593 435 -199 -501 -512 280 659 521 -304 -575 -391 305 453 105 -442 -569 70 989
5520 989 399 -404 -632 -792 328 1124 -28 -427 -526 -419 532 836 -317 -365 -581 17 822 708 -267 -890
5540 -890 -474 641 647 445 -664 -530 -125 879 958 -234 -740 -601 382 904 241 -659 -792 66 411 520
5560E20l79r43L0J089N81r5q13j039M20R14M78o72m21n36Q54J001m20m57o96J44
5580d40P72M97p06n86k52N2R98J15j18p82j51N26R40k53p63n04K1R43N83l30q25
5601b63l21l6J191K47q47n13J03L54O88j85m30p50K92J039N6m02q16j13Q33Q10
5621I37l88m65r01L4Q58O43n83m61j48J23J063J27o82m03p02P84R53j90p05l20
5641d26l84J022O53l84o23o46M13R07m7n3j030%K90O59J17m73q52O32L51O95k94
5662E27n74q71N37J026R6q29p97J42R14P52n76o52n96R72K31M55o98p73J03K99
5682c12R32O1p75o08M56P13J43l97p50l47N20P27J7l57o18j57Q54N93l87o82l39
5703g13l5J279J35k80j044r3N28R51j52n63p21M18L21M46j52o31r3k03J257J55
$$ plain form
5560 520 141 -802 -772 317 898 803 -10 -1049 -629 285 763 91 -330 -866 -12 989 569 112 -584 -440
5580 -440 332 829 123 -463 -715 -663 335 450 332 -450 -601 -75 865 612 -151 -655 -634 309 892 562 -263
5601 -263 -584 -620 571 818 -29 -542 -439 -85 603 418 -12 -762 -470 569 625 223 -593 -706 127 937
5621 937 549 84 -817 -783 75 718 135 -326 -474 -351 712 839 157 -246 -948 -164 789 599 -106 -426
5641 -426 -810 212 865 481 -142 -788 -375 532 485 432 -598 -598 -308 351 468 -5 -857 -225 126 821 527
5662 527 -47 -918 -381 645 741 -88 -885 -743 171 923 347 -305 -901 71 302 757 59 -714 -611 -312
5682 -312 620 681 -94 -702 -246 467 610 213 -537 -884 -364 363 380 23 -595 -752 102 695 308 -374 -713
5703 -713 -748 531 666 386 -658 -751 -223 728 576 13 -708 -290 31 477 325 -306 -399 -602 655 810
5723H10o88o69l58P96R60l93n13o32J31O61O66l23r39l84O81P16j1o09m78L27
5743b49J56P79o53k73l82j9Q10L46n92l30l91N34P03M83j235m71N30L74P47m03
5763D64r52n30P47Q00J78p93n56k99J180O59l17r35m35L51O39N20o19m27j62K91
5783a96P11K45q53l41l46Q46P39l21q76l05N21N34O35q05n99l50P27O38nq02k51
5804d54j74Q88N51m59l74o07N65Q88o6n95r41R6N38Q30o7p38l63M0O67J40J76
5825E41q36m53N52O76J19k19j025j20P92N85K4r16k61P1P23N08n16r19k37R33
5845B2M45N75j041o70J80Q40N28o46l65o07M31Q19J54m13j093L60J98J055j06
5864F66r07k31J43O41M53l09p02r71R46P14J55o48q18K14Q60N81j60p68p04K70
$$ plain form
5723 810 122 -547 -905 -109 851 458 -55 -687 -556 105 771 448 -491 -875 -194 522 511 -98 -576 -249
5743 -249 -93 686 33 -240 -622 -641 169 515 -77 -407 -798 -264 439 922 -313 -784 -254 120 867 464
5763 464 -488 -1018 -271 529 707 -86 -642 -941 239 898 581 -354 -789 -438 201 721 102 -325 -487 -196
5783 -196 515 760 -93 -434 -780 66 805 484 -392 -697 -176 358 993 188 -411 -761 -34 604 599 -203 -454
5804 -454 -628 260 811 352 -22 -629 -64 824 758 163 -778 -682 -144 686 619 -119 -482 -442 225 365 541
5825 541 -295 -748 -196 480 599 380 -645 -765 27 612 636 -280 -541 -470 253 761 245 -674 -911 22
5845 22 467 1042 1 -669 -489 351 879 233 -132 -739 -308 511 665 252 -841 -481 -283 772 666
5864 666 -241 -472 -329 312 765 456 -246 -1217 -271 443 598 -50 -868 -654 206 787 627 -141 -845 -575
5884e75P49O25p78m73j98N68L33P80j132p56L47O57Q12o43p17j01K73P49Q5k74
5904C31j017R4N59P86o1j186Q1k12J060Q8k19n04n91O09Q36j4n54r19K08O87P73
5925H35m08r81KM20N00M04k50r78k45O40P56k12m65p98L50P18O17l84j010p3M50
5946a12N08L57n95p53J80N70O11j18o10j066P66L73O72l17j094j93Q91O28m63
5965B35k28o79j3P10N58k28q44m23L65R47L80r29n09k46L49J180j44o81m73K96
5985c77Q49M37l10q42o01Q05K76L76o60p63j67Q07O75L6q61o73O03R12J87n97
6005A12n54n36O70Q15P6p50o25L03Q92N52p08k31r56N17P09K58j74j202QP65O65
6026F06k06m70n10M0N02N31l27n67k64N43M00Q4j08q07l14Q82Q17Pj299m53M34
$$ plain form
5884 -575 174 799 21 -452 -650 -82 251 1031 -101 -857 -510 147 959 316 -401 -502 -229 520 605 331
5904 331 -686 -592 -33 753 692 -494 -413 -625 435 523 304 -200 -791 -182 654 640 86 -833 -625 62 835
5925 835 427 -554 -552 -132 368 772 522 -456 -701 -61 695 483 18 -780 -430 288 905 521 -489 -562 -112
5946 -112 396 753 158 -595 -415 155 766 648 38 -1028 -262 111 783 466 -628 -821 70 698 235
5965 235 7 -672 -685 25 583 355 -489 -912 -547 400 780 -149 -658 -904 -555 625 481 -200 -673 -377
5985 -377 472 909 599 -243 -844 -39 237 613 -47 -810 -977 -170 505 541 -320 -993 -390 522 709 112
6005 112 -442 -978 -308 507 583 -167 -792 -489 403 955 247 16 -940 -423 286 544 370 -832 -824 -59 606
6026 606 400 -70 -580 -540 -38 493 166 -401 -665 -122 278 362 254 -553 -867 15 832 839 -460 -913 -479
6047d79Q05M18n53o99j80N53N97M95j035m46r5P24M73P8q14o73K27J237K05o44
6067A94m07n05P11N59p3n67m89O8O69O59j69r08l53L20R38j12k55p60l6K51J097
6088H32l56q80k44J6J257J44q08m83l13P39P72J76p94o71R0N33N39j16n04n92
6108f63M25M00M57l46r05N4N42M58K46o19l68j22Q49K74m99p20k71N09R08k1q25
6129b37k69K6O36P07k05q31l78j00J180K13m51n99n20R59L92Ro53j55j92O86J42
6150C60j42p12r1K25O01P03q85o47r6K73P31J37l65p40L15P00M79n55o00l36M03
6171b42M72O10p15n70L1L86K16K14m43m67j38J198M50q15n42o02Q62N68L87j478
6191f18R7lM34N79l0o70m94L93Q17J27n60m25r4M18K96L37o90n01L75M98N11l34
$$ plain form
6047 -479 326 744 191 -508 -688 -135 462 957 -78 -524 -619 105 578 656 -158 -831 -604 633 838 194
6067 194 -213 -718 -7 552 479 -88 -577 -509 160 819 650 -258 -611 -291 647 535 280 -480 -516 -265 832
6088 832 476 -404 -648 -632 625 769 -39 -522 -835 -96 676 852 58 -613 -523 10 549 433 -71 -663
6108 -663 -238 162 619 273 -632 -578 -36 422 668 49 -319 -441 408 682 183 -537 -808 -299 609 588 -237
6129 -237 -506 -480 156 863 658 -173 -551 -651 529 742 291 -308 -828 131 523 532 -121 -276 -468 218 360
6150 360 218 -494 -585 -360 241 944 59 -588 -684 -411 320 457 92 -648 -333 367 846 291 -309 -645 -242
6171 -242 230 840 125 -445 -414 -28 188 402 -41 -508 -646 552 1002 187 -355 -957 -95 473 860 -618
6191 -618 -521 -524 -90 489 459 -211 -705 -312 505 632 72 -353 -447 -29 267 604 -86 -587 -212 286 797 463
6213D63r04k83O67N27L51q43k04l38Q24L80k58q53k03J67N10P40n10q69N2N94
6233A0R97n47p02n45N29N83N72o65r21P7M67M29K18n80m84N6L10P28q1m07p83
6254g39N44O03O2l45n98n79N52R02L21n47q39L63J56R61j85o53j016O87L02O83
6274F35n32p77J01K54Q91k22n61k38m9N43P39p14n41k81N32R15K78r03l70m87
6294g87R79M33k90m14m78L04M46N73k99r43l36N07O12L95o28r19K33P73N17j27
6314E51j181K7Q7J125N2k12o70j39L05J127m21n89m67m34J113O15o38o70k81M92
6334b08N34J35j29r89r1P70M10O3r57j60J75P15L52l37o42n63Q23N61L22r20n05
6355f41K91K69O92k67q31m06M44P98M43q18n72k46R35L14M40q41l69r1P07N34
$$ plain form
6213 463 -441 -724 -57 470 821 -22 -226 -564 260 640 382 -471 -674 -507 3 743 233 -636 -584 10
6233 10 1007 460 -242 -787 -258 325 897 232 -689 -612 -145 284 502 -78 -562 -506 -196 532 451 44 -739
6254 -739 -195 408 470 125 -473 -1052 -500 402 723 176 -663 -300 -144 817 632 -21 -1037 -350 -48 635
6274 635 103 -674 -573 -319 572 350 -211 -449 -498 45 784 70 -471 -752 -220 695 973 70 -300 -787
6294 -787 192 625 335 -79 -557 -253 193 766 467 -476 -812 -305 307 702 74 -845 -612 161 678 551
6314 551 -630 -603 -516 609 661 449 -221 -360 -55 1072 651 62 -405 -839 274 889 251 -419 -700 -208
6334 -208 326 461 332 -657 -748 22 432 495 -462 -622 -447 268 620 283 -359 -922 -99 462 784 -136 -641
6355 -641 -350 -81 611 344 -487 -893 -449 349 792 -26 -598 -844 91 405 845 4 -365 -456 251 785
6375G85o20o87k78K62P73P45q44n70p9O38O21m22m35p12M55L74L09N0j069K81
6395d23M62M64Q9l98j009L70L96N51Q9q36l46j75J198K25o17m70l11M28P81K7
6415D95l58n20l43R67O34o94k79m45L71K44P25q07l35j17O63N94l52n38p00N97
6435a98K73N83m89n52n89J153K53M20p04p18O4O55M38k26n45k51M84L89L28n67
6455B01o10j54Q25N65l29m47o06J33N74N52n48n90l35M82R46k35l69r94K90O47
6475bO75q4p58m57M49L96L80l68q72J14P5R89Q8o24m03k76Q26K95o7o08m88O49
6497g1L45N59m37q36k59Q96N47j69o56m16J46O28M80l85p52k85M08M33M48k39
6517C85j008J20M02M90J38p49n96L50P20N20p35k72o42N41O24L11p21o40L18N41
$$ plain form
6375 785 165 -522 -800 -538 235 980 136 -434 -513 125 746 324 -111 -823 -368 6 315 365 -704 -423
6395 -423 39 503 592 194 -815 -445 -49 502 591 -245 -591 -766 432 657 40 -430 -741 -313 468 495
6415 495 137 -383 -726 241 875 181 -98 -543 -172 72 797 -10 -345 -462 201 795 443 -95 -795 -198
6435 -198 75 658 169 -383 -972 181 434 854 150 -568 -504 151 589 363 -182 -433 51 440 768 201
6455 201 -409 -563 262 827 498 51 -555 -422 152 704 156 -434 -769 -287 659 424 55 -939 -649 -2
6475 -2 673 589 -169 -626 -177 219 599 231 -641 -527 -452 537 625 1 -402 -678 148 443 376 -232 -720 -71
6497 -71 274 833 396 -440 -699 197 744 575 -81 -497 -351 277 757 372 -380 -665 -257 176 624 385
6517 385 -623 -503 -101 389 527 -222 -818 -468 252 772 37 -235 -877 -336 288 599 -122 -762 -444 97
6537I7L95r8o93m88O45L52P10n22o99j8L76K81P8o57n21M80P40j5m6q75q1N21
6559c8K08P21p61n04j42N82P99l50l72p81L34Q57o0k76l36l71K37N83J1k77r63
6580h99L80P74P03j78j176j40P6O26J60l93o78l0O58P77N4q44n72K36M50N11k36
6601B59n47j98j3J096J09q22l50j33O39N48n4o79m47M04P04o3m74n77K46L7L69
6622E4Q63j072m22M19L22L82k97q4o32M90R6L04m6r77l14O63Q01m3p95k71J78
6643c81P26M54m39p27n13M83R88j16m94k80m4K97O24L8o38o29J90N48L28k6p55
6664c66j82L14Q03O3j017M5n01J264L96j2r77n13P16J82L49o67j48l08N60M60
6684D61J85p51l94Q3M79P09m10r66j33O74N62k6m17q46J82O20M56j42m27n32K40
$$ plain form
6537 97 492 394 -299 -787 -142 210 920 398 -301 -319 57 338 416 -241 -762 -282 458 443 397 -478 -559 -38
6559 -38 170 891 130 -374 -516 66 865 515 143 -638 -304 553 493 217 -119 -490 -253 330 341 64 -899
6580 -899 -519 255 958 780 -396 -536 -460 166 326 -67 -745 -775 -117 660 714 -130 -702 -466 -16 495 259
6601 259 -288 -486 -499 597 706 -116 -466 -599 40 588 534 -145 -592 -188 516 453 -21 -598 -352 -315 54
6622 54 917 -155 -577 -158 164 546 249 165 -467 23 119 423 377 -600 -914 -251 550 507 -288 -559 -381
6643 -381 345 799 360 -367 -880 -397 591 475 -19 -299 -343 -46 578 616 -22 -651 -461 87 415 389 -366
6664 -366 -548 -234 569 632 -385 -340 -841 423 819 807 -170 -683 33 215 564 -103 -251 -559 1 461
6684 461 646 -105 -499 -416 63 772 362 -604 -737 -63 499 473 56 -790 -608 12 468 326 -101 -633 -393
6705c93O83K25m41k59n44M80Q86J5p06n35L86N55J71l42n11m5K77K10M08l72m67
6726c19J5K92N20j82k06n18m54J143J31k61m94k00R0J007k43l72m96J42O22K69
6746D86k97m72k79R7M05Q30n83m07k52L80Q46jr07n69M6P80M84j97o27m02K27
6767d12Q61k6l10o52j62O78N23n7l64p04K64M95K12j20m16j09m2Q46K30q15m99
6788e79n9P30M79k25o16n22M00O94J89k0j113j46O43Q63j42p34q53L30P81P41
6808H41l60j068KL58M98L31n99m82l8O45K75J07p17o05N66N90K17j19q06j33M53
6829d4P65j81o34l88P8L27Q28m32n16r21R14L97K72m79m43k87O28N40q4j45j074
6850h79M03J010K53l77r84O3K98L84K88m92m05p3M71O88mn58p35j29J041L37l07
$$ plain form
6705 -393 290 515 74 -185 -729 -249 637 652 -54 -589 -203 352 523 181 -330 -375 -98 112 520 148 -319
6726 -319 -304 -12 508 326 120 -398 -852 291 422 161 -333 -533 -443 564 321 -51 -547 -405 217 486
6746 486 189 -283 -562 -465 -60 770 187 -220 -472 -92 754 753 -154 -723 -677 103 587 390 -237 -639 -412
6767 -412 449 423 113 -539 -701 -23 500 443 79 -625 -361 134 346 226 -190 -299 -341 505 735 -80 -579
6788 -579 -638 92 571 346 -270 -792 -392 302 491 471 -642 -788 -145 718 576 -158 -1011 -681 100 841
6808 841 481 -587 -585 -227 271 602 3 -479 -517 128 403 510 -207 -812 -246 344 561 442 -364 -497 -44
6829 -44 721 540 -94 -482 -404 -77 751 319 -197 -1118 -204 193 465 -14 -457 -744 -116 424 340 195 -879
6850 -879 -476 534 787 410 -574 -511 -213 171 459 -33 -438 -511 -40 648 644 86 -649 -778 263 600 293
6871B93o81l13P32N91m59m32j45K1M98M22l1o38n68L00Q78m4k11m29k86M24Q50
6892G72l45k32n31j8K74O62n0r90m23P58P88r0l00n08R6J22N01k61k64q08L98
6913d49L82O38l79m24k85M03M94P1n18n99R1O85M74l61n63j41K49P27J90k60p80
6934c55J20q9Q33K64n73m62O9N64K37l84n19l29K37Q79k07r8o96J29M08L70j32
6955B66o64j08P4M23N00l27k96o05K88P43J21p6q16K49L22M78r4p75j14J78Q54
6976F21k31j50p71q3M56O24K53q24l04K41J57O41k43p39l8jM84L66n31m22J41
6997c53N23M13p6m69l62r8N65L77l22l08l12p4M26L86o86j85j57J097p7j13pp66
7019e78J79M95R6R5p15k55O86L08K15m18o53Q6O79M13M0q41k43R8N13K33j72m42
$$ plain form
6871 293 -388 -701 31 622 163 -269 -414 -393 105 527 496 -142 -710 -410 468 424 213 -216 -502 -78 772
6892 772 427 195 -336 -354 -80 582 532 -458 -881 -123 665 575 275 -233 -137 -15 486 225 -39 -847 -449
6913 -449 -67 571 192 -232 -517 -114 380 451 -67 -666 -575 110 584 223 -340 -481 -232 495 685 425 -355
6934 -355 -235 -324 509 773 200 -262 -193 371 608 224 -295 -624 -387 492 285 187 -509 -380 28 398 266
6955 266 -398 -506 -432 -9 491 164 -132 -737 -449 294 415 339 -477 -228 94 572 478 -297 -411 -233 621
6976 621 390 240 -531 -614 -158 466 719 -105 -409 -168 -11 630 387 -352 -390 -391 93 459 -72 -494 -353
6997 -353 170 583 507 38 -324 -422 143 520 198 -110 -422 -496 -70 316 -370 -555 -712 385 308 195 188 -578
7019 -578 -399 96 192 287 -428 -683 3 311 526 108 -545 -459 220 633 673 -168 -411 -313 200 433 261 -181
7041a81l75N37O73l01m22k03k39R43K13k50r08j56J27M78O06r01J42k19L27P06
7061E97l26j82q52P84L19M4k91m28k87N30L91n6j60l58k57N60N54m75m50k36J41
7082d38L57N43m01n10L12o5M67nl21k25L51J80N21p78o3k56L80J56L68l07p20
7103d54J11J05N08l4l78l37L58N04L5j96l47m84L22Q13O0m71m62L7O86K23n35
7124F4k85k93J44N01M56k9r53L5L38O42j35n10m59K81M39L25l58n50m06N41K79
7145F7J88k38o77L69K06M02Qk97n00q4N46M90m0n74m15N23M65Pl81m18l6M81M82
7168E74j28o30l28N03K5M47n67l10P5M48K46J99o49m39J29N94L79k10p70o8M52
7189b8L26o7l72j45k02N75K80j68j37n28J93O50K21n41j98l46M42L22P4k68o38
$$ plain form
7041 -181 -556 -19 654 353 -69 -272 -511 432 645 395 -513 -669 -542 -64 542 -359 -217 -436 -109 597
7061 597 271 89 -763 21 340 384 93 -335 -622 -92 299 243 83 -275 -532 28 582 107 -343 -579 -438
7082 -438 -81 462 61 -449 -137 -202 265 260 -61 -286 65 245 766 -12 -75 -331 49 205 573 266 -454
7103 -454 -343 -238 270 236 -142 -479 -121 383 418 222 -125 -609 -287 526 586 115 -347 -310 376 599 64
7124 64 -221 -514 -370 131 587 558 -395 -360 -22 620 485 -25 -484 -203 236 561 203 -347 -753 -212 67
7145 67 255 17 -660 -291 -85 317 325 28 -472 -556 -10 480 440 -134 -549 -26 439 446 65 -353 -389 92 574
7168 574 446 -184 -512 -9 16 463 -104 -414 -339 109 355 554 -95 -534 -405 189 568 358 -412 -480 -28
7189 -28 298 231 -141 -286 -488 87 367 199 62 -466 -273 377 598 57 -141 -487 -45 277 351 83 -555
7210e55M19O1N59j61o58m97P79O65k20k86n96J18L78L98N7p20J9m8M80L36o77
7231a49j69l64O30J94M57p00k33pP41p8k27n03l5K15K40L55r6o64m5L20J96J22
7253B00j55k59q1M55N34n60l12K4K18L42K25m66o86M00L35M19k32n41L7k11L21
7274GL85P4o66o8K56J91P04j039l32K03M18J82J18p40l33K52N31kkl05k77M00
7296d3M14j90j09m18K21M22J45r6n82m52P64J55j40p9j43j03P7L31j25M6o07K67
7318b45M01J5l0m75m22L01R01o4n07k44j07O08N08l66o36M9Q3L62J21k71k54j30
7340d02N1P76j87l11k17J39N7N70n00m28p1L16K19M06m39l77l78P81L36j73J58
7361C26p17Q8N83J68j61l80m60K87O98j73n61l5j83L56M64j63j13m17L27M65Q7
$$ plain form
7210 -555 -136 -75 484 323 -335 -832 -53 612 392 106 -490 -372 6 404 461 -259 -240 -288 192 528 -149
7231 -149 -318 -682 -52 142 599 -101 -334 -341 400 322 95 -408 -443 -228 12 367 271 -393 -438 -118 78 200
7253 200 45 -214 -295 160 694 134 -178 -154 64 406 631 165 -521 -121 214 633 401 -140 -103 -314 7
7274 7 392 466 -200 -268 -12 179 883 -156 -488 -285 133 315 433 -307 -640 -388 143 141 139 -166 -443 -43
7296 -43 371 181 72 -346 -125 297 442 346 -236 -688 76 231 91 12 -131 -234 -157 174 49 95 -512 -245
7318 -245 156 171 141 -334 -756 -455 446 382 -125 -369 -476 132 640 274 -362 -313 -230 132 253 -18 -272 -402
7340 -402 -351 425 238 -73 -290 -151 -94 476 -24 -452 -523 -207 12 418 -21 -398 -776 5 341 168 326
7361 326 -391 -303 280 448 287 -93 -553 -266 432 259 -302 -337 -520 -164 300 137 24 -393 -66 399 486
7382D86l08p55K18J71O70j46j17o45L4M83K86k9o07k74J66N31M01l65l08r7M0
7403a65O15P4m16l59L25P1P69o62o87Q3k4R34k65p7n77k50O75O27l12m06r7l06
7425d30P07M40m02n85k29L15L95J63o31K11r8N21P5M7q86J12K6K97K42m86k91
7446d87J35M33M02L49p62k24p0J09P47l53n16j1j39O30J34j79n60k38Q79K04%
7467D83n28k89M06M5L53k26o00j29L85O71j46j37m93j04M75O88m98m96n34J70
7487e04O74K88m99m56K5O39L32J32n97m51N45j18L60j09n26r7J77L32L48k33o77
7508d15%N80k07M0l42j80J37O62K45n89j41o22P10N62j52j28n33J80P9O75j70
7529C91l57m35l9N47L23l10j27n63N52L27M69m45o18j0O42M0M8n17m30M37M76
$$ plain form
7382 486 178 -577 -359 -188 482 336 219 -426 -392 91 377 348 -259 -533 -367 164 565 200 -108 -205 -165
7403 -165 450 524 108 -251 74 145 914 252 -435 -352 -376 558 293 216 -361 -611 64 691 379 -27 -124 -430
7425 -430 277 717 315 -270 -499 -184 211 374 -257 -46 -144 377 452 499 -387 -275 -249 48 290 -196 -487
7446 -487 -352 81 483 832 70 -154 -224 -115 632 279 -237 -248 -387 243 377 198 -362 -600 279 483 483
7467 483 -45 -334 72 117 470 244 -356 -485 -100 571 425 288 -205 -309 166 854 356 -140 -674 -504
7487 -504 170 458 -41 -497 -472 167 499 631 34 -417 128 10 370 261 -265 -362 -185 147 495 262 -415
7508 -415 -415 165 -42 -2 -344 -524 -387 275 520 -69 -210 -832 -122 440 288 160 -373 -193 -114 561 391
7529 391 34 -401 -440 107 430 120 -7 -570 -18 309 778 333 -285 -295 347 387 435 -82 -512 -75 401
7550D01L12o15j83l15N77k4j33p9o62K76N57j3K43k81k56K96J97n5l26l11J4M17
7572C7K22Pl24l61J18Q11j67k05m17J91k47R30l43l28j21M9K27J01q5O7o86L02
7594b22K18O21l36p90K58M23K94J63n86l51P7K84L64n45Q9k72L49L36k60r5k80
7615b61P7K35J28o4o1j48k54M39L25m36n69J30M84J67J63l31o32O3M56N63k1r46
7637d93K55j93R19J24n47j14k13N45k57K98n05l96J74L28O16L5o72m06L82O3P22
7658F65p95l49J57K64O11l35n19J80J22K81m6j12n75NK56N34n2k92n46L7P05K84
7680D80n43k2k37J84N46K55m49m39l55N86K99K07m68l69Q7L11M53n42m37L32L04
7701A83r2N90n86l40j24L14J64L26m20l71J21L36K47J54r98J91L77M07j94j89
$$ plain form
7550 401 713 98 -85 -400 177 153 20 -59 -721 -445 112 99 342 61 -195 101 298 243 -83 -394 -380 37
7572 37 259 266 -58 -419 -301 510 343 138 -279 -88 -335 595 252 -76 -197 -148 79 180 95 162 -524 -222
7594 -222 -4 617 281 -509 -251 172 466 629 43 -308 -231 53 417 -128 -39 -311 38 374 114 19 -261
7615 -261 -184 51 179 115 54 -94 -348 91 416 -20 -589 -459 25 192 355 24 -608 -545 -89 474 453 -493
7637 -493 -238 -431 488 612 65 -49 -262 283 26 324 -181 -577 -403 -75 541 576 -96 -502 -120 -57 665
7658 665 -130 -479 -322 -58 553 218 -301 -121 1 282 236 124 -451 -446 -190 344 292 0 -546 -509 196 480
7680 480 -63 -85 -322 -138 408 663 214 -225 -580 6 305 512 44 -325 -238 73 526 -16 -453 -121 183
7701 183 91 681 95 -245 -369 -55 109 435 15 -356 -235 101 348 502 -496 -305 72 479 285 96
7721I6m72l41Q81L98j60n03k47J26O62q8k64o09J88M51j8M33n09m66J14N57J88
7742D17k54o8j61k78M19L18k18m66j00L92M59j49k74m40j8Q97l21L67o88j71J82
7763a55L36O4l47l37N57j31Q24p37lk51JN20Ql30j78Jl0N82l76M3n41J73K37J90
7787A20J54l93l39L11J60L76n68j10K03P8K44j35k50l57r5P81L59l39j81k99Q3
7808a97L11L51m30j85l0L38J15N9n31k88J84O11k11K72r03K06L84K01J48l75m99
7829d69j50Q33m7n8n39r5M38M83Q4k65n14N0M78J64p1m28l52L07L84J58k62k69
7851a40r3L36K06J41n57k32j45O05J36j92J20k88m29M88O15k74m82m3L08J95K91
7872E66n88m06L17M17J42m9n95k44j5Q34Nk51J02l22L21l6k4rl69k59N27M68m09
$$ plain form
7721 96 -376 -717 164 562 402 -101 -348 -222 440 352 88 -521 -333 118 100 533 24 -442 -328 229 417
7742 417 163 95 -66 -344 75 393 175 -291 -391 1 460 311 37 -403 -421 476 155 522 -166 -337 -155
7763 -155 181 245 -102 -439 118 -13 811 74 71 -180 -179 341 349 19 -159 -158 -188 394 18 61 -480 -307 -70 120
7787 120 274 -119 -458 -147 13 389 -179 -289 -86 -8 236 101 -149 -506 -601 180 539 200 19 -280 -197
7808 -197 114 465 35 -150 -180 158 273 332 -199 -487 -303 308 97 369 -534 -328 56 257 405 30 -469
7829 -469 -619 214 167 109 -430 -525 -87 396 480 215 -299 -249 229 393 322 -106 -458 -151 233 391 129 -140
7851 -140 -233 103 309 450 -107 -339 -484 121 257 65 185 -103 -532 -44 571 297 -185 -228 80 275 566
7872 566 -22 -428 -111 306 448 399 -196 -440 -455 379 384 133 235 -87 234 198 174 165 -204 -463 64 532 123
7895A23m89k16N34L71M08o30j41l06N01K34j58k87n70K96M50L68j38l70m08L19
7915a09K38p3M1r7j55J75M17j81m94k50M75M53K23n23k49n30P34K32n2j56p64
7936f45M68M78L1j71p35L14K37O86j58n55n6j36M83K06Jn00l30R4O05J7q4k17
7958C3m17k42Q50j84P5m07L20J52J1K4l67l6k95L82K79m6o82K97K73K93j59l57
7980b03J2R4M31K06j58o71k00N23K01J08k72k30j87O44J79k25l26k90L80J43J49
8001C08n05Rl08K35O49K40o62k68K87R2L33M6n07l88N2N25J16l18k40j82M11M8
8023b7J70j14k51O02m65Q41n63m04j14O36L2K01n46j61j93M67N4o0l60k26L53
8044a28L51L90l02j47q23N00L41rm66m0J72L15J47q1m86j39L04J86j11o0j36j88
$$ plain form
7895 123 -366 -582 -48 323 731 101 -40 -346 155 389 231 -56 -626 -330 120 488 350 -20 -428 -109
7915 -109 129 56 97 0 -155 20 437 256 -238 -488 -13 440 663 140 -109 -639 95 327 275 119 -645
7936 -645 -177 301 332 161 -574 -260 -23 663 505 -50 -106 -242 241 447 448 -52 -382 -288 317 334 250 33
7958 33 -384 -626 224 40 115 -292 28 180 191 215 -152 -188 -483 -101 178 132 -550 -253 20 313 154 -203
7980 -203 -191 -97 334 540 382 -289 -489 34 235 343 71 -159 -346 298 477 252 -74 -364 16 159 308
8001 308 -197 -188 -496 -261 388 628 -34 -302 -15 77 410 456 -51 -439 -387 138 254 -64 -304 -486 -75 -27
8023 -27 143 29 -222 380 -85 756 193 -211 -325 311 343 544 -2 -163 -356 111 165 105 -255 -481 -128
8044 -128 223 613 311 164 -659 -159 182 173 -293 -333 -161 154 301 220 -266 -405 -101 85 -26 -86 -222 -410
8066d10K54M78j83l75k03K34J91M14k00n69j31O33J04N6l23j62J11R1N00m03k41
8087a34j0K11P1J65k85l58j18N7R26j20n27k14kK74M32l71l78J2N00M24m45j11
8109al78l80J094J15J42n68n32L83K61J48k61j4p08Q95J97L91n74o33K18J79M41
8130D15k12m40j32M17K43k57J61j14k87L06O3K00l17j90p0M26J34K3k76k86k62
8151d55Q31m5l19j8k8l1P91m20n20Lj04M40K39j9n77K23L2K08j29R3k53k97M35
8174H0M27m72j11l13J44K60M54k13n75L82l7K03J51l52m06k01N75
$$ plain form
8066 -410 -156 322 139 -236 -439 -205 -14 400 200 -369 -500 133 237 293 -30 -192 -81 10 510 107 -134
8087 -134 -144 67 138 303 18 -340 -458 -401 525 405 -122 -336 -338 -64 368 -3 -381 -369 131 555 110 -1
8109 -1 -379 -759 335 450 592 24 -508 -125 136 284 23 9 -699 196 393 784 210 -423 -205 -26 415
8130 415 203 -237 -369 48 291 34 195 81 -206 100 163 363 46 -144 -214 212 346 369 93 -193 -455
8151 -455 376 331 12 -6 -34 -65 726 306 -214 -211 -315 125 364 345 -232 -9 23 231 102 195 -58 -355 80
8174 80 507 35 -76 -389 -245 15 469 256 -319 63 26 229 380 28 -378 -579 -4
8191d
$$ Imaginary data points
##PAGE= N=2
##DATA TABLE= (X++(I..I)), XYDATA
0@%%%%%%%kJ0j6J6j6K1k9L2m0N1n9P2q4R5j11J32j54J75k00K30k62K96l35L77
31A99m24M75n31N93o61P35q16R08j005J113j235J367j512J673j856K063k297K562
49A351k870L235l669M199m861N714o867Q516j1076J5619k6040R0563K2202j69082
63g3066M0853j3578L4263J20491o7505j26874N4939J4656K9990P3312p8649q2928
75g4096M9115R806N1477N2130j10001o4733O8706K8580M8918O166j27929k5305
87h7166R8622L3864J1178m2792r3810L2458Q2216Q326J739o1044o6976P1918N5912
100D4445j6107J0354o8797o1617J02850N6221m5416r910n9434k9613J16837L7113
112G6926p2650k4208l3600J3519J03012n467p4295j2065j9565L3677Q9651l6909
$$ plain form
0 0 0 0 0 0 0 0 0 -2 8 -8 8 -8 13 -16 16 -24 27 -32 40 -44 51 -60 72 -82 93 -107 123 -139 157 -178 199
31 199 -225 250 -281 312 -349 386 -430 478 -527 586 -649 718 -794 879 -977 1086 -1211 1351
49 1351 -1519 1716 -1953 2246 -2615 3099 -3768 4748 -6328 9291 -16749 73814 96016 -73066
63 -73066 -32213 -45791 -11528 108963 41458 -85416 -30477 -15821 14169 87481 8832 -74096
75 -74096 -24981 -15175 36302 88432 -21569 -86302 -17596 10984 59902 66068 -61861 -87166
87 -87166 11456 45320 56498 13706 -80104 -47646 34570 42896 44635 -16409 -83385 -11467 44445
100 44445 28338 38692 -30105 -91722 11128 67349 21933 12023 -47411 -77024 39813 76926
112 76926 4276 -19932 -53532 -40013 62999 57532 -16763 -28828 -48393 -14716 74935 38026
124C8026p3576M103o245M3608P5612o0393p7585K0100K2596M6297L5572p6295
136h180n5207L6873L5359L8886k692q0737j8977M7289K6009L0022j9518q2395
148e3268L411O2196J9011J0711l4484p1195K5117P1591R906j8608m4876l9569
160f0057M6547N8856p113l2541m2904j2271N9502L9431k4225l4827l3948O659
172c6891O5399K4918m2958l9482j4165K9264N7097R04n2504l2269P615M3463L7408
185D7799k2461m7933j7090J8307M5247K4538l8483m6018j151L1718M2626O999
197D4098n3137m0714K3128M6054K4314k1388n1245j6528L9118L9754J151l2855
209A750l6465K425L9280K7746q008l4337l0922J1253M6221K3503k4747m2872j8058
$$ plain form
124 38026 -35550 -31447 -37692 5916 81528 21135 -56450 -36350 -13754 32543 68115 -8180
136 -8180 -63387 -26514 8845 47731 45039 -35698 -54675 -7386 18623 48645 29127 -53268
148 -53268 -49857 12339 31350 42061 7577 -63618 -38501 33090 42996 24388 -20488 -60057
160 -60057 -13510 45346 38233 5692 -37212 -49483 10019 49450 25225 -9602 -43550 -36891
172 -36891 28508 53426 10468 -29014 -43179 -13915 43182 44086 -8418 -40687 -33072 10391 47799
185 47799 25338 -22595 -39685 -21378 23869 48407 9924 -36094 -37245 -5527 37099 44098
197 44098 -9039 -49753 -26625 19429 43743 22355 -28890 -45418 -6300 33454 34605 1750
209 1750 -34715 -32290 6990 34736 26728 -7609 -38531 -27278 18943 42446 17699 -25173 -43231
222d3231L0914N0778L214m8308l5557J3205M2484K9611k1540m7245j1706K8457
234h924L2026J0381k6229l5709j169K8184K8658N181l4275l6270J1069L9875K5307
247C8105j3522m7111k2832L6144M2665J012l3134l7141L610M4945K3354j7852
259A8243l0312k1003J4554L8946J0820k1057k7947j5910K3109M1551L97l3010
271a619k8443j089L8508L4432k1478m1286j2494J9028L8171J3033l5444l0510
283b9191M839K4284K8242j52l7143k1611J2470K6673K3934j1561m2104j2979K6203
296h096L0672J0645k8658l8768O714L6676K0893q261l3722k2967K1569L3071O548
309B6316j5971l0032j1411K7614K8954r30k3372k9005O66L7151K3203j5887l1450
$$ plain form
222 -43231 -12317 38461 41675 -6633 -42190 -28985 13499 43110 21570 -25675 -37381 -8924
234 -8924 23102 33483 7254 -28455 -29624 -1440 27218 32399 -1876 -38146 -27077 12798 38105
247 38105 24583 -22528 -45360 -9216 33449 34461 1327 -35814 -32204 12741 36095 18243
259 18243 -12069 -33072 -18518 20428 31248 10191 -17756 -33666 -10557 30994 31391 -1619
271 -1619 -30062 -31151 7357 41789 20311 -20975 -33469 -14441 23730 36763 1319 -29191
283 -29191 -24352 -68 28174 28022 -9121 -30732 -18262 8411 32345 20784 -21320 -34299 -8096
296 -8096 22576 33221 4563 -34205 -27491 9185 30078 21817 -11905 -34872 -13303 19768 26316
309 26316 10345 -19687 -31098 -3484 25470 24540 1168 -27837 -27171 9980 33183 17296 -14154
322a4154j8218J8227L9247N831k9053k6249j890K7255K8476q115l0780j6745Q467
335a7701K8531J9526j7372l1416q671J8022L0147Q771k8756k8758M871K7614K3335
348B8143p147l3941j6627J7569K7792J1464j7909l0156n598K4936K4250J002k5604
361a826k6015P283L0617J7703j2079l0084j5341K0591L0162M538k2895k5063q68
374b3277K6042K2110o488k5005j8056Q178K7420J5596j4594k7586j1374J9124
386g910K9375N021k6285k6119L640K9344K0478j1304l0068j2479J6408K6613O975
399B3689j8668k3445k955K0106K1113L45k1839k1116L498K5826J9064r775k8845
412a3002j4648J7563K9734O659k4146k5737J871K6084J9915p920k6006j3774J2167
$$ plain form
322 -14154 -32372 -14145 25102 30933 1880 -24369 -26259 996 29472 21357 -9423 -26168 -17701
335 -17701 10830 30356 12984 -18432 -27103 -9081 21066 29837 1081 -27677 -22806 4808 28143
348 28143 20996 -12945 -29572 -12003 15789 27253 9344 -20812 -26410 -1474 22776 23778 -1826
361 -1826 -27841 -20558 10059 27762 15683 -14401 -29742 -9151 21011 25549 2654 -22409 -23277
374 -23277 2765 24875 18387 -6618 -24674 -16496 10924 26520 11926 -15660 -27034 -7910
386 -7910 21465 26486 201 -25918 -22278 7066 27544 16240 -13828 -26307 -9899 16714 23689
399 23689 5021 -18424 -21379 -1273 19840 20185 -1654 -22770 -19272 6554 25618 15843 -13002
412 -13002 -27650 -10087 19647 26306 2160 -23577 -21706 4378 24293 16373 -9633 -23407 -11240
425a1240K2735J0540j2963k3458p589J6305K2269N719k0159k4182J721K5026J9751
438B4475p355k8462j5594J7195K6723O177j8873k3672j719K2654J8454m267j9008
451c272j7008M346K3938J3650r970k1525j3758J3679K7407N683k0800k1824j496
464b0950K3134K2247q808k5368j1657J0036K2820J1677j7290k1098k447J3288
476d416K0214M432k0793j9009L370J8896J8689m714k7873j2648J5319K1942R230
489B2639j6609k5734j5K2753J5029k111j9594j7930R342K1848P904o957j9955
502i390j2465J5633K1597K847j4039k1371m002K4882J7694p924j9676j5180Q486
515a2908K6742O835j6719j6366n970J4550K1819j660j8848j2850K43J7765J9071
$$ plain form
425 -11240 11495 22035 9072 -14386 -21975 -5670 16599 22318 2159 -22023 -20302 4724 24475
438 24475 17120 -11342 -26936 -9741 16982 23159 4286 -19386 -21105 1549 20003 15736 -3272
451 -3272 -20280 -15934 8004 21654 11684 -9841 -23599 -9920 17487 23170 2370 -19454 -20950
464 -20950 2184 24431 15623 -9745 -21402 -11366 11454 23131 5841 -15257 -17704 -4416
476 -4416 15798 20230 -563 -19572 -16202 2694 21383 16669 -11204 -23852 -8533 13409 22639
489 22639 6030 -19704 -19719 3034 18063 15952 -3642 -21572 -12230 9618 17522 10565 -9390
502 -9390 -21855 -6222 15375 18222 4183 -17188 -21190 3692 21386 13462 -6214 -21394 -12908
515 -12908 13834 20669 3950 -12416 -18386 -3836 17983 16323 -2525 -15375 -15132 2633 21704
528B1704r438k2723p740Q300K1242J1751j9762k0905J886J4948J7851K8k3526
541f384j3113J0138J5769J1339o729k3234o680J4583J5798O957j4163k2564J461
554a6822K0322J3724k813k0254j5941J2625K1361M772j0737j9064n561J7791J5968
567A5371k043j3380j5533P19K0244J1902o999j5998j3262R078K3078N123j4843
580C457j6938m912J8350J9341o362j8608j0668N014J9144J0779j2562j6261m468
593a4694Q494J8139N170j6064j5168n8J4562J6874k708k1489j0800Q570J8424
606I252R623j3704j9338j345J4583J5020J86j6829j2727M811J4720J1171m511
619A0912j8960q284R542J5630Q272j1388k0857m48J6211J3865m8j8299j5269J0753
$$ plain form
528 21704 12266 -10457 -18197 -9897 11345 23096 3334 -17571 -15685 -737 17114 17142 -6384
541 -6384 -19497 -9359 6410 17749 11020 -12214 -18894 -4311 11487 18444 4281 -18283 -16822
554 -16822 3500 17224 14411 -5843 -21784 -9159 12202 16974 6237 -12827 -18388 -597 15371
567 15371 13328 -52 -15585 -14866 5378 17280 10281 -5717 -18979 -9901 13177 18300 3457
580 3457 -13481 -18393 -43 19298 12936 -5672 -16340 -11326 7818 18597 6035 -10226 -14694
593 -14694 -6200 11939 17109 1045 -14123 -14181 381 17255 14547 -6942 -17742 -9172 9252
606 9252 18875 5171 -14167 -15512 -929 14091 14277 -2552 -15279 -10468 4252 15423 10912
619 10912 -8048 -16332 -6790 8840 17112 5724 -15133 -15581 630 14495 14447 -3852 -19121 -8368
633h368J7074N672o747j7267p381J4933J4135k05r094j5485k415J7965J2046m687
647A0176j3049j3901N821K1532N661j2311j3989o066J3863J8177l911j5540r310
660a2847J458J5519J2111r671j3430n918M660J7890O734j4937j2325k258R871
673c143J9006j922k0263p490N182J2885J3651j1315j9806J773R329R720Q062j4825
687H44j6800P857R742P792M683j8285j4276J4053J1894M409k779k0229o824K0417
701B498R970l444p886j6141K686K1073L841p647q480j0962P482J8572m22r213
715A927r214p651J3699J6436n981j2160q786j21J8814J0067j4312j1243k915N823
729e617J8193J035j7762n566J708O216J5958m086j8266j384L604Q708J3373j0212
$$ plain form
633 -8368 8706 14378 7631 -9636 -17017 -2084 12051 11846 2752 -12733 -15148 2817 14863 10176
647 10176 -2873 -16774 -10953 10579 16240 3929 -10060 -16126 -2263 15914 12003 -3537 -12847
660 -12847 -11389 4130 16241 6570 -6860 -12778 -8118 9772 16506 1569 -10756 -13014 -3143
673 -3143 15863 13941 -6322 -13812 -8630 4255 17906 6591 -13215 -11442 -2113 7607 15669 844
687 844 -15956 -8099 1643 9435 14118 -4167 -18443 -4390 7504 11913 9134 -11095 -17919 2498
701 2498 12468 9024 1138 -15003 -12317 8756 12597 4950 -3530 -14492 -7010 11562 11140 1927
715 1927 -7287 -14938 -1239 15197 9216 -2944 -11730 -11851 6963 17030 2718 -8525 -11440 -5617
729 -5617 12576 13611 -4151 -9717 -8009 -1793 14165 10079 -8187 -9571 -5967 2741 16114 5902
743E902j9393L461R080R233O816j6713j5005J0501J1355M961n23j7457p349J4540
757e91Q470R60l535j5823k779J6819O108j430p255j5348M662J8917J892o362r873
772e168r982J2065J6823n194r419p181l956J4485J1708r894q645m114l92J5167
786F303P956j2933r503j439N045J5570J897j6910p387M758Q743J0979n351j6861
800i133j433Q513Q278N465r618j3566L007R677P003J821j2379j0615P285J0293
814D598N812l375j4718n145J2096R928k64p439j2552J033J5133M915m315q128
828b421r114N702J3880J307p211q081n338Q987J3657l019j0634o514j9J2180R533
843A2895p950j1810k506N498J0651M282j0599r206J619P089R073k38j1718p491
$$ plain form
743 5902 -13491 -10030 -950 8283 15099 -1614 -16619 -6118 5237 10198 9675 -7782 -15131 -591
757 -591 7879 8839 5304 -10519 -13298 3521 9629 8199 944 -14404 -9742 9175 11067 4705 -5168
772 -5168 -15150 -3085 13738 8544 -875 -8056 -12012 2473 14181 4287 -4358 -8472 -8864 6303
786 6303 14259 1326 -8177 -9616 -4571 10999 12896 -4014 -11401 -6643 2100 13079 7728 -9133
800 -9133 -10566 -2053 6225 11690 2072 -11494 -8487 1190 8193 10014 -2365 -12980 -5695 4598
814 4598 10410 7035 -7683 -12828 -732 9196 8932 1493 -11059 -10026 5107 10022 5707 -2421
828 -2421 -11535 -5833 8047 9354 2143 -5938 -11276 -2289 11368 8349 -2285 -8799 -8818 3362 12895
843 12895 4945 -6865 -9371 -3873 6778 11060 461 -8745 -7126 -37 9036 8798 -2920 -10411
857a0411M710R480O863m917j3239l229R397R354J788r384j0764K556J1456N454
871I114l217r841o444O889R611K691n952r077l582Q704J0148r08q827q414O20
886h485J2112Q011o908j0342m145N971J1821J702j0189p761J138P630P769j371
900F953j0185n068L286Q170O001m055j1403k966P107Q896K678q840j0762K840
914g348J0369O103k981j0223n907P040R294J217n234q346k495Q641P177j071o285
929d9q085L61J1094O194n167q560n113N166J1835J138q818p468O7Q388Q112l437
945E658r315l413K249Q432N251n589q862j980N203Q222L156r004q427K157P915
960A653P186k411j0923n033O677P799K852n383r338k37P843N659l04n996q217
$$ plain form
857 -10411 -5701 3779 10642 5725 -7514 -10743 -1346 8008 9796 412 -10352 -7796 3660 9114
871 9114 5897 -3944 -10388 -3499 6112 8803 2851 -6226 -9808 -1104 9044 8136 -691 -9105 -8485
886 -8485 3627 11638 4730 -5612 -9757 -3786 8035 9737 -452 -8213 -7075 555 8324 6953
900 6953 -3232 -8300 -5014 3156 9157 5102 -6301 -9267 -2160 6736 9414 574 -10188 -7348
914 -7348 3021 9124 6143 -4080 -9987 -2947 6347 7564 2330 -6016 -8511 130 7307 6236 -49
929 -49 -8134 -7773 3321 9515 4348 -4212 -9325 -4159 7676 8814 -4 -7472 -7405 983 9095 5658
945 5658 -3657 -7070 -4821 3611 8862 3273 -5589 -7569 -2366 5856 9012 8 -8419 -6262 1653
960 1653 8839 6428 -4495 -9528 -2851 4948 7800 2417 -6921 -7158 685 6344 6040 44 -8173
975h173K352R261L841k741p710o355O129R735J449o490p837j583R179P451l205
990E303p938m738K489R168L764o142o107k528M100Q561J608p898o364O37P015
1005I30P167k796q981l983M127P519M102o085q615J80O479O052P99p735o787K727
1021d900P177M634j853q987m103N695P431K047n760p783o36Q269N575j883o933
1036b010n040L297P472K954l969o407l296M950P808O09n927o491k23P115O802
1051G644k551q116m607L993Q322L284o722p138j06N820O451q89o935m403J445
1066d508O527M508k715o818l885L995O904K902n369p639o13P317O101j468p797
1081b558m885M006P224K906m037p211j711N117O154P37n132o018l3O332N438j365
$$ plain form
975 -8173 -5821 3440 7281 4540 -3170 -9525 -3396 6339 7788 1298 -6539 -8122 1057 8508 5303
990 5303 -2635 -7373 -4884 4284 8048 1906 -4201 -6729 -2629 5932 7540 -358 -6722 -6085 930
1005 930 8097 5301 -3680 -7663 -3536 3983 8085 2000 -6615 -6435 44 6096 6895 -840 -7627 -4900
1021 -4900 2277 6911 5058 -3929 -8032 -2337 5094 7141 1381 -6402 -7038 1231 6806 4923 -2010
1036 -2010 -7050 -3753 3719 6673 2704 -3703 -6999 -2049 5759 6368 441 -6050 -6273 842 7644
1051 7644 5093 -3023 -7630 -3637 4685 7969 1247 -5891 -5997 -177 6274 5385 -1550 -5953 -4508
1066 -4508 2019 6527 3812 -3006 -6891 -2896 4008 6910 1541 -6098 -6711 606 6707 5239 -2558
1081 -2558 -7443 -3437 3787 6693 2656 -4555 -6266 -1149 5005 5742 610 -5408 -5441 891 6329 4964
1097D964p339m646L205P554L093n161o909j055O259O114p13o588m729J693O714
1112B456L382k790n803l282L541O868J431m276o348j257O003O280r72o863m675
1127f305K356P390L001m382o190j150M212O042J80n037n085O82M909M775q47o752
1143b201l390J944O696L728m499o949j116M958O088K85o589n032K534N493L488
1158E438k027o711k451M132N034J370l027o428q97N998M214l23m876n368J931
1173c991P085K644k988o084l003M628O551n9m993m137p32N882M977k377n145l198
1189d940J287O555L174m882n251p51L572O222N8o123l623J246M645M066k144o274
1205c163j692K894M423L272m126o379M71M084M272R07o136m556K955N049K776
$$ plain form
1097 4964 -2375 -7021 -3816 3738 6831 1670 -5239 -6294 -35 6079 5366 -1222 -5951 -4258 2456
1112 2456 5838 3048 -2755 -6037 -2496 4372 5803 1527 -4821 -6078 -75 6205 5233 -1630 -6305
1127 -6305 -3949 3441 6442 2060 -4130 -5280 -1068 4974 5154 117 -4968 -4286 623 5398 4551 -2201
1143 -2201 -5591 -3647 3049 6777 2278 -4671 -5787 -829 5259 5544 -1045 -6077 -3543 1950 5438
1158 5438 3411 -3300 -5751 -1619 3415 4785 1758 -4670 -5567 431 4645 4322 -554 -5922 -3991
1173 -3991 3094 5738 2750 -3334 -6337 -1709 4842 4783 -210 -4347 -5079 803 5780 3403 -1742 -4940
1189 -4940 -3653 2902 6076 1194 -4057 -4808 -1236 4986 5044 -1079 -4702 -3456 1189 5255 3111 -3163
1205 -3163 -4855 -1961 2462 5734 1608 -4771 -4300 -216 4056 4963 -1173 -5729 -2774 2275 5051
1220E051j842o518k697N709M295q7l158n570J13O352K883j691l721m161J368O978
1236C304J684l407m373k819M565O032n89m863l953j05O093M104l852m292j496
1251c967J701N196K183m886l845J56K728M835N89n740l789J904L926M139j928
1266C202o898j299M157M419J019m139n733J958M740K210j64m553l959K929M414
1281B303J240j208m717k796M496M392K80l546n119J33O328L191k935l855l179
1296d992K927N844N46m005k928j472L676M616r98m476k429M25M020M696k916m916
1312b382k096K473N180J942n136m196Q51L823M001j319n332k062K695L718J704
1327C864k316m391j330L596L445P54k960m871N36M780L270j111n123k845K624
$$ plain form
1220 5051 3209 -3309 -6006 -297 3998 3911 753 -4817 -4704 1648 4531 2840 -881 -5042 -3674 3304
1236 3304 4988 1581 -2792 -5611 -1046 4986 4397 -466 -4419 -4524 1569 5673 1821 -2471 -3967
1251 -3967 -2266 2930 5113 227 -3618 -3462 -734 4101 4690 -1050 -4839 -2935 991 5130 3202
1266 3202 -3696 -4995 -838 3581 4600 461 -5272 -3314 1426 3636 3472 -1081 -5040 -2111 2303
1281 2303 3543 2335 -2382 -5178 -682 3710 3990 444 -4675 -4542 1786 4977 2042 -1813 -4992
1296 -4992 -2065 3779 4325 320 -2608 -4080 -404 4212 3214 -1262 -3691 -3266 754 5450 2534 -2382
1312 -2382 -4478 -2005 3175 5117 -19 -4215 -3364 459 4460 3141 -2191 -4253 -1558 2160 3864
1327 3864 1548 -2843 -4173 -577 2868 3622 662 -4209 -3673 1107 4377 3266 -1857 -4702 -2078
1342b078N422Q87l392l808j267M357M008j117l703k840L51M763K460k095l768
1357a820k261K334M789J246l770l967k46L972M198j016n360k123J957L883K421
1372D237k505m464j005L100L470J204l522m201N60M110K733r29m307k768K537
1387a750M548J078k579m302q01L976L688j071l350l030P00M468K428k050l790
1402a837k083K136M460J342l685l808Q8L388M208j162m421k264J491M099J711
1417C663k233l974m89K468K904J433l661l676M22L575K992k74m335k913K336L830
1433B068J286k184m036j117L873L193l23l288l036P44M613J580j757k924k430
1448c738K053M240J100k958l380j133L582M289j378l769k127N05M434K141k786
$$ plain form
1342 -2078 3344 4231 839 -2969 -4236 121 4129 3012 -691 -3531 -3180 1583 4043 1948 -1820
1357 -1820 -4081 -1747 3042 4288 518 -3449 -3695 277 4475 3459 -1901 -4024 -2067 1816 4237
1372 4237 1732 -2732 -3737 -637 2833 4037 515 -3686 -3126 984 3717 2788 -1519 -4287 -1750
1387 -1750 2798 3876 1297 -3005 -3806 170 3858 2787 -563 -3593 -2893 1575 4003 1953 -1837
1402 -1837 -3920 -1784 2676 4018 333 -3475 -3387 1 4209 3047 -1374 -3638 -2147 1952 3663
1417 3663 1430 -2544 -3033 -565 2339 3772 111 -3565 -3143 432 3424 3150 -1185 -4098 -1762 2068
1433 2068 3354 1170 -2866 -3983 -110 3083 2760 -528 -3564 -2820 1793 3373 1616 -1308 -3738
1448 -3738 -1685 2555 3655 697 -2683 -3816 -234 4055 2677 -1092 -3219 -2714 1720 3861 1075
1463A075l527l75J832K978J647l727k701K01K375L434j25m176k550J501L596K398
1479C856k067m839k70L222K829M46l478l472J603L685J258q08l246k090K160L438
1495B227R24k035l696j331L818L037m11k828l164M23M765J947k227l207j725K353
1511a130M183J42l236k542R3K109L735j101k963k467Q33L412K285k187l617n34
1527b985K360L071J136l902l018J107K931K345p75m144j726K611K600J210j746
1542A075l614n17K644K784J93k453l601J253L535J566q36l705j860K466L329J60
1558B419k028k923k75L050K825r22k825j633K61L262K222k028l262j114J838L680
1574B547N81l050k315q9K974K447q92m014j217J761K877J461k034l134n53K070
$$ plain form
1463 1075 -2452 -2827 -995 1983 3630 -97 -2798 -2597 -222 3212 3087 -1089 -3639 -2138 1458 3856
1479 3856 1789 -3050 -3320 -98 2731 3177 -301 -3773 -2170 1515 2773 1965 -1281 -3371 -1211 2227
1495 2227 3151 1116 -2580 -3911 -93 2944 2533 -295 -3459 -3036 1729 3676 1449 -1758 -3483 -1130
1511 -1130 3053 3195 -41 -2583 -2490 -381 3354 2253 -710 -3177 -2344 1068 3353 1166 -2451 -2985
1527 -2985 -625 2446 3582 -320 -3338 -2231 700 3045 2270 -1874 -3600 -989 1611 2821 1075
1542 1075 -2539 -3056 -412 2372 2565 112 -3489 -2236 1299 2865 2029 -1676 -3536 -1070 2259 2419
1558 2419 391 -2532 -2807 243 3068 2146 -679 -2312 -2051 1211 3433 1405 -1857 -2971 -1133 2547
1574 2547 3128 78 -2237 -2326 648 3095 2203 -1811 -3028 -1267 1610 3071 1037 -2097 -2650 -580
1590e80K900N65l170k854R34K737K641j008l470k288K389L508M87k345k790m07
1606b751L086K412p77k317k260L96L167J913j157l055j386K048L036N92l001k324
1622b378j98L277J969m03l336j805J452L152J091k045k712m77J893K809L01k438
1638A52k744J29K999J929m84l326j715J518L292J135k156l066k48K773K634o46
1654B176k363k356Q76K728J566j052k769j566J805K941R18k230k782n66K830K850
1670C006n26l335k210J072L628J660k044k967r44J949K722N61k173k754K98K283
1686B26K299n18k748k208J438L001J372j877l077p28K332K983j67k931k300Q74
1702b029K933J574q43k599j827J697L167K91j551k720q19K574K799o54k792j988
$$ plain form
1590 -580 2320 2885 -285 -3139 -2205 532 3173 2165 -1305 -3593 -1204 2304 2791 446 -2344 -2751
1606 -2751 335 2747 1970 -347 -2607 -2211 956 2869 1712 -1343 -2729 -681 2355 2947 -54 -2378
1622 -2378 -2576 701 2670 2267 -1069 -2874 -1422 1730 2821 776 -1936 -2413 -520 2289 2590 152
1638 152 -2592 -2463 536 2465 1981 -1345 -3060 -1542 1750 2885 729 -2337 -2585 188 2822 2176
1654 2176 -187 -2543 -1667 1061 2627 1575 -1194 -2760 -955 1986 2904 674 -2108 -2674 156 3006
1670 3006 2480 -855 -3065 -1993 1635 3295 1251 -1716 -2660 -711 2011 2572 399 -2355 -2057 226
1686 226 2525 2007 -741 -2949 -1511 1490 2862 985 -2092 -2820 -488 2495 2328 -603 -2903 -2029
1702 -2029 904 2478 1635 -964 -2791 -1094 2073 2364 813 -1907 -2726 -152 2647 1993 -799 -2787
1718b787R59K789K154k016k772q93J913K475M69k491j811k1K205K251l37k831
$$ plain form
1718 -2787 -1828 961 3115 1099 -1673 -2566 -653 1822 2291 -200 -2011 -2032 173 2424 2087 -744
$$ [...]
8191D23
##END NTUPLES=NMR FID
##END=
