##TITLE=1H_LR-790-B-M1
 D2O
 8 sc, 
 10.1.2025
##JCAMPDX= 6.0         $$ Bruker NMR JCAMP-DX V2.0
##DATA TYPE= NMR FID
##DATA CLASS= NTUPLES
##ORIGIN= UXNMR, Bruker Analytische Messtechnik GmbH
##OWNER= root
$$ XWIN-NMR		Version 3.5
$$ Fri Jan 10 13:49:06 2025 Russian Standard Time (UT+4h)  she@DPX200
##.OBSERVE FREQUENCY= 200.1315
##.OBSERVE NUCLEUS= ^1H
##.DELAY= (6, 6)
##.ACQUISITION MODE= SIMULTANEOUS
##.ACQUISITION SCHEME= undefined
##.AVERAGES= 8
##.DIGITISER RES= 18
##SPECTROMETER/DATA SYSTEM= spect
##.PULSE SEQUENCE= zg30
##.SOLVENT NAME= CDCl3
##.SHIFT REFERENCE= (INTERNAL, CDCl3, 0, 15.7039)
##AUDIT TRAIL= $$ (NUMBER, WHEN, WHO, WHERE, WHAT)
$$ ##TITLE= Audit trail, XWIN-NMR		Version 3.5
$$ ##JCAMPDX= 5.01
$$ ##ORIGIN= Bruker BioSpin GmbH
$$ ##OWNER= she
$$ F:/spectra/data/she/nmr/H-F/1/audita.txt
$$ ##AUDIT TRAIL=  $$ (NUMBER, WHEN, WHO, WHERE, WHAT)
(   1,<2025-01-10 13:47:54.34 +0400>,<she>,<DPX200>,
      <created by zg, POWCHK disabled, PULCHK disabled
       configuration hash MD5:
       00 E9 B6 7A A2 85 ED C7 34 08 36 98 17 FE 4E 26
       data hash MD5: 16K
       99 AF 1A DC 3F 74 10 7E 89 FC C2 38 A7 AF 28 6F>)
$$ ##END=
$$ 
$$ hash MD5
$$ 98 73 EF CE FC B2 90 55 9E 32 51 18 9F 3E 26 D4
##$RELAX= 
##$RELAX= 
##$RELAX= 
##$RELAX= 
##$RELAX= 
##$RELAX= 
$$ Bruker specific parameters
$$ --------------------------
##$DU= <F:/spectra>
##$EXPNO= 1
##$NAME= <H-F>
##$PROCNO= 1
##$TYPE= <nmr>
##$USER= <she>
##$AMP= (0..31)
100 100 100 100 100 100 100 100 100 100 100 100 100 100 100 100 100 100 
100 100 100 100 100 100 100 100 100 100 100 100 100 100 
##$AQSEQ= 0
##$AQ_mod= 1
##$AUNM= <au_zg>
##$AUTOPOS= <>
##$BF1= 200.13
##$BF2= 200.13
##$BF3= 200.13
##$BF4= 200.13
##$BF5= 200.13
##$BF6= 200.13
##$BF7= 200.13
##$BF8= 200.13
##$BYTORDA= 1
##$CFDGTYP= 0
##$CFRGTYP= 5
##$CHEMSTR= <none>
##$CNST= (0..31)
1 1 145 1 1 1 1 1 1 1 1 1 1 1 1 1 1 1 1 1 1 1 1 1 1 1 1 1 1 1 1 1 
##$CPDPRG= <>
##$CPDPRG1= <>
##$CPDPRG2= <>
##$CPDPRG3= <>
##$CPDPRG4= <mlev>
##$CPDPRG5= <mlev>
##$CPDPRG6= <mlev>
##$CPDPRG7= <mlev>
##$CPDPRG8= <mlev>
##$CPDPRGB= <>
##$CPDPRGT= <>
##$D= (0..31)
0 1.2 0 0 0 0 0 0 0 0.06 0 0.03 0 0 0 0 0.0002 0 0 0 0 0 0 0 0 0 0 0 0 
0 0 0 
##$DATE= 1736502473
##$DBL= (0..7)
120 120 120 120 120 120 120 120 
##$DBP= (0..7)
150 150 150 150 150 150 150 150 
##$DBP07= 0
##$DBPNAM0= <>
##$DBPNAM1= <>
##$DBPNAM2= <>
##$DBPNAM3= <>
##$DBPNAM4= <>
##$DBPNAM5= <>
##$DBPNAM6= <>
##$DBPNAM7= <>
##$DBPOAL= (0..7)
0.5 0.5 0.5 0.5 0.5 0.5 0.5 0.5 
##$DBPOFFS= (0..7)
0 0 0 0 0 0 0 0 
##$DE= 6
##$DECBNUC= <off>
##$DECIM= 24
##$DECNUC= <off>
##$DECSTAT= 4
##$DIGMOD= 1
##$DIGTYP= 9
##$DL= (0..7)
0 120 120 120 120 120 120 120 
##$DP= (0..7)
150 150 150 150 150 150 150 150 
##$DP07= 0
##$DPNAME0= <>
##$DPNAME1= <>
##$DPNAME2= <>
##$DPNAME3= <>
##$DPNAME4= <>
##$DPNAME5= <>
##$DPNAME6= <>
##$DPNAME7= <>
##$DPOAL= (0..7)
0.5 0.5 0.5 0.5 0.5 0.5 0.5 0.5 
##$DPOFFS= (0..7)
0 0 0 0 0 0 0 0 
##$DQDMODE= 0
##$DR= 18
##$DS= 0
##$DSLIST= <SSSSSSSSSSSSSSS>
$$ [...]
##$SUBNAM2= <"">
##$SUBNAM3= <"">
##$SUBNAM4= <"">
##$SUBNAM5= <"">
##$SUBNAM6= <"">
##$SUBNAM7= <"">
##$SUBNAM8= <"">
##$SUBNAM9= <"">
##$SW= 24.0689530833862
##$SWIBOX= (0..15)
0 0 2 0 0 0 0 0 0 0 0 0 0 0 0 0 
##$SW_h= 4816.95568400771
##$TD= 16384
##$TD0= 1
##$TE= 0
##$TE2= 300
##$TE3= 300
##$TEG= 300
##$TL= (0..7)
0 120 120 120 120 120 120 120 
##$TP= (0..7)
150 150 150 150 150 150 150 150 
##$TP07= 0
##$TPNAME0= <>
##$TPNAME1= <>
##$TPNAME2= <>
##$TPNAME3= <>
##$TPNAME4= <>
##$TPNAME5= <>
##$TPNAME6= <>
##$TPNAME7= <>
##$TPOAL= (0..7)
0.5 0.5 0.5 0.5 0.5 0.5 0.5 0.5 
##$TPOFFS= (0..7)
0 0 0 0 0 0 0 0 
##$TUNHIN= 0
##$TUNHOUT= 0
##$TUNXOUT= 0
##$USERA1= <user>
##$USERA2= <user>
##$USERA3= <user>
##$USERA4= <user>
##$USERA5= <user>
##$V9= 5
##$VALIST= <valist>
##$VCLIST= <CCCCCCCCCCCCCCC>
##$VD= 0
##$VDLIST= <DDDDDDDDDDDDDDD>
##$VPLIST= <PPPPPPPPPPPPPPP>
##$VTLIST= <TTTTTTTTTTTTTTT>
##$WBST= 1024
##$WBSW= 4
##$XGAIN= (0..3)
0 0 0 0 
##$XL= 0
##$YL= 0
##$YMAX_a= 476747
##$YMIN_a= -696991
##$ZGOPTNS= <>
##$ZL1= 120
##$ZL2= 120
##$ZL3= 120
##$ZL4= 120
##$ABSF1= 10
##$ABSF2= 0
##$ABSG= 5
##$ABSL= 3
##$ALPHA= 0
##$AQORDER= 0
##$ASSFAC= 0
##$ASSFACI= 0
##$ASSFACX= 0
##$ASSWID= 0
##$AUNMP= <proc_1d>
##$AZFE= 0.1
##$AZFW= 0.1
##$BCFW= 1
##$BC_mod= 2
##$BYTORDP= 1
##$COROFFS= 0
##$CY= 11.3945322036743
##$DATMOD= 1
##$DC= 2
##$DFILT= <>
##$DTYPP= 0
##$F1P= 15.6554695791079
##$F2P= 12.8336369535428
##$FCOR= 0.5
##$FTSIZE= 0
##$FT_mod= 4
##$GAMMA= 1
##$GB= 0.15
##$INTBC= 1
##$INTSCL= 1
##$ISEN= 128
##$LB= 0.24
##$LEV0= 0
##$LPBIN= 0
##$MAXI= 10000
##$MC2= 0
##$MEAN= 0
##$ME_mod= 0
##$MI= 1.114404
##$NCOEF= 0
##$NC_proc= 0
##$NLEV= 6
##$NOISF1= 3.799351
##$NOISF2= 2.8
##$NSP= 1
##$NTH_PI= 0
##$NZP= 0
##$OFFSET= 15.70392
##$PC= 1
##$PHC0= -26578.65
##$PHC1= 16.18744
##$PH_mod= 1
##$PKNL= yes
##$PPARMOD= 0
##$PSCAL= 0
##$PSIGN= 0
##$REVERSE= no
##$SF= 200.130013532006
##$SI= 16384
##$SIGF1= 3
##$SIGF2= 2
##$SINO= 400
##$SIOLD= 16384
##$SREGLST= <1H.CDCl3>
##$SSB= 0
##$STSI= 0
##$STSR= 0
##$SW_p= 3612.71676300578
##$SYMM= 0
##$S_DEV= 0
##$TDeff= 0
##$TDoff= 0
##$TI= <>
##$TILT= no
##$TM1= 0
##$TM2= 0
##$TOPLEV= 0
##$USERP1= <user>
##$USERP2= <user>
##$USERP3= <user>
##$USERP4= <user>
##$USERP5= <user>
##$WDW= 1
##$XDIM= 8192
##$YMAX_p= 0
##$YMIN_p= 0
$$ End of Bruker specific parameters
$$ ---------------------------------
##NTUPLES= NMR FID
##VAR_NAME=  TIME,          FID/REAL,        FID/IMAG
##SYMBOL=    X,             R,               I
##VAR_TYPE=  INDEPENDENT,   DEPENDENT,       DEPENDENT
##VAR_FORM=  AFFN,          ASDF,            ASDF
##VAR_DIM=   8192,          8192,            8192
##UNITS=     SECONDS,       ARBITRARY UNITS, ARBITRARY UNITS
##FACTOR=    0.0002076,     1,               1
##FIRST=     0,             0,               0
##LAST=      1.7004516,     0,               0
##MIN=       0,             -696991,         0
##MAX=       1.7004516,     476747,          0
$$ Real data points
##PAGE= N=1
##DATA TABLE= (X++(R..R)), XYDATA
$$ plain form
0 0 0 0 0 0 0 0 -8 8 -8 8 -8 16 -16 16 -24 28 -32 40 -48 55 -61 76 -85 95 -115 128 -147 164 -186 210
30 210 -236 264 -297 330 -369 409 -455 508 -560 620 -688 761 -841 933 -1035 1150 -1278 1429
48 1429 -1600 1803 -2048 2341 -2713 3194 -3834 4754 -6156 8563 -13509 27780 -157049 -696991
62 -696991 -499861 22910 285435 202736 167064 208286 78687 -223586 -323207 -129399 43079
73 43079 -3449 504 235720 400787 135841 -329780 -471096 -185360 117909 178787 150475
84 150475 194418 166186 -56162 -280921 -263458 -76252 54028 102660 182032 233071 95554
95 95554 -161175 -264318 -138711 -736 5551 17663 157093 272284 156822 -113266 -289770
106 -289770 -276192 -150125 47507 292289 409575 202675 -201572 -405548 -234494 44179
$$ packed form
0@%%%%%%qJ6j6J6j6K4l2L2m0N2o0P2q8J03j16J37j61J80k10K43k75L11l50L96
30B10m46N00n61O27o99P78q64R63j068J180j308J449j602J774j968K185k428K707
48A429l029L403l851M389n054N907p028Q588j0910J4719k2072M1289j84829n39942
62f96991J97130N22771K62525q2699l5672M1222j29599l02273r9621J93808J72478
73D3079m6528L953K35216J65067k64946m65621j41316K85736L03269O0878k8312
84A50475M3943k8232k22348k24759J7463J87206J30280M8632P9372N1039j37517
95I5554k56729j03143J25607J37975O287J2112J39430J15191j15462k70088j76504
106b89770J3578J26067J97632K44782J17286k06900m04247k03976J71054K78673
$$ plain form
116 44179 121995 55509 77984 177617 145997 -48829 -206658 -208764 -138641 -50929 121981 332264
128 332264 334871 20638 -334528 -376808 -121788 112881 158305 133432 145396 106401 -54641
139 -54641 -207690 -196528 -66092 33924 78985 137948 182591 103482 -84871 -215108 -185175
150 -185175 -69038 28449 108833 191852 201013 58961 -158391 -272306 -197974 -14203 150817
161 150817 219222 168671 26810 -112916 -153821 -97872 -38039 -19805 13378 106556 185701
172 185701 141763 -21110 -184842 -240353 -159132 20815 210363 280210 154160 -79767 -225697
183 -225697 -187039 -55529 34403 65353 96164 125320 90515 -13227 -110988 -145592 -123458
194 -123458 -55955 62252 189131 214683 83725 -109311 -213440 -177379 -65542 52565
$$ packed form
116D4179P7816o6486K2475R9633l1620j94826j57829k106P0123Q7712J72910K10283
128C32264K607l14233l55166m2280K55020K34669M5424k4873J1964l8995j61042
139e4641j53049J1162J30436J00016M5061N8963M4643p9109j88353j30237K9933
150a85175J16137R7487Q0384Q3019R161j42052k17352j13915P4332J83771J65020
161A50817O8405n0551j41861j39726m0905N5949N9833J8234L3183R3178P9145
172A85701m3938j62873j63732n5511Q1221J79947J89548O9847j26050k33927j45930
183b25697L8658J31510Q9932L0950L0811K9156l4805j03742r7761l4604K2134
194a23458O7503J18207J26879K5552j30958j93036j04129L6061J11837J18107
$$ plain form
204 52565 151882 194730 127849 -31526 -169021 -182791 -88396 19466 85505 115060 111378 59869
216 59869 -26872 -98909 -121869 -101545 -45834 52267 160347 192120 88181 -92345 -211911
227 -211911 -185314 -48929 95133 167661 143681 48053 -57905 -110753 -93288 -48694 -17291
238 -17291 10956 63862 120738 117496 25991 -100390 -172978 -143893 -30601 105470 186733 159193
250 159193 32123 -110692 -173977 -129566 -26850 65979 115300 115677 67906 -10911 -83246 -111227
262 -111227 -88385 -35871 29813 95925 132678 101445 -770 -116089 -167632 -120588 -4617
273 -4617 114112 171911 132056 11689 -114776 -161188 -104626 -2 76185 93464 73981
284 73981 43162 3884 -45702 -88191 -96317 -57606 19053 102887 144912 104055 -14395 -137043
$$ packed form
204E2565R9317M2848o6881j59375j37495j3770R4395J07862O6039K9555l682n1509
216E9869q6741p2037k2960K0324N5711R8101J08080L1773j03939j80526j19566
227b11911K6597J36385J44062P2528k3980r5628j05958n2848J7465M4594L1403
238a7291K8247N2906N6876l242r1505j26381p2588K9085J13292J36071Q1263k7540
250A59193j27070j42815o3285M4411J02716R2829M9321L77m7771p8817p2335k7981
262a11227K2842N2514O5684O6112L6753l1233j02215j15319n1543M7044J15971
273d617J18729N7799l9855j20367j26465m6412N6562J04624P6187J7279j9483
284G3981l0819l9278m9586m2489q126L8711P6659Q3834M2025m0857j18450j22648
$$ plain form
296 -137043 -172400 -94304 36528 129433 137430 75243 -12926 -83214 -106051 -75894 -17752 34976
308 34976 65176 77552 70247 30001 -43350 -110745 -121603 -57161 45345 126201 139317 74743
320 74743 -37883 -132751 -147393 -71960 40605 115933 116093 58814 -12033 -64528 -83127 -68344
332 -68344 -31131 14514 56031 84481 84403 37374 -48030 -122521 -128944 -51882 61402 138295 132445
345 132445 49665 -59000 -128296 -118622 -42297 45110 90649 82574 45387 3375 -34634 -65297
357 -65297 -75874 -53984 -1385 61277 103266 95186 28598 -67411 -132031 -117062 -26835 78024
369 78024 130170 104280 24036 -60602 -104211 -88698 -30008 32188 64880 64774 47272 21345
381 21345 -16552 -61556 -88437 -69615 -4140 74330 117199 94780 13122 -83001 -133023 -100303
$$ packed form
296a37043l5357P8096J30832R2905P997o2187q8169p0288k2837L0157N8142N2728
308C4976L0200J2376p305m0246p3351o7395j0858O4442J02506Q0856J3116o4574
320G4743j12626r4868j4642P5433J12565P5328J60n7279p0847n2495j8599J4783
332f8344L7213M5645M1517K8450p8m7029q5404p4491o423P7062J13284P6893n850
345A32445q2780j08665o9296R674P6325Q7407M5539q075l7187m2012l8009l0663
357f5297j0577K1890N2599O2662M1989q080o6588r6009o4620J4969R0227J04859
369G8024N2146k5890q0244q4638m3609J5513N8690O2196L2692j06j7502k5927
381B1345l7897m5004k6881J8822O5475P8470M2869k2419q1658r6123n0022L2720
$$ plain form
393 -100303 -6653 85300 116406 78511 7324 -52829 -77157 -65625 -31440 8448 41191 61736
405 61736 64070 40154 -12528 -74038 -104119 -72883 8890 90997 121102 79327 -8907 -90996
417 -90996 -117720 -74324 8174 75592 91879 58649 7201 -34354 -56430 -58428 -42571 -9239
429 -9239 33084 68907 77857 45976 -19522 -86412 -109334 -64503 24816 100830 114059 58189
441 58189 -26725 -89090 -95787 -50330 14004 59694 67346 45479 13608 -14742 -39088 -58160
453 -58160 -58047 -25784 31998 83425 92112 44103 -36562 -100686 -105744 -46704 41374 101501 97621
466 97621 37727 -34842 -77401 -73058 -36283 6635 38100 52434 50577 32554 -2007 -44502
478 -44502 -74910 -69337 -19767 49550 97440 88456 24340 -56251 -103551 -87399 -21026 52728
$$ packed form
393a00303R3650R1953L1106l7895p1187o0153k4328J1532L4185L9888L2743K0545
405F1736K334k3916n2682o1510l0081L1236Q1773Q2107L0105m1775q8234q2089
417i0996k6724M3396Q2498O7418J6287l3230n1448m1555k2076j998J5857L3332
429i239M2323L5823Q950l1881o5498o6890k2922M4831Q9319P6014J3229n5870
441E8189q4914o2365o697M5457O4334M5690P652k1867l1871k8350k4346j9072
453e8160J13L2263N7782N1427Q687m8009q0665o4124n058N9040Q8078O0127l880
466I7621n9894p2569m2559M343L6775M2918L1465J4334j857j8023l4561m2495
478d4502l0408N573M9570O9317M7890q984o4116q0591m7300J6152O6373P3754
$$ plain form
490 52728 89223 71180 18958 -31512 -55800 -52318 -32317 -6171 21553 45477 55392 42164
502 42164 4254 -45804 -81228 -73644 -17568 57635 101135 81295 11049 -61680 -93159 -70244
514 -70244 -12535 44413 71317 58107 20013 -17417 -38145 -44756 -42879 -27353 8783 54512
526 54512 78831 57093 -3937 -69492 -96911 -67551 4744 76022 101007 63140 -10652 -70076
538 -70076 -80604 -46747 2027 38142 50914 43244 23334 -2558 -28247 -48955 -52928 -29481
550 -29481 16335 62153 77425 46659 -15382 -71591 -86460 -49855 16285 69390 78680 42550
562 42550 -11007 -49290 -56595 -38771 -9882 17958 36714 42148 35746 15206 -18767 -54842 -69336
575 -69336 -42025 19364 75966 87982 44609 -25673 -79958 -86038 -41117 26029 71741 69343
$$ packed form
490E2728L6495j8043n2222n0470k4288L482K0001K6146K7724K3924R915j3228
502D2164l7910n0058l5424P584N6076P5203M3500j9840p0246p2729l1479K2915
514g0244N7709N6948K6904j3210l8094l7430k0728o611J877J5526L6136M5729
526E4512K4319k1738o1030o5555k7419K9360P2295P1278K4985l7867p3792n9424
538g0076j0528L3857M8774L6115J2772p670j9910k5892k5689k0708l973K3447
550b9481M5816M5818J5272l0766o2041n6209j4869L6605O6140N3105R290l6130
562D2550n3557l8283p305J7824K8889K7840J8756N434o402k0540l3973l6075j4494
575f9336K7311O1389N6602J2016m3373p0282n4285o080M4921O7146M5712k398
$$ plain form
587 69343 29376 -14881 -38768 -42080 -35090 -20486 4241 34007 53935 49351 17415 -31287 -72359
600 -72359 -74845 -27797 42551 86044 73114 18082 -40404 -70536 -61982 -22571 25007 54177
612 54177 49834 22358 -4624 -21064 -34218 -42199 -32455 1211 40729 60535 48073 10882 -36288
625 -36288 -71934 -68525 -19084 47675 82072 60516 6722 -40057 -57999 -47598 -17405 18694
637 18694 40544 37450 20907 6699 -4245 -26111 -50703 -49966 -8933 47514 75000 55561 4654
650 4654 -48230 -76912 -62685 -7222 53629 75166 45771 -2495 -32672 -38896 -35235 -25258 -2513
663 -2513 27201 45453 41723 20030 -11448 -45324 -64695 -46356 7780 63662 78331 42420
675 42420 -14343 -57775 -68045 -42848 5557 50281 61369 34666 -4356 -29410 -34240 -28856
$$ packed form
587F9343l9967m4257k3887l312O990J4604K4727K9766J9928m584l1936m8702m1072
600g2359k486M7048P0348M3493j2930n5032n8486l0132Q554L9411M7578K9170
612E4177m343k7476k6982j6440j3154p981R744L3666L9518J9806j2462l7191m7170
625c6288l5646L409M9441O6759L4397k1556n3794m6779j7942J0401L0193L6099
637A8694K1850l094j6543j4208j0944k1866k4592P37M1033N6447K7486j9439n0907
650D654n2884k8682J4227N5463O0851K1537k9395m8266l0177o224L661R977K2745
663b513K9714J8252l730k1693l1478l3876j9371J8339N4136N5882J4669l5911
675D2420n6763m3432j0270K5197M8405M4724J1088k6703l9022k5054m830N384
$$ plain form
687 -28856 -19031 -2235 19590 37274 40249 24322 -8953 -46162 -63983 -40773 13648 61266
699 61266 67825 32328 -17717 -51633 -54304 -28186 9696 34535 34955 21363 9485 1178 -14668
712 -14668 -37360 -46226 -22666 21388 56252 59356 28753 -20793 -63842 -70914 -31681 28475 66827
725 66827 59999 21244 -20126 -44558 -47107 -28958 1603 29034 39153 31292 15171 -4837 -27664
738 -27664 -45054 -40576 -9434 31104 56780 50765 16401 -30285 -63120 -57718 -14084 36533 58077
751 58077 40863 6692 -20441 -32436 -29817 -17763 -733 12167 19720 26849 30624 15352 -22804
764 -22804 -58046 -54736 -9883 41778 63312 46804 7269 -33993 -56921 -47188 -8259 31703
776 31703 43983 28827 8952 -2955 -14735 -30894 -37106 -19780 13231 38107 43615 30168
$$ packed form
687b8856R825J6796K1825J7684K975j5927l3275l7209j7821K3210N4421M7618
699F1266O559l5497n0045l3916k671K6118L7882K4839M20j3592j1878q307j5846
712a4668k2692q866K3560M4054L4864L104l0603m9546m3049p072L9233O0156L8352
725F6827o828l8755m1370k4432k549J8149L0561K7431J0119p861j6121k0008k2827
738b7664j7390M478L1142M0538K5676o015l4364m6686l2835N402M3634N0617K1544
751E8077j7214l4171k7133j1995K619J2054J7030J2900P553P129L775j5272l8156
764b2804l5242L310M4853N1661K1534j6508l9535m1262k2928R733L8929L9962
776C1703J2280j5156j9875j1907j1780j6159o212J7326L3011K4876N508j3447
$$ plain form
788 30168 866 -36140 -59750 -46146 1055 47776 60790 36618 -2703 -35520 -48655 -36695
800 -36695 -5120 26725 37652 25902 8717 -1707 -11604 -25449 -34995 -24045 6429 37129
812 37129 49206 35146 -1905 -43585 -62339 -39856 10835 51148 52744 23359 -10571 -29781
824 -29781 -32380 -22794 -6694 10105 20950 24114 22905 14127 -8250 -36925 -48647 -26617 16506
837 16506 49691 50860 23760 -14510 -44446 -50589 -27217 12792 41568 42194 19100 -5855 -20495
850 -20495 -25542 -24495 -15057 2769 20732 30451 28763 13757 -12370 -39569 -48657 -25287 18823
863 18823 52459 51932 19168 -21634 -46693 -43527 -16710 16324 34704 30504 13204 -1609 -10168
876 -10168 -17138 -24959 -24182 -7098 20076 40264 38535 13365 -23060 -48968 -46532 -13542 28724
$$ packed form
788C0168k9302l7006k3610J3604M7201M6721J3014k4172l9321l2817j3135J1960
800c6695L1575L1845J0927j1750j7185j0424r897j3845r546J0950L0474L0700
812C7129J2077j4060l7051m1680j8754K2483N0691M0313J596k9385l3930j9210
824b9781k599R586J6100J6799J0845L164j209q778k2377k8675j1722K2030M3123
837A6506L3185J169k7100l8270k9936o143K3372M0009K8776O26k3094k4955j4640
850b0495n047J047R438J7826J7963R719j688j5006k6127k7199r088K3370M4110
863A8823L3636n27l2764m0802k5059L166K6817L3034J8380m200j7300j4813q559
876a0168o970p821P77J7084K7174K0188j729k5170l6425k5908K436L2990M2266
$$ plain form
889 28724 50759 39700 7668 -22477 -35764 -30156 -12698 7377 21355 24687 18889 8749 -3990
902 -3990 -19679 -32350 -29488 -6813 25343 45642 38680 7840 -28408 -49193 -41296 -8100 29878
915 29878 47438 33493 2861 -21843 -28957 -22310 -10861 1234 11813 20862 23472 17609 406
928 406 -22894 -39424 -33935 -3700 33364 49869 34397 -2014 -34539 -44457 -28890 829 26254
941 26254 34059 22896 3821 -11373 -17735 -19358 -18394 -10203 7251 25839 33891 22485 -3863
954 -3863 -31470 -43797 -31116 2978 38024 48695 28668 -7374 -35071 -39023 -21555 2972
966 2972 21394 26751 19456 6637 -4659 -13171 -20354 -23294 -15048 6885 31079 39002 22825 -9757
980 -9757 -38312 -43794 -22530 12143 38680 39954 17087 -12166 -28913 -26597 -13431 772 10219
$$ packed form
889B8724K2035j1059l2032l0145j3287N608J7458K0075J3978L332n798j0140j2739
902c990j5689j2671K862K2675L2156K0299o962l0840l6248k0785P897L3196L7978
915B9878J7560j3945l0632k4704p114O647J1449J2095J0579R049K610n863j7203
928D06k3300j6530N489L0235L7064J6505j5472l6411l2525r918J5567K9719K5425
941B6254P805j1163j9075j5194o362j623R64Q191J7454J8588Q052j1406k6348
954c863k7607j2327J2681L4094L5046J0671k0027l6042k7697l952J7468K4527
966B972J8422N357p295j2819j1296q512p183k940Q246K1933K4194P923j6177l2582
980i757k8555n482K1264L4673K6537J274k2867k9253j6747K316J3166J4203R447
$$ plain form
993 10219 16423 18724 15457 4825 -11125 -26872 -31219 -16491 12132 37494 40510 17506 -17147
1006 -17147 -40397 -39011 -15133 15511 34749 32180 12357 -9909 -21460 -20808 -13828 -5560 3885
1019 3885 15362 23723 22248 7396 -16140 -34291 -34213 -12588 20163 42281 38005 9397 -23667
1032 -23667 -39190 -30105 -6321 17049 27245 22364 9025 -4487 -12334 -15414 -16580 -13138 -1654
1045 -1654 16528 30222 27421 5263 -22465 -38821 -31789 -5802 24844 40787 30375 2233
1057 2233 -24227 -32699 -22060 -3388 11737 18894 17640 11679 2826 -7096 -17400 -23259 -18532 -1072
1071 -1072 22265 36496 27580 201 -29429 -40136 -26618 2105 28150 35332 21681 -2496
1083 -2496 -21274 -24475 -15580 -3595 4721 11000 16168 17707 10458 -4960 -22644 -29972 -20270 3408
$$ packed form
993A0219O204K301l267j0632j5950j5747m347J4728K8623K5362L016k3004l4653
1006a7147k3250J386K3878L0644J9238k569j9823k2266j1551O52O980Q268R445
1019C885J1477Q361j475j4852k3536j8151P8K1625L2751K2118m276k8608l3064
1032b3667j5523R085K3784K3370J0196m881j3339j3512p847l080j166L442J1484
1045a654J8182J3694k801k2158k7728j6356P032K5987L0646J5943j0412k8142
1057B233k6460q472J0639J8672J5125P157j254n961q853r922j0304n859M727J7460
1071a072K3337J4231q916k7379k9630j0707J3518K8723K6045P182j3651k4177
1083b496j8778l201Q895J1985Q316O279N168J539p249j5418j7684p328R702K3678
$$ plain form
1097 3408 28643 38153 22881 -7496 -32423 -36250 -18342 7875 26286 27331 14859 -2085 -13858
1110 -13858 -17213 -14327 -9370 -1608 9204 20078 23365 13406 -7683 -27518 -33402 -17852 9672
1123 9672 33409 36161 16246 -12830 -31755 -29690 -11873 9358 20668 20026 11376 1279 -6549
1136 -6549 -11992 -16030 -15959 -7374 9984 26239 28904 12499 -14062 -33425 -32559 -11900 16118 33843
1150 33843 30403 8513 -15461 -26647 -20986 -6532 5718 11838 13951 12879 8592 -584 -12778
1163 -12778 -21425 -21003 -7312 13956 30637 28997 8571 -19093 -34700 -27971 -5376 18501 29361
1176 29361 22663 4677 -11864 -19352 -16300 -8033 -196 6413 13127 17032 14270 2154 -15430 -27639
1190 -27639 -24211 -4884 20611 34755 27249 1869 -23766 -33441 -22184 455 19121 24279 16097
$$ packed form
1097C408K5235R510j5272l0377k4927l827J7908K6217J8411J045j2472j6944j1773
1110a3858l355K886M957P762J0812J0874L287r959k1089j9835n884J5550K7524
1123I672K3737K752j9915k9076j8925K065J7817K1231J1310o42q650j0097p828
1136f549n443m038P1Q585J7358J6255K665j6405k6561j9363Q66K0659K8018J7725
1150C3843l440k1890k3974j1186N661J4454J2250O120K113j072m287r176j2194
1163a2778q647M22J3691K1268J6681j640k0426k7664j5607O729K2595K3877J0860
1176B9361o698j7986j6541p488L052Q267P837O609O714L905k762j2116j7584j2209
1190b7639L428J9327K5495J4144p506k5380k5635r675J1257K2639J8666N158q182
$$ plain form
1203 16097 2304 -8428 -12456 -12713 -10569 -6580 2628 15751 23705 18045 -1342 -22337 -31199 -20335
1217 -20335 3152 25753 31870 18961 -4858 -23359 -25842 -13737 3116 13096 15045 11714 6388
1230 6388 -214 -8175 -15339 -16994 -10257 4031 19183 26412 17692 -3517 -25793 -31943 -17761 7185
1244 7185 26328 28515 13996 -6378 -20423 -21089 -11179 1535 9253 10929 11443 10152 5140 -6230
1258 -6230 -18953 -23388 -12810 8468 27086 29534 13449 -12135 -30288 -29011 -9431 14280 25163
1271 25163 19974 5844 -6822 -12763 -12778 -9818 -5129 2084 10306 16671 16495 5777 -11224 -24839
1285 -24839 -23588 -7222 14686 28000 24534 6726 -14743 -26178 -22046 -5468 11759 19396 15771
1298 15771 6406 -3115 -9186 -11408 -10704 -7759 -840 9066 19064 20016 7284 -13975 -28494 -24676
$$ packed form
1203A6097j3793j0732m028k57K144L989R208J3123P954n660j9387k0995q862J0864
1217b0335K3487K2601O117j2909k3819j8501k483J2105J6853R980J949l331n326
1230F388o602p961p164j655O737J4288J5152P229q720k1209k2276o150J4182K4946
1244G185J9143K187j4519k0374j4045o66R910J2714P718J676N14j291n012j1370
1258f230j2723m435J0578K1278J8618K448j6085k5584j8153J277J9580K3711J0883
1271B5163n189j4130j2666n941j5K960M689P213Q222O365j76j0718j7001j3615
1285b4839J251J6366K1908J3314l466j7808k1469j1435M132J6578J7227P637l625
1298A5771r365r521o071k222P04K945O919R906R998R52j2732k1259j4519L818
$$ plain form
1312 -24676 -4425 18796 29551 21970 2095 -17949 -24916 -15741 364 10785 11697 8451 7566
1325 7566 6046 -1697 -13366 -19688 -14303 214 16962 25972 20640 444 -22613 -30519 -17635
1338 -17635 5084 21032 22471 13392 -27 -12189 -17966 -13862 -3185 6270 9021 10232 10881 7824
1352 7824 -3393 -16756 -20726 -12658 3437 17580 24317 18545 -936 -22634 -29456 -14971 7803
1365 7803 20978 18620 8439 -1573 -8909 -12518 -10063 -4164 -47 3133 9794 18054 15502 -2977
1379 -2977 -24648 -28657 -12012 11186 25009 23973 11285 -8057 -23966 -23724 -7162 10460 15387
1392 15387 10094 5450 4601 -626 -11135 -16781 -11398 -113 9569 15973 18199 10387 -8873 -26421
1406 -26421 -25336 -5463 15331 22508 17741 6673 -7043 -18994 -19798 -5982 9110 12776 7373
$$ packed form
1312b4676K0251K3221J0755p581j9875k0044o967R175J6105J0421R12l246q85
1325G566j520p743j1669o322N385J4517J6748R010n332k0196k3057p906J2884
1338a7635K2719J5948J439r079j3419j2162n777M104J0677R455K751J211O49l057
1352G824j1217j3363l970Q068J6095J4143O737n772j9481k1698o822J4485K2774
1365G803J3175k358j0181j0012p336l609K455N899M117L180O661Q260k552j8479
1379b977k1671m009J6645K3198J3823j036j2688j9342j5909K42J6562J7622M927
1392A5387n293m644q49n227j0509n646N383J1285R682O404K226p812j9260j7548
1406b6421J085J9873K0794P177m767j1068j3716j1951q04J3816J5092L666n403
$$ plain form
1419 7373 4398 6469 3320 -8399 -17932 -16054 -3031 10539 20125 21324 9808 -12516 -30115
1432 -30115 -25200 -1133 19940 23103 12240 252 -7413 -11930 -12338 -6612 1360 5704 7728 10614
1446 10614 12689 4091 -13275 -24163 -17672 1346 17997 22979 16326 959 -15846 -24068 -16270
1459 -16270 1660 15474 16009 9147 2248 -3317 -8797 -11714 -8325 -1936 3647 9347 14286 14206 2059
1474 2059 -16379 -25206 -15800 3787 18698 22569 14815 -769 -17858 -23295 -12268 5626 14383
1487 14383 10424 4333 2958 2636 -3976 -12769 -14375 -6940 4385 14062 19125 14448 -2308 -21993
1501 -21993 -27137 -11992 10890 21932 17631 6111 -4832 -12627 -14529 -8722 644 7277 8498
1514 8498 8012 7987 4467 -5275 -15686 -16800 -7062 7263 18249 20137 10038 -7958 -22479 -21617
$$ packed form
1419G373k975K071l149j1719r533J878J3023J3570R586J199j1516k2324j7599
1432c0115M915K4067K1073L163j0863j1988p665m517m08N726P972M344K024K886
1446A0614K075q598j7366j0888O491J9018J6651M982o653j5367j6805q222P798
1459a6270J7930J3814N35o862o899n565n480k917L389O389N583N700M939q0j2147
1474B059j8438q827R406J9587J4911L871p754j5584j7089n437J1027J7894Q757
1487A4383l959o091j375l22o612q793j606P435J1325R677N063m677j6756j9685
1501b1993n144J5145K2882J1042m301j1520j0943p795j902N807R366O633J221
1514H498m86k5l520r742j0411j114R738J4325J0986J888j0099j7996j4521Q62
$$ plain form
1528 -21617 -6743 10637 18632 14887 5409 -4534 -11582 -11987 -6067 220 2426 4109 8931 13443
1542 13443 8031 -7386 -20457 -19089 -4968 11147 20458 18764 6882 -10951 -22625 -18171 -914
1555 -914 12545 13887 7555 2636 651 -3436 -8713 -10956 -7490 290 8404 14822 15231 4912 -12105
1570 -12105 -23741 -18630 -1304 15780 21414 14923 756 -12563 -18084 -12385 -705 8013 9697
1583 9697 7744 5624 2203 -3518 -9229 -11318 -9078 -1503 9756 19024 16417 1448 -16800 -22906
1597 -22906 -12846 3610 15025 17058 11195 -224 -10776 -14124 -7701 999 4033 2464 4662
1610 4662 10041 10002 -992 -13751 -17811 -10627 2160 14062 19723 14935 -1396 -18703 -22604 -10177
1624 -10177 6688 15436 12984 6119 160 -6014 -9616 -9257 -4282 261 4235 9400 12922 9351 -3517
$$ packed form
1528b1617J4874J7380P995l745r478r943p048m05N920O287K206J683M822M512
1542A3443n412j5417j3071J368J4121J6115R311j694j1882j7833j1674M454J7257
1555i14J3459J342o332m919j985m087n277k243L466P780Q114O418M09j0319j7017
1570a2105j1636N111J7326J7084N634o491j4167j3319n521N699J1680Q718J684
1583I697j953k120l421n721n711k089K240P575J1259R268k607j4969j8248o106
1597b2906J0060J6456J1415K033n863j1419j0552l348O423Q700L034j569K198
1610D662N379l9j0994j2759m060P184J2787J1902N661m788j6331j7307l901J2427
1624a0177J6865Q748k452o865n959o174l602L59M975M543L974N165L522l571j2868
$$ plain form
1639 -3517 -16826 -19373 -8840 6787 17931 18850 8969 -7222 -18251 -16958 -4879 7252 10909
1652 10909 8142 4890 1526 -2364 -6323 -7991 -7166 -3842 2959 12086 16943 9624 -7061 -20192
1666 -20192 -18652 -4863 9838 17289 15027 5595 -7071 -15052 -12928 -3005 5217 6394 5057 5666
1680 5666 6702 2216 -7480 -13830 -11869 -2920 7957 16017 16369 5693 -10457 -21440 -16691 -920
1694 -920 12783 16220 10438 1028 -6575 -10353 -8583 -3323 907 3519 5090 8190 8771 2447 -8224
1709 -8224 -16339 -13253 -1669 12229 18445 14231 903 -13247 -18622 -11485 1911 11276 12161 6871
1723 6871 731 -3580 -5801 -6331 -5774 -3641 813 7434 12675 10754 131 -12511 -18286 -12196 2410
1738 2410 14555 17728 10439 -2687 -13716 -14895 -7102 3022 8340 7773 4750 2544 199 -3545
$$ packed form
1639c517j3309k547J0533J5627J1144R19r881j6191j1029J293J2079J2131L657
1652A0909k767l252l364l890l959j668Q25L324O801R127M857p319j6685j3131
1666b0192J540J3789J4701P451k262r432j2666p981K124R923Q222J177j337O09
1680E666J036m486r696o350J961Q949J0877Q060L52j0676j6150j0983M749J5771
1694i20J3703L437n782r410p603l778J770N260M230K612J571L100N81o324j0671
1709h224q115L086J1584J3898O216m214j3328j4150n375P137J3396R365Q85n290
1723F871o140m311k221n30N57K133M454O621N241j921j0623j2642n775O090J4606
1738B410J2145L173p289j3126j1029j179P793J0124N318n67l023k206k345l744
$$ plain form
1752 -3545 -7430 -9358 -6331 1539 10985 15164 9793 -2789 -15045 -18203 -9069 5580 15180 15285
1766 15285 6033 -4736 -11086 -10636 -4578 1404 3977 4976 5934 5890 3258 -3312 -10368 -12527 -7291 4212
1782 4212 14742 16388 7575 -6443 -16804 -16098 -4929 7754 13762 10957 3267 -3702 -7439 -6807
1796 -6807 -4042 -1797 348 4155 7643 9691 4903 -4980 -13747 -14364 -5190 8027 16410 14703 3730
1811 3730 -9070 -15433 -12086 -2236 7340 10403 7080 2003 -1754 -3385 -4814 -6093 -5621 -1947 5672
1826 5672 11625 11339 3733 -7866 -15956 -13577 -2960 10426 16283 11791 80 -10232 -12558 -7441
1840 -7441 -121 4369 6227 5560 3739 1564 -1106 -5290 -9069 -8260 -1532 8264 14846 11695 304
1855 304 -11854 -16339 -10735 1543 12073 13766 7686 -1632 -8507 -8754 -4572 -757 1724 3088 5154
$$ packed form
1752c545l885j928L027P870R446M179n371j2582j2256l158R134J4649R600J05
1766A5285r252j0769o350M50O058N982K573R99R58m4k632o570p056k159N236J1503
1782D212J0530J646q813j4018j0361P06J1169J2683O008k805p690o969l737O32
1796f807K765K245K145L807L488K048m788r883q767o17R174J3217Q383j707j0973
1811C730j2800o363L347R850R576L063l323n077l757j631j429j279M72L674P619
1826E672N953k86p606j1599q090K379J0617J3386N857m492j1711j0312k326N117
1840g441P320M490J858o67j821k175k670m184l779Q09O728R796O582l151j1391
1855C04j2158m485N604J2278J0530J693o080r318o875k47M182L815K481J364K066
$$ plain form
1870 5154 6753 5244 -602 -8287 -12284 -8550 1007 11537 15158 9381 -2808 -13140 -14267 -6431
1884 -6431 4041 10598 10136 4919 -2051 -5546 -5331 -3834 -3030 -1451 1769 6694 9550 6535 -1751
1899 -1751 -10684 -13770 -7935 3775 13518 14744 6400 -5366 -13146 -11556 -3180 4660 7837 6655
1913 6655 3448 352 -1535 -3549 -5846 -6567 -3703 2946 10271 11776 5352 -5473 -13823 -13399 -4274
1928 -4274 7340 13616 11195 2413 -6226 -10042 -7430 -1834 3049 4586 4453 3891 3277 474 -3631
1943 -3631 -8148 -8537 -3187 5720 12393 11744 3160 -7698 -14148 -11014 -739 9024 12052 7809 62
1958 62 -5975 -6654 -4592 -1917 120 1464 3593 5721 6230 1662 -6136 -11486 -10175 -1288 9196 13808
1974 13808 9779 -459 -9876 -12577 -7771 1568 7959 8644 4879 67 -2791 -3521 -3965 -4660 -2981
$$ packed form
1870E154J599j509n846p685l997L734R557J0530L621n777j2189j0332j127P836
1884f431J0472O557m62n217o970l495K15J497Q04J579L220M925K856l015q286
1899a751q933l086N835J1710R743J226q344j1766p780J590Q376P840L177j182
1913F655l207l096j887k014k297p21K864O649P325J505o424j0825q350M24R125
1928d274J1614O276k421q782q639l816K612N596M883J537j33n62o14k803m105
1943c631m517l89N350Q907O673o49q584j0858o450L134J0275R763L028m243p747
1958F2o037o79K062K675K037J344K129K128N09m568p798n350J311Q887J0484M612
1974A3808m029j0238r417k701M806R339O391O85l765m812k858p30m44o95J679
$$ plain form
1989 -2981 661 5849 8839 7117 -147 -8316 -12455 -8884 1354 10745 12869 7125 -2727 -10100 -10191
2004 -10191 -4837 2353 6279 5941 3031 925 -372 -1829 -4579 -6837 -5109 569 7292 11027 7612
2019 7612 -1581 -10849 -13148 -6439 4092 11445 10566 3676 -4023 -7775 -6675 -2580 543 2389 3001
2034 3001 3591 4302 3084 -1747 -7741 -9692 -4987 3884 11180 11165 4453 -4841 -11556 -10688 -3350 5709
2050 5709 10012 8011 1606 -3228 -5014 -4320 -3104 -1187 1147 3201 5176 5585 2834 -3011 -9028
2065 -9028 -9767 -3886 5584 11808 10032 2019 -6633 -10793 -8153 -688 5745 7303 4306 565 -1408
2080 -1408 -1337 -2198 -4218 -4709 -1499 3852 8344 8059 2432 -6336 -11252 -9458 -1068 8525 11514 7170
2096 7170 -844 -7119 -8258 -4814 -436 3580 4600 3826 2139 941 -747 -3491 -6582 -5736 82
$$ packed form
1989b981L642N188K990j722p264q169m139L571J0238R391K124n744r852p373r1
2004a0191N354P190L926l38k910k106j297j457k750k258J728N678O723L735l415
2019G612r193r268k299O709J0531P353q79o890p699l752J100M095L123J846O12
2034C001N90P11j218m831n994j951M705Q871P296j5o712r294o715Q68P338R059
2050E709M303k001o405m834j786O94J216J917K334K054J975M09k751n845o017
2065i028p39N881R470O224j776q013q652m160K640P465O433J558k997l741j973
2080a408P1q61k020m91L210N351M492k85n627q768m916J794Q390R593K989m344
2096G170q014o275j139L444M378M016J020p74j687j198j688k744l091Q46N818
$$ plain form
2111 82 6293 9742 7083 -144 -7550 -11166 -7986 1205 9203 10289 4506 -2810 -6234 -5237 -2660 -320
2127 -320 979 2440 3396 3893 3096 253 -4444 -8671 -7283 869 9425 11088 5516 -2979 -8894 -9217
2143 -9217 -4694 2293 7916 7736 2701 -2519 -3567 -2118 -2446 -3127 -2089 1949 5645 6821 3408 -2039
2159 -2039 -6810 -9450 -5726 2557 10347 10489 3477 -5145 -8494 -6842 -2140 3010 5775 5218 1985
2174 1985 -763 -1405 -1544 -3156 -4573 -2986 2237 7324 8192 3456 -3307 -8912 -9611 -3488 5410 10617
2190 10617 8123 206 -5357 -6603 -3990 -1379 1025 3044 3563 2633 1016 854 -1296 -5054 -7586
2205 -7586 -3714 4641 9800 7728 886 -5780 -8524 -7119 -2024 5344 8985 6577 -1021 -5401 -4145
2220 -4145 -1703 -1169 -1497 402 3110 4889 3265 464 -3036 -6825 -7494 -2410 5951 10829 7391 -757
$$ packed form
2111H2O211L449k659p227p406l616L180R191P998J086n783p316l424R97K577K340
2127c20J299J461R56M97p97k843m697m227J388Q152Q556J663n572q495n915l23
2143i217M523O987N623j80n035n220j048J449l28o81J038M038L696J176l413n447
2159b039m771k640L724Q283P790J42p012q622l349J652M702N150K765n57l233
2174A985k748o42j39j612j417J587N223N087Q68m736o763n605o99O123Q898N207
2190A0617k494p917n563j246K613K611K404K019N19r30j617j62k150l758k532
2205g586L872Q355N159k072o842o666k744J405N095P368L641k408p598m380J256
2220d145K442N34l28J899K708J779j624k801l500l789o69N084Q361M878l438q148
$$ plain form
2236 -757 -7085 -8649 -4996 542 5261 6417 3539 -665 -2793 -2091 -1742 -2867 -2925 -57 4531 6486
2252 6486 4448 -168 -5451 -8664 -6474 721 8083 9859 4295 -3133 -6852 -5912 -2602 871 3385
2267 3385 4556 2565 -94 -766 -604 -2163 -4853 -4153 295 5899 8026 4434 -1617 -7040 -7954 -4498
2283 -4498 1911 8043 7962 2452 -3542 -5952 -4178 -1067 514 1382 2181 2710 2772 1870 -1155 -4508 -6325
2300 -6325 -4057 1836 7746 8384 3274 -3874 -7804 -7088 -2304 4000 6971 5163 522 -2510 -3299 -2175
2316 -2175 -1689 -1811 -34 1994 4010 4317 2099 -1630 -6323 -7431 -2617 3862 8454 7060 793 -4896
2332 -4896 -7283 -5054 -204 3732 4960 3246 170 -1300 -1500 -1774 -2289 -2905 -1126 2543 6029 5473
2348 5473 1511 -4077 -7750 -6682 -877 5417 8373 5153 -477 -5305 -6022 -3171 94 2846 3071
$$ packed form
2236g57o328j564L653N538M719J156k878m204k128P02L49j125n8K868M588J955
2252F486k038m616n283l213K190P195P362J776n564p428l719R40L310L473K514
2267C385J171j991k659o72J62j559k690P00M448N604K127l592o051n423r14L456
2283d498O409O132q1n510n994k410J774L111J581Q68P99N29O2r02l025l353j817
2300f325K268N893N910O38n110p148l930P16M784O304K971j808m641l032p89J124
2316b175M86j22J777K028K016L07k218l729m693j108M814O479M592j394o267n689
2332d896k387K229M850L936J228j714l076j470k00k74n15o16J779L669L486n56
2348E473l962n588l673J068N805O294K956l220n630m828p17K851L265K752K25
$$ plain form
2363 3071 2017 1302 1130 282 -2559 -4660 -4195 -566 3938 7003 5420 109 -5758 -8033 -5159 1032
2379 1032 6478 6741 2919 -1627 -3892 -3583 -1934 -171 1048 1571 2103 2538 2552 146 -3680 -6178 -4539
2396 -4539 337 5889 7377 4347 -1798 -6681 -6840 -2857 2347 5228 4644 1717 -1062 -2172 -2302 -1739
2412 -1739 -1672 -865 787 3326 5043 3065 -512 -5228 -6837 -3625 2286 6741 6821 2709 -2980 -6192
2428 -6192 -5375 -1351 2494 4057 2754 937 -249 -354 -874 -2911 -3503 -2097 1609 4899 5518 3092
2444 3092 -2489 -6826 -6380 -1920 3759 7127 5485 1070 -3358 -4640 -3227 -664 1656 1839 1744 1684
2460 1684 2013 1038 -1533 -4138 -4647 -1990 2572 5626 5815 1336 -3940 -6855 -5119 -124 3900 5746
2476 5746 3443 -140 -2715 -3101 -2033 -638 -175 341 1708 2960 2718 923 -2465 -5346 -5258 -1196
$$ packed form
2363C071j054p15j72q48k841k101M65L629M504L065j583n311n867k275K874O191
2379A032N446K63l822m546k265L09J649J763J219N23N32M35J4k406l826k498J639
2396d539M876N552J488l030o145m883j59L983N204K881n84k927k779j110j30N63
2412a739O7Q07J652K539J717j978l577m716j609L212N911M455Q0m112n689l212
2428f192Q17M024L845J563j303j817j186j05n20k037n92J406L706L290O19k426
2444C092n581m337M46M460N679L368j642m415m428j282J413K563K320J83r5o0
2460A684L29r75k571k605n09K657M562L054J89m479n276k915J736M995M024J846
2476E746k303l583k575l86J068J395M63N16J367J252k42j795l388k881Q8M062
$$ plain form
2492 -1196 4145 6813 5208 -50 -4941 -6414 -3538 1039 4260 4009 1976 -404 -1339 -1306 -1315 -1928 -1833
2509 -1833 -10 2645 4785 3924 248 -4318 -6398 -4347 606 5641 6443 3474 -1761 -5301 -4834 -1943
2525 -1943 1208 2775 2348 1235 548 265 -572 -2200 -3162 -2673 223 3538 5598 3572 -1023 -5460
2541 -5460 -6059 -3058 1919 5375 5220 1780 -2524 -4314 -3226 -593 819 1226 1118 1609 1992 1674 -740
2558 -740 -3008 -4614 -3092 989 5127 5842 2944 -2633 -6159 -5082 -1163 2983 4534 3739 739 -1741
2574 -1741 -2471 -1453 -964 -870 -448 713 2859 3617 1816 -1518 -4667 -5060 -1941 2576 6003 5290 1046
2591 1046 -3329 -5332 -3636 -153 2669 3246 1685 194 -819 -876 -1141 -1710 -2145 -984 1689 3966
2607 3966 4242 1651 -2903 -5875 -4883 -760 3737 5977 4274 -340 -3917 -4105 -2175 124 1752 1687
$$ packed form
2492a196N341K668j605n258m891j473K876M577L221k51k033k380r35L3ro13R5
2509a833J823K655K140q61l676m566k080K051M953N035Q02k969n235l540M67K891
2525a943L151J567m27j113o87k83q37j628r62M89K896L315K060k026m595m437
2541e460n99L001M977L456j55l440m304j790J088K633J412M07j08M91L83l18k414
2558g40k268j606J522M081M138P15k898n577l526J077L919M146J551p95l000k480
2574a741p30J018M89R4M22J161K146P58j801l334l149l93L119M517L427p13m244
2591A046m375k003J696L483K822N77j561j491j013n7k65n69m35J161K673K277
2607C966K76k591m554k972R92M123M497K240j703m614l577j88J930K299J628o5
$$ plain form
2623 1687 1393 884 1038 64 -1127 -2943 -3160 -1147 2956 5416 3993 -52 -4309 -5618 -3404 808
2639 808 4417 4695 2317 -754 -3155 -2502 -1194 -237 415 567 1163 2244 1734 -112 -2609 -4017 -3429
2656 -3429 230 3955 5594 3362 -993 -4816 -4724 -2123 1631 3681 3749 1350 -1099 -1686 -1171 -870 -994
2673 -994 -1035 126 2165 3367 2461 -180 -3341 -5160 -3147 843 4989 5248 2268 -2314 -4303 -3546
2689 -3546 -850 1474 2327 1797 601 -122 -72 -398 -1716 -2758 -1992 641 3541 4286 2062 -1309 -4623
2706 -4623 -4830 -1909 2255 4879 4016 463 -2491 -3158 -2029 -757 931 1144 1365 1135 1221 649 -526
2723 -526 -2554 -3469 -1812 1784 4503 4090 1245 -2678 -4763 -4089 -507 3097 4409 2579 -364 -2499
2739 -2499 -2050 -907 -559 -236 -130 1017 1773 2220 1089 -1302 -3686 -4001 -1092 3103 5124 3991 -72
$$ packed form
2623A687k94n09J54r74j191j816k17K013M103K460j423m045m257j309K214M212
2639H08L609K78k378l071k401O53J308R57O52J52N96J081n10j846k497j408N88
2656c429L659L725J639k232m355l823R2K601L754K050O8k399k449n87N15L01j24
2673i94m1J161K039J202r06k641l161j819K013L990M146K59k980m582j989P57
2689c546K696K324Q53n30j196p23N0l26j318j042P66K633K900P45k224l371l314
2706d623k07K921M164K624q63l553k954o67J129J272J688K13K21k30Q6n72j175
2723e26k028r15J657L596K719m13k845l923k085O74L582L604J312j830k943k135
2739b499M49J143L48L23J06J147P56M47j131k391k384l15K909M195K021j133m063
$$ plain form
2756 -72 -3313 -4353 -2689 458 2862 2964 1481 -605 -1234 -806 -647 -1472 -1835 -394 1862 2980 2374
2773 2374 253 -2421 -4299 -3326 -111 3313 4782 2641 -1378 -3344 -3225 -1377 703 1882 1838 859
2789 859 307 -187 -237 -1111 -1971 -2181 -368 2453 3806 2672 -154 -3723 -4498 -2682 1318 4065 3748
2806 3748 1546 -1420 -2630 -1993 -883 276 676 655 855 1041 1148 136 -2217 -3688 -2265 954 3580
2823 3580 4017 1851 -1610 -3460 -3765 -1541 1481 3368 2841 137 -1331 -1630 -1066 -475 -754 -455 880
2840 880 1543 1881 1195 -836 -2647 -3888 -1949 1837 4238 3856 577 -2166 -3587 -2390 -436 1684
2856 1684 2283 1438 155 -603 -319 -348 -1081 -1639 -1164 969 2883 3034 1175 -1653 -3715 -3448 -802 2509
2874 2509 4340 2726 -412 -2535 -2918 -1466 -183 1017 1451 1085 389 735 468 -393 -2040 -2740 -1056
$$ packed form
2756g2l241j040J664L147K404J02j483k086o29M28J59q25l63J441K256J118o06
2773B374k121k674j878R73L215L424J469k141m019j966J19J848K080J179m4r79
2789H59n52m94n0q74q60k10J813K821J353j134k826l569p75J816M000K747l17
2806C748k202k966j210O37J110J159M00k1K00J86J07j012k353j471J423L219K626
2823C580M37k166l461j850l05K224L022J887n27k704j468k99N64N91k79K99J335
2840H80O63L38o86k031j811j241J939L786K401l82l279k743j421J197J954K120
2856A684N99q45j283p58K84k9p33n58M75K133J914J51j859k828k062K67K646L311
2874B509J831j614l138k123l83J452J283J200M34l66o96L46k67q61j647p00J684
$$ plain form
2891 -1056 1722 3388 3119 221 -2312 -4195 -2333 302 2654 3356 1709 -335 -2208 -1782 -822 75
2907 75 41 159 959 1653 1461 534 -1636 -2732 -2798 51 2519 3738 2332 -696 -3052 -3662 -1876 1112
2925 1112 2445 2283 551 -708 -867 -869 -748 -818 -700 246 1197 2042 2131 95 -2470 -4089 -2017 823
2943 823 3518 3519 1181 -1248 -2640 -2552 -1152 1146 1696 1242 335 -116 -187 -236 -1125 -1476 -1091 578 2103
2962 2103 2795 1831 -903 -2972 -3504 -1382 1707 3831 2419 66 -1656 -2499 -1710 -413 821 1017
2978 1017 601 748 936 768 209 -2068 -2610 -1230 1310 2733 2644 1262 -1665 -3510 -2758 -409 2364
2995 2364 2647 1744 -268 -1267 -1187 -701 -521 -154 291 571 1301 1632 1156 -925 -2569 -2880 -774 2083
3013 2083 3404 2610 88 -2207 -2935 -1532 46 1781 2081 788 -156 -968 -490 -417 -946 -1131 -646 1200
$$ packed form
2891a056K778J666k69k898k533j883J862K635K352P02j647k044j873M26R60Q97
2907G5l4J18Q00O94j92r27k170j096o6K849K468J219j406l028k356o10J786K988
2925A112J333j62j732j259j59kJ21p0J18R46R51Q45Q9k036k565j619K072K840
2943H23K695Jk338k429j392Q8J400K298N50m54r07m51p1m9q89l51L85J669J525
2962B103O92r64k734k069n32K122L089K124j412k353j722q43P89J297J234J96
2978A017m16J47J88j68n59k277n42J380K540J423q9j382k927j845P52K349K773
2995B364K83r03k012r99Q0M86J80L67M45K80P30L31m76k081j644l11K106K857
3013B083J321p94k522k295p28J403J578J735L00j293r44q12M78P3n29j85M85J846
$$ plain form
3031 1200 2209 1967 303 -1980 -3122 -2273 -162 2439 3113 1692 -721 -2152 -2553 -899 573 1355
3047 1355 1281 443 521 237 27 -825 -1606 -1583 -439 1576 2881 2026 -117 -2463 -3084 -1576 823 2839
3065 2839 2507 953 -1006 -1766 -1411 -517 314 472 556 507 1093 893 -138 -1583 -2493 -1735 614 2403
3083 2403 2864 1364 -1098 -2788 -2637 -355 1474 2294 1755 111 -694 -1253 -783 -640 -571 -448 139 1088
3101 1088 1916 1194 -585 -2136 -2631 -1372 1168 3041 2532 660 -1439 -2778 -2086 -431 997 1451
3117 1451 1052 246 -313 -195 -235 -790 -1239 -723 840 1892 2090 859 -1433 -2880 -2528 -514 1905 2808
3135 2808 1808 -126 -1863 -2146 -718 182 1058 659 468 493 329 353 -746 -1314 -1829 -630 1072 2155
3153 2155 2179 33 -1903 -2554 -1915 39 2096 2535 1094 -676 -1361 -997 -710 -12 -25 189 789 866 753
$$ packed form
3031A200J009k42j664k283j142Q49K111K601O74j421k413j431m01J654J472P82
3047A355p4q38P8k84k10q52p81K3J144K015J305q55k143k346o21J508K399K016
3065B839l32j554j959p60L55Q94Q31J58Q4m9N86k00j031j445r10P58K349J789
3083B403M61j500k462j690J51K282J829Q20n39j644q05n59M70J43O9J23N87R49
3101A088Q28p22j779j551m95J259K540J873n09j872k099j339O92J655J428M54
3117A451l99q06n59J18m0n55m49N16J563J052J98j231k292j447L52K014K419R03
3135B808j000j934j737k83J428R00Q76l99j91K5j64K4j099n68n15J199J702J083
3153B155K4k146j936o51O39J954K057M39j441j770o85L64K87O98j3K14O00P7j13
$$ plain form
3172 753 271 -1284 -2110 -1819 5 1817 2778 1632 -687 -2624 -2204 -923 920 1741 1481 362 -335
3189 -335 -867 -866 -437 -585 -735 -501 913 1789 1448 -208 -1777 -2443 -1478 876 2461 2644 730 -873
3207 -873 -2249 -1692 -308 1013 1542 762 -33 -11 439 -231 -698 -1150 -857 259 1892 2174 1076 -750
3225 -750 -2195 -2047 -798 1468 2594 1960 67 -1307 -1424 -1000 -13 356 793 432 430 767 594 -320 -1292
3244 -1292 -1688 -1094 705 1989 2286 536 -1704 -2605 -1994 62 1540 1772 1223 14 -950 -1395 -690
3261 -690 -95 -51 92 -83 1052 1286 360 -902 -2274 -1881 2 1489 2267 1563 125 -1572 -2412 -1208
3279 -1208 520 1371 1707 259 -40 -330 -371 -325 -690 -506 -13 748 1475 1252 286 -1414 -2599 -1757 276
3298 276 1802 2092 1154 -667 -1512 -1572 -584 313 1125 470 181 -211 260 -172 -730 -1068 -1044 69 1053 1954
$$ packed form
3172G53m82j555q26K91J824J812R61j146k319j937M20J281J843Q21k60j119o97
3189c35n32JM29j48j50K34J414Q76l41j656j569o66R65K354J585J83j914j603
3207h73j376N57J384J321N29p80p95K2M50o70m67m52K93J116J633K82j098j826
3225g50j445J48J249K266J126o34j893j374j17M24R87L69M37l61kL37j73r14r72
3244a292l96N94J799J284K97j750k240r01O11K056J478K32n49j209r64m45P05
3261f90N95M4J43j75J135K34r26j262j372L93J883J487P78p04j438j697q40J204
3279a208J728Q51L36j448k99k90m1M6l65J84M93P61P27k23r66j700j185Q42K033
3298B76J526K90r38j821q45o0R88Q97Q12o55k89l92M71m32n58l38K4J113R84R01
$$ plain form
3318 1954 1450 -75 -1963 -2212 -701 762 1799 1497 768 -684 -1167 -1048 -399 692 565 35 583
3335 583 1100 963 -119 -1203 -1469 -690 547 1643 1854 894 -865 -1969 -1922 -432 1166 1962 872
3352 872 -65 -727 -383 -567 -105 -470 -161 133 588 969 718 -430 -1444 -1849 -819 796 2142 1750
3370 1750 106 -1269 -1794 -1071 -429 1158 989 693 108 -538 -336 -126 -238 -514 -605 278 1409 1777 319
3389 319 -1126 -2091 -1388 -277 1146 1595 857 -252 -1309 -1351 -670 94 1082 272 53 464 667 182 -473
3408 -473 -1376 -1149 -21 1023 1453 1209 229 -1414 -2233 -1693 144 1443 1190 674 -337 -1038 -943 -638
3426 -638 -51 -31 -71 422 681 869 -116 -1011 -1466 -929 -60 1448 1953 1101 -420 -1894 -1755 -408 891
3445 891 1053 935 444 -488 -560 -341 -266 -385 -380 -46 1064 1429 901 -275 -1505 -1649 -896 241 1293 1610
$$ packed form
3318A954n04j525j888k49J511J463J037l02p29j452m83J19O49J091j27n30N48
3335E83N17j37j082j084k66P79J237J096K11r60j759j104M7J490J598P96j090
3352H72r37o62L44j84M62l65L09K94M55L81k51j148j014m05J030J615J346l92
3370A750j644j375n25P23O42J587j69k96n85o46K02K10j12k76r1Q83J131L68j458
3389C19j445r65P03J111J423M49p38j109j057m2O81P64R88q10k19M11K03m85o55
3408d73r03K27J128J044M30k44r80j643q19N40J837J299k53n16j011p01R5L05
3426f38N87K0m0M93K59J88r85q95m55N37Q69J508N05q52j521j474J39J347J299
3445H91J62j18m91r32p2K19P5j19NL34J110L65n28j176j230j44P53J137J052L17
$$ plain form
3465 1610 427 -773 -1335 -1312 -223 892 675 174 110 -30 62 -321 -292 -668 -563 -127 781 1719 729 -447
3485 -447 -1795 -1398 -413 764 1633 881 -77 -877 -1458 -769 -459 247 305 159 452 403 150 -97 -638 -903
3505 -903 -585 768 1397 1248 504 -629 -1736 -1316 -215 1073 1409 765 -450 -621 -643 22 -177 -26
3523 -26 29 246 779 769 278 -823 -1345 -1014 -372 1079 1366 1095 26 -1422 -1352 -377 288 673 673 214 -207
3544 -207 -490 -263 -264 -50 -416 -188 393 1394 1331 90 -1363 -1273 -1254 469 1228 1621 941 -582 -1122 -986
3564 -986 103 313 485 475 -31 105 173 -40 -427 -856 -802 75 963 1361 1011 -336 -1487 -1201 -393 698
3584 698 1155 1173 565 -609 -856 -685 165 56 253 -127 474 686 534 -105 -884 -1201 -935 -69 1240 1438
3604 1438 908 -886 -1297 -1003 -300 1137 1347 519 -49 -588 -333 157 -140 -101 -430 -204 513 821 534
$$ packed form
3465A610j183j200n62K3J089J115k17n01o4j40R2l83K9l76J05M36R08R38r90j176
3485d47j348L97R85J177Q69p52r58q00n81O89L10P06N8j46K93m9k53k47n41k65
3505i03L18J353O29j49p44j133j107M20J101J288L36o44j215j71k2O65j99J51
3523b6N5K17N33j0m91j101n22L31O42J451K87k71j069j448P0R75O65L85%m59m21
3544b07k83K27jK14l66K28N81J001o3j241j453R0J9J723P59L93o80j523n40J36
3564i86J089K10J72j0n06J36O8k13l87m29N4Q77Q88L98l50j347j151K86Q08J091
3584F98M57J8o08j174k47J71Q50j09J97l80O01K12j52o39p79l17K66Q66J309J98
3604A438n30j794m11K94P03J437K10q28n68n39K55M90k97L9l29K26P17L08k87
$$ plain form
3623 534 -340 -825 -925 -433 522 1389 959 181 -890 -1283 -894 122 755 940 581 9 -59 -137 48 -547
3643 -547 -422 -271 301 915 975 348 -779 -1247 -1195 -62 1106 1234 838 -413 -653 -815 -422 9 296
3662 296 161 328 83 433 30 -179 -707 -564 -230 651 1170 815 -78 -1172 -1351 -927 45 1030 1048 660
3682 660 -278 -735 -304 107 -166 70 -163 416 760 628 -201 -608 -825 -695 -82 853 1039 626 -142 -892
3702 -892 -1292 -515 392 495 684 77 -744 -398 -42 -402 -232 -661 -16 483 619 318 103 -857 -1138 -428
3722 -428 324 1109 916 342 -559 -619 -570 -172 674 493 451 392 175 -93 46 -378 -724 -656 247 787 682 273
3744 273 -333 -793 -844 -555 832 1067 1156 -126 -493 -641 14 310 12 144 415 310 115 189 -123 -640
3764 -640 -596 -510 194 949 776 4 -605 -1350 -640 -159 845 996 383 -38 -392 -380 -150 138 195 103 36 484
$$ packed form
3623E34q74m85j00M92R55Q67m30p78j071l93L89J016O33J85l59n72o8p8J85n95
3643e47J25J51N72O14O0o27j127m68N2J133J168J28l96j251k40j62L93M31K87
3662B96j35J67k45L50m03k09n28J43L34Q81N19l55q93j094j79M24R72R85J8l88
3682F60r38m57M31M11k73K36k33N79L44j32q29m07k17J30O13R35J86m13p68p50
3702h92m00P77R07J03J89o07q21L46L56l60J70m29O45M99J36l01k15r60k81P10
3722d28P52P85j93n74r01o0M9L98Q46j81m2n9k17k68J39m24l46O8R03N40j05m09
3744B73o06m60n1K89J387K35Q9j282l67j48O55K96k98J32K71j05j95P4l12n17
3764f40M4Q6P04P55j73p72o09p45P10M81J004J51o13m21l54J2K30K88N7r2o7M48
$$ plain form
3786 484 543 435 -430 -547 -729 -144 574 1076 678 -381 -808 -617 -510 225 594 308 21 -382 -34 -282
3806 -282 -74 -191 -183 137 132 720 537 -186 -429 -1017 -587 70 502 766 350 -459 -600 -687 79 114 238 357
3828 357 90 174 -2 279 -123 -421 -714 -83 414 998 716 -116 -614 -1010 -489 269 597 161 -216 -341
3848 -341 -244 -399 57 -21 -6 -15 -39 227 351 -239 -328 -630 -810 199 597 779 268 -480 -871 -609 26 328
3870 328 749 533 -188 -294 -8 -100 14 -326 -118 -8 360 630 -117 -175 -494 -579 -363 362 1080 642 128
3891 128 -453 -722 -502 129 418 436 190 154 47 236 9 -193 -502 -166 -3 567 568 270 -544 -707 -1055
3912 -1055 -189 573 804 380 12 -699 -347 -174 107 -3 301 -58 380 59 -19 -10 -196 -585 -401 645
3932 645 621 469 16 -634 -735 -479 -66 477 532 99 -331 -405 -319 233 151 -185 55 395 139 429 221 -462
$$ packed form
3786D84N9j08q65j17j82N85P18N02l98j059m27J91J07P35L69k86k87m03L48k48
3806b82K08j17QL20nN88j83p23k43n88M30O57M32K64m16q09j41q7P66L5J24J19
3828C57k67Q4j76K81m02k98k93O31M97N84k82q32m98l96N21P58L28m36l77j25
3848c41R7j55M56p8J5rk4K66J24n90q9l02j80J009L98J82n11p48l91K62O35L02
3870C28M21k16p21j06K86r2J14l40K08J10L68K70p47n8l19q5K16P25P18m38n14
3891A28n81k69K20O31K89J8k46l6j07J89k27k02l09L36J63N70Jk98q14j63l48
3912a055Q66P62K31m24l68p11L52J73K81j10L04l59M38l21p8Rj86l89J84J046
3932F45k4j52m53o50j01K56M13N43N5m33m30p4Q6N52q2l36K40L40k56K90k08o83
$$ plain form
3954 -462 -479 -128 69 612 455 372 -114 -1010 -685 -3 399 456 461 43 138 18 -330 -273 -41 -161 -251 114 777
3977 777 120 -257 -506 -624 -463 -32 491 361 65 -135 -541 -600 77 117 162 364 -174 -107 34 -40 -125 -463
3999 -463 -510 -128 594 600 45 -129 -706 -327 74 304 437 477 248 -102 -319 -181 -56 -233 -63 -81 26 -94
4021 -94 302 -87 -440 -450 -181 250 756 262 -47 55 -661 -345 154 352 332 218 29 -437 -461 -246 -308 -211
4043 -211 -176 335 60 313 365 -70 -447 -227 -7 357 502 258 -484 -365 -297 -101 -2 213 449 395 57 -58
4065 -58 -46 -70 -183 -321 171 321 346 350 -113 -140 -773 -296 -88 143 264 213 166 -425 -365 116 203 32 -27 -145
4089 -145 15 -88 16 -203 -260 -51 -128 -42 625 141 -241 -567 -496 -340 98 456 177 -73 -206 -353 -89
4110 -89 -5 -204 -36 300 52 154 200 -18 -242 -246 -340 109 691 431 0 -30 -509 -290 58 291 499 282
$$ packed form
3954d62j7L51J97N43j57q3m86q96L25O82M02N7Nm18R5j20l48N7K32j20r0L65O63
3977G77o57l77k49j18J61M31N23j30k96k00m06n9O77M0M5K02n38O7J41p4q5l38
3999d63m7L82P22On55j74n77L79M01K30J33M0k29l50k17J38J25j77J70j8J07j20
4021i4L96l89l53j0K69M31N06m94l09J02p16L16M99J98k0j14j89m66k4K15o2R7
4043b11L5N11k75K53N2m35l77K20K20L64J45k44p42J19O8J96R9K15K36n4l38j15
4065e8J2k4j13j38M92J50K5Mm63k7o33M77K08K31J21n1m7n91O0M81Q7j71n9j18
4089a45J60j03J04k19n7K09p7Q6O67m84l82l26P1J56M38L58k79k50j33j47K64
4110h9Q4j99J68L36k48J02M6k18k24mr4M49N82k60m31l0m79K19L48K33K08k17
$$ plain form
4132 282 72 -179 -229 -134 117 -17 163 71 -2 228 -103 117 -186 -657 -489 293 432 686 -49 -111 -591 -166
4154 -166 12 347 -90 218 138 0 -105 -53 -188 -324 -209 -126 18 499 266 75 -456 -540 -98 487 77
4175 77 184 96 -269 -479 -357 223 41 310 177 166 -23 154 -229 -512 -129 325 70 285 405 19 -151
4196 -151 -254 -375 -1 427 432 242 -130 -77 -313 79 22 52 18 188 212 -15 67 12 -389 -451 -230 573 174
4219 174 120 -231 -460 -85 -178 -9 46 367 88 54 -75 -70 69 134 23 -224 -194 276 499 -118 -257 -426 -182
4242 -182 407 168 375 234 -198 -549 -216 -456 161 -23 14 -31 267 173 -73 -112 -55 8 -87 62 581 140
4264 140 -173 -153 -480 -251 86 170 336 231 -19 227 76 11 18 -250 11 186 135 161 67 -203 -235 -133 121
4287 121 202 86 196 -229 -351 -307 55 54 146 490 148 -349 -355 -3 -218 18 -84 153 161 -84 99 -301 -371
$$ packed form
4132B82k10k51n0R5K51j34J80r2p3K30l31K20l03m71J68P82J39K54p35o2m80M25
4154a66J78L35m37L08q0j38j05N2j35j36J15Q3J44M81k33j91n31q4M42N85m10
4175G7J07q8l65k10J22N80j82K69j33j1j89J77l83k83L83M54k55K15J20l86j70
4196a51j03j21L74M28Nj90l72N3k36L92n7L0l4J70K4k27Q2n5m01o2K21Q03l99
4219A74n4l51k29L75r3J69N5L21k79l4j29NJ39O5j11k47L0M70K23o17j39j69K44
4242a82N89k39K07j41m32l51L33k40O17j84L7m5K98r4k46l9N7O3r5J49N19m41
4264A40l13K0l27K29L37Q4J66j05k50K46j51o5Pk68K61J75n1K6r4k70l2J02K54
4287A21Q1j16J10m25j22M4L62jR2L44l42m97oL52k15K36j02K37Qk45J83m00p0
$$ plain form
4310 -371 -554 136 217 480 211 -303 -59 -110 -171 -184 230 -236 173 -62 15 -113 -23 -63 -603 -300 -127 232
4332 232 473 174 -488 -290 -353 228 358 658 243 -86 -24 -210 -34 33 112 0 57 198 174 87 -70 -313
4354 -313 4 -84 450 330 354 252 -462 -254 -185 55 329 344 263 -241 -334 23 121 105 -59 -175 189 203 125
4377 125 -24 -358 -124 -249 -46 263 386 127 78 -2 -262 -151 21 197 186 -347 72 -63 -100 288 -183
4398 -183 -248 -285 -344 90 -119 128 45 -346 -193 96 151 23 -51 70 -348 6 124 192 -106 186 -2 115
4420 115 -105 -81 188 -386 174 138 265 34 147 1 -77 -402 -175 131 290 26 228 -214 -69 49 3
4441 3 53 2 -98 -73 303 -291 -157 -78 -288 -127 192 241 52 -98 45 -289 -205 84 -86 97 12 202 206 -168
4465 -168 51 -127 96 -111 76 285 -76 78 -110 159 111 -195 25 372 -154 80 -229 -220 -36 273 452
$$ packed form
4310c71j83O90Q1K63k69n14K44n1o1j3M14m66M09k35P7j28R0m0n40L03J73L59
4332B32K41k99o62J98o3N81J30L00m15l29O2j86J76O7P9j12N7J41k4q7j57k43
4354c13L17q8N34j20K4j02p14K08O9K40K74J5q1n04r3L57R8j6j64j16L64J4p8
4377A25j49l34K34j25K03L09J23k59m9q0k60J11J72J76j1n33M19j35l7L88m71
4398a83o5l7n9M34k09K47q3l91J53K89N5j28p4J21m18L54J18O8k98K92j88J17
4420A15k20K4K69n74N60l6J27k31J13j46p8l25K27L06J59k64K02m42J45J18m6
4441CN0n1j00K5L76n94J34P9k10J61L19M9j89j50J43l34Q4K89j70J83q5J90Ml74
4465a68K19j78K23k07J87K09l61J54j88K69m8l06K20L47n26K34l09RJ84L09J79
$$ plain form
4486 452 179 248 -336 -167 -189 -507 123 85 -15 -13 107 59 -101 -168 -279 23 -111 -84 27 -129 -20 -157 117
4509 117 -140 -54 324 23 107 231 -303 35 -48 189 -56 -79 37 -70 704 41 192 -300 -279 -118 -43 83
4531 83 84 236 20 143 181 155 92 -56 -79 88 -13 221 46 -129 101 158 -24 97 -50 6 -178 -231 -183 144
4555 144 16 111 -6 -116 -130 -82 40 -386 -229 276 185 48 371 91 -138 47 -164 -232 83 129 195 -109
4577 -109 146 -399 -111 103 -159 168 104 94 144 226 -75 -178 84 -25 320 292 82 -214 150 -195 79 107
4599 107 -15 -113 179 195 101 66 206 -68 18 162 -188 -150 215 94 -240 119 -40 121 -214 -150 -185 -38 -96
4622 -96 -42 -68 56 -61 -118 434 -169 210 -64 77 -35 -130 -291 175 112 -57 39 -142 -163 -278 29 302 -161
4645 -161 402 -150 -66 -85 -56 152 13 258 -59 -70 -211 -209 207 63 29 174 182 114 -84 12 -83 -50 -83 30 20
$$ packed form
4486D52k73O9n84J69k2l18O30l8j00KJ20m8j60o7j11L02j34K7J11j56J09j37K74
4509A17k57Q6L78l01Q4J24n34L38q3K37k45k3J16j07P74o63J51m92K1J61P5J26
4531H3JJ52k16J23L8k6o3j48k3J67j01K34j75j75K30N7j82J21j47N6j84n3M8L27
4555A44j28R5j17j10j4M8J22m26J57N05r1j37L23k80k29J85k11o8L15M6O6l04
4577a09K55n45K88K14k62L27o4j0N0Q2l01j03K62j09L45k8k10k96L64l45K74K8
4599A07j22r8K92J6r4l5J40k74Q6J44l50L8L65j21l34L59j59J61l35O4l5J47n8
4622i6N4k6J24j17n7N52o03L79k74J41j12r5j61M66o3j69R6j81k1j15L07K73m63
4645a61N63n52Q4j9K9K08j39K45l17j1j41KM16j44l4J45Qo8j98R6r5L3l3J13j0
$$ plain form
4670 20 402 50 -251 41 113 -110 -157 58 -123 -66 88 234 157 -76 -234 99 58 -305 116 -104 273 63
4692 63 -139 -75 113 289 27 193 -99 280 -46 -146 100 -331 21 -186 2 140 -6 -13 -47 -100 292 297 527
4715 527 -55 -330 95 11 -181 -19 -145 20 -21 120 60 -99 -101 -81 352 -221 149 116 115 -277 195 -177 -303
4738 -303 143 -319 -70 -17 -50 -251 163 -259 31 -100 100 6 241 194 171 422 94 -156 -279 5 -142 96
4760 96 149 8 165 -139 -71 15 -150 -185 -8 -193 -103 112 -68 -52 194 121 -79 -304 -79 -220 76 22 187
4783 187 -106 -23 36 -184 31 -162 67 380 -21 -99 432 13 234 27 -212 25 -6 334 -127 -52 -33 64
4805 64 -161 155 202 39 36 390 155 -176 -238 -41 88 225 171 22 -20 -258 -75 -114 -55 -182 -126 -118 -357 113
4829 113 114 110 -30 -12 53 -119 250 48 -26 69 16 -178 49 323 9 119 168 -142 -198 -316 -128 70 87 68
$$ packed form
4670B0L82l52l01K92P2k23m7K15j81N7J54J46p7k33j58L33m1l63M21k20L77k10
4692F3k02O4J88J76k62J66k92L79l26j00K46m31L52k07J88J38j46pl4n3L92NK30
4715E27n82k75M25q4j92J62j26J65m1J41o0j59kK0M33n73L70l3jl92M72l72j26
4738c03M46m62K49N3l3k01M14m22K90j31K00r4K35m7k3K51l28k50j23K84j47K38
4760I6N3j41J57l04O8Q6j65l5J77j85R0K15j80J6K46p3k00k25K25j41K96n4J65
4783A87k93Q3N9k20K15j93K29L13m01p8N31m19K21k07k39K37l1L40m61P5J9R7
4805F4k25L16M7j63lL54k35l31o2J97J29J37n4j49m2k38J83l9N9j27N6Qk39M70
4829A13Jmj40J8O5j72L69k02p4R5n3j94K27K74l14J10M9l10n6j18J88J98J7j9
$$ plain form
4853 68 -107 128 -91 -84 -364 -80 136 133 -75 53 -236 -322 -81 -128 -298 203 -17 -67 -92 -55 1 118 -137 14
4877 14 -4 -74 100 -156 126 -192 -6 -165 300 169 21 267 -26 -348 177 328 -72 -228 -103 -173 134
4898 134 303 -15 149 267 -168 11 159 369 226 143 243 -89 -49 -33 83 21 -87 59 130 -32 -47 80
4920 80 -114 -208 -129 -167 7 47 99 43 -34 -256 -146 103 216 69 228 -32 -207 -165 194 31 -178 46 -86
4943 -86 -221 -226 176 -202 223 123 54 90 -40 -155 -52 17 60 -196 -17 -80 -158 -27 -401 118 -152 -239 125
4966 125 216 -73 -187 -93 -62 43 -4 -128 -111 -92 211 -104 -212 -470 25 -113 38 -5 71 108 -21 45 157
4989 157 -357 100 8 -310 196 298 64 -228 -248 -18 -81 232 97 5 -439 89 -161 -183 -64 147 81 -47
5011 -47 30 -177 -145 9 164 -14 154 38 -76 -12 109 -115 -110 -49 -82 273 99 -135 3 -75 -186 42 -204
$$ packed form
4853F8j75K35k19Pk80K84K16lk08J28k89q6K41m7j70N01k20n0k5L7N6J17k55J51
4877A4j8p0J74k56K82l18J86j59M65j31j48K46k93l22N25J51m00j56J25p0L07
4898A34J69l18J64J18m35J79J48K10j43q3J00l32M0J6J16o2j08J46P1j62j5J27
4920H0j94r4P9l8J74M0N2n6p7k22J10K49J13j47J59k60j75M2L59j63k09K24j32
4943h6j35nM02l78M25j00o9L6j30j15J03O9M3k56J79o3p8J31l74N19k70q7L64
4966A25R1k89j14R4L1J05m7j24J7J9L03l15j08k58M95j38J51m3P6L7j29O6J12
4989A57n14M57r2l18N06J02k34k92k0K30o3L13j35r2m44N28k50k2J19K11o6j28
5011d7P7k07L2J54J55j78J68j16j14O4J21k24NO1l3L55j74k34J38p8j11K28k46
$$ plain form
5034 -204 20 -18 -119 186 117 -60 284 -220 -219 -31 71 257 163 -53 -136 73 -360 80 5 283 -119 -270
5056 -270 187 245 -104 -189 -11 -14 -67 -136 413 137 -85 -282 60 -58 50 142 -130 13 -82 54 257 -106 250
5079 250 -100 141 -276 170 -120 20 91 -17 -18 304 215 243 -236 196 -31 157 169 -126 250 323 50 -52
5101 -52 -60 -91 50 131 27 4 -87 148 116 30 -125 95 52 4 298 -97 152 -434 -85 138 -122 190 -65 -436
5125 -436 -26 -116 -313 -67 137 272 98 287 15 5 -45 -285 -116 218 143 98 125 19 -123 -190 -383 -98
5147 -98 49 -2 -121 203 -133 267 56 -143 61 368 -116 -36 487 134 -224 40 143 191 210 97 126 -129
5169 -129 59 10 -44 -52 -304 -267 -1 -61 194 270 2 164 181 -160 193 128 311 254 -103 -22 157 244 268 226 -165
5194 -165 28 -175 -77 172 -294 113 80 7 -14 171 23 215 18 -160 -105 46 329 -47 54 -68 -77 -219
$$ packed form
5034b04K24l8j01L05o9j77L44n04JJ88J02J86r4k16q3K09m33M40p5K78m02j51
5056b70M57N8l49q5J78ln3o9N49k76k22j97L42j18J08R2k72J43r5J36K03l63L56
5079B50l50K41m17M46k90J40P1j08jL22q9K8m79M32k27J88J2k95L76P3k73j02
5101e2ql1J41Q1j04k3r1K35l2q6j55K20m3m8K94l95K49n86L49K23k60L12k55l71
5125d36M10r0j97K46K04J35j74J89k72j0n0k40J69L34p5m5K7j06j42o7j93K85
5147i8J47n1j19L24l36M00k11j99K04L07m84Q0N23l53l58K64J03M8J9j13K9k55
5169a29J88m9n4qk52L7K66o0K55P6k68J62J7l41L53o5J83n7l57Q1J79Q7K4m2l91
5194a65J93k03R8K49m66M07l3p3k1J85j48J92j97j78N5J51K83l76J01j22rj42
$$ plain form
5216 -219 -160 65 231 -25 -174 -136 91 5 186 -71 -42 -64 93 166 -107 289 -326 -129 -389 15 88 -38
5238 -38 60 -130 -51 79 98 139 -28 -76 29 309 197 -258 120 51 -128 106 -43 61 26 -92 -228 -205 453
5261 453 339 253 155 96 -244 8 -126 193 93 -482 131 80 51 190 35 153 -3 -45 478 55 0 198
5283 198 -299 207 143 288 191 -125 -62 -54 119 -231 274 28 -95 146 48 -68 -62 309 -144 -332 -79 -160 68
5306 68 234 32 -341 -68 150 24 122 164 -245 -366 -71 184 -74 -89 53 79 200 218 415 -1 -325 26
5328 26 -305 -477 54 335 -123 -46 -217 -67 -10 -172 -86 81 30 -182 -86 115 187 282 -1 29 160 67 -183
5351 -183 22 -153 -377 -193 -84 228 -80 296 256 -219 -62 -49 42 -119 -224 -309 50 -72 55 34 327 -212
5373 -212 -25 49 326 41 143 -229 -491 247 -196 324 -3 76 22 107 -133 32 420 -2 -203 234 12
$$ packed form
5216b19N9K25J66k56j49L8K27q6J81k57K9k2J57P3k73L96o15J97k60M04P3j26
5238c8R8j90P9J30J9M1j67m8J05K80j12m55L78o9j79K34j49J04l5j18j36K3O58
5261D53j14q6r8n9l40K52j34L19j00n75O13n1k9J39j55J18j56m2N23m23n5J98
5283A98m97N06o4J45r7l16O3QJ73l50N05k46j23K41r8j16OL71m53j88K53q1K28
5306F8J66k02l73K73K18j26R8M2m09j21K95K55k58j5J42K6J21J8J97m16l24L51
5328B6l31j72N31K81m58P7j71J50N7j62Q6J67n1k12R6K01P2R5k83L0J31r3k50
5351a83K05j75k24J84J09L12l08L76m0m75J57J3R1j61j05q5L59j22J27k1K93n39
5373b12J87P4K77k85J02l72k62P38m43N20l27P9n4Q5k40J65L88m22k01M37k22
$$ plain form
5394 12 50 -82 -334 -97 256 176 -3 16 -58 -7 -32 -28 36 50 -8 159 335 74 -143 124 -153 24 285 -43
5418 -43 259 127 -86 -25 -199 -270 -50 144 333 140 -188 -78 -206 -194 45 108 103 -263 -204 279 -74 -8 -62
5441 -62 -197 -216 -111 79 251 138 71 -123 -300 91 60 105 23 -189 -129 163 93 321 -219 -184 -150 105 -83
5464 -83 86 -103 -195 -62 -128 257 166 62 40 -87 -107 70 450 352 210 174 -498 -263 -141 168 25 -29 -235
5487 -235 -187 203 -49 -12 -56 -17 -308 49 254 373 -35 -256 -246 -232 354 125 77 145 15 -256 -255 160 -269
5510 -269 -357 123 29 -86 251 116 253 -162 -163 20 73 192 299 48 -169 89 -159 207 271 116 -17 57
5532 57 109 235 -138 -49 -235 12 -220 37 554 -279 -30 -139 -205 238 102 -44 224 -123 -65 290 -188 101
5554 101 236 -114 -28 -13 -82 -60 160 34 -183 -42 215 124 66 -87 -117 -416 -58 -8 -24 127 -8 118 -124
$$ packed form
5394A2L8j32k52K37L53q0j79J9p4N1k5MO4J4n8J67J76k61k17K67k77J77K61l28
5418d3L02j32k13O1j74p1K20J94J89j93l28J10j28J2K39O3nl66N9M83l53O6n4
5441f2j35j9J05J90J72j13o7j94j77L91l1M5q2k12O0K92p0K28n40L5L4K55j88
5464h3J69j89r2J33o6L85r1j04k2j27k0J77L80r8j42l6o72K35J22L09j43n4k06
5487b35M8L90k52L7m4L9k91L57K05J19m08k21J0J4N86k29m8O8j30k71JM15m29
5510b69q8M80r4j15L37j35J37m15jJ83N3J19J07k51k17K58k48L66O4j55j33P4
5532E7N2J26l73Q9j86K47k32K57N17q33K49j09o6M43j36j46K68l47N8L55m78K89
5554A01J35l50Q6J5o9K2K20j26k17J41K57r1n8j53l0k99L58N0j6J51j35J26k42
$$ plain form
5577 -124 30 108 91 -36 229 375 140 183 252 -203 -376 4 265 107 297 159 -83 -353 -255 -155 366 256
5599 256 157 -78 93 99 200 -96 -440 -37 -22 -34 296 254 -306 92 -283 -81 -58 407 -31 113 -244 -300 146
5622 146 100 -263 1 14 -60 149 99 -140 -320 -21 -297 -125 142 70 201 36 -226 -138 -116 41 267 428
5644 428 -58 -373 36 2 -167 -91 170 250 -257 -47 296 325 -172 -318 142 359 42 309 335 -104 -199 111
5666 111 -38 176 156 425 -217 -146 -272 -142 -100 40 -248 -224 376 0 207 -51 -221 -318 30 107 222 36
5688 36 66 -193 -222 38 -392 246 -4 69 248 159 -121 91 -182 -339 -57 213 72 57 65 -43 -132 -123 -177 263
5712 263 252 -215 -265 -19 157 -88 -7 -227 -95 -31 -51 45 -289 -119 -63 -264 -198 231 308 434 -83 -431 -294
5735 -294 -229 -289 289 333 -282 103 -405 -168 -123 180 51 64 -46 -167 -5 93 119 -203 -57 -102 60 352 476
$$ packed form
5577a24J54P8j7j27K65J46k35M3O9m55j73L80K61j58J90j38k42k70R8J00N21j10
5599B56r9k35J71OJ01k96l44M03J5j2L30m2n60L98l75K02K3M65m38J44l57n6M46
5622A46m6l63K64J3p4K09n0k39j80K99k76J72K67p2J31j65k62Q8K2J57K26J61
5644D28m86l15M09l4j69P6K61Q0n07K10L43K9m97j46M60K17l17K67K6m39r5L10
5666A11j49K14k0K69o42P1j26J30M2J40k88K4O00l76K07k58j70r7L48P7J15j86
5688C6L0k59k9K60m30O38k50P3J79q9k80K12k73j57K82K70j41j5Qj08q9Rn4M40
5712B63j1m67n0K46J76k45Q1k20J32O4k0R6l34J70N6k01O6M29P7J26n17l48J37
5735b94O5o0N78M4o15L85n08K37M5L03j29J3j10j21J62R8K6l22J46m5J62K92J24
$$ plain form
5758 476 -260 -140 -251 36 366 228 182 71 -175 81 41 -273 46 43 -246 -36 282 169 206 -524 -382 -52
5780 -52 92 168 377 17 -238 -180 -35 -65 319 -170 -12 -88 253 -118 295 -207 -230 74 419 -140 85 -41
5802 -41 -331 -241 -119 -6 232 180 507 36 42 -217 194 107 122 115 -215 38 301 76 81 -66 -314 -140 274 372
5826 372 196 18 -383 -393 -76 55 301 11 -90 -48 43 83 -260 168 -167 -402 -24 135 59 121 -272 -462
5848 -462 -472 253 456 381 -21 -164 54 7 169 122 256 -300 -105 94 -188 63 239 -454 -426 -152 -53 293
5870 293 248 6 -261 -377 -122 -58 44 493 72 -162 29 140 -87 -55 240 -50 -253 -71 27 236 172 90
5892 90 -88 -110 223 254 176 -196 -98 -469 84 295 256 -78 16 11 -185 162 227 27 238 130 176 315 208 -23
5916 -23 -232 -274 -237 -133 -23 555 462 -182 -147 -104 2 408 85 101 -192 -135 -79 -208 70 -92 -411 144 87
$$ packed form
5758D76p36J20j11K87L30j38m6j11k46K56m0l14L19lk89K10L18j13L7p30J42L30
5780e2J44P6K09l60k55N8J45l0L84m89J58p6L41l71M13n02k3L04L45n59K25j26
5802d1k90R0J22J13K38n2L27m71Ok59M11q7J5pl30K53K63k25Nj47k48J74M14R8
5826C72j76j78m01j0L17J31K46k90j01M2R1M0l43M28l35k35L78J59p6O2l93j90
5848d62j0P25K03p5m02j43K18m7J62m7J34n56J95J99k82K51J76o93K8K74R9L46
5870B93m5k42k67j16K55O4J02M49m21k34J91J11k27L2K95k90k03J82R8K09o4q2
5892I0j78k2L33L1p8l72R8l71N53K11l9l34R4nj96L47O5k00K11j08M6J39j07k31
5916b3k09m2L7J04J10N78r3o44L5M3J06M06l23J6k93N7N6j29K78j62l19N55n7
$$ plain form
5939 87 142 171 -353 79 -346 -287 431 134 271 95 -630 -80 -116 184 -9 28 2 -12 -261 -95 -320 -135 83
5962 83 -81 295 349 319 49 -79 191 -141 -61 -25 145 3 4 166 -8 109 160 99 181 79 47 138 19 -123
5986 -123 -374 -292 91 224 129 234 40 12 -322 124 52 297 286 133 -432 -312 -43 130 -16 209 -346 -66
6008 -66 139 -146 -420 -27 6 -232 -148 96 -63 305 44 -98 174 -101 115 -60 441 -28 -222 -47 143
6029 143 58 -168 -287 -164 106 216 391 -201 -372 -132 -1 208 297 216 -117 -434 154 -165 8 26 152
6050 152 207 -8 171 -26 134 44 -230 -65 135 535 201 29 -3 28 -78 -16 -134 254 -89 -139 -367 320
6072 320 31 9 -322 -319 16 336 12 195 -120 -392 -252 -242 164 53 220 -128 -235 -118 -225 115 128 300
6094 300 113 -343 88 50 112 -79 -325 -268 -75 184 89 24 -107 -313 -251 -238 156 150 138 26 155 -267 -134
$$ packed form
5939H7N5K9n24M32m25N9P18k97J37j76p25N50l6L00j93L7k6j4k49J66k25J85K18
5962H3j64L76N4l0k70j28K70l32Q0L6J70j42JJ62j74J17N1o1Q2j02l2R1j19j42
5986a23k51Q2L83J33r5J05j94k8l34M46p2K45j1j53n65J20K69J73j46K25n55K80
6008f6K05k85k74L93L3k38Q4K44j59L68k61j42K72k75K16j75N01m69j94J75J90
6029A43q5k26j19J23K70J10J75n92j71K40J31K09Q9q1l33l17N88l19J73J8J26
6050A52N5k15J79j97J60r0k74J65K00M00l34j72l2L1j06O2j18L88l43n0k28O87
6072C20k89k2l31LL35L20l24J83l15k72J40J0M06j11J67l48j07J17j07L40J3J72
6094C00j87m56M31l8O2j91k46N7J93K59r5o5j31k06O2J3L94oj2j12J29m22J33
$$ plain form
6117 -134 160 -10 64 -59 -221 83 412 -80 -339 -100 -381 23 212 33 26 -140 -238 -341 177 339 -63
6138 -63 -43 8 90 -83 -8 -58 9 26 -145 276 289 -202 -62 -47 -220 22 407 454 0 -236 -119 -254 -186 202
6162 202 -12 82 -4 -142 -42 111 -248 33 191 49 98 -30 413 -146 -94 -248 79 161 225 212 -281 -225 -250
6185 -250 -29 94 -11 -149 -285 -371 -118 51 23 46 338 -157 43 -83 415 214 -59 -155 -174 179 59 265
6207 265 -54 23 -163 -76 -191 41 -10 129 83 -74 -154 306 260 -240 -135 -4 -143 218 409 248 -485 -691
6229 -691 -133 126 -77 16 -25 -187 250 -264 93 184 -219 -284 -81 -300 238 380 65 -172 -55 176 -48
6250 -48 110 357 156 37 -69 -202 355 272 108 -1 -365 -233 -124 32 151 46 76 572 128 145 -8
6271 -8 250 -218 -79 324 38 191 -27 -340 -292 -8 -88 51 320 -21 174 -65 -324 211 78 -170 106
$$ packed form
6117a34K94j70P4j23j62L04L29m92k59K39k81M04J89j79pj66r8j03N18J62m02
6138f3K0N1Q2j73P5n0O7J7j71M21J3m91J40J5j73K42L85M7m54k36J17j35O8L88
6162B02k14R4q6j38J00J53l59K81J58j42M9j28M43n59N2j54L27Q2O4j3m93N6k5
6185b50K21J23j05j38j36q6K53J69k8K3K92m95K00j26M98k01k73r6j9L53j20K06
6207B65l19P7j86Q7j15K32n1J39m6j57q0M60m6n00J05J31j39L61J91j61p33k06
6229f91N58K59k03R3m1j62M37n14L57R1m03o5K03k19N38J42l15k37J17K31k24
6250d8J58K47k01j19j06j33N57q3j64j09l64J32J09J56J19j05L0M96m44J7j53
6271hK58m68J39M03k86J53k18l13M8K84q0J39K69l41J95k39k59N35j33k48K76
$$ plain form
6292 106 -176 184 106 347 -31 -431 -377 -95 93 68 107 64 -164 -324 -37 -161 143 -68 -267 -190 -41 76
6314 76 148 -87 -284 34 111 215 160 114 58 -313 -435 -161 41 1 168 93 -173 -171 -126 349 490 -15 -36 223
6338 223 124 -77 -278 -367 -197 14 91 151 88 -115 -211 -233 -178 -114 204 431 17 -223 113 13 99 239 79
6361 79 366 147 386 496 93 -219 -153 -472 -43 175 221 399 -228 -203 -294 122 -170 40 29 -107 -206 24
6383 24 8 -69 -212 38 370 144 322 -52 -19 12 -457 -87 234 307 150 226 -167 -170 -70 -126 -94 114 187 -32
6407 -32 -66 -92 48 -124 99 -133 -126 202 267 -118 -121 -191 -136 -158 43 196 -172 -58 -86 -295 86 -116 -46 -154
6431 -154 144 121 89 460 393 -70 -120 -169 247 434 212 351 86 -397 -183 -128 203 101 -23 -189 -148 -283
6453 -283 124 85 -89 -52 -360 -368 13 53 -342 -64 -349 227 78 85 -132 -423 -314 -324 -70 -78 19 -36 41 89 -236
$$ packed form
6292A06k82L60p8K41l78m00N4K82J88k5L9m3k28j60K87j24L04k11j99P7J49J17
6314G6P2k35j97L18P7J04n5m6n6l71j22K74K02m0J67p5k66KM5M75J41n05k1K59
6338B23r9k01k01q9J70K11P7O0o3k03r6k2N5O4L18K27m14k40L36j00Q6J40j60
6361G9K87k19K39J10m03l12O6l19M29K18M6J78o27K5r1M16k92K10j1j36r9K30
6383B4j6p7j43K50L32k26J78l74L3L1m69L70L21P3j57P6l93lJ00n6L2K08P3k19
6407c2l4k6J40j72K23k32PL28O5l85lp0N5k2K01J53l68J14k8k09L81k02P0j08
6431a54K98k3l2L71o7m63n0m9M16J87k22J39k65m83K14N5L31j02j24j66M1j35
6453b83M07l9j74L7l08qL81M0l95K78k85N76j49Pk17k91J09j0K54qR7n5P7M8l25
$$ plain form
6478 -236 -9 -285 105 -141 -538 361 393 396 -365 -244 -511 -366 66 189 327 182 -80 -298 -225 -80 208
6499 208 165 -84 50 -214 376 76 -124 -623 -27 209 374 189 87 46 -379 -237 102 289 -153 356 57
6520 57 96 63 -71 100 -49 -291 -147 -261 187 154 100 56 -89 217 -213 355 478 47 235 -161 -182 -46
6542 -46 93 -13 -186 118 -52 66 88 212 54 -386 -214 -27 259 106 -18 -233 -297 -137 69 251 198
6563 198 -31 -184 -231 -11 -121 208 -77 -112 176 -37 38 272 45 -113 -39 -196 146 324 57 -73 -160 -76
6585 -76 87 106 252 68 -83 202 -197 -11 189 38 -77 203 -27 419 132 -178 -13 37 -335 262 393
6606 393 111 -17 33 -422 -248 449 255 64 97 -223 -168 368 127 -96 -25 -200 -3 252 198 213 45 -52
6628 -52 -18 -128 -75 -44 -105 -105 -544 -96 135 -87 256 193 -267 -49 -46 26 220 118 -37 208 267 -175 319 99
$$ packed form
6478b36K27k76L90k46l97Q99L2Lp61J21k67J45M32J23J38j45k62k18P3J45K88
6499B08m3k49J34k64N90l00k00m99N96K36J65j85j02m1m25J42L39J87m42N09k99
6520E7L9l3j34J71j49k42J44j14M48l3n4m4j45L06m30N68J23m31J88l96k1J36
6542d6J39j06j73L04j70J18K2J24j58m40J72J87K86j53j24k15o4J60K06J82n3
6563A98k29j53m7K20j10L29k85l5K88k13P5K34k27j58P4j57L42J78k67j30q7Q4
6585g6J63J9J46j84j51K85l99J86K00j51j15K80k30M46k87l10J65N0l72N97J31
6606C93k82j28N0m55J74O97j94j91L3l20N5N36k41k23P1j75J97K55n4J5j68r7
6628e2L4j10N3L1o1%m39M48K31k22L43o3m60K18LP2J94j02j55K45N9m42M94k20
$$ plain form
6652 99 -220 -376 -114 362 -158 -118 -16 89 8 13 -77 -126 -107 -86 -89 -37 -30 -51 164 -181 -421 3 211 493 45
6677 45 -205 5 -92 -33 516 338 -234 273 57 -150 -138 -258 15 162 -333 -288 -26 136 58 94 60 -230 -114
6700 -114 -38 220 -144 -182 -76 -260 -325 298 137 117 128 207 154 10 130 -61 -187 233 516 250 151 -159 187
6723 187 -238 -339 190 18 613 27 -40 -105 43 214 -212 -2 -12 377 -188 85 49 -172 -491 156 -29
6744 -29 283 159 -2 -98 -533 -230 105 102 41 -76 -280 -351 206 123 80 -16 -399 -174 130 -134 -206 155 -242
6767 -242 -461 352 381 109 49 92 -211 -150 143 -36 103 62 -81 -176 -193 91 181 -130 -104 103 -36 109 72
6790 72 -403 -92 -434 -197 71 175 306 65 -15 -169 -126 -79 -102 235 -61 -290 -345 27 34 -107 87 134 -115
6813 -115 99 401 440 110 -241 -262 -118 208 291 75 -163 -228 10 13 -14 73 -210 -58 -281 308 113 84 -10
$$ packed form
6652I9l19j56K62M76n20M0J02J05q1Nr0m9J9K1lN2Pk1K15l45k40M24K08K82m48
6677D5k50K10r7N9N49j78n72N07k16k07J2j20K73J47m95M5K62J62p8L6l4k90J16
6700a14P6K58l64l8J06j84o5O23j61k0J1P9n3j44J20j91j26M20K83k66r9l10L46
6723A87m25j01N29j72N95n86o7o5J48J71m26K10j0L89n65K73l6k21l19O47j85
6744b9L12j24j61r6m35L03L35lo1j17k04p1N57q3m3r6l83K25L04k64p2L61l97
6767b42k19Q13K9k72o0M3l03O1K93j79J39m1j43r5j7K84R0l11K6K07j39J45l7
6790G2m75L11l42K37K68J04J31k41q0j54M3M7k3L37k96k29n5L72Pj41J94M7k49
6813a15K14L02L9l30l51k1J44L26Q3k16k38o5K38Lk7Q7k83J52k23N89j95k9r4
$$ plain form
6836 -10 22 -16 51 193 286 406 -287 126 -255 -28 195 49 -117 -68 -190 -119 90 23 147 -61 243 209 186
6859 186 4 -50 33 33 92 -15 23 427 -607 -326 -73 -257 -104 194 153 -96 263 152 -250 -70 -274 -88
6881 -88 -111 165 246 268 -199 -214 -194 -446 -28 196 281 147 80 -200 43 98 -89 19 -305 -78 -193 -20 175
6904 175 290 -122 -78 -224 176 318 44 -23 -141 -184 -317 -47 425 20 -72 -223 -211 -215 -211 286 -46 -80 220
6927 220 86 162 77 76 154 -243 122 -152 16 72 -35 -228 -416 -475 45 84 135 106 -92 -80 -79 -82 -142 -281 -3
6952 -3 280 75 87 -29 4 -374 -291 142 120 117 -100 -358 -55 223 -62 84 310 -68 -96 304 -59 -73 47
6975 47 -504 -141 -136 387 -220 117 169 -366 30 132 120 80 249 71 -142 -204 96 -24 -211 115 139 -367 361
6998 361 180 -244 -278 -151 68 365 173 287 -55 -271 -24 -89 71 309 393 167 80 -232 33 131 620 -253
$$ packed form
6836a0L2l8O7J42R3J20o93M13l81K27K23j46j66M9j22P1K09o7J24k08L04l4k3
6859A86j82n4Q3%N9j07L8M04j034K81K53j84J53K98m1k49L59j11m02J80k04J86
6881h8k3K76Q1K2m67j5K0k52M18K24Q5j34o7k80K43N5j87J08l24K27j15J73J95
6904A75J15m12M4j46M00J42k74o7j18m3j33K70M72m05r2j51J2mMM97l32l4L00
6927B20j34P6q5jP8l97L65k74J68N6j07j93j88n9N20L9N1k9j98J2Jlo0j39K78
6952cK83k05J2j16L3l78Q3M33k2lk17k58L03K78k85J46K26l78k8M00l63j4J20
6975D7n51L63NN23o07L37N2n35L96J02j2m0J69j78k13o2L00j20j87L26K4n06P28
6998C61j81m24l4J27K19K97j92J14l42k16K47o5J60K38Q4k26q7l12K65R8M89q73
$$ plain form
7020 -253 -255 392 -3 110 27 -328 -101 -179 -214 28 385 161 -205 -391 32 -21 -6 -102 300 53 -66 -288 243
7043 243 39 -116 -59 -84 173 135 -63 14 -154 -154 116 390 132 316 66 -33 -165 -201 122 103 67 -72 133
7066 133 -105 205 -246 -117 -84 -348 100 19 257 16 -170 -350 -67 -57 29 393 53 147 -257 -123 -20 115
7088 115 -30 73 64 -114 63 432 16 127 -109 -33 -91 125 258 -36 -152 -345 -61 207 92 350 51
7109 51 89 -197 -144 92 1 283 -234 -191 -199 303 -169 54 -383 -569 -78 -69 169 52 -63 -92 222 -411 147
7132 147 173 -132 -181 -351 -74 -146 -202 16 -135 -157 181 412 34 63 -291 85 -153 37 458 212 -138 -32
7154 -32 -182 -142 -274 152 -195 -138 72 -47 -128 -200 297 -2 172 126 129 274 -7 -169 -168 -3 129 -210 140
7177 140 6 -127 -178 -30 -132 119 33 -71 126 174 -266 -96 51 -78 -39 -18 -98 67 321 -28 160 -25
$$ packed form
7020b53kO47l95J13q3l55K27p8l5K42L57k24l66j86M23n3J5r6M02k47j19k22N31
7043B43k04j55N7k5K57l8j98P7j68%K70K74k58J84k50r9j32l6L23j9l6j39K05
7066A33k38L10m51J29L3k64M48q1K38k41j86j80K83J0Q6L64l40R4m04J34J03J35
7088A15j45J03rj78J77L69m16J11k36P6n8K16J33k94j16j93K84K68j15K58k99
7109E1L8k86N3K36r1K82n17M3qN02m72K23m37j86M91RK38j17j15k9L14o33N58
7132A47K6l05m9j70K77p2n6K18j51k2L38K31l78K9l54L76k38J90M21k46l50J06
7154c2j50M0j32M26l47N7K10j19q1p2M97k99J74m6LJ45k81j62JJ65J32l39L50
7177A40j34j33n1J48j02K51q6j04J97M8m40J70J47j29L9K1q0J65K54l49J88j85
$$ plain form
7199 -25 -159 -242 -76 392 -99 -330 -153 -100 -78 120 -147 -383 223 61 -180 -69 -157 -424 -393 2 194 33
7221 33 62 232 86 17 276 213 257 105 385 202 -17 113 -321 5 146 -252 172 -2 178 -315 -78 -116
7243 -116 -237 51 155 482 -134 130 -54 -289 -158 162 43 -154 -59 -177 -405 117 62 -129 -21 -28 253
7264 253 274 -45 111 -99 -464 -258 60 139 47 19 -152 -91 71 230 -5 146 -147 243 -120 227 391 54
7286 54 -8 -160 -155 334 310 160 -150 -509 -156 -170 97 20 44 -201 -3 -160 33 181 -216 3 -19 -76 90
7309 90 -84 -9 -78 -327 124 258 593 53 -84 189 28 -49 12 117 263 85 31 -99 50 48 -104 -219 -245
7332 -245 -35 -146 153 12 30 -119 -134 -301 157 85 31 -1 -526 67 42 283 -192 -119 -123 -182 43 -2 -393 159
7356 159 -1 79 -170 -56 -112 -110 -182 -184 -450 4 426 -77 135 309 -455 -318 28 106 98 369 175 39 117 240
$$ packed form
7199b5j34q3J66M68m91k31J77N3K2J98k67k36O06j62k41J11q8k67L1L95J92j61
7221C3K9J70j46o9K59o3M4j52K80j83k19J30m34L26J41l98M24j74J80m93K37l8
7243a16j21K88J04L27o16K64j84k35J31L20j19j97R5j18k28N22n5j91J08pK81
7264B53K1l19J56k10l65K06L18P9r2k8j71O1J62J59k35J51k93L90l63L47J64l37
7286E4o2j52NM89k4j50l10l59L53j4K67p7K4k45J98j57J93J48l97K19k2n7J66
7309I0j74P5o9k49M51J34L35n40j37K73j61p7O1J05J46j78n4j30J49kj52j15k6
7332b45K10j11K99j41J8j49j5j67M58p2n4l2n25N93k5K41m75P3mn9K25m5l91N52
7356A59j60Q0k49J14n6Kp2kk66M54M22n03K12J74p64J37L46P8qK71j94j36P8J23
$$ plain form
7380 240 -127 -200 -230 -155 234 102 329 25 -363 -56 326 59 219 293 155 -161 172 -45 138 -81 201
7401 201 -20 238 -136 -192 -186 -13 112 -440 17 -191 54 -114 388 -247 -122 213 -64 265 169 -283 53
7422 53 55 20 -109 43 -35 -256 121 181 -27 23 -127 -374 -132 -16 263 -84 41 270 -81 86 170 137 -38
7445 -38 -141 -276 151 236 68 -50 -220 46 -82 -47 498 53 -308 -179 -20 -445 -80 128 12 -192 -65
7466 -65 28 -178 -256 209 -246 233 121 -148 -7 65 -103 -38 -213 -209 102 123 130 -170 -189 -340 -232 33 278 -251
7490 -251 78 -2 -298 71 -107 -156 220 35 187 480 -238 320 -329 112 130 190 222 -4 205 -251 -346 -33
7512 -33 298 116 90 57 -115 -315 -36 -125 -13 5 191 -81 144 271 116 -29 -208 173 16 56 227 -310
7534 -310 -115 -363 104 89 446 20 -97 -183 -162 143 -7 -55 -189 199 -42 324 -59 139 -82 -139 -140 -18
$$ packed form
7380B40l67p3l0P5L89j32K27l04l88L07L82k67J60P4j38l16L33k17J83k19K82
7401B01k21K58l74n6OJ73J25n52M57k08K45j68N02o35J25L35k77L29r6m52L36
7422E3Kl5j29J52p8k21L77O0k08N0j50k47K42J16K79l47J25K29l51J67Q4l3j75
7445c8j03j35M27Q5j68j18j70K66j28L5N45m45l61J29J59m25L65K08j16k04J27
7466f5R3k06p8M65m55M79j12k69J41P2j68O5j75ML11K1Pl00j9j51J08K65K45n29
7490b51L29q0k96L69j78m9L76j85J52K93p18N58o49M41J8O0L2k26K09m56r5L13
7512c3L31j82k6l3j72k00K79q9J12J8J86k72K25J27j55j45j79L81j57M0J71n37
7534c10J95k48M67j5L57m26j17q6K1L05j50m8j34L88k41L66l83J98k21n7jJ22
$$ plain form
7556 -18 -357 77 131 189 115 25 382 43 -22 -251 -157 -86 0 -305 417 -60 -310 216 184 68 -97 -57 -164 -193
7580 -193 -59 -345 206 301 -42 183 -244 -67 -111 286 -86 -284 -38 -21 -31 -88 81 -16 -8 -33 48 287 -42
7603 -42 -181 -220 -2 -68 57 292 110 -316 -138 -147 -27 274 -33 -235 -160 145 120 62 -89 -246 21 40 23
7626 23 -40 -43 -18 126 -143 -45 -179 180 -4 61 1 -415 31 170 -222 -97 -98 -44 -43 266 358 61 -388 -213 -114
7651 -114 -40 510 -136 157 -204 -59 -6 -209 -118 120 -219 -15 16 -39 272 -215 -216 -316 -35 -117 204 42 -97
7674 -97 -215 -40 -166 120 -46 -4 240 -138 107 -205 188 -226 -178 35 -132 273 -21 -56 -317 -210 -208 -59
7696 -59 -27 142 145 48 27 44 100 -246 -28 35 -168 195 597 -98 -218 -182 -75 -176 383 338 107 93 -68 -182
7720 -182 -111 134 -93 143 -308 -79 -266 -48 153 12 -162 -118 429 93 -55 -64 -311 -207 -162 231 207 -50
$$ packed form
7556a8l39M34N4N8p4r0L57l39o5k29R4P1Q6l05P22m77k50N26l2j16j65M0j07k9
7580a93J34k86N51R5l43K25m27J77m4L97l72j98K46J7j0n7J69r7Qk5Q1K39l29
7603d2j39l9K18o6J25K35j82m26J78rJ20L01l07k02P5L05k5n8j51j57K67J9j7
7626B3o3lK5J44k69R8j34L59j84O5o0m16M46J39l92J25jN4JL09R2k97m49J75R9
7651a14P4N50o46K93l61J45N3k03R1K38l39K04L1n5L11m87jj00K81q2L21j62j39
7674i7j18J75j26K86j66M2K44l78K45l12L93m14M8K13j67M05k94l5k61J07KJ49
7696e9L2J69Lr7k1J7N6l46K18O3k03L63M02o95j20L6J07j01N59m5k31j4j61j14
7720a82P1K45k27K36m51K29j87K18K01j41j74M4N47l36j48rk47J04M5L93k4k57
$$ plain form
7742 -50 -176 -159 -122 -28 26 125 187 -207 60 -319 167 -338 -213 -503 -40 165 217 -22 -70 -117 -375 -185 161
7765 161 314 156 398 3 -147 -86 -88 16 -227 -68 -384 177 52 216 55 -216 -31 -275 52 231 93
7786 93 177 -379 -201 81 -9 207 92 158 -43 -145 -289 200 270 -133 -166 0 -126 -35 145 136 -249 -195 -83
7809 -83 -169 -156 132 -79 -399 -278 -237 267 -80 249 -95 215 8 -169 -75 -92 -271 20 -44 206 -2 256
7831 256 -27 31 105 93 156 283 -195 -171 -31 39 -31 -124 281 191 94 106 -270 -182 223 102 0 -54 261 -83
7855 -83 -76 15 -147 -186 -11 135 142 148 197 190 -165 91 -196 229 -2 137 200 -47 -20 -29 -5 -55 -469 69 165 105 425
7882 425 -100 -33 0 151 -58 -106 26 208 -236 214 -8 83 257 44 -85 -189 3 317 -160 -239 128 -66
7904 -66 109 45 231 -134 -251 -141 -177 6 425 101 98 228 -11 -297 275 -75 -95 -313 -26 -53 307 168
$$ packed form
7742e0j26J7L7R4N4R9O2l94K67l79M86n05J25k90M63K05N2k39m8m7k58J90L46
7765A61J53j58K42l95j50O1kJ04k43J59l16N61j25J64j61k71J85k44L27J79j38
7786I3Q4n56J78K82r0K16j15O6k01j02j44M89P0m03l3J66j26R1J80rl85N4J12
7809h3q6J3K88k11l20J21M1N04l47L29l44L10k07j77R4j7j79K91o4K50k08K58
7831B56k83N8P4j2O3J27m78K4J40P0p0r3M05r0r7J2l76Q8M05j21j02n4L15l44
7855h3PR1j62l9J75J46POM9pl55K56k87M25k31J39O3k47K7rK4n0m14N38R6o0L20
7882D25n25O7L3J51k09m8J32J82m44M50k22R1J74k13j29j04J92L14m77p9L67j94
7904f6J75o4J86l65j17J10l6J83M19l24lJ30k39k86N72l50k0k18K87k7L60j39
$$ plain form
7926 168 -102 -243 -312 -142 45 189 -257 -140 -174 -149 -160 -50 29 -96 -132 158 -105 -55 -41 45 8 5 366 198
7950 198 312 -30 289 -165 -133 112 -177 60 67 -312 24 78 148 -8 -296 -202 13 144 99 10 198 32 -31
7973 -31 52 120 53 -125 -21 -48 -154 -272 540 51 -77 -229 -95 -121 116 -220 -135 -64 -96 66 -114 -28 -47 -229
7997 -229 -96 -50 34 -2 -14 208 -277 -8 29 120 -338 105 -8 -39 -287 -50 189 30 -415 -490 -160 -377 -139
8020 -139 -107 -214 -28 -120 176 -32 -68 -12 41 -46 132 211 -282 181 6 -118 -49 -15 -19 28 -135 -168 70 -220
8044 -220 -9 -115 79 -233 49 -163 184 178 196 -4 -356 69 -64 -61 315 460 -69 27 40 326 -232 -43
8066 -43 -40 -268 70 125 -146 173 -53 75 -253 36 73 -108 109 -81 41 -65 -84 -10 -14 57 3 152 252 -35
8090 -35 -102 -76 -134 177 447 218 132 -9 -66 -220 83 133 162 -95 -176 -59 -66 101 -305 10 106 144 -102 106
$$ packed form
7926A68k70j41o9J70J87J44m46J17l4K5j1J10P9j25l6K90k63N0J4Q6l7lL61j68
7950A98J14l42L19m54L2K45k89K37Pl79L36N4P0j56k88R4K15J31m5q9J88j66o3
7973c1Q3O8o7j78J04k7j06j18Q12m89j28j52J34k6K37l36Q5P1l2J62j80Q6j9j82
7997b29J33M6Q4l6j2K22m85K69L7R1m58M43j13l1k48K37K39j59m45p5L30k17K38
8020a39L2j07J86r2K96k08l6N6N3q7J78P9m93M63j75j24O9L4mM7j63l3K38k90
8044b20K11j06J94l12K82k12L47oJ8k00l52M25j33LL76J45n29R6J3K86n58J89
8066d3Lk28L38N5k71L19k26J28l28K89L7j81K17j90J22j06j9P4mP1n4J49J00k87
8090c5o7K6n8L11K70k29q6j41n7j54L03N0K9k57q1J17pJ67m06L15R6L8k46K08
$$ plain form
8114 106 506 -66 24 -31 -183 -63 -235 207 153 199 -217 -263 68 -278 58 274 11 161 -83 -256 359 244
8136 244 79 -30 -34 125 118 182 -210 -261 -221 407 104 451 -4 -269 -221 20 17 -107 196 391 -66 -24 -111 -168
8160 -168 162 50 106 -325 -48 -46 243 -74 -390 -268 -194 44 -98 232 198 46 -12 57 -180 -205 94 -10 -9
8183 -9 291 167 306 -68 -141 -420 -149 67
$$ packed form
8114A06M00n72R0n5j52J20j72M42n4M6m16m6L31l46L36K16k63J50k44j73O15j15
8136B44j65j09mJ59pO4l92n1M0O28l03L47m55k65M8K41lj24L03J95m57M2q7n7
8160a68L30j12N6m31K77KK89l17l16J22P4K38j42L30l4j52n8O9k37k5K99j04J
8183iL00j24J39l74p3k79K71K16
8191F7
$$ Imaginary data points
##PAGE= N=2
##DATA TABLE= (X++(I..I)), XYDATA
$$ plain form
0 0 0 0 0 8 -8 8 -8 16 -17 24 -32 40 -56 64 -80 96 -113 137 -161 193 -223 257 -303 346 -400 457 -521
27 -521 593 -672 758 -858 960 -1078 1206 -1345 1501 -1667 1853 -2059 2277 -2525 2796 -3095
43 -3095 3427 -3796 4211 -4679 5210 -5824 6532 -7370 8373 -9603 11156 -13178 15939
56 15939 -19969 26399 -38362 68251 -300992 -316825 430703 476747 226374 -14694 48
67 48 -128663 -296671 -275871 37245 212426 142572 56318 178715 192204 -113380 -468529
78 -468529 -377673 60082 359181 276230 95659 27319 -30840 -205421 -300804 -146072 117761
89 117761 220157 169401 119758 72784 -88992 -269553 -245394 -15577 152232 129786 77789
100 77789 128078 138144 -40842 -271820 -303600 -118211 103963 252798 317941 225920 -79250
$$ packed form
0@%%%Qj6J6j6K4l3M1n6P2r6J20j44J76k09K50k98L54m16M80n60O49p46Q57r78
27e21J114j265J430j616J818k038K284k551K846l168L520l912M336m802N321n891
43c095O522p223Q007q890R889j1034J2356j3902J5743j7976K0759k4334K9117
56A5939l5908M6368o4761J06613l69243j5833P47528M6044k50373k41068J4742
67D8j28711j68008K0800L13116J75181o9854q6254J22397J3489l05584l55149
78d68529R0856M37755K99099q2951j80571o8340n8159j74581r5383J54732K63833
89A17761J02396n0756m9643m6974j61776j80561K4159K29817J67809k2446n1997
100G7789N0289J0066j78986k30978l1780J85389K22174J48835O5143r2021l05170
$$ plain form
111 -79250 -397207 -396765 -57037 250137 246248 77975 24333 66767 -150 -176224 -243257 -119853
123 -119853 45207 142859 216975 253969 105158 -223653 -430324 -265027 105700 305674
133 305674 222943 70748 5652 -50013 -164347 -218732 -102698 82810 164686 135594 99156
144 99156 61277 -51313 -195489 -219688 -78789 91096 163014 156094 126405 44243 -115807
155 -115807 -252833 -223495 -29292 172971 246755 176107 24293 -128472 -199360 -143826 -17901
166 -17901 67227 76076 75948 106912 103951 -2768 -157787 -227294 -147426 26107 191064 259217
178 259217 174336 -39249 -238231 -259954 -96197 88523 152036 115628 74692 44709 -20846
189 -20846 -112432 -151505 -101491 -7469 80262 151217 173708 91510 -82846 -223135 -208274 -59171
$$ packed form
111g9250l17957M42L39728L07174l889j68273n3642M2434o6917j76074o7033J23404
123a19853J65060R7652P4116L6994j48811l28811k06671J65297L70727J99974
133C05674q2731j52195o5096n5665j14334n4385J16034J85508Q1876k9092l6438
144I9156l7879j12590j44176k4199J40899J69885P1918o920k9689q2162j60050
155a15807j37026K9338J94203K02263P3784p0648j51814j52765p0888N5534J25925
166a7901Q5128Q849j28L0964k961j06719j55019o9507P9868J73533J64957O8153
178B59217q4881k13585j98982k1723J63757J84720O3513l6408m0936k9983o5555
189b0846r1586l9073N0014R4022Q7731P0955K2491q2198j74356j40289J4861J49103
$$ plain form
201 -59171 96932 172966 170647 103774 -24142 -162927 -208884 -114190 41976 138343 139351 88761
213 88761 25407 -47255 -111281 -124868 -76871 -317 71076 128105 147855 83772 -64036 -198875
225 -198875 -203759 -66855 105912 194924 160644 46732 -75578 -142986 -123889 -43753 31177
236 31177 62219 66795 76813 75074 19866 -81930 -156800 -135765 -25191 105697 179496 153462
248 153462 36299 -108648 -189132 -149672 -24190 96704 144269 116038 46427 -33523 -98158
259 -98158 -118133 -80609 -7756 60083 99168 105813 71617 -7718 -105161 -156802 -115599 100
271 100 118484 169499 126547 11666 -113502 -173094 -125337 -2990 105191 131508 82279
282 82279 14081 -34389 -63127 -79029 -73156 -32752 32623 94243 119585 84145 -10059 -118707
$$ packed form
201e9171J56103P6034k319o6873j27916j38785m5957R4694J56166R6367J008n0590
213H8761o3354p2662o4026j3587M7997P6554P1393N7029J9750o4083j47808j34839
225a98875m884J36904J72767Q9012l4280j13912j22310o7408J9097Q0136P4930
236C1177L1042M576J0018j739n5208j01796p4870K1035J10574J30888P3799k6034
248A53462j17163j44947q0484L9460J25482J20894M7565k8231o9611p9950o4635
259i8158j9975L7524P2853O7839L9085O645l4196p9335r7443n1641M1203J15699
271A00J18384N1015m2952j14881j25168n9592M7757J22347J08181K6317m9229
282H2279o8198m8470k8738j5902N873M0404O5375O1620K5342l5440r4204j08648
$$ plain form
294 -118707 -167112 -106697 28584 142899 159176 79719 -29548 -105998 -120067 -76667 -2663
305 -2663 62102 87689 73628 39741 -798 -48045 -92309 -101190 -48711 45785 122570 131574 65273
318 65273 -40456 -128702 -146881 -77686 40231 130540 135617 62886 -31239 -90822 -97269 -62607
330 -62607 -9248 39990 70166 74829 55385 13609 -46778 -101971 -111491 -49887 55321 135113
342 135113 133710 49946 -61831 -135026 -128307 -47044 55297 114238 101250 39311 -25026 -61075
354 -61075 -70069 -59384 -31162 14962 63417 89598 74594 17403 -61409 -118945 -111331 -31047
366 -31047 75575 136579 112528 22761 -71898 -118199 -97128 -27314 48250 88234 77095 35089
378 35089 -8204 -38530 -58784 -67367 -49156 3270 68167 105386 83641 9425 -78074 -126432
$$ packed form
294a18707m8405O0415J35281J14315J6277p9457j09267p6450j4069M3400P4004
305b663O4765K5587j4061l3887m0539m7247m4264q881N2479R4496P6785R004o6301
318F5273j05729q8246j8179O9195J17917R0309N077p2731r4125n9583o447L4662
330f2607N3359M9238L0176M663j9444m1776o0387n5193r520O1604J05208P9792
342A35113j403q3764j11777p3195O719Q1263J02341N8941j2988o1939o4337l6049
354f1075q994J0685K8222M6124M8455K6181j5004n7191p8812n7536P614Q0284
366c1047J06622O1004k4051q9767r4659m6301K1071O9814P5564L9984j1139m2006
378C5089m3293l0326k0254q583J8211N2426O4897L7219k1745p4216q7499m8358
$$ plain form
390 -126432 -101640 -11687 87541 130083 90556 3331 -72750 -96967 -69985 -17812 30867 59392
402 59392 62800 46229 15633 -24417 -65172 -85138 -60618 8281 84152 116401 77897 -9457
414 -9457 -92760 -121623 -78654 8517 86478 108161 66200 -3799 -57490 -72985 -56146 -23779
426 -23779 11398 43524 63239 59714 28531 -24451 -75991 -94988 -59485 20292 96385 116006
438 116006 63011 -27773 -98035 -106122 -54128 21569 76303 83288 46850 -2706 -38748 -51646
450 -51646 -48952 -35360 -8195 32697 71335 77664 37239 -33636 -93322 -101368 -47073 39218 103876
463 103876 105139 42745 -41146 -92787 -86070 -34655 23426 58008 61405 41936 12756 -18947
475 -18947 -47073 -61780 -52104 -11485 46088 87384 81258 23931 -53763 -102782 -90317 -23101
$$ packed form
390a26432K4792Q9953R9228M2542l9527q7225p6081k4217K6982N2173M8679K8525
402E9392L408j6571l0596m0050m0755j9966K4520O8899P5871L2249l8504q7354
414i457q3303k8863M2969Q7171P7961K1683m1961o9999n3691j5495J6839L2367
426b3779L5177L2126J9715l525l1183n2982n1540j8997L5503P9777P6093J9621
438A16006n2995r0784p0262q087N1994P5697N4734O985l6438m9556l6042j2898
450e1646K694J3592K7165M0892L8638O329m0425p0875n9686q046N4295Q6291O4658
463A03876J263o2394q3891n1641O717N1415N8081L4582L397j9469k9180l1703
475a8947k8126j4707R676M0619N7573M1296o126n7327p7694m9019J2465O7216
$$ plain form
487 -23101 56370 98776 80422 18803 -44996 -73967 -60384 -23101 13332 37434 47683 44101
499 44101 25101 -8132 -44786 -67522 -59149 -13796 50308 93690 81585 14871 -62892 -100251
511 -100251 -75759 -10086 54690 82760 65034 15869 -32936 -56438 -50466 -28308 -4193 20371
523 20371 46812 62031 45460 -4831 -63248 -90076 -63359 3989 73287 101260 68082 -7437
535 -7437 -76318 -94410 -54831 9404 56076 65084 43113 9727 -19991 -38881 -45002 -37548 -14764
548 -14764 20328 55132 66958 40714 -15133 -68118 -83563 -49493 15312 72140 84716 47350
560 47350 -15310 -61935 -67627 -38756 2266 33463 46044 40382 22069 -2299 -26537 -46402
572 -46402 -52192 -31568 16060 66274 82405 45389 -23679 -80458 -87958 -43528 25911 77529
$$ packed form
487b3101P9471M2406j8354o1619o3799k8971J3583L7283L6433K4102J0249l582
499D4101j9000l3233l6654k2736Q373M5353O4104M3382j2105o6714p7763l7359
511a00251K4492O5673O4776K8070j7726m9165m8805k3502N972K2158K4115K4564
523B0371K6441J5219j6571n0291n8417k6828K6717O7348O9298K7973l3178p5519
535g437o8881j8092L9579O4235M6672R008k1971l3386k9718j8890o121P454K2784
548a4764L5092L4804J1826k6244n5847n2985j5445L4070O4805N6828J2576l7366
560D7350o2660m6625n692K8871M1022L1197J2581n662j8313k4368k4238j9865
572d6402n790K0624M7628N0214J6131l7016o9068n6779p500M4430O9439N1618
$$ plain form
584 77529 80924 35587 -24013 -58170 -54402 -28659 -2129 19000 36023 45224 36218 6631 -31834
597 -31834 -61663 -63029 -26507 35504 82511 78526 22722 -45415 -80265 -66219 -19334 32085
609 32085 62753 58196 22782 -18102 -39573 -39005 -28741 -15352 7107 36887 54681 41294 2921
622 2921 -39192 -63469 -58526 -19106 39885 81197 69831 11544 -49281 -71784 -50862 -10245
634 -10245 27140 48803 45377 19344 -10229 -24689 -27644 -31099 -31256 -8931 36005 68770 55863
647 55863 3830 -50514 -75028 -58280 -9320 49382 80343 58725 -562 -49801 -57568 -34772
659 -34772 -8355 11480 29687 42715 36312 9924 -21780 -44222 -50188 -34833 5176 54475
671 54475 76495 47487 -14581 -64478 -72382 -40201 9452 52212 66576 41943 -6112 -44030
$$ packed form
584G7529L395m5337n9600l4157L768K5743K6530K1129J7023R201r006k9587l8465
597c1834k9829j366L6522O2011M7007l985n5804o8137l4850J4046M6885N1419
609C2085L0668m557l5414m0884k1471N68J0264J3389K2459K9780J7794j3387l8373
622B921m2113k4277M943L9420N8991M1312j1366n8287o0825k2503K0922M0617
634a0245L7385K1663l426k6033k9573j4460k955l455j57K2325M4936L2765j2907
647E5863n2033n4344k4514J6748M8960N8702L0961k1618n9287m9239p767K2796
659c4772K6417J9835J8207J3028o403k6388l1704k2442n966J5355M0009M9299
671E4475K2020k9008o2068m9897p904L2181M9653M2760J4364k4633m8055l7918
$$ plain form
683 -44030 -48701 -28556 -5082 11637 24880 33801 30279 12607 -14543 -40115 -51743 -35932 8267
696 8267 55970 70431 37632 -18865 -59137 -60494 -29827 13139 43712 47275 24221 -3572 -18606
709 -18606 -21722 -25500 -28742 -16489 16713 50002 54780 24705 -21933 -59085 -65546 -33558 23235
722 23235 69056 68961 24952 -28437 -56422 -50961 -24048 9260 35944 44790 30883 4878 -18406
735 -18406 -31344 -36159 -29069 -5259 29250 52949 46618 12376 -30596 -58517 -55732 -18558 33777
748 33777 64775 51887 7782 -31682 -44470 -32974 -12123 8536 22620 26167 20330 12631 2977
761 2977 -16281 -41219 -47995 -16904 34849 65932 51190 5173 -38747 -57963 -46798 -10425
773 -10425 33398 55038 40035 3961 -21943 -26516 -24660 -23264 -13176 12450 37601 42272 22283
$$ packed form
683d4030m671K0145K3474J6719J3243Q921l522j7672k7150k5572j1628J5811M4199
696H267M7703J4461l2799n6497m0272j357L0667M2966L0573L563k3054k7793j5034
709a8606l116l778l242J2253L3202L3289M778l0075m6638l7152o461L1988N6793
722B3235M5821r5m4009n3389k7985N461K6913L3308K6684Q846j3907k6005k3284
735a8406j2938m815P090K3810L4509K3699o331l4242m2972k7921K785L7174N2335
748C3777L0998j2888m4105l9464j2788J1496K0851K0659J4084L547n837p699r654
761B977j9258k4938o776L1091N1753L1083j4742m6017m3920j9216J1165L6373
773a0425M3823K1640j5003l6074k5904m573J856J396J0088K5626K5151M671j9989
$$ plain form
786 22283 -8043 -34704 -49555 -41296 -3870 43567 64825 42395 -5497 -43358 -52977 -35541
798 -35541 -2783 30233 45769 33133 4199 -17782 -23818 -21975 -21091 -14299 6855 32558 43853
811 43853 29009 -4288 -38882 -55530 -40156 4250 49951 61911 31781 -14772 -42938 -40969
823 -40969 -21030 1452 19116 27225 24515 13667 611 -12417 -27619 -36589 -24600 10946 46745
836 46745 52994 24025 -18067 -46916 -49610 -26175 11873 44070 49348 23544 -12048 -33262 -32321
849 -32321 -19558 -5040 10070 23595 28774 21111 4090 -16071 -33222 -38799 -22651 13760 47931
862 47931 53418 22929 -22483 -51124 -47612 -17387 18938 42107 38266 14127 -11297 -23527 -21581
875 -21581 -16732 -11358 -1126 17593 33825 32764 10255 -21627 -44887 -43573 -14880 25492 52248
$$ packed form
786B2283l0326k6661j4851Q259L7426M7437K1258k2430m7892l7861r619J7436
798c5541L2758L3016J5536j2636k8934k1981o036J843Q84O792K1154K5703J1295
811D3853j4844l3297l4594j6648J5374M4406M5701J1960l0130m6553k8166J969
823d0969J9939K2482J7664Q109k710j0848j3056j3028j5202q970J1989L5546L5799
836D6745O249k8969m2092k8849k694K3435L8048L2197N278k5804l5592k1214R41
849c2321J2763J4518J5110J3525N179p663j7021k0161j7151n577J6148L6411L4171
862D7931N487l0489m5412k8641L512L0225L6325K3169l841k4139k5424j2230J946
875b1581M849N374J0232J8719J6232j061k2509l1882k3260J314K8693M0372K6756
$$ plain form
888 52248 45083 9901 -28180 -43944 -33546 -9188 14853 28368 28118 16060 -248 -12892 -20872
901 -20872 -24463 -20355 -3430 21510 40642 35765 7520 -27615 -47790 -40509 -9145 29169 49696
914 49696 39375 4932 -28340 -39423 -26876 -5141 11554 19487 21004 17334 8320 -5571 -20776
927 -20776 -30711 -26752 -4147 27624 47068 36209 580 -35611 -48074 -31310 1859 30751
939 30751 39918 26305 664 -20042 -26140 -19539 -9688 14 10745 22466 27136 17203 -5571
952 -5571 -29086 -38910 -27018 2500 34490 48032 31507 -5812 -38626 -45069 -24878 6483 28886
965 28886 32545 20606 1397 -13921 -20057 -18918 -13681 -5617 8212 24970 32650 20508 -8328
978 -8328 -35762 -42423 -22712 11138 39286 43133 20794 -13314 -35599 -33815 -14050 7698 19655
$$ packed form
888E2248p165l5182l8081j5764J0398K4358K4041J3515k50j2058j6308j2644p980
901b0872l591M108J6925K4940J9132m877k8245l5135k0175P281L1364L8314K0527
914D9696j0321l4443l3272j1083J2547K1735J6695P933J517l670r014j3891j5205
927b0776r935L959K2605L1771J9444j0859l5629l6191j2463J6764L3169K8892
939C0751R167j3613k5641k0706o098O601R851R702J0731J1721M670r933k2774
952e571k3515r824J1892K9518L1990J3542j6525l7319l2814o443K0191L1361K2403
965B8886L659j1939j9209j5318o136J139N237Q064J3829J6758P680j2142k8836
978h328k7434o661J9711L3850K8148L847k2339l4108k2285J784J9765K1748J1957
$$ plain form
991 19655 21124 15791 7572 -2807 -13850 -22346 -23136 -11392 10836 32300 37344 18067 -15234
1004 -15234 -40377 -40730 -16102 16780 38198 36314 13836 -13846 -29543 -26642 -11938 3117 12500
1017 12500 17047 18353 14518 2510 -15268 -29199 -28738 -10699 17523 38854 37856 11840 -22781
1030 -22781 -42538 -34942 -6577 21602 33923 26015 7079 -11314 -20080 -18604 -11577 -3723 4474
1043 4474 14930 23084 21811 4491 -20119 -35652 -30187 -5241 23872 39957 32236 4323 -25772
1056 -25772 -38551 -26496 -1424 19090 25500 19282 6913 -4406 -12505 -17029 -17042 -10771 2317
1069 2317 18722 30122 24781 1582 -26588 -39815 -28249 1433 29907 38679 24430 -3004
1081 -3004 -26013 -30906 -18417 893 13449 17119 14444 10574 3674 -7400 -19385 -24329 -15836
$$ packed form
991A9655J469n333q219j0379j1043q496p90J1744K2228K1464N044j9277l3301
1004a5234k5143l53K4628L2882K1418j884k2478k7682j5697K901J4704J5055R383
1017A2500M547J306l835j2008j7778j3931M61J8039K8222K1331r98k6016l4621
1030b2781j9757P596K8365K8179J2321p908j8936j8393q766J476P027P854Q197
1043D474J0456Q154j273j7320k4610j5533N465K4946K9113J6085p721k7913l0095
1056b5772j2779J2055K5072K0514O410o218j2369j1319q099m524j3O271J3088
1069B317J6405J1400n341k3199k8170j3227J1566K9682K8474Q772j4249k7434
1081c004k3009m893J2489J9310J2556L670k675l870o900j1074j1985m944Q493
$$ plain form
1094 -15836 3878 25191 34651 22770 -4879 -31840 -39046 -21034 8396 30512 32400 16247
1106 16247 -5410 -20338 -22500 -14320 -2730 6418 12310 16175 16178 8025 -7632 -24145 -28867 -16316
1120 -16316 8139 31176 35782 18113 -11762 -33916 -34051 -13241 12329 26756 24828 11401 -4567
1133 -4567 -13857 -16295 -12842 -7821 -428 9702 20831 23566 10927 -11852 -30745 -31641 -12365 15923
1147 15923 34339 32392 10821 -16431 -31360 -26472 -6666 11814 19682 16280 9308 1572 -5607
1160 -5607 -12860 -17067 -14704 -3474 12639 25791 25667 8625 -16364 -33726 -29685 -6469 19804
1173 19804 32660 25522 4854 -15987 -25196 -19358 -6021 6641 12602 13821 11921 7782 -1522
1186 -1522 -13484 -22658 -19795 -4242 17861 32153 26967 3843 -23053 -35596 -25145 -94 22409
$$ packed form
1094a5836J9714K1313R460j1881k7649k6961p206J8012K9430K2116J888j6153
1106A6247k1657j4928k162Q180J1590R148N892L865Lq153j5657j6513m722J2551
1120a6316K4455K3037M606j7669k9875k2154j35K0810K5570J4427j928j3427j5968
1133d567r290k438L453N021P393J0130J1129K735j2639k2779j8893q96J9276K8288
1147A5923J8416j947k1571k7252j4929M888J9806J8480P868l402o972p736p179
1160e607p253m207K363J1230J6113J3152j24j7042k4989j7362M041K3216K6273
1173A9804J2856p138k0668k0841r209N838J3337J2662N961J219j900m139r304
1186a522j1962r174K863J5553K2103J4292n186k3124k6896j2543J0451K5051K2503
$$ plain form
1199 22409 29513 18939 358 -14762 -18764 -13667 -5709 865 7291 13327 17160 13114 -1121 -19024
1213 -19024 -28689 -20053 2150 24369 32153 20342 -4091 -25205 -29677 -16319 4833 19305 20403
1226 20403 12079 1240 -6626 -10845 -13042 -11761 -5208 5603 17295 21839 14791 -3250 -22418
1239 -22418 -30269 -19124 5350 26881 31332 16014 -7419 -24210 -25501 -12575 4630 15414
1251 15414 16462 10530 3400 -2304 -7688 -14534 -17221 -10279 6802 23784 27466 13530 -10550 -29446
1265 -29446 -30258 -11877 13816 29232 24747 6401 -11827 -19093 -15334 -7031 1025 7285 11175 12855
1279 12855 10552 2298 -10437 -20517 -21040 -7057 13176 27223 24410 7438 -14804 -27514 -23911
1292 -23911 -6485 13817 23270 19444 5284 -7868 -14385 -13120 -8414 -1703 4275 9940 13949 13849
$$ packed form
1199B2409P104j0574j8581j5120m002N097P958O574O426O036L833m046j4235j7903
1213a9024r665Q636K2203K2219P784j1811k4433k1114m472J3358K1152J4472J098
1226B0403q324j0839p866m219k197J281O553J0811J1692M544p048j8041j9168
1239b2418p851J1145K4474K1531M451j5318k3433j6791j291J2926J7205J0784
1251A5414J048n932p130n704n384o846k687O942J7081J6982L682j3936k4080j8896
1265b9446q12J8381K5693J5416m485j8346j8228p266L759Q303Q056O260L890J680
1279A2855k303q254j2735j0080n23J3983K0233J4047k813j6972k2242j2710L603
1292b3911J7426K0302R453l826j4160j3152o517J265M706O711N978N665M009j00
$$ plain form
1306 13849 5093 -10951 -24554 -24052 -6022 17380 30317 23904 3087 -18978 -27969 -19878 -324
1319 -324 16027 19273 10680 1588 -2367 -4544 -9941 -14654 -11053 1333 15647 22475 17555 1029
1333 1029 -18818 -29297 -21292 2541 24175 27596 14211 -3440 -15701 -19318 -14502 -2138 9653
1346 9653 14548 11350 5635 888 -4396 -12928 -17294 -10829 4341 17952 21540 14608 -767 -18705
1360 -18705 -28154 -19255 4656 24947 25068 9900 -6519 -14266 -14343 -9909 -2022 5702 9003 8362 8915
1375 8915 8837 188 -16702 -26726 -15977 8569 27199 26051 10106 -9268 -23158 -24760 -11265
1388 -11265 9808 22796 17132 3417 -4618 -5975 -7909 -12467 -10619 648 12789 16313 12803
1401 12803 5021 -6460 -20500 -24576 -10357 13657 27050 20689 3801 -10744 -18660 -19438 -9303
$$ packed form
1306A3849q756j6044j3603N02J8030K3402J2937o413k0817k2065q991Q091J9554
1319c24J6351L246q593r092l955k177n397m713L601J2386J4314O828m920j6526
1333A029j9847j0479Q005K3833K1634L421j3385j7651j2261l617M816J2364J1791
1346I653M895l198n715m747n284q532m366O465J5170J3611L588o932j5375j7938
1360a8705r449Q899K3911K0291J21j5168j6419p747p7M434P887P724L301o41N53
1375H915p8q649j6890j0024J0749K4546J8630j148j5945j9374j3890j602J3495
1388a1265K1073J2988n664j3715q035j357j934m558J848J1267J2141L524l510
1401A2803p782j1481j4040m076J4219K4014J3393o361j6888j4545p916p78J0135
$$ plain form
1414 -9303 7866 19121 15026 2393 -3671 -3076 -4996 -11826 -13756 -3536 11663 19393 16714 6368
1428 6368 -9294 -24416 -26057 -7573 18565 29495 18283 -2319 -14712 -15311 -11295 -4805 3659
1441 3659 10461 10965 6880 3894 1115 -8122 -18343 -18116 -1703 17788 24997 15663 -1452 -15875
1455 -15875 -22710 -17794 -839 16903 21941 12212 -1474 -9324 -10949 -10082 -6590 661 7651 11028
1469 11028 9993 7283 946 -11270 -21331 -16998 860 19419 24202 14122 -2292 -16730 -22984
1482 -22984 -15613 2526 18354 18569 6233 -4277 -5218 -4395 -7534 -11013 -5732 5770 14084 15505
1496 15505 9798 -1406 -16323 -25093 -15894 6891 24884 23196 6725 -9275 -16274 -15165 -8186
1509 -8186 2102 10724 12587 7518 1920 -1154 -5149 -11184 -13844 -6531 7369 17747 18025 8126
$$ packed form
1414i303J7169J1255m095j2633o064N95j920o830j930J0220J5199P730k679j0346
1428F368j5662j5122j641J8484K6138J0930j1212k0602j2393n99M016O490Q464
1441C659O802N04m085k986k779r237j0221K27J6413J9491P209r334j7115j4423
1455a5875o835M916J6955J7742N038r729j3686p850j625Q67L492P251O990L377
1469A1028j035k710o337j2216j0061M333J7858J8559M783j0080j6414j4438o254
1482b2984P371J8139J5828K15j2336j0510r41Q23l139l479N281J1502Q314J421
1496A5505n707j1204j4917q770R199K2785J7993j688j6471j6000o999J109O979
1509h186J0288Q622J863n069n598l074l995o035k660P313J3900J0378K78r899
$$ [...]
8191d9
##END NTUPLES=NMR FID
##END=
