##TITLE=1H_LR-790-A-K1
 D2O
 8 sc, 
 30.10.2024
##JCAMPDX= 6.0         $$ Bruker NMR JCAMP-DX V2.0
##DATA TYPE= NMR FID
##DATA CLASS= NTUPLES
##ORIGIN= UXNMR, Bruker Analytische Messtechnik GmbH
##OWNER= root
$$ XWIN-NMR		Version 3.5
$$ Wed Oct 30 13:49:12 2024 Russian Standard Time (UT+4h)  she@DPX200
##.OBSERVE FREQUENCY= 200.1318
##.OBSERVE NUCLEUS= ^1H
##.DELAY= (6, 6)
##.ACQUISITION MODE= SIMULTANEOUS
##.ACQUISITION SCHEME= undefined
##.AVERAGES= 8
##.DIGITISER RES= 18
##SPECTROMETER/DATA SYSTEM= spect
##.PULSE SEQUENCE= zg30
##.SOLVENT NAME= CDCl3
##.SHIFT REFERENCE= (INTERNAL, CDCl3, 0, 15.7039)
##AUDIT TRAIL= $$ (NUMBER, WHEN, WHO, WHERE, WHAT)
$$ ##TITLE= Audit trail, XWIN-NMR		Version 3.5
$$ ##JCAMPDX= 5.01
$$ ##ORIGIN= Bruker BioSpin GmbH
$$ ##OWNER= she
$$ F:/spectra/data/she/nmr/H-F/1/audita.txt
$$ ##AUDIT TRAIL=  $$ (NUMBER, WHEN, WHO, WHERE, WHAT)
(   1,<2024-10-30 13:48:03.89 +0400>,<she>,<DPX200>,
      <created by zg, POWCHK disabled, PULCHK disabled
       configuration hash MD5:
       00 E9 B6 7A A2 85 ED C7 34 08 36 98 17 FE 4E 26
       data hash MD5: 16K
       BE 25 AE 55 77 C3 4C E6 0C B1 BA 8C 6D CC 72 F8>)
$$ ##END=
$$ 
$$ hash MD5
$$ 37 9D 25 A2 6C 7A 0E CD 35 93 BD 10 3A 9E DE 07
##$RELAX= 
##$RELAX= 
##$RELAX= 
##$RELAX= 
##$RELAX= 
##$RELAX= 
$$ Bruker specific parameters
$$ --------------------------
##$DU= <F:/spectra>
##$EXPNO= 1
##$NAME= <H-F>
##$PROCNO= 1
##$TYPE= <nmr>
##$USER= <she>
##$AMP= (0..31)
100 100 100 100 100 100 100 100 100 100 100 100 100 100 100 100 100 100 
100 100 100 100 100 100 100 100 100 100 100 100 100 100 
##$AQSEQ= 0
##$AQ_mod= 1
##$AUNM= <au_zg>
##$AUTOPOS= <>
##$BF1= 200.13
##$BF2= 200.13
##$BF3= 200.13
##$BF4= 200.13
##$BF5= 200.13
##$BF6= 200.13
##$BF7= 200.13
##$BF8= 200.13
##$BYTORDA= 1
##$CFDGTYP= 0
##$CFRGTYP= 5
##$CHEMSTR= <none>
##$CNST= (0..31)
1 1 145 1 1 1 1 1 1 1 1 1 1 1 1 1 1 1 1 1 1 1 1 1 1 1 1 1 1 1 1 1 
##$CPDPRG= <>
##$CPDPRG1= <>
##$CPDPRG2= <>
##$CPDPRG3= <>
##$CPDPRG4= <mlev>
##$CPDPRG5= <mlev>
##$CPDPRG6= <mlev>
##$CPDPRG7= <mlev>
##$CPDPRG8= <mlev>
##$CPDPRGB= <>
##$CPDPRGT= <>
##$D= (0..31)
0 1.2 0 0 0 0 0 0 0 0.06 0 0.03 0 0 0 0 0.0002 0 0 0 0 0 0 0 0 0 0 0 0 
0 0 0 
##$DATE= 1730281683
##$DBL= (0..7)
120 120 120 120 120 120 120 120 
##$DBP= (0..7)
150 150 150 150 150 150 150 150 
##$DBP07= 0
##$DBPNAM0= <>
##$DBPNAM1= <>
##$DBPNAM2= <>
##$DBPNAM3= <>
##$DBPNAM4= <>
##$DBPNAM5= <>
##$DBPNAM6= <>
##$DBPNAM7= <>
##$DBPOAL= (0..7)
0.5 0.5 0.5 0.5 0.5 0.5 0.5 0.5 
##$DBPOFFS= (0..7)
0 0 0 0 0 0 0 0 
##$DE= 6
##$DECBNUC= <off>
##$DECIM= 24
##$DECNUC= <off>
##$DECSTAT= 4
##$DIGMOD= 1
##$DIGTYP= 9
##$DL= (0..7)
0 120 120 120 120 120 120 120 
##$DP= (0..7)
150 150 150 150 150 150 150 150 
##$DP07= 0
##$DPNAME0= <>
##$DPNAME1= <>
##$DPNAME2= <>
##$DPNAME3= <>
##$DPNAME4= <>
##$DPNAME5= <>
##$DPNAME6= <>
##$DPNAME7= <>
##$DPOAL= (0..7)
0.5 0.5 0.5 0.5 0.5 0.5 0.5 0.5 
##$DPOFFS= (0..7)
0 0 0 0 0 0 0 0 
##$DQDMODE= 0
##$DR= 18
##$DS= 0
##$DSLIST= <SSSSSSSSSSSSSSS>
$$ [...]
##$SUBNAM2= <"">
##$SUBNAM3= <"">
##$SUBNAM4= <"">
##$SUBNAM5= <"">
##$SUBNAM6= <"">
##$SUBNAM7= <"">
##$SUBNAM8= <"">
##$SUBNAM9= <"">
##$SW= 24.0689170037331
##$SWIBOX= (0..15)
0 0 2 0 0 0 0 0 0 0 0 0 0 0 0 0 
##$SW_h= 4816.95568400771
##$TD= 16384
##$TD0= 1
##$TE= 0
##$TE2= 300
##$TE3= 300
##$TEG= 300
##$TL= (0..7)
0 120 120 120 120 120 120 120 
##$TP= (0..7)
150 150 150 150 150 150 150 150 
##$TP07= 0
##$TPNAME0= <>
##$TPNAME1= <>
##$TPNAME2= <>
##$TPNAME3= <>
##$TPNAME4= <>
##$TPNAME5= <>
##$TPNAME6= <>
##$TPNAME7= <>
##$TPOAL= (0..7)
0.5 0.5 0.5 0.5 0.5 0.5 0.5 0.5 
##$TPOFFS= (0..7)
0 0 0 0 0 0 0 0 
##$TUNHIN= 0
##$TUNHOUT= 0
##$TUNXOUT= 0
##$USERA1= <user>
##$USERA2= <user>
##$USERA3= <user>
##$USERA4= <user>
##$USERA5= <user>
##$V9= 5
##$VALIST= <valist>
##$VCLIST= <CCCCCCCCCCCCCCC>
##$VD= 0
##$VDLIST= <DDDDDDDDDDDDDDD>
##$VPLIST= <PPPPPPPPPPPPPPP>
##$VTLIST= <TTTTTTTTTTTTTTT>
##$WBST= 1024
##$WBSW= 4
##$XGAIN= (0..3)
0 0 0 0 
##$XL= 0
##$YL= 0
##$YMAX_a= 180746
##$YMIN_a= -179614
##$ZGOPTNS= <>
##$ZL1= 120
##$ZL2= 120
##$ZL3= 120
##$ZL4= 120
##$ABSF1= 10
##$ABSF2= 0
##$ABSG= 5
##$ABSL= 3
##$ALPHA= 0
##$AQORDER= 0
##$ASSFAC= 0
##$ASSFACI= 0
##$ASSFACX= 0
##$ASSWID= 0
##$AUNMP= <proc_1d>
##$AZFE= 0.1
##$AZFW= 0.1
##$BCFW= 1
##$BC_mod= 2
##$BYTORDP= 1
##$COROFFS= 0
##$CY= 11.3945322036743
##$DATMOD= 1
##$DC= 2
##$DFILT= <>
##$DTYPP= 0
##$F1P= 15.6554695791079
##$F2P= 12.8336369535428
##$FCOR= 0.5
##$FTSIZE= 0
##$FT_mod= 4
##$GAMMA= 1
##$GB= 0.15
##$INTBC= 1
##$INTSCL= 1
##$ISEN= 128
##$LB= 0.24
##$LEV0= 0
##$LPBIN= 0
##$MAXI= 10000
##$MC2= 0
##$MEAN= 0
##$ME_mod= 0
##$MI= 1.114404
##$NCOEF= 0
##$NC_proc= 0
##$NLEV= 6
##$NOISF1= 3.799351
##$NOISF2= 2.8
##$NSP= 1
##$NTH_PI= 0
##$NZP= 0
##$OFFSET= 15.70392
##$PC= 1
##$PHC0= -26353.28
##$PHC1= 15.38743
##$PH_mod= 1
##$PKNL= yes
##$PPARMOD= 0
##$PSCAL= 0
##$PSIGN= 0
##$REVERSE= no
##$SF= 200.130013532006
##$SI= 16384
##$SIGF1= 3
##$SIGF2= 2
##$SINO= 400
##$SIOLD= 16384
##$SREGLST= <1H.CDCl3>
##$SSB= 0
##$STSI= 0
##$STSR= 0
##$SW_p= 3612.71676300578
##$SYMM= 0
##$S_DEV= 0
##$TDeff= 0
##$TDoff= 0
##$TI= <>
##$TILT= no
##$TM1= 0
##$TM2= 0
##$TOPLEV= 0
##$USERP1= <user>
##$USERP2= <user>
##$USERP3= <user>
##$USERP4= <user>
##$USERP5= <user>
##$WDW= 1
##$XDIM= 8192
##$YMAX_p= 0
##$YMIN_p= 0
$$ End of Bruker specific parameters
$$ ---------------------------------
##NTUPLES= NMR FID
##VAR_NAME=  TIME,          FID/REAL,        FID/IMAG
##SYMBOL=    X,             R,               I
##VAR_TYPE=  INDEPENDENT,   DEPENDENT,       DEPENDENT
##VAR_FORM=  AFFN,          ASDF,            ASDF
##VAR_DIM=   8192,          8192,            8192
##UNITS=     SECONDS,       ARBITRARY UNITS, ARBITRARY UNITS
##FACTOR=    0.0002076,     1,               1
##FIRST=     0,             0,               0
##LAST=      1.7004516,     0,               0
##MIN=       0,             -179614,         0
##MAX=       1.7004516,     180746,          0
$$ Real data points
##PAGE= N=1
##DATA TABLE= (X++(R..R)), XYDATA
$$ [...]
2736c245J181L107J644n41l660j937L378K385j217j356p37r36J827J965o94j104
2752F0n21j379P76L638j41l844j367J781K735J348k509m127J200L799O25j331
2768G43j181j681Q10L171o57j372Pj455j1K965J317k730j640l9J508K956k80m096
2786a665j809L585J825l61j120k597M2L187Q90j587m82q90j059K157K183j123
2802A176j876j388L24L110J994k948l978J767K916R84l75k828j848K709K447j129
2818A057j421Pj153Q49K164j27j363r90j204J218L709k75l896r49J558K352J569
2835C105k479l987J621L155L22j139q79j084K18K121O29r97q15j280m79L477J285
2852B794k337k763K06J927K664p3l928j571K775K152k82j273j607m68K074J015
$$ y = [-3245, -2064, 1043, 2687, 2146, -1514, -3451, -73, 2312, 1095, -261, -998, -1934, -107, 1858, 1164, 60, -461, -1840, -1064, 2574, 2433, -1411, -2778, -997, 1738, 3086, 577, -3550, -2350, 1449, 2074, 743, -438, -2119, -1309, 1862, 1205, -167, -160, -1615, -1626, 1339, 2656, -74, -1714, -1753, -245, 2711, 2431, -1665, -3474, 111, 1936, 1575, 455, -2142, -2100, 1087, 1977, 390, -92, -982, -2041, 116, 2299, 1176, -700, -2088, -1764, 1346, 3340, 392, -3586, -1819, 1097, 2081, 1706, -1122, -2970, -261, 2186, 1057, -364, -357, -1510, -661, 1503, 1376, 13, -977, -2181, -963, 2746, 2471, -1425, -2374, -816, 1536, 3105, 626, -3361, -1740, 1415, 1737, 598, -281, -1365, -1147, 974, 1603, 606, -209, -1489, -1968, 1509, 2794, 457, -2306, -2100, -173, 2491, 2418, -1510, -3081, -306, 1846, 1564, 291, -1316, -1784, 290, 1305]
2868A305p84j85o29j693J693K750r52k087j797Q32K823K297k880l576P49L214
2884A080J148j067k064j558K023K115q29l83o46j332J24K826P53k022j605j158
2900b595J919L827o70m066j256K092K264J170k200l140P44K705P26p15r20j319
2916a434k79J855R87J02j013k292PL503J569k377k947l50K544K750o37l304j331
2933b647K298J913j13j004j312n62J044J334M4k03j548j832K006L147j44k987
2949e66k222R98L139J763k768k843M55K767J140o34j662j182R04J704K15m12n62
2966B34k124O9K722J619j427k630j727L231K990n54l728j740J989K559Q48j787
2982E44k546K70J753J110p2n25j748k50R38K632k91k178k069J13L591J973k438
$$ y = [1305, 521, 336, -293, -1986, -293, 2457, 1505, -582, -2379, -1547, 1276, 3573, 693, -2883, -2134, 1080, 2228, 1161, -903, -2461, -438, 1677, 848, 465, -181, -1513, -1389, 1437, 2190, 168, -1437, -2595, -676, 3151, 2481, -1585, -2841, -749, 1515, 2685, 485, -2655, -1911, 794, 1520, 805, -115, -1434, -1713, 142, 1129, 1231, 218, -2074, -2067, 1436, 3005, 628, -2319, -2669, -125, 2625, 1988, -1316, -2647, -349, 1564, 1451, 447, -865, -1427, -383, 951, 995, 792, -756, -2588, -582, 2565, 2421, -566, -2788, -1790, 1349, 3112, 344, -2499, -2044, 723, 1863, 1229, -433, -1615, -711, 993, 1208, 796, 234, -1890, -1821, 901, 2520, 1093, -1537, -3264, -33, 2957, 2403, -1325, -3065, -1076, 1483, 2331, 544, -2002, -1732, 21, 1131, 1059, 534, -1214, -1464, -526, 2106, 1815, -363, -2432, -2319, 1272, 3245, 807]
2999H07l204j51K651K332o67k814j393J612K003K07p67j475o63N04J703J258p57
3016A186k254j360J941K883J48k874k467J359L112J268k499k234r9K349J236l79
3032A316j723r03l0J091J591L17j594j948j66K737K146j448l514r86K892K524
3048B302k36k755j991J503K460O11j663j167m76P89J437N64p19j550q83Q96K470
3065A592R83k477l048R22L495J643k139l135m25K888K289j508j553j263P27J482
3081D73P99k90j419j320N3J786K394j018k876j118K019K771ok881k358J576L390
3098A975J51j654k121j32J546J803n08r45j206j70N53K093O66k291k313O65K393
3115E05K422j678l461o33L149K161p14k539j234P28K444L46j166r35r17M58J532
$$ y = [807, -2397, -2548, 103, 2435, 1768, -1046, -2439, -827, 1176, 1383, 616, -859, -1522, -1018, 685, 1943, 1186, -1068, -2428, -487, 2396, 2544, -330, -2797, -1438, 1674, 2942, 443, -1791, -1890, 459, 1695, 1316, -407, -1310, -1340, -249, 1342, 1659, 65, -1883, -2049, 688, 2834, 1386, -2128, -3114, -222, 2302, 2066, -689, -2680, -1177, 1283, 1894, 231, -936, -1412, -623, 814, 1378, 659, -891, -1774, -878, 1592, 2575, 98, -2950, -2028, 1467, 3110, 971, -2164, -2589, 299, 2588, 1080, -473, -1736, -1009, 473, 1272, 982, -437, -1757, -1704, 82, 2476, 1458, -1418, -2536, -517, 2254, 2248, -633, -2991, -1415, 1975, 2126, 472, -1649, -1781, -235, 1568, 1060, 115, -1091, -1261, -708, 1385, 2051, -240, -2553, -1888, 505, 2927, 1249, -2212, -2845, 304, 2465, 1751, -788, -2022, -1294, 1150, 1496, 330, -605, -1522, -1064, 468]
3132D68J598j001k165r62R02K866J233l131k996J525L206Q47j559k429n31K522
3148C93K035j453j113q96n60J382J683l93j284j576m48K762K156r59l581o29K100
3165c81K787m5k732k654J520L022O8j302r53q55J026J584L13j171p39j056L46
3182a222K821J039k888k416J053K029K191r77l668q50L590J366q16j443j459L57
3198a293J986Q97q09q12j006o25J709K600j162k838q34J386K698J145l444l054
3214c456K176K750L52q93k058j022K245J761p94j019o12j222P61K733K03k244
3230c39j297m23K000L263j509l868p24L185J679M0j786k622J199K966m10j202
3246A52k93j040k31K291Q16j130j027j579N54L436J155l370k404J245K405J697
$$ y = [468, 2066, 1065, -1100, -2062, -1160, 1706, 2939, -192, -3188, -1663, 1543, 2390, 831, -1598, -2129, 393, 2428, 975, -138, -1034, -1594, -212, 1471, 1078, -206, -1782, -2230, 532, 2688, 1729, -1852, -2481, -381, 2406, 2361, -371, -3025, -1505, 1517, 1585, 283, -670, -1525, -499, 1085, 1398, 227, -512, -1568, -1222, 1599, 2638, -250, -2666, -1613, 416, 2607, 1630, -2038, -2888, 702, 2068, 1252, -191, -1650, -1293, 693, 1590, 781, -31, -1037, -1662, 47, 2647, 1485, -1353, -2187, -801, 1897, 3042, -402, -3456, -1280, 1470, 1822, 929, -1129, -2151, 94, 1855, 1061, 42, -570, -1792, -1031, 1702, 1905, -339, -1636, -2059, -59, 3204, 1695, -2173, -2897, 288, 1967, 2007, 221, -2401, -1202, 1764, 1354, 152, -141, -1181, -1412, 879, 1695, 565, -462, -2041, -1487, 1949, 3104, -266, -2670, -1425, 980, 2677]
3262B677j316l165r09L241J290j190n15j293m42J556J622p07n51j245j104K073
3278B2K967j582l399k81J716K304J002l191k447K097K217K20q35j492j014R56
3294g40K011k98m17n32k145Q40L222L32k659j444k12J928L299j154m634K15L059
3311F71Q22n5j414k281R22K277K33r20L19j786p28K197K190j838j080j885N91
3328a765L597J542l811k387J583J936J703q99l426n79L047R46p17kj241j557J573
3345d57K374o62j110j688q28K612K870j580l505k22J732K002P92k894k187K297
3361d54J800k19l52j052j827J310K087j54l51r85k003M87M122n5k554k019J76
3378b043K282K961j663l568K9K374J116l74o89k379K41K387L15KN1k307j063K598
$$ y = [2677, 1361, -1804, -2713, 528, 1818, 628, 113, -1180, -1622, -66, 1556, 849, 298, -947, -2051, 22, 2989, 1407, -1992, -2273, -557, 1747, 2749, -442, -2889, -792, 1425, 1645, 810, -682, -1696, -740, 1271, 973, 556, 24, -2121, -1281, 1941, 2273, -386, -1830, -2042, -114, 3185, 2031, -2603, -2388, 671, 1493, 1438, 24, -2257, -1335, 942, 1175, 255, 574, -1212, -1940, 257, 2447, 609, -471, -2356, -1765, 1832, 3374, -437, -2824, -1241, 695, 2398, 1499, -1927, -2506, 541, 1487, 770, 768, -473, -2030, -457, 1917, 1255, 145, -1543, -2371, 241, 3111, 1531, -1974, -2196, -464, 1538, 2330, -564, -2751, -454, 1346, 1127, 775, -277, -2104, -794, 1293, 1139, 788, -197, -2200, -1713, 2409, 2354, -200, -2219, -2043, 239, 3200, 1537, -2031, -2002, 372, 1488, 1114, 425, -1954, -1713, 674, 989, 991, 1042, -1265, -2328, 270]
3396B70K480j649j975j534J013L566R45l910j626J136K384Q16r95j967q99J894
3412e1J047l87L14j402j798J247K600L33j770j483j143K730K932j465l585k26
3428b107J506K042P19k410k147J724J579M4J62o85k056J5K150R68m95j216k225
3445b432O90L841Q16l407j881P17K308K107j299l374j37K438P78k28k6k081n06
3462a676J699R09L80n37k024j363L335J975j463k588j015R26L105J019l006j789
3478b113J289J572N45j22j767j367J600Q22L30L25j095k289J183K859J20j699
3494A93j887m40K480K641j891l035j9J721J282P77j573j813Q82J200o7P35o66
3511E20j931l00K113J654l45j843k331J040L692L99l290j445L93K224J607o39
$$ y = [270, 2750, 1101, -874, -2408, -1395, 2171, 3116, -794, -2420, -1284, 1100, 1916, 921, -1046, -1945, -51, 996, 609, 923, -479, -2277, -1030, 1570, 1903, 133, -1350, -2493, 237, 3169, 1704, -1881, -2107, -601, 1441, 2160, -250, -2397, -673, 906, 950, 1112, 427, -1629, -1614, 536, 1504, 1009, -207, -2432, -1742, 2099, 2915, -492, -2373, -1656, 652, 2759, 1460, -1914, -2051, 387, 1165, 937, 911, -1170, -1676, 23, 932, 1312, 775, -1249, -2612, 723, 2698, 1235, -1353, -2368, -1442, 1663, 2682, -324, -2113, -824, 748, 1293, 1171, -596, -1963, -363, 459, 789, 1114, 19, -2270, -1087, 1772, 1892, 193, -1694, -2134, 346, 2987, 1096, -1939, -1958, -237, 1045, 1822, 249, -1564, -682, 518, 451, 1186, 520, -1411, -1711, 402, 2056, 1711, -132, -2463, -1423, 2269, 2668, -622, -2067, -1674, 550, 2157, 1518]
3527A518l060J30J465O42J00L87j519j413J383J324O40p39k417r04K744K374j371
3544A284k534j037J413K511L73k506j581J307Q34J036j12j144j395L90J446J020
3560A305O83k268k370J141L417K57k119k154K8K432K729j822l117J69J125J445
3576H81L35r52j412J57N34J030Q35o05k091p87K049K238o95k314j853J539L035
3593A924N98l038j301N31K006R24o80j836n46J118L20J105J76j537j715J048K158
3610A255N32j136k858n2K906K020j455k440p39J335K373j29j766j173K88R47J200
3627A108K23j089j774L33J055J941l43j963k022J371L098L54k111k405K95K440
3643E11J696j269k002l62J102Q59Q24q42j238q67O15J520J057r38k283p86K476
$$ y = [1518, -1542, -1412, 53, 695, 795, 1182, -337, -1750, -367, 957, 1597, 858, -1559, -2463, 281, 2655, 1284, -1250, -2287, -874, 1637, 2010, -496, -2077, -770, 64, 1100, 988, -156, -1551, -1161, 285, 1305, 1988, -280, -2650, -1509, 1908, 2165, 46, -2108, -2080, 352, 3081, 1259, -1858, -1689, -564, 881, 1216, 264, -1148, -991, -457, 573, 1408, 803, -1288, -2075, -26, 2212, 1517, -797, -2650, -1111, 1924, 2522, -516, -1817, -1286, 720, 1644, 964, -872, -1418, -300, 20, 1125, 1301, -236, -1951, -903, 1255, 1787, 651, -2207, -2259, 647, 2667, 1212, -1228, -1967, -632, 1741, 1612, -154, -1327, -1039, -92, 1108, 1331, 242, -1532, -1199, -144, 1797, 1454, -509, -2531, -1160, 1938, 2292, 181, -2224, -1929, 511, 2207, 938, -1064, -1426, -324, 535, 1359, 517, -721, -1588, -973, 547, 1604, 666, -1617, -2403, 73]
3660G3K197o23k685j443J910K343L73k218j572P28J461Q18l46j238o33m32J309
3677B2J300J54j845j660R83K245J018j683k694k4K583J806j230j950r85J444K065
3694A549k88p87j292o0L16J366O74j163j457n97J538K002J23k824j744J488K884
3711A728M31j841k389O22K193R72q08j516o36P57J330L95n74j052j036J2K193
3728G81J448j559k450o07K229K434l94l254r13J999J974K1j733j261J89J113J099
3745A116j93p36j194l24J181J928q7k136j669O77K790J042k214k217L75K154J538
3762B031j178j765j041J503J439j78m64o83j360R04J657N55j054j822o97J776
3778c77K653k69l224r83J834J821N49k030j859K77K136Q12q06p85r49%J384Q55
$$ y = [73, 2270, 1647, -1038, -2481, -571, 1772, 2145, -73, -1645, -917, 544, 1362, 1016, -222, -855, -1287, 22, 1322, 1476, -369, -2029, -1046, 1199, 2217, 534, -2160, -2184, 399, 2205, 975, -975, -1960, -516, 1549, 1261, 474, -818, -878, -562, 804, 1478, 315, -1142, -1739, -201, 1801, 1924, -900, -2644, -1156, 1728, 2159, 318, -2071, -1449, 744, 1716, 908, -608, -1244, -487, 843, 1238, 664, -388, -1424, -1412, 781, 2229, 670, -1780, -2387, -158, 2276, 1882, -1372, -2285, -286, 1688, 1709, -24, -1285, -1096, 17, 1116, 923, 187, -1007, -1331, -150, 1778, 1691, -445, -2114, -1437, 1353, 2395, 181, -2036, -1661, 493, 2031, 853, -912, -1953, -450, 989, 811, 347, -336, -1696, -792, 865, 1420, 366, -1456, -2153, -377, 2276, 2007, -1217, -2200, -366, 1455, 2004, -26, -1885, -1608, 528, 1340, 534, -251, -1200, -1200, 184, 1039]
3796A039K36j368j815O35K511J382k197k460k55K537K117p02k982q63J881J297
3812I93M6p57j296n17J610Q03L5O6k009j065J938K351n77k403j116L59K741J514
3830B716k363k433P65K056Q57l92j698j471J765R82j56K38q21j888N02K606O30
3847A895j074k283p21K104K754r14l028p02J601J447N44j285k072O16J572K68
3863G22K1j56j586o07J661J371k9j601j777Q5K974J799k722j911L8J967J609j48
3881A710k760j016J820J442k44k96j195q58P49J669M46n18j489j721J749L037
3897B525j015k326n78K96K277J174k074k332J028J654M42R8j610j011O55J093
3913B96M16L98r87j968J77K977N66j535j633j024J555L089o87k943j95J335O48
$$ y = [1039, 1275, -93, -1908, -1273, 1238, 2620, 423, -2037, -2292, 245, 2362, 1660, -1322, -2185, -304, 993, 1039, 282, -1014, -1531, 79, 882, 917, 983, -1026, -2091, -153, 2198, 1621, -782, -1898, -1539, 1202, 2716, 353, -2080, -1315, 741, 1598, 1206, -492, -1963, -198, 784, 628, 866, 45, -1843, -1341, 1265, 1895, 821, -1462, -2183, -79, 2675, 1761, -1267, -1969, -368, 1079, 1623, 338, -1734, -1118, 454, 722, 743, 587, -999, -1606, 55, 1426, 1397, -204, -1981, -1896, 1078, 2877, 155, -1756, -1718, 249, 1858, 1710, -1050, -2066, -246, 1196, 952, 656, -539, -1397, -648, 1021, 1467, 949, -540, -2261, -512, 2525, 1510, -816, -1394, -1098, 1179, 2353, 279, -2053, -1025, 629, 1071, 1169, -441, -1452, -797, 296, 712, 1110, 123, -1845, -1668, 1309, 1875, 340, -1293, -2317, -762, 2327, 1640, -1303, -1498, -163, 485]
3930D85R18m76j727l29J498k4O09K0j887r30J915J839n32j349j918M16K710J275
3948B513k416k330J067J296J501j15k293q59J276R11K31L94j244j589J007J389
3964G39N79o31j809j622K550K902j563k113q63Q65K095J149j947k332J170J143
3980C12j7N52k87j896K65J540N70L49j171k143M68K943O97j735j647p31J470K568
3998B107p39k418m10J067P80P56j85k023k20R99R39N11L48k469j321K125K085
4015A932j018j040j782K84K940J059k457j561P82J050J084K04j781j026Q32N86
4031H8L74J150j704k165J200J816J156j097j846j131J998K948j581k136n98R42
4047e86R57J229j455j664P58O60M07O69j02k399P8J429J337N0j068k562M62L365
$$ y = [485, 1403, 927, -800, -1129, 369, 345, 954, 974, -913, -1843, 72, 1911, 1379, 30, -1888, -1472, 1238, 2513, 97, -2233, -1166, 130, 1631, 1516, -777, -1636, -360, 551, 782, 1176, -68, -1657, -650, 739, 1318, 687, -1122, -2744, -194, 2708, 1145, -968, -1831, -966, 1129, 2278, 331, -2001, -831, 312, 295, 847, 560, -1336, -1071, 469, 1039, 1388, 217, -1926, -1458, 1485, 2182, 447, -1200, -1931, -461, 2107, 1368, -1050, -1460, -393, 387, 1143, 958, -1065, -1285, -286, 653, 1164, 1512, -957, -2278, -153, 1932, 914, -126, -1908, -1624, 1316, 2375, -82, -1643, -861, 189, 1273, 1477, -304, -1330, -498, 88, 462, 1612, -92, -2257, -1057, 759, 1915, 818, -1028, -2159, -161, 2787, 1206, -930, -1528, -586, 371, 1600, 145, -1519, -761, -101, 306, 975, 873, -1526, -1448, -19, 1318, 1368, 300, -2262, -1800, 1565]
4065A565L70j814j555k27J706J818r01j933m15J040N58P41J88j919o11Q22P62
4082A95J217n1k591j226K517J965m76j791j655M31K555J150k483j303R56L93J163
4099I66J39r91j312N70P63N48J155j587k237Q28K262N29j317j443j272K128K693
4116B422j442k061j27P44O98J181o83j823Q1O42K97J484n4k017j276K255J077
4133A398J94j746k032N59L153Q68k148j516j44J563J242k36k071k36N65L00J227
4150I40L27j789j133P87J305J290m18k448j359K457J954q17j856q12L75K505N86
4167A894k200r94O47j86J205P94q50j308k12J130J061R01j741k285L79K903O68
4184A806j492j587o78J782K020o20k067j88N30N22J020m78j437KK32P12J581j73
$$ y = [1565, 1935, 121, -1434, -1661, 45, 1863, 962, -971, -1386, -346, 212, 953, 1141, -778, -1389, -567, 195, 1412, 1361, -1230, -2456, 61, 2026, 1550, -241, -1896, -1465, 1090, 2240, -243, -1546, -590, -197, 966, 1105, 114, -1198, -628, 135, 683, 1838, 251, -1986, -1158, 1104, 1633, 316, -1127, -2399, -271, 2422, 980, -1081, -1208, -464, 234, 1415, 732, -1091, -1010, -368, -71, 1413, 1359, -658, -1934, 321, 1398, 1592, -154, -2186, -1627, 1526, 2394, 246, -1270, -1414, 149, 1391, 1155, -916, -1152, -587, -287, 940, 1267, -522, -1655, -868, 437, 1727, 1309, -1139, -2498, -41, 1913, 1096, -760, -1572, -1197, 1308, 1894, -306, -1300, -653, -839, 366, 1160, 310, -998, -1210, -80, 981, 1882, 141, -2144, -1765, 1138, 1806, 314, -1273, -1951, -169, 1851, 1231, -836, -1024, -494, 28, 1048, 570, -867, -865, -633, 79, 1660, 1487]
4202A487k603q50J726J747N7j548k360R03K914N32j950j011O0P04J350m24j053
4219c19m90Q5N00J083Q84j621j962M84J809J276q37k347q56K223K133j062j653
4236f70r61R13J587P42j179j194J10J78Q38J260j013j478l70O98J901L93j852
4253i7j806M03K688M96j301j729m11J611J365l98j091m35j16J082N82r1j092r10
4271a250J82J370J146n68k041q99J955J664m21j515j632R39K151L17j116j136
4287h54o7O49J151J96r43q26k65M29J694O63j845j764M68K144R68r62k265n65
4305a994J874J660n90j475p69P00J377K19n09o86l94l59J310R51n88j672r93J595
4323c43J947p1j860j762J084K273L89j397r49n79J255J155j25j006p53j46O86
$$ y = [1487, -1116, -1966, -240, 1507, 1564, 16, -2344, -1441, 1473, 2005, 55, -956, -896, -192, 1158, 734, -319, -809, -724, -224, 859, 1743, 122, -1840, -1356, 453, 1729, 892, -1455, -2311, -88, 2045, 983, -670, -1631, -718, 869, 1611, 432, -762, -652, -474, 364, 1624, 611, -867, -1237, -539, 1362, 1755, -97, -1903, -1500, 1188, 1684, 383, -1346, -1757, -146, 1219, 821, -270, -705, -821, 261, 843, 752, -340, -1250, -1068, 302, 1448, 880, -1161, -2060, -105, 1559, 1138, -377, -2009, -1070, 1081, 1398, 282, -854, -921, -272, 879, 1075, 132, -694, -959, -530, 1164, 1827, -18, -1782, -1314, 830, 1798, 836, -1429, -1994, -120, 1540, 950, -525, -1294, -594, 783, 1002, 493, -193, -587, -946, 364, 1315, 727, -945, -1938, -343, 1604, 1533, -327, -2089, -1005, 1268, 1657, 260, -689, -1268, -13, 1142, 1017, 11, -742, -888, -202]
4340b02J089K94j348j194NJ593J531p30k296n27J897J284K0j971j341J328J478
4357I10m2n55r41k28O35O70N24o08j332o28J114J559L09j305j680J65K228Q42
4375A637j383j504m18J600J363o79j032n57J81R67P25jr49j183L96J093J156l45
4393A067k210n44J221K078j31j852j157P13J641Q31j127j473J23O09N29M64m12
4410C70n52j034J020J168N22j461j380J48J991J135j237k019j62J387J554n14
4426I36j415n88O04J079M60l81j124n51N49R19N86j23j291j366J205J915m2j270
4444A02j580L11K090J002k095j448N77J015P37L11q53j037L83L90R73O8q85j558
4462a497M56J494J006p53j503r83J560K050m87k168l46K59J501P08r20j383M87
$$ y = [-202, 887, 1181, -167, -1361, -1356, 237, 1768, 1038, -1258, -1785, 112, 1396, 1416, -555, -1896, -568, 910, 868, 313, -628, -856, -221, 449, 973, 365, -967, -1595, -481, 1078, 1387, 82, -1598, -1433, 795, 1637, 254, -1250, -1668, -68, 1295, 616, -416, -973, -792, 175, 900, 899, -50, -1233, -837, 256, 1412, 1067, -1143, -1687, -466, 1612, 1481, -371, -1528, -815, 826, 1657, 530, -943, -820, -211, 318, 782, 370, -182, -1216, -196, 972, 1494, 33, -1347, -1199, 792, 1927, 690, -1329, -1491, -104, 1450, 936, -479, -1067, -463, 616, 1076, 695, -429, -980, -431, 488, 1074, 951, -340, -1706, -501, 1414, 1372, 102, -1478, -1167, 923, 1925, -170, -1618, -1041, -26, 711, 1022, 169, -868, -485, -95, 878, 946, 61, -1497, -1041, 453, 1459, 706, -797, -1780, -220, 1830, 1343, -825, -1171, -912, 589, 1297, 377, -1006, -519]
4479e19O1P26N62j09j134r16Q34J520L63j370j781K72K328J183j459j676k29R70
4497c74J688m1j998o50P90O42P60K02j494o80L95J008Q43l02j401j274J491J843
4515A448k4j681j184M09J772J269j697j359N54M50O17L62o99p14l04O42O83L13
4533H57n61j891J41K344N10p07j291j095J376J828q13j557k94P48N83P69l64j268
4551f85j05M15M93Q34N7j635r06J524J226j8j127j596P3K501O07j563j200M68
4569f37N02J037L46j322m04J9K61N88O17q79j287P79Q44O61K6k067q77J447J949
4588A603m63j697o19J86J523R39j223j159K42K80O06O96J93j851k34P74P10Q21
4606A327j049j796J99K322O35j147j206q82J720J184m82j547k36Q31L85N74N6
$$ y = [-519, -458, 268, 830, 721, -413, -1329, -495, 1025, 1388, 18, -1763, -1491, 837, 2020, 561, -1115, -1344, -374, 1314, 1273, -725, -1375, -585, 57, 817, 1019, -475, -1155, -760, 248, 1091, 789, -612, -1886, -395, 1448, 1424, -257, -1441, -1032, 740, 2009, 312, -1047, -493, -43, 574, 936, 237, -477, -781, -139, 544, 857, 296, -1595, -1454, 890, 1400, 693, -598, -1693, -317, 1511, 698, -859, -1153, -405, 178, 947, 583, -685, -790, -375, 118, 952, 1009, -626, -1532, -8, 1218, 1200, 73, -1523, -1450, 1051, 1658, 95, -1105, -637, -135, 902, 1248, -74, -478, -459, -198, 390, 1007, 128, -1159, -380, 464, 1125, 1151, -916, -1793, -346, 1603, 1140, -557, -1176, -990, 533, 1472, 249, -910, -668, -388, 218, 914, 1107, -744, -978, -204, 506, 1327, 278, -1518, -1319, 1003, 1638, 491, -715, -1597, 123, 1307, 825, -722, -958, -127, 258, 832, 888]
4623H88j422l76N95K17J198p4j817n72J239J222j85r78j393J62K227L29j338p72
4641h50Q3L19J033J84r91l80J83L43M26J085j232j591R07J107L56J90j947j064
4659a839J604J689r14r71m70j24J356Q97r80p80O2J35J18J356m32j608j63N40
4677e24J282L96r17k180P67K005M39j158r01l95R86J384m78r07m63L31N2J047
4695G66K19j091p69K77O46J026m8j713j370J831J346m33n33j220J81J514P73r60
4713D42r78L36k49O89Q15p90p32l78M28R54R32j112j390J81J303Q76n85j158p67
4732a183J110J450o99j251J0k62Q27R07n30n51l13k44O69R29J62j773p34R86J491
4751A001K86q85k064N52K042R4j048o32l16M60J433r1r16r5l21m23J519K82p80
$$ y = [888, -534, -910, -315, -98, 1100, 1026, -791, -1363, -124, 1098, 913, -65, -1458, -1296, 931, 1260, -78, -850, -767, -448, 585, 769, -222, -602, -419, -76, 350, 1435, 203, -1388, -481, 626, 982, 1172, -775, -1839, -235, 1454, 540, -431, -901, -1025, 331, 1228, 248, -532, -470, -335, -217, 1139, 707, -901, -1064, -524, 758, 1154, 237, -1943, -1176, 829, 1268, 110, -791, -1186, -200, 1184, 706, -201, -664, -333, -281, 766, 985, -106, -875, -598, 48, 1074, 1026, -687, -2057, -226, 1120, 687, 154, -1066, -885, 629, 1402, 442, -536, -200, -449, 240, 1055, 265, -467, -845, -417, 537, 1469, 357, -1033, -852, 451, 1327, 742, -416, -1183, -73, 1377, 678, -573, -563, -825, 2, 909, 379, -172, -485, -729, -60, 869, 1031, -742, -1476, -490, 1001, 1287, 402, -1662, -1110, 932, 1026, -22, -654, -970, -510, 923, 832, -84, -179, -500, -923, 596, 878, 98]
4770I8j193J31P50J360k49j451j116J387J134k26p18j051M02J429L83j026j90
4787a46o32J63O72Q88o51p57m03N19J101J000j681j629R53J226L37n35q37n69
4805i81Q99Q61R1j170j25j03M92Q44r9q48m87m8O21J254l51j566m23R60R71L0
4825H22p39j356L72J921J45j235o56j09J91J152L75o17k37m80m14J367R80j470
4843A2j162J07J486P12l2k028p53J872Q49j50r60m29l78J310L35n36m16l70J2
4862e19M11J195n68j277k10L52J318M03r73j534N11J449N82q50p57n04O87Q88
4880F04n1o42m04k64L57P27N39q28n25k61P58J306m13j982J7J183P97k06q99j010
4900a197M62J176L14m12q72j14L8R73M66n25r69j65K1J602L51q24j322J0J122
$$ y = [98, -1095, -964, -214, 1146, 897, -554, -1670, -283, 851, 625, -93, -1144, -742, 687, 1070, 44, -146, -778, -615, 57, 945, 294, -463, -866, -347, 754, 1754, 73, -1556, -603, 623, 960, 425, -412, -981, -82, 779, 870, -300, -425, -528, -36, 808, 709, -139, -626, -674, -53, 1201, 850, -716, -1139, -179, 792, 822, 83, -1273, -901, 1020, 1165, -70, -726, -835, -644, 508, 883, 266, 29, -451, -865, 502, 1482, 12, -1150, -1043, 443, 1155, 1123, -905, -1658, 214, 1063, 913, -47, -476, -854, 456, 791, 255, -161, -531, -519, -108, 1087, 519, -758, -968, -616, 702, 1105, 132, -1402, -891, 558, 1140, 290, -467, -971, -284, 604, 553, -89, -493, -757, -400, 327, 866, 38, -487, -748, 10, 1316, 903, -1079, -1062, 121, 918, 712, -187, -1197, -735, 441, 755, 343, -529, -643, -605, 368, 834, 309, -660, -825, -804, 798, 1149, 325, -997, -987, 135]
4919A35R35p08j019n39J221J043l50q15o07O6P64M00k8p9q39m59M83J352j19j324
4939d87n76P22J076O07j321j587P98J213N55n43r08o9J34J005O9n25m91l97N62
4958a63N89N09q87q87k69J236J306m79j960p75J333J110J69j075l85l51J492K12
4976G25l25k51l54j62J93J090o3j410l54K10J412O49j381j213N70J018P49q44
4994B59r29l56Q71Q00k65q5q64q6L68N06P10q81o10k38P03J179l27r50o47N26
5014c16J278P1j019j016M80Q84L03j60o07m30J49O59K28K74r77l26M4J041M69
5033A029j008p93k90J417N37J74j594p38J282M65J96j078l86L05M33N25k9l68
5051G9q37j40J012N94j97p16p24M83J060K58r55o10q0J344K58m11r50j63L02J001
$$ y = [135, 1070, 362, -657, -1196, 25, 1068, 718, -97, -704, -638, 126, 526, 498, 419, -420, -879, -396, 956, 837, -487, -1063, -341, 735, 1342, 21, -1566, -768, 445, 1000, 457, -451, -520, -386, 619, 688, 163, -328, -725, -163, 426, 935, 48, -839, -1108, 128, 1434, 955, -1005, -1780, -447, 663, 832, -243, -628, -979, 513, 725, 400, 149, -205, -367, -174, 916, 853, -557, -911, -701, 711, 1360, -21, -1234, -664, 354, 1103, 259, -670, -1026, -155, 645, 380, 295, -569, -655, -287, 219, 929, 48, -562, -800, -97, 1082, 755, -195, -842, -316, 962, 1033, 14, -1002, -522, 362, 665, 505, -102, -532, -383, 276, 504, 778, -199, -525, -481, 560, 1029, 21, -772, -1062, 355, 892, 1066, -528, -1266, 16, 481, 677, -401, -787, -482, -49, 476, 447, 79, -758, -898, 114, 708, 511, -205, -929, -446, 614, 872, -83, -693, -773, 571, 829, 418, -532, -695, -393, 608]
5071F08K39o06n16l05QO82L94l79o35n76Q86J086K51j883k54O15J117L91j484
5090c61l61K69M42R15n73k26l49j26K99O20J24r84q51R85N80R12j384p36j72J395
5110D18L67n52p89j9L56R07l86p06pK50J81J99N15m28r71j61O54R33J07j283r97
5131a412J185R42J43p15j021k6J356M09q65l61Q4j93O35N90m71n68k71K44O39
5150C24L57m95j180J42R10O10j24q77r04R24J078l16n87l45k1J30L85O4J09o94
5170e10J00N11N67K33j491m25N70J072L61r22p42J04J072N80r48m16k91Q3R69
5189D77j12k36m50m8k11Q06O42n69j244M67M48O66K88r87r71Q08R14j62q58k88
5209f20J69O65N14n18k88k08j54J34Q87n7o41l89J23L94M94k50r91K9P26N52l23
$$ y = [608, 847, 241, -275, -580, -572, 110, 504, 125, -510, -1086, -200, 886, 1137, -746, -1000, -385, 732, 1123, -361, -722, -453, -11, 904, 331, 105, -244, -370, -71, 549, 673, -311, -1162, -177, 403, 1315, -69, -805, -977, 418, 785, 233, -556, -575, -219, 688, 302, -404, -411, -161, 20, 219, 734, 306, -665, -826, -172, 761, 868, -415, -1412, -227, 715, 858, 143, -878, -904, 452, 861, -4, -365, -281, -474, 161, 751, 280, -288, -559, -315, 324, 681, 186, -994, -852, 58, 668, 544, -333, -1237, -313, 765, 449, -138, -483, -504, -374, 11, 75, 184, -510, -410, 101, 668, 901, -590, -1015, -445, 627, 988, 66, -676, -572, 500, 1080, 132, -284, -575, -492, 477, 365, 129, -321, -369, -580, 226, 868, 299, -945, -478, -30, 636, 924, -63, -1034, -226, 688, 526, -332, -620, -451, 214, 728, 210, -78, -286, -440, -306, 581, 524, -117, -506, -383, 11, 505, 255, -736, -707, 19, 571, 248]
5230B48o25m35L63R32Q9o09k97K55j2N62L04n42o71L4m7J040K82j194l20L87R88
5251G32j50p95p79Q3J507J10r62N8J08j37J54N06l24k76l26n7O44Q01q90o64j26
5272g83R53M61O2r59r09J258N30m38k18j35k14N27K11l8m11j31m77L35R70J15
5292G09j361p1M92O05M59j92j535P9J430q1n28q9p13O50O37k03o22L09k38j70
5312d33R00K43n23o76n85N28J407l28p32r35R81M95K50l67o23l07Q50M92m30l83
5332a76J87l98J81N68k75l78j69j62O71P29l73r79m1N09M36K50p53o81O72P98
5352F16l78k79J92n42M19L00l1l33k69j22J60J143l42q00j92M58K97L21o72j002
5372a056P38N30L79k54k72o29L7P84K43n43J46m06R9N60N22n97p42k16K11J244
$$ y = [248, -377, -812, -449, 483, 572, -37, -334, -79, -91, 471, 775, 233, -438, -404, -451, 589, 871, -323, -643, -256, 732, 582, -213, -992, -909, 598, 708, -254, -196, -88, -225, -71, 435, 111, -165, -491, -548, 96, 897, 7, -657, -783, 170, 631, 693, -266, -1175, 83, 613, 175, -43, -178, -392, 135, 346, 308, -103, -234, -711, -376, 594, 709, -652, -723, -231, 374, 833, 641, -894, -815, 615, 534, 6, -83, -796, -146, 491, 288, -334, -25, -263, -433, 467, 710, 187, -489, -1074, -546, 861, 533, -199, -1134, -153, 342, 592, 225, -398, -705, 145, 637, 207, -176, 11, -387, -206, 362, 87, -291, -460, -622, 49, 778, 405, -574, -615, -106, 330, 580, -173, -854, -182, 616, 238, -41, 151, -391, 28, 328, 297, -36, -305, -427, -267, 876, 534, -266, -458, 0, 297, 618, -54, -1056, -318, 212, 591, 337, 65, -564, -527, 257, 500, -43, 103, -303, -204, 356, 878, 281, -461, -677, -466, 778]
5392G78K6j007n64P70M71r5k74l09l45R21J36l75J7k77m30K57Q34j01p61j29M30
5413b7M29P79j224q04L67P20K22L6n37q96O73N84j4o20K53m10K18N29Mj43m51
5434c12l53O29N46L94j447k26N36O08L34n02j043M99P44p7j32l9l06j18K37N42
5454E14j15k52o34j55J004K45p51l52p6L75Q75j24r89m91Q72N51j59J22m16l81
5474c37K44L27K15j55m89l20M82L25J92o01o19J01Q71P06p44j028L77O29l8K47
5494C85n17k56K31L23Jr9J49m53j53O09J99l28m33k48L99N67L54r46n51M40R86
5515F59l18k71m96j93N57J03l9J49l14m21Q53K65k42j3p90J79P64K12q44r8j75
5536d73O85M66m94l54l33K18M82K81m43l75l1J24O14o4j98Q1j089O69O61J35m42
$$ y = [778, 804, -203, -767, 3, 474, 379, 105, -204, -549, 372, 508, 133, 150, -127, -557, -300, 534, 433, -328, -457, -27, 402, 1181, -43, -847, -480, 240, 462, 498, -39, -935, -262, 322, 308, -312, -59, -469, -251, 278, 282, 139, -312, -665, -36, 510, 904, -543, -769, -233, 375, 709, 207, -836, -337, 407, 330, 198, 159, -147, -265, -28, 514, 399, 147, -487, -642, 362, 607, -144, -496, -572, -197, 678, 554, -435, -926, -54, 497, 338, 460, 44, -337, -93, 234, 449, 294, -195, -515, -33, 292, 484, -117, -736, -635, 236, 942, 198, -830, -453, 176, 138, 385, -132, -388, -157, 166, 167, 68, 217, -236, -389, 220, 419, 91, -342, -590, -191, 376, 730, -216, -767, -327, 659, 341, 70, -426, -619, -62, 41, 2, 151, -163, -584, 269, 534, 292, 279, -511, -332, 432, 644, -200, -298, -473, 212, 678, 184, -170, -503, -285, 197, 478, 35, -340, -371, -247, 367, 303, 105, 186, -903, -234, 427, 562, 120]
5557A20j41k79R24K15p62m72Q5L96K78J99m60m54M9K18M48k89K15o34k26Q60M45
5578G35m95n66m24P46N68j7j030j6L45L03J12rm13m47N07R8Q3J35n23R5R8O73
5600E58j30m39o06l1J107R1m78p16K28N05K44J72p87k25K12M24N4L4k23m62m9
5621e17P41K89j65j121J22O80M84m94k04m25K29M70M19K2p92l1M42J05l6l2l92
5642b06m99N17L25j76K48m49j96P95L77p66m23N1L86M99m48k0n29K06K81M94j53
5663C14n08J8N0N75j06j83n88p9L34K99L97q54j09J87P7M67r2m07o7K14L06L68
5685F13o53J18n52O13LJ84m40l27J03N31M94n39k59m42M44N12P5p20QP3O41J79
5707F59n30l69L46k50K04P8J7m33LN9N81l33j78m81L19J25O63j58l87m88O13M75
$$ y = [120, -21, -300, 624, 839, 77, -395, -310, 86, 364, 563, 103, -351, -302, -84, 364, 75, 290, -344, -570, 290, 735, 240, -326, -750, -4, 564, 547, -483, -499, -154, 149, 261, 252, -161, -608, -101, -3, 80, 215, -308, -213, -115, 558, 428, -11, -617, -648, 459, 550, 72, -644, -416, 89, 333, 505, -282, -507, -295, 129, 183, 217, -6, -468, -517, 224, 513, 348, -773, -651, 29, 513, 19, -185, -610, -381, 89, 508, 530, -262, -293, 149, 254, 218, 186, -206, -705, -188, 137, -39, 209, -240, -436, 359, 736, -30, -453, -402, -16, 483, 35, 15, -514, -308, -27, 467, 314, -194, -176, -126, 449, 343, 160, -428, -507, -173, 126, 523, -331, -440, -253, -176, 291, 199, -208, -275, -61, 245, 613, -40, 78, -474, 139, 142, 326, -114, -441, -338, 193, 687, 148, -111, -553, -109, 403, 478, -242, -234, -161, 480, 659, 129, -240, 106, -144, 60, 138, 155, -278, -275, -216, 365, 32, -146, -627, -308, -183, 480, 322, -65, -553, 60, 535]
5729E35m18l79k05M01L53L7m79j50N3k1K69M12l83J56m58M9Q78j64m09r29Q35
5750a7M34k24J44m91k56M37K45j26m4l65J70j55N95N2l15l77J9J53N10k40o98
5771e49J86M28K35M9m79j63Q4O99l67K1j01l67N2K37M71m77k23Q3Q6K55M08n86
5793a8k99p5N75p3P7j48n84L86O14l52l0J01m36J79L33k03p6m72j48N69K70Q8
5815B78p40O8L51J47L25n33m49M65M31J0k97p6k89K16J00r8K74m02J92k64K16
5836g5P61o29Jm14N94rK61p75j97O58Q7k62k66k88L34N31q0j4k9l01m4K81K17
5859C42L5n72o1k78P14L94m38m02J43M23M4J96p73J09L51J12l91N34p42j23q0
5880d63M58P4N5l97j59N00K52K2o32p2L26L68Ln86l17L95M89l67L95l35m53K57
$$ y = [535, 117, -262, -467, -66, 287, 324, -155, -305, -252, -273, -4, 408, 25, 181, -277, -228, 650, 486, 77, -852, -17, 417, 193, 337, -154, -410, 27, 272, 146, 102, -263, -93, -248, 347, 399, 84, -293, -274, -121, 389, 149, -549, -363, 65, 300, 349, -130, -293, -209, 490, 123, 144, 43, -324, -272, -35, 436, -41, -264, -181, -95, 160, 568, -18, -317, -392, 183, 110, 187, 39, -545, -159, 455, 103, 73, 174, -262, -83, 250, 47, -29, -501, -649, -80, 190, 278, -462, -394, -43, 104, 429, -104, -553, -88, 343, 353, 56, -20, -309, -93, 7, -91, 183, -219, -27, -291, -75, 686, 57, 58, -356, 238, 229, 490, -285, -482, 176, 263, 1, -265, -553, -219, 312, 232, 218, 189, -112, -156, 125, 342, 377, -195, -256, -534, 180, 574, 136, -266, -123, 300, 344, 540, -233, -124, 227, 339, -52, 482, -260, -383, -463, -5, 69, 124, -273, -432, 68, 320, 342, -290, -362, -36, 332, 335, -251, -568, -173, 316, -51, 344, 9, -444, -187]
5902a87L01k3q5K33p74K22L94K30m82p9m7M39R1J64q73L24L35j07K18m06l08K96
5924a24K47L7O0l4m90q7M05N33n74R5m37J05O87O6k84o81J43M95J11j46m07k40
5946e20P91l47K22Q8k00k90J85K05L64k06m41j83J86O92k68n44J37J31P9K21l80
5967g8j55M67l37rJ36K1k17k81O83j76J03o9k42K0M93j16l28l77n6M04N49j60
5989B75o45K6J63J21r1J44m88M83j56P2K67Om76k3N03J0K64p34J84k99N24L25
6011D55l78l00J03K47J85j30k49l74L96P6J48j04k09P0m80O11j3J14j38l74L48
6032DN74o30l39L18J66k7O5j99p1J2K1j30J80J33l75J53K28O6L09m32l56K67L55
6055B92J87n37J24n57P82J47q2n65J79o2J05J10l2l09j09M08j93M92J77o80k12
$$ y = [-187, 114, 91, 6, 239, -535, -313, 81, 311, -171, -250, -297, 142, 233, 397, -476, -152, 183, 76, 294, -112, -420, -124, 123, 160, 220, 186, -304, -391, 14, 547, -27, 68, -369, -264, 423, 489, 205, -476, -333, 162, 273, 127, -280, -520, 271, -76, 146, 234, 34, -256, -71, 134, 498, 292, -149, -332, -146, 546, 278, -266, -129, 2, 81, 302, -78, -233, 234, -103, -112, 24, 45, -172, -453, 230, 54, 157, 88, -154, -134, 359, 243, -85, -462, -518, -114, 435, 275, -370, -344, -181, -60, -151, -7, -495, -12, -168, -96, 171, 177, -299, -322, 181, 191, 455, -279, -95, -394, 130, 455, 77, -223, -120, 127, 312, 182, -67, -441, -45, 31, 179, 75, -134, -64, -544, 67, 54, 168, 30, -344, 4, 578, -52, -391, -73, 93, 66, 131, -68, -139, -127, -106, -236, -56, 77, -298, -145, 83, 149, 458, 26, -330, -63, 292, 479, -58, 66, -491, 291, 438, 356, -209, -30, -92, 13, 123, 91, -218, -327, 81, -112, 380, 557, -123, -335]
6076c35O55r4K22n85j35L1M99J69n81q6J74m3J40J7J9m32p0L93j33L84p3n14J38
6099b40K50K00k55n10M37j3M94K94j031K23J95l59J5M62p7l41J36K18J73k4n85
6120c38k01M49J40KJ1q6l44Q17m5k50N4p47O61k4j86Q4j92K95j8L33J9k37m83
6143b86J74J31M00k80k18j27O6O18j72n23k45M89p1K10J2j51m9k9r2K72P2k08
6165gj02k81M12M84n54l36L22K63Q0k22l69J58J52J20J80p14L00JJ33L71j51o03
6187c63m3M32l95O40J05l09j30qJ63J34o20q5K25L61j80J03p8l10L57J63k1K92
6209D33n37p1M46O7j49k97l7k17N37O6j11J16l55k91O08j33j95O1J04L4l6J28
6231A71m08J36J68k7k57K57p0Mo7L83J57m99l74L20J86M0q9p5k41q1N72k78P7
$$ y = [-335, 320, 226, 448, -137, -272, -241, 258, 427, -154, -240, -66, -109, 31, 48, 67, -365, -435, -42, -175, 209, 136, -378, -240, 10, 210, -45, -555, -118, -131, 363, 657, -374, -151, 44, -315, -300, 162, 85, -256, -120, 98, 271, 247, -338, -539, -90, 50, 52, 63, -23, -367, 450, 405, 155, 209, -538, 123, 99, -87, -3, -195, 100, 82, 415, 434, 197, -286, -112, 19, 419, 139, -79, -206, -140, 478, 306, -217, -462, 27, -44, 166, 178, 27, -22, -51, -143, 129, 201, -7, -109, -390, 22, 506, -48, -384, -62, 201, 281, 59, -310, -152, 0, 120, 300, -414, -114, -113, 20, 391, 240, -363, -406, 26, -369, 271, 376, 67, -63, -71, 92, 226, -394, -479, -254, 107, -73, 30, -48, -358, -1, 162, 141, 433, -104, -175, 271, 338, 189, -108, -145, -362, 175, 241, 130, 246, -109, -400, 208, 75, -120, -59, 45, 79, 43, 171, -237, -101, 67, 40, -217, 40, -30, -26, -93, 290, 447, -52, -426, -106, 80, 120, 31, -44, -285, -366, 206, -72, 5]
6254Ek81J74J67j35J75J5l34n95R59jq5l9m80M32r8K56l64L8l8j16N19l72L97
6277A99n50K84J84K47m30q6n9P5L40j07L4l14r7J96j1K60k94J34m3J16N0p3k01
6300a46j5l5K60K55k22j18n0L19o8J79m8m44K64P6J03j70m90P5M69K0j13p8q4
6323f1l8K51j37MR5m35L22J9L64o28m0J15L49J42j2m46L20j25J20J6P2m35K1M69
6347C22j54o9R7j39r7j63L21J67J3o71K01O9M54k95m51M58J0k5j4L3m28L30K56
6370B25O4n5n37NK50J29k4j8k14j74M17j3q2j27k12N03j50L56m18r7L79j0r7P7
6394A77k07p4L62l36L50j61j31j15M5M22l39J80l40k73L31M90k57j15l69K03J94
6415C7L34l58O8k04J05J70L06l94k82J6K74J53l02J55j73J90J90k4j39m49J26
$$ y = [5, -276, -102, 65, -70, 105, 120, -214, -809, 150, 149, 64, 25, -455, -23, -121, 135, -229, -191, -229, -345, 174, -198, 199, -351, -67, 117, 364, -66, -152, -211, -136, 204, 97, 131, -183, -280, -84, -95, 165, -129, 5, -38, 78, 128, 55, -146, -161, -196, 64, 319, 97, -21, -71, 248, 180, 359, 311, -133, 131, 207, 310, 140, -350, -275, 194, 214, 101, 23, -61, -99, 152, 15, 19, 114, -321, 1, 20, 384, -244, -284, -169, 180, 322, 310, -136, 184, 59, 179, 195, 267, -168, -147, 322, 168, 99, 196, 57, -40, -203, 118, 285, 298, -373, -172, -103, 351, 56, -395, 63, 73, 48, 34, 67, -361, -31, 225, 289, 234, -303, -298, -48, 81, 57, 39, -175, -349, 68, 55, -27, -154, -366, 137, -13, 343, -75, -172, 207, 197, 100, 177, -30, -104, 258, -78, 272, 111, -20, -135, -90, 332, -7, 173, -167, -440, -109, 381, 124, 9, -360, -157, 37, 371, 13, 81, -123, -18, 152, 458, 64, -218, -202, 72, 225, -77, 78, -95, 95, 285, 261, 122, -327, -201]
6436b01m1M80j93R6N9l58L93j28K51l53N5j89J87Q6Q5m19p8J74L49N6k56k19O0
6459a04L55o4l74k0J96J05J32k79J48j35j40J2M55p2j58m47K87p6N37n40K47j57
6481i2J07n3o8j30j9L17O9N1J7j76k98J08KL40k23j16k68L66M77k97k25j58K07
6504f2l71R94m29n46L66p5L00l04J38J4j30K19L0Q2k55m26J63L67K56p7l89M4
6526i1k92L27L47j27o44L34K93k45K84n56K46k20M16K11j74Lj72k13N13j14k71
6547a45j54o7M15r6M39p68M35j67L46J26j81n85K63Q4K65n0p5mk76M33q7j46j16
6570a11j47M10J5j34J50m18J56J96p1N8Ol44p8K93K56k1ok93q9P9K66k95J12k31
6594b41K68L39l05K4n50L70J91Q6k71k28j3M58P5k57Kj45j8M16L10m21k36k27
$$ y = [-201, -242, 238, 45, 141, 200, -158, 235, 107, 358, 5, 60, -129, 58, 144, 229, -190, -268, -94, 255, 311, 55, -164, -104, 251, 187, -187, -207, -11, 94, 226, -53, 95, -40, -180, -168, 287, 215, 57, -390, -103, -179, 358, -182, 65, -92, 15, -38, -106, -236, -255, 62, 131, 182, 199, 23, -275, -167, -165, 175, -48, -164, -432, -66, 411, 114, -111, -269, -62, -433, 561, 132, -414, -48, -123, 177, -127, 11, 25, -105, 114, 144, 226, -29, -455, -292, 75, 331, 254, -135, -91, -383, -56, 291, 164, -480, -146, 147, -98, 186, -370, -124, -344, 72, 283, 109, 112, -60, -273, 240, 126, -145, -299, -366, 49, -47, 392, -376, 59, -108, 238, 364, 183, -402, -139, -55, 210, 160, 85, 81, -195, 238, 151, 5, -111, -258, 152, 167, 33, 183, -235, -79, 117, 46, 104, 110, -234, -312, -19, 237, 216, 210, -83, -172, -93, 173, -122, -10, -241, 27, 366, 61, 85, -465, -95, 96, 182, -89, -317, -330, 128, 203, -54, -52, -197, -215, 201, 511, 90, -146, -373]
6616c73J38N32m5k82j04j65L49j22L24k56m36N93J33k72Q2j35j94M42J62k54k62
6637a45J62J8L3L6J99m06nK7L6K45l94mM8k5K97k26N2J9j80K0O0Q4J6j25K4L99
6663B65J43m36Q6j02n6K65M4l17l46J95K57J92r3J82o65M16K69j55k0j82k71M49
6685A20j33Q5j21l94N77o6K53l36n33L99L07l8n6j52j14n9M99j54j88oj8J57j79
6708a50L82j69L0l71J88M1J40L9j21m2j5P8j22J76l52J57N18j97k23p6j59L04
6730E6J57o9m15j11lK50O27j03m00k60mK22l6J12l25j97N81K59n00K55l36L22
6752H2J83N2k67p6j17K71K57j76p7n44K12K26J10l03K7j75O08k31K41O5o46K66
6774a2n8M43l3o26N4L84K38j96r0mn69J37L93P4k8l52Q0P4M29j98k73j13L07L7
$$ y = [-373, -235, 297, 252, -30, -134, -299, 50, -72, 252, -4, -440, 153, 286, 14, 96, -39, -233, 209, 371, 117, -145, 17, 35, 68, 104, 303, -103, -108, -81, -45, 200, -194, -198, -150, -175, 122, -104, -52, -33, -213, -193, -133, -49, -33, -158, -134, 265, 408, -28, 58, -44, -100, 165, 209, -108, -454, -259, -2, 190, 97, 279, -386, 30, 299, 144, 124, -58, -329, 120, -13, 72, -49, -443, 134, 68, 321, -15, -548, -149, 158, 120, 64, -88, -202, -261, 238, 84, -104, -110, -128, 29, -150, 232, 63, 93, -278, -90, -49, 91, 130, 9, -33, -48, 30, -92, 84, -268, -111, 407, 210, -13, -89, -248, 56, 213, 144, -271, -382, -385, -135, 492, 389, -11, -271, -275, -53, -89, 23, -302, -499, 82, 341, -159, 96, -240, 82, 265, 317, 50, -26, -143, 128, 385, 209, 132, -412, -200, 26, 136, -167, -140, -315, 293, 62, 303, 368, -278, -12, -70, 373, 340, -286, -232, 152, 390, 194, 104, 100, -469, -332, 61, 135, 107, -245, -165, -91, 338, 140, -133, -246, 61, 98]
6798I8J61j54n27J87K00R8OM4n49N06k59L76j76l8q9L96o2q2k42l7rL26Q5K3l8
6823B44n40M62j24J07l6k20j24k7K92N89m77k91J52K59j78P7l00j27R0K2J47L5
6845C2R8m24N44J36l50q3j13l4P1J82k19l8L7K68K53k04n1k80J45K04OJ53k69
6868F4k61J46J8L71l34k7j29N0L39j79M53p61J23k41P92k56o49M12K19o4k6L30
6890C90p60J60K25o9R8j04L0k64N89j42k4J28n04K49J19Kpk94R2J43K16l13J49
6913A09k88J33Q7L1J27l80l9L7K68J07K11m15l18q8O95j12l30K22l80N38N4L7
6935C06m46J00L1K33l6j72r4k53J98j5m9M6J81j02J62J79l18k4l6m8J70J76k64
6958g5j61J67L72R9n38k04O1L42K36q0j37M8j35j75M50j66O7o01L00K27J90n3
$$ y = [98, 259, 105, -422, -235, -35, 63, 69, 113, -436, 70, -189, 187, 11, -27, -116, 280, 218, 136, -106, -143, -152, 174, 259, 282, 244, -296, 166, 42, 149, 113, -107, -231, -258, 34, 623, 146, -145, 7, 266, 88, 165, -135, -262, -172, -150, -3, 32, 130, -294, 250, 386, 36, -47, -160, -194, -123, 59, -160, -198, -161, 107, 360, 156, 105, -175, -30, 174, 180, 333, 64, -197, -51, -33, 338, 4, -23, -152, -102, 237, 58, 511, -250, -127, -368, 424, 168, -481, -69, 150, 86, 60, 390, -370, -210, 15, -54, 44, -60, -30, -294, 295, 153, 129, 257, -247, 2, 121, 123, 116, -178, -86, 57, 273, -40, 109, -179, -46, 41, 72, 199, -181, -220, -183, 85, 192, 403, -12, -330, -418, 277, 165, -165, 57, -323, 215, 269, 306, -140, -40, -9, 224, 188, 16, -78, -331, -133, -148, -197, -151, 30, -72, 90, 269, -49, -73, -109, -157, 13, 189, -75, -236, -69, 303, 402, -136, -340, -279, 63, 299, 219, 82, 130, -5, -180, 270, 104, 171, -430, -130, 97, 287, 234]
6980B34l05k38L35J97Q9l15k49M44m6K69k52k37j07J56L42J38o02J97k51J68M61
7001D28j67m82J83j87M22m2J68m23m34M81kO23m23l16K3N8M61j5l85L6l82N37
7023A62k15j73m8J28m9O26j57l21Q5Q2q5K20j43k85j96J24N39r2k72k00O7K88
7045H5J41k09J32o03L4M65L02k84k13r9O19lk47l06J77o5o7O05l81j12m77M35
7067g1K11J61J04l68l45J57K95K30l47l35r2N39J01l51j07l22L81L39%p07N86
7088E9m10L34L01j58l30j45l6L15K99q8j73k94J39K45L00k24n10K00K16K49k66
7109B3j20j79K16K33n6j12p7k99M08J17J50m60K47o4P0m16K61k34K48l3k8L96
7131B91k68l49J06M31q2j05K05o85L17J6O74n37l07L75j22M6m0L3k3J5N5J89j7
$$ y = [234, -71, -309, 26, 223, 312, -3, -252, 192, 146, 415, 163, -74, -181, -25, 317, 455, -147, 50, -201, -33, 428, 261, -221, -38, -225, 197, 155, 323, -100, -534, -53, -55, 568, 145, -171, -148, -90, 371, 356, -29, 7, -375, 162, -53, -226, -274, -146, -195, 431, 274, -47, 38, 120, 35, 255, 112, -173, -369, -245, 294, 202, -70, -270, -203, 85, 226, 17, 149, -454, -420, 45, 347, 63, -150, -249, 370, 367, 120, -186, -9, -74, -141, 464, 83, -29, -506, -71, 140, 301, 405, 37, -308, -151, 144, 374, 27, -308, -400, 139, 240, -111, -218, -540, -159, 180, 180, -527, 59, -351, -17, 284, 126, -204, -349, -385, -70, 229, 141, -32, -326, -187, 58, 358, 134, -376, -176, 40, 289, 23, -97, -276, -60, 173, 117, 5, -72, -371, 37, 154, 304, -156, 91, 27, 97, -319, -58, -292, -44, -77, -105, 291, 23, -326, -220, 211, 129, 24, 229, -456, -139, -123, 551, 14, -293, 82, -40, 6, -34, -1, -24, -9, 46, 235, 218]
7154B18k21L3r5j05N11l74q5k42J10N34O9n71j67m8L74K76M15p27M1O4o7J68K5
7177A36n92M08J91L91o86m7j96QR8P14m13k92mJ58M52j79o8m41o6N54K53K6q24
7200d19M25kK25q6j09j7j59M47J13Q9k43n23J61J37M86n10k65j4J29Q6J43j7m2
7223C5l20K56L27m05K66p24L06J43L15R2n75J57O3L21q2l22J21K94P9j07k83k05
7245b48k10K41L25Q3j74k44n5Q3M41k45R5k86N4K53M35o78j74J24M28k62J85p4
7267I7k35N4j15O56l55j81k92O14N4j41p9k06o21O05N53R5l00m38J06K37L68m00
7289G6k57J72l6J24J37j14j22k79p9J073o60L2l88j76M97L51Q9l12l46nk0N85
7311C42m46l03m9P04P9j75m52j90L01L55o6M3o24M08J47J31j0l03K4m23O23L89
$$ y = [218, -3, 30, -65, -170, 341, -33, -118, -360, -250, 284, 353, -218, -385, -433, -59, 217, 632, -95, -54, 10, -57, 111, 136, -456, -48, 143, 534, -152, -199, -395, -387, -289, 425, 12, -280, -284, -126, 326, 147, 79, -362, -428, 126, 379, 405, -419, 6, 4, 229, 143, 34, 17, -142, 305, 418, 507, 264, -259, -98, 39, 525, 15, -250, -264, -135, -49, 94, 77, 35, -285, -29, 298, -107, 159, -565, -259, -116, 199, 291, -284, -127, -64, 257, 175, -147, -26, 268, 347, 240, -43, -248, -458, -217, 108, 191, 17, -227, -282, -199, 242, -3, 92, -194, -140, 113, 548, -130, -304, -180, 248, -14, 171, 97, -138, -84, -199, 457, 102, -79, -371, 243, 297, 156, 77, -129, -750, -145, 408, 503, 203, -235, -129, 108, 476, 76, -181, -9, -45, 79, 216, 102, -20, -299, -378, 695, 35, 67, -321, -497, 0, 351, 440, 128, -218, -223, -243, 342, -104, -407, -456, 248, 327, 152, -300, -490, -189, 166, 100, 143, -481, -73, 74, 205, 195, -108, -84, -507, 116, 505]
7333E05j73n58j42J90J75J87k65l67r4N25L17Pn48j03J67K56K3K70m89k92L08
7354a01K76Q7m89qJ30N28j87k23N9l25L60J70J69q08J03J31M04m65L34k78q1P5
7376a39l5N79n12l4J84j52J11P13q67j72M65k79l1L44l62j23j04Q03j22k50k57
7397b40k66L48M17L04n53l56r0P19L71o07J43m96N12P6k37r4k76K49K25K06j42
7418B13j60l68o5N56L06o3l54o7j29M03k02l27l24K43K43M53km71n65O74L36J6
7440C46m98L0n1K39pJ43k1l81J2O10k90j6k25j51l9K69M76k34p57O01Q9j0j07
7463B8l54L14m87N92O0K90n00k39L95o5M80o36k03J92J5N00m04j25j90L09J49
7484A21J45m02m26J57O53l06L27k52j16k71M13M67n46P5l38K54K02L30n25j01
$$ y = [505, 332, -226, -368, -178, -3, 184, -81, -448, -542, -17, 300, 307, -241, -344, -177, 79, 102, 372, -117, -409, -101, 175, 262, -227, -235, -105, 423, 236, 13, 72, -253, 107, 277, 446, -362, -259, -128, 276, -189, 145, -133, -214, -139, -174, 405, -107, -141, 43, -109, 2, 715, -152, -324, 141, -138, -169, 175, -187, -310, -414, 389, 267, 17, -240, -506, -158, 259, 563, 10, -346, -436, 283, 654, 47, 190, -306, 206, 282, 45, -49, -325, -76, 149, 355, 213, 53, -315, -380, 176, 482, 419, 65, -2, -131, 272, 70, -257, -581, -338, -95, 358, 356, -115, -680, -6, 330, 346, -152, -122, -173, 66, 59, 202, 181, -200, -188, 422, 132, 116, -109, -260, -299, -30, 446, 212, -545, 56, 145, 135, 28, -326, -12, -499, 93, 153, 443, -57, -296, 99, 34, 514, -122, -325, -133, -118, 382, -22, -147, -337, -28, 121, 266, -136, -562, -405, 248, -58, 269, 17, -99, -370, 43, 510, -36, 39, -299, -45, 157, 487, -38, -139]
7504a39L5L56k6j55m03O4K08K56K85m02k15m7K12J5K46l23k98j34L49N48l75l43
7526b86P0p9M26J76q3j65l01M65r4J20k32l64O5L96J40k3k87l43J98K40m2k89
7548b92k65N95N4R7J81n30J66R9J25j23j21m4j10K89K80j31R8o27k59L85K95K09
7570C71q03M5K95J22M35r23J64L12J4N40l77k41j66J66L66K3k52l25k81K10P11
7591D06L54r18PM9P4N23l79l53j41M18J73N0l82k83j5Q4J21M45j93k37j8K02L8
7614B5K89m16o5Q7K67K42l36n22R2L35L46j22m85J59J17r2L43q6l81l70N61L31
7636C19J12q8n58N8K54J47O9j92j74l18K57M6J01l18k15P11j19K34n59k6j58N24
7658A07J93k46j98j50o5M46j17r4o9k20M86L17J77j040J88P2N10k03K0o4l85O0
$$ y = [-139, -104, 252, 226, 71, -332, -268, -60, 196, 481, 79, -136, -183, 29, 44, 290, -33, -331, -465, -116, 432, 57, -286, -216, -295, 131, 307, 224, 59, -242, 223, 129, 249, 17, -347, -282, 114, 254, 231, -56, -399, -201, 39, -3, -292, -557, 38, 92, 189, 370, -160, 6, 105, 230, 107, -14, -58, -168, 121, 401, 270, 368, -259, -518, -133, 162, 371, -432, -387, -92, 30, 465, -458, -294, 18, 32, 572, 195, -46, -212, -46, 320, 343, 91, -234, -515, -305, 406, 760, -158, -151, -102, -28, 495, 116, -237, -378, 40, 213, 263, -119, -402, -417, -333, -212, 233, 40, -197, -215, -13, 25, 314, -102, -167, -80, 187, 429, 93, -429, -337, -2, 344, 222, -263, -104, 13, -79, 264, 178, -203, -573, -12, 319, 431, 343, -215, -157, 97, 244, 313, 121, -53, -371, -114, -68, 33, -285, -500, 211, 92, 326, -233, -259, -417, 107, 300, 54, -144, -294, -359, 87, -30, -124, -193, -413, 73, 390, 567, -473, -285, -213, 297, 94, 114, 50, -335, -275]
7680b75M19j47L25n24n3K99J59L46o44j05o9O73l83J71o2k63O1K00K37l15j4j42
7702a06K61M80j87m15p17M49N18J7k63l72K67J77M39k42k79m46M15K33J94l78
7722D5n4l28M77J65R8p9n01j95K64L16K9l67k03K51L57k56j04l10J64K87K54j70
7744A40l17O9j77K22K09m8n86K58K96J52p0Rk60j72N08L72m13j49n30J11P90J00
7766E14n91j43j41O09j26Q9l38j68R9L73J09q0j96k23p7M90K86m15m03J87Q0N0
7788a5L16l19m29M53J48J48o4m02o9L76J31N8n75K73k08K74K80m7n42L9j16J68
7810a22N58l20m42K32J1LK07j05l89q7O45k06K58n40j52K52R4J85J00n32M5L77
7832G2K09R4j65o75J92L67L95l52l32r6K67l7K16j95j55J9L7N61n27M8k85j75
$$ y = [-275, 144, -3, 322, -202, -255, 44, 203, 549, -95, -200, -269, 404, 21, 192, 130, -133, -72, 128, 365, 50, 36, -106, 155, 635, 448, 33, -684, -235, 283, 300, 37, -335, -68, 109, 548, 306, 27, -419, -4, 229, 423, 45, -9, -337, 140, 305, 403, 324, -177, -372, -108, 208, 237, -130, -333, -82, 275, 19, -85, -395, -231, 56, 310, 140, -177, -108, -285, -63, 146, 98, -488, -230, 66, 218, 148, 157, -103, -275, 233, 605, 192, 43, -487, -376, 414, 514, -77, -220, -361, 248, 122, 211, -127, -295, -196, 177, 286, 206, 10, -213, -290, 200, 486, 71, -332, -145, -65, -15, 301, -18, -447, 6, 154, 302, 238, -164, -233, 143, 274, 332, -243, 30, -178, 96, 376, 329, -213, -174, -290, -122, 436, 116, -326, -94, -83, -80, 127, 22, -367, -454, 191, -15, 243, -297, -449, -197, -103, 82, 182, -350, -305, 72, 281, 375, 210, -465, -273, 94, 489, 137, -195, -291, -24, -61, 155, -40, -195, -176, -139, 422, -105, -57, -342, -517]
7854e17R41L96p93j96q1N81j24J81m69k85L66J39R2J50n51j45J66L92K21o24J26
7875c4k64L39M13l36l87p2N0K37L81o27L06o5l7N68k52q9k36l57K58L27J39j83
7897G9o93M60L91L39m08l86k10N21J14M2m43k53J15J83L19k75l00K76N73m19J30
7918A55P9n13k53O65M7k39l3k39J47L56J53l24j20k26J37O85J84r85P7L32o5J22
7940A42J09j14m54L34J04J96l23o4k98J85P70m88p40M53%rN18l77l6j9l1M81k36
7963A03q3m30L6K78M12j35n6l49l09Q79M34p55l32q4L16O93m40j17n42M17M3N29
7985E08k45m27k25M14O9l2K03l92j05J54L16J9m58k26J17M31L59l31l38k66L23
8006a32J39R2n07K09K39o7K37K63p78j09K89N72K32q54OP8L79k5j01n36K83jJ2
$$ y = [-517, 424, 820, 27, -169, -250, 331, 207, 388, -81, -366, 0, 139, 231, 381, -170, -315, -149, 243, 464, -160, -34, -298, 41, 454, 118, -269, -341, -291, -54, 327, -300, 6, -59, -96, 472, 220, 131, -105, -462, -204, 123, 262, 79, -614, -154, 237, 576, 168, -218, -428, 93, 207, 249, -194, -447, -332, -149, 170, -105, -405, -129, 444, 25, 155, 234, -279, -532, 133, 180, -59, -92, -331, -184, 172, 325, 1, -119, -345, -208, 477, 661, -324, -247, 85, 20, 142, 251, 137, -317, 17, 121, 317, -6, -70, -368, -183, 587, 99, -641, -188, -188, -197, 321, -56, -92, -111, -142, 339, 103, 20, -410, -374, -96, 316, 181, 125, -224, -533, 346, 780, 25, -307, -391, -75, 618, 178, 61, -481, -64, -21, 508, 263, -164, -389, 25, 94, 62, 265, -127, -232, -78, 238, 257, -201, -427, -310, 121, 480, 149, -189, -455, -132, 7, 99, -408, -199, 40, -27, 210, 473, -305, -414, -125, 447, 679, -175, -169, -91, 288, 263, 162, -374, -91, -92, -80]
8029h0L54n51J89l32J41M63PJ22o01q3L11M35P6m67n52R1N64J37j39n18j67N53
8051d7J69N40o03k37q8M79k21J31k04l47K90J66j4N4j52k62J06M55o2m54K53k58
8073c06P33k48J79m55n6k28L37jpl59P8K66K18L47l08l80J30M61rk40l55j4J33
8096h4M30k42q4k00LJ91lJ86k40k94N9K09J58K98m44k88M64oJ08j79l80m2O08
8119B28N3n69J79j31M9M14N5k33k39J84o1N05r7k02n18L63N08lj57m73l81L29
8141a97M80j01l87j89k70P41L66m67M2m5j5P5M79m35k46k05K87L34k7l11k12j55
8163d58Q11J94n49k64j48J88K94J84q9j73k19J25N39k97j24l65jK64J97J06l87
8184a72j13j19M17K21k92o9J
$$ y = [-80, 274, -277, -88, -420, -279, 184, 191, 313, -288, -371, -60, 375, 451, -16, -568, -477, 87, 224, 85, -433, -600, -47, 122, 662, 59, -178, -266, 213, -8, 123, -81, -428, -138, 28, 14, 68, -84, -346, -240, 215, 153, -301, -48, -306, 427, 179, 358, -97, -153, -381, -44, -45, -52, -411, -333, -67, 151, 498, 190, -190, -60, 401, 392, 152, -203, -217, -84, 346, 104, 20, -180, -177, 14, 11, 197, -43, -337, -278, -69, 89, 387, -57, -345, 119, 113, 221, 42, -338, -380, 228, 281, -288, -109, -240, -191, 223, 278, 45, -194, -10, -71, 434, 337, 135, -383, -20, 488, 485, 328, -145, -526, -197, 283, 182, -205, -394, -664, 77, 443, -24, 18, -27, -42, 33, 512, 77, -169, -374, -87, 247, 220, -91, -303, -458, 353, 547, -2, -266, -414, -226, 68, 252, 163, -10, -229, -104, 435, 138, 14, -351, -352, -88, 109, 215, -172, -285, -404, 13, 234, -58, -127, -126]
8191a26
$$ Imaginary data points
##PAGE= N=2
##DATA TABLE= (X++(I..I)), XYDATA
0@%%%%%%JrJ6j6K4l2L2m0N0n8P2q8J04j21J40j64J93k23K55k92L35l82M31m87
30b59N49o18O95p75Q65r66J075j194J326j470J626j800J994k209K448k713L011
47A585l353L744m195M727n362O134p104Q357j0043J2462j6237K2987l8708J39908
61A14902O5844k89862k3516P8862J08050Q6638q7537j97020O4330J33173k3207
72C0657J587L0991j27348m3247J20476N2113l949j0092j52358n4876K19587J12475
84A76016j54573j09720r164N0617J56649K9450j98526o6895J15495L4889J9983
95D4221M2774j09342r7615R0407P8231J1341J9211j16829j31645J42517J81428
106A54699o8745j28728n4866N890J46788J05860j54183j32192Q5179O2361K829
$$ y = [0, 0, 0, 0, 0, 0, 0, 1, -8, 8, -8, 16, -16, 16, -24, 26, -32, 40, -48, 56, -65, 75, -89, 104, -119, 136, -156, 179, -203, 228, -259, 290, -328, 367, -408, 457, -509, 566, -628, 698, -772, 854, -946, 1048, -1161, 1287, -1426, 1585, -1768, 1976, -2219, 2508, -2854, 3280, -3824, 4533, -5510, 6952, -9285, 13702, -25006, 114902, 180746, -109116, -132632, -53770, 54280, 140918, 53381, -143639, -79309, 53864, 30657, 32244, 63235, -64113, -107360, 13116, 65229, 61280, 51188, -101170, -156046, 63541, 176016, 21443, -88277, -97441, -46824, 109825, 139275, -59251, -126146, -10651, 24238, 44221, 86995, -22347, -119962, -29555, 48676, 60017, 79228, -37601, -169246, -26729, 154699, 85954, -42774, -97640, -91750, 55038, 160898, 6715, -125477, -40298, 22063, 24892]
117B4892M3240n1675r5652M0063M9085k92O9717k1228j72137j941J75956N4795
129A14823o5122r4869r4985Q8452K03094l8068j91122k2593P4521N4416O3068
140I1615m6695j27882J9651Q3876q796K7058K7784j12853o0186J05144P1243o367
152F3592l8481j14817k5149J72749P8705j27190q5164J2768L9415R3038K0837
163I0303j22296m7517O7353J4998K0778N2366p0673r9514M5823Q0600L3108K675
175F8004j03144j01556J11507J49302m9665j13353m0353J8456J01091O9706j00322
186I673r2618N1890M0160O87M1115k0492q0942J562M2783K6679N1665l0869j34478
199i3185j975J43385N0354o4546p9343n2840O7597J33314k4473j28505j6678M8741
$$ y = [24892, 68132, 16457, -79195, -39132, 9953, 9661, 79378, 58150, -113987, -115928, 60028, 114823, 49701, -45168, -140153, -51701, 151393, 113325, -77797, -100390, -25869, 28547, 91615, 44920, -82962, -63311, 20565, 11769, 38827, 66611, -46242, -106428, -1284, 69959, 63592, 25111, -89706, -114855, 57894, 136599, 9409, -75755, -62987, -23572, 69466, 90303, -31993, -79510, -12157, 2841, 23619, 75985, 5312, -94202, -48379, 32221, 65329, 68004, -35140, -136696, -25189, 124113, 74448, -38905, -79258, -60802, 40289, 109995, 9673, -82945, -31055, 9105, 9792, 50907, 30415, -50527, -48965, -6182, 20497, 72162, 41293, -93185, -95160, 48225, 98579, 34033, -45310, -98150, -30553, 102761, 78288, -50217, -66895, -18154]
211a8154K9250M2254j0168p9771j4357M0664J4233M0158J9064r7423o3360Q3995
223a3615Q2569n321n6187q5535k872J27128N6126r5160o7328J6366L2104N3258
235D1533J7137o7932l8579K7946J0809K6863M7381m8243r0374J7745P8797M3429
247F6512j2630q8982o9217Q4260J13326l1917r1937l1312K2102O6203M3719n5674
259A4453o1005J9056K1208Q826M0295n404o9620k4157L9287M9328L4706m3660
271B3313j01600M696J13151M3381n9545o8219k3238N4183Q0948j5845p8582j5972
283d3329K6638J6869L1422Q524m8444l4436J2215L2314M7836N086q4883n4363
295h4551O7151Q0915l626o4289o2849J3791R0202L5591o4430n1116R449K6520
$$ y = [-18154, 11096, 53350, 43182, -36589, -50946, -10282, 3951, 44109, 63173, -34250, -97610, -13615, 68954, 63633, 7446, -78089, -80961, 46167, 102293, 7133, -60195, -43829, -11725, 41533, 58670, -9262, -47841, -19895, -9086, 17777, 65158, 16915, -73459, -55714, 23083, 66512, 53882, -35100, -104317, -20057, 93269, 61352, -30585, -61897, -39795, 26408, 70127, 14453, -46552, -27496, -6288, 2538, 42833, 37429, -32191, -56348, -17061, 32267, 66973, 23313, -78287, -73591, 39560, 82941, 23396, -44823, -68061, -13878, 67070, 51225, -27357, -43329, -16691, 178, 31600, 40124, -8320, -42756, -30541, 1773, 49609, 54695, -30188, -84551, -17400, 63515, 59889, -4400, -67249, -53458, 36744, 72335, 7905, -43211, -33762, -7242]
307g242L1824J4185l1974l3902k870J2956L8921L6700m2957p7266O423P5139M6418
320F6355k6950p8040l8238O6437P8128k0957o8318k6328K2013M3408K4439k4319
332A7630l6823p269O326K1795L9280l538o0624l5048L6228O2820K1238n5374p3300
345f6659J4097Q4923L4900m9639n9373o513M5004M5141q517m1752j9064N752J6075
358e625K8868J4349l1433m5045l593M7591M9764j2527p3652l7523N3745P0610
370E5529k558o4397m5557K5014N9491J8879l5447l6633k849J8673K3776J4886
382B8807j0271l3685k5129J8151N1473K3744m3816o1648K191O7900M6277l5659
394B8335o9405j4220N2667M8511j0011m7515k5529J7163K9705J4348l675k0491
$$ y = [-7242, 24582, 38767, 6793, -27109, -29979, -17023, 21898, 58598, 15641, -61625, -55202, 19937, 66355, 39405, -38635, -76873, -10436, 67692, 46735, -21583, -47911, -25898, 17510, 41949, 17630, -19193, -26462, -20136, 1659, 40939, 37401, -23223, -58271, -22043, 40777, 62015, 6641, -66659, -52562, 32361, 67261, 17622, -41751, -48264, -3260, 41881, 33364, -8388, -27452, -21700, -5625, 23243, 37592, 6159, -38886, -42479, 5112, 54876, 42349, -31303, -68826, -15081, 55529, 52971, -11426, -56983, -31969, 27522, 46401, 10954, -25679, -28528, -9855, 13921, 28807, 18536, -15149, -40278, -22127, 29346, 53090, 9274, -52374, -50183, 17717, 63994, 28335, -41070, -55290, -2623, 45888, 35877, -11638, -37167, -20004, 9701, 24049, 20374, -117]
406a17k7779l324L5308L6902p681n1901l7154L1926O8509J1653o1828n0197K0224
419c5459N8976K7996l4856n1221j736L7050K2869j456j4347k4833j2840J9948
431i909L2243J3075k3522m8061j1665N6735M9303k8230o2396j9853M0399N6487
443D4606J186n9003l4065K9603L6271Q292j1641k5479j7397J2876K3955J5253
455B4457P60l3556l8682K3306O0471J0873m6545m5268K188N6922M3142l7559o0029
468c9520J553L9966K5127J43k7412k8335R248K3315J0073Q759j0727m1653r737
481c9200M7040L4628j5218m4012l3416K6935O8078M982o3580l2064K4469L6978
493A5620K1378j9282m3955k479K9985R733M364M111k9741k6380K4355L6151Q796
$$ y = [-117, -27896, -31220, 4088, 40990, 33309, -18592, -55746, -23820, 44689, 56342, -5486, -55683, -35459, 23517, 51513, 16657, -34564, -36300, 750, 23619, 22163, 7816, -17017, -29857, -9909, 22334, 35409, 11887, -36174, -47839, 8896, 58199, 29969, -32427, -52280, -11881, 44606, 45792, -13211, -47276, -17673, 18598, 26890, 15249, -10230, -27627, -14751, 9204, 24457, 25217, -8339, -47021, -23715, 36756, 47629, 1084, -44184, -41996, 14926, 58068, 20509, -39520, -37967, 1999, 27126, 27269, -143, -28478, -19230, 4085, 14158, 22917, 12190, -29463, -39200, 7840, 42468, 27250, -16762, -50178, -23243, 44835, 49817, -13763, -45827, -21358, 15620, 36998, 17716, -26239, -28718, 1267, 11000, 15364, 19475, -10266, -36646, -12291, 23860, 32656]
506C2656j9983m5917j5011N9410M5886l7378n1578n615K8215M1615O296m8268
518i672k7362K6535K0261L397P621j8467l1829R086K8915J5556K973l3092m3519
531d9597K7007O4160l99m7843k9223L637M3759L7274l4039m9990J0278K8943P897
544A1864Q214r576l1360p94K0695J0334J6066n833n0426j2689N4856L2233k2949
557B0635l6905k7086K2749O1989J785o0205j9649K5382J9537J6503n290l6669
569a7224p792K3915N208R017J3053l3688l3905K9710L8892J301j9572l8119j3902
582d3106N4610L9984m0041m0936N032J7204K6383J2981l5427k5587K0236J0596
594A929L452K0622j5005m3096O075L5890J6100q24l2315m1837L0180O2054q503
$$ y = [32656, 12673, -33244, -48255, 11155, 57041, 19663, -31915, -37530, -9315, 32300, 38596, -9672, -37034, -10499, 9762, 13159, 20780, 2313, -29516, -20430, 8485, 24041, 27014, -6078, -49597, -22590, 41570, 41171, -6672, -35895, -32258, 11501, 48775, 14736, -35254, -24976, 3967, 11864, 20078, 10502, -20858, -21652, -957, 9377, 25443, 19610, -30816, -43505, 11351, 43584, 20635, -16270, -43356, -20607, 41382, 43167, -17038, -36687, -11305, 8232, 24735, 19445, -17224, -25016, -1101, 4107, 13124, 26177, -7511, -41416, -11706, 27186, 28487, 8915, -29204, -43106, 11504, 51488, 11447, -29489, -24457, -7253, 19130, 32111, -3316, -28903, -8667, 1929, 5381, 26003, 10998, -32098, -26023, 9867, 25967, 25143, -7172, -49009, -18829, 43225, 34722]
607C4722m7634j6819Q002L0028L0381k7175m0260J3405J9049k678J4600K798l2975
620a4556j0273J9952J3135J7954m805n2204j3079N7415K8696k7467l1181j8533
632c4946J7025N2475J949n2367j3056K2961P879J3795O448l1298j5032J8414Q158
645B405J1430J4145l4911l5992L2856M0067n349k0546k8574j0937M6398L2647
657D3639l7496l0712J0607P558J4370J8629k2236k5231J0523N324P653K6854j3571
670A5911m9059L427M1166J6123n535l1017l5600K9068N7038j2693m4603p893R823
683a3844J8658K4158j8083l2185J0344J1876o011J8825R677l4252j6712K1289
695f260J6820J4688o486m8192j0713N4171K4996k9748k4535j1354J1716M0732
$$ y = [34722, -12912, -29731, -21729, 8299, 38680, 11505, -28755, -15350, 3699, 1021, 15621, 18419, -14556, -24829, -4877, 8258, 26212, 21407, -30797, -43876, 13539, 42235, 14768, -16413, -34946, -17921, 34554, 36503, -15864, -28920, -5959, 1920, 15715, 22163, -9135, -24167, -5753, 2405, 13835, 27980, -6931, -42923, -10067, 30000, 24651, 4105, -24469, -35406, 10992, 43639, 6143, -24569, -13962, -6404, 7966, 26595, 4359, -20872, -10349, -5025, 2628, 29482, 15911, -33148, -29721, 11445, 27568, 22033, -8984, -44584, -15516, 41522, 28829, -15774, -23667, -13844, 4814, 28972, 10889, -21296, -10952, 924, -5087, 13738, 23415, -10837, -27549, -6260, 10560, 25248, 18762, -29430, -40143, 14028, 39024, 9276, -15259, -26613, -14897, 25835]
707B5835M559m2078r792J6855O97J3582J5400k6966k3445J4440J3340J3799J1063
720B7289l5846l3808L4315L9377j0878k1607j9375o557L6677K5822l2062k2907
732a9560J2149J191O184K1950j1096k6028J933M767J0582K8156j3261m9614J697
745c0950M3575J5942j1064k7046k8503K5802M8263j2421l8719k310Q613R139J9833
758B0154p586k6008L609O530l940K1654J1198l5455k0287K2923K1041R568j0135
771A3266l9888p347M8386J9193k8640j8099m613N323K8875P852k9327r470Q975
784e514l099J4780K0672k2966k8847R189J8798J5750N894l3711l0245L2486L7165
797C0352j2452k2259j2489l462K7099K0091k3482j7087R032k681K736K3493l890
$$ y = [25835, 30394, -11684, -21476, -4621, -3924, 9658, 25058, -1908, -25353, -10913, 2427, 16226, 27289, -8557, -42365, -8050, 31327, 20449, -1158, -20533, -27090, 9587, 35409, 3347, -19560, -7411, -6220, -36, 21914, 10818, -15210, -13277, -8510, 2072, 30228, 16967, -32647, -30950, 12625, 28567, 17503, -9543, -38046, -12244, 36019, 23598, -15121, -17431, -8818, 321, 20154, 12568, -13440, -9831, -3301, -7241, 14413, 25611, -9844, -30131, -7208, 13833, 23401, 13266, -26622, -33969, 14417, 33610, 4970, -13129, -17742, -12419, 16456, 24308, -5019, -14489, -5514, -8613, 6167, 26839, 3873, -24974, -15785, 3013, 18763, 24657, -9054, -39299, -6813, 30352, 17900, -4359, -16848, -20310, 6789, 26880, 3398, -13689, -4657, -7338, -4602, 18891, 15001]
810A5001k5955n528O737J4340K4838j4364m5769J942M1499J4013j3536k3631j9748
823c0161K0378L7830r124k9756j527M966L694J7289J658k0190o475K513J973K3179
837A6247R582l5920k0670K3654K4022M435j3530l1709k458L8991J4480k4100j3588
850a0564j193J484J9247R793j7459j0083N71l133J6342K2084j9628l1755N514
863a8780K2310J7062L97l0776k3794K8171L1371j0273k0194r256r20J7795J6129
876A9242j3601j2804K398n103M369K3329j11k6508j0976R021J8707J8436j5690
889A0709l8010K762L6067J2162j4383j8902j2384J4526K6066m374j9095k405o85
902g946O21J6270Q670j6685j3725j338R280K3406M588l2875j9157K2213K4447
$$ y = [15001, -10954, -16482, -9745, 4595, 29433, 15069, -30700, -28758, 12741, 26754, 13218, -10413, -30161, -9783, 28047, 18923, -10833, -12360, -7394, -3700, 13589, 15247, -4943, -11418, -8905, -6932, 16247, 25829, -10091, -30761, -7107, 16915, 21350, 7820, -23889, -26347, 12644, 27124, 3024, -10564, -11757, -10273, 8974, 18767, 1308, -8775, -8204, -11337, 5005, 27089, 7461, -24294, -18780, 3530, 20592, 20989, -9787, -33581, -5410, 25961, 15688, -4506, -13762, -14682, 3113, 19242, 5641, -7163, -4765, -9868, -5499, 17830, 17719, -8789, -19765, -10744, 7963, 26399, 10709, -27301, -24539, 11528, 23690, 9307, -9595, -21979, -7453, 18613, 14239, -4856, -7261, -7946, -7325, 8945, 17615, 930, -12795, -14133, -4853, 18553, 23141, -9734, -28891, -6678, 17769]
915A7769J538j6439k2863K22K9418J0754j6974j0186j856p65J2458J1785q074
928F787j2299o344n79J8449J9462j7366l0155K414K3557J6799l967k6912j6297
941b6451K1678K4884o793j6225p436l64J0397J2553l713r601n372o100P468K1568
955A6493J726k5108j4596J0651K2457J2130j7677k8793L936K8370J0340j3263
967F666j5111o757R777J5964M35r669n454n074rJ5731J1669j2734j8971m112J5477
982b172K2003p24k9073j5215J8958K2591J189j7514j6082K966J8717P822q509
995D957q294m010j805Q829J3015j716j4172j2352L104K0917J3801j5896k5771
1008a9393N52K3796J5262q530k2239q596J5751J6675k145j1614o709j680N832
$$ y = [17769, 19307, 2868, -19995, -19773, 9645, 20399, 3425, -6761, -8617, -9382, 3076, 14861, 6787, -5512, -11856, -12435, 6014, 25476, 8110, -22045, -19631, 3926, 20725, 16758, -10154, -26451, -4773, 20111, 13318, -2907, -10343, -10707, -310, 12243, 8530, -1071, -6443, -12543, -5075, 16493, 18219, -6889, -21485, -10834, 11623, 23753, 6076, -22717, -18781, 9589, 19929, 6666, -8445, -15202, -5425, 10539, 10974, 1305, -4149, -9223, -9232, 6499, 18168, 5434, -13537, -17649, -2172, 19831, 19107, -9966, -25181, -6223, 16368, 17557, 43, -16039, -13073, 5644, 13466, 4957, -3337, -7347, -9152, -323, 12692, 10976, -3196, -15548, -12444, 8473, 22274, 6378, -19393, -18841, 4955, 20217, 11687, -10552, -19148, -3397, 13278, 11133, -481, -7190, -8870, -3038]
1021c038R839L657o394j2611o598J1513J9759M07k2195j5966J1390K4161O033
1034A9957j8236k0370M567K0532R230r348j2864l524N328Q500N120k164r115r465
1048a1852K140J5745J1275r812k1229n026J9244J9319o135k2582j0936J4125J9203
1061A3479J036j5774j0757L828R921O077j90o473q644k407P856J3121K788j5664
1075a803j6212O688K2218Q817j5529k0139m17K0716J4058j0031j7807l315R858
1088b898R431K875o021q489l323L517Q541R113n137j7947o455J5697J6822j466
1102A4260j9383j4562J0543K3404L069j8704j2325M271J2339Q313m139j1331l448
1115g693L010M026Q190L284j2287j3150N324J6055R077q483k0712n588K1318J6802
$$ y = [-3038, 6801, 10458, 4064, -8547, -15145, -3632, 16127, 16534, -5661, -21627, -10237, 13924, 19957, 1721, -18649, -14082, 6450, 15680, 6332, -6532, -10056, -4728, 3772, 8892, 6728, -2387, -11852, -9712, 6033, 17308, 7496, -13733, -18759, 485, 19804, 13669, -8913, -19849, -5724, 13479, 14515, -1259, -12016, -8188, 1733, 7810, 7620, 1147, -7497, -9904, -2048, 11073, 13861, -1803, -18015, -11327, 10891, 19708, 4179, -15960, -16377, 4339, 18397, 8366, -9441, -12756, -2898, 6533, 9408, 3387, -5102, -8425, -4908, 3633, 12746, 7609, -10338, -16793, -1096, 15726, 14260, -5123, -19685, -9142, 14262, 17331, -1373, -13698, -9427, 2912, 11225, 7086, -4245, -7693, -4683, -657, 7533, 10817, -1470, -14620, -9296, 6759, 15836, 7353, -13359, -18947, 2371, 19173]
1129A9173j0245j7346n757R051J5105K584j3187q500L787L548N289O576n788j3202
1143h912k265R533J2189L893j6101j7662R547K2659L016j4479j4003r66J5895
1156B344J3524r478j4182M19M278L971P729j371j1399n050L028Q206J1584l784
1170I819k1601n749J9068J4142m624j5133j3187R009K1437J095j7694o238L670
1183e986N445P979O58r782n138J476K073J0374P089j5256j5162P810J6280O368
1197A4228p589j8532n872K0801J4561j1569j3056k140L560J1339N677j0346p457
1210f395K073m76N633J1744n990j7359j251J1550J0732L061j5192j7658J1135
1223h393K2310j096j3730p935j501J0756J1947p156j1124J911K89O11J0725K923
$$ y = [19173, 8928, -8418, -14175, -5124, 9981, 12565, -622, -9122, -5335, -1787, 3502, 10078, 4290, -8912, -11177, -1644, 10545, 14438, -1663, -19325, -9778, 12881, 15897, 1418, -12585, -13551, 2344, 15868, 6390, -7792, -7373, -3095, 876, 8605, 7234, -4165, -9215, -6187, 2019, 13603, 9819, -11782, -17531, 1537, 15679, 11055, -4078, -17265, -8256, 13181, 14276, -3418, -9656, -5986, -541, 7438, 8096, -1686, -6824, -5348, -3275, 7099, 14188, -1068, -16230, -8420, 7860, 14228, 6639, -11893, -17765, 3036, 17597, 6028, -7028, -9168, -5608, 5731, 11408, 1062, -6395, -4322, -4798, 835, 12579, 6589, -10770, -12021, -471, 10261, 13322, -1870, -19528, -8393, 13917, 12821, -909, -8844, -10345, 411, 12358, 5202, -5922, -4011, -3722, -3111, 7614, 10537]
1237A0537j3796p177L926Q371J2030l714k3205m703K1132J1528p034j1452j0339
1250a3896O062J9440K92j5099l140K935m89Q326N331r241p455J005J788J0583
1264F442Q834j6292j6233J0597J5257L121o465j4852n787J7770J2925j1651r095
1277e429M97j000P055Q935o025q742m4j678O257J4846o462k0768o9J3805R027
1292A0205J293j3186j6127J0887K0197l536j2165l169j359N435J0734l936q711
1305c438J523k603j751J3672N552j5604q985M858Q825J1045l274k2215m606K1300
1319D299R516q792q008p674L128J6059J712j2766j540J699l806Q705Q881r195
1333B218r290J10K992J0969P686j6260j5526J1787J4857n65n510j0505n220J4169
$$ y = [10537, -3259, -10436, -6510, 1861, 13891, 10177, -13028, -17731, 3401, 14929, 7895, -3557, -13896, -7834, 11606, 11898, -3201, -6341, -3406, -3895, 4431, 9762, 521, -6934, -5929, -4141, 6442, 15276, -1016, -17249, -6652, 8605, 11726, 5261, -9591, -15378, 2392, 15317, 3666, -5429, -4932, -5932, 1123, 10058, 4033, -4709, -4753, -6431, -174, 14672, 8210, -12558, -12627, 1178, 10205, 11498, -1688, -17815, -6928, 13269, 9733, -2432, -5601, -6960, -1525, 9209, 5273, -3438, -1915, -4518, -6269, 7403, 12955, -2649, -11634, -6776, 2049, 13094, 9820, -12395, -17001, 4299, 13815, 5023, -2985, -10659, -7531, 8528, 10240, -2526, -4066, -2367, -6173, 2532, 11413, 2218, -7072, -6962, -3970, 6999, 14685, -1575, -17101, -5314, 9543, 8978, 3468, -7037, -12257, 1912]
1347A912R972r415n685J243m600M044J2166l046r819k695j760P613J4961o562
1361H329k1729R28J5111P039k01j1420j3301R791J7187m325j0183l72j983J613
1375c516R635L1o888r42l924j703J4544O606j6041j0250O382R304Q900l554j9557
1390a0973l569J8910P224q206n187n077l61J2167L722q605k180p88m660Q949J1236
1405A2602q728j2286M67N199J0040N546j4963j3162J1588J2391k182m558o820
1418d866m594R566Q358o235k986K43o550K496J2964J44j0676m854p63Q438J3516
1433A4201o623k0028P62J4918N993k328q658r967O824J3759l054o933M27l235
1447c942j499R491L013n656l699m481j0J4197N890j6047r530P316R062N582l494
$$ y = [1912, 11884, 2469, -3216, -1973, -6573, -2529, 9637, 6591, -3228, -5923, -7683, -70, 14891, 8329, -13400, -12472, 2639, 9678, 9477, -1943, -15244, -5453, 11734, 7409, -2774, -3146, -5129, -3516, 6119, 6150, -738, -1680, -5604, -7307, 7237, 13843, -2198, -12448, -6066, 3238, 12138, 8584, -10973, -14542, 4368, 11592, 3386, -1801, -6878, -7239, 4928, 8650, 45, -2135, -2923, -7583, 1366, 12602, 3874, -8412, -7945, -2746, 7294, 12840, -2123, -15285, -3697, 8694, 6512, 1954, -4866, -9460, 106, 8464, 2229, -757, -514, -7064, -4568, 8396, 8540, -2136, -6990, -7753, 685, 14201, 7578, -12450, -11688, 3230, 9223, 6895, -1763, -11730, -4906, 8853, 5799, -1134, -707, -3942, -5441, 4050, 7063, 1407, -2292, -6773, -6783, 7414, 13304, -2743, -12273, -4957, 4105, 9687, 6193]
1462F193j5048k587J4821N475o441l012l575k785Q345N986m696l363l403m380
1476h470R487J1746q103j3333K83P235Q854L112j3191j0767R704J1290k673l722
1490A452m514l930N924O694k536j999j044p504K072J3645R67j0907o580R96Q739
1505A475J1187o187j6978M28J2816M970k518o478o904L800J0262j251m497N73
1519F98m767k478Q687O085n439o103m334K275J3020M088j4573q820P441Q862L446
1534H088l754j0957j974J0868M113m476r13l002m586N540P274j396m516n461l237
1549h389R417J1307p440j3103k84Q165P644J247j0580q369P590R013k024k807
1563A387k267m652K452O230Q60j208l698o783K705J2665K127j1081p291K054R268
$$ y = [6193, -8855, -11442, 3379, 8854, 2413, -599, -4174, -6959, 1386, 7372, 2676, -687, -4090, -8470, 1017, 12763, 4660, -8673, -8390, -1155, 7699, 10811, -2380, -13147, -3443, 7847, 5174, 1452, -3062, -6992, -1068, 5626, 3090, 1091, 47, -7457, -5385, 8260, 9227, -1680, -8260, -7264, 1475, 12662, 6475, -10503, -10075, 2741, 7711, 5193, -1285, -8189, -4389, 5873, 4622, 125, 698, -4069, -6547, 2140, 8225, 2786, -3317, -7651, -5376, 7644, 11732, -2841, -11661, -4220, 4642, 8088, 4334, -6623, -8597, 2271, 6384, 1908, 995, -2007, -6593, -1053, 6221, 4825, 309, -5152, -8389, 1028, 12335, 4895, -8208, -8492, -327, 7317, 8564, -2016, -10385, -2795, 6218, 4194, 1387, -880, -5532, -3080, 3150, 4010, 2802, -896, -7679, -4974, 7691, 9818, -1263, -8554, -6500, 2768]
1578B768P599n562j3688O17J0350M237k425l856n515Q73O746J607j253j044n796
1593d342k841Q586P418m142q910m360M858J1209K008j2254p212O761P558K326
1607F663m058o992j553O186L654j579N4l765m920L107Q579J091n663p083j806
1622h085R979Q885o246j2081m07P971O771l87q204n411M445O231L32j546k150
1637I7m101m51O012L808r01o435o126L756J0877K571r437q585L233R023N385n559
1653C167r337j48P120L713j189l042l407p24L042M125J254k535o892k476Q330
1668A001P794l772r550m346O555R727L4r452n967M809O544J578l232m515j220
1683d012K325L256K463q91m597m796K412Q748K552o474q406N76Q973O880m943
$$ y = [2768, 10367, 4805, -8883, -8266, 2084, 6321, 3896, 40, -5475, -4602, 2144, 3751, 2498, 1454, -4342, -7183, 1403, 8821, 4679, -4231, -8591, -3733, 7476, 9484, -2770, -9982, -3221, 4337, 6663, 2605, -4387, -5940, 246, 3900, 2321, 2375, -1390, -6310, -3203, 5376, 6467, 804, -6279, -8085, 1894, 10779, 4533, -7548, -7955, 16, 6787, 6400, -1804, -7215, -2770, 3461, 3793, 2247, 97, -4004, -4455, 1557, 5365, 4464, -1971, -8097, -4341, 6536, 9107, -330, -8915, -5682, 3341, 8726, 3167, -6170, -6318, 802, 4515, 3326, 284, -3123, -3847, -805, 3320, 4574, 2039, -4853, -7329, 1001, 8795, 5023, -4527, -8873, -2318, 7409, 7443, -2009, -7976, -3167, 3377, 4955, 1723, -2792, -4012, -1687, 1569, 4032, 3141, -1456, -6252, -3840, 4908, 7460, 986, -7420, -6844, 2129, 9009, 4066]
1698D066r913j230O700O015j149n513l347J470L319K601M55k645m592r13M394
1713b82O621r41q202n530N060R577J580q106p411K545Q749L184n370n795p4L593
1729h02L518Q73k454l133k139J242N606L583m500p478r77P462O863k237r777m140
1745h490P569P401j196o432l985J934N180K379k476l148j237r40L099M969l12
1760D315o004m392K206P969L757o241r172J254R153M104l822p262j660N009N849
1775E063j791l589j756q36J350M189J991l686m362j818M187P888p57r340m688
1790g955N636P746R56o237o648K223P375K083m312k891n20pL865K410j142l318
1806g36l173j47O370N500n963q346P46O860N273j257q913l824O835O321k001l868
$$ y = [4066, -5847, -7077, -377, 5638, 4489, -1024, -4371, -2901, 418, 3019, 3474, 829, -3763, -4676, -282, 6339, 5398, -2804, -8334, -3274, 6303, 7883, -223, -7634, -5089, 3660, 6844, 1474, -4321, -4395, -802, 2716, 3589, 1135, -1998, -4137, -2895, 2711, 6294, 1794, -5684, -6661, 801, 7664, 5427, -4350, -8490, -921, 6480, 5284, -1148, -5133, -3199, 1981, 4360, 1884, -1264, -2501, -3441, -342, 4627, 4315, -1689, -6081, -3875, 4094, 7851, 1610, -7562, -6308, 2845, 6949, 3127, -4135, -5795, -786, 5063, 3272, -317, -2073, -2909, -1559, 2630, 4621, 935, -3427, -5245, -1058, 6830, 6073, -3267, -7955, -2319, 5427, 6383, 146, -6502, -4279, 3096, 5179, 867, -2024, -2544, -2551, 1314, 3724, 2582, -736, -3909, -4056, 2314, 7814, 1851, -6495, -5749, 1111, 6384, 5127, -3786, -7610, -775, 5546, 3545, -323]
1822c23k443o52L754L312j578j882k225k384L063O585R0p868l488K982O873L184
1838G000n641q684K462P877K037l190m055k525L341M957q92k448p19k664n67N847
1854B136L510m412n144j332M287P573n31j0248l258O352N862j79m095n296M95
1869d280O689J287l307r38j153j793L141M710j635l674k839m16O037N970o119
1884A680q345J957O182L697r22o928m284O394M921j991k521p70k953K290M517
1899B924j30j972k336l220K651Q166r31q390k113L157N042L265m654p863K375
1914d029P224M95k650j377k738L52M839N98j539m38l943j681O815M669n675n120
1930d198n01L708O669r0q926l432O822L656p55j986m300p13N068J858k299M83
$$ y = [-323, -2766, -3418, 336, 3648, 2070, 188, -2037, -4421, -1358, 5227, 5317, -2551, -6039, -3057, 3816, 7000, 1359, -7325, -4863, 3014, 5051, 1861, -2194, -4719, -1378, 3579, 2687, 239, -480, -3144, -3711, 2136, 5646, 1234, -3910, -5242, -955, 6618, 6087, -4161, -7419, -1067, 4795, 4616, 521, -4775, -4280, 2409, 3696, 389, -549, -1702, -3495, -354, 4356, 2721, -953, -3792, -4208, 1829, 7799, 1680, -6665, -4708, 1474, 5171, 4249, -2679, -6963, -569, 4352, 2361, -160, -930, -3883, -1593, 2924, 2794, 822, -1514, -4734, -2083, 6083, 5152, -3238, -5351, -2194, 2848, 6113, 1459, -6404, -4029, 3195, 3690, 1040, -337, -3075, -2723, 2116, 2714, 1175, 737, -3206, -4887, 1928, 6597, 922, -4198, -4699, -991, 5678, 5588, -3338, -6770, 52, 3708, 2953, 967, -3333, -4046, 1022, 2880, 581, 1064]
1946A064j767m030L393O367j781m258k843o00O285N593n959p870K568N296K185
1961C643k76m573m150M190M426j887m88p65l374L44N857R51k952k551l431K818
1977b218Q280o24r037j971M392L783K270l358o545J361O325j08j820L00k928j514
1993c412M307J635o62q72m141j928P042N055n600n860M52L347N314P21q479k958
2009f039O244L035j480k30l209j672L169K228j230O85k127m313L258O562j343
2024C538n031k134J51M878N522n759o404K018M518J063L56k459m349K501L315
2039A724m80K77L6n272k81O786J780l388k994l006K804P628n56q184j824M086
2055h64K804J757k216n189P80M783n99p69J650l557k622L688L235j37j538m604
$$ y = [1064, -703, -4733, -1340, 5027, 3246, -1012, -3855, -4455, 1830, 7423, 1464, -6406, -3838, 1458, 3643, 3367, -1206, -5356, -1166, 3260, 1373, 885, 120, -3254, -2910, 2947, 3898, 946, -1605, -5036, -2218, 6062, 5438, -3599, -5570, -1178, 2605, 4875, 1517, -5028, -3667, 2658, 2550, 730, 1030, -1898, -3412, 895, 2530, 1868, 996, -3145, -5073, 1969, 7024, 1424, -4436, -3984, -637, 4677, 5398, -3081, -6039, 205, 3240, 1760, 1530, -1679, -3351, -182, 2046, 816, 1501, -626, -4939, -1681, 4881, 3538, -1493, -3627, -3476, 1402, 6924, 1165, -5239, -3221, 1297, 2360, 2716, 257, -4092, -1591, 1724, 1244, 1521, 1557, -3715, -3996, 2790, 4570, 1182, -1812, -4818, -2014, 5614, 5058, -3126, -4950, -864, 1940, 3697, 1481, -3708, -2928, 1855, 1256, 487, 2137, -1420, -4042, -354, 2881, 2744, 1206, -3398]
2071c398j782O956M923n266n821M28L509M196O72o365k909M649K092o94N08j638
2087F0l816K479L188J25j17k258m861L140P371j055n746k048N17M172M381m124
2103A408o048K076L758L55N79r48l782R5L062P18J163n61n520j156O740L224l622
2120A541m017k042K932O606p15p211j363L800J759J366p59m328m44L312j2Q15
2136A240J541l686l822L427M563J55k501m213j229O305M451n000n051J082K472
2151b66K914R11m670k179K777J292jJ045j093l807M04M250J258l97l330m027K571
2168b348P392r89n511k233J427L699K948l109m537J285K227L45R32M70l714j324
2184c040K287K346J122r14n461q65O171L321l369l778j747K379N869o01n558j859
$$ y = [-3398, -5180, 1776, 6699, 1433, -4388, -3960, -451, 3745, 4417, -1948, -4857, -208, 1884, 1190, 1698, 60, -3756, -1277, 1911, 2036, 1919, -339, -5200, -2060, 5311, 4256, -1490, -3538, -3021, 1151, 5532, 1408, -4640, -2564, 1194, 1549, 2128, 1180, -2602, -2507, 555, 1273, 2436, 1875, -3645, -4801, 1939, 5163, 1541, -2476, -4518, -1586, 5020, 4305, -2906, -4269, -469, 1290, 2656, 1897, -2431, -2875, 437, 425, 1240, 2781, -905, -4727, -1300, 3263, 3418, 917, -3296, -4525, 1780, 6231, 1231, -3820, -2738, -266, 2648, 3559, -1111, -3290, -513, 779, 778, 1823, 730, -3077, -2673, 1577, 2835, 2438, -892, -4919, -2348, 5044, 4055, -1456, -3689, -2262, 1437, 4385, 1276, -3261, -1976, 251, 596, 1528, 1998, -1716, -3040, -753, 1593, 2715, 1801, -3660, -4525, 1646, 4967, 1598, -2180, -3927, -1548, 4321, 3720, -1838, -3697]
2200c697K970J548R32O2k496j826J482R65J729J304l400m068K825M736M74l126
2216D14l936o50N409L957m157l989M31K426J450J199k824j715P97J071O15K136
2232B634j147m227n10M107K251n22l595l440L103N293n08m598j927J190K748J839
2248B691j068m011P33J103R12J497L66l002k411J822L244J634k078m846o85N220
2264A121L472k923l787j077J803M036K63l849j564J359J281J046P77j736k722
2279b500K38K311K202L27l345l558K148N249O35l403l534j26M730K565k811l023
2295a895j13J593J347J061r86k136l40L93J769K209j250m082j318M278L174j230
2311B474m147k455K800L997P21m014k098J370J826J630p05j972r01M90R58J862
$$ y = [-3697, -727, 821, 1753, 1815, -681, -2507, -1025, -60, 1669, 2973, -427, -4495, -1670, 3066, 3540, 414, -3522, -4172, 1237, 5194, 1037, -2952, -2521, -95, 1355, 2554, -270, -1985, -1188, -117, 498, 2634, 1487, -2740, -3250, 857, 3108, 2586, -1009, -4449, -1346, 3947, 3439, -1159, -3086, -1896, 852, 2691, 1623, -2388, -1655, -552, 360, 1857, 2223, -779, -3190, -1368, 1876, 3510, 1432, -3414, -4099, 1121, 4593, 1670, -2117, -3194, -1391, 2645, 2908, -941, -2505, -1146, 135, 1181, 1958, 222, -2500, -2262, 49, 2251, 2578, -767, -4325, -2177, 3072, 3707, 304, -3230, -3356, 1374, 3939, 1128, -1895, -2008, -415, 932, 1993, 1007, -1129, -1469, -1076, 693, 2902, 1652, -2430, -3748, 530, 3704, 2474, -1673, -4128, -1328, 2669, 3390, -624, -2722, -1352, 474, 2104, 1399, -573, -1474, -984, -26, 1836]
2327A836Q24l016k926J196L998J640k517m088l56M229K982k089l599o58J924K752
2343B132k5j888j653M9O50J552J023q00k632j150K347L156M10m257k700J824M821
2360B859M67k828l431O38L362J513j442k202o00Q24J484P60L14k043k187P49K624
2377H61K357k054l740o31L173L545n70m624j751K708K890N56k962j521J85J706
2393A28Q66M82j148j576p68J096L440J74k869k775P29M096J832k906l781R6L283
2410C99K513j314l139j040J867K061L04r32q56j528N61K190J185j288k804j420
2426c241K247M075r7m080k047J091M003J177k717k972K83L164L54kj340j427o0
2443a589J710J468L71j676k890K45L734K143k402l238j039K683L901r83m097j289
$$ y = [1836, 2660, -356, -3282, -2086, 1912, 3552, 1035, -3053, -3409, 820, 3802, 1713, -1886, -2544, -620, 2132, 2107, 219, -1434, -1385, -735, 817, 1840, 1040, -1592, -2742, -395, 2761, 3171, -1086, -3786, -1962, 2859, 3326, 498, -2933, -2295, 1067, 2580, 1138, -1064, -1664, -840, 644, 1404, 1718, -325, -2512, -1763, 861, 3218, 1164, -2576, -3207, -34, 3511, 2941, -1683, -3434, -726, 2164, 2720, -242, -1763, -1578, 128, 994, 1476, 328, -1248, -2016, -920, 2520, 2694, -175, -2950, -2221, 1875, 3707, 801, -2980, -2884, 399, 2912, 1598, -1541, -2581, -714, 1347, 1651, 719, -137, -1665, -1104, 1086, 2271, 983, -1821, -3241, -994, 3081, 2984, -1096, -3143, -2052, 1951, 3128, 411, -2561, -2278, 886, 1240, 1238, -102, -1529, -1589, 121, 1589, 1960, 284, -2606, -2361, 1373, 3516, 1114, -2124, -3163, -480, 3421, 2438, -1659, -2948]
2459b948K318J789O80j165j965j99J118J069N95J25k515k143K604L222l2k789
2475b36l025P62L958K512l191l658N54K412K105Q9k900j641J161J924m9N55r08
2492D24k800L70K845J806j030k888k403K802M123k91m074j720J441K866J539k410
2508F00k893M63K133P04J38K7k501j268K304J723O57j244l263p95M868K183l009
2525H27k837l91J676L225J1l802j074J887J290N79M1k069j323J234J468Q74L94
2542B010l098k422K087M228j94k951k340O1M044K587l399l182J011J734Q42P82
2558A800j632j948O90J067K79J844j012l267n21L737J619j072k593k444J884M914
2574C345m77l854j411J281J799J745j060l167N9J377O10R27O87k784j751K101
$$ y = [-2948, -630, 1159, 1839, 674, -1291, -1490, -372, 697, 1292, 1417, -1098, -3241, -637, 2585, 2553, -236, -3261, -2499, 1459, 3971, 780, -2878, -2324, 88, 2193, 2282, -618, -2259, -1098, 826, 777, 1332, 424, -2376, -2006, 839, 2645, 1615, -1273, -3676, -874, 3249, 2958, -1116, -2836, -1395, 1471, 3010, 600, -2293, -1830, 303, 1007, 1145, 1172, -1329, -2597, -293, 1430, 2087, 843, -2420, -3215, 1653, 3836, 827, -2010, -2401, -725, 2500, 2511, -1291, -2365, -478, 812, 1391, 1432, -637, -1960, -726, 742, 1616, 2010, -1088, -3510, -1423, 2805, 2611, -340, -2680, -2619, 1425, 4012, 613, -2569, -1558, 176, 1018, 1800, 168, -1780, -1090, -23, 256, 2100, 1088, -2179, -2700, 1037, 2656, 1584, -1009, -3453, -1569, 3345, 2868, -986, -2397, -1116, 683, 2428, 1368, -1799, -1740, -363, 247, 1174, 1861, -923, -2674, -573]
2590e73K298N83j308l610n86M438K480l073k675n00J652L284L9l048j515J713
2606d01M74O57J321j514k864J079J730J009P10k466l392K199M404m51k813k396
2622b714L05L488K617k812l103J203R95L32J417o39k336l72J026R82J842p97l767
2639b333n72L837K005j637k148k147J519M576n89l760r32J417J061J629l91k444
2655i09n22R50Q1J720J320l427k379K353L277k0j636l257q44M405K405k909k300
2672a692J75M67K501O71k131j395J128l59R41J811j038l545M25K257J708K04k874
2689g46l141K534M475o81k651j982K90K164K662k111k715P82P32J18J847J83k793
2706a033q34J368J001J957o55m364q50M465J846j562k313j567J086L707l7k824
$$ y = [-573, 1725, 2308, 1000, -2610, -3196, 1242, 3722, 649, -2026, -2526, -874, 2410, 2449, -599, -2114, -401, 73, 730, 2051, 537, -2327, -1248, 482, 1491, 2201, -265, -3657, -1458, 2946, 2495, -318, -2714, -2409, 1079, 3696, 884, -2219, -1016, -21, 311, 1728, 1089, -1247, -1619, -593, 389, 2231, 1434, -2333, -2905, 932, 2937, 1300, -848, -2995, -1476, 3100, 2511, -1249, -2181, -764, 297, 1926, 1535, -909, -1431, -481, -400, 1320, 2640, -787, -3166, -813, 2464, 2444, 808, -2449, -3293, 1112, 3517, 608, -1692, -1517, -1050, 1451, 2122, -9, -1404, -276, -635, 306, 2117, 1079, -2466, -2041, 216, 1924, 2128, -746, -3887, -1353, 3122, 2441, -210, -2192, -1902, 262, 2924, 813, -1902, -1120, -388, -270, 1577, 1760, -1033, -1867, -499, 502, 2459, 1804, -2560, -3410, 1055, 2901, 1339, -974, -2541, -1455, 2252, 2215, -609]
2722f09j054J016N5J834N05j682j463O78L63J506J908l610k968K223L336J03j407
2739G34k973o33L781K173k642j870J22M98J105J861k107j083Q8j91J250K473r11
2756A675m217m3K984J811o5k762l121K343L959j62l140o18l67J543K321q91k606
2773a356M98K72k18K170J019l142k051J786J662J789o15m173r74M430J530j421
2789A206k124j278R11K884M61k380j180R33k43J056J861j351k283l42J088K444
2805A663J077l224l351K605L321J14j735k434m76K795K233j951j628K42j87Q27
2821a09J886p08j682q75L7J426K907j368l831m05L191J852j08k611k746J851L929
2838B636l39k578p01k85Q01K169l69j679m73m42N28K446R70k987k460J370K469
$$ y = [-609, -1663, -647, -592, 1242, 1747, 65, -1398, -720, -357, 1149, 3057, -553, -3521, -1298, 2038, 2141, 734, -2239, -2872, 909, 3082, 440, -1430, -1308, -810, 295, 2156, 49, -1034, -946, -1137, 113, 2586, 1675, -2542, -2585, 399, 2210, 2145, -617, -3738, -1395, 2564, 2402, -738, -1356, -1723, -180, 2141, 1250, -1356, -858, -586, -804, 1366, 2385, -757, -2808, -1022, 640, 2429, 1814, -2359, -3333, 1097, 2627, 1206, -918, -2196, -1285, 1599, 2060, -320, -1500, -567, -810, 246, 2107, 756, -1527, -1869, -781, 1663, 2740, -484, -3835, -1230, 2091, 2205, 470, -1964, -2440, 355, 2588, 637, -991, -749, -936, -109, 1777, 1069, -613, -1488, -1451, -25, 2882, 1514, -2317, -2722, 469, 2321, 2213, -398, -3144, -1293, 2636, 2297, -281, -982, -1267, -466, 1703, 1334, -345, -818, -1260, -732, 1714, 2684, -303, -2763, -1393, 1076]
2855A076J751j329l947m62L625J888j636j588j132M81K065Q70j349p74p4q12J592
2872B45K092j227k995k29J150L092Q95l394l418K404L518M02k132k030p61K473
2888H5K354j573j366m74j94O48K502p3k272j060l51K265K204j062l710p68L467
2905F22J674o64k043k153J446K660P8j684q48n0J91J863Q52j562j393p09O50K857
2923A787R92l485k377J591K892J546j565l400j002L698J908j307j953p74K53J485
2939B89J145m69j142j025q68K205K659j012l620j001K625K330L27k838k500J583
2955a312L072N01j770j754o67J817J541j54j256q30r49P18K952K64k425j993Q7
2972b158K618K871j880l582n00K669K327o14k652j185R29K140Q72j202j352q08
$$ y = [1076, 2827, 1498, -2449, -2911, 714, 2602, 966, -622, -1754, -1273, 792, 1662, 313, -461, -535, -1347, 245, 2337, 1110, -1885, -2114, -964, 2128, 3023, -371, -3789, -1385, 2133, 2535, 403, -1627, -2388, 85, 2439, 866, -500, -974, -1168, -520, 1982, 1909, -363, -1423, -1774, 491, 2695, 1633, -2077, -2845, 622, 2296, 1632, -411, -2564, -1118, 1542, 1620, -64, -912, -962, -771, 1092, 1944, 382, -1011, -1720, -1070, 1787, 2779, -706, -3083, -1492, 1400, 2946, 1381, -2019, -3021, 677, 2585, 1278, -675, -1449, -1196, 289, 1434, 965, -177, -1202, -2070, 135, 2794, 1782, -1838, -2839, -214, 2116, 2443, -395, -2895, -1312, 1760, 2261, 491, -1263, -1930, -113, 1428, 1274, 18, -812, -1761, -1043, 1909, 2173, -252, -2245, -2158, 460, 3331, 1451, -2131, -2631, 38, 2365, 1751, -901, -2086, -1157, 983, 1855, 653, -699, -1507]
2988a507N86J359J422m74k634r87J316L192L75k596k999J041L374J265j926k760
3004a953k80K374J504p17j191j038J70J143J455J08j101k079n86K630K492j447
3020A484l089j255K220L150j56k679k196J393K415P60j598j385j61O38J351O75
3036A567m77j882j054Q18K610J026k367l085O90L390J391j439k799n99K163K381
3052B334q54j956j203J181R24N00J39j235j143l04J664K087m93k754j767J985
3068h95K926N89k838k684Q80L619Q95k029k384j33J775J136M00q35j785r1P96
3085f58J629J490k154k649o4L262J736r39l487j642L014K628N5l205j083O98J820
3102D51R74o91j395n71J81Q52J810Kk824j426J646K915M10k210k779J70L620J794
$$ y = [-1507, -921, 438, 1860, 1386, -1248, -2235, -919, 2273, 2648, 52, -2947, -1906, 1468, 2733, 807, -1953, -2233, 141, 1645, 928, -263, -1301, -1131, 12, 1467, 1575, 474, -1605, -2191, 439, 2931, 1484, -1605, -2860, -640, 2510, 2354, -325, -2521, -1128, 1287, 2047, 449, -936, -1097, -459, 892, 1567, 1090, -792, -1846, -1028, 1582, 2608, 241, -2844, -2154, 1236, 2627, 1188, -1611, -2210, -47, 2334, 1480, -476, -1679, -498, 426, 926, 1065, -170, -1313, -1617, 47, 2134, 1641, -1113, -2880, -895, 2031, 2620, -218, -2902, -2022, 1597, 2492, 463, -1921, -2054, -279, 857, 1257, 422, -1363, -1454, -658, 971, 2461, 307, -2342, -2406, 856, 2592, 1653, -1834, -3476, -462, 2166, 2221, -984, -2067, -1369, 451, 1425, 734, -661, -1232, -1051, -199, 1611, 1613, -1211, -2637, -991, 1924, 2334, 124, -2655, -2485, 1135, 2929]
3120B929k278k241l67J455K043J98k357j67J09J95J246J175j570k039k39J965
3136E7K085n59k700k117K173L377L0k470k253O60K850J123j540j820Q4M40O01
3153B1J466o15j751n72M85J998J235j294l548K69L200J674j321k630j311K122
3169e72L125n51l032j10j79J239J253Q5j670q15k76J085K486R0l286j870K344
3186f54K397R53k411k877J55L731J293k096j737m38J235J681L35j743q05k30K31
3203i80J983J594j871k782L61J690J992r8k843k662K719L418o34k165j490N34
3219a234J627J552r85k050M86l81Q49J852O6k926j289J419K030J761k001l669
3235b893N81L527J393j392k253j324J830L001r40k193j48j15K63J936L24j680
$$ y = [2929, 651, -1590, -1957, -502, 1541, 1739, -618, -785, -676, -481, 765, 1940, 370, -1669, -1908, 57, 2142, 1583, -1117, -3234, -1061, 2316, 2346, -124, -2377, -1717, 1133, 2256, 716, -1104, -1020, -580, 21, 1487, 872, -879, -1451, -966, 1032, 2267, 973, -2575, -2306, 894, 2568, 1247, -1383, -2694, -572, 2553, 2002, -1030, -1140, -1319, -80, 1173, 1258, -412, -1227, -1503, -418, 2068, 2158, -1128, -2998, -654, 1743, 2696, 285, -2592, -2437, 1294, 2587, 491, -1246, -1684, -449, 1232, 1567, -176, -981, -1211, -980, 1003, 2597, 726, -2056, -1695, -5, 1987, 1889, -954, -3616, -897, 2521, 1887, -278, -1768, -1234, 393, 1945, 960, -1090, -604, -985, -136, 1716, 1782, -1144, -2433, -1014, 1016, 2777, 776, -2893, -2312, 1215, 2608, 1216, -1037, -2361, -531, 2470, 1530, -663, -811, -926, -663, 1273, 1597, -83]
3251h3j073l10N46L374J2l808j609K404K201N25j672k878j18L836J032j682j602
3268i05o4J52J591J129j304j289m69k32K055K383k443l357Q96K468J571k32l018
3285a068k063K477L107q66k024p67l73J797J487q93j278k76p26M96L265m50l413
3302a568p47J438K182J489j876m123J266L098J239j468j718j275J102K985p85
3317A239j897K16o13l08K296J172k044j720k23J399L056l5m073j570K539K547
3333A981O2j723k581L11K893J111j775p24n98l85J649J608j254j516n22r4K368
3350H11K040k437l281J047K771J267n85k736j652K070K922j239j272k16j169J462
3366a97J967n02j405m23j303R15L090L43l707j021J303K343J358k110l423N89
$$ y = [-83, -1156, -1466, -920, 2454, 2466, -1342, -2951, -547, 1654, 2179, 507, -2371, -2489, 1347, 2379, 697, -905, -969, -817, 774, 1903, 599, -690, -1159, -1391, 664, 3047, 604, -2753, -1857, 611, 2182, 1950, -1068, -3131, -654, 2453, 1587, -437, -1204, -1577, 220, 1707, 814, -464, -740, -1466, -970, 2295, 1845, -1568, -2315, -877, 1305, 2794, 918, -3205, -1939, 1159, 2398, 930, -788, -2063, -961, 2024, 1239, -658, -442, -1055, -1363, 933, 2105, 61, -1659, -1882, -483, 2573, 2538, -1535, -3105, -566, 1981, 2043, 320, -2261, -1950, 943, 2054, 279, -445, -1043, -1428, 221, 1829, 575, -941, -1463, -1557, 811, 2851, 414, -2867, -1820, 951, 2218, 1633, -1103, -2755, -685, 2237, 998, -274, -490, -1659, -197, 1770, 1268, -137, -560, -1863, -948, 2142, 2485, -1222, -2243, -940, 1403, 2761, 651, -2772, -2183]
3382b183L417N50q55j534r74P25K231J93j532k72q77n31K366K015k481j948k30
3399a920J486K862R0l679k066L050K230n10j021k020n84K612J131r83n38q63j167
3416a890J763K274o99k127q84Q8K602J950k193m001J491K569J329q35k404j435
3432b402J913K207p62p61n67j176P15J957K71j115j495q69J498K964k11l468j647
3449b948K287K239Q75j593l268L95K925N48j501k81j108K7K027R54j022q18j298
3466a560l93L009J709k395k478J91K123K057L5l482j951K752J816o16k69j447
3482h99j007K253P88l00n72j083j230J741K357m56k535j330N28L022J667k425
3498E19l191P30K815Q94n75j549j432J348J614k11m36n86j667l07L110J317j681
$$ y = [-2183, 1234, 1784, 929, -605, -1579, -854, 1377, 1570, 38, -234, -1111, -1642, 724, 2739, 258, -1690, -1920, -434, 2428, 2518, -1161, -3227, -177, 2053, 1543, 522, -1498, -2082, 530, 1661, 678, 140, -723, -1890, -127, 2147, 1448, -679, -1563, -1475, 1127, 3077, 884, -3117, -1626, 943, 2272, 1437, -967, -2402, -489, 1718, 956, 195, -372, -1548, -833, 1124, 1395, 280, -1215, -2084, -586, 2378, 2167, -1301, -2948, -661, 1578, 2453, 860, -2408, -2013, 912, 1460, -41, -322, -1430, -1403, 624, 1578, 556, -262, -1560, -1953, 1056, 2765, 370, -2108, -1917, 206, 2263, 2298, -1184, -3135, -383, 1433, 817, 548, -899, -1906, 347, 1135, 835, 263, -820, -2050, -309, 2048, 1592, -943, -2273, -1745, 1277, 2944, 519, -2672, -1942, 873, 1767, 1192, -357, -1789, -441, 1173, 962, 526, -60, -1727, -2034, 1076, 2393, 712]
3515G12k078j083J953L061l20l429j336J878K134N04j636k213J24K409P28q99
3531E09o44j073n69K339J161p46j059j482j80K800J906k569k733M74K299J684
3547B117l78k787j468K379J539k56j052m79j158J071J322M55o14j580j747J856
3563g80L143n48l082j147J076K773J156k614k319P09K388R36p62r35j351L47J340
3580C30P17k81o82j391m16L069J167j815k305l30K047K358n14l067j407J945K080
3597A505K36j317k141M41J375R29l82m8j465r71J492J995m8j931j867L71L307
3614A481J243k147k941K50K480J410l34k356j089J325J441L94l68j012j390O23
3630i90J909Q65q32k045j644K371K576m24k478j668J179K493Q34j987k016O85
$$ y = [712, -1366, -2449, -496, 2565, 2245, -1184, -2520, -642, 1492, 1996, 360, -1853, -1729, 680, 1408, 509, -135, -1208, -1777, 562, 1723, 977, -82, -1564, -1744, 1056, 2962, 393, -2340, -1866, 433, 2117, 1739, -1048, -2516, -137, 1402, 1146, 94, -385, -1543, -472, 850, 1305, 691, -889, -2636, -780, 2363, 1815, -1267, -2414, -1338, 1435, 2591, -23, -2342, -1633, 755, 1691, 929, -6, -1357, -1010, 330, 1047, 766, 84, -1307, -1723, 1346, 2513, 698, -1607, -1937, 110, 2468, 1954, -1113, -2520, -575, 1505, 1741, 424, -1717, -1276, 99, 1028, 646, 598, -867, -1838, -346, 1649, 1601, -330, -2197, -1826, 1481, 2724, 577, -2364, -2114, 366, 1776, 1442, -914, -2003, -678, 763, 1157, 789, -223, -1613, -990, 919, 1784, 952, -1093, -2737, -366, 2210, 1786, -692, -2360, -1181, 1312, 2146, 159, -1857, -1172]
3646a172J374Q70K57j234r87q1J212O68M98j291j814M21J867J897j509k784k65
3663b073K150K412q86k891m65J196J541M55j096j170m12O09J336P09o68j658j250
3680b161J663K332J80k389k119R51K925J061k077j995m1K243J070o10j706j158
3696a831J006P60R15J83j443q85O2J853J468q10k621j078K452K292n45k501j678
3713b401J352K453M43j615j551Q0J268J123J99j184r00n35R55J611P92k520j785
3730b215P49K617J281j686k923K79K295J984j183k129n44P97J348M23r86p99m56
3747a148m7J705J212q89j911r18J497K279L07k554k131J343K735N18j955j607
3763a564j3J795J489o93j202o72m42J085J655j82j695j130K8K070J908j181l361
$$ y = [-1172, 202, 1072, 1329, 95, -892, -973, 239, 907, 1405, 114, -1700, -1279, 588, 2485, 976, -1808, -2073, 77, 2489, 1603, -1288, -1753, -557, 984, 1439, 343, -827, -1239, -630, 706, 1415, 747, -911, -2161, -498, 1834, 2014, -375, -2494, -1543, 1382, 2443, 366, -1629, -1670, 573, 1643, 1033, -673, -1831, -825, -65, 850, 1033, -410, -1295, -1233, 620, 2088, 1278, -1343, -2421, 31, 2323, 1778, -723, -2401, -1049, 1404, 1847, 232, -1319, -1239, 29, 1152, 1351, 167, -733, -1268, -313, 1298, 2090, -430, -2215, -1466, 1151, 2432, 746, -2177, -1898, 397, 2381, 1198, -931, -1475, -678, 670, 1093, 107, -692, -1148, -1195, 510, 1722, 833, -1078, -1996, -499, 1780, 2087, -467, -2598, -1255, 1480, 1998, 43, -1564, -1577, 218, 1707, 1014, -188, -860, -1302, -217, 1438, 1256, -439, -1569, -1541, 529, 2437, 1256, -2105]
3780b105j19K675J364j64k163j648R22K676J09j496p51n54P02J281P07p60j373
3797f97r66Q67K427M08k593k214J513K404R27j335k625k6K183J983j629j021j007
3814a401M98J409Q02q21n66j193l22J881K071j261k845j4J338K485J23k956j886
3831b658J592K327K36j124j348j88J168J564p96q81l05j108P81K140L23k343j323
3848a943M54K150J767j400l178j05K507J525o74j401j375Q22K142m27n35p19o96
3865a086j71K359N47j176j196j015R69K630L66k671k258J616K512O50r00k827
3881a651j76K287J100j082n76p29n68J634J214l95j068j141o25K288J954j613
3897H53k466p9J597J846K93k714j681J700K165l68o36q02j361J152J617m48j70
$$ y = [-2105, -2224, 451, 1815, 1651, -512, -2160, -1238, 1438, 1547, 51, -700, -1254, -552, 729, 1436, 676, -697, -1663, -796, 1631, 2039, -554, -2768, -1255, 1149, 2076, 741, -1884, -1910, 273, 2256, 627, -394, -1401, -903, 506, 1308, 487, -79, -1272, -1594, 287, 2358, 1097, -1748, -1762, -424, 2061, 2184, -772, -2658, -1066, 1261, 1497, 373, -975, -1163, 5, 1569, 773, -108, -413, -1521, -740, 1400, 1723, -620, -1943, -1489, 661, 2428, 1028, -2150, -2255, 252, 1777, 1103, -298, -1673, -851, 1291, 864, 329, -390, -1086, -1257, 1102, 1649, 473, -723, -1738, -769, 1861, 2227, -444, -2702, -1086, 1426, 2076, 1176, -1651, -1827, 460, 1560, 478, -98, -827, -1395, 239, 1453, 1058, -10, -1151, -1776, 512, 2466, 853, -1613, -1692, -95, 1751, 2044, -670, -2351, -651, 1514, 1146, 510, -292, -1653, -501, 1116, 668, 498]
3914D98r29j595J081K726j5k254j201N56J639J815j336l114J85K457Q25l09j316
3931b87j044L30J890K17q43o3j105q17K528J099j286j724m92R95K575K74l006
3948g59j793J703J617Q99r32k192n89K281J140q76M10j377j305J323K002l27j265
3965d0j192o28K393K462j819k862k66K249J145K75k097k065J626K135m52l59m33
3982G2j586M66J894M09q78j067j406J344K821K10l074r94K52K146J774j200l106
3999a923J66K003O99J9j022p81m12J456Q20m81J1k005l74K211J834j586k153k97
4017a815J133K462Q13l014k154K389J216K80l45j786r70J950O81m50L13j062j360
4034a719J237K138l40j597q44r20K519K349j701k942M03J327J064L91j431j949
$$ y = [498, -431, -2026, -945, 1781, 1766, -488, -1689, -1133, 506, 2321, 985, -2129, -1944, 513, 1338, 1029, -287, -1331, -1001, 889, 1106, 263, 200, -905, -1722, 806, 1905, 619, -1105, -1597, -602, 1973, 2247, -759, -2552, -849, 768, 1667, 735, -1457, -2046, 235, 1375, 499, 909, -468, -1773, -450, 1552, 1225, -40, -1232, -1860, 533, 2995, 1176, -1686, -1952, 297, 1442, 1717, -380, -2445, -819, 1316, 864, 505, 72, -1514, -1048, 846, 1255, 377, -690, -2096, -752, 2069, 2279, -795, -1789, -1537, 609, 2383, 1183, -1923, -1757, 246, 945, 964, -58, -839, -1251, 205, 1025, 544, 555, -1450, -1824, 387, 2221, 635, -1518, -1815, -682, 1780, 2593, -421, -2575, -186, 1030, 1310, 965, -821, -1791, 159, 840, 390, 703, -359, -1719, -482, 1656, 1316, -281, -1125, -2045, 474, 2823, 1122, -1820, -1417, -90, 974, 1365, -66, -2015]
4050b015J429J414j11K08o59j820M70J913P52p36j481j156Q39L068l9k920r20
4067a764O61J781J655j436k723J82K129N89n56Q3j107j026J686R25J5q37j870
4084a613m46K789J671j742k177j99J337J814L88k571j194J502J281R2k27r97j493
4101a785J288J367P1m3j145j871J350K332Qj817j200j00K337J756j970k226M26
4118a222J376O21L99j376j002L08J141M13L83o33j951j06K422R33q91j481j464
4135b130J411K645J86k815j113Q63J289J156o44j847m22J524M43RL44j391j482
4152a974K112J106N1q69j830l99K523J694k025j726m06J503J248O33j967j277
4168a603J111R77L63L20j267j306N78J036P17J35j457j761J384K441J49j981j192
$$ y = [-2015, -586, 828, 717, 925, 266, -1554, -1084, 829, 1581, 845, -636, -1792, -953, 2115, 2076, -844, -1764, -1103, 678, 2333, 897, -1826, -1644, 485, 1074, 518, 601, -506, -1532, 154, 1079, 1094, 257, -1613, -2059, 730, 2401, 659, -1518, -1717, -380, 1434, 1822, -749, -1943, -441, 840, 932, 705, -292, -1785, -497, 870, 941, 898, -247, -2118, -768, 1564, 1572, -245, -1445, -1545, 792, 2548, 578, -1648, -1222, 154, 775, 1174, -202, -1204, -896, 245, 658, 1041, 408, -1543, -1649, 773, 1706, 815, -666, -2130, -719, 1926, 2112, -703, -1816, -953, 336, 1492, 848, -999, -1421, 103, 546, 555, 899, -492, -1974, 138, 1244, 1295, 426, -1404, -1803, 720, 2414, 389, -1337, -1743, -240, 1008, 1641, -326, -1603, -492, 485, 848, 1168, -99, -1405, -827, 209, 926, 1061, -396, -2157, -773, 1668, 1817, -164, -1356]
4185a356k3K205J296j703j800q7J356O25P83q91j447K30M78N96J026p87k001k26
4203a726K634R30r55j597j107J445J994p9k480n70J059R33P29l18j456p66J276
4220e4N60L98J74j517j377J443J735n3j337j618k81K654J559j894j885k27J297
4237d23J446K2j288o06K13P91L96R55j391j525K20J332J073L0j981j422J511K627
4255A980k39k086j171N99J535Q26r57j890K25R29O38O29o26r82p55Q77J317O98
4273A547j302j834k69K957R38j153k147p11J866J617j30j844p75M23Q46R62k40
4290G51j119q07L02R44J217k27j519j339J168K009K85j779j614L8K550R91j335
4307E16j347l39R04J159O0q46q85J0N93J053L29o47j785k92J767J670q05k119
$$ y = [-1356, -1379, 826, 2122, 419, -1381, -1468, -112, 513, 1296, 405, -1042, -812, -334, 262, 1288, 501, -1500, -1726, 908, 1838, 883, -714, -1821, -376, 1618, 1539, -941, -1511, -452, 481, 1210, 892, -564, -1330, -54, 506, 904, 1078, -439, -1816, -373, 1362, 1309, -28, -1646, -1927, 727, 2286, 392, -1493, -1720, -423, 1023, 1045, -243, -849, -636, 155, 551, 1506, 115, -1410, -1190, 142, 1215, 1245, -736, -2158, -647, 1980, 1741, -345, -1516, -917, 618, 1444, 487, -1403, -1178, -249, 389, 1018, 392, -590, -1345, -468, 849, 1547, 245, -1589, -1858, 1099, 2037, 884, -1263, -1974, -108, 1509, 1379, -465, -1240, -817, 29, 991, 751, -368, -1175, -873, 71, 1288, 1061, -458, -1797, -629, 1380, 1665, -114, -1728, -1690, 860, 1851, 516, -831, -1170, -266, 893, 953, 107, -778, -768, -175, 878, 1207, 560, -1225, -1517, 250, 1920, 1115, -1004]
4325a004o97J113K355kk399q57P22J450O87j126q00m85O64L95R08j69j369o79
4343a293N98J846M16j435j718J38J891J396r42k268l35J680J082p0j282q12N95
4360e13M95O88K06q18j045l72J311J335k52j665j232J344J803L91k033j164L39
4377a182J875Q31j392j158k85J050P78L39p30p38k23M24J015P77r74j642n6J630
4395C39J537q47j905o04J010J940k67j203j470O69J425K29m03m04q27O3J072P03
4413A057n1j654j180J195K083K17j719j415K7J977J016q75j867m03J133J485k51
4430G75o89o17l55Q49O51L51o52j235j16J370J424q27j737o26R37J834M7j292
$$ y = [-1004, -1701, -588, 1767, 1765, -634, -1491, -769, 681, 1368, 242, -558, -1043, -379, 16, 924, 755, -614, -1293, -695, 1151, 1567, 132, -1586, -1448, 443, 1839, 897, -1371, -1706, -26, 1056, 986, -296, -1108, -513, -18, 670, 876, 58, -987, -1359, -48, 1287, 1035, -630, -1862, -518, 1285, 1676, -357, -1521, -1182, 693, 1524, 132, -1026, -1311, -261, 517, 856, 126, -612, -835, -411, 604, 1381, 407, -1235, -1291, 339, 1876, 1029, -876, -1480, -470, 1470, 1203, 0, -1470, -801, 624, 853, 450, 46, -781, -718, 354, 1057, 1006, -648, -1828, -633, 1450, 1667, -52, -1467, -1440, 537, 1553, 678, -1189, -1592, -459, 1026, 775, 86, -531, -886, -37, 614, 965, 313, -922, -1038, 332, 1756, 929, -808, -1434, -497, 1337, 1384, 92]
$$ [...]
8191A98
##END NTUPLES=NMR FID
##END=
