##TITLE=1H_LR-789-B-C2-OF
 CDCl3
 8 sc, 
 3.12.2024
##JCAMPDX= 6.0         $$ Bruker NMR JCAMP-DX V2.0
##DATA TYPE= NMR FID
##DATA CLASS= NTUPLES
##ORIGIN= UXNMR, Bruker Analytische Messtechnik GmbH
##OWNER= root
$$ XWIN-NMR		Version 3.5
$$ Tue Dec  3 16:17:59 2024 Russian Standard Time (UT+4h)  she@DPX200
##.OBSERVE FREQUENCY= 200.1315
##.OBSERVE NUCLEUS= ^1H
##.DELAY= (6, 6)
##.ACQUISITION MODE= SIMULTANEOUS
##.ACQUISITION SCHEME= undefined
##.AVERAGES= 8
##.DIGITISER RES= 18
##SPECTROMETER/DATA SYSTEM= spect
##.PULSE SEQUENCE= zg30
##.SOLVENT NAME= CDCl3
##.SHIFT REFERENCE= (INTERNAL, CDCl3, 0, 15.7039)
##AUDIT TRAIL= $$ (NUMBER, WHEN, WHO, WHERE, WHAT)
$$ ##TITLE= Audit trail, XWIN-NMR		Version 3.5
$$ ##JCAMPDX= 5.01
$$ ##ORIGIN= Bruker BioSpin GmbH
$$ ##OWNER= she
$$ F:/spectra/data/she/nmr/H-F/1/audita.txt
$$ ##AUDIT TRAIL=  $$ (NUMBER, WHEN, WHO, WHERE, WHAT)
(   1,<2024-12-03 16:16:57.60 +0400>,<she>,<DPX200>,
      <created by zg, POWCHK disabled, PULCHK disabled
       configuration hash MD5:
       00 E9 B6 7A A2 85 ED C7 34 08 36 98 17 FE 4E 26
       data hash MD5: 16K
       EE 8F 9D A3 EE F0 95 68 FB 31 89 38 14 48 7F E1>)
$$ ##END=
$$ 
$$ hash MD5
$$ F1 2A 14 AC E6 DE B6 DF 85 9E CA 96 AB 50 E4 11
##$RELAX= 
##$RELAX= 
##$RELAX= 
##$RELAX= 
##$RELAX= 
##$RELAX= 
$$ Bruker specific parameters
$$ --------------------------
##$DU= <F:/spectra>
##$EXPNO= 1
##$NAME= <H-F>
##$PROCNO= 1
##$TYPE= <nmr>
##$USER= <she>
##$AMP= (0..31)
100 100 100 100 100 100 100 100 100 100 100 100 100 100 100 100 100 100 
100 100 100 100 100 100 100 100 100 100 100 100 100 100 
##$AQSEQ= 0
##$AQ_mod= 1
##$AUNM= <au_zg>
##$AUTOPOS= <>
##$BF1= 200.13
##$BF2= 200.13
##$BF3= 200.13
##$BF4= 200.13
##$BF5= 200.13
##$BF6= 200.13
##$BF7= 200.13
##$BF8= 200.13
##$BYTORDA= 1
##$CFDGTYP= 0
##$CFRGTYP= 5
##$CHEMSTR= <none>
##$CNST= (0..31)
1 1 145 1 1 1 1 1 1 1 1 1 1 1 1 1 1 1 1 1 1 1 1 1 1 1 1 1 1 1 1 1 
##$CPDPRG= <>
##$CPDPRG1= <>
##$CPDPRG2= <>
##$CPDPRG3= <>
##$CPDPRG4= <mlev>
##$CPDPRG5= <mlev>
##$CPDPRG6= <mlev>
##$CPDPRG7= <mlev>
##$CPDPRG8= <mlev>
##$CPDPRGB= <>
##$CPDPRGT= <>
##$D= (0..31)
0 1.2 0 0 0 0 0 0 0 0.06 0 0.03 0 0 0 0 0.0002 0 0 0 0 0 0 0 0 0 0 0 0 
0 0 0 
##$DATE= 1733228217
##$DBL= (0..7)
120 120 120 120 120 120 120 120 
##$DBP= (0..7)
150 150 150 150 150 150 150 150 
##$DBP07= 0
##$DBPNAM0= <>
##$DBPNAM1= <>
##$DBPNAM2= <>
##$DBPNAM3= <>
##$DBPNAM4= <>
##$DBPNAM5= <>
##$DBPNAM6= <>
##$DBPNAM7= <>
##$DBPOAL= (0..7)
0.5 0.5 0.5 0.5 0.5 0.5 0.5 0.5 
##$DBPOFFS= (0..7)
0 0 0 0 0 0 0 0 
##$DE= 6
##$DECBNUC= <off>
##$DECIM= 24
##$DECNUC= <off>
##$DECSTAT= 4
##$DIGMOD= 1
##$DIGTYP= 9
##$DL= (0..7)
0 120 120 120 120 120 120 120 
##$DP= (0..7)
150 150 150 150 150 150 150 150 
##$DP07= 0
##$DPNAME0= <>
##$DPNAME1= <>
##$DPNAME2= <>
##$DPNAME3= <>
##$DPNAME4= <>
##$DPNAME5= <>
##$DPNAME6= <>
##$DPNAME7= <>
##$DPOAL= (0..7)
0.5 0.5 0.5 0.5 0.5 0.5 0.5 0.5 
##$DPOFFS= (0..7)
0 0 0 0 0 0 0 0 
##$DQDMODE= 0
##$DR= 18
##$DS= 0
##$DSLIST= <SSSSSSSSSSSSSSS>
$$ [...]
##$SUBNAM2= <"">
##$SUBNAM3= <"">
##$SUBNAM4= <"">
##$SUBNAM5= <"">
##$SUBNAM6= <"">
##$SUBNAM7= <"">
##$SUBNAM8= <"">
##$SUBNAM9= <"">
##$SW= 24.0689530833862
##$SWIBOX= (0..15)
0 0 2 0 0 0 0 0 0 0 0 0 0 0 0 0 
##$SW_h= 4816.95568400771
##$TD= 16384
##$TD0= 1
##$TE= 0
##$TE2= 300
##$TE3= 300
##$TEG= 300
##$TL= (0..7)
0 120 120 120 120 120 120 120 
##$TP= (0..7)
150 150 150 150 150 150 150 150 
##$TP07= 0
##$TPNAME0= <>
##$TPNAME1= <>
##$TPNAME2= <>
##$TPNAME3= <>
##$TPNAME4= <>
##$TPNAME5= <>
##$TPNAME6= <>
##$TPNAME7= <>
##$TPOAL= (0..7)
0.5 0.5 0.5 0.5 0.5 0.5 0.5 0.5 
##$TPOFFS= (0..7)
0 0 0 0 0 0 0 0 
##$TUNHIN= 0
##$TUNHOUT= 0
##$TUNXOUT= 0
##$USERA1= <user>
##$USERA2= <user>
##$USERA3= <user>
##$USERA4= <user>
##$USERA5= <user>
##$V9= 5
##$VALIST= <valist>
##$VCLIST= <CCCCCCCCCCCCCCC>
##$VD= 0
##$VDLIST= <DDDDDDDDDDDDDDD>
##$VPLIST= <PPPPPPPPPPPPPPP>
##$VTLIST= <TTTTTTTTTTTTTTT>
##$WBST= 1024
##$WBSW= 4
##$XGAIN= (0..3)
0 0 0 0 
##$XL= 0
##$YL= 0
##$YMAX_a= 211065
##$YMIN_a= -79458
##$ZGOPTNS= <>
##$ZL1= 120
##$ZL2= 120
##$ZL3= 120
##$ZL4= 120
##$ABSF1= 10
##$ABSF2= 0
##$ABSG= 5
##$ABSL= 3
##$ALPHA= 0
##$AQORDER= 0
##$ASSFAC= 0
##$ASSFACI= 0
##$ASSFACX= 0
##$ASSWID= 0
##$AUNMP= <proc_1d>
##$AZFE= 0.1
##$AZFW= 0.1
##$BCFW= 1
##$BC_mod= 2
##$BYTORDP= 1
##$COROFFS= 0
##$CY= 11.3945322036743
##$DATMOD= 1
##$DC= 2
##$DFILT= <>
##$DTYPP= 0
##$F1P= 15.6554695791079
##$F2P= 12.8336369535428
##$FCOR= 0.5
##$FTSIZE= 0
##$FT_mod= 4
##$GAMMA= 1
##$GB= 0.15
##$INTBC= 1
##$INTSCL= 1
##$ISEN= 128
##$LB= 0.24
##$LEV0= 0
##$LPBIN= 0
##$MAXI= 10000
##$MC2= 0
##$MEAN= 0
##$ME_mod= 0
##$MI= 1.114404
##$NCOEF= 0
##$NC_proc= 0
##$NLEV= 6
##$NOISF1= 3.799351
##$NOISF2= 2.8
##$NSP= 1
##$NTH_PI= 0
##$NZP= 0
##$OFFSET= 15.70392
##$PC= 1
##$PHC0= -26717.27
##$PHC1= 12.38744
##$PH_mod= 1
##$PKNL= yes
##$PPARMOD= 0
##$PSCAL= 0
##$PSIGN= 0
##$REVERSE= no
##$SF= 200.130013532006
##$SI= 16384
##$SIGF1= 3
##$SIGF2= 2
##$SINO= 400
##$SIOLD= 16384
##$SREGLST= <1H.CDCl3>
##$SSB= 0
##$STSI= 0
##$STSR= 0
##$SW_p= 3612.71676300578
##$SYMM= 0
##$S_DEV= 0
##$TDeff= 0
##$TDoff= 0
##$TI= <>
##$TILT= no
##$TM1= 0
##$TM2= 0
##$TOPLEV= 0
##$USERP1= <user>
##$USERP2= <user>
##$USERP3= <user>
##$USERP4= <user>
##$USERP5= <user>
##$WDW= 1
##$XDIM= 8192
##$YMAX_p= 0
##$YMIN_p= 0
$$ End of Bruker specific parameters
$$ ---------------------------------
##NTUPLES= NMR FID
##VAR_NAME=  TIME,          FID/REAL,        FID/IMAG
##SYMBOL=    X,             R,               I
##VAR_TYPE=  INDEPENDENT,   DEPENDENT,       DEPENDENT
##VAR_FORM=  AFFN,          ASDF,            ASDF
##VAR_DIM=   8192,          8192,            8192
##UNITS=     SECONDS,       ARBITRARY UNITS, ARBITRARY UNITS
##FACTOR=    0.0002076,     1,               1
##FIRST=     0,             0,               0
##LAST=      1.7004516,     0,               0
##MIN=       0,             -79458,          0
##MAX=       1.7004516,     211065,          0
$$ Real data points
##PAGE= N=1
##DATA TABLE= (X++(R..R)), XYDATA
$$ [...]
$$ plain form
1970 71 188 231 -79 -8 100 33 -111 397 66 285 -289 15 66 -72 -46 45 151 432 73 83 178 -132 274
1993 274 -138 127 -98 -6 44 286 237 -72 227 42 50 142 -103 99 101 239 -96 -132 -106 -244 76 -150 -226 213
2017 213 15 124 33 196 57 3 179 118 280 112 -151 70 243 65 -45 -171 3 31 26 3 -166 69
2039 69 -127 -178 17 -14 190 89 -27 -66 36 -67 -160 -20 151 -92 156 11 -156 93 81 134 -11 205
2061 205 -181 -172 -157 -24 181 226 57 156 202 41 124 120 -407 -7 64 172 27 -145 -5 34 254 257 -63 -146 115
2086 115 135 -233 -103 -90 88 -51 -248 -74 172 179 -148 -149 147 -266 -17 234 238 185 -96 104 -72 98 123
2109 123 184 150 132 274 -374 -128 -165 147 46 -212 320 150 77 64 7 163 87 -42 -205 -92 -124 -31 -323
2132 -323 96 247 16 -156 191 -270 124 -137 36 43 -165 201 -82 38 -170 -17 -151 214 -168 38 -99
$$ packed form
1970G1J17M3l10P1J08o7j44N08l31K19n74L04N1j38K6R1J06K81l59J0R5l10M06
1993B74m12K65k25R2N0K42m9l09K99j85QR2k45K02KJ38l35l6K6j38L20k26p6M39
2017B13j98J09r1J63j39n4J76o1J62j68k63K21J73j78j10j26J74K8nk3j69K35
2039F9j96n1J95l1K04j01j16l9J02j03r3J40J71k43K48j45j67K49j2N3j45K16
2061B05l86RJ5J33K05M5j69R9M6j61Q3mn27M00P1J08j45j72J40L9K20Ll20q3K61
2086A15K0l68J30J3J78j39j97J74K46Pl27jK96m13K49K51Mn3k81K00j76J70K5
2109A23O1l4j8J42o48K46l7L12j01k58N32j70p3j3n7J56p6j29j63J13l2R3k92
2132c23M19J51k31j72L47m61L94k61J73Pk08L66k83J20k08J53j34L65l82K06j37
$$ plain form
2153 -99 -126 237 -421 327 -20 -67 168 -88 183 -24 -65 -5 118 -124 15 -18 -18 147 -52 5 -26 -156 95
2176 95 -218 -410 -170 -111 111 -240 137 -49 -82 346 208 88 73 196 -160 -378 163 -128 -249 -19 170
2197 170 187 121 395 58 133 147 356 203 -99 -100 -78 -31 -44 -42 -239 -98 86 -161 -70 -103 -82 252 34 -146 125
2222 125 -97 71 40 -331 94 165 90 214 -202 -61 87 29 115 115 5 -66 74 176 -152 179 -35 -161 -82
2245 -82 -10 -78 290 -90 314 -14 169 74 171 157 186 173 -252 -91 62 -208 71 179 64 -110 57 -212 -115
2268 -115 -130 -233 175 -118 49 24 -102 -17 -2 -295 311 -212 83 -63 202 99 76 107 -131 -25 121 86
2290 86 77 -108 75 -203 -176 -19 -116 -126 -51 -158 32 -229 -431 -176 -70 81 -128 40 -160 134 26 218
2312 218 33 -21 217 89 30 415 -24 -284 -79 263 -45 84 37 -51 40 -288 174 -265 160 86 83 -178 -180
$$ packed form
2153i9k7L63o58P48l47m7K35k56K71k07m1O0J23k42J39l3%J65j99N7l1j30K51
2176I5l13j92K40N9K22l51L77j86l3M28j38j20j5J23l56k18N41k91j21K30J89
2197A70J7o6K74l37P5J4K09j53l02jK2M7j3Kj97J41J84k47R1l3K1L34k18j80K71
2222A25k22J68l1l71M25P1p5J24m16J41J48n8Q6%j10p1J40J02l28L31k14j26P9
2245h2P2o8L68l80M04l28J83r5R7j4K9j3m25J61J53k70K79J08j15j74J67k69R7
2268a15j5j03M08k93J67k5j26Q5J5k93O06n23K95j46K65j03k3L1k38J06J46l5
2290H6rj85J83k78K7J57r7j0P5j07J90k61k02K55J06J51k09J68k00K94j08J92
2312B18j85n4K38j28n9L85m39k60K05L42l08J29m7q8R1l28M62m39M25p4lk61k
$$ plain form
2335 -180 55 29 133 -235 162 68 384 -150 -39 73 35 -120 -116 107 8 -50 262 -104 174 -112 -53 167 -162
2358 -162 25 -162 -155 -109 164 138 168 -302 12 157 -118 -40 200 244 -274 64 -49 -303 255 -266 70 234
2380 234 55 68 116 78 -117 101 51 -122 -30 -32 -185 -256 18 80 -152 11 87 110 20 199 317 16 -80 -127 35
2405 35 -67 -98 -186 22 -279 446 -433 77 365 -197 -14 -131 63 73 157 119 -92 -283 101 -220 42 208
2427 208 -85 -375 -285 -49 130 44 -106 66 -79 -122 -158 215 -100 14 -117 -18 11 125 209 -46 59 157 -181
2450 -181 -14 -239 58 -64 113 -163 -175 -103 -130 -9 -140 148 -109 40 -359 25 3 46 -152 172 34 65
2472 65 61 -26 180 -550 -88 120 177 -166 38 -38 -140 171 -14 -320 -105 174 24 -134 98 170 -95 159
2494 159 -101 -147 -20 189 -22 -333 183 -104 51 40 -40 96 64 46 -74 260 -107 94 101 321 -105 133
$$ packed form
2335a80K35k6J04l68L97r4L16n34J11J12l8j55MK23r9n8L12l66K78k86N9K20l29
2358a62J87j87PM6K73k6L0m70L14J45k75P8K40M4n18L38j13k54N58n21L36J64
2380B34j79J3M8l8j95K18n0j73R2kj53p1K74O2k32J63P6K3r0J79J18l01r6m7J62
2405C5j02l1q8K08l01P25q79N10K88n62J83j17J94J0Q4l8k11j91L84l21K62J66
2427B08k93k90R0K36J79q6j50J72j45m3l6L73l15J14j31R9K9J14Q4k55J05R8l38
2450a81J67k25K97j22J77k76j2P2k7J21j31K88k57J49l99L84k2M3j98L24j38L1
2472F5mq7K06p30M62K08N7l43K04p6j02L11j85l06K15K79j50j58K32P2k65K54
2494A59k60m6J27K09k11l11N16k87J55j1q0J36l2j8j20L34l67K01PK20m26K38
$$ plain form
2516 133 -31 -41 70 77 -145 45 -360 146 -219 26 57 264 -5 -337 189 -64 239 -282 -146 -141 -82 -30 -164
2539 -164 84 148 -422 -178 111 -76 407 191 144 -18 -175 -22 201 71 -43 187 171 -145 39 -198 -118
2560 -118 -7 195 285 -66 261 39 -199 184 -426 147 -159 -91 -162 10 3 65 98 -99 144 -50 328 -176
2582 -176 -101 -18 -25 315 -36 -180 -119 -94 -137 102 -79 -95 317 -95 7 216 -385 318 -241 -176 -301 -187 6
2605 6 83 65 289 228 219 14 -146 -319 -144 -51 74 -35 -263 -225 -31 285 -283 -143 239 52 12 65 -232 -84
2629 -84 35 194 85 8 214 161 -112 73 -86 64 -113 23 72 -222 74 -199 194 -11 131 -29 72
2650 72 -186 294 161 -138 -49 -46 158 -187 58 -298 -321 86 319 456 -116 60 65 156 -14 1 113 -39 -221
2673 -221 1 -88 165 -125 110 -124 0 -50 -4 -109 32 -48 6 -169 147 13 84 -22 -172 -168 -368 -135 -60
$$ packed form
2516A33j64j0J11Pk22J90m05N06l65K45L1K07k69l32N26k53L03n21J36NN9N2j34
2539a64K48O4n70K44K89j87M83k16m7j62j57J53K23j30j14K30j6l16J84k37Q0
2560a18J11K02R0l51L27k22k38L83o10N73l06O8p1J72pO2L3j97K43j94L78n04
2582a76P5Q3pL40l51j44O1K5m3K39j81j6M12m12J02K09o01P03n59O5j25J14J93
2605FP7j8K24o1rk05j60j73J75R3J25j09k28L8J94L16n68J40L82j87m0N3k97J48
2629h4J19J59j09p7K06n3k73J85j59J50j77J36M9k94K96k73L93k05J42j60J01
2650G2k58M80j33k99Q9LK04l45K45l56k3M07K33J37n72J76NR1j70J5J12j52j82
2673b21K22q9K53k90K35k34J24n0M6j05J41q0N4j75L16j34P1j06j50Mk00K33P5
$$ plain form
2696 -60 174 -91 197 -15 133 -5 -242 -186 79 -211 -98 -187 -252 -308 282 -106 99 -89 162 38 -51 137
2718 137 -109 273 166 81 -264 -246 -257 -155 27 32 224 -38 -301 -42 75 -62 -1 177 -112 -11 61 80 -132
2741 -132 -37 86 75 134 162 36 418 -81 -193 -137 292 -176 -445 -214 -179 24 95 169 44 47 -21 -176 139 52
2765 52 87 -147 13 -103 138 50 259 -166 53 0 -123 294 -82 111 -157 -467 146 -1 116 -171 204
2786 204 235 -198 -33 -20 -167 20 -27 115 -15 53 -226 -97 10 -133 -19 4 -104 106 -156 -47 -243 93
2808 93 10 176 -282 -130 135 -244 -186 -1 -90 22 48 -113 -39 59 83 -45 33 112 -97 -86 164 -50 231 118
2832 118 293 166 58 -79 -126 -112 -6 86 7 182 286 249 -138 248 20 -102 -11 36 184 278 18 147 -110
2855 -110 157 -52 257 209 85 -114 75 343 -72 326 16 -73 33 75 -65 18 -256 -58 49 53 -120 -113 -222
$$ packed form
2696f0K34k65K88k12J48j38k37N6K65k90J13q9o5n6N90l88K05j88K51j24q9J88
2718A37k46L82j07q5l45J8j1J02J82NJ92k62k63K59J17j37O1J78k89J01P2J9k12
2741a32R5J23j1N9K8j26L82m99j12N6M29m68k69K31L5K03P1P4j25Lo8j55L15q7
2765E2L5k34J60j16K41q8K09m25K19n3j23M17l76J93k68l10O13j47J17k87L75
2786B04L1m33J65J3j47J87m7J42j30O8k79J29J07j43J14K3j08K10k62J09j96L36
2808I3q3J66m58J52K65l79N8J85q9J12K6j61P4R8K4j28P8P9k09J1K50k14K81j13
2832A18J75j27j08j37m7J4J06R2p9J75J04l7l87L86k28j22R1M7J48R4k60J29k57
2855a10K67k09L09m8j24j99J89K68m15L98l10q9J06M2j40Q3k74J98J07Mj73Pj09
$$ plain form
2878 -222 58 264 185 262 -402 -102 144 -278 -12 -97 -83 32 -76 -36 84 1 82 210 77 -176 -58 37 -90
2901 -90 -198 48 -127 73 169 -52 -144 -101 129 -97 -206 46 99 -208 20 -398 172 143 -306 -109 -176 398
2923 398 -31 85 105 -146 -176 145 -112 68 21 2 210 264 77 40 166 161 -103 -124 7 -285 238 15 -57
2946 -57 54 -381 298 36 106 109 -121 124 57 -95 334 -152 50 -29 -204 -278 -179 -17 -18 142 -22 -116 -144 -20
2970 -20 -20 162 -330 35 197 -249 -14 -357 170 -183 -198 -55 -45 99 -153 -283 -65 47 -12 44 285 -225
2992 -225 -44 52 -44 121 175 -103 -152 -124 163 -12 -69 128 10 -36 107 259 -5 7 -176 -167 -107 103 167 -38
3016 -38 -147 196 365 24 -302 -59 99 260 -63 -27 101 1 111 -100 11 204 126 43 246 209 233 -281
3038 -281 -200 -146 17 140 -100 -140 5 52 30 42 17 -5 71 67 -3 -224 93 13 12 -173 -166 125 -144 37 -1 -75
$$ packed form
2878b22K80K06p9P7o64L00K46m22K66q5J4J15j08M0J20q3Q1J28j33k53J18R5j27
2901i0j08K46j75K00R6k21r2M3K30k26j09K52N3l07K28m18N70k9m49J97o7N74
2923C98m29J16K0k51l0L21k57J80m7j9K08N4j87l7J26nk64k1J31k92N23k23p2
2946e7J11m35O79k62P0Lk30K45o7j52M29m86K02p9j75p4R9J62jJ60j64r4k8J24
2970b0%J82m92L65J62m46K35l43N27l53j5J43J0J44k52j30K18J12n9N6K41n10
2992b25J81R6r6J65N4k78m9K8K87j75n7J97j18m6J43J52k64J2j83RO0K10O4k05
3016c8j09L43J69l41l26K43J58J61l23L6J28j00J10k11J11J93p8q3K03l7K4n14
3038b81Q1N4J63J23k40m0J45M7k2J2k5k2P6mp0k21L17q0jj85PK91k69J81l8p4
$$ plain form
3064 -75 128 343 131 -122 10 17 -43 94 -59 -197 -64 249 37 44 53 37 -9 178 -113 50 268 150 383
3087 383 133 119 -158 35 -63 240 -106 110 -9 -158 346 147 235 6 62 349 -116 -303 -86 67 -72
3108 -72 -71 -97 112 257 75 -94 92 -175 -109 69 -116 -74 44 214 139 80 310 -147 288 355 241 -10 172
3131 172 -44 -90 158 48 263 176 190 129 32 191 35 -251 304 -248 -356 -98 -73 -167 69 -240 -89 -346
3153 -346 10 85 -28 -238 -83 -65 -142 -236 353 -146 -268 -135 266 195 31 -34 36 -88 91 -35 0 -397 -64
3176 -64 -236 -336 -5 174 26 -215 -228 51 -55 59 91 -113 -147 -206 -231 42 65 -139 -17 -206 -138 -13 -46
3199 -46 -196 -129 -295 -258 119 100 12 207 143 410 110 35 -54 -13 -72 -22 -82 -167 127 -117 -91 121 31 -22 19 -143
3225 -143 125 -181 157 -292 -16 -81 -109 19 -62 27 147 -262 -353 -95 -188 -81 -81 -75 -74 175 -144 12 -141 212
$$ packed form
3064g5K03K15k12k53J32Po0J37j53j38J33L13k12PRj6m6J87k91J63K18j18K33
3087C83k50j4k77J93r8L03l46K16j19j49N04j99Q8k29N6K87m65j87K17J53j39
3108g2Jk6K09J45j82j69J86k67O6J78j85M2J18J70p5n9K30m57M35O7j14k51J82
3131A72k16m6K48j10K15q7J4o1r7J59j56k86N55n52j08K58K5r4K36l09J51k57
3153c46L56P5j13k10J55J8p7r4N89m99j22J33M01p1j64o5P0j24J79j26L5l97L33
3176f4j72j00L31J79j48k41j3K79j06J14L2k04l4n9k5K73K3k04J22j89O8J25l3
3199d6j50O7j66L7L77j9q8J95o4K67l00p5q9M1n9N0o0q5K94k44K6K12r0n3M1j62
3225a43K68l06L38m49K76o5k8J28q1Q9J20m09r1K58r3J07%OJK49l19J56j53L53
$$ plain form
3249 212 392 -144 -144 110 225 -61 373 44 32 -309 -96 -18 141 154 -308 -209 -36 -56 -75 36 30 -36 53 127
3273 127 191 -99 -49 -118 162 -63 80 347 288 185 -86 20 -218 -196 156 -238 180 128 -37 -513 119 -56
3295 -56 274 -171 -36 -26 232 -207 -355 26 -75 -109 -129 97 -107 67 321 -56 53 -14 352 104 -82 90
3317 90 -37 238 -304 -129 233 -62 248 -44 168 125 185 302 162 -185 94 -10 -251 107 -210 -108 -17
3338 -17 -149 129 52 149 -361 252 142 -137 180 209 256 -83 87 249 72 237 -269 454 99 -247 -326 171
3360 171 104 211 98 -145 251 -83 -194 -111 -5 241 -61 123 166 -144 114 137 147 -467 -16 57 -86 -57
3382 -57 280 40 78 -99 -149 -188 24 -10 31 -1 -137 -36 -94 39 -346 192 -262 -193 10 99 270 35 282
3405 282 24 503 126 38 -187 7 -108 -126 -149 -156 -273 382 -165 30 343 170 176 -126 80 72 -98 -21 123
$$ packed form
3249B12J80n36%K54J15k86M34l29j2l41K13P8J59J3m62R9J73k0j9J11oo6Q9P4
3273A27O4k90N0o9K80k25J43K67n9j03k71J06k38K2L52l94M18n2j65m76O32j75
3295e6L30m45J35J0K58m39j48L81j01l4k0K26k04J74K54l77J09o7L66k48j86J72
3317I0j27K75n42J75L62k95L10k92K12m3O0J17j40l47K79j04k41L58l17J02R1
3338a7j32K78p7R7n10O13j10k79L17K9M7l39J70J62j77J65n06P23l55l46p9M97
3360A71o7J07j13k43L96l34j11Q3J06K46l02J84M3l10K58K3J0o14M51P3j43K9
3382e7L37k40L8j77n0l9K12l4M1l2j36J01n8J33l85N38m54O9K03Q9J71k35K47
3405B82k58M79l77q8k25J94j15j8k3pj17O55n47J95L13j73Ol02K06qj70P7J44
$$ plain form
3428 123 -266 142 -170 410 -50 144 -221 -267 -73 -78 -64 75 187 -62 15 237 159 8 -53 81 -17 127 -223
3451 -223 103 14 -304 82 359 138 126 -376 -147 51 182 -101 -160 20 0 230 90 33 -147 76 261 -294
3473 -294 17 29 213 21 79 124 -56 -172 -112 35 61 -156 -272 317 72 -61 -115 204 4 -341 -48 47
3495 47 108 -25 -8 -42 6 75 -149 -281 -2 74 24 145 -14 151 122 -119 47 109 -53 -28 -110 67 -295 220
3519 220 326 -26 53 80 97 227 133 113 43 -46 105 -22 -87 13 -60 -45 248 60 -31 364 -223 51 126 -12
3543 -12 11 -58 168 43 -73 -206 133 232 14 63 178 -2 99 57 30 -33 200 280 70 -64 374 117 -23
3566 -23 -12 -45 248 130 1 -500 -210 96 115 333 -340 26 255 -10 -67 -151 -133 60 -39 -135 129 -32 275
3589 275 170 66 116 368 186 158 90 -205 -7 151 -86 -210 96 73 -91 -392 -16 177 60 291 102
$$ packed form
3428A23l89M08l12N80m60J94l65m6J94nJ4J39J12k49P7K22p8j51o1J34r8J44l50
3451b23L26q9l18L86K77k21j2n02K29J98J31k83n9J80k0K30j40n7j80K23J85n55
3473b94L11J2J84j92N8M5j80j16O0J47K6k17j16N89k45j33n4L19k00l45K93R5
3495D7O1j33J7l4M8O9k24j32K79P6n0J21j59J65k9k41J66O2j62K5q2J77l62N15
3519B20J06l52P9K7J7J30r4k0p0q9J51j27o5J00p3J5K93j88r1L95n87K74P5j38
3543a2K3o9K26j25j16j33L39R9k18M9J15j80J01m2k7o3K33Q0k10j34M38k57j40
3566b3J1l3K93j18j29n01K90L06J9K18o73L66K29k65n7q4J8J93r9r6K64j61L07
3589B75j05j04N0K52j82k8o8k95J98J58k37j24L06k3j64l01L76J93j17K31j89
$$ plain form
3610 102 -147 -114 -342 123 -3 47 -182 292 24 -133 -122 -318 212 -80 377 15 50 -225 -22 173 114 -35
3632 -35 61 -84 -202 18 78 217 -93 -191 16 285 105 73 83 -87 129 3 502 44 -35 22 284 60 35
3655 35 -91 -22 205 -8 239 -356 36 73 186 161 11 -218 -62 -61 64 120 -50 -161 -183 21 144 -85 -231
3678 -231 -100 -23 263 101 -627 0 130 19 241 363 89 -109 146 -101 254 326 -80 69 160 18 155
3699 155 -79 147 27 151 69 -174 113 -115 82 177 219 -77 -56 -220 -122 57 65 -111 29 -97 -8 350 67
3722 67 -12 -432 -380 -73 95 -14 -10 -122 -35 -9 -280 44 269 -41 -206 382 -32 69 -29 330 -202 112 241
3745 241 -184 28 -61 25 -213 255 49 -79 -20 -58 259 -97 -84 21 30 167 -218 54 237 25 -73 -240 257
3768 257 -342 60 34 -46 -70 -30 87 -70 -49 -234 -301 93 -200 38 56 -370 -211 -39 39 -95 -337 69 257
$$ packed form
3610A02k49L3k28M65j26N0k29M74k68j57J1j96N30k92M57l62L5k75K03J95n9j49
3632c5R6j45j18K20O0J39l10r8K07K69j80l2J0j70K16j26M99m58p9N7K62k24k5
3655C5j26O9K27k13K47n95L92L7J13k5j50k29J56JJ25N6j70j11k2K04J23k29j46
3678b31J31P7K86j62p28O27J30j11K22J22k74j98K55k47L55P2m06J49R1j42J37
3699A55k34K26j20J24q2k43K87k28J97R5M2k96K1j64R8J79Qj76J40j26Q9L58k83
3722F7p9m20N2L07J68j09Mj12Q7K6k71L24K25l10j65N88m14J01r8L59n32L14J29
3745B41m25K12q9Q6k38M68k06j28N9l8L17l56J3J05RJ37l85K72J83k12r8j67M97
3768B57n99M02k6q0k4M0J17j57K1j85o7L94k93K38J8m26J59J72P8j34k42M06J88
$$ plain form
3791 257 182 -96 -186 -131 18 -124 135 -216 174 -156 89 204 7 -112 150 165 -73 -105 233 -116 52 37
3813 37 255 29 14 131 88 -165 3 -8 -213 213 -57 233 -56 4 -339 -113 -79 -101 130 -93 -193 195
3835 195 76 194 -103 -360 133 83 -51 -46 78 -459 19 155 325 181 -97 -141 -154 268 16 85 -48 -70
3857 -70 324 -1 -222 -119 178 20 71 226 -89 92 161 581 -5 33 78 84 -26 194 46 -17 -86 34 -10
3880 -10 309 -87 -138 132 148 -49 -86 116 125 194 16 -201 36 14 -528 -254 10 221 -165 131 77 258 69
3903 69 -158 176 140 -40 171 105 -8 -55 -177 34 118 -58 -93 -63 122 22 -267 57 -84 131 -111 -36 22
3926 22 204 224 -188 240 -50 -268 -127 21 -249 52 175 84 -50 42 379 38 67 42 -88 -156 55 265
3948 265 -27 -76 -163 197 -126 -127 119 -4 -64 -66 -32 14 -209 -251 -218 21 -101 -17 -69 -332 309 -70 228 18
$$ packed form
3791B57p5k78r0N5J49j42K59l51L90l30K45J15j97j19K62J5k38l2L38l49J68j5
3813C7K18k26j5J17m3k53J68j1k05M26k70K90k89O0l43K26L4k2K31k23j00L88
3835A95j19J18k97k57M93n0j34NJ24n37M78J36J70j44k78m4j3M22k52O9j33k2
3857g0L94l25k21J03K97j58N1J55l15J81O9M20n86L8M5Oj10K20j48o3o9J20m4
3880a0L19l96n1K70J6j97l7K02RO9j78k17K37k2n42K74K64K11l86K96n4J81j89
3903F9k27L34l6j80K11o6j13m7j22K11Q4j76l5L0J85j00k89L24j41K15k42P5N8
3926B2J82K0m12M28k90k18J41J48k70L01J23r1j34R2L37l41K9k5j30o8K11K10
3948B65k92m9q7L60l23jK46j23o0kL4M6k23m2L3K39j22Q4n2k63O41l79K98k10
$$ plain form
3972 18 -141 70 17 110 28 -388 74 51 -403 -132 -159 64 -234 53 -16 -19 -124 226 -45 -108 189 54 1 293
3996 293 -136 317 63 259 4 -113 -167 -111 -59 250 106 -17 -37 -98 54 -18 129 -50 -259 -267 184 -386 55
4019 55 -8 -91 1 -1 -19 133 -143 165 -84 -166 151 -103 294 222 -204 322 -72 -33 -40 -85 1 -42 181 -154 42
4044 42 -35 -19 244 155 -122 -216 367 -67 140 426 195 65 -157 -101 19 67 -419 -199 294 -182 507 -115
4066 -115 -218 -56 -47 -149 -74 -125 77 160 128 84 39 81 89 302 325 -62 481 87 -40 7 -54 6 -12 9 -116 -178
4092 -178 -314 -86 51 -119 -17 -183 184 -392 91 -372 -285 -316 -164 77 18 179 -65 -111 15 -277 11
4113 11 -171 300 156 -318 -185 -49 -31 -50 8 118 332 -179 -258 226 167 -248 -6 73 354 -153 51 120 165
4136 165 74 -274 -54 -47 14 -263 65 -99 -174 -130 127 -122 165 -275 -414 -108 160 253 -165 -239 -90 180 22
$$ packed form
3972A8j59K11n3R3q2m16M62k3m54K71k7K23k98K87o9lj05L50k71o3K97j35n3K92
3996B93m29M53k54J96k55j17n4N6N2L09j44j23k0o1J52p2J47j79k09qM51n70M41
4019E5o3q3R2kj8J52k76L08k49q2L17k54L97p2m26N26l94L9pm5Q6m3K23l35J96
4044D2p7J6K63q9k77r4N83m34K07K86k31j30k22N6J20M8m86K20M93m76O89o22
4066a15j03J62Rj02P5n1K02Q3l2m4m5M2QK13K3l87N43l94j27M7o1O0j8K1j25o2
4092a78j36K28J37j70J02j66L67n76M83m63Q7l1J52K41n9J61k44m6J26k92K88
4113A1j82M71j44m74J33J36J8j9N8J10K14n11p9M84n9m15K42P9K81n07K04O9M5
4136A65r1l48K20PO1k77L28j64p5M4K57k49K87m40j39L06K68R3m18p4J49K70j58
$$ plain form
4159 22 277 -105 -220 7 234 93 -76 -316 22 -72 -88 21 344 -174 222 -28 -43 -42 26 325 137 -43
4181 -43 136 51 9 164 -17 -6 316 -9 -229 -47 -14 26 97 -185 142 -107 -386 -178 -189 183 13 116 3
4204 3 14 136 -70 192 12 215 90 274 19 184 193 75 -176 -66 -72 -194 219 94 347 126 -59 -59 -197
4227 -197 -28 224 -34 72 -152 -22 176 -254 225 -4 46 -35 151 -42 -245 17 -77 -54 198 -62 -121 329
4249 329 96 104 -7 -184 -108 -104 18 -129 95 -54 -106 70 -59 204 -202 -124 -265 63 -331 -93 106 -128
4271 -128 210 -108 95 -105 -93 128 -40 73 -57 112 55 18 135 31 -156 -227 -121 8 -68 64 -140 -129
4293 -129 73 13 166 211 -43 -154 82 -73 116 -103 164 180 313 -96 -388 64 -227 92 46 159 39
4314 39 136 -68 -94 -10 266 149 -28 317 83 -169 183 -52 183 103 -71 -129 -38 -81 -52 194 140 102 97 46 23
$$ packed form
4159B2K55l82j15K27K27j41j69k40L38r4j6J09L23n18L96k50j5JO8K99j88j80
4181d3J79q5m2J55j81J1L22l25k20J82L3M0P1k82L27k49k79K08j1L72j70J03j13
4204CJ1J22k06K62j80K03j25J84k55J65Rj18k51J10oj22M13j25K53k21j85%j38
4227a97J69K52k58J06k24J30J98m30M79k29N0q1J86j93k03K62r4K3K52k60n9M50
4249C29k33Qj11j77P6MJ22j47K24j49n2J76j29K63m06P8j41L28l94K38J99k34
4271a28L38l18K03k00J2K21j68J13j30J69n7l7J17j04j87p1J06J29p6J32k04J1
4293a29K02o0J53M5k54j11K36j55J89k19K67J6J33m09k92M52k91L19m6J13j20
4314C9R7k04k6Q4K76j17j77L45k34k52L52k35K35q0j74n8R1m3K9K46n4l8nn1k3
$$ plain form
4339 23 -179 -71 239 -6 -146 7 60 440 -10 -205 214 14 -76 -190 215 38 48 -164 -287 -55 -63 -243
4361 -243 59 122 -205 129 -370 151 -224 -205 -149 182 35 0 -393 114 -174 -12 -187 -45 257 20 399
4382 399 -108 85 -334 -137 129 40 -242 150 107 -201 130 -98 -140 -20 -30 77 -105 -44 -27 329 -168 -61
4404 -61 -108 -41 -167 7 -146 -28 157 233 101 -36 153 -45 -252 30 261 -86 106 159 -8 -78 90 419
4426 419 228 -41 237 64 -22 232 458 -181 -47 -270 188 351 1 -176 109 -231 -30 175 22 267
4446 267 252 -57 19 -73 129 -212 90 38 231 -126 -79 -3 426 49 -68 260 -151 326 269 -101 -168 -147 -124
4469 -124 193 -146 -325 -48 311 120 29 -67 115 -153 101 121 0 -23 72 41 -83 73 -76 -192 236 83
4491 83 172 -144 66 -47 26 321 92 229 -504 -73 -167 -24 -101 -187 366 -110 -30 283 -48 86 10 122 -121
$$ packed form
4339B3k02J08L10k45j40J53N3L80m50j95M19k00r0j14M05j77J0k12j23K32qj80
4361b43L02O3l27L34m99N21l75J9N6L31j47l5l93N07k88J62j75J42L02k37L79
4382C99n07J93m19J97K66q9k82L92m3l08L31k28m2J20j0J07j82O1J7L56m97J07
4404f1m7O7j26J74j53J18J85P6j32j37J89j98k07K82K31l47J92N3j67p0J68L29
4426D19j91k69K78j73q6K54K26o39J34k23M58J63l50j77K85l40K01K05j53K45
4446B67j5l09P6r2K02l41L02n2J93l57M7P6M29l77j17L28m11M77n7l70o7K1K3
4469a24L17l39j79K77L59j91r1r6J82k68K54K0j21k3R5l1j24J56j49j16M28j53
4491H3Q9l16K10j13P3K95k29J37p33M31r4J43p7q6N53m76Q0L13l31J34p6J12k43
$$ plain form
4514 -121 -244 128 127 139 19 26 -331 -304 262 -227 -227 67 -33 150 103 104 80 151 -96 -103 4 -18 -111 56 291 129
4540 129 136 -373 6 -247 35 89 -234 16 -87 -425 -151 62 -27 189 -239 -19 98 149 42 -220 47 123
4562 123 54 -77 154 -152 -70 56 -57 191 193 -185 -250 260 32 65 -101 -178 69 -169 272 -33 -83 -115 -11
4585 -11 257 -74 67 250 -47 201 -131 -217 -31 242 43 -41 -54 -244 171 -193 103 50 -132 -35 59 -303
4607 -303 -320 99 13 -25 -52 60 147 63 -129 -42 -107 -50 89 124 -291 256 38 66 123 -249 -263 -115 -328 -71
4631 -71 -289 -29 251 -288 -192 -146 -66 514 53 188 175 -72 -14 -140 4 295 32 269 -164 -57 28 -132
4653 -132 81 -495 -74 -51 95 82 70 -81 -264 327 -163 172 65 -26 531 54 -177 45 -53 445 -91 308
4675 308 105 -225 287 142 -70 -213 83 -301 -180 114 -69 73 -4 25 -92 120 71 76 204 -270 -222 52
$$ packed form
4514a21j23L72jJ2j20Pl57K7N66m89%K94j00J83m7Jk4P1k47pJ07k2r3J67K35j62
4540A29Pn09L79k53K82N4l23K50j03l38K74K13q9K16m28K20J17N1j07k62K67P6
4562A23o9j31K31l06Q2J26j13K48Kl78o5N10k28L3j66p7K47k38M41l05n0l2J04
4585a1K68l31J41J83k97K48l32q6J86K73j99q4j3j90M15l64K96n3j82R7R4l62
4607c03j7M19q6l8k7J12Q7q4j92Q7o5N7J39L5m15N47k18K8N7l72j4J48k13K57
4631g1k18K60K80n39R6M6Q0N80m61J35j3k47N8j26J44K91k63K37m33J07Q5j60
4653a32K13n76M21K3J46j3j2j51j83N91m90L35j07r1N57m77k31K22r8M98n36L99
4675C08k03l30N12j45k12j43K96l84J21K94j83J42p7K9j17K12m9NJ28m74M8K74
$$ plain form
4697 52 270 91 31 228 -154 -144 -160 10 -236 -25 384 110 -270 286 70 -95 -21 -20 -88 -398 -22 218 -109
4720 -109 72 69 169 221 -219 62 293 17 142 -43 -130 -196 -44 -265 167 256 -178 -358 -277 -208 12 -46 155
4743 155 -76 -22 202 41 -287 -6 238 -84 -283 -180 -101 -312 -216 194 28 -196 315 144 22 -171 -108
4764 -108 154 94 -19 225 262 -221 -124 22 -96 293 329 -361 197 128 -287 -74 -144 146 -70 81 -84 40
4786 40 225 -237 -212 2 -225 -114 47 -45 70 -288 110 114 -181 61 238 91 -9 96 -362 -268 -120 96
4808 96 152 121 73 -294 167 209 312 -290 284 -37 29 97 -65 -212 97 297 -270 239 -468 167 -407 197
4830 197 -25 47 -320 -49 243 -206 187 -51 80 -116 172 7 176 -150 100 163 -122 170 -40 164 165
4851 165 51 -315 -220 -75 74 -298 -18 -57 -148 -100 -126 -21 168 -56 -155 -27 -50 -271 263 -118 -21 94 -330
$$ packed form
4697E2K18j79o0J97l82J0j6J70k46K11M09k74l80N56k16j65P4Jo8l10L76K40l27
4720a09J81lJ00N2m40K81K31k76J25j85q7o6J52k21M32Q9m34j80Q1O9K20n8K01
4743A55k31N4K24j61l28K81K44l22j99J03P9k11R6M10j66k24N11j71j22j93O3
4764a08K62o0j13K44L7m83R7J46j18L89L6o90N58o9m15K13p0K90k16J51j65J24
4786D0J85m62K5K14k27J11J61r2J15l58L98Mk95K42J77j47j00J05m58R4J48K16
4808I6N6l1m8l67M61M2J03o02N74l21O6O8j62j47L09K00n67N09p07O35n74O04
4830A97k22P2l67K71K92m49L93k38J31j96K88j65J69l26K50O3k85K92k10K04J
4851A65j14l66R5J45J49l72K80l9r1M8k6J05J89k24r9J28k3k21N34l81R7J15m24
$$ plain form
4874 -330 158 80 -252 -208 180 128 -110 -343 -296 -37 -217 195 268 44 53 160 34 -51 -185 206 56 -35 -176
4897 -176 -70 -287 174 -105 -16 73 86 264 322 -103 17 2 -1 47 -125 92 251 -456 -209 -148 -339 -39 -276
4920 -276 -151 29 138 34 117 15 -55 -88 -34 230 -209 24 -140 77 199 296 463 194 130 -302 -158 166
4942 166 159 -129 89 92 -82 -186 17 -22 -210 28 -55 -140 -8 -77 -278 45 -55 -36 -34 -170 -174 475 -244 -204 -80
4967 -80 -107 -2 135 -266 -7 9 -146 167 -115 182 -161 -112 -34 -64 427 439 118 143 -220 194 -59 310 -4
4990 -4 -134 9 173 -222 -388 18 -272 354 -89 -22 -2 -131 -155 -195 -351 0 -10 -41 -168 -278 -262 79 -25
5013 -25 -169 75 -3 4 197 201 18 54 36 -365 -267 121 -168 -18 -107 98 185 -170 19 34 -67 90 -119 47
5037 47 386 202 23 119 -128 249 -279 159 -78 -126 34 -111 220 -97 158 -238 -149 -152 -2 -12 123 297
$$ packed form
4874c30M88p8l32M4L88n2k38k33M7K59j80M12P3k24RJ07j26q5j34L91j50r1j41
4897a76J06k17M61k79Q9Q9J3J78N8m25J20j5lM8j72K17J59p07K47O1j91L00k37
4920b76J25J80J09j04Q3j02p0l3N4K64m39K33j64K17J22R7J67k69o4m32J44L24
4942A66pk88K18Lj74j04K03l9j88K38q3q5J32o9k01L23j00J9Kj36mO49p19M0J24
4967h0k7J05J37m01K59J6j55L13k82K97l43M9P8l0M91J2l21K5l63M14k53L69l14
4990dj30J43J64l95j66M06k90O26m43O7K0j29k4m0j56L51j0l1j27j10J6L41j04
5013b5j44K44p8PJ93Mj83L6j8m01R8L88k89J50q9K05Q7l55J89J5j01J57k09J66
5037D7L39j84j79R6k47L77n28M38k37m8J60j45L31l17K55l96Q9lJ50j0J35J74
$$ plain form
5059 297 -168 -91 -69 -136 -102 -79 -175 110 72 -183 149 -236 140 66 360 77 -137 5 -202 151 159 -201 329
5082 329 -85 61 -319 -141 25 -51 271 -4 6 127 13 92 80 442 211 15 2 -61 -136 47 199 270 47
5105 47 -134 58 -12 -65 13 60 -391 -1 -353 -101 203 242 102 -58 -139 10 63 71 278 104 -213 35 -95
5128 -95 -153 -218 -141 -96 -155 201 119 -90 12 -108 -211 -72 -105 -77 -115 -220 -45 -167 -34 93 195 64 -192
5151 -192 -108 106 65 55 165 489 -72 -591 -110 60 226 71 147 -9 -193 42 125 140 395 -63 -147 -11
5173 -11 -25 198 45 -160 -101 -376 -65 190 -52 41 131 -126 -63 141 -33 -140 152 421 -26 48 -40 157 -346
5196 -346 48 -90 176 -80 131 -24 -316 115 192 13 138 483 -30 -36 33 -29 -180 319 -69 -59 10 177
5218 177 35 146 316 431 128 69 34 -226 -93 -85 -65 420 -31 55 89 -158 -148 39 191 127 -302 -262 -3
$$ packed form
5059B97m65P7K2o7L4K3r6K85l8k55L32l85L76p4K94k83k14J42k07L53Ql60N30
5082C29m14J46l80J78J66p6L22k75J0J21j14P9j2L62k31j96j3o3p5J83J52P1k23
5105D7j81J92p0n3P8M7m51L90l52K52L04L9j40j60q1J49N3QK07j74l17K48j30
5128i5n8o5P7M5n9L56q2k09J02j20j03J39l3K8l8j05J75j22J33J27J02j31k56
5151a92Q4K14m1j0J10L24n61n19M81J70J66j55P6j56j84K35Q3J5K55m58q4J36
5173a1j4K23j53k05N9k75L11K55k42R3R0k57O3K04j74j07K92K69m47P4q8J97n03
5196c46L94j38K66k56K11j55k92M31P7j79J25L45n13oO9o2j51M99l88J0O9J67
5218A77j42J11J70J15l03n9l5k60J33QK0M85m51Q6L4k47J0J87J52o4m29M0K59
$$ plain form
5241 -3 -218 95 104 125 105 -162 -223 -145 270 -197 201 -108 299 -61 216 -84 312 230 -34 37 303 -119 -35 -285
5265 -285 -181 63 -235 123 -200 30 46 -75 72 -50 97 4 84 124 -13 93 -213 -253 389 418 -132 106
5287 106 301 -128 39 255 -134 -45 -340 195 -68 187 -76 108 -166 -48 29 -157 16 -51 -91 68 -78
5308 -78 -96 31 176 -131 -257 -14 -64 54 -127 71 -74 127 -177 -230 245 -8 -108 -23 259 364 -20 -205
5330 -205 -283 203 74 31 194 188 -237 265 -56 27 353 96 -37 -101 57 -219 -9 -8 236 -215 -1 8 -270
5353 -270 -14 -53 -128 170 -203 -211 -79 119 -200 -205 -186 82 -21 -68 -288 -162 46 1 55 66 -181 -130 103 -109
5377 -109 477 -137 -75 -216 -17 418 71 74 256 -81 160 -218 -24 -163 111 42 -65 135 104 251 370 97
5399 97 40 287 -198 188 -85 22 -27 55 -110 59 -141 -4 -129 345 45 166 352 101 195 206 178 -188
$$ packed form
5241ck15L13RK1k0k67o1P8M15m67L98l09M07l60K77l00L96q2k64P1K66m22Q4k50
5265b85J04K44k98L58l23K30J6j21J47j22J47r3Q0M0j37J06l06m0O42K9n50K38
5287A06J95m29J67K16l89Q9k95N35k63K55k63J84k74J18P7j86J73o7m0J59j46
5308g8j8J27J45l07j26K43n0J18j81J98j45K01l04n3M75k53j00Q5K82J05l84j85
5330b05p8M86j29m3J63om25N02l21Q3L26k57j33o4J58k76K10JK44m51K14Rk78
5353b70K56l9p5K98l73qJ32J98l19nJ9K68j03m7k20J26K08m5N4J1k47N1K33k12
5377a09N86o14O2j41J99M35l47LJ82l37K41l78J94j39K74o9j07K00l1J47J19k73
5399I7n7K47m85L86k73J07m9Q2j65J69k00J37j25M74l00J21J86k51R4J1k8l66
$$ plain form
5421 -188 -26 -122 288 260 -345 105 78 20 -152 86 -99 -45 106 -30 11 -32 -244 113 28 56 -280 182 -319
5444 -319 58 297 -55 83 193 -3 -269 151 94 97 -111 -362 6 47 38 -76 -53 128 152 -265 -72 175 116
5467 116 -56 32 -122 -32 -168 -142 -141 -35 123 73 105 134 255 -38 29 -28 -76 83 -113 -34 -204 207 -32 217
5491 217 138 -129 -84 52 -23 41 162 96 -156 -76 -92 172 158 109 24 -111 -280 129 -76 158 257 -111 54 -138
5515 -138 -125 46 89 9 150 303 36 366 262 55 62 -209 -85 -197 -14 216 35 136 -113 -189 25 218
5537 218 -118 -72 59 -97 -9 -25 51 -162 40 -388 -40 33 222 -7 -108 254 89 -40 389 467 111 -4
5559 -4 -328 151 -32 69 -3 -98 14 -336 -47 -152 -136 134 58 -49 -24 152 302 9 -291 96 312 -454
5581 -454 107 -22 23 56 256 8 -368 28 42 -198 45 -75 -84 -45 -16 467 72 -201 59 156 74 -258 -152
$$ packed form
5421a88J62r6M10k8o05M50k7n8j72K38j85N4J51j36M1m3k12L57q5K8l36M62n01
5444c19L77K39l52J38J10j96k66M20n7Lk08k51L68M1rj14K3J81K4m17J93K47n9
5467A16j72Q8j54R0j36K6JJ06J58n0L2K9J21k93O7n7m8J59j96P9j70M11k39K49
5491B17p9k67M5J36p5O4J21o6k52Q0j6K64j4m9q5j35j69M09k05K34R9l68J65j92
5515a38J3J71M3q0J41J53k67L30j04k07Pk71J24j12J83K30j81J01k49p6K14J93
5537B18l36M6J31j56Q8j6P6k13K02m28L48P3J89k29j01L62j65j29M29P8l56j15
5559dl24M79j83J01p2r5J12l50K89j05J6K70p6j07K5J76J50k93l00L87K16p66
5581d54N61j29M5L3K00k48l76L96J4k40K43j20rL9K9M83l95k73K60R7q2l32J06
$$ plain form
5604 -152 -136 -331 249 66 284 59 -140 52 -60 99 -28 -137 89 -69 16 212 -9 115 98 233 55
5625 55 329 -146 311 150 -41 -57 -243 -51 294 82 98 315 -14 22 19 -137 116 -167 -44 138 224 -56
5647 -56 -211 15 -110 96 231 -59 -15 98 -89 76 -494 -13 162 -97 -304 -75 -188 106 23 -8 -192
5668 -192 -121 89 -126 -101 -481 32 -4 127 -58 308 -73 34 160 37 -325 -56 10 265 -146 59 304
5689 304 42 -154 14 -40 79 86 6 179 138 -78 58 33 -294 -247 -79 -80 -288 -210 -139 65 4 -118 -166 49
5713 49 -71 376 1 99 -68 -198 15 -59 -25 200 106 25 -5 -40 -92 -4 -354 264 295 211 -167 -190 10 6 172
5738 172 47 -115 -51 245 6 52 166 73 -238 184 -196 68 -134 -73 -35 -262 -187 42 -43 -100 60 -124 58
5761 58 -75 2 -50 -27 -77 -33 118 -120 -116 69 291 126 -350 229 29 -27 -39 76 234 70 66 -167 67 -248
$$ packed form
5604a52J6j95N80j83K18k25j99J92j12J59j27j09K26j58Q5J96k21J24j7J35j78
5625E5K74m75M57j61j91j6j86J92L45k12J6K17l29L6lj56K53k83J23J82Q6k80
5647e6j55K26j25K06J35k90M4J13j87J65n70M81J75k59k07K29j13K94q3l1j84
5668a92P1K10k15K5l80N13l6J31j85L66l81J07J26j23l62K69O6K55m11K05K45
5689C04k62j96J68n4J19Pq0J73m1k16J36k5l27M7J68jk08P8P1K04o1j22m8K15
5713D9j20M47l75R8j67j30K13p4L4K25r4q1l0l5n2Q8l50O18L1q4l78k3K00mJ66
5738A72j25j62O4K96k39M6J14r3l11M22l80K64k02O1L8k27P5K29q5n7J60j84J82
5761E8j33P7n2K3n0M4J51k38MJ85K22j65m76N79k00n6j2J15J58j64mk33K34l15
$$ plain form
5785 -248 -47 -139 84 -130 180 -86 83 22 120 -53 176 -114 201 -137 -11 200 -58 21 -77 -8 170 -98
5807 -98 214 -35 106 120 -171 73 80 0 -115 -27 -137 -1 124 -275 169 -61 -97 16 -66 91 70 -141 -305
5830 -305 -99 -235 155 -387 -82 74 315 -189 -287 -231 242 -114 -118 180 -57 224 -55 -178 -50 80 -249
5851 -249 163 528 -120 -135 -83 103 18 -118 187 -81 -161 -5 70 -57 32 304 -172 -11 156 -45 -171 84
5873 84 5 -82 -282 -44 -257 317 -34 -219 103 -193 -272 -68 -185 111 -275 45 -87 221 237 -20 -309 -170
5895 -170 -83 155 450 106 -38 132 -38 -158 -179 21 -268 67 -117 107 -205 126 70 -109 83 -37 -74
5916 -74 6 -4 -84 -80 13 -63 67 423 -82 135 -173 80 -167 237 -123 -178 -125 -160 -139 78 -84 -245 -255 -48
5940 -48 34 152 -149 10 425 -49 -232 -93 -176 250 -284 -25 -188 -151 6 13 120 78 151 -119 62 161 -8
$$ packed form
5785b48K01r2K23k14L10k66J69o1R8j73K29k90L15l38J26K11k58P9r8O9J78k68
5807i8L12k49J41J4k91K44Pq0j15Q8j10J36J25l99M44k30l6J13q2J57k1k11j64
5830c05K06j36L90n42L05J56K41n04r8N6M73l56mK98k37K81k79j23J28J30l29
5851b49M12L65o48j5N2J86q5j36L05k68q0J56P5j27Q9K72m76J61J67k01j26K55
5873H4p9q7k00K38k13N74l51j85L22k96p9K04j17K96l86L20j32L08J6k57k89J39
5895a70Q7K38K95l44j44J70j70j20k1K00k89L35j84K24l12L31n6j79J92j20l7
5916g4Q0j0q0MR3p6J30L56n05K17l08K53k47M04l60n5N3l5K1K17j62j61j0K07
5940d8Q2J18l01J59M15m74j83J39q3M26n34K59j63L7J57PJ07m2P3k70J81R9j69
$$ plain form
5963 -8 242 -268 -74 66 -16 -152 -243 71 -184 137 -109 -59 -43 286 129 -233 -165 219 -3 -246 192 -245
5985 -245 -126 203 -214 4 246 -145 145 -135 -187 306 -117 -62 -154 -69 151 11 155 44 470 -41 12 286
6007 286 -28 -35 -146 -21 -105 -18 398 -199 109 440 -48 -19 73 -24 84 -13 -219 24 -42 -4 -44 -235 289 -76
6031 -76 -25 -30 -45 85 -287 -226 238 166 -93 -204 117 263 148 199 310 -64 130 197 -268 -246 142 192 -34 256
6055 256 131 -34 -81 109 -170 14 -176 203 110 -6 186 -178 69 170 -46 -361 4 178 3 -192 101
6076 101 238 116 11 -2 -239 74 93 36 -38 309 67 322 -134 -74 153 -18 -157 -110 87 -481 -62 62
6098 62 -69 -7 -136 -183 65 46 -46 -32 138 -188 162 174 -81 383 -75 104 -135 -391 -171 -206 -148 48 176
6121 176 67 -121 273 298 150 -222 -81 -127 -40 -91 91 -77 293 409 -15 -52 -53 30 -77 -80 -31 60 -44 -27
$$ packed form
5963hK50n10J94J40q2j36r1L14k55L21k46N0J6L29j57l62O8L84k22k43M38m37
5985b45J19L29m17K18K42l91K90k80n2M93m23N5r2Q5K20j40J44j11M26n11N3K74
6007B86l14pj11J25q4Q7M16n97L08L31m88K9R2r7J08r7k06K43o6L8m0j91N24l65
6031g6N1nj5J30l72O1M64p2k59j11L21J46j15N1J11l74J94O7m65K2L88N0k26K90
6055B56j25j65m7J90k79J84j90L79r3j16J92l64K47J01k16l15L65J74j75j95K93
6076A01J37j22j05j3k37L13J9n7p4L47k42K55m56O0K27j71j39M7J97n68M19J24
6098F2j31O2j29m7K48j9r2J4J70l26L50J2k55M64m58J79k39k56K20l5N8J96J28
6121A76j09j88L94K5j48l72J41m6Q7n1J82j68L70J16m24l7jQ3j07lM9R1j04J7
$$ plain form
6145 -27 45 55 -146 -64 -160 -141 -62 103 115 -12 346 101 -69 159 176 179 -158 -216 -175 269 -157 213 -88 303
6169 303 94 -203 -52 -177 -309 165 215 6 106 65 359 -47 -54 -64 -30 -74 136 116 -265 236 -18 88 -11
6192 -11 -400 -103 -349 -276 -551 265 80 -199 -19 -5 134 -52 308 60 349 -196 105 -91 -153 -38 -69 59
6214 59 184 -333 268 -124 -34 16 -43 72 -290 150 -13 265 142 -63 -270 531 -118 -30 95 163 -159 -228
6236 -228 349 177 -189 -212 1 119 267 81 22 51 -16 -90 -222 -84 -29 113 -3 7 -225 96 -45 57
6258 57 145 56 -171 -6 247 -18 -151 -219 156 -134 -212 167 376 323 -145 269 182 -91 -63 -29 -238 -435 9
6281 9 55 -52 -119 -25 294 88 -221 213 137 -278 195 -59 85 -85 -50 -179 22 -20 145 38 -82 31 25
6304 25 252 192 33 232 51 -90 -71 128 -54 -23 -58 116 -261 226 534 161 154 191 130 -48 -96 0 -137 17
$$ packed form
6145b7P2J0k01Q2r6J9P9J65J2j27L58k45j70K28J7Ll37n8M1M44m26L70l01L91
6169C03k09k97J51j25j32M74N0k09J00m1K94m06pj0L4m4K10k0l81N01k54J06r9
6192a1l89K97k46P3k75Q16j85k79J80J4J39j86L60k48K89n45L01j96o2J15l1J28
6214E9J25n17O01l92R0N0n9J15l62M40j63K78j23k05k07Q01o49Q8J25O8l22o9
6236b28N77j72l66k3K13J18J48j86n9K9o7p4j32J38N5J42j16J0k32L21j41J02
6258E7Q8q9k27J65K53k65j33o8L75k90p8L79K09n3m68M14q7k73K8L4k09j97M44
6281IM6j07o7R4L19k06l09M34p6m15M73k54J44j70L5j29K01m2J65j07j20J13o
6304B5K27o0j59J99j81j41J9J99j82L1l5J74l77M87L08l73pL7o1j78m8R6j37J54
$$ plain form
6328 17 -154 18 91 109 65 64 12 -143 149 -80 -22 352 87 48 -166 -389 7 -43 -263 28 12 187 -206 31
6352 31 21 -326 66 37 23 184 -126 -83 57 29 -79 -168 174 -311 -250 37 -158 -12 -167 231 -267 -165 108
6375 108 -110 138 -220 -193 79 -464 -94 18 -366 78 100 110 22 -239 -104 110 -77 257 38 -83 -156 76
6397 76 99 -176 -113 60 -62 19 -202 95 -58 -64 -79 -161 60 45 -200 -206 -23 58 -87 -257 -83 -74 62 -30 131
6422 131 242 75 -137 71 -13 289 79 36 161 24 66 81 -343 57 242 93 4 75 -10 -36 -115 120 -106
6445 -106 -18 67 1 32 -279 295 -4 16 -54 -91 -186 -179 -92 -237 500 10 -132 -89 133 -338 -200 -252 39 -63
6469 -63 -103 19 87 23 132 -112 41 -225 -180 59 -68 126 140 2 89 -108 93 188 -91 154 -400 -110 -371
6492 -371 105 161 -73 53 -100 15 63 -171 204 -174 -148 -62 -20 51 91 -21 -13 129 -24 -3 -16 88 -80 -19
$$ packed form
6328A7j71J72P3J8m4jn2j55K92k29N8L74k65l9k14k23L96n0k20K91j6J75l93K37
6352C1j0l47L92k9j4J61l10M3J40k8j08q9L42m85O1K87j95J46j55L98m98J02K73
6375A08k18K48l58K7K72n43L70J12l84M44K2J0q8k61J35K14j87L34k19j21p3K32
6397G6K3k75O3J73j22Q1k21K97j53oj5q2K21j5k45oJ83Q1j45j70J74RJ36r2J61
6422A31J11j67k12K08q4L02k10m3J25j37M2J5m24M00J85j49q9P1q5k6p9K35k26
6445a06Q8Q5o6L1l11N74k99K0p0l7r5PQ7j45P37m90j42M3K22m71J38n2K91j02
6469f3m0J22O8o4J09k44J53k66M5K39j27J94J4j38Q7j97K01R5k79K45n54K90k61
6492c71M76N6k34J26j53J15M8k34L75l78K6Q6M2P1M0j12QJ42j53K1j3J04j68O1
$$ plain form
6516 -19 -145 -154 -102 232 168 177 -48 -99 19 -127 -9 10 -2 13 89 105 56 393 54 58 -83 -243 -373 179 121 -1
6542 -1 323 61 215 10 -212 -41 153 127 228 189 -31 -82 -99 165 -65 126 -54 182 -171 160 95 138 32
6565 32 -254 -17 57 21 -316 94 -30 113 58 -176 74 11 -77 270 35 176 195 -47 273 -5 36 -53 -228
6588 -228 54 -16 166 190 131 151 75 81 88 -69 -213 -248 -212 43 -176 117 -137 218 -36 -112 13 -15 42 21 113
6613 113 44 37 -96 291 -78 -216 -104 124 -273 -229 -76 19 -383 -29 -27 116 171 51 77 -146 -293 67 37
6636 37 255 -163 45 -195 104 339 85 -51 154 -12 -176 168 -302 -334 -128 403 8 -106 187 380 -242
6657 -242 174 -409 164 150 123 -36 40 114 133 -239 -13 40 -221 65 27 327 -199 -120 -51 -237 -78 261 -214
6680 -214 -32 141 112 -271 -128 -54 38 -120 169 125 82 10 71 -64 -197 -434 264 173 -128 48 -225 -12 288
$$ packed form
6516a9j26rN2L34o4Rk25n1J18j46J18J9j2J5P6J6m9L37l39Mj41j60j30N52n8j22
6542aL24k62J54k05k22J71J94k6J01l9k20n1j7K64k30J91j80K36l53L31o5M3j06
6565C2k86K37P4l6l37M10j24J43n5k34K50o3q8L47k35J41J9k42L20k78M1q9j75
6588b28K82p0J82K4n9K0p6OPj57j44l5L6K55k19K93k54L55k54p6J25k8N7k1R2
6613A13o9pj33L87l69j38J12K28l97M4J53R5m02L54KJ43N5j20K6k23j47L60l0
6636C7K18m18K08k40K99K35k54j36K05j66j64L44m70l2K06N31l95j14K93J93o22
6657b42M16n83N73j4k7j59P6P4J9l72K26N3k61K86l8L00n26P9O9j86J59L39m75
6680b14J82J73k9l83J43P4R2j58K89m4m3p2O1j35j33k37O98r1l01J76k73K13L00
$$ plain form
6703 288 85 -125 247 101 76 -82 -111 71 -71 230 5 -30 -141 -174 310 96 84 -54 28 -8 198 -204
6725 -204 169 -168 116 -132 -37 124 113 36 3 -65 -133 -33 -159 -174 91 -71 62 -203 153 45 -264 126
6747 126 153 -51 -101 -94 58 74 -214 0 6 68 395 -220 364 -26 95 -137 159 102 -24 149 84 -44 152
6770 152 -226 -99 36 -63 -161 42 213 50 149 52 185 -200 -140 43 326 202 10 86 317 -228 -95 -20
6792 -20 -189 -36 -94 18 135 -166 106 -56 -152 14 2 -396 -46 -317 86 205 12 -50 -79 -33 -294 509
6814 509 -279 419 234 -57 -80 -163 155 -21 53 -87 36 79 -171 71 -58 -52 -220 -63 -269 -44 37 165
6836 165 -156 60 7 -114 40 289 -318 37 183 -103 209 264 -23 63 -47 52 -260 -169 4 -131 146 10
6858 10 -2 94 -104 216 -11 19 -100 119 118 -247 103 8 -192 223 18 12 -121 37 168 197 246 -127 408 -124
$$ packed form
6703B88k03k10L72j46k5j58k9J82j42L01k25l5j11l3M84k14j2j38Q2l6K06m02
6725b04L73l37K84k48R5J61j1p7l3o8o8J00j26j5K65j62J33k65L56j08l09L90
6747A26K7k04n0PJ52J6k88K14OO2L27o15N84l90J21k32K96n7j26J73o5j28J96
6770A52l78J27J35r9r8K03J71j63R9r7J33l85O0J83K83j24j92P6K31n45J33P5
6792b0j69J53n8J12J17l01K72j62r6J66j2l98L50k71M03J19j93o2k9M6k61Q03
6814E09p88O98j85k91k3q3L18j76P4j40J23M3k50K42j29Oj68J57k06K25Q1J28
6836A65l21K16n3j21J54K49o07L55J46k86L12N5k87Q6j10R9l12R1J73j35K77j36
6858A0j2R6j98L20k27L0j19K19jl65L50r5k00M15k05oj33J58J31K9M9l73N35n32
$$ plain form
6882 -124 24 206 -182 64 -208 92 123 -18 346 -335 67 22 -173 -45 -238 -229 199 64 262 -210 -65
6903 -65 -310 157 448 -66 -48 35 139 236 206 303 93 -62 259 -74 368 153 159 22 -255 80 195 -272 186
6926 186 -217 -173 72 -63 57 -24 -110 109 -65 10 -180 102 -132 -200 -39 88 71 188 29 -265 149 31
6948 31 -78 -118 277 198 -109 -114 -32 -341 -259 -215 -32 83 225 -129 -18 99 -54 -176 194 -233 -201 -153 40
6971 40 362 178 -166 268 80 -319 24 -89 -127 -237 208 -421 16 -142 127 -11 -260 117 -447 353 -10
6992 -10 130 -159 -211 74 -165 309 -43 203 203 156 155 143 -58 -286 20 -52 -182 -294 0 -1 52 15 -132 -36 219
7017 219 -193 -11 -98 63 26 -45 225 183 -94 237 288 190 -197 -115 -46 112 -51 -28 -103 -66 85 -261 149 311
7041 311 122 -230 256 -54 153 -46 47 -267 171 51 -37 -28 -233 -90 -19 -118 -17 -69 -17 -1 -8 29 41 -94
$$ packed form
6882a24J48J82l88K46k72L00L1j41L64o81M02m5j95J28j93RM28j35J98m72J45
6903f5k45M67K91n14J8Q3J04R7l0R7k10j55L21l33M42k15Oj37k77L35J15m67M58
6926A86m03M4K45j35J20q1q6K19j74P5j90K82k34o8J61J27j7J17j59k94M14j18
6948C1j09m0L95p9l07nQ2l09Q2M4J83J15J42l54J11J17j53j22L70m27L2M8J93
6971D0L22j84l44M34j88l99L43j13l8j10M45o29M37j58K69j38k49L77n64Q00l63
6992a0J40k89n2K85k39M74l52K46%m7jj2k01k28L06p2j30j12K94jN3l7j47R6K55
7017B19m12J82q7J61l7p1K70m2k77L31N1r8l87Q2O9J58j63K3p5L7J51l46M10J62
7041C11j89l52M86l10K07j99R3l14M38j20q8Rk05J43P1r9J01n2N2J6pL7J2j35
$$ plain form
7065 -94 -27 191 -143 64 -127 -32 223 88 26 148 304 251 -220 67 38 -149 -200 44 42 62 -475 53 52 -107
7089 -107 -86 -13 -113 58 -143 -174 -372 -19 -222 -290 -117 121 139 11 -258 35 -249 14 -168 -150 148 248
7111 248 434 159 155 -51 -237 57 77 -439 -236 -130 156 -82 151 -103 350 -194 274 -75 464 74 -75
7132 -75 81 -114 21 -49 19 -41 181 -304 204 -158 -163 109 -264 25 247 -168 188 -209 214 8 407 143
7154 143 -36 127 190 -96 47 -160 10 9 222 -180 270 9 57 -97 8 62 273 37 71 -161 -109 -95 -54
7177 -54 134 192 155 161 -80 -31 158 8 -53 81 -179 -391 155 -222 -167 100 223 -186 99 221 -63 -151 -104
7200 -104 216 -55 -286 -36 -371 -45 45 -39 87 111 -3 -386 -153 -172 -192 -8 -7 10 -233 -34 100 164 111
7223 111 62 -38 -34 134 264 -192 293 10 301 -34 -69 161 -206 -179 -89 40 -329 -171 -220 71 -14 38 124
$$ packed form
7065i4O7K18l34K07j91R5K55j35o2J22J56n3m71K87k9j87n1K44kK0n37N28jj59
7089a07K1P3j00J71k01l1j98L53k03o8J73K38J8j28k69K93k84K63j82J8K98J00
7111B48J86k75mk06j86K94K0n16K03J06K86k38K33k54M53n44M68l49N39l90j49
7132g5J56j95J35p0O8o0K22m85N08l62nK72l73K89K22m15L56l97M23k06L99k64
7154A43j79J63O3k86J43k07J70jK13m02M50k61M8j54J05N4K11k36L4k32N2J4M1
7177e4J88N8l7Ok41M9J89j50o1J34k60k12N46l77N5K67J23m09K85J22k84q8M7
7200a04L20k71k31K50l35L26R0q4J26K4j14l83K33j9k0J84JJ7k43J99J34O4n3
7223A11m9j00MJ68J30m56M85k83K91l35l5K30l67K7R0J29l69J58m9K91q5N2Q6
$$ plain form
7246 124 -31 -94 215 321 -83 56 -64 -117 -226 -210 -235 -155 108 -228 23 23 -307 -95 117 139 267 102 162
7269 162 264 53 114 302 -161 -11 -40 -27 4 52 -248 -64 -18 157 144 91 13 22 112 142 -222 57 -30 122 33
7294 33 127 33 373 144 -96 -169 -39 51 -168 -234 246 -98 -2 -271 -233 -126 147 15 141 388 149 254 38
7317 38 39 -195 241 -190 423 314 176 -281 449 -83 -202 243 -76 343 294 1 -138 -166 28 -62 -66 -2 7 -169
7341 -169 236 51 -56 -107 -103 -168 209 119 -73 30 9 194 1 45 -25 169 -141 -17 402 -92 -122 -42 228
7364 228 -28 -26 -107 -88 -237 -49 37 256 87 313 -342 -209 77 -163 203 -76 -62 344 95 -246 218 179
7386 179 160 -338 65 -56 266 101 -137 177 83 9 -176 -8 36 -173 72 251 -247 -50 138 -55 -132 -275
7408 -275 85 -63 68 -185 -271 -281 58 155 -126 -168 22 -30 326 187 21 -153 -49 -214 -116 10 -216 25
$$ packed form
7246A24j55o3L09J06m04J39j20n3j09J6k5Q0K63l36K51%l30K12K12K2J28j65O0
7269A62J02k11O1J88m63J50k9J3L1M8l00J84M6J75j3n3p8RR0L0l64K79q7J52q9
7294C3R4r4L40k29k40p3J30R0k19o6M80l44R6k69L8J07K73j32J26K47k39J05k16
7317C8Jk34M36m31O13j09j38m57P30n32j19M45l19M19m9k93j39k8J94r0mO4Rj76
7341a69M05j85j07n1Mo5L77r0j92J03k1J85j93M4p0J94l10J24M19m94l0Q0K70
7364B28k56Kq1J9j49J88Q6K19j69K26o55J33K86k40L66k79J4M06k49l41M64l9
7386A79j9m98M03j21L22j65k38L14r4p4j85J68M4k09K45J79m98J97J88j93p7j43
7408b75L60j48J31k53q6j0L39R7k81m2J90n2L56j39j66j74J04j65R8J26k26K41
$$ plain form
7430 25 258 -151 -2 46 27 -38 -237 -425 11 -5 63 39 -15 -153 -196 -131 -29 -88 -91 -99 -39 -51 -188 182 115 -380
7456 -380 -189 87 130 -245 -261 -212 128 -54 -62 -12 227 -139 -296 178 181 -187 -50 -13 -124 -121 -112 180 -50 -425
7480 -425 -105 -40 -80 10 -47 57 117 244 163 -129 43 54 100 -33 248 -201 -86 276 -46 49 -39 57 118 -123
7504 -123 164 -76 2 216 -253 41 -54 -158 143 -61 -114 -56 -128 228 337 -3 115 -20 85 -303 -71 265
7526 265 -262 32 -97 11 -24 224 305 0 -66 -139 6 -70 155 -272 -281 -33 181 31 199 -78 131 254
7548 254 20 397 -134 58 176 -200 -184 -512 -396 -12 127 158 -448 2 -232 129 -113 255 64 70 -27 -76
7570 -76 74 -165 3 -42 55 -251 164 19 252 -4 -75 -194 70 130 58 -169 145 184 4 -52 -96 164 -253
7593 -253 -70 20 -251 25 -137 8 153 12 17 -122 170 103 46 -80 147 -7 -85 -207 344 -167 -251 -165 64
$$ packed form
7430B5K33m09J49M8j9o5j99j88M36j6O8k4n4j38m3O5J02n9lqO0j2j37L70o7m95
7456c80J91K76M3l75j6M9L40j82qN0K39l66j57M74Ll68J37L7j11LRK92k30l75
7480d25L20O5m0R0n7J04O0J27q1k92J72J1M6j33K81m49J15L62l22R5q8R6O1k41
7504a23K87k40P8K14m69K94r5j04L01k04n3N8p2L56J09l40J18j35J05l88K32L36
7526B65n27K94j29J08l5K48Q1l05o6p3J45p6K25m27rK48K14j50J68k77K09J23
7548B54k34L77n31J92J18l76J6l28J16L84J39L1o06M50k34L61k42L68j91Or7m9
7570g6J50k39J68m5R7l06M15j45K33k56p1j19K64O0p2k27L14L9j80n6m4K60m17
7593b53J83R0k71K76j62J45J45j41Nj39K92o7n7j26K27j54p8j22N51n11q4Q6K29
$$ plain form
7616 64 106 135 197 309 100 -195 193 -621 138 172 339 49 -178 -207 37 278 11 -19 34 145 77 -148 -284
7639 -284 -134 140 76 -197 -76 -173 123 -325 33 128 127 21 -5 20 -132 155 -47 4 17 -136 211 140 -79
7662 -79 -68 116 -50 -147 82 -112 126 109 303 269 27 -528 -188 -34 -175 122 -227 -339 111 -181 142 -186
7684 -186 -282 -258 -328 51 101 140 202 28 210 206 98 163 -39 -312 -111 72 220 -127 24 239 -55 -261 68
7707 68 126 40 -299 -348 50 55 168 318 246 -185 180 93 -300 33 175 20 107 -171 67 55 127 272 -29 -253
7731 -253 -50 -7 -430 119 58 -317 6 62 16 -50 71 59 -170 -449 -50 -53 -78 -219 80 83 -646 -83 131 56
7755 56 -59 -57 3 -239 -48 -70 68 -20 257 24 46 -13 114 -175 -106 116 -38 -223 -58 -257 -270 90 -161
7778 -161 -161 68 -351 394 82 130 8 61 223 -160 -21 -110 87 -60 -368 -114 -254 -37 81 -65 -73 -192
$$ packed form
7616F4M2K9O2J12k09k95L88q14P59L4J67k90k27k9K44K41k67l0N3J11o8k25j36
7639b84J50K74o4k73J21r7K96m48L58R5jj06k6K5j52K87k02N1J3j53L47p1k19
7662g9J1J84j66r7K29j94K38j7J94l4k42n55L40J54j41K97l49j12M50k92L23l28
7684a86r6K4p0L79N0L9O2j74J82mj08O5k02k73K01J83J48l47J51K15k94k06L29
7707F8N8q6l39m9L98NJ13J50p2m31L65q7l93L33J42j55Q7k78K38j2P2J45l01k24
7731b53K03M3m23N49o1l75L23N6m6o6J21j2k29k79L99lk5j41K99Lp29N63K14p5
7755E6j15KO0k42J91k2J38q8K77k33K2n9J27k89O9K22j54j85J65j99j3L60k51
7778a61%K29m19P45l12M8j22N3J62l83J39q9J97j47l08K54j40K17J18j46qj19
$$ plain form
7800 -192 -19 74 -107 91 398 28 -186 63 -203 -75 -112 65 43 71 235 25 248 118 -190 -89 -28 -152
7822 -152 228 -201 -117 66 -15 51 -162 -133 -114 6 84 -346 -230 -60 5 -343 63 -34 -74 236 -16 2 326
7845 326 -338 -407 -295 -95 117 -34 -83 400 167 221 223 408 43 4 29 46 -72 69 -215 -158 -16 40 133 -56
7869 -56 -96 21 -34 1 340 110 -431 186 -16 -110 93 88 -147 362 -10 105 147 185 -224 -50 -91 -30 -106 87
7893 87 -179 -15 232 -15 401 -308 107 -75 178 66 -221 149 -15 -8 -65 -265 92 207 24 58 116 -117
7915 -117 -87 -4 -86 16 131 -123 72 -56 -83 -13 -62 15 76 124 -46 -33 -265 -210 -257 27 -60 -22 49 52 -238 -82
7941 -82 -31 132 265 309 58 111 90 -60 -167 115 -63 -30 -23 162 148 -125 54 13 27 -73 248 -11 67 -296
7965 -296 -18 -112 197 -90 113 75 -43 -20 -41 45 83 -123 -178 123 57 -50 -107 -148 56 38 -303 119 -341 -371
$$ packed form
7800a92J73R3j81J98L07l70k14K49k66J28l7J77k2K8J64k10K23j30l08J01O1j24
7822a52L80m29Q4J83q1O6k13K9J9J20P8m30J16J70O5l48M06r7m0L10k52J8L24
7845C26o64o9J12K00K12j51m9M83k33N4KJ85l65l9K5J7j18J41k84N7J42N6R3j89
7869e6m0J17n5L5L39k30n41O17k02r4K03nk35N09l72J15M2L8m09J74m1O1p6J93
7893H7k66J64K47k47M16p09M15j82K53j12k87L70j64Pn7k00L57J15j83L4N8k33
7915a17L0Q3q2J02J15k54J95j28k7P0m9P7O1M8j70J3k32N5m7K84q7L8P1Lk90J56
7941h2N1J63J33M4k51N3k1j50j07K82j78L3PJ85j4k73J79m1J4j00L21k59P8l63
7965b96K78r4L09k87K03l8j18K3k1Q6L8k06n5L01o6j07n7m1K04j8l41M22m60l0
$$ plain form
7989 -371 -40 -51 -82 49 76 47 -16 35 10 379 136 -237 288 169 -55 -293 -200 -148 -34 220 -384 4 90
8012 90 87 -16 85 -253 -23 -131 -350 -109 197 17 -161 266 -4 -18 -3 15 -41 57 136 -14 73 -44 -95 62
8036 62 -17 20 13 -337 280 -204 -212 48 40 -31 163 132 40 -169 288 -122 46 -35 118 -545 -57 -93 165 123 -161
8061 -161 -144 113 -108 42 397 -274 32 97 112 50 -234 259 -70 -308 88 53 60 -46 88 174 33 170 -74
8084 -74 150 165 55 -290 1 -20 -308 -163 -166 -172 -97 -34 50 49 -172 -110 209 163 -90 39 148 -384 118 3 337
8109 337 -71 -305 -60 309 75 -205 -30 -186 136 18 136 443 38 -133 235 -186 -228 -128 179 -112
8129 -112 -27 -70 -279 277 -209 -93 259 24 -61 -22 -26 -312 -17 180 198 -55 39 -200 -104 -136 164 268 -62
8152 -62 14 259 47 132 -99 -40 170 71 103 172 -197 -27 -4 -6 -50 185 -155 79 -100 -369 199 35 -27 -245
$$ packed form
7989c71L31j1l1J31K7k9o3N1k5L69k43l73N25j19k24k38R3N2J14K54o04L88Q6
8012I0lj03J01l38K30j08k19K41L06j80j78M27k70j4J5J8n6R8P9j50Q7j17n1J57
8036F2p9L7pl50O17m84qK60qp1J94l1r2k09M57m10J68q1J53o63M88l6K58m2k84
8061a61J7K57k21J50L55o71L06O5J5o2k84M93l29k38L96l5Pj06J34Q6j41J37k44
8084g4K24J5j10l45K91k1k88J45loP5O3Q4jk21O2L19m6k53J29J09n32N02j15L34
8109C37m08k34K45L69k34k80J75j56L22j18J18L07m05j71L68m21m2J00L07k91
8129a12Q5m3k09N56m86J16L52k35q5L9mk86K95J97J8k53R4k39R6l2L00J04l30
8152f2P6K45k12Q5k31N9K10r9L2O9l69J70K3km4K35l40K34j79k69N68j64o2k18
$$ plain form
8176 -245 -159 316 54 -43 85 -30 -88 125 -36 -217 134 47 210 207 -167
$$ packed form
8176b45Q6M75k62r7J28j15n8K13j61j81L51q7J63ll74
8191a67
$$ Imaginary data points
##PAGE= N=2
##DATA TABLE= (X++(I..I)), XYDATA
$$ plain form
0 0 0 0 0 0 0 0 8 -8 8 -8 16 -16 19 -24 32 -33 40 -49 61 -72 81 -96 112 -129 148 -169 194 -220 250 -282
30 -282 318 -357 400 -447 499 -555 619 -687 763 -845 936 -1036 1148 -1271 1407 -1561 1736
47 1736 -1932 2162 -2427 2737 -3117 3580 -4164 4930 -5984 7533 -10032 14758 -26864 125023
61 125023 211065 -33191 -16095 87012 83147 -8386 28313 63024 30222 18008 78691 60318
73 60318 3324 22730 75331 29751 -14766 29175 66370 20984 14561 64709 54346 -14135
85 -14135 -7028 48869 42622 3000 19656 44798 26932 18250 40980 31271 -955 5074 24698
98 24698 5055 -5299 29452 44903 12696 3721 30633 24385 -11295 -11252 11357 5260 -5229
111 -5229 13708 24442 4947 -2641 7791 -2581 -20101 -4105 14634 -3971 -19163 3297
$$ packed form
0@%%%%%%Qj6J6j6K4l2L5m3N6o5P3q9J10j33J53j77K08k41K77l17L63m14M70n32
30b82O00o75P57q47R46j054J174j306J450j608J781j972K184k419K678k968L297
47A736l668M094m589N164n854O697p744R094j0914J3517j7565K4790m1622J51887
61A25023Q6042k44256J7096J03107l865r1533L6699L4711l2802j2214O0683j8373
73F0318n6994J9406N2601m5580m4517M3941L7195m5386o423N0148j0363o8481
85a4135P107N5897o247l9622J6656K5142j7866q682K2730r709l2226O029J9624
98B4698j9643j0354L4751J5451l2207q975K6912o248l5680M3K2609o097j0489
111e229J8937J0734j9495p588J0432j0372j7520J5996J8739j8605j5192K2460
$$ plain form
123 3297 16197 -7149 -20541 -5170 -4367 -24011 -20810 988 642 -14312 -11063 -1820 -11899 -23292
137 -23292 -18657 -13535 -16472 -15726 -10065 -13441 -17849 -9672 -4319 -15850 -27587 -25096 -17694 -16301 -15715
152 -15715 -13209 -13931 -15916 -14069 -12927 -17063 -22048 -22245 -18781 -15658 -13805 -13282 -13233 -12806 -14396 -18864
168 -18864 -20200 -17070 -13838 -13124 -12567 -11592 -13041 -13093 -10607 -10882 -15686 -17491 -13761 -10619 -10161 -7390 -4679
185 -4679 -7954 -12039 -10808 -8253 -9477 -9908 -7397 -6768 -7719 -5147 -2044 -2731 -5283 -5582 -5780 -8175 -6874
202 -6874 -1625 887 -1892 -2150 -792 -1589 -2467 -1277 -709 -2783 -2175 1733 3164 1543 2663 3114 289
219 289 -1933 189 2480 1982 2886 5304 4378 2164 3311 5660 3142 603 2034 4408 3544 4334 8129
236 8129 7294 3141 3005 6193 5478 2378 3977 6900 5127 4306 7728 8482 5031 3795 5929 5559 2882
$$ packed form
123C297J2900k3346j3392J5371Q03j9644L201K1798l46j4954L249R243j0079j1393
137b3292M635N122k937P46N661l376m408Q177N353j1531j1737K491P402J393N86
152a5715K506p22j985J847J142m136m985j97L464L123J853N23M9M27j590m468
168a8864j336L130L232P14N57R75j449n2K486k75m804j805L730L142M58K771K711
185d679l275m085J231K555j224m31K511O29r51K572L103o87k552k99j98k395J301
202f874N249K512k779k58J358p97q78J190N68k074O08L908J431j621J120M51k825
219B89k222K122K291m98R04K418r26k214J147K349k518k539J431K374q64P90L795
236H129q35m153j36L188p15l100J599K923j773q21L422P54l451j236K134l70k677
$$ plain form
253 2882 4590 8522 7738 5283 5325 6603 5336 4384 6306 5808 3551 3883 7351 7876 5938 5508 6370
270 6370 4448 3122 4569 6022 5291 5187 6192 5773 4281 4352 5495 4397 2974 3348 4154 4475 5082
287 5082 6086 5270 3180 2605 2652 3438 3319 3244 3287 2687 3280 4146 3488 1980 1596 1600 1425 1316 2144 2607 2312
308 2312 2032 1343 631 47 139 977 613 -512 35 933 1233 800 380 -1072 -2263 -1469 -299 -491 -1224
327 -1224 -949 -718 -1206 -1734 -1332 -1509 -2671 -3021 -2163 -1577 -2084 -2122 -1653 -1923 -3223 -4128 -3431 -2943 -3290 -2991
347 -2991 -2562 -2866 -3423 -3109 -2923 -3598 -4382 -4751 -3951 -3079 -3111 -3212 -3516 -3682 -4040 -3711 -4007 -4213 -3984 -3687
367 -3687 -3287 -3466 -3335 -2903 -3171 -4058 -3630 -3865 -3929 -3393 -2683 -2726 -2633 -3020 -3026 -2451 -2690 -2797 -3097 -2849 -2455 -2039
389 -2039 -1399 -1211 -1830 -2513 -1937 -1372 -1692 -1747 -1099 -489 -255 -1206 -603 -375 -570 -861 -350 -403 -266 183 604
$$ packed form
253B882J708L932p84k455M2J278j267r52J922m98k257L32L468N25j938m30Q62
270F370j922j326J447J453p31j04J005m19j492P1J143j098j423L74Q06L21O07
287E082J004q16k090n75M7P86j19p5M3o00N93Q66o58j508l84Mj75j09Q28M63k95
308B312k80o89p12n84R2Q38l64j125N47Q98L00m33m20j452j191P94J170j92p33
327a224K75K31m88n28M02j77j162l50Q58N86n07l8M69k70j300r05O97M88l47K99
347b991M29l04n57L14J86o75p84l69Q00Q72l2j01l04j66l58L29k96k06K29K97
367c687M00j79J31M32k68q87M28k35o4N36P10m3R3l87oN75k39j07l00K48L94M16
389b039O40J88o19o83N76N65l20n5O48O10K34r51O03K28j95k91N11n3J37M49M21
$$ plain form
410 604 1074 575 312 461 438 578 846 751 935 1193 1616 1837 1947 1942 995 1290 1629 1930 2052 2340 2148 2135
432 2135 2161 2043 1851 1842 1795 1954 2179 2098 2629 2823 2799 2530 2462 2119 1742 2008 2650 2624 2179 2370 2005 2295 2155
455 2155 2130 1919 1669 1610 1993 1946 2573 1714 1892 1664 1452 1196 1405 1302 1117 1518 1460 1503 872 949 1101 709
477 709 177 37 631 918 353 582 198 358 191 428 241 6 -407 -216 26 149 51 -421 -134 -695 -594
498 -594 -431 -550 -472 -647 -696 -165 -573 -1171 -851 -696 -859 -1050 -1149 -1226 -860 -455 -497 -1128 -1128 -1129 -743 -957 -758
521 -758 -1126 -674 -1163 -1040 -790 -788 -1104 -1203 -874 -1057 -776 -769 -638 -478 -838 -708 -701 -687 -949 -710 -643 -779 -322
544 -322 -457 -117 -597 -532 -439 -160 -665 -266 -261 -61 -772 -286 325 -54 81 -138 -78 -50 61 -170 -2 91 75
567 75 -129 156 -247 -374 -496 194 -114 -88 71 159 139 -105 -259 -57 -14 184 -111 156 243 -463 -440 283 100
$$ packed form
410F04M70m99k63J49k3J40K68r5J84K58M23K21J10nr47K95L39L01J22K88j92j3
432B135K6j18j92rm7J59K25q1N31J94k4k69o8l43l77K66O42k6m45J91l65K90j40
455B155k5k11k50n9L83m7O27q59J78k28k12k56K09j03j85M01n8M3o31P7J52l92
477G09n32j40N94K87n65K29l84J60j67K37j87k35m13J91K42J23r8m72K87n61J01
498e94J63j19P8j75m9N31m08n98L20J55j63j91r9p7L66M05m2o31%jL86k14J99
521g58l68M52m89J23K50Kl16r9L29j83K81PJ31J60l60J30PJ4k62K39O7j36M57
544c22j35L40m80O5R3K79n05L99NK00p11M86O11l79J35k19O0K8J11k31J68R3j6
567G5k04K85m03j27j22O90l08K6J59Q8k0k44j54K02M3J98k95K67Q7p06K3P23j83
$$ plain form
590 100 5 -90 -7 58 -122 -2 22 -304 -136 -154 -281 -99 75 -251 -171 -17 9 -80 17 -34 -187 -119 -164 -13 48
615 48 -81 -87 -259 -257 245 -240 -395 -35 41 -275 -274 14 43 151 -534 -4 -31 -44 16 -83 247 474 -28 52 148
640 148 -108 302 94 62 -36 233 228 434 424 484 401 97 -37 548 431 79 212 610 524 216 145 492 555 186
664 186 411 468 825 542 447 988 592 -178 496 307 904 506 719 895 684 465 600 620 685 54 808 843
686 843 540 347 704 710 257 519 466 504 136 479 164 505 353 462 10 151 259 148 273 -83 103 260
708 260 -42 289 -25 -36 46 -318 -19 28 -348 -278 -115 244 -130 -298 -154 -167 -253 -516 -524 -122 -286 -557 -514
731 -514 -541 -288 -521 -255 -528 -770 -409 -588 -467 -497 -787 -459 -599 -707 -523 -500 -354 -917 -504 -271 -498
752 -498 -895 -641 -430 -528 -459 -663 -330 -530 -552 -464 -249 -306 -403 -537 -109 -362 -732 -320 -640 -75 87 -369
$$ packed form
590A00r5r5Q3O5j80J20K4l26J68j8j27J82J74l26Q0J54K6q9R7n1j53O8m5J51O1
615D8j29oj72KN02m85j55L60P6l16JK88K9J08o85N30k7j3O0r9L30K27n02Q0R6
640A48k56M10k08l2r8K69nK06j0O0q3l04j34N85j17l52J33L98q6l08p1L47O3l69
664A86K25N7L57k83r5N41l96p70O74j89N97l98K13J76k11k19J35K0O5o31P54L5
686H43l03j93L57Om53K62n3L8l68L43l15L41j52J09m52J41J08j11J25l56J86J57
708B60l02L31l14j1Q2l64K99M7l76P0J63L59l74j68J44j3q6k63qM02j64k71M3
731e14k7K53k33K66k73k42L61j79J21l0k90L28j40j08J84K3J46n63M13K33k27
752d98l97K54K11r8O9k04L33k00k2Q8K15n7r7j34M28k53l70M12l20N65J62m56
$$ plain form
774 -369 -350 -43 -135 -27 184 166 144 8 -127 66 77 -230 -148 43 26 141 276 53 215 165 51 223 386
797 386 700 -17 221 587 226 177 102 486 303 478 368 309 763 586 483 366 163 56 420 428 340 123
819 123 71 202 630 62 189 276 474 391 306 623 173 186 328 618 154 36 354 350 231 21 138 450 -15
842 -15 72 -211 -19 279 -136 99 349 13 -210 -234 -280 5 -131 -92 -69 -237 185 139 298 -52 0 -221 -120
865 -120 -231 -364 -12 -24 -156 -119 -299 -195 -172 -335 -152 -40 -168 -270 -101 -184 -252 -85 -290 -154 -444 -130
887 -130 -13 -135 -406 -293 -172 -354 -294 -37 -273 -201 273 -115 -53 -219 -96 223 51 -501 113 235 -209
908 -209 -5 -95 323 -85 -39 200 88 -129 -34 -161 301 67 -31 142 343 126 208 61 -59 198 77 274
930 274 264 -27 349 211 278 288 -1 150 330 227 397 287 26 483 691 21 78 57 -58 27 93 125 140
$$ packed form
774c69J9L07r2J08K11j8k2j36j35J93J1l07Q2J91j7J15J35k23J62n0j14J72J63
797C86L14p17K38L66l61m9p5L84j83J75j10n9M54j77j03j17k03j07L64Qq8k17
819A23n2J31M28n68J27Q7J98q3q5L17m50J3J42K90m64j18L18mj19k10J17L12m65
842a5Q7k83J92K98m15K35K50l36k23k4m6K85j36L9K3j68M22m6J59l50N2k21J01
865a20j11j33L52j2j32L7j80J04K3j63J83J12j28j02J69q3o8J67k05J36k90L14
887a30J17j22k71J13J21j82O0K57k36P2M74l88O2j66J23L19j72n52O14J22m44
908b09K04r0M18m08M6K39j12k17R5j27M62k34r8J73K01k17Q2j47j20K57j21J97
930B74j0k91L76j38O7J0k89J51J80j03J70j10k61M57K08o70N7k1j15Q5O6L2J5
$$ plain form
953 140 -65 -141 205 62 53 -118 -35 252 -159 127 -204 -78 -250 -60 -65 -251 216 -289 -109 -198 -99 -67 18 -277
977 -277 -275 -242 -640 -184 -142 96 -216 -292 -241 8 -178 -48 -363 -116 -37 -337 -554 227 49 -365 -181 15 75
1000 75 -258 -235 19 -122 -27 -27 -166 -93 -187 -72 -289 -9 -220 -29 99 32 -91 -120 191 -89 115 36 -172
1023 -172 99 -368 277 226 -281 336 81 146 -27 132 -147 -146 23 -35 357 -80 294 32 218 103 313 238
1045 238 33 259 18 176 260 -45 371 246 40 391 199 115 267 262 -345 108 171 264 210 152 248 568 278
1068 278 304 520 156 76 363 51 172 -77 307 534 336 305 122 197 66 191 -83 45 -262 7 -161
1089 -161 416 78 144 48 -433 -100 -199 183 -152 26 -109 -8 -140 -244 -99 -192 -137 -62 -364 88 -6 -80 -158
1112 -158 -364 -213 -10 -246 -151 -442 86 -248 -142 -235 131 193 1 -49 -210 -303 -104 119 -134 -210 65 -200
$$ packed form
953A40k05p6L46j43rj71Q3K87m11K86l31J26j72J90nj86M67n05J80q9R9L2Q5k95
977b77KL3l98M56M2K38l12p6N1K49j86J30l15K47P9l00k17P81j78m14J84J96O0
1000G5l33K3K54j41R5%j39P3r4J15k17K80k11J91J28o7j23k9L11k80K04p9k08
1023a72K71m67O45n1n07O17k55O5j73J59k79JJ69n8L92m37L74k62J86j15K10p5
1045B38k05K26k41J58Q4l05M16j25k06L51j92q4J52no07M53O3R3n4n8R6L20k90
1068B78K6K16l64q0K87l12J21k49L84K27j98l1j83P5j31J25k74J28l07K69j68
1089a61N77l38O6r6m81L33r9L82l35J78j35J01j32j04J45r3N5P5l02M52r4p4p8
1112a58k06J51K03k36R5k91N28l34J06r3L66O2j92n0j61r3J99K23k53p6K75k65
$$ plain form
1134 -200 -424 -135 -288 47 -71 -394 -412 -89 -113 85 -211 84 -11 -7 -34 -22 -265 -31 -52 69 224 46 -69
1157 -69 -45 -290 -53 182 124 107 -130 164 475 88 -274 65 -195 18 -10 -112 74 116 22 51 -21 151 295
1180 295 110 -146 253 175 139 378 194 -165 -67 158 35 4 308 93 96 133 10 -51 111 117 255 -261 -44
1203 -44 80 20 -31 94 188 -90 -49 5 145 -112 9 -151 25 324 -19 -251 154 192 39 -291 -20 -123
1225 -123 168 77 -216 -163 -126 -88 141 -123 -301 55 -77 -62 -352 51 -99 -339 78 -123 -188 -319 369 15
1247 15 -238 281 -103 -196 -32 -61 -180 -278 -79 -290 62 82 154 -107 -304 -347 -265 -133 98 -210 -202 76 147 -119
1271 -119 -166 -141 -76 -16 -50 158 50 -169 -21 76 -169 -136 171 67 252 299 298 -82 216 395 189 441 9
1294 9 -69 216 177 113 76 178 50 -19 97 69 429 8 61 -128 127 289 95 58 392 405 165 -87 87 239
$$ packed form
1134b00k24K89j53L35j18l23j8L23k4J98k96K95r5Mk7J2k43K34k1J21J55j78j15
1157f9K4k45K37K35n8j7k37K94L11l87l62L39k60K13k8j02J86M2r4K9p2J72J44
1180B95j85k56L99p8l6K39j84l59R8K25j23l1L04k15LL7j23o1J62OJ38n16K17
1203d4J24o0n1J25R4k78M1N4J40k57J21j60J76K99l43k32M05L8j53l30K71j03
1225a23K91r1k93N3L7L8K29k64j78L56j32J5k90M03j50k40M17k01o5j31O88l54
1247A5k53N19l84r3J64k9j19r8J99k11L52K0P2k61j97m3Q2J32K31l08QK78P1k66
1271a19m7K5O5O0l4K08j08k19J48R7k45L3L07j04J85M7jl80K98J79k06K52m32
1294Ip8K85l9o4l7J02j28o9J16k8L60m21N3j89K55J62j94l7L34J3k40k52J74J52
$$ plain form
1318 239 128 -46 364 -61 52 -161 193 66 39 -91 -54 156 161 4 -202 246 -11 -56 70 169 -195 281
1340 281 -190 64 -45 148 213 -274 125 23 189 223 120 413 -188 -37 136 -64 -97 147 130 -15 28 -51
1362 -51 29 -71 54 -231 350 -156 -60 -16 -281 -245 -458 -133 99 190 -240 11 -14 132 113 -64 -40 -242 124
1385 124 80 -185 -110 71 -17 -106 -22 -425 62 -171 121 -201 -67 109 155 -16 -166 -243 91 -168 -189 -241 24
1408 24 -8 -186 -161 10 167 104 165 159 41 127 63 64 101 -74 139 106 114 133 146 273 -154 59 240 58 -8 249
1434 249 268 328 -147 138 -228 -10 136 108 135 -10 12 321 -50 6 331 205 -129 -108 -215 214 234 5 159
1457 159 -311 261 86 166 -99 99 -116 -27 -280 -600 -131 -70 -348 -137 139 76 7 -299 164 -190 27 5
1479 5 223 16 19 91 -405 17 294 116 -179 -27 -85 -294 178 -73 -321 -42 -23 163 -578 -317 86 -340
$$ packed form
1318B39j11j74M10m25J13k13L54j27k7j30L7K10Nj57k06M48k57m5J26R9l64M76
1340B81m71K54j09J93O5m87L99j02J66L4j03K93o01J51J73k00l3K44j7j45M3p9
1362e1Q0j00J25k85N81n06R6M4k65L6k13L25K32R1m30K51k5J46j9j77K4k02L66
1385A24m4k65P5J81q8q9Q4m03M87k33K92l22J34J76M6j71j50p7L34k59k1n2K65
1408B4l2j78K5J71J57o3O1oj18Q6o4JL7j75K13l3QJ9J3J27m27K13J81j82o6K57
1434B49J9O0m75K85l66K18J46k8K7j45K2L09l71N6L25j26l34K1j07M29K0k29J54
1457A59m70N72j75Q0k65J98k15Q9k53l20M69O1k78K11K76o3o9l06M63l54K17k2
1479EK18k07LP2m96M22K77j78k95J52n8k09M72k51k48K79J9J86p41K61M03m26
$$ plain form
1501 -340 -131 -77 145 -167 -137 25 -99 -427 -72 -152 -63 61 -88 115 213 46 125 78 -147 202 64 -113
1523 -113 140 -166 -244 4 23 14 148 -119 155 -182 228 -143 69 122 185 -94 34 90 8 45 173 196 -85
1546 -85 184 5 -312 161 101 148 -208 -79 -51 66 273 13 150 -13 11 -73 188 413 432 377 -29 50 175
1569 175 66 154 -38 89 -139 334 -67 97 -152 105 -39 104 197 159 23 -194 114 139 35 -100 8
1590 8 45 -173 -78 -107 -191 -378 136 31 -57 -5 36 -366 129 -119 -12 -316 122 65 -85 -94 -77 -9 -89 159 243
1615 243 -105 -122 -53 59 236 25 -101 454 -69 -193 -4 -136 214 -272 -42 48 -197 28 -20 157 -193
1636 -193 82 -121 -262 -97 118 16 197 -196 43 160 95 -5 249 -32 -320 -125 374 64 -118 368
1656 368 133 -111 141 91 -44 6 -270 -28 321 302 138 170 37 129 103 -63 -235 2 171 -27 120 -3
$$ packed form
1501c40K09N4K22l12L0J62j24l28L55q0Q9J24j49K03R8j67P9m7k25L49j38j77
1523a13K53l06p8K48J9rJ34k67K74l37M10l71K12N3O3k79J28N6q2L7J28K3k81
1546h5K69j79l17M73o0M7l56J29K8J17K07k60J37j63K4q4K61K25J9n5m06P9J25
1569A75j09Q8j92J27k28M73m01J64k49K57j44J43R3l8j36k17L08K5j04j35J08
1590HL7k18R5k9q4j87N14j05q8N2M1m02M95k48J07l04M38n7j50rJ7O8q0K48Q4
1615B43l48j7O9J12J77k11j26N55n23j24J89j32L50m86K30R0k45K25m8J77l50
1636a93K75k03j41J65K15j02J81l93K39J17o5j00K54k81k88J95M99l10j82M86
1656C68k35k44K52n0j35N0k76K42L49j9j64L2j33R2k6j66j72K37J69j98J47j23
$$ plain form
1678 -3 -311 108 41 117 -30 57 -37 66 -107 -344 72 -196 13 -88 31 182 80 134 190 -25 -15 24 166
1701 166 -138 -64 -19 140 205 37 -216 115 -17 -39 104 -117 -41 -15 113 196 -31 -352 49 60 100 -20 -149
1724 -149 -64 106 77 19 -82 -42 -185 -268 -11 -73 -150 45 282 -209 -71 235 -242 92 -45 -12 -95 2 132
1747 132 -201 -9 -293 -164 54 31 -284 -323 25 101 -128 82 -39 119 -3 114 -48 30 0 118 -59 93
1769 93 309 -167 42 -172 -206 -128 -79 72 -7 -70 -112 -14 -27 154 -116 -75 -91 7 151 61 27 -59 -192 -181 -102 -42
1795 -42 530 76 -7 -143 62 -40 -133 -115 -139 106 331 -182 19 14 73 -169 5 266 -174 -132 -208 -29 84
1818 84 -192 5 29 -80 77 44 4 2 29 6 -25 86 -32 313 22 -113 -6 -23 -225 -3 -175 62 165
1841 165 -193 74 -157 213 -60 -133 -74 -42 9 -290 -49 -213 -45 -21 -197 101 -77 103 32 -147 -38 104
$$ packed form
1678cl08M19o7P6j47Q7r4J03j73k37M16k68K09j01J19J51j02N4N6k15J0L9J42
1701A66l04P4M5J59O5j68k53L31j32k2J43k21P6K6J28Q3k27l21M01J1M0j20j29
1724a49Q5J70k9n8j01M0j43q3K57o2p7J95K37m91J38L06m77L34j37L3q3R7J30
1747A32l33J92k84J29K18k3l15l9L48P6k29K10j21J58j22J17j62P8l0J18j77J52
1769I3K16m76K09k14l4P8M9J51p9o3m2R8j3J81k70M1j6R8J44r0l4q6j33J1P9O0
1795d2N72m54q3j36K05j02r3J8k4K45K25n13K01nN9k42J74K61m40M2p6J79J13
1818H4k76J97K4j09J57l3m0kK7k3l1J11j18L45k91j35J07j7k02K22j72K37J03
1841A65l58K67k31L70k73p3N9L2N1k99K41j64J68K4j76K98j78J80p1j79J09J42
$$ plain form
1863 104 -105 169 -230 -418 -46 12 -109 -140 -79 170 14 -188 -49 -172 -201 169 -203 149 -341 -31 42 267
1885 267 41 131 -31 -193 18 402 28 -169 115 -56 -169 125 332 63 6 -285 259 185 126 81 -14 -127
1907 -127 -327 174 -134 78 58 -23 31 15 -208 146 230 -191 -7 -33 123 6 160 -105 -106 55 58 42 79 101
1931 101 -40 60 -100 -275 69 -96 -142 126 -127 -163 46 -115 57 38 -192 41 144 -30 89 -38 -224
1952 -224 380 -173 213 -28 -95 -177 88 -114 -113 -259 158 133 12 5 182 42 -85 -35 -155 381 -60 134 149
1975 149 59 -40 -5 -52 128 -238 -227 -117 -28 -4 71 -274 250 32 42 253 92 -140 -143 127 81 -35 219 -301
1999 -301 -110 -73 45 -270 -502 47 7 -42 -156 -119 -104 259 98 -27 113 79 -120 42 77 -4 163 60 -136
2022 -136 -35 -50 -113 24 185 166 -213 54 -187 73 -43 -406 -91 -15 -154 109 -120 -61 -105 104 -103 -26
$$ packed form
1863A04k09K74l99j88L72N8j21l1O1K49j56k02J39j23k9L70l72L52m90L10P3K25
1885B67k26R0j62j62K11L84l74j97K84j71j13K94K07k69n7k91N44p4n9m5r5j13
1907a27k00N01l08K12k0q1N4j6k23L54Q4m21J84k6J56j17J54k65jJ61Lj6L7K2
1931A01j41J00j60j75L44j65m6K68k53l6K09j61J72j9k30K33J03j74J19j27j86
1952b24O04n53L86k41o7q2K65k02Jj46M17k5j21pJ77j40j27N0j20N36m41J94J5
1975A49r0r9L5m7J80l66J1J10Q9K4P5l45N24k18J0K11j61k32lK70m6j16K54n20
1999c01J91L7J18l15k32N49m0m9j14L7J5L63j61j25J40l4j99J62L5q1J67j03j96
2022a36J01j5o3J37J61j9l79K67k41K60j16l63L15P6j39K63k29N9m4K09k07P7
$$ plain form
2044 -26 167 29 -116 76 -185 -156 3 -57 -357 107 -38 -295 83 -302 201 -123 266 -21 -166 -9 -55
2065 -55 100 -79 115 163 -2 -27 -64 -28 -397 111 -33 -41 78 32 130 -1 -4 26 -168 138 -299 129 -145 -67
2089 -67 120 95 -205 383 -90 320 7 -141 126 -296 127 -235 104 -345 -105 -19 232 -143 100 56 -79
2110 -79 377 -180 29 188 -233 -233 -200 -127 -55 -224 -108 -15 -66 180 -314 -28 -39 334 282 -63 -42 153 -72 -87
2134 -87 -59 -40 196 481 78 -79 297 -183 260 60 -12 29 -96 -248 -3 158 -289 -43 185 -37 95 -127
2156 -127 497 -19 36 -16 106 47 83 -86 65 12 -370 37 75 254 -167 60 83 -48 -158 29 -172 -3
2178 -3 325 -260 -95 39 -36 -194 255 149 -314 101 367 36 -139 -120 44 -56 232 28 -114 134 330
2199 330 -33 -66 245 17 -116 -108 373 -164 -112 -159 37 22 -66 232 250 359 -22 235 199 161 -355 38 88 -39
$$ packed form
2044b6J93j38j45J92k61K9J59o0l00M64j45k57L78l85N03l24L89k87j45J57m6
2065e5J55j79J94M8j65k5l7L6l69N08j44qJ19m6R8j31lL0j94L06m37M28k74P8
2089f7J87k5l00N88m73M10l13j48K67m22M23l62L39m49K40Q6K51l75K43m4j35
2110g9M56n57K09J59m21%L3P3P2j69J16R3n1K46m94K86j1L73n2l45K1J95k25j5
2134h7K8J9K36K85m03j57L76m80M43k00p2M1j25j52K45J61m47K46K28k22J32k22
2156a27O24n16N5n2J22n9L6j69J51n3l82M07L8J79m21K27K3j31j10J87k01J69
2178cL28n85J65J34p5j58M49j06m63M15K66l31j75J9J64j00K88k04j42K48J96
2199C30l63l3L11k28j33QM81n37N2m7J96j5q8K98J8J09l81K57l6l8n16L93N0j27
$$ plain form
2223 -39 26 203 47 -96 -360 61 51 -106 -147 -239 67 198 -43 -266 265 -108 102 14 59 142 37 -224 228
2246 228 205 36 -141 232 -287 73 -14 8 -82 210 -387 84 122 114 254 -149 288 44 -102 -131 126 -206 -330
2269 -330 371 284 -431 66 -42 247 61 -225 39 -205 -221 101 -209 28 122 -246 -240 -160 131 -306 -47 -134
2291 -134 -192 -132 -139 -197 79 -61 81 110 40 68 20 -200 19 -167 382 161 229 -131 16 34 177 91 -59 -30
2315 -30 72 10 -113 -134 -113 -422 265 316 99 -76 114 47 29 138 256 207 -117 89 -8 67 -152 -45 27 91
2339 91 158 -8 36 -163 -64 424 159 -139 26 114 19 311 4 110 78 41 -98 51 -96 -123 50 231 75
2362 75 420 -73 -185 -104 -62 -108 -177 -84 -87 -53 -132 53 135 112 198 -37 108 -67 67 1 321 121 -372 -403 -235
2387 -235 198 -71 -9 247 217 -38 -290 235 38 -82 -151 2 169 -183 -81 19 146 -220 162 130 304
$$ packed form
2223c9O5J77j56j43k64M21j0j57m1r2L06J31k41k23N31l73K10q8M5Q3j05k61M52
2246B28k3j69j77L73n19L60q7K2r0K92n97M71L8qJ40m03M37k44j46k9K57l32j24
2269c30P01q7p15M97j08K89j86k86K64k44j6L22l10K37R4l68OQ0K91m37K59q7
2291a34n8O0pn8K76j40J42K9p0K8m8k20K19j86N49k21O8l60J47J8J43q6j50K9
2315c0J02o2j23k1K1l09O87N1k17j75J90o7j8J09J18m9l24K06r7P5k19J07P2O4
2339I1O7j66M4j99R9M88k65k98J65Q8r5K92l07J06l2l7j39J49j47k7J73J81j56
2362G5L45m93j12Q1M2m6o9R3lL4p9J85Q2k3Q6k35J45j75J34o6L20k00m93l1J68
2387b35M33k69O2K56l0k55k52N25j97j20o9J53J67l52J02J00J27l66L82l2J74
$$ plain form
2408 304 -113 182 42 -47 14 -20 194 106 98 -35 214 -36 277 137 240 172 -117 -229 -147 158 221 110 -143
2431 -143 71 69 144 72 -138 15 -217 60 133 120 -68 -136 -32 -185 295 -64 -350 62 73 -61 143 5 -40
2454 -40 153 -203 429 149 12 21 -35 -70 28 -21 -40 -287 100 67 -158 75 -135 -66 -131 70 -63 -32 -365 109
2478 109 98 -264 87 -132 43 192 -315 -57 -129 56 -148 185 -211 -315 -40 -145 -33 374 63 -51 9
2499 9 -198 73 -326 150 6 -228 -180 -2 17 174 70 -184 51 71 -80 -130 -26 -100 -63 -6 302 -100 148
2522 148 -53 56 -29 208 -2 205 -311 259 -228 -127 39 -20 -41 45 -83 -199 170 77 77 -196 41 -6 176
2545 176 -225 -156 -69 -186 -180 95 118 5 8 -207 -160 -57 -91 69 -79 -5 167 -65 20 -212 -206 129 -15 -218
2569 -218 -154 -137 -127 114 -158 -142 348 4 350 -116 33 -161 -257 -246 -53 331 175 -256 246 -70 93 187
$$ packed form
2408C04m17K95j40q9O1l4K14q8qj33K49k50L13j40J03o8k89j12Q2L05O3j11k53
2431a43K14kP5p2k10J53k32K77P3j3j88o8J04j53M80l59k86M12J1j34K04j38m5
2454d0J93l56O32k80j37Rn6l5R8m9j9k47L87l3k25K33k10O9o5K01j33L1l33M74
2478A09j1l62L51k19J75J49n07K58p2J85k04L33l96j04K75j05J12M07l11j14O0
2499Ik07K71l99M76j44k34M8J78J9J57j04k54K35K0j51n0J04p4L7N7L08m02K48
2522A48k01J09q5K37k10K07n16N70m87J01J66n9k1Q6j28j16L69r3%k73K37m7J82
2545A76m01O9Q7j17OK75K3j13Lk15M7J03l4J60j48P4J72k32Q5k32OL35j44k03
2569b18O4J7J0K41k72J6M90l44L46m66J49j94r6J1J93L84j56m31N02l16J63R4
$$ plain form
2591 187 79 -26 -295 39 6 -26 -21 20 150 75 -223 96 -101 381 125 135 -20 225 -43 -95 378 235 4
2614 4 135 -86 185 34 -180 275 35 40 96 161 -178 211 -162 12 250 13 223 -77 -54 154 -195 -333
2636 -333 81 -180 -44 -98 71 -117 126 -193 -177 255 -218 174 120 38 36 13 -362 253 -339 96 -148 -25
2658 -25 170 -137 -1 -123 205 -107 23 -103 -160 -77 -78 -87 294 -252 -5 -141 17 -272 19 147 384 -28
2680 -28 113 24 75 22 290 119 11 -10 35 113 53 72 143 -125 -139 -35 110 -8 -181 126 45 139 -126 -183 -50
2705 -50 152 -113 174 5 44 114 172 -241 210 -129 282 -256 -278 99 -100 -40 -74 -252 -14 -143 127 19
2727 19 5 -81 43 -169 69 133 -4 -42 -240 -66 -329 139 -330 2 22 191 -77 -4 -48 -301 114 106 87 180
2751 180 88 289 -121 -217 32 344 -25 -122 173 -148 -273 -269 -117 150 -29 -352 5 330 14 1 -41 253
$$ packed form
2591A87j08j05k69L34l3l2NM1J30p5k98L19j97M82k56J0j55K45k68n2M73j43k31
2614DJ31k21K71j51k14M55k40NN6O5l39L89l73J74K38k37K10l00K3K08l49j38
2636c33M14k61J36n4J69j88K43l19J6M32m73L92n4q2kk3l75O15n92M35k44J23
2658b5J95l07J36j22L28l12J30j26n7Q3jrL81n46K47j36J58k89K91J28K37m12
2680b8J41q9N1n3K68j71j08k1M5P8o0J9P1k68j4J04J45j18j73L07q1R4k65n7J33
2705e0K02k65K87j69L9P0N8m13M51l39M11n38k2L77j99O0l4j78K38j29K70j08
2727A9j4q6J24k12K38O4j37l8j98J74k63M68m69L32K0J69k68P3m4k53M15qj9R3
2751A80r2K01m10r6K49L12l69r7K95l21j25MJ52K67j79l23L57L25l16j3m2K94
$$ plain form
2773 253 251 -53 103 270 230 -184 -255 -8 -156 -124 -157 99 -156 125 -55 -82 -149 -97 -90 36 164 156 23 203
2797 203 -112 82 -218 -122 -38 101 239 -36 -122 -236 -101 -147 6 -59 -81 -83 -47 75 46 230 0 -50 88 33
2821 33 118 -288 -114 167 -105 79 -272 -4 -229 -276 62 -70 -138 21 23 242 -108 -161 -110 -81 -308 179 31
2844 31 39 -243 -75 -25 -81 24 27 -55 89 116 -26 -63 -108 -71 100 -154 -253 -303 -31 -103 358 61 -165 149 193
2869 193 -148 95 154 -58 3 -307 -89 250 56 -212 -330 300 -78 -60 154 -149 83 139 -20 102 304
2890 304 119 95 196 -24 -130 -159 -337 -224 146 31 15 -95 -75 -11 -31 -236 89 -59 -58 2 46 106 -112 32
2914 32 -138 67 -260 127 62 109 101 189 16 105 -102 236 149 181 -104 -27 -188 126 12 379 0 -304 64
2937 64 -254 122 -6 147 63 -193 150 165 296 -59 120 153 185 162 277 198 -157 167 94 176 197 130 131 -56
$$ packed form
2773B53kl04J56J67m0m14p1K47j48L2l3K56k55K81j80k7o7N2PJ26J28qj33J80
2797B03l15J94l00R6Q4J39J38k75q6j14J35m6J53o5k2kL6J22k9J84k30n0J38n5
2821C3Q5m06J74K81k72J84l51K68k25m7L38j32o8J59KK19l50n3N1K9k27M87j48
2844C1Qk82J68N0n6J05Lq2J44K7j42l7m5L7J71k54r9n0K72p2M61k97k26L14M4
2869A93l41K43N9k12O1l10K18L39j94k68j18O30l78J8K14l03K32N6j59J22K02
2890C04j85k4J01k20j06k9j78J13L70j15j6j10K0O4k0k05L25j48JO0M4O0k18J44
2914C2j70K05l27L87o5M7qQ8j73Q9k07L38q7L2k85P7j61L14j14L67l79l04L68
2937F4l18L76j28J53q4k56L43J5J31l55J79L3L2k3J15p9l55L24p3Q2K1o7Jj87
$$ plain form
2961 -56 -108 129 -147 -46 -58 73 -102 -65 -181 62 -59 -80 173 51 -197 -74 -78 -67 -246 -55 213 -74 -248
2984 -248 38 257 163 -24 -355 -114 54 1 -313 93 4 82 -5 -145 319 211 -94 -36 5 -136 -88 17 -19
3007 -19 -44 96 -45 -178 -172 -19 -71 -130 269 -258 -102 202 222 104 43 -83 -403 136 -198 -348 247 -69 219
3030 219 -58 383 -151 138 -250 88 -106 209 348 -281 18 -139 40 121 -19 30 -31 -153 14 -171 79
3051 79 271 -95 -355 -31 -40 14 139 139 -106 -267 23 -7 -73 212 -124 -105 -31 -30 -211 -68 -40 -58 -159 280 -16
3076 -16 40 -249 98 -22 267 -110 -112 9 66 -106 130 179 -170 -145 68 -95 -92 -51 264 -121 225 -105 79
3099 79 -55 -90 153 -95 209 -121 -122 -144 28 236 46 -324 -77 -115 -159 -321 15 -219 189 -134 151 -76
3121 -76 -188 -183 65 19 172 -242 -135 47 108 -134 -19 225 87 16 -17 92 -71 177 49 55 -157 413 -104
$$ packed form
2961e6n2K37k76J01j2J31j75L7j16K43j21k1K53j22k48J23mJ1j79J91K68k87j74
2984b48K86K19r4j87l31K41J68n3l14M06q9P8q7j40M64j08l05N8M1j41M8J05l6
3007a9k5J40j41j33OJ53n2n9L99n27J56L04K0j18o1j26l20N39l34j50N95l16K88
3030B19k77M41n34K89l88L38j94L15J39o29K99j57J79Q1j40M9o1j22J67j85K50
3051G9J92l66k60L24rN4J25%k45j61K90l0o6K85l36J9P4Jj81J43K8j8j01M39k96
3076a6N6k89L47j20K89l77kJ21N7j72K36M9l49K5K13j63LM1L15l85L46l30J84
3099G9j34l5K43k48L04l30jk2J72K08j90l70K47l8m4j62L36k34M08l23K85k27
3121g6j12NK48m6J53m14J07J82O1k42J15K44j38p1l3J09j63K48j28Ok12N70n17
$$ plain form
3144 -104 49 118 -207 22 120 -209 -1 -66 26 237 257 97 -10 325 267 -140 187 65 -44 -339 16 42
3166 42 -22 -64 26 -1 155 -33 48 -153 -85 -117 216 39 124 -26 33 -98 -110 96 -142 287 -95 -16 69 63 -25
3191 -25 -154 93 395 311 -139 -45 105 -327 -237 -68 312 -54 252 -183 41 159 -187 -365 -348 -124 -15 -87
3213 -87 26 30 192 219 -288 95 -137 34 -115 -72 -185 69 87 18 6 -179 190 39 174 42 -112 -346 315
3236 315 139 191 -57 -197 -115 -18 312 206 166 81 38 6 240 -170 -73 49 -97 -242 454 -48 71 344 -276
3259 -276 217 147 381 -105 -154 121 -104 -40 -197 -30 -19 -48 -197 108 234 -20 41 31 452 -87 -106 -84 40
3282 40 276 176 103 -225 -70 -276 -147 104 -67 -43 266 -199 167 -165 124 -112 57 58 272 -71 -211 -234
3304 -234 -223 -93 152 487 -149 -111 -118 -125 -318 55 -97 -97 -34 -33 -169 -170 -188 -176 -159 213 160 -244 -17 -181 -174 200
$$ packed form
3144a04J53O9l25K29R8l29K08o5R2K11K0j60j07L35n8m07L27j22j09k95L55K6
3166D2o4m2R0k7J56j88Q1k01O8l2L33j77Q5j50N9j31j2K06k38M29l82P9Q5oq8
3191b5j29K47L02q4m50R4J50m32R0J69L80l66L06m35K24J18l46j78J7K24J09p2
3213h7J13MJ62K7n07L83k32J71j49M3j13K54J8o9j2j85L69j51J35j32j54k34O61
3236C15j76N2k48j40Q2R7L30j06m0q5m3l2K34m10R7J22j46j45O96n02J19K73o20
3259b76M93p0K34m86m9K75k25O4j57J67J1k9j49L05J26k54O1j0M21n39j9K2J24
3282D0K36j00p3l28J55k06J29K51j71K4L09m65L66l32K89k36J69JK14l43j40k3
3304b34J1J30K45L35o36L8ppj93L73j52%O3Jj36jj8J2J7L72n3m04K27j64PL74
$$ plain form
3330 200 149 35 -44 156 -83 -16 126 168 44 190 -278 84 73 -80 -30 114 103 -203 -40 391 -30 5 -34
3353 -34 -48 25 155 248 71 343 458 160 -238 -68 35 103 3 -205 -147 -138 -97 256 5 -224 -113 228 -10
3376 -10 -302 161 -69 0 72 -199 -204 224 -317 42 153 -219 -35 -296 -10 229 101 81 96 22 33 -311 137
3399 137 -15 161 227 97 155 44 194 205 -11 90 444 -12 228 -87 -127 -145 177 -108 -80 243 -99 96
3421 96 -333 -55 120 -99 1 291 25 59 82 -24 -2 157 205 28 4 42 132 -62 -298 -225 66 45 -263
3444 -263 -81 -37 -238 -124 -84 86 -134 -31 -170 86 -75 -181 61 -282 242 -101 122 105 98 -98 7 74
3466 74 30 98 -141 -277 -329 292 -129 35 -93 -4 -65 15 -87 -65 181 -273 1 -35 179 -5 -106 -49 117
3489 117 -64 67 285 154 272 -151 70 77 193 48 121 -175 -24 -10 -74 181 1 -171 -118 156 36 -171
$$ packed form
3330B00n1j14p9K00k39O7J42M2j24J46m68L62j1j53N0J44j1l06J63M31m21L5l9
3353c4j4P3J30R3j77K72J15k98l98J70J03O8j00k08N8RM1L53k51k29J11L41k38
3376a0k92M63k30O9P2k71nM28n41L59J11l72J84k61K86K39j28k0J5p4J1l44M48
3399A37j52J76O6j30N8j11J50J1k16J01L54m56K40l15m0j8L22k85K8L23l42J95
3421I6m29K78J75k19J00K90k66L4K3j06K2J59M8j77k4L8R0j94k36P3K91k1l08
3444b63J82M4k01J14M0J70k20J03j39K56j61j06K42l43N24l43K23j7pj96J05O7
3466G4m4O8k39j36n2O21m21J64j28Q9o1Q0j02K2K46m54K74l6K14j84j01N7J66
3489A17j81J31K18j31J18m23K21PJ16j45P3k96J51J4o4K55j80j72N3K74j20k07
$$ plain form
3511 -171 -184 55 147 -195 165 108 -4 184 56 -210 9 -28 90 56 -272 125 -287 181 124 -47 70 -4
3533 -4 -318 -75 -74 139 -296 -37 -113 -255 -307 41 -129 -60 -30 183 -132 -133 40 8 -64 117 36 -3 -34 -62 -336
3558 -336 157 195 30 -137 -22 -319 177 212 30 -120 12 226 75 107 556 -394 169 257 -75 3 57 -67
3580 -67 66 -167 35 214 -2 23 121 -125 -166 -92 11 214 57 280 72 -38 129 260 -8 23 -86 200
3602 200 -36 203 16 -78 -106 -281 -61 28 -72 236 -14 -201 247 127 -300 118 47 -9 234 -19 -493 -258
3624 -258 -7 -67 47 -56 -135 179 336 -286 -99 -110 -128 -256 -86 7 76 85 149 -273 76 17 78 -5 -131 -17
3648 -17 -32 -83 -60 79 -13 19 0 -44 -197 42 281 107 -203 -101 -86 -293 -91 41 -208 80 -267 -353 152
3671 152 63 203 98 267 203 66 79 -140 52 211 483 -99 -64 82 197 -276 36 69 210 -116 -112 -55 -61
$$ packed form
3511a71j3K39R2l42L60n7j12J88j28k66K19l7J18l4l28L97m12M68n7j71J17p4
3533dl14K43JK13m35K59p6j42n2L48j70O9L0K13l15jJ73l2p2J81q1l9l1k8k74
3558c36M93L8j65j67J15k97M96L5j82j50J32K14j51L2M49r50N63Q8l32P8N4j24
3580f7J33k33K02J79k16K5R8k46m1P4J03K03j57K23k08j10J67J31k68L1j09K86
3602B00k36K39j87r4k8j75K20Q9j00L08k50j87M48j20m27M18p1n6K43k53m74K35
3624b58K51o0J14j03p9L14J57o22J87j1j8j28J70R3O9RO4m22L49n9O1q3j26J14
3648a7j5n1K3J39r2L2j9m4j53K39K39j74l10J02J5k07K02J32k49K88l47q6N05
3671A52q9J40j05J69o4j37J3k19J92J59K72n82L5J46J15m73L12L3J41l26MN7o
$$ plain form
3694 -61 -13 -172 68 -304 73 240 -141 411 -208 281 -27 32 -187 -468 98 35 -91 108 168 -34 271 162
3716 162 -45 295 78 -52 288 189 -122 44 295 -132 41 -16 193 11 -61 111 140 -359 202 -245 -269 -188
3738 -188 161 0 41 -15 -192 4 -305 -57 -76 -265 -167 181 -259 -144 74 147 -9 -294 -50 -397 -215 -24
3760 -24 113 325 174 -183 -233 -348 -116 -57 -201 294 69 -15 -151 62 259 175 22 121 -30 272 -17 -158
3782 -158 233 91 204 -27 0 -51 -134 -121 -28 -176 -271 45 167 -104 68 13 62 19 52 -36 -24 -12 51 237 138
3807 138 251 202 186 141 -153 -149 260 47 -3 -352 -91 -130 -71 -107 -224 -138 62 -102 18 139 9 -148 104
3830 104 -337 258 -1 163 88 -98 -12 31 84 233 165 -102 -50 -202 111 11 -31 -64 -252 385 -251 298 91
3853 91 -62 -155 132 -140 177 -22 -135 242 -3 207 -67 30 23 357 -46 -48 -234 40 127 -71 -11 -200 -41
$$ packed form
3694f1M8j59K40l72L77J67l81N52o19M89l08N9k19k81N66o3j26J99O0k02L05j09
3716A62k07L40k17j30L40r9l11J66K51m27J73n7K09j82p2J72K9m99N61m47k4Q1
3738a88L49j61M1n6j77J96l09K48j9j89R8L48m40J15K18P3j56k85K44l47J82J91
3760b4J37K12j51l57n0j15K32N9j44M95k25q4j36K13J97q4j53R9j51L02k89j41
3782a58L91j42J13k31K7n1q3J3R3j48r5L16J22k71J72n5M9m3L3q8J2J2O3J86r9
3807A38J13m9j6m5k94MM09k13n0l49K61l9N9l6j17Q6K00j64J20J21j30j57K52
3830A04m41N95k59J64p5j86Q6M3N3J49o8k67N2j52L13j00m2l3j88O37o36N49k07
3853I1j53r3K87k72L17j99j13L77k45K10k74R7pL34m03kj86K74Q7j98O0j89J59
$$ plain form
3876 -41 -164 50 134 -36 176 39 -176 67 -240 22 167 -157 62 -24 355 -328 124 0 77 63 237 -99
3898 -99 81 -174 -7 -359 111 9 17 -282 -152 62 15 134 285 -83 186 257 91 -175 -104 -175 138 -113
3920 -113 -115 2 141 -205 -52 -94 -47 39 -183 80 -223 235 10 -13 -18 144 -27 1 -150 24 230 99 -131
3943 -131 73 43 134 33 196 287 -6 104 159 272 -63 4 26 182 142 -32 521 153 109 -212 -226 -337 -40
3966 -40 -214 -5 -2 393 214 -98 -149 -93 -27 -35 16 -187 199 289 67 -78 47 -246 -80 105 -198 -295 -2 82
3990 82 165 -134 83 -186 -217 -171 197 -61 107 175 61 -360 84 16 257 -139 70 60 61 -23 341 25 -224
4013 -224 94 1 -291 127 -143 -161 41 76 -235 114 223 302 95 100 235 47 -59 65 98 -225 214 76
4035 76 -8 -57 -2 395 -339 71 68 -70 -66 0 41 -226 38 17 -101 -102 -162 216 -208 -190 5 -229 9 68 70 -79
$$ packed form
3876d1j23K14Q4j70K12j37k15K43l07K62J45l24K19q6L79o83M52j24P7j4J74l36
3898i9J80k55J67l52M70j02Qk99J30K14m7J19J51l68K69P1j66k66P1p1L13k51
3920a13kJ17J39l46J53m2M7Q6k22K63l03M58k25k3nJ62j71K8j51J74K06j31k30
3943a31K04l0R1j01J63R1k93J10N5J13l35O7K2J56m0j74N53l68m4l21j4j11K97
3966d0j74K09LL95j79l12n1N6O6qN1k03L86R0k22j45J25k93J66J85l03r7K93Q4
3990H2Q3k99K17k69l1M6L68k58J68O8j14m21M44o8K41l96K09j0Jq4L64l16k49
4013b24L18r3k92M18k70j8K02L5l11L49J09P9k07NJ35j88j06J24L3l23M39j38
4035G6q4m9N5L97p34M10lj38MO6M1k67K64k1j18jo0L78m24J8J95k34K38N9Kj49
$$ plain form
4061 -79 160 -214 -126 32 190 223 126 -41 -99 133 -139 -337 102 -371 43 214 20 -120 -35 -29 -255 -154 -128
4084 -128 -19 258 -50 49 -104 -238 -237 59 102 67 175 -46 221 -74 -47 -99 180 -108 -193 -34 -194 -152 -261
4107 -261 -157 -221 -15 182 12 -8 26 -6 -109 -174 40 -44 -94 74 81 -173 152 60 -138 136 136 -55 -356 -237
4131 -237 41 14 73 183 208 218 37 181 156 -15 -20 65 -34 -51 105 -31 40 48 -192 -141 81 233 243 -16 78
4156 78 -136 272 206 228 198 -281 -58 -126 107 -184 95 26 108 287 289 139 65 -152 305 -135 5 -80 -218 -156
4180 -156 1 329 69 207 172 -281 -140 -59 326 -269 130 -49 56 -41 -15 85 114 188 206 -109 -198 144 -235
4203 -235 83 119 -88 73 136 -136 172 -179 -247 -104 181 85 256 -63 162 104 -143 -427 -227 6 -140 -85
4225 -85 307 205 66 -29 -35 18 125 -184 -15 -15 167 -16 -23 5 140 114 90 -196 125 -48 2 57 -29 16 -215
$$ packed form
4061g9K39l74Q8J58J58L3r7j67n8K32k72j98M39m73M14J71j94j40Q5Ok26J01K6
4084a28J09K77l08R9j53j34JK96M3l5J08k21K67k95K7n2K79k88q5J59j60M2j09
4107b61J04o4K06J97j70k0L4l2j03o5K14q4n0J68Pk54L25r2j98K74%j91l01J19
4131b37K78k7N9J10K5J0j81J44k5j71nQ5r9j7J56j36P1Qk40N1K22J52J0k59R4
4156G8k14M08o6K2l0m79K23o8K33k91K79o9Q2J79Kj50p4k17M57m40J40q5j38O2
4180a56J57L28k60J38l5m53J41Q1L85n95L99j79J05r7K6J00K9P4J8l15q9L42l79
4203b35L18L6k07J61O3k72L08l51o8J43K85r6J71l19K25n8k47k84K00K33j46N5
4225h5L92j02j39r5oN3J07l09J69%J82j83pK8J35k6k4k86L21j73N0N5q6M5k31
$$ plain form
4250 -215 -66 280 161 211 65 156 -20 -10 -45 365 65 -37 -154 -162 -57 -196 199 130 142 3 29 -118 85
4273 85 63 -231 -14 8 62 -20 -241 109 -2 -71 -282 101 -62 -48 -129 -71 534 65 -61 -72 -182 65 341
4296 341 48 -47 -14 190 -124 101 317 49 168 334 25 -133 64 -126 -3 11 152 -60 -232 73 -83
4317 -83 -118 222 330 -150 151 160 -59 -174 242 -74 61 100 228 51 -82 -70 71 33 286 -84 -188 -63
4339 -63 -15 360 -197 -191 -52 158 144 74 41 -218 153 -138 -149 17 -128 198 -148 66 -141 -55 282 -389 -28
4362 -28 -88 -84 -131 -187 62 172 -148 73 -51 -204 -319 74 -66 222 -243 -127 55 -119 -266 -89 3 99 -85
4385 -85 -99 -314 -219 23 -25 -157 -182 122 -152 -141 -78 103 -353 -13 269 -289 24 85 -18 -63 -184 -162 -9
4408 -9 37 -200 -9 126 49 -112 345 -108 208 -32 342 270 3 -303 -179 213 1 272 485 94 2 -152
$$ packed form
4250b15J49L46j19N0j46R1j76J0l5M10l00j02j17qJ05j39L95o9J2j39K6j47K03
4273H5k2k94K17K2N4q2k21L50j11o9k11L83j63J4q1N8O05m69j26j1j10K47K76
4296C41k93r5L3K04l14K25K16k68J19J66l09j58J97j90J23J4J41k12j72L05j56
4317h3l5L40J08m80L01Rk19j15M16l16J35L9J28j77j33J2J41l8K53l70j04J25
4339f3M8L75n57OJ39K10j4p0l3k59L71k91j1J66j45L26l46K14k07Q6L37o71L61
4362b8o0Mm7n6K49J10l20K21j24j53j15L93j40K88m65J16J82j74j47J77R2R6j84
4385h5j4k15R5K42m8j32k5L04k74J1O3J81m56L40K82n58L13O1j03m5j21K2J53
4408iM6k37J91J35p7j61M57m53L16k40L74p2k67l06J24L92k12K71K13l91r2j54
$$ plain form
4430 -152 5 -218 99 198 267 58 399 -174 120 -11 -111 108 -140 -61 274 -246 -64 -18 -54 129 218 -83
4452 -83 123 306 370 -14 -222 150 -129 89 -79 86 58 -139 16 -116 -150 -33 -51 -107 -53 -45 -120 -45 -37 -111 482
4477 482 -15 -179 -19 44 -121 184 -90 -100 -219 11 108 -146 -10 -124 176 -264 68 107 47 -95 115 50
4499 50 -232 -38 -84 122 143 184 -109 187 189 -377 -8 186 216 271 -41 -144 -46 -42 88 100 105 254 237 43 268
4524 268 -4 -268 113 104 -165 36 -13 -16 206 65 139 25 14 -17 238 -224 -19 110 62 155 110 -57 386 -33
4548 -33 122 -249 55 -47 136 -176 -196 10 -7 72 -87 108 81 238 -24 45 151 83 -144 37 94 -181 -162
4571 -162 33 -86 -93 -107 271 -29 -158 -106 234 125 -213 -36 152 -8 67 -63 228 200 -205 296 278 316 235
4594 235 30 113 -222 158 -168 -363 -273 -227 -59 23 -179 201 -112 202 -197 -371 -75 -188 176 324 110
$$ packed form
4430a52J57k23L17R9O9k09L41n73K94j31j00K19k48P9L35n20J82M6l6J83Q9l01
4452h3K06J83O4l84k08L72k79K18j68J65k8j97J55j32l4J17j8n6N4Qp5P5Qp4N93
4477D82m97j64J60O3j65L05k74j0j19K30R7k54J36j14L00m40L32L9o0j42K10o5
4499E0k82J94m6K06K1M1k93K96Kn66L69J94L0N5l12j03R8MJ30J2NJ49j7j94K25
4524B68k72k64L81rk69K01m9lK22j41P4j14j1l1K55m62K05J29m8R3m5j67M43m19
4548c3J55l71L04j02J83l12k0K06j7P9j59J95k7J57k62O9J06o8k27J81N7k75J9
4571a62J95j19pj4L78l00j29N2L40j09l38J77J88j60P5j30K91k8m05N01j8L8q1
4594B35k05Q3l35L80l26j95R0M6J68Q2k02L80l13L14l99j74K96j13L64J48k14
$$ plain form
4615 110 65 162 -231 30 -57 -168 29 271 -159 -435 -70 72 43 76 -149 252 140 48 -79 280 -329 106
4637 106 248 21 -126 -160 222 345 -70 215 -157 402 197 67 -159 -89 335 181 -28 62 -260 171 -166
4658 -166 291 -160 -173 -55 48 -146 -80 -65 -142 122 79 -311 -42 232 52 -102 -97 -92 123 -347 173 56 -23
4681 -23 124 181 96 -224 -73 178 -113 -119 273 -53 -262 124 39 -69 68 -45 339 239 298 212 21 20 75 -182
4705 -182 -146 -380 -148 35 -305 -66 178 15 294 -125 -197 -200 -38 18 -83 250 35 246 -142 91 37 41 -33
4728 -33 -269 -90 53 -40 -252 331 86 -184 252 -486 -184 -72 -69 1 -101 -249 43 -26 -176 -145 -70 115 117
4751 117 -100 -116 -199 -149 -129 10 11 70 136 -21 -11 20 142 -76 98 75 97 -15 143 -31 -97 198 20 -297
4775 -297 197 -54 -96 -119 -121 -119 -48 -105 54 70 -305 -52 -314 -230 158 -65 -51 263 2 336 63 246 -3 30
$$ packed form
4615A10m5R7l93K61q7j11J97K42m30k76L65J42k9L3k25M01j12r2j27L59o09M35
4637A06J42k27j47l4L82J23m15K85l72N59k05j30k26P0M24j54k09R0l22M31l37
4658a66M57m51j3J18J03j94O6J5p7K64m3l90K69K74j80j54NNK15m70N20j17p9
4681b3J47N7q5l20J51K51k91oL92l26k09L86q5j08J37j13L84j00N9q6j91jN5k57
4705a82L6k34K32J83l40K39K44j63K79m19p2lJ62N6j01L33k15K11l88K33n4Mp4
4728c3k36J79J43r3k12N83k45k70M36p38L02J12LP0j02j48K92o9j50L1P5J85K
4751A17k17j6q3N0K0J39JN9O6j57J0L1J22k18J74k3K2j12J58j74o6K95j78l17
4775b97M94k51m2k3kKP1n7J59J6l75K53k62Q4L88k23J4L14k61L34k73J83k49L3
$$ plain form
4799 30 -121 -146 -192 140 -114 -45 303 -170 32 -3 -3 -52 -104 -194 256 112 68 -90 222 103 168 -35 -359 -74
4823 -74 255 387 -261 100 29 319 -148 -174 -154 93 -54 -10 -106 242 5 -165 309 -137 -410 281 152 -203
4845 -203 -111 -260 -94 50 128 -173 -85 -36 -154 18 178 -420 26 136 -153 -343 64 -6 -7 139 -5 77 43
4868 43 34 13 -170 -201 -248 -145 -6 419 -83 -12 88 34 166 -21 -230 28 -31 -267 -47 194 19 108 118 79
4892 79 -119 180 -161 146 -254 -226 -95 -249 65 -202 139 -247 81 -85 -123 56 47 -82 59 97 230 356
4914 356 -119 -96 17 56 55 -109 143 -292 85 76 16 -6 24 -83 -412 -58 14 -41 -3 151 40 -116 -89 -217
4938 -217 216 -51 -227 192 50 30 6 -156 146 -142 181 69 283 60 -24 -211 150 30 -14 -259 -98
4959 -98 11 58 -290 -394 -55 81 -137 -312 265 -282 -73 -23 -307 207 -191 174 -161 -372 408 -264 297
$$ packed form
4799C0j51k5m6L32k54O9L48m73K02l5%m9n2r0M50j44m4j58L12j19O5k03l24K85
4823g4L29J32o48L61p1K90m67k6K0K47j47M4r6L48k37j70M74m46k73O91j29l55
4845b03R2j49J66J44P8l01Q8M9j18J72J60n98M46J10k89j90M07p0jJ46j44Q2l4
4868D3rk1j83l1m7J03J39M25n02P1J00n4J32j87k09K58n9k36K20K41j75Q9J0l9
4892G9j98K99l41L07m00K8J31j54L14k67L41l86L28j66l8J79rj29J41L8J33J26
4914C56m75K3J13L9jj64K52m35L77ro0k2L0j07l29L54P2n5L8J54j11j56K7j28
4938b17M33k67j76M19j42k0k4j62L02k88L23j12K14k23q4j87L61j20m4k45J61
4959i8J09M7l48j04L39J36k18j75N77n47K09N0k84N14l98L65l35k11P80o72N61
$$ plain form
4980 297 -96 -42 363 -112 7 -111 180 110 -201 -286 1 465 -126 148 444 -102 -49 73 -168 98 -45
5001 -45 -78 -278 -10 76 -163 -87 132 -196 104 -21 -212 -232 210 132 47 -74 -137 240 174 265 120 90 -93 171
5025 171 -125 210 -180 39 29 -147 88 -134 -220 207 -17 -39 184 -75 -65 38 339 184 213 -81 65 24
5047 24 127 -193 -145 -20 75 61 -231 -1 -32 -32 -93 246 166 57 65 161 -282 200 285 272 -145 276 121 -28 303
5072 303 -116 379 -34 79 -41 232 74 -92 -107 91 -95 -152 185 98 -98 246 105 -242 -6 159 -363
5093 -363 161 -241 -208 -178 122 14 91 -9 57 -260 62 75 -283 215 165 43 -382 -222 60 24 -234 84
5115 84 -19 51 -74 -70 254 -170 125 256 378 302 3 -26 -93 -40 442 -42 -332 188 -103 -132 -101 -206 33
5138 33 176 -47 -270 -376 347 -167 -46 186 -33 -60 50 -143 48 50 100 191 31 -101 176 -22 -53 -176
$$ packed form
4980B97l93N4M05m75J19j18K91p0l11q5K87M64n91K74K96n46N3J22k41K66j43
5001d5l3k00K68Q6k39P6K19l28L00j25j91k0M42p8q5j21o3L77o6R1j45l0j83K64
5025A71k96L35l90K19j0j76K35k22q6M27k24k2K23k59J0J03L01j55K9k94J46m1
5047B4J03l20M8J25R5j4k92K30l1%o1L39q0j09QR6m43M82Q5j3m17M21j55j49L31
5072C03m19M95m13J13j20K73j58j66j5J98j86n7L37q7j96L44j41l47K36J65n22
5093c63N24m02L3L0L00j08P7j00O6l17L22J3l58M98n0j22m25J60K82l6k58L18
5115H4j03P0j25ML24m24K95J31J22p6k99k9o7N3M82m84k90N20k91k9L1j05K39
5138C3J43k23k23j06P23n14J21K32k19k7J10j93J91KN0R1j60j32K77j98l1j23
$$ plain form
5160 -176 45 -132 327 199 -167 -119 239 -10 -251 360 -199 11 -196 -87 15 -51 25 353 -95 -236 -162
5181 -162 282 -97 294 226 38 231 85 -178 258 320 181 156 -107 -395 -43 249 -70 -30 -120 -11 110 -144
5203 -144 36 203 -82 173 -219 -72 257 -220 -175 481 -318 37 -259 103 290 249 43 -106 175 80 24
5224 24 119 -157 161 176 -4 46 -233 336 -320 -365 -134 112 90 72 124 72 -358 44 -54 7 -255 -153 77 6
5248 6 0 -273 -460 -330 -2 -275 132 113 -371 -2 -76 124 158 -315 -256 224 137 93 -61 -106 -234 70 -83 45
5272 45 -51 76 -241 -238 106 -148 -52 232 -133 -142 171 133 -59 -71 159 226 39 59 23 13 -81 338 152 -294 -42
5297 -42 -62 67 -224 -114 -137 -218 -55 -149 -104 -167 85 -88 -3 -45 15 -88 -89 -116 63 -75 -23 9 15 136 -12 248
5323 248 -78 372 -89 6 -111 166 -25 -55 140 -162 33 64 -38 -150 -104 -200 -167 27 144 -100 -326 104
$$ packed form
5160a76K21j77M59j28l66M8L58k49k41O11n59K10k07J09J02o6P6L28m48j41P4
5181a62M44l79L91o8j88J93j46k63M36O2j39k5k63k88L52K92l19M0r0J09J21k54
5203a44J80J67k85K55l92J47L29m77M5O56p99L55k96L62J87m1k06j49K81r5n6
5224B4R5k76L18J5j80N0k79N69o56m5K31K46k2j8N2n2m30M02r8O1k62J02K30p1
5248Fok73j87J30L28k73M07j9m84L69p4K00L4m73N9M80q7m4j54m5j28L04j53J28
5272D5r6J27l17LL44k54R6K84l65rL13l8j92j2K30O7j87K0l6j0r4M19j86m46K52
5297d2k0J29k91J10k3q1J63r4M5o3K52j73Q5m2O0j03jk7J79j38N2L2OJ21j48K60
5323B48l26M50m61R5j17K77j91l0J95l02J95L1j02j12M6r6L3J94J17k44k26M30
$$ plain form
5345 104 207 -68 -87 -229 -50 -46 197 124 327 -97 -86 -180 -122 113 369 -283 124 114 -79 169 -23 -162 138
5368 138 -269 -48 -99 -138 120 206 -27 -95 91 -83 -65 201 17 -19 -194 29 292 95 -59 -458 -145 -210
5390 -210 61 275 193 169 -435 -27 116 37 -212 200 69 -188 88 -235 -114 -207 78 319 -134 -55 100 -259
5412 -259 -149 236 142 175 315 66 -21 -4 -73 -184 -136 298 221 -162 -66 181 -70 -218 -149 276 59 -289 19
5435 19 -92 7 79 174 4 83 161 79 -29 -193 49 217 -218 -139 22 -221 -12 -76 -159 73 -313 4 -200
5458 -200 45 215 -242 -194 -298 -110 -189 112 305 7 -64 -149 102 235 53 -206 -29 184 229 142 -77 281
5480 281 31 -19 -264 158 33 14 107 -123 -411 -168 -84 182 267 -201 31 -154 -58 -269 -54 -28 172 334
5502 334 -89 72 189 96 43 -65 47 -132 113 -9 9 29 101 74 -226 117 309 -142 -105 -111 52 -67 -19
$$ packed form
5345A04J03k75j9j42J79MK43p3K03m24J1r4N8K35K56o52M07j0j93K48j92j39L00
5368A38m07K21n1l9K58Q6k33o8J86j74J8K66j84l6j75K23K63j97j54l99L13o5
5390b10K71K14q2k4o04M08J43p9k49M12j31k57K76l23J21r3K85K41m53P9J55l59
5412b59J10L85r4L3J40k49q7J7o9j11M8M34p7l83R6K47k51j48O9M25k17l48L08
5435A9j11R9P2R5j70P9P8q2j08j64K42J68m35P9J61k43K09o4q3K32l86L17k04
5458b00K45J70m57M8j04J88p9L01J93k98p1q5K51J33j82k59J77K13M5q7k19L58
5480B81k50n0k45M22j25j9R3k30k88K43Q4K66Q5m68K32j85R6k11K15K6K00J62
5502C34m23J61J17r3n3j08J12j79K45j22J8K0P2k7l00L43J92m51L7oJ63j19M8
$$ plain form
5525 -19 -108 -138 37 20 188 -53 -18 162 -157 130 -1 -34 -24 116 -218 18 -171 141 139 29 45 -2 -133 97
5549 97 32 57 188 180 322 171 14 367 -42 37 -64 -22 -172 -10 -182 160 0 59 -142 218 217 -12 -7 -117
5573 -117 285 124 199 -55 -64 -97 -182 -363 -168 116 -66 37 81 97 180 6 30 210 225 -178 -26 -109 380 233
5597 233 -60 325 296 85 33 -41 -295 -14 7 2 -272 -23 119 43 -296 230 67 -63 287 -24 138 34
5619 34 33 15 -195 46 -199 51 73 284 45 67 -182 -74 -94 -106 -140 -415 68 -219 -167 -268 36 -96 160
5642 160 109 -6 63 -132 63 56 -255 -232 -168 -31 -163 222 129 -67 -81 22 52 53 -3 -317 384 -30 -50 -268
5666 -268 -328 122 95 164 -241 -243 92 -162 -279 -253 101 86 53 -244 32 20 13 246 200 180 -63 17 -185 78 114
5691 114 103 -366 78 -226 -48 161 -206 -38 -36 62 -69 75 -206 -225 -202 187 69 24 23 104 -145 -154 -74 -101 19
$$ packed form
5525a9q9l0J75j7J68k41L5J80l19K87j31l3J0J40l34K36j89L12kj10J6m7j31K30
5549I7o5K5J31qJ42j51j57L53m09P9j01M2j50J62j72L42j60N9k01L60jk29Nj10
5573a17M02j61P5k54rl3q5j81J95K84j82J03M4J6Q3j74K4J80J5m03J52q3M89j47
5597B33k93L85k9k11n2p4k54K81K1nk74K49J42p6l39N26j63j30L50l11J62j04
5619C4jj8k10K41k45K50K2K11k39K2k49J08k0j2l4k75M83k87N2j01L04j32K56
5642A60n1j15O9j95J95pl11K3O4J37j32L85r3j96j4J03L0Jn6l14P01m14k0k18
5666b68o0M50k7O9m05kL35k54j17K6L54j5l3k97K76j2pK33m6k0k43Q0k02K63L6
5691A14j1m69M44l04J78K09l67J68KR8j31J44k81j9K3L89j18m5jQ1k49rQ0k7J20
$$ plain form
5716 19 -97 -11 -315 -325 132 -41 -108 -320 249 149 -152 173 -70 -102 103 -116 93 -215 -135 189 -25 123
5738 123 77 187 48 -100 127 -42 -63 128 -134 -196 -280 19 92 20 -315 -21 31 -7 -288 -353 -54 -106 -102 288
5762 288 81 138 -395 154 -41 104 26 -234 -55 74 -215 89 24 149 26 -146 -37 -240 94 -438 -38
5783 -38 65 -173 190 -25 10 49 -161 -152 -161 266 -162 -270 -37 243 121 -76 -231 25 -93 58 42 175 -298
5806 -298 3 20 60 -100 10 0 -332 -375 -321 -8 -136 -51 288 106 -84 -96 70 76 -111 254 -98 163 317
5829 317 -236 195 -212 91 192 3 -94 -26 -39 67 172 -79 130 -92 62 -13 267 -249 39 163 -139
5850 -139 326 -110 -141 -204 228 -143 84 -121 -180 202 -16 -231 79 -241 -324 47 43 150 -154 57 -251 313
5872 313 28 -212 -189 -101 554 -291 -151 143 281 -85 107 81 160 276 -169 -99 217 -158 62 -339 247 149
$$ packed form
5716A9j16Q6l04j0M57j73o7k12N69j00l01L25k43l2K05k19K09l08Q0L24k14J48
5738A23m6J10j39j48K27j69k1J91k62o2q4K99P3p2l35K94N2l8k81o5K99n2ML90
5762B88k07N7n33N49j95J45p8k60J79J29k89L04o5J25j23j72J09k03L34n32M00
5783c8J03k38L63k15L5L9k10RrM27m28j08K33K80j22j97j55K56j18J51j6J33m73
5806b98L01J7M0j60J10j0l32m3N4L13j28Q5L39j82j90j2J66Oj87L65l52K61J54
5829C17n53M31m07L03J01j89r7O8j3J06J05k51K09k22J54p5K80n16K88J24l02
5850a39M65m36l1o3M32l71K27k05n9L82k18k15L10l20q3L71mJ07l04K11l08N64
5872C13k85k40K3Q8O55q45J40K94J38l66J92k6P9J16m45P0L16l75K20m01N86r8
$$ plain form
5894 149 -56 11 271 114 241 186 58 140 -233 -295 63 49 -65 -264 107 53 182 161 75 -115 195 85 -30
5917 -30 -90 -217 195 82 -13 -48 172 -146 40 69 -250 -125 7 80 -117 317 176 -189 -121 -379 -35 178
5939 178 -64 19 -158 90 199 283 174 -73 -66 -111 165 50 -107 -143 44 264 -55 443 418 22 14 91 -389
5962 -389 119 -34 301 82 122 237 -79 179 210 -173 -215 -145 334 73 53 310 -300 -219 -14 -188 60 -67
5984 -67 154 -160 50 11 188 132 5 154 59 293 -96 1 94 -183 -63 289 178 -256 102 -105 16 -232
6006 -232 -217 213 122 89 41 -118 353 156 -92 -207 55 -244 68 -42 177 154 -232 59 -5 85 -224 -156 -35
6029 -35 282 240 43 283 -193 -296 -28 -297 117 -164 -228 -170 -46 -91 138 -207 229 257 175 -235 -15 128
6051 128 -179 -86 51 -330 -276 -361 -392 30 -165 75 262 -171 -2 87 -180 -238 122 35 96 -181 -109 -202 -265 -175
$$ packed form
5894A49k05O7K60j57J27n5j28Q2l73o2L58j4j14j99L71n4J29k1q6j90L10j10j15
5917c0o0j27M12j13r5l5K20l18J86K9l19J25J32P3j97M34j41l65O8k58L44K13
5939A78k42Q3j77K48J09Q4j09k47Pm5K76j15j57l6J87K20l19M98k5l96qP7m80
5962c89N08j53L35k19M0J15l16K58L1l83m2P0M79k61k0K57o10Q1K05j74K48j27
5984f7K21l14K10l9J77n6j27J49r5K34l89R7R3k77J20L52j11m34L58k07J21k48
6006b32J5M30r1l3m8j59M71j97k48j15K62k99L12j10K19k3l86K91o4R0l09O8J21
6029c5L17m2j97K40m76j03K68k69M14k81o4N8J24m5K29l45M36K8q2m10K20J43
6051A28l07R3J37l81N4q5l1M22j95K40J87m33J69Q9k67n8L60q7O1k77P2r3o3R0
$$ plain form
6075 -175 266 -3 4 -84 67 297 48 322 21 30 -186 -10 -34 -91 177 255 -217 59 -85 70 25 27 41 272
6099 272 41 -59 -88 41 137 -261 22 -17 -101 75 -52 -22 290 -88 98 -108 82 128 62 23 -101 -251 -93
6122 -93 -6 113 32 112 404 -120 -84 -136 156 86 240 -38 159 -33 -305 57 -46 190 -141 -137 -119 -59 -51 -97 396
6147 396 308 68 -144 21 -90 -92 -75 -65 -206 -154 104 -182 72 -33 228 236 94 -279 128 -171 38 -212 51
6170 51 -263 49 84 -363 163 61 196 202 -132 -66 -57 293 84 -20 -97 118 -48 -187 -40 -51 -15 119 97 140
6194 140 -211 83 205 -40 -74 -107 126 57 -98 -60 160 -152 141 356 128 248 336 44 58 -81 43 -133
6216 -133 -74 64 222 -82 -185 -44 329 382 -34 -220 144 29 60 -296 -17 19 25 26 -275 -3 237 -45 -61
6239 -61 56 -116 130 -157 110 55 333 -95 50 120 307 -34 -18 -174 -55 14 -10 -192 109 157 16 256
$$ packed form
6075a75M41k69Pq8J51K30k49K74l01Rk16J76k4n7K68P8m72K76j44J55m5KJ4K31
6099B72k31j00k9J29R6l98K83l9q4J76j27L0L12l78J86k06J90M6o6l9j24j50J58
6122i3Q7J19q1Q0K92n24L6n2K92p0J54k78J97j92k72L62j03K36l31MJ8O0Qm6M93
6147C96q8k40k12J65j11kJ7J0j41N2K58k86K54j05K61Qj42l73M07k99K09k50K63
6170E1l14L12L5m47N26j02J35Ol34O6RL50k09j04p7K15j66j39J47j1L6J34k2M3
6194A40l51K94J22k45l4l3K33o9j55L8K20l12K93K15k28J20Q8k92J4j39J24j76
6216a33N9J38J58l04j03J41L73N3m16j86L64j15L1l56K79L6OJl01K72K40k82j6
6239f1J17j72K46k87K67n5K78m28J45P0J87l41J6j56J19O9k4j82L01M8j41K40
$$ plain form
6261 256 329 232 142 69 -192 -127 227 2 156 -77 -202 145 -32 -100 -33 -106 125 -299 -26 76 -13 269 -249
6284 -249 -23 -12 -174 -86 -286 119 173 55 -111 -141 -39 200 61 66 34 186 244 -138 -7 -64 -318 140 -66
6307 -66 -90 213 -280 17 126 -171 -116 -84 183 337 -318 -104 499 -158 5 34 13 -133 294 120 26 -12 -296
6330 -296 -104 142 -314 42 148 -272 -123 306 98 -297 111 -48 224 46 -134 55 250 135 -89 49
$$ packed form
6261B56P3r7r0p3k61O5L54k25J54k33j25L47j77o8O7p3K31m24K73J02q9K82n18
6284b49K26J1j62Q8k00M05N4j18j66l0J02K39j39Nl2J52N8l82J31n7k54M58k06
6307f6k4L03m93K97J09k97N5L2K67J54o55K14O03o57J63K9k1j46M27j74r4l8k84
6330b96J92K46m56L56J06m20J49M29k08l95M08j59K72j78j80J89J95j15k24J38
$$ [...]
8191A05
##END NTUPLES=NMR FID
##END=
