##TITLE=1H_LR-788-CR4
 CDCl3
 8 sc, 
 10.1.2025
##JCAMPDX= 6.0         $$ Bruker NMR JCAMP-DX V2.0
##DATA TYPE= NMR FID
##DATA CLASS= NTUPLES
##ORIGIN= UXNMR, Bruker Analytische Messtechnik GmbH
##OWNER= root
$$ XWIN-NMR		Version 3.5
$$ Fri Jan 10 14:32:14 2025 Russian Standard Time (UT+4h)  she@DPX200
##.OBSERVE FREQUENCY= 200.1315
##.OBSERVE NUCLEUS= ^1H
##.DELAY= (6, 6)
##.ACQUISITION MODE= SIMULTANEOUS
##.ACQUISITION SCHEME= undefined
##.AVERAGES= 8
##.DIGITISER RES= 18
##SPECTROMETER/DATA SYSTEM= spect
##.PULSE SEQUENCE= zg30
##.SOLVENT NAME= CDCl3
##.SHIFT REFERENCE= (INTERNAL, CDCl3, 0, 15.7039)
##AUDIT TRAIL= $$ (NUMBER, WHEN, WHO, WHERE, WHAT)
$$ ##TITLE= Audit trail, XWIN-NMR		Version 3.5
$$ ##JCAMPDX= 5.01
$$ ##ORIGIN= Bruker BioSpin GmbH
$$ ##OWNER= she
$$ F:/spectra/data/she/nmr/H-F/1/audita.txt
$$ ##AUDIT TRAIL=  $$ (NUMBER, WHEN, WHO, WHERE, WHAT)
(   1,<2025-01-10 14:31:13.81 +0400>,<she>,<DPX200>,
      <created by zg, POWCHK disabled, PULCHK disabled
       configuration hash MD5:
       00 E9 B6 7A A2 85 ED C7 34 08 36 98 17 FE 4E 26
       data hash MD5: 16K
       FB 58 24 D0 52 41 DC 3A 0F 1C A3 96 8A 68 23 26>)
$$ ##END=
$$ 
$$ hash MD5
$$ FD F9 0F 02 D0 51 BA FB 77 5D C0 4C 49 2A DC A0
##$RELAX= 
##$RELAX= 
##$RELAX= 
##$RELAX= 
##$RELAX= 
##$RELAX= 
$$ Bruker specific parameters
$$ --------------------------
##$DU= <F:/spectra>
##$EXPNO= 1
##$NAME= <H-F>
##$PROCNO= 1
##$TYPE= <nmr>
##$USER= <she>
##$AMP= (0..31)
100 100 100 100 100 100 100 100 100 100 100 100 100 100 100 100 100 100 
100 100 100 100 100 100 100 100 100 100 100 100 100 100 
##$AQSEQ= 0
##$AQ_mod= 1
##$AUNM= <au_zg>
##$AUTOPOS= <>
##$BF1= 200.13
##$BF2= 200.13
##$BF3= 200.13
##$BF4= 200.13
##$BF5= 200.13
##$BF6= 200.13
##$BF7= 200.13
##$BF8= 200.13
##$BYTORDA= 1
##$CFDGTYP= 0
##$CFRGTYP= 5
##$CHEMSTR= <none>
##$CNST= (0..31)
1 1 145 1 1 1 1 1 1 1 1 1 1 1 1 1 1 1 1 1 1 1 1 1 1 1 1 1 1 1 1 1 
##$CPDPRG= <>
##$CPDPRG1= <>
##$CPDPRG2= <>
##$CPDPRG3= <>
##$CPDPRG4= <mlev>
##$CPDPRG5= <mlev>
##$CPDPRG6= <mlev>
##$CPDPRG7= <mlev>
##$CPDPRG8= <mlev>
##$CPDPRGB= <>
##$CPDPRGT= <>
##$D= (0..31)
0 1.2 0 0 0 0 0 0 0 0.06 0 0.03 0 0 0 0 0.0002 0 0 0 0 0 0 0 0 0 0 0 0 
0 0 0 
##$DATE= 1736505073
##$DBL= (0..7)
120 120 120 120 120 120 120 120 
##$DBP= (0..7)
150 150 150 150 150 150 150 150 
##$DBP07= 0
##$DBPNAM0= <>
##$DBPNAM1= <>
##$DBPNAM2= <>
##$DBPNAM3= <>
##$DBPNAM4= <>
##$DBPNAM5= <>
##$DBPNAM6= <>
##$DBPNAM7= <>
##$DBPOAL= (0..7)
0.5 0.5 0.5 0.5 0.5 0.5 0.5 0.5 
##$DBPOFFS= (0..7)
0 0 0 0 0 0 0 0 
##$DE= 6
##$DECBNUC= <off>
##$DECIM= 24
##$DECNUC= <off>
##$DECSTAT= 4
##$DIGMOD= 1
##$DIGTYP= 9
##$DL= (0..7)
0 120 120 120 120 120 120 120 
##$DP= (0..7)
150 150 150 150 150 150 150 150 
##$DP07= 0
##$DPNAME0= <>
##$DPNAME1= <>
##$DPNAME2= <>
##$DPNAME3= <>
##$DPNAME4= <>
##$DPNAME5= <>
##$DPNAME6= <>
##$DPNAME7= <>
##$DPOAL= (0..7)
0.5 0.5 0.5 0.5 0.5 0.5 0.5 0.5 
##$DPOFFS= (0..7)
0 0 0 0 0 0 0 0 
##$DQDMODE= 0
##$DR= 18
##$DS= 0
##$DSLIST= <SSSSSSSSSSSSSSS>
$$ [...]
##$SUBNAM2= <"">
##$SUBNAM3= <"">
##$SUBNAM4= <"">
##$SUBNAM5= <"">
##$SUBNAM6= <"">
##$SUBNAM7= <"">
##$SUBNAM8= <"">
##$SUBNAM9= <"">
##$SW= 24.0689530833862
##$SWIBOX= (0..15)
0 0 2 0 0 0 0 0 0 0 0 0 0 0 0 0 
##$SW_h= 4816.95568400771
##$TD= 16384
##$TD0= 1
##$TE= 0
##$TE2= 300
##$TE3= 300
##$TEG= 300
##$TL= (0..7)
0 120 120 120 120 120 120 120 
##$TP= (0..7)
150 150 150 150 150 150 150 150 
##$TP07= 0
##$TPNAME0= <>
##$TPNAME1= <>
##$TPNAME2= <>
##$TPNAME3= <>
##$TPNAME4= <>
##$TPNAME5= <>
##$TPNAME6= <>
##$TPNAME7= <>
##$TPOAL= (0..7)
0.5 0.5 0.5 0.5 0.5 0.5 0.5 0.5 
##$TPOFFS= (0..7)
0 0 0 0 0 0 0 0 
##$TUNHIN= 0
##$TUNHOUT= 0
##$TUNXOUT= 0
##$USERA1= <user>
##$USERA2= <user>
##$USERA3= <user>
##$USERA4= <user>
##$USERA5= <user>
##$V9= 5
##$VALIST= <valist>
##$VCLIST= <CCCCCCCCCCCCCCC>
##$VD= 0
##$VDLIST= <DDDDDDDDDDDDDDD>
##$VPLIST= <PPPPPPPPPPPPPPP>
##$VTLIST= <TTTTTTTTTTTTTTT>
##$WBST= 1024
##$WBSW= 4
##$XGAIN= (0..3)
0 0 0 0 
##$XL= 0
##$YL= 0
##$YMAX_a= 45591
##$YMIN_a= -121555
##$ZGOPTNS= <>
##$ZL1= 120
##$ZL2= 120
##$ZL3= 120
##$ZL4= 120
##$ABSF1= 10
##$ABSF2= 0
##$ABSG= 5
##$ABSL= 3
##$ALPHA= 0
##$AQORDER= 0
##$ASSFAC= 0
##$ASSFACI= 0
##$ASSFACX= 0
##$ASSWID= 0
##$AUNMP= <proc_1d>
##$AZFE= 0.1
##$AZFW= 0.1
##$BCFW= 1
##$BC_mod= 2
##$BYTORDP= 1
##$COROFFS= 0
##$CY= 11.3945322036743
##$DATMOD= 1
##$DC= 2
##$DFILT= <>
##$DTYPP= 0
##$F1P= 15.6554695791079
##$F2P= 12.8336369535428
##$FCOR= 0.5
##$FTSIZE= 0
##$FT_mod= 4
##$GAMMA= 1
##$GB= 0.15
##$INTBC= 1
##$INTSCL= 1
##$ISEN= 128
##$LB= 0.24
##$LEV0= 0
##$LPBIN= 0
##$MAXI= 10000
##$MC2= 0
##$MEAN= 0
##$ME_mod= 0
##$MI= 1.114404
##$NCOEF= 0
##$NC_proc= 0
##$NLEV= 6
##$NOISF1= 3.799351
##$NOISF2= 2.8
##$NSP= 1
##$NTH_PI= 0
##$NZP= 0
##$OFFSET= 15.70392
##$PC= 1
##$PHC0= -26582.77
##$PHC1= 25.78744
##$PH_mod= 1
##$PKNL= yes
##$PPARMOD= 0
##$PSCAL= 0
##$PSIGN= 0
##$REVERSE= no
##$SF= 200.130013532006
##$SI= 16384
##$SIGF1= 3
##$SIGF2= 2
##$SINO= 400
##$SIOLD= 16384
##$SREGLST= <1H.CDCl3>
##$SSB= 0
##$STSI= 0
##$STSR= 0
##$SW_p= 3612.71676300578
##$SYMM= 0
##$S_DEV= 0
##$TDeff= 0
##$TDoff= 0
##$TI= <>
##$TILT= no
##$TM1= 0
##$TM2= 0
##$TOPLEV= 0
##$USERP1= <user>
##$USERP2= <user>
##$USERP3= <user>
##$USERP4= <user>
##$USERP5= <user>
##$WDW= 1
##$XDIM= 8192
##$YMAX_p= 0
##$YMIN_p= 0
$$ End of Bruker specific parameters
$$ ---------------------------------
##NTUPLES= NMR FID
##VAR_NAME=  TIME,          FID/REAL,        FID/IMAG
##SYMBOL=    X,             R,               I
##VAR_TYPE=  INDEPENDENT,   DEPENDENT,       DEPENDENT
##VAR_FORM=  AFFN,          ASDF,            ASDF
##VAR_DIM=   8192,          8192,            8192
##UNITS=     SECONDS,       ARBITRARY UNITS, ARBITRARY UNITS
##FACTOR=    0.0002076,     1,               1
##FIRST=     0,             0,               0
##LAST=      1.7004516,     0,               0
##MIN=       0,             -121555,         0
##MAX=       1.7004516,     45591,           0
$$ Real data points
##PAGE= N=1
##DATA TABLE= (X++(R..R)), XYDATA
0 0 0 0 0 0 0 0 0 0 0 0 0 0 -1 6 -8 8 -8 8 -8 10 -16 16 -17 23 -24 29 -33 36 -41 48 -53 57 -64 72 -82 91
36 91 -101 110 -125 136 -152 167 -186 208 -229 253 -284 317 -354 399 -453 518 -600 705 -846 1049
56 1049 -1359 1887 -2963 6024 -34425 -121555 -44548 29485 -7405 -39558 6967 13999 -37207
69 -37207 -41205 2522 -188 -25240 -16692 -22276 -63751 -52302 13532 22945 -28663 -37340 -13401
82 -13401 -34573 -59772 -20429 16539 -17886 -52586 -26975 -5600 -26875 -36612 -19835 -22775 -39084
95 -39084 -31193 -19596 -23787 -14745 3042 -16531 -52608 -40286 -6295 -18500 -48963 -32548 639
108 639 -4417 -21139 -14806 -13000 -29915 -32635 -19784 -21623 -25332 -10228 -2977 -21285 -24362 1035
122 1035 5966 -22405 -34244 -18631 -15250 -22186 -5722 15822 2988 -23577 -24858 -9378 -5059
135 -5059 -5733 -2172 -5270 -13724 -10497 435 3904 3304 3215 -7505 -24137 -19896 5858 21711 12739
150 12739 -188 -3482 -5354 -6383 -778 7023 6094 -1247 -4532 -327 9955 19033 18228 5825 -7192
165 -7192 -9398 -2060 7032 14211 15843 11761 5548 3628 7081 12325 12545 6076 -671 1297 10641
180 10641 16937 17434 15830 11417 4190 -159 5488 13820 15087 11739 10072 10857 12964 15794 14098
195 14098 6958 2282 4993 9822 12398 16113 19020 14510 5842 4814 10469 11912 8295 5535 6975
210 6975 8510 13222 18478 17187 10165 3441 1352 2007 7573 15308 16146 8521 4171 7630 11280 10448
226 10448 8655 6969 1329 -2231 4281 14418 16790 12985 6620 -835 -4284 1140 9840 10248 4682
241 4682 2622 3326 3176 5360 10741 9119 -1658 -8661 -3705 3936 7485 9538 8800 1440 -5712 -4176
257 -4176 1156 2412 1429 733 -2146 -4426 158 7731 6052 -2650 -7419 -7133 -6331 -4105 2139 4834
273 4834 64 -5213 -5402 -3354 -3161 -3724 -5029 -7420 -8615 -3791 756 358 -3202 -5704 -8759 -11079
289 -11079 -8790 -3981 -2723 -6277 -7575 -5831 -4021 -4385 -5037 -8616 -11948 -12161 -8545 -4970 -2152 -2487
305 -2487 -6452 -11110 -11936 -8112 -5507 -6964 -9672 -10169 -9299 -6787 -3037 -2155 -5880 -11357 -14531 -12800
321 -12800 -8255 -3016 -1866 -5115 -9347 -9579 -7128 -5474 -4738 -6020 -9113 -11312 -9289 -3259 1374
336 1374 93 -4823 -9422 -10876 -8390 -4027 -709 -1298 -3987 -6004 -4805 -2310 32 -94 -3610 -7654
352 -7654 -7138 -2390 2125 3819 2621 -950 -3477 -4153 -2365 1455 2234 595 -1192 -217 3281 5002
368 5002 4730 2368 -647 -1828 -351 3655 6400 7143 5324 2637 2130 3671 5626 5119 3311 2146
384 2146 3270 6194 8641 9459 7712 4441 1303 1645 5302 8129 8104 6450 5052 5905 7226 8310
400 8310 8180 5214 2975 2231 4577 8534 10507 10359 6968 3320 2428 5014 7060 6987 5520 4427 3987
417 3987 5138 7767 9280 7458 2858 -479 449 3862 7572 8016 6214 3211 1445 1912 3739 4719
433 4719 4061 1467 -172 771 3493 6869 5787 2335 -1354 -2620 -1116 1386 3227 3260 1714 -732
449 -732 -1404 266 1975 1358 -1592 -3826 -3128 -1164 1485 2638 1275 -1369 -3997 -4419 -2383 -1117
465 -1117 -965 -1713 -3126 -3234 -1689 276 -551 -2681 -4798 -5432 -4527 -2412 157 81 -2379 -4530 -4587 -3294
483 -3294 -2362 -2999 -3555 -4767 -4874 -2881 -674 46 -1831 -4117 -6083 -5955 -3744 -1369 -655 -2096 -3611
500 -3611 -4092 -2874 -1730 -1866 -3022 -4737 -5677 -4340 -1540 559 372 -1887 -4499 -5089 -3920 -2128
516 -2128 -1103 -1170 -2028 -3520 -2814 -772 474 -782 -3012 -4746 -4483 -2554 315 1592 567 -1902
532 -1902 -2992 -2805 -2132 -404 -120 -1229 -2899 -2160 480 1802 1215 -429 -2431 -3821 -3044 -637 1457
549 1457 983 -208 -1255 -1215 -600 428 333 -1299 -2581 -2035 32 1422 2090 1465 -276 -1891 -2469 -563
567 -563 1100 1022 308 -34 -157 424 1901 1833 284 -1099 -2130 -898 1376 2899 2985 1609 -421 -730
585 -730 413 1352 1701 1198 399 -137 969 2852 3627 2915 805 -850 -698 929 3424 3522 2384 2014
603 2014 959 1434 2214 2922 2532 423 121 965 3026 4309 4251 2953 943 129 1028 2658 3311 3325
621 3325 2728 1767 1797 2931 4215 3585 1791 660 1015 1909 3268 4579 4114 2333 776 1273 1925 2978
639 2978 3149 2138 1059 1047 2494 3927 3404 2100 821 -165 -1 1232 3161 3199 1861 730 347
656 347 846 1721 1731 305 -322 -258 447 1458 2476 1784 -60 -1736 -2170 -502 211 461 -113 -692 -1279
675 -1279 -952 51 334 -987 -2356 -2499 -2429 -1623 195 196 -1732 -3110 -2962 -2553 -2147 -1537 -1655 -2847 -3586
694 -3586 -2928 -1283 -1102 -1539 -3031 -3783 -4459 -3189 -1736 -945 -1855 -2787 -3555 -3464 -2808 -2066 -1871 -3352 -4020
713 -4020 -3319 -2060 -1431 -983 -1836 -3386 -3935 -3744 -2310 -1686 -1415 -1917 -2750 -2974 -1829 -639 -1393 -2374
731 -2374 -2883 -2768 -2110 -742 259 6 -1418 -2175 -1942 -1598 -547 -232 -591 -1567 -1261 -48 342 388 473
750 473 -635 -1747 -1351 520 1850 1520 629 390 7 112 1163 1258 762 35 -77 1117 1598 2355 2468
769 2468 1007 -301 -267 1189 1693 2189 1859 1592 1119 1107 2277 2400 2003 732 388 601 1628 2764
787 2764 2976 2242 1066 645 812 1516 2065 2254 1237 893 1343 1500 2149 2051 1169 -19 -131 868 1735
806 1735 2105 2032 1244 411 559 628 1388 1515 549 291 358 1137 1667 2063 1286 152 -1074 -302 614 934
826 934 1152 794 34 -113 404 1410 858 117 -506 -744 -116 780 1516 789 -155 -742 -497 -175 53 46 411
847 411 -339 -507 147 735 1192 137 -661 -952 -1064 -353 938 726 18 -200 -584 -384 190 210 195 -343
867 -343 -454 -365 204 675 664 -128 -812 -839 -338 282 798 206 163 -801 -118 306 265 409 -339 -878 -964 -74
889 -74 485 1361 336 -484 -611 -501 -345 292 216 -126 -632 -370 9 201 296 -389 -783 -1388 -872 113 68
910 68 150 -342 -742 -1078 -686 -269 -298 -1005 -1318 -1079 -888 -175 -41 -352 -1522 -1681 -1710 -903 -437 -319 -930
931 -930 -1152 -1422 -1150 -996 -660 -1134 -1593 -1466 -1535 -584 -307 -497 -1301 -1747 -1810 -1449 -1222 -432 -899 -1330 -1374
952 -1374 -1071 -567 -401 -664 -1238 -1886 -1341 -915 -14 -329 -524 -845 -1211 -826 -451 55 -411 -957 -564 -278
972 -278 -186 175 356 -261 -647 -768 -213 179 594 847 259 -61 -61 509 607 801 182 -190 69 715 1298 1552
994 1552 1441 666 440 471 908 1132 1552 1155 674 464 1229 1578 1475 1252 771 580 1095 1787 1930 1781
1014 1781 1482 1008 885 1336 1555 1688 1433 1327 962 1082 1960 2124 1280 1232 384 853 903 1481 1895 1727
1034 1727 945 534 931 1275 1249 628 654 640 425 1038 1342 1179 778 -4 -71 172 739 559 748 231 -75
1055 -75 417 757 360 358 -130 -584 -574 -240 -151 265 -177 -723 -856 -573 -477 -409 -177 -757 -1034 -1170 -344 -291 -588
1078 -588 -772 -1059 -1303 -930 -607 -833 -721 -995 -1294 -1097 -1051 -854 -832 -766 -1365 -1388 -909 -568 -258 -557 -1296
1099 -1296 -1394 -1326 -787 -335 -425 -816 -976 -1060 -536 -442 -431 -847 -898 -976 -691 -776 -526 37 -351 -696 -1194 -334 54
1122 54 -48 -307 -583 -596 -141 -78 81 52 -433 -630 -329 97 165 373 355 -251 -215 104 35 2 744 119 13
1145 13 -50 -172 307 557 -74 -54 -489 112 178 463 559 407 550 -32 131 410 200 -73 -175 -15 520 474
1167 474 658 37 95 -303 -113 -112 173 583 107 -15 -41 73 96 712 316 -321 -335 -148 12 -41 363 -247
1189 -247 -445 -324 -155 254 197 -67 44 -353 -50 189 -187 -8 -109 -498 -499 -229 69 102 -48 -355 -235
1210 -235 -333 -11 28 276 -184 -237 -31 337 256 126 17 -110 -333 28 331 -16 435 -55 -112 111 268 429
1232 429 558 183 133 432 421 342 723 720 225 236 372 619 927 687 675 261 502 494 738 755 367 551 267
1255 267 255 622 915 922 702 261 570 584 772 654 657 122 444 650 687 890 505 352 237 157 451 612 395
1278 395 448 406 131 422 607 479 338 150 57 25 -152 355 199 206 -181 -116 -230 30 95 -128 -390 -683 -513
1301 -513 -296 -78 -361 -428 -704 -925 -575 -233 -500 -511 -738 -658 -617 -579 -529 -843 -693 -869 -553 -887 -774 -728
1323 -728 -511 -891 -1010 -781 -681 -547 -810 -892 -862 -719 -545 -613 -490 -833 -834 -1051 -636 -514 -532 -384 -939 -776
1345 -776 -637 -741 -429 -723 -217 -504 -149 -470 -448 -143 -556 -147 -409 -544 -173 -168 148 -159 -43 -159 119
1366 119 110 389 385 38 192 140 159 186 770 343 2 183 300 302 924 620 368 326 159 635 682 551 303 260
1390 260 206 698 1068 1127 787 694 352 497 481 412 645 571 410 444 706 879 312 541 571 535 564 423 613
1413 613 685 326 438 264 801 718 410 358 169 154 -99 413 583 314 193 8 -179 50 199 219 137 -92
1435 -92 -154 26 -166 338 -237 -234 341 -600 -400 -220 69 -244 -408 -496 -210 -530 -349 34 -343 -374 73 -195
1457 -195 -176 -430 -388 -605 -414 -187 -311 -250 -210 -49 -460 -539 -699 42 -86 -146 -356 -437 -214 -248 4 -257 -416
1480 -416 -542 -80 -7 -104 -276 -275 -102 -183 -45 93 3 26 -59 -492 81 258 180 59 -8 199 117 256 459 18
1504 18 -224 238 239 121 172 276 58 215 182 -194 426 242 518 412 -160 316 244 514 387 72 181 -106
1526 -106 165 75 190 106 -14 -183 -48 23 83 74 116 52 -97 -139 365 23 209 85 4 199 -215 -95 57
1549 57 -474 -283 -127 -80 -119 -75 -107 -258 -644 -519 -287 -358 -234 -201 -484 -608 -502 -211 -357 -398 -351 -391 -598
1572 -598 -543 -379 -602 -325 -101 -607 -317 -200 -518 -140 -462 -484 -260 -256 295 -363 -366 -415 -295 200 -141 155
1594 155 -168 -263 -418 -294 -418 -138 -54 -283 -45 -39 248 310 63 223 -91 -198 161 233 408 397 305 229 419
1617 419 567 412 409 53 166 431 519 552 518 479 187 -18 502 328 551 311 637 710 408 499 733 402 447
1640 447 414 402 565 526 724 265 249 520 360 718 603 340 421 123 152 12 294 447 420 281 297 410 409
1663 409 204 119 166 392 97 -40 259 268 113 60 130 -4 63 22 -369 -181 -220 -134 -315 -225 -521 -398 -451 -196
1687 -196 8 -239 -324 -352 -607 -485 -561 -406 -323 -268 -440 -415 -297 -185 -169 -303 -409 -477 -642 -475 -546 -275 53
1710 53 -200 -296 -352 -474 -264 -353 -133 -89 -620 -80 -203 -358 -190 -219 -241 -296 -501 -310 -412 -6 60 -80 -60
1733 -60 94 55 -174 -74 -101 -93 -12 -54 138 71 139 -105 111 98 51 296 69 129 153 -235 202 174 233 455 325
1758 325 506 35 330 116 329 349 231 394 396 463 236 489 202 386 299 109 217 146 24 268 133 643
1780 643 527 344 268 447 189 39 228 237 209 137 -17 -7 449 271 85 -6 -34 120 55 -234 -252 -66 -90 208
1804 208 -52 -143 37 -283 -221 -178 -187 -68 -49 59 -68 -538 -199 -142 -109 -140 -262 -498 81 4 -9 -51 -503 -237
1828 -237 -610 -477 -99 -296 -276 -410 -337 -167 -84 368 -191 -525 -588 152 -83 -97 134 -84 -517 -156 -218 41
1850 41 -22 -194 -165 -81 123 -104 92 25 -107 -8 18 -403 239 344 94 78 221 128 68 250 69 340 238
1873 238 219 275 185 460 138 330 750 -38 298 278 478 -62 558 119 280 348 212 317 148 279 -58 479
1895 479 208 517 171 4 -25 89 -19 76 51 277 85 175 394 109 110 174 246 -10 -79 -55 -295 5 -89 -141
1919 -141 -185 28 49 -266 -120 29 -5 -194 -114 -203 79 -21 -355 -186 -312 -4 -218 -190 -553 -319 -14 -524
1941 -524 -658 -146 -59 -320 -361 -178 -221 -371 -417 -118 -396 -132 -284 -384 -288 -136 -537 -284 -321 -250 -220 -278 -133
1964 -133 3 -133 -290 -323 -247 -27 -558 -48 -346 -171 -310 -37 -134 -313 -62 -57 -135 2 125 38 -240 169
1986 169 194 70 82 287 -119 237 -252 79 171 42 118 119 191 127 308 164 10 385 486 229 147 381 371
2009 371 -131 524 114 376 145 154 314 385 391 368 460 108 90 330 305 80 360 363 145 104 550 222 50 207
2033 207 215 208 223 219 208 430 -54 10 215 172 -49 -34 31 136 118 -188 -149 -206 -156 10 131 -134 119 -203 -59
2058 -59 224 -315 -94 -63 -204 -188 -226 -127 -31 -259 -216 -249 -189 -401 -153 -69 -170 -266 -76 -341 -419 -121 -86 -170 -58
2083 -58 -429 -294 -264 118 -239 -327 -112 -399 -319 -109 -355 -19 84 -211 -82 1 -255 217 -181 -127 -65 -182
2105 -182 -254 -59 3 -165 141 -10 309 132 15 94 120 23 204 143 355 -17 373 154 315 332 353 -50 175
2128 175 -68 77 131 17 -107 390 40 316 310 319 177 88 506 209 -1 261 254 330 307 357 17 365 494 -19
2152 -19 234 133 -18 433 406 274 -32 33 348 484 244 -46 76 -123 -121 -83 486 -114 -16 64 -38 89 -106
2175 -106 -140 -225 -32 -155 65 -321 -378 -90 -256 -422 -324 9 -263 -300 -328 -238 -53 -327 -45 -239 -327 -489 -529
2198 -529 -236 -441 117 -377 -378 -19 -111 -357 147 -217 -115 -135 -177 -255 -105 -316 -324 62 16 217 -310 -131 -192
2221 -192 20 -71 19 384 -251 -156 -34 69 -142 -207 60 -153 34 88 54 201 58 -86 190 40 219 -59
2243 -59 166 -1 173 119 -22 210 -184 160 321 103 14 139 374 196 608 205 312 210 119 342 383 437
2265 437 471 514 119 130 190 315 139 276 23 237 78 325 339 -201 125 207 215 363 215 168 241 82 -80
2288 -80 75 84 -53 128 37 86 373 -79 241 508 57 165 -215 -232 -18 64 -82 59 -291 -97 -125 -84 -201
2311 -201 -323 -178 -89 -126 -242 -133 -185 -335 -177 169 -450 -162 74 -283 -208 -200 -106 -449 7 -660 -435 -287
2333 -287 -77 154 -122 11 -297 -157 -284 -181 -147 -148 -146 -298 -273 -327 -367 -23 -240 -16 -89 -41 75 24 -296 -42
2357 -42 23 -181 148 -16 -299 194 -88 -77 118 385 89 6 -134 -46 233 182 204 71 154 267 66 211 219
2380 219 107 383 -33 377 -15 118 210 166 -33 386 110 115 34 357 105 168 -143 -39 47 70 -198 432 201
2403 201 -180 141 321 265 395 138 179 225 54 53 -12 -29 73 64 -142 -70 70 -172 76 -60 -182 109 -280
2426 -280 262 182 -304 -122 155 162 -44 -223 -33 82 -170 -183 -65 -124 -273 -216 -141 -272 -304 -89 -283 -59 -195
2449 -195 -230 -403 -72 114 -225 -433 -223 -9 -156 -223 44 -55 -482 -178 -269 -308 -198 -153 143 54 0 -52 182
2472 182 -23 -32 -110 69 -135 107 123 129 -38 102 -182 -59 116 17 123 191 108 -4 63 205 144 87 402 19
2496 19 -6 236 -112 -17 48 224 75 -15 99 208 377 123 484 155 -112 120 75 306 39 -93 -38 62
2518 62 193 328 74 98 129 81 211 -82 207 9 200 60 -370 37 36 227 -1 20 159 -57 -507 137
2540 137 231 406 113 133 -158 -58 -17 -90 -131 -241 -350 -128 -23 203 -111 -87 -128 -10 -261 2 -227 -248 -173
2563 -173 -246 70 -243 -3 -133 48 -192 -101 -95 -265 -32 -195 -139 -138 -206 -67 -42 -311 -104 305 107 -155 -12
2586 -12 -161 185 6 -179 -123 -238 -115 -477 -48 -222 -65 53 185 110 333 15 -39 -6 -50 -8 53 106 -15
2609 -15 455 21 -208 165 -26 533 11 -110 198 101 215 206 -202 198 95 -113 59 142 62 278 -34 218
2631 218 150 197 98 213 89 25 359 46 -59 344 169 98 81 190 -71 405 -74 172 336 26 208 66
2653 66 -188 245 236 -24 -118 -331 237 -2 293 -139 17 -113 -63 -95 10 -218 98 240 48 384 190 -40
2675 -40 150 -48 -91 98 269 42 403 -327 -348 12 367 -253 -67 31 -58 15 -110 -281 -327 -173 -150 194 -224
2698 -224 -147 48 -215 144 -441 -215 -113 -59 184 -204 14 -224 73 194 -8 -312 -155 -153 -124 -45 159 -83
2720 -83 157 -127 -401 -7 24 275 102 -161 -25 91 -114 317 392 49 133 -88 4 91 -71 261 330 253 142
2743 142 225 200 87 74 85 468 233 127 -37 150 -253 341 64 -86 -148 -4 139 225 237 195 46 247 241
2766 241 209 -118 -239 28 78 -98 -125 10 -2 132 -170 204 -99 79 209 118 180 -69 174 -173 145 570
2788 570 76 99 150 -41 8 -247 73 20 45 -72 -71 61 -474 -261 -263 47 126 -231 -124 -43 -162 -272 -178 -388
2812 -388 -21 7 -318 -233 228 39 -147 -348 -190 -204 -177 -78 -259 32 -225 26 -471 -316 -251 -469 -181 -141
2834 -141 113 -85 -73 202 -50 12 -162 147 182 -161 -51 138 132 319 122 -100 178 -11 251 164 160 38 162
2857 162 85 -22 -135 -139 180 -54 -205 181 57 93 -312 347 335 170 -90 283 297 288 301 66 163 -59 -137 -122
2881 -122 -110 54 62 -39 29 16 218 -25 -3 -35 133 333 224 549 99 45 17 167 285 -128 73 249 57
2904 57 80 -212 -89 -179 -28 -178 -31 135 -257 183 54 151 73 -268 -22 17 -80 -152 -351 326 72 -168 -224
2927 -224 40 -178 156 -7 222 151 207 -19 -26 -174 -107 -155 27 -257 -172 22 -71 14 31 -161 -157 244 -131 -94
2951 -94 -602 -317 154 -39 -41 101 225 282 262 -367 -57 174 102 157 70 54 -275 -135 124 150 75 32 25 139 -123
2976 -123 26 -176 172 241 201 260 -79 89 -102 -126 -264 173 81 160 9 -50 -249 163 -218 112 242 154 231
2999 231 -290 134 145 159 377 -96 39 -47 132 19 194 -123 -45 59 204 71 -116 -224 431 453 199 150
3021 150 4 189 55 -87 -38 86 144 43 103 -31 71 -437 252 135 -86 84 -183 -274 164 195 -135 -16
3043 -16 -409 234 -117 51 -164 -117 -207 93 29 21 78 -409 -108 -168 -63 168 -237 -75 -143 -330 -159 201 266
3066 266 -144 66 142 36 -395 74 47 -267 6 -161 223 -278 -4 -358 31 133 56 -208 -127 309 -115
3087 -115 -50 70 -77 -72 -55 -312 -263 -170 -314 66 142 -6 105 157 3 -91 416 50 279 167 -72 172 360
3110 360 411 69 189 201 96 -192 91 281 97 182 -327 416 415 354 239 113 -184 -51 173 160 -29 301
3132 301 194 198 517 278 293 411 96 178 84 -23 -42 288 -67 219 38 163 -100 -138 -28 33 155 85 200
3155 200 114 -10 211 18 -309 62 -34 206 -12 -299 181 74 -132 -145 8 -65 29 21 -152 -33 -10 -247 -63
3178 -63 111 231 37 60 142 -160 -118 150 -189 36 -223 -260 -81 52 -204 -254 -156 -438 -63 -223 -247 -273 -117
3201 -117 -19 -143 -269 -49 -51 105 -194 2 -93 -184 221 -165 -353 -17 -9 -92 -13 -223 158 100 -5 28 -197 38
3225 38 157 207 -189 -88 265 -366 -142 -20 218 162 293 -7 -20 160 -36 248 220 129 92 84 -18 -44 160
3248 160 72 -204 163 -40 -44 -33 110 31 145 -41 -53 220 402 157 -246 68 90 66 -41 270 331 2 49
3271 49 106 -107 -9 75 70 -91 -100 101 229 49 -38 125 -157 160 76 179 -31 60 104 81 150 160 234 132 224 5
3297 5 10 -350 -151 3 -235 148 51 -228 -42 138 -125 10 -49 -36 -48 -361 -41 -162 50 100 -135 99 149
3320 149 -186 -215 70 -32 0 -200 -339 19 1 349 29 138 148 -47 45 -112 -95 64 -42 -103 381 -242
3342 -242 -63 286 218 -14 153 -42 -58 62 114 84 155 104 -179 33 53 90 -36 -97 171 348 167 -45 170
3365 170 198 -38 303 -17 150 77 210 34 16 146 -37 132 212 122 -183 86 -20 101 390 -226 236 244
3387 244 -159 -105 28 125 3 -66 -224 -84 37 100 0 -19 69 21 182 168 -343 228 16 -158 -222 29 -56
3410 -56 -189 -133 -201 139 -27 -220 -28 61 16 -149 -118 113 -225 26 -220 -25 12 -39 208 -4 42 137 -304
3433 -304 62 0 -45 172 -23 25 21 70 -217 -55 -7 45 -83 -250 -218 -20 -48 -2 -77 -41 -406 96 80 180 -296
3458 -296 -146 143 -222 240 -95 48 61 196 -296 -145 107 -393 -438 -65 -171 -112 46 36 97 -21 23 185
3480 185 263 -146 -181 -186 275 100 63 38 -199 113 208 153 60 220 -134 197 271 -59 -101 -176 99 281 71 -4
3504 -4 303 196 18 308 321 -103 -53 -81 292 -257 34 376 17 -159 -74 -245 155 41 -19 -8 -107 64 140
3527 140 -138 -86 -120 -162 81 -86 13 286 266 24 96 -141 -216 -101 138 38 -283 -80 -199 -44 -348 -128
3549 -128 -61 -86 42 -56 -284 -118 -155 -122 -1 -20 -250 -43 -31 -81 -330 152 -8 -176 136 -170 3 24 143
3572 143 106 296 77 259 41 -108 -83 -305 -195 140 -183 44 -192 1 128 127 109 9 -85 128 242 -154
3594 -154 -11 79 -103 -159 -111 -22 -78 -20 -283 -29 337 65 101 289 27 302 -81 -17 349 470 154 -39 -38
3617 -38 -5 182 359 85 74 271 45 137 -277 201 177 -34 228 -84 179 -199 -22 121 -125 -24 215 -51
3639 -51 194 87 106 66 -96 99 280 -164 280 114 69 -17 95 -67 -37 87 -115 139 -253 137 -204 48
3661 48 -58 156 -19 -16 225 6 -7 -142 6 -34 110 -314 -85 -181 -233 -485 200 24 151 178 20 182 153
3684 153 -69 -237 -115 -80 -81 -352 63 -307 -107 119 -178 -307 -121 -31 -157 -128 -59 140 -150 -187 22 21 -241
3707 -241 -137 -239 -183 -72 51 -33 -148 -41 28 -144 77 -35 -215 -74 110 -252 -93 56 -232 -298 1
3728 1 15 -18 92 154 450 223 -32 -111 345 186 -77 72 -50 20 52 165 339 -167 -243 -112 416 -171 320
3751 320 221 221 -77 50 106 -118 -5 436 -224 -40 426 38 54 156 157 76 -211 237 -318 146 -304 -163 -203
3774 -203 353 -20 -86 -42 -63 -141 -255 4 -14 103 -5 -229 -179 -146 199 220 -54 -222 -35 298 169 -58 -132
3797 -132 -12 -141 -306 -248 157 -23 133 183 -383 144 -113 -185 127 -158 -70 -142 116 177 100 -65 -106 -315 -172
3820 -172 70 111 49 118 -345 -146 62 70 -309 -288 -196 45 -326 -21 25 -205 -63 -362 111 -207 -234 198 86
3843 86 23 21 -169 158 -54 130 31 96 28 151 -184 -31 407 -86 72 42 22 -26 184 -56 -239 212 87
3866 87 198 286 401 16 -94 -130 248 84 -264 204 -36 -87 106 -112 -10 -83 -209 84 -338 231 31 215
3888 215 -32 422 -2 -48 286 -162 150 -8 216 58 198 -441 -224 56 344 199 -132 -219 -50 -80 -261
3909 -261 468 81 -46 10 -337 352 189 457 134 -297 -221 -30 52 183 21 67 -178 58 156 218 -92 -132
3931 -132 -23 -304 297 8 93 -247 -292 -161 134 -329 138 290 -198 -182 -49 -205 219 -220 -131 -78 51 231
3953 231 -88 -47 -153 -319 141 147 165 -53 -64 -243 240 60 120 -52 -85 93 -104 163 -21 -24 350 181 98
3976 98 -269 -29 -31 -126 -108 56 -138 11 150 -151 -4 132 113 51 69 198 13 1 406 -54 -262 362 -81
3999 -81 -9 -175 185 88 60 179 63 203 -277 -140 -158 -302 11 34 -75 148 94 6 29 46 -336 274 34
4022 34 160 0 38 -54 -154 -98 -132 160 115 -264 -68 129 -84 -120 -272 27 -547 166 -354 29 -77 -79 -75 -200
4046 -200 -6 -249 88 -76 176 201 -276 12 -165 -7 -4 25 433 183 -2 87 62 4 301 55 -234 -66
4068 -66 -4 -26 45 -235 180 6 -157 138 -103 -272 150 -295 -126 104 -246 12 -165 1 -106 80 122 -10
4090 -10 89 -240 0 -139 164 -328 -96 201 34 -74 97 -254 -168 -34 159 -90 -238 93 -15 -133 -206
4111 -206 -166 -194 73 -5 -124 -312 39 111 235 -150 -50 28 -93 428 149 -2 40 -54 -61 135 219 142 -195 146
4135 146 226 218 89 281 86 53 -98 -233 59 -5 7 100 -174 -95 -272 -67 -100 -36 30 -149 125 -58 -44 173
4159 173 -264 50 71 -226 211 62 149 -81 -16 114 -20 -189 165 163 -173 -148 -187 -306 -282 -222 -116 112 -92
4182 -92 -122 1 -52 -73 196 -266 -197 -99 -24 -15 -76 -169 36 6 -41 -266 -161 -54 -50 -14 0 113 187 5 -85 275
4208 275 -29 -21 41 6 -65 130 -107 -98 51 51 7 29 -42 69 -5 -126 -148 257 122 -276 330 -165 -61 -68 29 -245
4234 -245 259 117 -67 308 -123 -100 285 211 -549 263 -175 55 -80 79 -111 -269 32 -43 55 39 8 0 217
4257 217 365 -188 112 -150 -21 -215 273 -53 49 188 4 0 272 -257 -108 85 -112 140 -255 34 197
4278 197 215 278 -131 66 48 -287 -190 -83 -100 -286 -159 82 62 163 -16 6 215 97 113 -272 43 111 139
4301 139 116 -199 -38 142 -83 -53 -221 16 178 -222 210 -62 195 315 -60 -16 124 -90 14 21 -215 70
4323 70 -146 38 88 -131 81 -207 107 200 -35 -173 -56 48 56 59 179 178 -46 42 -240 175 191 -80 137 250
4347 250 -31 8 95 81 0 -11 254 178 51 251 -44 -4 -9 38 -105 206 11 -84 103 -117 418 -223 -149 86
4371 86 -79 -108 23 -148 176 -61 -28 211 -147 -136 79 167 197 21 328 17 -19 -251 79 46 -242 -199 -191 -159
4395 -159 25 -41 -64 -38 78 -194 -311 -175 -4 -6 -68 -169 145 -104 239 187 35 -94 -93 32 -105 169 -33
4418 -33 -55 -69 -26 -36 -50 220 -61 -208 41 -124 -407 -52 -10 1 43 154 299 -166 -189 -190 79 -160 -99 144
4442 144 117 -390 5 -191 -77 -233 -321 45 -234 25 -438 -2 130 -97 110 34 -19 -139 182 -49 35 90
4464 90 179 -263 30 235 -39 141 -36 24 -56 -76 -244 -160 224 -434 45 331 -115 158 6 18 151 90 -89
4487 -89 -173 -85 82 40 309 -139 34 -308 -395 13 119 272 148 -41 -107 57 -46 -192 11 -349 -140 -14
4509 -14 -68 -128 65 166 91 22 -84 -87 13 115 -26 18 -158 -14 244 381 37 74 132 127 -11 232 -303 -197
4533 -197 105 -20 -86 -189 -279 64 -51 250 333 58 -194 -98 252 143 -147 77 417 -111 -214 191 -370
4554 -370 165 -255 -89 297 -86 -223 -174 -135 51 150 -275 -131 -62 25 140 -159 -313 142 -121 232 -104 -40
4576 -40 391 -2 63 6 -136 -22 -226 42 165 -130 -195 136 26 203 -2 -133 -127 -39 -42 38 38 -249 138 -225
4600 -225 -144 -209 -229 -159 -52 66 94 -18 -88 -10 87 87 231 361 220 278 211 -152 77 252 187 -90 172 -207
4624 -207 184 -46 367 -130 -239 -93 -66 -19 -78 9 137 23 -37 84 -256 -199 -2 -145 259 87 -98 182
4646 182 -15 130 47 253 107 91 155 146 -18 179 91 71 64 -11 -52 -224 -9 42 180 30 -16 -308 -257 199 -73
4671 -73 -43 -139 126 129 -135 90 20 62 -128 115 -8 245 155 199 283 -235 89 198 18 -196 -12 115 -44
4694 -44 2 137 234 116 -3 -133 284 157 -332 72 208 77 241 15 307 -210 94 186 107 -356 414 45
4716 45 346 20 145 150 88 7 181 -8 -42 118 -120 -47 49 -186 248 -137 56 11 67 149 -154 348 -42 64
4740 64 71 -14 -111 -182 241 199 189 127 209 162 -168 -78 130 -85 -209 184 -179 -34 -119 -136 -146 -70 275 273 126 320
4766 320 -46 92 -145 -310 -255 135 -130 -106 229 -51 105 177 -121 16 -188 63 -197 -233 67 18 58 174
4788 174 -216 -11 190 -269 -284 278 47 -63 85 34 -176 -196 89 79 91 56 -119 73 127 -221 -44 331
4810 331 270 23 -105 94 153 -48 -111 70 -144 23 -121 -8 -104 -246 -351 -7 128 210 -234 -36 29 -75
4832 -75 -177 159 173 87 -147 150 222 75 -244 -117 -101 -18 -248 -148 35 -259 104 -29 -63 268 -235 10
4854 10 324 -106 213 232 -35 48 78 -80 93 192 232 -61 154 -313 400 120 -149 111 -94 -33 -220 120
4876 120 79 195 -30 12 -7 -46 250 -146 152 48 60 -48 99 -267 -249 389 -3 27 -216 180 73 89 118
4899 118 95 -24 154 -139 -76 -97 225 97 -14 47 -188 -154 399 -90 97 50 331 78 -105 297 -74 -101
4921 -101 -239 -108 -168 13 95 -191 -193 49 212 42 103 -136 3 -290 -121 -90 -223 -266 -137 -258 -25 -171
4943 -171 -65 157 -53 103 -99 -62 -13 31 59 -119 391 96 109 246 -235 -232 -33 -56 242 72 39 139 200
4966 200 32 -241 219 23 -26 55 93 47 340 -208 89 -179 39 130 133 157 -200 16 -58 202 12 -96 62
4989 62 -176 -214 -122 -87 36 -241 -112 86 -6 87 -226 50 243 -287 93 -46 -140 126 13 238 -2 133
5011 133 2 -121 267 134 -105 322 -150 -108 146 178 -328 114 134 -110 130 -233 -38 -20 -71 53 70 212
5033 212 309 176 15 -35 -54 -70 212 -459 231 -78 50 23 -70 9 -182 253 71 -28 153 -157 150 100 120
5056 120 24 99 359 58 -140 -68 -86 169 -315 -144 226 116 86 65 -129 273 -85 13 16 26 -2 58 -195 351
5080 351 129 157 -33 -167 293 77 -257 -29 9 -1 -111 -190 191 -77 93 -157 -79 167 -435 65 405 3
5102 3 112 336 -136 190 113 -296 47 -144 130 -107 89 75 -51 -92 220 -64 -323 87 -80 36 130 0
5124 0 222 -127 87 -2 -324 -60 -238 74 37 84 -123 -91 185 -217 120 -181 177 -32 61 66 -163 -26 307
5147 307 -65 64 271 43 27 278 39 -8 63 62 -97 -149 315 -453 -120 -75 156 -6 -64 13 -20 309 -95
5170 -95 188 216 306 -10 72 288 84 2 -59 86 19 -78 -62 -124 32 -13 17 80 303 -38 404 131 46 -170 -337
5195 -337 16 -116 -293 -239 177 99 -13 281 -33 51 290 -317 -24 65 -195 35 140 18 -7 -133 -156 -108
5217 -108 221 -106 111 -116 22 -74 71 -48 144 -169 -114 47 240 220 235 -26 -110 -190 -242 304 -134 31
5239 31 -196 160 2 48 -121 175 273 41 -453 70 87 -174 -253 20 -50 10 -32 246 -41 -282 -136 -158 165
5262 165 -227 25 -34 141 52 38 -129 -22 221 68 36 68 222 123 -130 -173 -91 116 -56 -9 132 -312 108
5285 108 -197 -299 214 -387 142 -95 -42 -177 -130 172 -102 151 -179 263 -215 230 -13 -72 -25 185 124 267
5307 267 134 209 34 253 104 63 2 100 26 -143 -125 -57 8 -75 31 -19 51 342 -255 -196 -70 123 -80 -129
5331 -129 68 -282 -32 32 -47 102 -199 -184 9 -205 111 146 -6 -159 67 -22 148 -135 -14 -226 -112 -63
5353 -63 -157 -159 121 79 89 -125 1 28 -52 -21 -60 201 -180 -192 -2 128 -114 88 -174 251 521 38 -99 253
5377 253 82 -330 108 23 132 -51 -19 -161 61 -282 148 68 33 -178 -53 -5 -135 35 84 -177 -147 174
5399 174 178 -2 -326 -170 273 -68 -90 232 328 -36 82 -72 50 215 177 54 -131 -194 -317 -114 13 46
5421 46 -225 14 63 73 -432 -116 154 141 -9 94 78 -128 106 106 174 28 -216 48 -93 -211 116 14 -117
5444 -117 70 -305 -76 -194 72 259 -232 47 186 124 -109 131 66 23 -213 -4 288 -23 -417 90 -207
5465 -207 -57 96 -42 114 -173 -406 -163 105 -30 64 -191 -122 -297 -10 164 225 212 -53 -60 -215 -134 109
5487 109 229 47 -64 -223 13 -124 -151 27 129 -366 116 121 -299 88 33 -330 44 63 -63 -57 114 -148
5509 -148 -209 77 -125 86 -131 212 253 -116 2 88 -186 390 192 -100 34 48 -325 249 115 -148 34
5530 34 -186 -134 40 50 -214 73 -139 3 -222 190 -267 88 -170 -247 151 33 190 -65 293 -43 16 -103
5552 -103 -122 -87 -226 64 -140 -220 2 -298 -262 -340 93 -72 -28 75 116 -139 -6 -145 76 -115 -117 -149 41
5575 41 17 116 -132 60 185 -16 -152 58 208 60 24 -256 102 -137 21 379 134 -42 -167 -236 -77 72
5597 72 -213 -282 125 361 417 -17 -100 159 137 -92 -1 105 41 -367 106 -2 -192 76 77 75 128 190 106 21 -162
5622 -162 -215 -63 -132 -92 63 -33 -160 45 -279 -358 138 -89 -192 -208 161 174 -75 9 -35 73 -58 -159 79
5645 79 -157 -154 -107 -57 57 70 -30 80 -21 158 -156 -51 16 -89 75 281 178 -132 -65 86 390 27 -504
5668 -504 -267 -96 -38 40 -13 296 -100 -65 -293 -120 -208 -122 -9 7 -378 274 35 30 232 -140 -51 -65 10 -16
5692 -16 70 -233 137 -111 -87 -99 -154 -49 -262 -262 33 139 -205 -11 -125 -31 13 7 15 -69 40 -93 -8 69 92 -32
5718 -32 124 -247 176 75 -196 75 -147 168 -150 291 133 -190 -551 -262 122 -173 -101 294 -353 149 -256
5739 -256 -83 299 60 91 -161 49 65 -266 64 148 -116 -158 -73 72 118 -260 139 -6 122 154 -52 291
5761 291 -298 257 -22 225 -20 -114 -89 -133 38 49 224 165 99 -15 -194 178 -2 -249 371 -18 -111 -78 31
5784 31 -13 104 5 -217 -386 161 2 -251 -41 -32 111 266 -72 89 -281 -96 -82 230 -85 -319 -113 152
5806 152 185 -89 -124 -193 -15 102 -9 51 36 36 263 -146 -87 -129 -102 -371 23 275 -352 -83 -87 252 70 -139
5830 -139 -156 -188 -64 129 224 -58 1 -28 -198 145 24 -12 138 -12 118 -440 183 -25 -136 32 57 266
5852 266 -196 188 191 -72 60 -176 140 -63 156 193 105 18 -130 139 -152 -208 15 380 351 96 159 11 62
5875 62 -51 44 89 62 31 159 -65 -28 126 258 235 -1 -190 188 69 -178 46 343 108 -80 -134 68 142
5898 142 235 -47 -40 181 155 -32 -298 -276 -153 303 35 132 -42 197 176 215 67 -239 -31 -93 -66 136 306
5921 306 -54 -114 -134 -111 -30 207 87 47 277 13 134 329 73 -288 3 37 170 137 -116 -124 -90 -248 -1
5944 -1 369 -303 134 -11 129 -425 -98 -51 70 1 21 -142 -144 -21 65 169 -489 48 162 -320 94 46 301
5967 301 -110 305 176 93 187 142 161 -55 -140 -270 111 35 -127 -146 246 275 137 -112 119 58 -192 194 78
5990 78 138 38 -245 248 115 -65 -213 83 69 -177 186 127 -115 65 0 17 73 -201 175 172 -126 -36 412
6013 412 -220 -115 -71 58 -225 -247 -107 -322 -217 118 28 -14 -312 -30 324 -8 -162 313 -45 186 282 51
6035 51 -166 -15 113 -399 -87 -187 189 -58 -88 -185 -166 114 34 146 -56 72 -115 31 -53 162 -156 21
6057 21 216 -258 126 141 -76 -306 -184 58 55 19 86 -63 -32 -139 -172 -222 -97 166 271 48 -15 -132 323
6080 323 301 -145 87 -52 134 96 -32 -78 249 40 -118 -9 120 36 -214 -397 -69 89 -52 -94 233 102
6102 102 -120 -123 64 -38 210 33 84 -280 -157 -92 -36 89 -46 -129 -200 27 90 230 -127 -35 166 197 -226
6125 -226 -137 -109 207 258 114 -249 23 -160 179 -137 -148 -162 323 -117 -125 219 186 6 -157 -12 -278 101 36
6148 36 266 -53 86 9 263 -214 -75 58 407 117 13 -94 -23 -9 77 -481 -229 129 -64 167 -289 10
6170 10 37 -343 -367 0 -260 -47 -165 -350 -50 195 36 -41 -48 167 55 -75 -170 -231 23 95 -135 -193 58
6193 58 104 -20 -273 44 150 147 -52 87 10 -116 -17 -46 -256 -269 -126 -11 -1 -48 313 -123 -109 -32 40 0 265
6218 265 -181 91 88 -102 118 162 206 229 -37 60 -118 15 228 224 -32 -253 103 -5 -166 190 23 457 44
6241 44 130 247 -151 -177 -186 227 -381 -267 -353 -35 167 -232 -2 -195 116 191 283 215 107 70 -258 111 47 61
6265 61 102 -124 23 -114 62 -201 31 -167 -136 -121 -198 -6 98 115 -81 -248 -207 277 10 192 -146 -503
6287 -503 -209 146 40 -323 -6 160 -141 -178 -192 -29 37 11 209 99 -486 175 106 25 148 -354 -46 201
6309 201 -84 -56 -49 312 -17 0 43 -11 341 -247 158 -4 -1 -249 190 265 96 -53 117 52 -249 205 60
6332 60 -33 55 -22 -26 -5 84 98 -188 -76 58 165 164 -47 275 165 -138 -363 -129 -104 -155 -29 -4 110 -26 210
6357 210 16 -141 91 262 -54 188 -301 217 -45 177 327 242 -146 -183 -148 49 -42 -415 10 -147 0
6378 0 155 -155 -190 294 16 142 136 222 41 -10 -44 20 -115 67 160 -26 72 127 69 266 -192 -226 -122 -93 -67
6403 -67 23 62 -299 -4 29 36 236 327 -35 145 -68 0 99 208 -29 -123 -73 -84 -166 -297 -278 -107 333 180 -77
6428 -77 161 53 279 -28 54 11 235 123 -238 -96 61 21 -545 138 32 -332 47 -66 -163 -79 177 16
6450 16 -102 -88 397 -155 -160 -169 70 83 -304 -107 243 220 66 -87 41 77 117 -81 -200 136 298 -42 -8 160
6474 160 34 51 22 102 -329 -10 118 -230 78 -198 22 -413 -38 206 -183 -56 424 -184 -29 -91 140
6495 140 116 123 138 99 31 -158 18 177 107 -196 225 12 263 47 112 -118 257 -214 104 -271 -59 220 248
6518 248 -94 -126 383 -38 285 142 36 -88 -603 1 -100 51 -91 -192 325 -98 -80 136 84 60 -63
6539 -63 -99 -198 -319 -6 -356 -53 -187 -59 128 197 -58 3 131 3 17 38 151 32 25 18 299 3 21 -196
6563 -196 137 297 42 53 89 145 -345 89 1 -276 -71 31 -59 -157 137 -127 -255 -14 28 84 71 5 75 -21
6587 -21 30 34 170 216 -121 -65 -328 109 231 137 312 -12 34 215 -202 85 -94 37 -31 -202 18 -181 -180 50
6611 50 78 547 -175 -40 17 -152 77 77 -129 -594 -245 198 -256 -294 105 -136 -15 148 -78 -90 -81 64 143
6634 143 15 -97 -12 198 239 -182 -14 397 60 -188 -345 -145 -117 126 -362 20 -6 64 188 -45 115 -115
6656 -115 -13 147 -71 183 170 -78 9 384 -119 -214 55 55 265 6 25 -54 -242 -75 246 203 -282 67 424
6679 424 -60 -84 295 159 69 -36 -201 -30 -150 -101 92 112 -66 -95 -20 -39 -87 211 158 -32 49 260 77
6702 77 224 -108 123 -47 -9 -149 8 160 -307 56 -14 19 148 -171 94 112 -102 61 -4 -148 -17 242
6724 242 65 27 107 -337 50 -213 -12 -67 -52 -116 65 101 -140 -28 17 -58 -184 -247 154 -79 -103 -386 -83
6747 -83 -335 19 -92 6 104 -91 65 -305 256 -20 -94 -218 -83 65 -106 -108 79 -150 12 2 -71 34 102
6770 102 -2 -103 120 -258 182 113 382 -230 185 154 267 220 161 -215 9 -226 22 -48 113 130 -56 -174
6792 -174 -145 78 47 39 -54 -16 -143 -60 128 -57 -276 340 127 370 134 249 -62 -91 -335 5 -177 438 -340
6815 -340 -85 -214 -145 11 115 -78 -164 -97 8 -50 178 449 217 -5 426 -59 -144 -2 -91 -54 52 -27 4
6838 4 142 130 137 -64 -69 -349 -243 -67 85 -200 -63 -188 199 -77 -57 -182 243 98 -114 -85 21 52 167
6861 167 18 22 -108 -105 -428 -234 54 -186 -94 -84 -253 14 29 -77 57 31 60 -162 -32 -130 0 -148 50
6884 50 -172 -192 127 -92 100 199 -74 -112 236 -37 -155 221 -93 -68 -205 74 240 58 4 -15 -319 8
6906 8 -220 636 -137 27 -369 -7 -61 -269 -205 -84 10 -233 -6 -210 -160 110 305 -84 -125 -130 161 -158 -58
6929 -58 5 -89 293 -30 94 -158 -33 156 -91 124 -231 24 88 42 -241 309 37 76 129 61 -68 200 -189
6952 -189 301 -141 -162 -140 331 -14 76 -152 -465 140 -127 75 157 -283 -289 -153 -120 -181 42 166 -168 240 47
6975 47 -236 -18 155 -110 -213 195 -2 54 -172 -48 -35 -272 350 175 86 129 262 -266 -18 -188 304 -34
6997 -34 8 120 303 -55 10 103 2 -49 134 -409 162 156 -167 -123 -58 104 261 190 -149 108 -130 -260 -232 100
7021 100 198 13 192 170 184 77 -227 182 -205 -229 39 -129 74 236 79 -116 -62 24 25 24 120 -215 -103 107
7045 107 -28 -191 -132 -94 -11 -173 164 49 53 368 33 23 -209 -57 -195 -34 -146 172 -102 -52 -6 107 -27
7068 -27 36 -61 140 42 27 -219 47 -180 -75 -497 -124 375 -9 -33 -40 -607 -337 36 -304 90 30 -37 24 -85
7092 -85 -183 98 -182 98 85 169 132 44 154 197 215 -35 140 -389 -117 -24 129 -99 141 77 -67 272 294 -261
7116 -261 61 -110 -43 200 105 51 -284 -54 -346 -41 109 -83 -364 -43 -174 79 -251 -141 -124 68 82 -269
7138 -269 -81 -18 302 57 -70 28 -127 267 -49 71 90 120 -35 93 144 23 -61 -3 -29 196 -65 55 63
7161 63 -137 -46 2 131 -46 -257 94 185 8 -146 -235 -92 -159 -17 -133 -61 145 164 -63 117 -87 -29 -37 387
7185 387 75 164 -271 -63 281 154 -17 14 -199 255 -77 -206 66 -81 119 -148 202 -36 -216 -337 3
7206 3 -5 -95 202 -11 -140 -270 -18 61 25 89 -176 -6 147 -166 -91 -80 127 91 -152 -260 -204 -92 82 68
7230 68 -24 43 -180 175 -103 247 168 -64 -46 171 230 -305 -259 -39 252 -138 -160 25 -16 -303 -55 160 -136
7253 -136 58 -17 134 287 -176 -69 -190 -54 -321 -220 -119 295 80 101 -115 -273 -150 -91 -165 -42 173
7274 173 -54 171 3 60 110 -149 65 -111 177 -219 116 332 -10 0 -1 -151 -119 -6 222 50 97 2 64
7297 64 271 42 136 -108 215 168 85 -103 227 -151 -223 -143 -91 -301 0 80 247 379 -270 -26 -161 -111 46
7320 46 430 -12 169 -34 -49 235 101 -63 -33 -32 -354 261 -8 -59 -148 -229 -167 4 -338 -139 186 33 -354
7343 -354 -227 176 -53 -169 -101 1 30 39 318 -89 -57 170 19 -159 -200 299 -44 -302 70 4 211 -63
7365 -63 86 -248 -19 -63 -210 88 135 60 54 -105 -22 -95 -151 -20 142 114 -45 -117 -105 -405 -212 96 -41 47
7389 47 -44 204 215 -65 93 7 77 -16 54 302 -495 -144 111 18 58 -106 201 -242 -170 -87 -94 13 -250 175
7413 175 -101 -153 193 223 44 -58 -120 42 12 -561 -42 346 -234 181 31 -314 -52 -58 -158 137 -34 44
7435 44 176 225 -171 35 30 -322 293 40 341 -99 21 53 -28 -59 -99 -90 -90 0 -57 -244 -49 131 72 445 -335
7460 -335 -237 16 20 -108 237 -187 -85 -158 -125 145 70 -238 50 -27 -21 315 -61 -51 -128 210 148 201 39 318
7484 318 26 -68 -26 -16 -82 124 -82 400 -94 -348 76 -172 -185 198 110 -7 18 -133 62 -160 -31 -77 117
7507 117 374 -287 -143 75 36 -165 71 -130 -399 10 182 52 -63 3 -14 -172 -153 -60 50 87 209 215 28
7530 28 208 -253 49 49 1 -389 -223 -155 176 -77 -64 -193 -58 169 66 104 -173 218 17 18 -32 173 -24
7553 -24 35 -104 222 89 -192 178 55 174 342 18 -190 32 -213 -53 182 150 120 297 278 107 53 83
7575 83 116 -92 -69 -175 -344 -239 86 43 300 2 409 -186 234 -27 -48 -114 118 -36 80 -8 -194 -149 228
7598 228 405 29 120 62 34 81 -127 62 46 56 -25 -270 -77 336 -310 144 315 -408 2 -26 -143 -102 -39
7621 -39 -159 -241 15 -224 -46 -186 269 34 50 89 -168 34 -223 -173 132 -60 77 -71 130 -214 153 -94
7643 -94 -118 9 85 82 -50 -374 -136 198 175 -170 -86 -163 -101 76 144 -32 -53 -139 -4 -68 20 24 18 -178 39 58
7669 58 82 -17 -14 141 -7 98 -211 114 53 -102 32 118 77 -133 -82 113 -180 359 2 -94 91 -190 -184 -287
7693 -287 -67 138 15 134 141 -171 -73 -51 -17 146 -92 -240 -58 -7 1 -411 -81 130 329 49 100 -113 161
7716 161 -23 -139 114 35 -16 116 -28 -269 -226 -63 177 -24 42 -196 -58 63 21 74 147 -118 -51 -60 -123 189
7740 189 311 -385 -71 -78 -88 -3 -21 122 -48 29 -3 12 118 -151 -71 -71 -234 -76 188 -53 57 12 -274 13
7764 13 169 163 6 63 -115 -25 -26 81 -541 -97 275 -105 -50 5 -1 171 -156 223 -110 -18 -136 16 188 74
7788 74 68 -1 16 -248 17 50 -184 61 -173 37 -123 42 92 -320 -51 -39 60 -10 -332 -53 -53 -80 -64 -184 219
7813 219 -224 39 -157 -70 15 26 121 172 -59 -91 -23 -11 -121 -173 -142 7 -428 113 -22 191 196 71 -305 154
7837 154 -258 -201 123 3 -223 -118 5 13 -218 -194 -34 87 -133 -45 173 320 52 -242 120 45 -47 -178
7859 -178 -108 136 -173 -87 -137 138 16 -173 -47 209 21 36 -214 -101 114 -20 -115 167 89 104 -273 13
7881 13 25 -39 -253 -221 56 124 -38 248 186 446 0 -132 -59 -147 144 216 89 68 30 250 -41 -46 62 44 85
7906 85 -183 -26 -66 -6 -14 -91 -107 268 302 213 -229 -228 -135 205 -145 114 77 -31 -127 267 -22 221 -147 165 -41
7931 -41 -88 199 10 223 382 -14 -41 243 116 69 139 188 -274 123 -19 -157 272 157 -366 -133 5 253
7953 253 -256 -39 307 -175 -64 196 62 79 56 6 93 40 -71 34 84 -231 -221 -60 -241 -89 -270 -191 28
7976 28 -83 -89 38 -345 -83 179 -265 108 -147 -83 354 -45 -235 -143 61 230 245 365 132 -28 -118 -314
7998 -314 45 -240 83 30 164 -229 -216 106 128 -60 -204 183 -64 -96 -301 258 -210 -315 22 -124 29
8019 29 -259 -4 -288 28 -201 -181 -386 -146 -23 -6 -171 151 137 -291 -30 -55 -146 358 -110 -125 117 62 44
8042 44 19 139 -45 128 182 -139 -158 -44 9 22 169 -205 -109 318 -163 35 -188 11 -165 -8 -119 -176 132
8065 132 180 20 -128 -7 3 174 -68 -306 151 9 -264 -162 134 -100 61 -109 -216 -22 -185 234 -340
8086 -340 -45 -48 -125 -52 -99 -50 -223 -20 -83 -183 27 -243 264 108 26 -97 -61 316 -146 169 -64 -245 -9
8109 -9 -101 97 -247 69 17 23 183 5 -4 -32 -20 -66 6 150 -239 32 -432 45 156 -97 127 24 -15 13 26
8134 26 97 147 -89 -51 -271 50 -167 189 -203 -286 267 49 -106 -5 -7 67 -157 -68 -407 145 -75 138 28
8157 28 270 256 142 -190 38 43 224 -40 140 -26 288 209 -506 152 121 316 -154 37 25 263 36 -95
8179 -95 216 -234 -12 -135 -68 -305 -93 66 103 19 -7 -2
8191b
$$ Imaginary data points
##PAGE= N=2
##DATA TABLE= (X++(I..I)), XYDATA
0 0 0 0 0 0 0 0 0 0 -8 8 -8 8 -16 16 -21 24 -32 32 -40 48 -56 64 -77 88 -102 115 -133 151 -171 193 -218
31 -218 243 -274 306 -343 382 -423 471 -521 578 -641 711 -785 871 -964 1070 -1189 1323 -1478
49 -1478 1661 -1871 2126 -2439 2833 -3346 4046 -5063 6690 -9710 17268 -80805 -80200 45591
63 45591 -19359 -57564 -26039 -1343 -57482 -56004 -10254 -5543 -44371 -36224 -29141 -47679 -35135
76 -35135 25588 23474 -37253 -51624 -13426 -18462 -37590 -4333 29242 -9505 -45054 -16386 13307
89 13307 -9488 -23660 -4080 121 -15195 -6762 9715 5047 3213 12533 -4202 -31828 -15077
102 -15077 23314 13636 -15926 746 34168 23085 -3172 57 7602 -4071 -5030 12897 16246
115 16246 9446 18777 24510 7320 1687 23409 26371 -2625 -11030 12411 23557 15617 23221 36062
129 36062 18911 -7898 -2664 19974 24967 17958 17762 15252 9338 13027 24012 23746 16896 12482
143 12482 6479 -920 9411 33550 40350 21146 3597 3446 8126 10773 15975 21725 17868 10157
157 10157 9452 15766 23007 24732 16868 3503 -4670 1125 13735 22317 23351 18580 10860 5183 5296
172 5296 9825 13526 11846 4675 1508 6748 16112 18205 12659 6682 2521 -1700 -1557 6638 13879
187 13879 11731 5300 3407 4381 5650 5826 2843 -2797 -4231 1414 7208 7783 6765 5986 13 -7287
203 -7287 -6015 1364 3012 -1798 -3594 -917 1995 3332 4347 -258 -8189 -11797 -9213 -4637 781
218 781 4866 1729 -6980 -10644 -5109 -1027 -3465 -7595 -8244 -10196 -10096 -2847 4727 2107 -6532 -13094
234 -13094 -15483 -13726 -6079 1265 -1303 -9200 -10943 -7735 -7141 -6394 -3887 -6684 -15535 -18202 -9188
249 -9188 -51 169 -2875 -7621 -13543 -17519 -12080 -5045 -4387 -7463 -8644 -9434 -9888 -6036 -939 -5048
265 -5048 -14075 -16769 -11492 -7275 -5093 -1195 -1678 -8065 -13172 -10738 -6954 -6673 -7667 -8153 -9011 -8037 -3176
282 -3176 -271 -3437 -8252 -10135 -10167 -9176 -5584 -748 -1113 -5277 -6278 -4133 -2481 -3668 -5006 -7397
298 -7397 -8090 -5402 -627 2674 2301 -802 -4736 -7335 -5874 -380 2074 -428 -2600 -1859 675 2576
314 2576 4085 2948 -1345 -5466 -4971 277 5952 8486 6587 1484 -1701 -283 3485 5332 4453 2796
330 2796 1306 1281 4827 10297 11460 6551 785 -1317 1032 5702 9922 10792 8341 4799 3847 5384
346 5384 8053 8663 7084 3492 2084 5057 10347 13197 11440 7246 3966 2869 4032 7439 10139
361 10139 9816 6637 5520 6658 9509 9907 7445 4433 2824 3621 6637 10128 10956 8812 5350 3087
377 3087 3460 5627 6706 5684 3565 2884 5168 7309 7716 6248 3313 806 -1051 1537 5412 6879
393 6879 4921 2215 881 1656 2892 2589 1237 -930 -2476 -1561 2207 4684 4289 1256 -2439 -5202
409 -5202 -3807 -353 1073 40 -2011 -3331 -2564 -911 267 -430 -3420 -6934 -7520 -4742 -416 845
425 845 -583 -3627 -6659 -7131 -5276 -2862 -2334 -3951 -6195 -6592 -4568 -1805 -1087 -3439 -7382 -9106
441 -9106 -8237 -4665 -2325 -1411 -2648 -5388 -6647 -6505 -3948 -3084 -5246 -6824 -6749 -5033 -2522 -944 -1625
458 -1625 -4060 -6948 -7941 -6059 -3145 -2008 -2377 -3633 -4617 -3454 -2246 -1615 -2708 -5240 -5939 -4691
474 -4691 -2600 -216 776 -654 -3257 -4993 -3820 -1692 -643 -1592 -2287 -2330 -1766 79 1820 848 -1789
491 -1789 -3607 -3841 -1635 1009 2512 1866 -393 -1996 -1044 297 988 419 -531 -1929 -1339 930 3281
508 3281 4117 1699 -1033 -2683 -1573 837 2712 3020 1827 550 126 1258 2809 3245 1027 -1247
524 -1247 -1320 492 2860 4525 3907 2002 -187 -451 840 2003 3185 2542 1336 238 1659 3299
540 3299 4036 1948 343 -778 -445 1501 3979 4555 3309 1342 703 1219 1736 2787 2055 649 -104
557 -104 1370 3489 4254 3616 2109 43 -641 454 3021 3778 3190 1901 1454 1847 2709 3232 2420 1064
575 1064 -414 642 2442 4183 4176 3140 1114 -8 344 1781 3202 2506 2029 1004 1271 2254 3600
592 3600 2949 1375 -229 -753 371 2525 4052 3469 1345 211 -26 873 1699 2119 1061 -486 -268
609 -268 1067 3012 2721 1709 -158 -1667 -1593 291 2128 1522 640 -259 -140 -301 176 1068 -174 -2126
627 -2126 -2485 -1101 268 938 1026 -183 -2573 -3168 -2118 -47 -357 -1060 -1728 -2077 -2234 -1085 4 -1233
645 -1233 -2895 -3701 -3483 -2734 -1238 -262 -1259 -3052 -3899 -2892 -2364 -2200 -2370 -3209 -4098 -3067 -1768 -900
663 -900 -1358 -2665 -4096 -4790 -3910 -2487 -1298 -1887 -2693 -3212 -3626 -2645 -1539 -2212 -3558 -4041 -3620 -2482
681 -2482 -1136 -549 -1259 -3097 -4194 -3493 -2191 -1392 -1159 -1620 -2785 -2941 -1590 -60 -444 -1772 -2582
698 -2582 -3078 -2068 -386 1048 703 -621 -1535 -1235 -827 -77 721 400 -778 -900 259 1521 1996 1278
716 1278 338 -707 -794 711 1973 2494 1728 1220 597 956 2022 2798 1822 799 626 1175 2335 3168
734 3168 3689 2420 993 892 1573 2276 2645 3007 2361 1477 1774 3151 3097 2598 2089 1158 1004 1573 3618
753 3618 4139 2854 1893 1692 1598 1873 2595 2885 1462 1101 1534 2549 2626 2568 2050 1105 -120 549 1988
772 1988 2695 2356 1295 1268 679 782 1448 1822 360 -131 12 770 1678 1914 1710 358 -662 -533 -108
791 -108 623 826 376 -96 -476 174 671 648 -351 -1185 -1687 -1181 -208 926 764 -253 -830 -1370 -1145 -376
811 -376 46 -578 -1270 -1329 -283 31 185 -287 -675 -2190 -2208 -945 154 163 -137 -541 -1326 -1494 -665 -176
831 -176 -561 -1478 -1698 -863 -646 63 397 112 -1590 -1711 -1282 -300 34 89 -677 -885 -966 -52 155 -141 -1161
852 -1161 -1203 -1424 -654 493 514 0 -696 -1216 -1105 -358 -145 -117 -332 -911 -1013 -420 92 145 -440 -891 -1511
873 -1511 -883 -318 211 146 -328 -375 -1041 -502 -211 157 -349 -1006 -1235 -357 -232 344 89 -953 -1621 -1161
893 -1161 -971 -131 -235 25 -1009 -1072 -678 -333 133 -624 -1429 -1298 -1457 -394 64 367 -571 -1275 -1343 -1422
913 -1422 -693 -243 -367 -927 -1001 -892 -145 360 -298 -401 -1265 -1380 -728 22 354 30 -326 -660 -767 -250
933 -250 30 128 -199 -782 -306 -66 716 1059 386 -456 -742 -171 530 1072 974 791 237 269 554 914 890 843
955 843 482 324 866 1584 1983 1266 750 343 281 1414 1330 1801 1568 965 871 1285 1669 2036 1700 947 867
976 867 1066 1550 1861 1998 1845 1016 986 1483 1922 1794 1150 953 763 1389 1616 2009 1574 1032 687 901 950
997 950 1448 1263 1231 853 741 718 844 996 1042 444 -49 202 468 1120 873 718 -214 -43 -229 -179 191 393
1019 393 88 -316 -263 -68 415 255 -487 -865 -1213 -844 -272 -9 -198 -997 -1091 -993 -531 -475 -815 -1224 -1396
1040 -1396 -1679 -829 -628 -667 -896 -1357 -1742 -1843 -912 -793 -1134 -1248 -1507 -1969 -1299 -616 -1190 -1500 -1905 -1667
1060 -1667 -1408 -931 -565 -613 -1065 -1547 -1442 -1290 -818 -424 -861 -819 -1139 -879 -554 -330 -561 -1162 -1179 -1103 -815
1081 -815 -200 -415 -404 -1035 -1161 -426 -286 -273 -77 -454 -495 -183 354 374 467 -256 -191 -331 -56 242 270 685
1103 685 78 152 51 395 719 389 355 112 90 557 1213 1263 524 287 198 333 374 954 986 468 429 421 821
1126 821 776 648 421 295 368 297 706 1047 881 180 326 216 269 718 612 476 206 285 323 495 450 609
1148 609 -112 -114 103 459 529 601 168 255 -35 -76 29 128 -301 -53 -57 -410 223 696 247 109 -388 -430 132
1171 132 -178 209 209 -343 -247 63 141 -55 -37 -347 -348 -345 -367 160 260 111 -71 -417 -230 -113 173 116 -153 167
1195 167 -18 2 190 441 65 -214 -147 -81 591 175 504 -64 49 137 67 413 425 294 -134 224 365 805
1217 805 599 505 433 -142 169 317 288 458 578 544 72 333 662 610 224 -58 -16 281 616 699 696 487 -81
1240 -81 -43 131 295 157 418 155 45 127 239 123 271 -184 -363 -487 14 512 442 291 46 -220 -242 27
1262 27 -172 -162 -133 -542 -364 -631 -302 -3 -697 -443 -759 -750 -458 -457 -525 -353 -700 -700 -624 -542 -472 -845 -915 -864 -862 -288
1288 -288 -413 -829 -755 -1176 -803 -908 -924 -210 -858 -902 -684 -916 -513 -712 -607 -1049 -1062 -684 -671 -544 -679 -395
1310 -395 -852 -842 -896 -428 -371 -263 -479 -529 -630 87 -50 -273 -478 -298 -78 -248 266 335 93 -188 250 68
1332 68 449 209 299 -173 -135 27 669 591 868 231 341 461 180 833 937 249 437 387 407 608 908 793
1354 793 463 368 508 767 786 890 855 549 600 760 1032 557 516 536 544 389 564 872 654 753 539 261 611
1377 611 662 785 574 405 444 301 815 795 998 351 303 234 -24 294 604 497 -170 -214 247 -80 661 235
1399 235 125 262 -83 -65 164 -139 -203 -422 -430 -335 -24 108 13 -4 -479 -475 -348 -8 -333 -294 -472 -583 -187
1422 -187 -288 -297 -110 -775 -719 -649 -391 -282 -274 -468 -566 -391 -836 -294 -269 -518 -638 -585 -201 -534 -359 -219 -541
1445 -541 -659 -662 -111 -410 -138 47 -264 -70 -400 -10 -71 -37 -363 -306 -450 -75 267 -20 144 -237 -165 -417
1467 -417 98 109 176 269 -2 13 119 405 209 -148 219 -34 205 370 309 184 220 425 328 299 235 389 433
1490 433 -84 106 355 385 366 536 -14 204 280 102 11 557 269 70 -83 215 493 195 147 9 -31 22
1512 22 84 98 118 83 -125 -306 1 -204 304 -438 -113 -444 -355 162 -136 -149 -305 -270 -233 -41 -186 -119 -208 -399
1536 -399 -616 -453 -559 -60 -377 -266 -89 -251 -424 -32 -182 -256 -300 -462 -228 -401 -295 -318 -156 15 -516
1557 -516 -144 96 9 -47 -261 -370 -245 23 -97 52 -336 -95 3 249 -57 97 -26 529 -19 90 127
1578 127 293 373 -94 299 -27 388 468 653 473 175 410 246 517 311 338 326 295 94 498 281 584 484
1600 484 302 880 257 423 535 752 358 494 273 451 181 570 481 266 232 59 411 387 504 652 383
1621 383 434 142 381 225 326 256 3 183 364 493 139 -54 -101 -282 178 218 306 225 86 -229 -18 153
1643 153 32 -292 -383 -319 -90 93 -349 123 -673 -208 -367 -667 -360 -90 -165 -264 -361 -392 -157 -386 -330 -345 -749
1666 -749 -462 -519 -389 -695 -640 -465 -360 -675 -236 -457 -441 -444 -474 -507 -485 -707 -465 -471 -502 -895 -435 -301 -329 -218
1690 -218 -633 -260 -432 -377 -295 -292 -114 -322 -280 115 -159 70 -47 -69 -357 22 277 -64 -8 -35 -19 453 366
1713 366 78 -14 -59 139 211 272 492 533 88 187 130 179 351 338 462 736 173 439 336 465 445 597 -34
1736 -34 264 212 88 179 496 517 396 246 550 552 376 211 159 257 236 428 275 107 123 -79 322 393 511 159
1760 159 484 -69 209 54 442 73 -32 -172 -324 119 -126 -198 -77 -263 67 52 -374 -187 -37 209 -151
1781 -151 -355 -90 -351 16 -195 -44 -77 -72 -334 -438 -53 -196 166 -595 -273 -42 -431 -356 -247 -98 -355
1802 -355 -155 -294 -101 121 -258 -454 -48 -10 -434 -11 -93 -363 66 -186 -397 -60 -4 -196 -87 129 104
1823 104 28 228 -141 -124 421 169 10 307 132 256 0 121 255 324 233 -134 216 199 198 236 295 582 22
1846 22 216 -22 573 400 107 558 -177 71 242 219 253 -115 350 225 -202 329 196 330 255 98 55 172
1868 172 -161 71 422 122 306 220 489 111 201 305 -73 62 187 159 -345 104 80 -60 89 -150 118
1889 118 39 -171 -15 -227 91 -17 -82 -161 -196 107 -222 -255 -446 -184 -337 -567 -142 -391 -294 -135 -290 -419
1911 -419 -325 -195 -34 -130 -313 -472 -327 -96 -359 -330 -148 -639 -59 -299 -78 -181 -276 -33 -285 -369 -391 -519
1933 -519 -516 -268 -333 -379 -88 109 54 -2 -274 -101 -216 29 -151 -20 -50 267 -90 -10 131 -235 271 -24 -182
1956 -182 18 26 200 -228 83 -43 276 464 -47 -272 108 397 188 487 306 315 67 348 325 171 222 586
1978 586 128 540 425 312 198 371 193 379 357 315 334 568 563 538 617 264 423 199 424 338 74 97 2
2001 2 -77 287 391 209 476 342 266 171 395 147 319 -239 -251 71 73 99 84 54 29 -107 41 -154 -181 -82 -194
2026 -194 -28 -95 -23 -83 -295 -115 -269 -237 109 -187 -405 -152 -144 -468 7 -186 -390 -340 -515 -366 -136 -356
2048 -356 -295 -170 -92 30 -222 -366 -282 -27 -145 -424 -70 18 -164 -89 -351 -489 -278 -150 -142 70 -445 -136
2070 -136 169 -16 78 -239 163 -212 -5 -135 -35 -192 122 29 -190 85 15 65 189 -46 164 -91 -50 -42
2092 -42 38 -8 -55 324 148 464 77 548 420 3 335 28 158 130 432 225 27 -130 31 293 429 123
2114 123 51 104 229 458 180 135 359 -11 -78 -18 28 3 -247 520 -240 112 180 275 -195 109 -115 266 -118
2137 -118 -274 -10 -229 -5 -87 101 -268 4 -234 8 -220 -177 -365 -290 -224 -66 -190 -148 -4 -261 -419 -13
2159 -13 -216 -215 -269 -167 -28 -212 -190 -254 -262 -282 -34 -181 -240 -293 -390 -181 -125 -26 -333 95 -11 -127 -85 -244 -267
2184 -267 -159 -209 137 -140 -298 146 -434 -179 -237 -140 -180 102 -134 -213 -119 220 58 -76 35 338 74 15
2206 15 91 14 141 -179 200 103 187 -13 173 491 -6 66 228 228 198 259 437 242 272 395 71 153 326 322 73
2231 73 383 436 -65 211 -35 79 103 205 137 92 107 98 256 252 291 138 0 128 103 209 329 79 16 -156
2255 -156 160 -92 -44 -104 -276 108 -19 -135 -105 -163 67 -70 -228 141 -259 -6 149 123 -5 -13 -313 -225 -93
2278 -93 -358 196 -127 -264 -64 -354 -354 -398 -134 111 64 -124 -158 -404 -86 -329 -280 -108 -128 -417 -234 -23 -287
2301 -287 281 -118 -404 -133 -544 100 -49 -415 -253 -175 -196 -156 4 -169 5 -251 -161 -14 -253 -190 -70 -243
2323 -243 84 116 -62 -167 297 -79 -78 216 -276 147 152 -258 121 -138 260 115 182 56 185 101 23 215 13
2346 13 296 343 222 112 309 290 57 113 273 -98 513 272 260 47 141 162 -163 286 136 258 -103 242
2368 242 264 64 103 150 30 220 307 421 227 -86 129 174 -121 -319 48 12 -72 297 -203 34 -22 -261 60
2391 60 32 115 -201 -26 35 -6 -120 -130 -291 -279 -100 126 -282 -53 34 5 148 -41 -255 -235 -193 -74 -3 76
2415 76 -84 94 -312 -64 -86 -292 -425 -90 178 -163 13 -168 16 -102 -300 -169 -65 -373 78 -108 -274
2436 -274 -151 -379 170 105 -20 46 127 234 -210 135 -28 -47 -32 185 213 -167 -133 -154 240 329 190 322 32
2459 32 114 198 -98 -45 295 251 181 219 342 97 -107 175 182 145 362 -110 340 287 -266 260 104 343 -145 136
2483 136 3 133 71 252 141 337 198 11 -9 -115 -146 77 33 158 403 -22 253 195 253 -127 -139 242
2505 242 -179 219 254 13 72 -165 50 18 14 -11 -111 134 -72 -49 -250 -311 -287 167 -270 -48 -272 -152 2
2528 2 -24 -13 -577 -213 57 14 45 -453 -333 -200 -226 -402 -210 2 -274 145 221 -374 -312 -232 -276 -74 -268 -41
2552 -41 -366 -457 -207 -89 -299 59 -201 -153 270 -86 -222 -177 -116 81 57 126 -220 -115 -240 160 -84 117
2574 117 -152 44 108 208 4 384 175 -78 328 141 425 107 235 56 10 227 255 165 -35 -26 42 175
2596 175 313 90 31 270 310 186 281 203 342 528 103 229 222 157 455 248 -62 102 352 226 488 214
2618 214 142 120 -21 1 274 247 -149 46 141 -330 -28 9 -165 315 14 -305 91 252 -173 179 23 143
2640 143 47 -191 -115 -332 -386 100 11 168 302 -244 -320 210 46 -116 -244 -137 -12 -587 12 -66 91 195
2662 195 -383 -143 137 -31 -85 -125 50 233 -400 -113 316 -398 -318 6 67 -115 -413 -130 -286 -87 -188
2683 -188 -153 -187 250 94 -181 176 -261 -252 42 -125 -240 83 -68 -8 24 -119 200 66 -51 88 -165 69
2705 69 162 68 124 24 -153 210 35 172 264 -22 -80 31 -35 -25 -80 235 228 200 -62 373 98 4 41 -115 98
2730 98 243 177 82 139 100 349 96 -50 -106 -30 -101 103 50 253 174 111 411 108 49 171 -133 45 85 213
2754 213 32 50 245 222 -181 26 -141 10 198 212 114 215 -192 19 -96 308 -293 31 -312 -339 164 -13
2776 -13 -140 -238 -43 139 -317 -134 -63 -138 -120 -166 -509 -163 -186 -67 -258 -435 -33 -210 78 -132 -114 -176 106
2799 106 -68 -79 -309 104 20 -203 -87 -61 105 -160 -39 118 66 -155 80 30 -55 -200 -116 47 125 -172 253
2822 253 70 -370 -281 -87 -102 94 43 183 183 -18 72 -63 -42 96 -135 43 94 106 7 426 -7 185 32
2845 32 130 -5 179 73 -28 157 260 -205 -12 148 38 503 265 306 -349 124 281 -26 -42 171 -98
2866 -98 -63 -157 -125 -29 26 194 16 153 -391 113 155 12 -125 266 -7 137 140 -251 -131 186 -100 141 81
2889 81 -8 -185 39 -72 -213 211 -296 -148 -226 21 -12 23 74 -289 34 -126 -114 -170 53 41 10 -25 -346 -64
2913 -64 -49 -92 -495 23 -20 -273 -173 -115 -141 -26 158 27 -122 -64 33 -80 -427 27 97 -115 29 -13 98
2936 98 -405 16 79 -283 -134 -73 -165 180 -350 -207 -450 -180 -77 -134 192 125 -177 -184 -95 217 -20 5 267
2959 267 -126 134 -273 14 206 -12 20 321 207 263 -112 7 157 -111 -88 159 101 89 208 43 237 247
2981 247 165 -130 -64 259 120 -48 339 478 263 246 -143 118 25 122 74 -294 -140 1 -392 -153 21 -1
3003 -1 -269 -213 -21 330 498 -255 125 -68 76 117 143 287 -15 -296 -116 -315 174 -82 -137 -86 12 -40 45
3026 45 -249 -180 -8 -124 -232 -32 70 70 -170 -56 -88 -125 -308 -44 -183 139 -248 -79 -85 -175 -153 132 20
3049 20 -319 3 -78 -8 -37 -98 -196 39 -251 -78 143 134 9 221 -33 -52 -21 182 -71 196 7 206 -80
3072 -80 38 52 132 27 -192 96 78 310 -104 -162 331 201 177 85 105 412 90 67 -229 -145 -24 58 225 -66
3096 -66 -14 -39 246 -194 366 487 22 141 197 269 55 208 155 34 -74 248 24 128 -186 -174 -360 -28
3118 -28 120 -3 159 -142 259 216 91 88 -34 207 134 -236 -10 117 -80 120 -59 137 -82 60 97 -181
3140 -181 -183 -70 -210 -130 -29 -31 -72 -297 -406 -47 134 -27 -246 95 91 -195 176 30 -227 -209 -57 -346 62
3163 62 226 112 -128 313 -205 -87 -97 32 -393 -28 -13 -178 -8 140 11 -131 23 -65 127 83 153 242
3185 242 207 -82 -23 -62 65 -164 -93 127 -281 90 223 56 103 17 110 186 -350 -38 27 103 83 4 -449 -7
3209 -7 21 344 238 85 -175 8 201 150 -256 -72 63 486 61 139 -42 171 380 70 160 28 -62 330
3231 330 235 394 -32 -45 -11 159 65 -103 9 200 74 -21 161 343 79 -60 494 -177 -7 156 21 -47
3253 -47 65 125 94 146 7 -296 38 149 -117 26 -275 321 -338 -367 -92 201 17 54 131 89 231 112 -273
3276 -273 -83 -46 -3 -50 42 -154 46 -141 88 -158 -143 -95 169 -444 -61 -349 -333 -113 -184 -148 -160 -302 133
3299 133 -30 -144 312 -260 -106 -281 2 22 266 -201 -59 264 -124 125 -224 85 -23 63 -80 80 -108
3320 -108 -9 -202 -53 -137 -28 288 33 -5 37 -219 -53 -26 -153 256 -47 143 -235 190 -56 30 -122 192
3342 192 89 -98 348 141 127 111 230 308 71 -127 -218 -166 101 -194 65 35 -197 88 277 62 125 28 -154
3365 -154 -32 67 187 33 146 47 111 57 167 2 -122 60 143 124 300 142 -119 272 148 248 -460 -13
3387 -13 -30 -50 -39 -201 -361 -283 -223 174 -81 -231 117 -10 -47 -203 -100 91 -65 65 -250 -65 -124 -2 -167
3410 -167 -241 -116 -116 -271 248 399 -44 -279 -43 156 91 127 -140 -205 -22 -251 4 35 -28 113 45 33 -488
3433 -488 -271 -151 83 -84 -400 -242 -347 84 300 126 88 -34 382 51 56 70 -106 -50 290 185 65 203
3455 203 0 218 108 36 191 257 232 219 44 -48 -62 -119 123 -135 178 -78 -136 -301 123 62 248 48 162
3478 162 301 51 118 56 14 234 -86 101 -197 -132 0 -226 282 149 77 -99 33 -116 -225 171 420 -104
3500 -104 63 -82 224 44 -63 -183 42 2 56 -529 -21 123 -115 -107 176 -104 -136 76 -34 86 -159 -202
3522 -202 485 -48 -7 25 -95 -39 95 32 -85 245 82 -321 -185 81 -22 -166 -44 121 -168 -35 139
3543 139 5 -237 -228 11 80 122 172 -40 57 140 -12 54 136 355 -84 4 -185 17 75 -374 105 -129 -149 47
3567 47 -69 12 -255 -323 -145 416 -158 103 -232 5 -34 -144 331 102 299 245 -187 15 261 158 19 -141
3589 -141 -39 118 -212 -127 -31 -10 -74 -54 -151 8 -143 -126 -77 159 297 -226 -39 113 70 14 -63 -373 -105 -80
3613 -80 31 -141 -11 94 -171 -51 12 63 -109 -127 111 -169 62 -213 -89 255 436 -100 109 42 56 -131
3635 -131 -52 77 258 225 -186 -100 84 12 62 -40 -3 -98 -95 -195 233 66 -62 -163 197 254 -60 -322 -300 195
3659 195 -48 -28 -358 -74 -66 240 6 -140 -234 266 -279 111 -3 -319 -274 209 -232 84 130 -83 -30 -217
3681 -217 86 -315 53 292 153 201 17 182 97 89 57 196 279 131 -143 -52 55 121 -21 63 14 -316 -47
3704 -47 -194 48 -228 28 296 148 -2 -66 105 22 -126 -43 129 228 158 34 -30 -65 166 181 -99 138 259
3727 259 -12 216 72 451 41 165 -262 393 50 239 77 -193 248 -64 -115 -68 78 -22 55 291 -325
3748 -325 -47 188 -71 185 -195 89 35 -75 -291 -263 -56 -33 148 -340 20 -276 -155 -117 -413 -217 32
3769 32 -165 -9 -86 84 -196 -97 -260 -186 -166 -48 -137 74 126 -177 -27 -28 -282 -131 -206 -176 -6 93 198 -161
3793 -161 -32 -105 -250 -123 70 40 -89 -80 101 -258 -102 -154 -354 102 29 -230 -127 -56 -210 223 177 -78 -232
3816 -232 -59 -258 84 87 -6 9 -28 -21 160 91 -106 -261 -29 -76 201 22 99 -74 124 55 -258 117 -60 69
3840 69 -28 134 19 7 -56 5 326 -135 79 135 262 -102 8 -23 140 119 -15 53 64 17 -116 29 -108 -138
3864 -138 154 192 72 -109 -111 178 -27 -38 16 299 170 34 -59 183 -45 43 -54 -50 -74 -84 313 197 -208 439
3888 439 -348 -176 -98 -43 145 -47 -157 -262 351 -55 -33 53 -143 -115 -29 -205 -44 -14 78 -198 -14 210 -312
3911 -312 95 -106 122 -128 -175 -16 34 -291 223 -16 9 45 -72 -82 -3 6 -101 -24 -119 -94 -128 -5 53 -121
3935 -121 -35 138 -7 134 103 -57 73 -4 43 53 -52 -12 -65 9 -78 -173 -242 -161 -265 46 -178 236 119 -27
3959 -27 -49 60 6 -23 149 -49 33 104 110 45 -214 161 93 88 1 78 -205 141 -165 -10 -269 311 -178 81 -5
3984 -5 -9 -167 279 -280 169 -129 -100 234 -137 149 -2 -293 -33 163 -237 124 -132 9 -70 -22 -239 -140 72
4007 72 34 71 170 38 126 2 -94 -199 -187 218 68 -548 -14 78 -237 -181 88 74 -116 -281 31 1 26 52
4031 52 -101 -197 15 -83 62 42 91 68 14 274 34 -359 4 -328 17 -225 179 94 2 -26 -111 -304 -54 124
4055 124 -131 -274 9 64 135 323 75 51 -98 66 19 -99 -65 -64 -409 269 -378 466 62 -182 80 166 -80
4078 -80 -4 -144 356 235 -153 144 -38 280 445 10 61 -237 37 -36 52 374 110 287 338 130 -264 -78
4100 -78 3 134 -387 69 95 -106 -200 -202 111 -30 -171 -225 34 238 27 -247 123 -134 -2 68 146 168 -156
4123 -156 -100 418 395 -230 -291 255 -11 -58 -176 -216 -88 -365 95 -268 159 -220 -72 178 230 -155 265 -40
4145 -40 -34 53 372 24 -138 -114 -238 -54 15 96 2 37 56 173 -219 -194 -82 -170 -13 1 50 -158 -46 138 -76
4170 -76 -57 -108 -243 56 -138 -207 -118 -73 -550 -31 491 -237 -89 -95 -135 -104 -113 -137 464 -43 112 -72 10 -50 -139
4195 -139 92 133 49 36 63 -39 180 184 271 162 91 -40 -95 70 347 -299 272 36 104 -133 -234 41 84 130
4219 130 63 312 346 -28 -234 -118 341 114 -35 -46 10 102 -9 -239 248 110 -247 -45 104 -81 -143 -170
4241 -170 -123 -68 303 256 -31 42 267 148 -52 -9 392 35 104 -68 -257 -210 -146 121 161 48 0 -41 -24 42
4265 42 46 83 -314 73 86 -161 -79 70 30 -36 6 -91 24 58 -321 -100 33 -190 188 33 134 -256 -40 71
4289 71 -158 376 90 31 51 40 -42 122 33 99 82 182 181 -148 -311 50 -314 131 95 -215 -109 -63 142 126
4313 126 -21 76 205 380 167 4 282 180 -24 -172 105 368 13 -124 20 -87 5 -85 61 29 -62 -278
4335 -278 -42 66 127 38 180 212 60 -52 -76 -63 228 41 -31 211 -17 42 -113 -219 75 -129 10 22 184
4358 184 27 -212 -203 270 105 80 83 -44 220 272 -300 331 -8 -84 142 -229 255 71 -125 20 165 -128
4380 -128 -92 -7 227 194 51 -51 -169 -279 -44 150 -69 -126 -219 179 -58 -96 144 -91 -59 172 161 97 -363
4403 -363 130 -77 -63 60 173 -156 -74 -358 -85 69 143 -75 -14 -19 121 -216 -38 105 -172 -164 216 13 -103
4426 -103 189 -34 194 158 -140 -52 90 74 -106 -49 -46 -48 47 -115 -23 -235 -58 64 -69 -225 -33 -99 324 -52
4450 -52 -170 127 -171 249 225 372 -32 -42 48 228 119 112 125 455 69 -405 245 101 138 -24 -27 -318 36
4473 36 -539 -139 -103 -71 -341 -2 317 -140 -50 165 105 -196 -144 -152 106 -148 169 -169 -41 183 -49 30 -173
4496 -173 -310 98 22 -32 -242 119 -90 -92 91 183 64 -399 -120 -63 96 -282 -112 23 -239 -36 194 128
4518 128 -114 0 -170 134 -236 -130 -183 243 -55 264 -99 -191 -199 -123 -139 75 56 -13 -193 -43 49 25 158
4541 158 -106 -177 222 -225 -78 161 99 186 -228 151 257 -159 -183 -169 -135 -123 14 96 97 -18 -257 -209 16 127
4565 127 150 41 -181 -120 103 29 -45 -168 34 207 -226 97 33 -205 -374 -335 -142 -27 27 236 -38 233
4587 233 -72 117 -89 43 270 63 111 120 -179 -224 513 105 144 194 229 134 233 -171 107 187 120 -75 -107 -179
4611 -179 -197 136 29 -124 -229 -101 -32 -32 187 171 40 35 -34 101 -12 475 -84 -194 -140 -257 365 6 -74
4634 -74 93 225 -48 -16 134 -129 208 -80 -279 -326 -51 -14 138 217 118 -148 27 -24 256 25 60 163 33
4657 33 -182 -153 166 57 -322 31 -129 214 -317 -148 -101 131 152 114 -201 -217 276 13 169 -199 92 176
4679 176 14 -40 222 296 108 -272 116 -18 -204 144 191 -44 14 -229 -113 -159 -52 240 -110 193 -119 252
4701 252 -17 211 67 -19 -116 -292 -298 118 -19 -47 -188 336 12 -108 81 260 295 172 -362 80 51 141 -196
4724 -196 -78 -18 -221 81 -90 173 -134 -263 99 -118 83 64 -45 -68 -227 121 20 -109 127 103 280
4745 280 232 -50 -99 267 45 161 -8 -79 -21 -368 31 27 -210 -38 74 -33 -139 72 -122 -200 -225 -243 51
4768 51 -378 -258 29 -8 -56 226 -48 -157 35 31 119 -58 -255 -38 8 245 -161 48 -140 176 -1 152
4790 152 -267 -331 319 398 23 29 -233 -53 -98 494 -61 -53 52 -111 5 8 237 -169 -182 176 135 -384 -214 229
4814 229 -42 88 0 -10 58 217 -144 -242 52 161 218 -109 -96 184 253 -126 157 -159 -121 -286 -298 168 -243
4837 -243 -184 26 -99 244 184 -134 -53 -83 -57 -151 67 10 133 -267 -270 103 -125 -166 -41 -43 -166 -50 -260 -74
4861 -74 91 -153 80 170 -86 -123 64 99 -163 -48 247 -59 56 119 22 -205 40 193 0 -10 -21 -152 -49
4884 -49 -33 -156 117 -173 -53 -111 -96 230 -149 -134 -92 -58 53 128 3 219 124 -93 84 241 19 -46 139
4907 139 -129 26 44 312 11 -18 -50 51 209 -185 54 106 161 270 -69 74 134 257 192 -40 -94 -92 -123 -89
4931 -89 53 -294 218 325 329 -44 329 -107 -189 144 207 2 -19 70 -115 316 157 223 -105 -70 211 -9 34
4954 34 -260 426 125 192 -8 22 -28 4 45 -162 185 298 -41 -38 37 25 -148 67 236 -194 -134 318 -218 -391
4978 -391 -413 54 122 -218 -160 -128 -13 22 -18 -131 -172 42 299 -322 66 84 -283 111 -82 -190 -47 -109 -214
5001 -214 205 55 -147 114 61 -252 -111 0 239 -126 -55 288 93 77 20 11 -260 219 -55 -175 2 -58
5023 -58 -211 103 -6 119 -179 -12 -240 139 7 -59 105 -123 139 25 43 -2 37 -305 -158 29 375 -31
5045 -31 -50 14 4 -341 49 391 40 -255 -108 -170 486 -154 -16 14 59 -153 157 135 -163 26 124 16 -449
5068 -449 -206 -223 -47 357 85 -251 28 10 11 86 -117 -190 -89 291 -163 14 130 -110 20 -99 -43 -178
5090 -178 221 251 83 68 284 163 -98 105 250 -87 0 101 -159 105 248 -73 196 -54 -137 113 -72
5111 -72 185 -222 -115 2 180 7 154 -141 126 -131 110 -61 87 328 -117 -91 389 -65 125 -223 -128
5132 -128 -114 -134 -152 201 -85 -102 365 26 -15 -39 86 -33 23 128 -4 -40 8 114 -36 221 -376 75 -66
5155 -66 -178 143 -4 89 -153 123 37 271 -168 -41 201 168 193 385 100 -288 90 -141 130 66 -115 172
5177 172 -93 -10 -84 -247 6 -6 -83 3 -1 -25 0 248 330 186 242 123 -178 258 -235 149 52 198 -65 10
5201 10 -52 -337 -173 79 -75 -184 128 -20 223 304 -71 -86 21 -98 284 66 222 15 -12 -198 -34 -515
5223 -515 -350 152 298 30 84 220 252 76 217 24 57 185 -402 -199 -317 16 -399 -74 -171 -288 -216 -161
5245 -161 364 -241 122 152 35 -216 -36 88 40 -40 -35 34 278 119 -99 -234 -85 -109 30 37 13 261 -372
5268 -372 -77 -46 308 374 79 -53 30 204 25 -293 -114 -36 10 -41 -63 -146 159 -135 20 26 -257 112 -188
5291 -188 -71 10 -378 -206 -154 22 -87 -273 -273 188 213 -31 -97 -105 -434 69 292 156 110 85 -135 -157 -114 182
5315 182 -197 -38 34 95 115 -182 -311 -176 103 22 60 169 4 165 -12 86 130 87 -117 -364 -248 -97 -131
5338 -131 18 30 81 -107 -289 123 -14 123 6 -194 -145 -170 354 -110 -97 4 -55 -143 -252 229 -172 -132 318
5361 318 -105 325 258 -60 166 122 113 -22 -245 -29 -70 72 -106 180 39 -450 -45 24 -212 167 -237 223
5383 223 -63 -71 89 14 70 -180 -342 46 87 -121 69 119 -36 -30 -274 -195 -181 -124 166 187 -25 -142 -10 153
5407 153 122 186 -162 97 -54 -83 5 84 -192 135 -55 399 114 -278 253 -133 188 25 -92 22 -153 374
5429 374 26 -63 -69 -138 26 215 -49 259 -8 79 -17 181 66 -135 156 -192 -200 63 138 235 43 130 14 182
5453 182 107 -22 -91 362 -95 -281 31 -132 -334 161 -1 -144 67 -252 99 -7 -115 307 125 -103 -87
5474 -87 -38 335 87 336 -69 38 -79 -14 6 -57 -48 5 249 78 -240 -230 39 255 84 -90 -224 257 -60
5497 -60 48 80 97 -57 266 -22 -129 23 -73 71 -185 -5 5 316 -50 31 358 86 45 59 152 55 -247
5520 -247 -76 -99 -152 204 153 58 77 40 -72 -4 -161 34 -244 57 139 122 25 -91 -106 -72 3 -1 -100 110 -160
5545 -160 165 -239 -37 61 30 -95 -11 -105 88 -125 -88 148 -207 -200 -132 185 60 -87 -106 -177 114 107 -227 272
5569 272 422 87 -111 223 -165 191 109 -53 -138 -95 -247 147 12 -157 72 3 -142 -122 -108 70 -90 -235
5591 -235 -75 92 466 93 195 209 269 -282 33 -40 124 67 -253 -127 1 47 -142 -153 -20 365 148 -73
5613 -73 83 -44 104 -107 334 156 -86 103 -2 56 342 -138 -161 84 29 -104 12 -95 -205 360 49
5634 49 -47 44 -194 -87 114 -67 -20 81 -40 -130 147 358 49 -99 81 -18 -219 134 -207 -19 -187 157
5656 157 108 -145 82 -144 -57 -118 46 -76 25 153 16 91 75 138 269 -53 56 -42 18 -43 125 186 -48
5679 -48 -21 -363 44 -59 44 144 144 3 -14 -55 74 -254 -213 -93 -10 -283 -34 247 -301 82 -144 5 33
5702 33 -158 -111 -244 -230 183 48 25 -240 209 97 -145 -174 -69 -247 -325 -283 -55 201 92 -14 10 -205 -77
5725 -77 158 -109 111 -108 -98 -189 50 3 -220 -142 -47 -174 -178 392 1 17 65 111 133 -145 -345 35 127 -49
5749 -49 -191 111 -87 -69 -117 -2 -78 51 -142 -24 -23 -230 22 218 241 135 80 151 164 -198 116 -190 -124 347
5773 347 -29 -53 -319 0 56 173 4 -200 -285 -270 -12 -117 -29 -79 453 -40 297 42 -194 162 -130 -462
5795 -462 -133 60 -177 6 -358 129 -81 -265 -182 70 235 -73 90 57 -125 92 -52 -88 -100 -119 48 -133
5817 -133 -306 -129 -151 368 209 -153 66 -292 -98 -228 151 436 -187 -62 -38 210 -289 -64 113 -105 272
5838 272 -149 -84 -125 48 9 -283 -119 -32 112 -35 101 29 148 -356 -43 -83 -126 202 -205 -216 -126 52 -102
5861 -102 -26 84 -2 126 8 15 -172 -80 141 -21 147 128 3 -163 -115 -131 3 -177 -125 184 109 176 -96 -147
5885 -147 -156 -35 87 -82 -173 -106 54 68 -96 49 -18 -73 -49 -18 57 83 -164 29 34 64 -126 25 -211 -63 60
5910 60 200 -129 -226 -158 64 -228 293 -44 -6 106 61 239 80 134 40 112 30 -86 -15 -12 97 108 -258 226
5934 226 138 -11 -194 -218 195 -35 -29 19 -2 140 -34 367 -32 -109 -237 -90 326 -269 -125 257 -11 -198
5956 -198 2 -171 115 162 38 117 140 -241 -7 231 -121 34 78 3 141 26 -155 -20 16 286 -138 -162
5978 -162 341 -20 351 -175 614 50 -97 46 160 179 -66 -37 70 -14 -193 5 33 -440 -25 152 -502
5999 -502 -157 129 -39 208 92 199 479 86 -113 -8 -70 74 -282 375 161 217 -148 -156 -68 -50 -266 86
6021 86 63 -6 249 42 7 149 -110 119 188 -181 -61 -149 -143 -218 -213 11 -272 -9 -56 -135 100 -331 -129 -152 -4
6046 -4 490 74 89 -10 -218 -133 44 116 -73 -182 11 183 -186 102 92 189 113 -75 350 52 -8 -103 291 9
6070 9 -70 -347 111 -224 52 -69 280 -9 -21 69 -249 -30 -272 -47 -62 -285 100 144 6 146 -47 233
6092 233 -179 319 48 136 28 96 -27 415 73 -14 -310 -236 281 -75 170 102 112 -126 351 258 202 -118 29
6115 29 59 78 -64 -115 44 195 -72 -253 -59 -48 -141 -376 88 -131 13 -79 -263 182 -143 -206 352 94 111
6138 111 172 -162 6 193 298 5 -189 -49 26 56 -262 174 303 -162 175 83 92 132 -31 6 -54 68 -369
6161 -369 -191 -258 48 128 -24 42 -67 -315 -107 -90 19 -29 -48 -48 -105 174 224 39 -60 216 -21 104 -25 89
6185 89 205 -70 -89 222 -142 64 66 49 -50 302 30 -70 -1 -383 -181 -162 -59 -18 264 86 370 -98 117
6208 117 18 -54 2 201 152 4 63 -142 -151 -43 177 -64 180 -261 63 -84 -75 222 29 -184 -47 371 -438
6231 -438 -130 -248 199 23 -185 -63 -391 -70 -125 -96 -121 -58 -202 25 -109 86 130 157 0 -3 44 -107 -144
6254 -144 38 143 -18 -394 81 48 -76 159 -29 110 558 198 18 231 -18 237 -89 162 161 -87 54
6275 54 89 137 77 -73 187 -314 97 -65 128 -152 152 196 143 45 -15 343 0 -7 281 87 39 49 -405 62
6299 62 3 -68 -223 -112 71 -41 -179 -276 17 -70 263 -190 -303 -10 -127 189 -181 -164 -26 -107 -162 -159 -200 93
6323 93 140 -4 2 26 110 7 -76 -116 199 -86 51 -328 -31 -84 102 51 -142 -339 327 -144 -245 -106 -47 78
6347 78 35 -19 -85 268 81 -23 187 -87 84 89 -246 219 -12 3 -54 -147 -363 -104 -24 -68 -43 -177 -65 42
6371 42 172 138 -272 12 -158 44 -6 -27 35 212 -99 -59 -140 -195 273 137 69 -157 -101 346 106 31 76 157
6395 157 -130 105 376 -67 -32 -59 248 7 -52 -12 -128 248 210 77 -107 -352 -14 179 -320 171 199 123
6417 123 1 11 -63 175 -110 -101 -33 -151 132 -164 -182 -125 -104 -163 160 -280 7 -140 -239 -36 36 -49 284 165
6441 165 -531 255 378 110 -50 303 -175 33 132 138 35 98 -102 11 -244 -345 348 -181 -114 31 283 -152
6463 -152 -52 -362 378 -31 97 -221 111 -356 -221 32 -181 -174 -150 -113 -130 -57 -203 -91 155 -48 26 117 -39
6486 -39 -49 94 71 -67 -154 -99 148 55 71 375 -173 -54 92 -78 13 25 3 9 49 -80 12 329 -75 236 418
6511 418 -72 100 166 -200 -30 23 -45 -138 14 73 126 215 -182 74 -333 -109 38 37 344 36 126 -130 -220 210
6535 210 -58 -44 14 281 138 -187 -158 55 91 138 -181 -45 137 132 113 -110 194 20 -175 162 360 24 44
6558 44 24 78 158 67 -149 -305 -88 129 14 -58 -76 57 167 -250 -177 -69 -98 -23 138 29 93 68 -80 130
6582 130 -91 -122 -116 -117 -164 -95 -24 198 302 -354 -58 -99 -226 4 -332 319 -64 -52 -233 -142 68 -34 -97 -1
6606 -1 220 -41 27 -71 -246 -153 19 230 211 80 -107 2 76 64 -97 31 281 -34 150 -40 97 -255 45
6629 45 -46 98 193 -89 -39 118 -239 147 97 -305 -117 124 35 -67 -8 11 -231 177 -245 -218 12 -118 99
6652 99 -337 -158 -57 424 78 -110 -77 -22 -39 11 -115 -86 180 472 223 -4 159 310 -219 -22 24 -107
6674 -107 -35 63 -40 20 -119 -191 38 149 84 -176 17 39 -19 242 86 -99 -138 -57 -157 -289 63 174 156
6697 156 13 96 267 55 81 -144 228 -120 -69 86 -105 -40 -75 103 277 177 -180 274 67 -71 -204 105
6719 105 -308 -136 -220 -166 -71 -129 -37 27 70 290 -10 263 42 231 208 -78 58 137 -74 -89 7 -154 147 -32
6743 -32 -195 -3 91 73 -9 172 169 -9 -14 -81 -243 -82 -14 -128 110 167 24 -34 168 204 140 -100 -154 143 -27
6768 -27 -105 -105 -359 94 -149 182 -140 -192 63 -14 150 -246 41 128 15 -109 -292 107 28 -60 106 334 -258
6791 -258 -395 -63 29 -130 145 -464 50 234 -169 106 21 30 -321 139 26 -88 -166 -86 -58 -11 -240 -31 -15
6814 -15 -94 196 123 -19 -85 50 -105 -124 112 203 -252 -402 -95 -360 -60 -32 148 -217 173 -210 47 -275
6836 -275 -130 -72 50 38 -45 75 -353 114 154 -28 -213 -240 -123 5 -415 -60 -144 -233 237 -120 228 -13
6858 -13 -82 -111 -159 66 81 194 -408 -267 -306 188 -130 -304 -84 106 331 -130 187 40 48 -99 -199 35 52
6881 52 -184 -361 -312 94 -146 -158 343 168 26 47 224 191 98 92 -105 -32 -115 193 -387 93 -212 23 197
6904 197 -390 184 238 -120 324 -152 72 -195 -130 54 -86 -32 248 -67 -127 76 116 197 -41 -389 58 -163
6926 -163 -35 39 -21 12 71 -58 -185 120 -13 199 132 -207 -261 4 51 69 -33 -197 -339 78 -120 -238 -75
6949 -75 -40 -154 -280 21 -106 -134 100 194 -372 -17 91 170 -105 -77 -278 -159 -78 61 124 113 199 -108 16
6972 16 -236 107 -225 87 215 1 -175 314 93 -472 -183 -15 -101 -55 -174 185 -81 125 99 -17 -402
6993 -402 -88 -44 40 -168 -4 267 -297 26 -232 384 331 47 -1 -184 88 139 194 -5 -95 -140 -251 16 175
7016 175 -52 98 8 288 154 -103 151 36 -35 169 262 45 77 116 150 74 57 -6 190 154 -57 -349 312
7039 312 84 4 131 -140 -155 32 179 -9 -49 -32 202 133 -111 -154 -64 138 -130 -154 33 189 -21 576 96
7062 96 205 283 189 -34 -269 126 130 -120 206 169 -65 1 35 87 -20 117 341 141 49 -199 239 24 37 -265
7086 -265 2 63 76 48 -192 8 109 255 -104 82 -219 -217 125 -192 -272 -12 16 4 5 -82 -156 -164 104 42 23
7111 23 21 53 126 -162 -217 2 -51 151 -119 64 -180 -138 233 29 -223 -63 -197 90 227 162 136 92 26 -184
7135 -184 -50 -104 323 105 286 -146 -123 -28 55 -67 -82 10 28 111 -1 -103 -247 99 23 210 -254 351 355 274
7159 274 62 302 -151 9 54 -40 127 -142 -254 154 6 -220 -23 59 -175 -167 352 -259 111 72 -35 77
7181 77 -138 -366 74 -9 -150 -148 -224 -186 -71 -466 92 101 235 -30 -92 -203 -400 -21 41 168 -89 53 -71
7204 -71 54 -39 26 248 -108 79 66 -327 36 -141 215 -80 -277 204 270 181 -249 86 -199 65 139 -257
7226 -257 -24 114 -54 113 23 -140 -342 156 -105 115 -174 191 -241 -16 -182 115 16 190 -307 0 108
7247 108 -68 261 -122 149 -26 167 -108 93 80 -6 141 273 -136 221 106 41 -112 33 -26 -43 -186 -141
7269 -141 -155 221 223 14 -51 16 -56 -197 85 -11 -232 -78 208 37 -86 -159 89 59 -94 23 118 226 -58
7292 -58 -51 34 -127 184 -317 -208 -50 73 129 -199 -301 51 -2 -333 257 -257 262 -462 87 42 -24 35 -205
7315 -205 81 121 256 -213 48 88 204 38 -85 -223 -139 2 -45 287 -145 86 85 88 -21 -56 -326 61 -330
7338 -330 158 5 -131 249 226 104 172 -133 137 74 -68 27 -136 244 -141 -169 14 -93 221 99 -40 -134
7360 -134 330 90 -127 85 -16 -275 73 91 -155 -112 119 3 -7 -264 94 -222 -154 108 119 355 -72 61
7382 61 87 373 86 241 36 -262 -128 -12 -93 -31 42 -180 -359 280 -159 -5 -296 -118 25 -35 -150 -178
7404 -178 280 -184 49 176 74 -194 -18 -80 -82 -181 369 65 -40 -306 167 43 -317 56 -46 -3 -367 196
7426 196 113 -116 15 -73 108 -36 -75 62 94 -364 -293 75 180 87 64 65 265 -141 36 -128 122 205 132 47
7450 47 180 -220 -5 24 129 155 -139 -172 -247 -111 -213 -43 -132 -95 58 139 162 -150 -102 -144 335 85 30 253
7474 253 135 -141 290 -109 66 251 175 185 -53 226 -87 -224 200 -389 -52 126 -55 69 -46 -177 -128
7495 -128 385 20 -241 33 185 -29 11 -115 109 136 -29 -218 277 3 -179 473 -47 114 161 -112 77
7516 77 143 273 196 16 134 -51 -46 221 101 99 -97 -145 311 67 -325 -17 11 70 230 -123 36 -75 60
7539 60 -249 -165 -120 -346 -38 174 -126 270 -100 -224 -216 227 113 -15 19 212 -38 -136 356 -145 45 103 111
7562 111 -12 131 -82 -51 13 106 -57 -44 -178 -212 47 159 -309 -88 -78 -52 2 -438 110 231 60 82 -13
7585 -13 -196 160 -140 204 101 -280 0 -122 5 190 -52 -131 19 64 74 -121 347 -149 240 37 57 -27
7607 -27 84 212 208 -126 -75 -49 144 10 -127 -136 127 223 115 -258 -275 -68 129 -10 -294 21 -154 -129 -202 181
7631 181 319 -130 109 -114 -256 -330 326 -381 117 169 53 36 -14 -222 -144 226 -159 -121 -44 -103 -1 -44 58
7654 58 110 -154 136 -98 -79 -31 -164 9 126 51 486 -279 56 114 -341 -227 65 266 20 70 -27 123 18
7677 18 15 -86 -51 -112 -9 -35 -239 -89 -226 -155 69 39 -245 -295 -174 199 74 -13 141 189 -96 71 -232 50
7701 50 291 55 -81 154 134 -156 103 256 -2 29 -5 -175 175 -120 -28 -25 -243 341 28 -139 -206 -91 -9
7724 -9 169 14 69 204 -260 -145 380 110 -114 -10 -39 -33 -144 -179 393 132 -85 9 96 165 78 -230 69 119
7748 119 -170 -60 162 -41 -67 -200 -76 -63 63 8 28 83 -4 -71 236 111 -196 88 216 177 31 259 22
7771 22 -232 5 5 299 185 -390 22 23 70 -291 -265 -247 177 160 -33 95 287 241 78 85 92 -42 362 153 338
7796 338 -225 -7 287 -89 130 352 103 28 100 -30 61 -153 26 160 -85 -58 89 -86 203 75 -11 -386
7818 -386 57 -131 -227 -126 -311 -20 114 -49 90 -67 -324 -19 -103 -38 134 -76 -117 195 24 65 -98 -15
7840 -15 70 142 126 195 -111 -176 -88 66 -124 228 -42 -248 38 116 37 53 -159 21 71 177 133 129 -125 158 29
7865 29 66 358 -5 -228 -95 -22 293 -19 -247 -51 60 50 127 230 -402 -29 20 168 215 130 -52 -93 168
7888 168 90 -195 134 15 394 252 22 -13 -53 308 41 -224 -48 164 335 310 -202 121 167 -278 151 235
7910 235 66 159 -39 134 141 -11 138 -55 -15 -48 111 -171 125 -42 193 -123 -79 -98 168 215 15 -19 -65
7933 -65 -106 -188 -153 76 130 197 -165 32 602 -118 55 229 -54 -94 -118 -469 166 -46 187 355 21 -179 -500
7956 -500 -126 24 164 -165 -9 -79 42 -26 -45 -6 -192 -72 326 -197 -51 105 -1 106 -109 43 -137
7977 -137 -92 142 119 -79 -219 -245 -109 -52 -430 -42 175 -140 -81 176 142 -139 -34 82 -7 16 -58 71 30
8000 30 -149 165 -29 -13 -164 144 -91 24 -6 35 -61 -131 -302 41 -73 -64 -17 -222 -176 99 -111 16 101 -47
8024 -47 167 -254 138 -79 -282 171 88 133 79 57 143 -228 78 -57 99 22 -255 152 -209 133 258 168 -69
8047 -69 -137 -301 -29 -187 75 193 -223 -168 111 -262 -45 -405 145 44 56 -17 -270 102 -234 76 163 166 58
8070 58 51 140 -83 -198 35 -4 21 25 30 2 -77 -89 -100 -280 362 132 106 144 2 -82 24 104 263 138 -203 129
8096 129 -172 18 46 -234 -150 187 -115 177 154 -7 191 160 71 57 188 34 8 -501 -346 -118 -48 -118 -90
8119 -90 -126 -369 -41 14 -270 151 152 -116 -311 89 111 208 -286 139 -146 -166 274 23 -159 -26 462 -51 -133
8142 -133 -97 -146 -133 116 11 142 -18 305 31 111 -180 -96 -306 59 223 -17 8 -253 255 62 -174 193
8164 193 164 -25 -74 -55 161 188 90 280 166 -275 -123 151 -18 202 -50 -29 228 209 118 69 99 75 144 143 -177
8189 -177 -167 143
8191A43
##END NTUPLES=NMR FID
##END=
