##TITLE=1H_LR-788-B-C2-OF1
 CDCl3
 8 sc, 
 3.12.2024
##JCAMPDX= 6.0         $$ Bruker NMR JCAMP-DX V2.0
##DATA TYPE= NMR FID
##DATA CLASS= NTUPLES
##ORIGIN= UXNMR, Bruker Analytische Messtechnik GmbH
##OWNER= root
$$ XWIN-NMR		Version 3.5
$$ Tue Dec  3 16:26:37 2024 Russian Standard Time (UT+4h)  she@DPX200
##.OBSERVE FREQUENCY= 200.1315
##.OBSERVE NUCLEUS= ^1H
##.DELAY= (6, 6)
##.ACQUISITION MODE= SIMULTANEOUS
##.ACQUISITION SCHEME= undefined
##.AVERAGES= 8
##.DIGITISER RES= 18
##SPECTROMETER/DATA SYSTEM= spect
##.PULSE SEQUENCE= zg30
##.SOLVENT NAME= CDCl3
##.SHIFT REFERENCE= (INTERNAL, CDCl3, 0, 15.7039)
##AUDIT TRAIL= $$ (NUMBER, WHEN, WHO, WHERE, WHAT)
$$ ##TITLE= Audit trail, XWIN-NMR		Version 3.5
$$ ##JCAMPDX= 5.01
$$ ##ORIGIN= Bruker BioSpin GmbH
$$ ##OWNER= she
$$ F:/spectra/data/she/nmr/H-F/1/audita.txt
$$ ##AUDIT TRAIL=  $$ (NUMBER, WHEN, WHO, WHERE, WHAT)
(   1,<2024-12-03 16:25:11.15 +0400>,<she>,<DPX200>,
      <created by zg, POWCHK disabled, PULCHK disabled
       configuration hash MD5:
       00 E9 B6 7A A2 85 ED C7 34 08 36 98 17 FE 4E 26
       data hash MD5: 16K
       86 A9 BC 6B 02 58 E3 52 24 3E 85 F1 17 B9 63 75>)
$$ ##END=
$$ 
$$ hash MD5
$$ 96 14 72 ED 25 BF 9A 5E 93 8A 4C 8C 94 3F 37 94
##$RELAX= 
##$RELAX= 
##$RELAX= 
##$RELAX= 
##$RELAX= 
##$RELAX= 
$$ Bruker specific parameters
$$ --------------------------
##$DU= <F:/spectra>
##$EXPNO= 1
##$NAME= <H-F>
##$PROCNO= 1
##$TYPE= <nmr>
##$USER= <she>
##$AMP= (0..31)
100 100 100 100 100 100 100 100 100 100 100 100 100 100 100 100 100 100 
100 100 100 100 100 100 100 100 100 100 100 100 100 100 
##$AQSEQ= 0
##$AQ_mod= 1
##$AUNM= <au_zg>
##$AUTOPOS= <>
##$BF1= 200.13
##$BF2= 200.13
##$BF3= 200.13
##$BF4= 200.13
##$BF5= 200.13
##$BF6= 200.13
##$BF7= 200.13
##$BF8= 200.13
##$BYTORDA= 1
##$CFDGTYP= 0
##$CFRGTYP= 5
##$CHEMSTR= <none>
##$CNST= (0..31)
1 1 145 1 1 1 1 1 1 1 1 1 1 1 1 1 1 1 1 1 1 1 1 1 1 1 1 1 1 1 1 1 
##$CPDPRG= <>
##$CPDPRG1= <>
##$CPDPRG2= <>
##$CPDPRG3= <>
##$CPDPRG4= <mlev>
##$CPDPRG5= <mlev>
##$CPDPRG6= <mlev>
##$CPDPRG7= <mlev>
##$CPDPRG8= <mlev>
##$CPDPRGB= <>
##$CPDPRGT= <>
##$D= (0..31)
0 1.2 0 0 0 0 0 0 0 0.06 0 0.03 0 0 0 0 0.0002 0 0 0 0 0 0 0 0 0 0 0 0 
0 0 0 
##$DATE= 1733228710
##$DBL= (0..7)
120 120 120 120 120 120 120 120 
##$DBP= (0..7)
150 150 150 150 150 150 150 150 
##$DBP07= 0
##$DBPNAM0= <>
##$DBPNAM1= <>
##$DBPNAM2= <>
##$DBPNAM3= <>
##$DBPNAM4= <>
##$DBPNAM5= <>
##$DBPNAM6= <>
##$DBPNAM7= <>
##$DBPOAL= (0..7)
0.5 0.5 0.5 0.5 0.5 0.5 0.5 0.5 
##$DBPOFFS= (0..7)
0 0 0 0 0 0 0 0 
##$DE= 6
##$DECBNUC= <off>
##$DECIM= 24
##$DECNUC= <off>
##$DECSTAT= 4
##$DIGMOD= 1
##$DIGTYP= 9
##$DL= (0..7)
0 120 120 120 120 120 120 120 
##$DP= (0..7)
150 150 150 150 150 150 150 150 
##$DP07= 0
##$DPNAME0= <>
##$DPNAME1= <>
##$DPNAME2= <>
##$DPNAME3= <>
##$DPNAME4= <>
##$DPNAME5= <>
##$DPNAME6= <>
##$DPNAME7= <>
##$DPOAL= (0..7)
0.5 0.5 0.5 0.5 0.5 0.5 0.5 0.5 
##$DPOFFS= (0..7)
0 0 0 0 0 0 0 0 
##$DQDMODE= 0
##$DR= 18
##$DS= 0
##$DSLIST= <SSSSSSSSSSSSSSS>
$$ [...]
##$SUBNAM2= <"">
##$SUBNAM3= <"">
##$SUBNAM4= <"">
##$SUBNAM5= <"">
##$SUBNAM6= <"">
##$SUBNAM7= <"">
##$SUBNAM8= <"">
##$SUBNAM9= <"">
##$SW= 24.0689530833862
##$SWIBOX= (0..15)
0 0 2 0 0 0 0 0 0 0 0 0 0 0 0 0 
##$SW_h= 4816.95568400771
##$TD= 16384
##$TD0= 1
##$TE= 0
##$TE2= 300
##$TE3= 300
##$TEG= 300
##$TL= (0..7)
0 120 120 120 120 120 120 120 
##$TP= (0..7)
150 150 150 150 150 150 150 150 
##$TP07= 0
##$TPNAME0= <>
##$TPNAME1= <>
##$TPNAME2= <>
##$TPNAME3= <>
##$TPNAME4= <>
##$TPNAME5= <>
##$TPNAME6= <>
##$TPNAME7= <>
##$TPOAL= (0..7)
0.5 0.5 0.5 0.5 0.5 0.5 0.5 0.5 
##$TPOFFS= (0..7)
0 0 0 0 0 0 0 0 
##$TUNHIN= 0
##$TUNHOUT= 0
##$TUNXOUT= 0
##$USERA1= <user>
##$USERA2= <user>
##$USERA3= <user>
##$USERA4= <user>
##$USERA5= <user>
##$V9= 5
##$VALIST= <valist>
##$VCLIST= <CCCCCCCCCCCCCCC>
##$VD= 0
##$VDLIST= <DDDDDDDDDDDDDDD>
##$VPLIST= <PPPPPPPPPPPPPPP>
##$VTLIST= <TTTTTTTTTTTTTTT>
##$WBST= 1024
##$WBSW= 4
##$XGAIN= (0..3)
0 0 0 0 
##$XL= 0
##$YL= 0
##$YMAX_a= 39426
##$YMIN_a= -38246
##$ZGOPTNS= <>
##$ZL1= 120
##$ZL2= 120
##$ZL3= 120
##$ZL4= 120
##$ABSF1= 10
##$ABSF2= 0
##$ABSG= 5
##$ABSL= 3
##$ALPHA= 0
##$AQORDER= 0
##$ASSFAC= 0
##$ASSFACI= 0
##$ASSFACX= 0
##$ASSWID= 0
##$AUNMP= <proc_1d>
##$AZFE= 0.1
##$AZFW= 0.1
##$BCFW= 1
##$BC_mod= 2
##$BYTORDP= 1
##$COROFFS= 0
##$CY= 11.3945322036743
##$DATMOD= 1
##$DC= 2
##$DFILT= <>
##$DTYPP= 0
##$F1P= 15.6554695791079
##$F2P= 12.8336369535428
##$FCOR= 0.5
##$FTSIZE= 0
##$FT_mod= 4
##$GAMMA= 1
##$GB= 0.15
##$INTBC= 1
##$INTSCL= 1
##$ISEN= 128
##$LB= 0.24
##$LEV0= 0
##$LPBIN= 0
##$MAXI= 10000
##$MC2= 0
##$MEAN= 0
##$ME_mod= 0
##$MI= 1.114404
##$NCOEF= 0
##$NC_proc= 0
##$NLEV= 6
##$NOISF1= 3.799351
##$NOISF2= 2.8
##$NSP= 1
##$NTH_PI= 0
##$NZP= 0
##$OFFSET= 15.70392
##$PC= 1
##$PHC0= -26724.66
##$PHC1= 23.18744
##$PH_mod= 1
##$PKNL= yes
##$PPARMOD= 0
##$PSCAL= 0
##$PSIGN= 0
##$REVERSE= no
##$SF= 200.130013532006
##$SI= 16384
##$SIGF1= 3
##$SIGF2= 2
##$SINO= 400
##$SIOLD= 16384
##$SREGLST= <1H.CDCl3>
##$SSB= 0
##$STSI= 0
##$STSR= 0
##$SW_p= 3612.71676300578
##$SYMM= 0
##$S_DEV= 0
##$TDeff= 0
##$TDoff= 0
##$TI= <>
##$TILT= no
##$TM1= 0
##$TM2= 0
##$TOPLEV= 0
##$USERP1= <user>
##$USERP2= <user>
##$USERP3= <user>
##$USERP4= <user>
##$USERP5= <user>
##$WDW= 1
##$XDIM= 8192
##$YMAX_p= 0
##$YMIN_p= 0
$$ End of Bruker specific parameters
$$ ---------------------------------
##NTUPLES= NMR FID
##VAR_NAME=  TIME,          FID/REAL,        FID/IMAG
##SYMBOL=    X,             R,               I
##VAR_TYPE=  INDEPENDENT,   DEPENDENT,       DEPENDENT
##VAR_FORM=  AFFN,          ASDF,            ASDF
##VAR_DIM=   8192,          8192,            8192
##UNITS=     SECONDS,       ARBITRARY UNITS, ARBITRARY UNITS
##FACTOR=    0.0002076,     1,               1
##FIRST=     0,             0,               0
##LAST=      1.7004516,     0,               0
##MIN=       0,             -38246,          0
##MAX=       1.7004516,     39426,           0
$$ Real data points
##PAGE= N=1
##DATA TABLE= (X++(R..R)), XYDATA
$$ [...]
1941A08j33L30j31m24M62j5l26j55K90L28j78k78L81K01j97m2p2P6j3l48n0M36
1963B50P9m37K02K13j76k09J77L2l47M12L32m14l02J41J41k61J43L17j22J16M9
1984C36m24n5J33k70L31J86k40m17M69K78m11J29M6j32j95L19l7k35L34k10L7
2005b8k28j22J05J6K93j0j97L02m29J41K66l58p5QK78M0j45QL40j22k32K30k45
2028a64L55j26l43L6Q5L29m85M66P6n63K43j3pk91J80O1j02p8K48O9J23j06K47
2051B40m9j87J82k20Q7J41o9K43l81L9j61J36L32m28J24K48k2l97J70J14K45m93
2073a06R4L9Q2J15l7O8o1K06l45O9L5m13L40J66n8m10L84J15n2k05n1l5l2J88
2097I6j43R3J61r7L21n43m1K66J87K2l90P6L20n85J27K04L58l96o7k73N1L27M4
$$ plain form
1941 108 -25 305 174 -250 212 197 -129 -284 6 334 156 -122 259 460 263 221 149 225 212 -136 -186 250
1963 250 329 -108 94 307 131 -78 99 131 -216 196 528 114 -188 -47 94 -167 -24 293 171 287 336
1984 336 -88 -143 -10 -280 51 237 -3 -420 49 327 -84 45 91 -41 -236 83 46 -189 145 -65 -28
2005 -28 -256 -378 -273 -257 36 26 -171 131 -298 -157 109 -249 -324 -316 -38 2 -143 -135 205 83 -149 81 -164
2028 -164 191 65 -278 -242 -157 172 -313 153 229 -334 -91 -104 -111 -402 -222 -161 -263 -341 -93 -24 99 -7 240
2051 240 191 4 186 -34 53 194 125 368 -13 26 -135 1 333 -95 29 277 255 -142 28 142 387 -106
2073 -106 -12 27 109 224 187 255 194 400 55 124 159 -254 86 252 194 -216 168 283 231 26 -25 -60 -92 96
2097 96 -47 46 207 110 431 -112 -153 113 300 322 -68 8 328 -257 -130 74 432 36 -31 -304 -253 74 118
2120A18j99L31n23K79K0m3p7r3rJ84o8o3L69l54j52K91M0Nj81J49nP7j60mq9j14
2146b71L06j43M2K19j92o7J68j14k8j02J17J66n19O6J45j56M48M3nl04n1J52J69
2169H9q0L8n7j12J27j31K10r9j22M0N24p07J62K72K5m4P0l07N23k62q5K28l12
2192a0k12O08l07p1j52J6N04k18M9j17K73k30j88M49o7j22j93O1J70q0k17M5P7
2215F8J9k11Q3L27l30l4P44q17K9K24j52K05j41Q0J67k52m3J85k86J38J2K86m64
2238a63N95m74j53K27j58J05R5q9j13j4J50p6k16j3J72L3MN2R4P0j8k52K18l34
2262b58Q7J89j54J16j31M87j34p2k02J48k27J29j50j00L55k21J10p7m4j3l11P80
2284C07j52q3j31J71p0k49j24M09k11J23j47J04l08K44J46j07J21J1j36J57k9
$$ plain form
2120 118 -81 250 -273 6 26 -17 -94 -187 -196 -12 -80 -143 226 -128 -280 11 51 56 -125 24 19 96 -64 -68 -157 -271
2146 -271 35 -108 -66 153 -39 -106 62 -52 -80 -182 -65 101 -418 -352 -207 -363 85 128 123 -181 -232 -80 89
2169 89 9 47 -10 -122 5 -126 84 -15 -137 -97 427 -280 -118 154 179 135 205 -102 421 159 74 302 -10
2192 -10 -222 386 79 8 -144 -128 376 158 207 90 363 133 -55 394 327 205 12 73 243 163 -54 -9 68
2215 68 87 -124 -41 286 -44 -78 666 -151 -122 102 -50 155 14 94 261 9 -34 151 -135 3 15 301 -163
2238 -163 432 -42 -195 32 -126 -21 74 -15 -128 -142 8 -68 -284 -297 -125 -92 -88 -36 58 128 110 -142 76 -258
2262 -258 -171 18 -136 -20 -151 336 202 130 -72 76 -151 -22 -172 -272 83 -138 -28 -105 -149 -162 -473 307
2284 307 155 72 -59 112 42 -207 -331 78 -133 -10 -157 -53 -361 -117 29 -78 43 54 -82 75 46
2305D6k87K46K99n54M11K45p35M69p3j02L60m93PK84n8p1J72J61m79M18o4k77
2327g5J12J64m0K9m48p8L21K47j05l32L91k37M0K11j90K4J34k24k8K49k7k31O8
2350b5L92j0l79l64O76q8m35K84Q8j77M5K25l21l0l1K16j76o4K56l44L39k9K86
2373C34l39j0P6q9j14J54k78K51L62l27m2k33L60j78P6O8k13l2J45J70L9m30K36
2396a4J77l18K54j87J15j27k05K9K32j54K15O6j78J84k62M13J26o84J61J95l84
2417c46J51N6M72m96L92j80J90l93K29K10n37J71o4M03m49L36J64k55j57J0K3
2438g0o6K15o1J22j57L33j31l04L61j82j96M1M00j14j90J24R8m12L41l39M54k99
2460c2l5J43l7K54j75j51L65m12J37L6j48J98m71L46J41O5l24p5L16l2k91M39
$$ plain form
2305 46 -241 5 304 -250 161 406 -329 140 67 -35 325 -168 -161 123 65 -6 166 327 -152 266 202 -75
2327 -75 37 201 161 190 -258 -336 -15 232 127 -205 186 -51 -11 200 10 34 168 -56 -84 165 138 -93 -25
2350 -25 367 357 -22 -386 290 202 -233 51 139 -38 7 232 -89 -119 -150 66 -110 -174 82 -262 77 48 334
2373 334 -5 -15 61 -28 -142 12 -266 -15 347 20 -22 -255 105 -73 3 71 -142 -174 -29 141 180 -250 -14
2396 -14 163 -155 99 -88 27 -100 -305 -276 -44 -198 17 83 -95 89 -173 240 366 -318 -157 38 -346
2417 -346 -195 -139 333 -163 229 49 239 -154 75 285 -252 -81 -145 258 -191 145 309 54 -103 -93 -70
2438 -70 -136 79 18 140 -17 316 185 -119 242 60 -136 -95 305 191 1 125 223 -189 152 -187 267 -32
2460 -32 -67 76 39 293 118 -33 332 -80 57 93 -55 143 -328 18 159 224 -100 -175 141 109 -182 257
2482B57O9k77l15L65l88l8M84o6j36j51r7Q3M22l33K32o0m5m5m0K55l16R4L7J31
2506A22j50m39L16L3m4K94O6l70P5K03r6j68N8K1l98L91O7n7R6j45L42l95Q2J34
2530C8m42J16J60K7K9P7m07O86o24K63K82n66L13O5o0l10L37l15J15J14K04p8
2552B4J70k02n5M9J20r5M3r5RJ59p5m0o3r6M87j85J1j27j09K21L9p2q7K03L7n25
2578b54L11J83J4j41l31K50k17M17l5j22k53M95k19J14j74R0lj17J2L9P1M2n6
2601A16j30N0j8j09K74n77M93m4n3o4j50M58o9j85J80l19N0M69k03l5k52J53q3
2624d8m4P9j17rP20p32j2k64L03P3p1J25j80p3m5p2qK84q0O6J13M5M0l3J2l80
2650c08L13l10K92R0j80M41m13N9m12M26R2j39k95L61M24o87N8J5P0M2m3P2K4
$$ plain form
2482 257 326 49 -266 99 -289 -327 157 91 -45 -196 -293 -210 212 -121 111 51 6 -39 -79 176 -140 -46 -9 122
2506 122 -28 -467 -151 -118 -162 132 198 -172 -97 106 10 -158 -100 -79 -477 -86 -19 -76 20 -125 217 -178 -96 38
2530 38 -404 -288 -128 -101 -72 5 -402 284 -340 -77 205 -361 -48 17 -43 -353 -16 -331 -216 -102 102 24
2552 24 194 -8 -63 -14 106 11 54 -41 -32 127 52 12 -51 -147 340 155 166 39 -70 151 190 118 31 234 271 -254
2578 -254 57 240 254 113 -218 32 -185 232 197 75 -178 317 98 212 38 128 125 8 20 59 130 172 116
2601 116 -14 36 18 -91 183 -394 99 55 2 -62 -212 246 177 -8 172 -147 -97 372 169 134 -118 35 -48
2624 -48 -92 -13 -130 -139 581 -151 -163 -427 -124 -51 -122 3 -177 -250 -295 -367 -375 -91 -171 -105 8 53 93 60 72 -308
2650 -308 5 -305 -13 77 -103 338 -75 -16 -428 -2 90 -49 -344 17 441 -246 -188 -173 -103 -61 -104 -32 -8
2673ho6q3K51k94L22J88j30k42k10L57k98K16J29J51k15j10L45k75j13k8J47M4
2695G8K61n46O6J80L53p4k26j63J51o7O3PK10Q7j51j86m6J44J21j99j16J97J25
2718B69j06L15m62L42n39K87k32K5R0Rj83O13n15n5K10k13R3K4R0l67N21l94Q3
2741i5L35l20n4L43k77o8r4J94K08l44j19P9k0L54j46P4J17k22j82K59L1j87N0
2764h4P6j87K6J18L60p08K03L43l17O4m5k74K77m1l7K83k3J19l39K84r9L36m53
2787a18l1J25k57J82J71Ol65L02L5j09J38j74Q1J38j0N1j76j9J60m15P53n58j0
2810a00J04J84k95J93n8k47K14j60J59j3K20j51J06m18O8K22m4J62q9O9k11rK17
2833A23l46M51p4l37K71J44k36J71o6l49K57j46K3j13K92K01j59K47o13o5M71
$$ plain form
2673 -8 -74 -157 94 -200 122 310 180 -62 -272 85 -213 3 132 283 68 -42 303 28 -85 -113 34 78
2695 78 339 -207 -141 39 392 318 92 -71 80 13 76 83 293 380 229 43 -3 141 262 63 -53 144 269
2718 269 163 478 16 358 -181 106 -126 -101 -11 -2 -185 428 -87 -142 68 -145 -52 -28 62 -305 216 -178 -95
2741 -95 240 -80 -134 209 -68 -136 -230 -36 172 -172 -291 -212 -232 122 -24 50 167 -55 -237 22 53 -134 -84
2764 -84 -8 -195 -169 -51 309 -399 -196 147 -170 -106 -151 -425 -148 -189 -226 57 34 153 -186 98 -1 335 -118
2787 -118 -149 -24 -281 -99 72 78 -287 15 50 -59 79 -95 -14 124 114 165 -11 -30 130 -285 468 -90 -100
2810 -100 4 188 -107 86 28 -219 -5 -165 -6 -19 201 50 156 -262 -194 28 -16 146 57 126 -85 -94 123
2833 123 -223 228 154 -183 88 232 -4 167 101 -248 9 -137 -114 -227 65 266 107 354 -259 -324 147
2854A47k02L21l56QM14k08k17n9M15m78j82N45l51JK96p4m3k73L41k45K07k7l38
2877c58K16J55k49K26k54K08k8l8N4j35J84r2M3l24M13K35k45j09L2j50M24K1
2899B29k19N8l39j3N3K15j11J9K0Q6j09p7J17l55N06l36J51r8J81j86M16k69j45
2922b06M28l8j71K58l34J55k69j9M21R2j26M2P2l81K02j37M5j8J47j81k4M22l99
2945a9R1j6j85p1M52k17K35j20mj26k61L22ql68L55m8j34K80p0j9m59M53j0j9
2969C4N9j97J38J18k52L10k80m2K09j72j16Q3j29q2L99k05J39j02R5p4J92j11
2991A4J17ok19L27k82J19n17P59k73q3J24J2L1k81kR5l83L44Lj81L93j79mj2P1
3016a3Q4J17J11j15l37K33k97L13l48J77M5m7kl1J05LK84k96J55k52K06l11J31
$$ plain form
2854 147 -55 266 -90 -82 332 124 -93 -152 263 -215 -397 148 -203 -202 94 20 -23 -296 45 -200 7 -20 -358
2877 -358 -142 13 -236 -10 -264 -56 -84 -122 -68 -203 -19 -111 -68 -392 21 256 11 -98 -66 -216 208 229
2899 229 10 68 -271 -284 -231 -16 -127 -108 -88 -2 -111 -188 -71 -426 80 -256 -105 -203 -22 -208 208 -61 -206
2922 -206 222 184 13 271 -63 92 -177 -196 225 317 191 233 305 -76 126 -11 34 16 163 -18 -42 380 -19
2945 -19 72 56 -129 -200 252 35 270 150 146 20 -241 81 73 -295 60 12 -122 158 88 69 -390 63 53 34
2969 34 93 -104 34 152 -100 210 -70 -112 97 -75 -191 -108 -237 -319 80 -125 14 -88 7 -67 125 14
2991 14 131 125 -94 233 -49 70 -447 312 39 -44 80 92 123 -158 -160 -65 -448 -104 -101 -282 111 -68 -72 -84 -13
3016 -13 71 188 299 184 -153 80 -217 96 -252 -75 -30 -77 -79 -110 -5 -2 282 -14 141 -111 95 -216 -85
3039h5j85K84P6J23J62k72k56j04L97J0m41K87j18J76k41K77J5Q1l4Q3l15RnJ83
3063A07r9K6K42m2M0m28L6R2p6j04K57n0J47m15N04n5l78O7N50m21R0j07K97k78
3087BN21k97l34L77m57L51k0n9J48l86Q7K2J62k77j18L59j02n1k9Qk43O01k74
3110iK98k95K5J24l84j68K44J71n0Q3k45M82k28J70l01j06J68J46k83m2L1KJ16
3133e1j30J26j26L49k65J41J70l44J90J5K04k94lJ86m2j69J42o32K65Q7K84k93
3155a90J33j65L75r4rj27J25j4j5j47L43j64M3n1n69Q77k74k57M46k05k29K56
3177H8l82L66k52J46m5J51K76m49j5J8R8j10M7L28k93Q2j71Q9j05M5l4M5K62J21
3201C06N4l70K15l51R1K12j33J9N78l76n32N04l07Q7J86J10k74J85M2l2m03O5
$$ plain form
3039 -85 -270 14 90 213 375 103 -153 -257 140 150 -291 -4 -122 54 -187 90 105 186 152 235 -80 -71 -76 107
3063 107 8 34 276 234 274 -154 -118 -26 -102 -206 51 1 148 -267 237 182 -196 -129 421 0 90 -17 280 2
3087 2 523 226 -108 269 -188 163 143 84 232 -154 -67 -45 117 -160 -278 81 -21 -72 -101 -93 -336 265 -9
3110 -9 289 -6 19 143 -241 -409 -165 6 -44 39 -206 276 48 218 -83 -189 -21 125 -158 -200 -169 -167 -51
3133 -51 -181 -55 -181 168 -97 44 214 -130 60 75 279 -15 -18 168 126 -43 99 -533 -268 -181 103 -190
3155 -190 -57 -222 153 59 50 -77 48 34 19 -128 215 51 94 43 -526 351 77 -180 266 61 -168 88
3177 88 -294 72 -180 -34 -79 72 348 -101 -116 -98 0 -110 -63 265 -28 54 -117 -28 -133 -88 -122 -77 185 306
3201 306 360 -10 205 -146 -55 157 24 43 621 245 -287 217 -90 -3 183 293 19 204 246 214 -189 -124
3223a24N63n17J79rK4P5j32k70K51L7K15O7l17l46J81r8j89L44O0j6m2J06k07
3246a65L23j76L99o37M06J19m99L66k12J13J5n3p8K13l66L28j33K03j37k92L48
3267H5K4J26m11K4P7R2l61J61L11j34k84N30m79N61l18M9k52J62M2j8o8on4P7
3291f4L74k06k8j04M5l66K65J36L01k07J04j71r3K39m37K17Q8Q7j12J3L18n75
3313a76Q9k03N30m7j64J4J93j75L87k16n1l16NJ71J26j00M8j6p0J50k39j17L12
3336A35P4k15j5K05r1l04K15L9Q3p1rL93m93J59j9q7k78L33k19P3J54J52p2k78
3360a36J90K99l13m39N68k14K41k31K6J41k5j74K3j29J06P5l57R5K99k29J12k0
3382i2J0Q5P1k30K87j68P5Q3j32j63L3K41J6j73j89K71j54N0L0J02L39p12M08
$$ plain form
3223 -124 439 -78 101 92 116 191 59 -211 40 77 292 359 42 -304 -123 -221 -410 -66 -6 -22 -64 42 -165
3246 -165 158 -18 381 -256 150 269 -230 136 -76 37 52 -1 -79 134 -232 96 -37 166 29 -263 85
3267 85 109 235 -176 -152 -75 17 -344 -183 128 -6 -290 240 -239 322 4 53 -199 -37 5 -13 -81 -87 -141 -64
3291 -64 310 104 76 -28 17 -349 -84 52 353 146 250 79 -14 225 -212 5 93 180 68 81 399 -176
3313 -176 -87 -290 240 193 29 43 236 61 448 232 181 -135 -130 41 167 67 115 99 29 179 -60 -177 135
3336 135 209 -6 -21 184 93 -211 4 43 126 55 46 439 -54 105 86 -1 -279 54 -165 -92 62 214 142 -136
3360 -136 54 353 40 -399 169 -45 196 -35 -9 132 107 -67 -44 -173 -67 8 -349 -254 45 -184 -72 -92
3382 -92 -82 3 74 -156 131 -37 38 121 -11 -174 -141 100 116 -57 -246 25 -129 -79 -49 53 392 -320 88
3405H8j50k3J74l9K06n31K56n8J32k12K82J15m90N0K58n8J31rK12k95m5k38O26
3428C82m50Q9K55l79n7Q7j14j87l5L80kQ0M3l2j91M15l48J13j88Qj67M55n88O18
3452A87j37K6m6L4%k66L02K91l51J46p9p0k89L29k73M80l46K87p8J53m19j00K00
3475a9q7L21j84J83k90J98M5J9k59J69p3J74l14n3M6M00j18m00P0j39J74L12M3
3498B18l00K40j72N0J58l07K24m40K47j1K69o8k48K05l24J10k30M78M2j58j64
3519a81J63J82k16Q1J84Q4k12l68J95J58K17oo55J83N6L74m35J33J1o5J12Q5K98
3542C78k11J69l33K97l78J12lJ39l43K79j64K85k06k89R5K47k54R2K96j20k01
3563a13Q4J51r6Q2j71K13M9k35K90l38J37j77K28q7kL94k90r6M5O2j04n6P2l76
$$ plain form
3405 88 -62 -85 89 50 256 -275 -19 -77 55 -157 125 240 -250 -200 58 0 131 122 334 39 -6 -244 382
3428 382 -68 21 276 -103 -160 -73 -187 -374 -409 -29 -31 49 92 60 -131 284 -64 49 -139 -131 -298 157 -431 187
3452 187 50 76 30 64 64 -202 100 391 40 186 107 37 -252 77 -196 284 -62 225 147 300 -119 -219 -19
3475 -19 -106 215 31 214 -76 122 167 186 -73 96 23 197 -117 -170 -124 276 158 -242 -172 -311 -137 175 218
3498 218 -82 158 -14 36 194 -113 111 -329 -82 -93 176 108 -140 65 -259 -149 -379 99 141 -17 -181
3519 -181 -18 164 -52 29 213 297 85 -283 -88 70 287 281 -374 -191 -135 239 -196 -63 -52 -117 -5 80 378
3542 378 167 336 3 300 -78 34 31 170 -173 106 -58 227 21 -268 -173 74 -180 -88 208 88 -113
3563 -113 -29 122 26 108 -63 150 199 -36 254 -84 53 -124 104 17 15 409 119 23 68 130 26 -30 42 -334
3587c34J50M10l74J90J97j60K21p9L3l49M32j00m25k09L09N2J70M1o4l04K96J32
3609B35k51K66j83j6j85K24j08J94j80J04j52l31J89K88Q7m39J94N7N2L9j83J70
3631G1k02K24j35j64R1R8L14j93j25O8l50M60l7j55J48m86L47J97l37L69k66M10
3653C47n03n7K26N4P9j71K35j83K96k28r5M2M5M1r7O6j64j23J41k25M2N5N9J35
3677A7J81k96M97k72k67J82j56J03J21j67J19m03L79J99j34J12M1m78J0K50R9
3698A37j87J0j87J51l8k12M97k56o7M01j23j50O4J02j89l69R1K11n8L34j29k74
3720b41L89l7N4m3l0%J62j19P2k25K44l41K55r7j97K87l06J15j54P7J12j52m2
3743b17K05N8k84L82Mj03k73J97Q7j20M67n47J45J84l73P0M11j93o0L0k08k8Q5
$$ plain form
3587 -334 -184 226 -148 42 239 79 300 221 254 -95 337 237 -188 -397 -88 -36 134 175 111 -193 103 235
3609 235 -16 250 67 51 -134 90 -18 176 -4 100 -52 -383 -194 94 181 -258 -64 -7 45 84 -99 71
3631 71 -131 93 -42 -206 -115 -17 297 104 -21 47 -303 157 120 -35 113 -373 -26 171 -166 203 -63 347
3653 347 -156 -213 13 67 146 -25 210 27 323 95 0 42 87 128 31 97 -67 -190 -49 -274 -232 -177 -118 17
3677 17 198 -98 399 127 -140 42 -114 -11 110 -57 62 -341 38 237 103 215 256 -222 -212 38 137
3698 137 -50 -40 -227 -76 -114 -326 171 -85 -152 249 126 -24 40 142 -47 -416 -325 -114 -172 162 33 -241
3720 -241 148 111 165 122 92 92 254 135 207 -18 226 -115 140 43 -154 133 -173 -58 -212 -135 -23 -175 -217
3743 -217 -12 46 -238 144 148 45 -228 -31 56 -64 403 -144 1 185 -188 -118 293 100 40 70 -138 -166 -81
3766h1L45j66J23l04J26O0k54L51k42L97l0m28k50K47k17K80M57l92K37k83R9
3787G5j7j7k2J51k52J51J08l95J37Q1p1K34j37M4j87J92mJ67o9p5l25L09n2O7
3811I3j30K9J85l05J8k50J79J35K62j66J19k13k48J83K61m5k69K9L21j48j59J73
3833E4J81l05J58J40k05K75M2m81P7J57n0nK34j82K32n19J12j0j56L92q8R0m0
3856A03l32L49l94K93p1r1L43l75K78j16K24k89J90J17l78M27o13L61r0l81M84
3877C9j17K64l32L01m90N25j53j51O9N2J05l2P9O3j63J65k03n3J27k78M00k10
3899GK45l57K4J5K58k94K93L1k55K6JJ98k87K04l14L18p2K77M0o30M88j26P4m15
3923b51M9K62J23Ll32J18K4K19M9l23J72K0K6j21l20K59J2k06L39j0K57n55M44
$$ plain form
3766 -81 264 98 221 -83 43 103 -151 200 -42 355 325 -103 -353 -106 -323 -43 414 22 259 -24 75
3787 75 58 41 19 170 -82 69 177 -218 -81 0 -71 163 26 70 -117 75 71 238 169 94 -231 78 26 93
3811 93 -37 -8 177 -128 -110 -360 -181 -46 216 50 169 -44 -292 -109 152 107 -162 -133 188 40 -119 54
3833 54 235 -70 88 228 23 298 340 -141 -64 93 43 38 272 90 322 -197 -85 -95 -251 141 53 143 103
3856 103 -229 120 -274 19 -52 -143 200 -175 103 -13 211 -78 112 229 -149 278 -335 26 -64 -445 39
3877 39 -78 186 -146 155 -335 190 37 -114 -45 7 112 80 159 222 59 224 21 -32 95 -183 217 7
3899 7 252 -105 -81 -66 192 -102 191 222 -33 -7 -6 192 -95 109 -205 113 41 318 358 -272 216 90 164 -251
3923 -251 -202 60 183 186 -146 -28 -4 215 264 -59 113 133 159 38 -282 -23 -11 -217 122 112 369 -186 258
3946B58m98J43M7Q4K50k45M2k09M57p71L89l9K89k87P2j18P5P7R4j39j24J19n0
3969h4M24k95K36n84M01n9K3j12J04j34P9K05k33N1l73M30m53K91k8L13q3k07
3991h8J56j61l65P73l80M5j03N9qJ09j10l2q5K93l88O8J67n5j77O14m04m8K69
4014A49n6j95k9J69r2J60k69L48J7j59m2K45k67Q0j1K12k51rr0Q4k91O5M54q5
4038A37m25L83o4M8J51k37n1K34j46Q5j51l34M42k25J69qJ16R4j72j74J77j08
4060e9p2L8K73J07j78k32J16l75J87O4R8rJ77q5M5k54m9J49O0k5Q5q8j07J2L6
4085h6L9m6J78k98L13m9%R2J09m08N3L24j18j2l31J00L46m0L5k82r0J23J35M4
4109A31j96L21j03r8R6j03l25K64M2k29r9L27k76K86J48j12l68L30j9J61j04J59
$$ plain form
3946 258 -240 -97 -50 34 284 39 81 -128 329 -442 -53 -92 197 -90 -18 -136 -61 16 110 -29 -153 -34 -84
3969 -84 340 45 281 -303 98 39 62 -50 54 -80 -1 204 -29 22 -351 79 -374 -83 -111 202 119 -88
3991 -88 68 -93 -458 315 -65 -20 -123 -64 -72 37 -73 -105 -190 103 -285 -217 -50 -105 -282 332 -72 -120 149
4014 149 93 -102 -131 38 -54 106 -163 185 202 43 1 246 -21 59 48 260 9 0 -90 -6 -297 -232 222 137
4038 137 -288 95 31 79 230 -7 -58 176 30 115 -36 -370 72 -153 16 8 124 218 46 -128 49 -59
4060 -59 -131 -93 180 287 109 -123 -7 -382 -195 -131 -33 -42 135 50 95 -159 -208 -59 1 -24 61 -27 -134 -122 -86
4085 -86 -47 -93 85 -213 100 51 51 143 252 -156 -103 221 103 91 -240 -140 206 166 201 -81 -171 -48 87 131
4109 131 -65 256 153 55 151 48 -277 -13 29 -200 -299 28 -248 38 186 74 -294 36 17 178 74 233
4131B33j71k46K00j39P5q0K32K4k15K72k58K1L13n0n5P8p1j01l97J92K61m22M50
4154A46r9l38K36J51l12J98j24m1K00p7L53k78K08k17kJ11j33j64J43L31m34J34
4176hk03M64l48K44l48P0M9J0J2j06M97m15J61J3RJ01j97L6K43k96j85J58j88
4199b27K88m74L78J2m67M38J93j94K14J08k32pj57%j57J54qK58k79r8L15j8l84
4222c44L50m5L9K20k90k0Q8k63K15ML61j98j17k33J10J13k7n2Nj24J53L37j85
4245I7k83J25mo5%K74Rl59k6J4R1P0M4j07O6L51l61R5O4J60Rk83N0L6j53j06J00
4272i2K88k31j87J78lJ42k09K57J32j36j91J25J39j72N5J78k80m5J15l57L01o7
4294f0J35P7k81J25J93j32J25j84n4K20Q8j92L92o67N12l77k21J80K26k32K05
$$ plain form
4131 233 62 -184 16 -123 -48 -128 104 128 -87 185 -73 -52 261 211 156 234 163 62 -335 -143 118 -304 146
4154 146 47 -291 -55 96 -216 -18 -142 -183 17 -60 293 15 223 6 4 115 -18 -182 -39 292 -142 -8
4176 -8 -211 253 -95 149 -199 -129 -80 -70 -58 -164 333 -82 79 92 101 202 5 41 284 -12 -197 -39 -227
4199 -227 61 -413 -35 -23 -490 -52 141 -53 161 269 37 30 -127 -127 -284 -130 -138 120 -159 -257 58 40 -344
4222 -344 6 -39 0 220 -70 -90 -2 -265 -50 -46 315 117 0 -233 -123 -10 -37 -89 -84 -208 -55 282 97
4245 97 -186 -61 -65 -130 -130 144 153 -206 -232 -218 -127 -57 -13 -120 -54 297 -64 31 95 255 264 -19 31 67 -86 -192 -92
4272 -92 196 -35 -222 -44 -47 95 -114 143 275 139 -52 73 212 40 95 273 -7 -52 63 -294 7 -60
4294 -60 75 152 -129 -4 189 57 182 -2 -56 164 252 60 452 -215 297 -80 -301 -121 105 -127 78
4315G8k99O19n49L57k47K1Q9l71L98l3k33RM93l47L0J28P8j56j13K56l39N4J63
4338H6M6Q7q5j01R5j41O9n8P2K40k40k5k17m9J18J26L0J05J49o65M19p9M66l72
4362G6j28L6l2L0M9pJ12k79K0P5J84Nl02N01k62J47k64J38r7M5J55m14M81O6n25
4387a90J44n1Jq0J69J33M4k91L0K37nL8j70R7l58J29j21q7L44NR2Q4j89k76K20
4412e1J50o3l12M85q1J13l38J88j90Q5P4k70O41j19k34N5j02r1K67R9l68J72p3
4435C7o1K1Jj23L74k72J78n24M74j10O4o9J07k05N2K27j14K25k66o9K6n7J31k86
4459b39N05m7n9k11J24j59J69k16j46L27k6j43L05n24K42J80k31L68m9m61M43
4480A52k61L04l16K46o4J7k2j09J85k72K97m4p5K57o8P7o00J81Q3K77k63n7K76
$$ plain form
4315 78 -221 398 -151 206 -41 -20 69 -302 96 63 -170 -161 332 -15 15 143 221 65 -48 208 -131 -77 86
4338 86 132 219 134 33 128 -13 56 -2 70 310 70 45 -172 -221 -103 23 53 158 307 -358 61 -18 448 76
4362 76 -52 -16 -48 -18 31 24 136 -143 -123 -48 136 141 -161 340 78 225 -39 99 2 47 202 -212 269 335 -190
4387 -190 -46 -97 -96 -176 -7 126 170 -121 -91 146 141 179 9 106 -252 -123 -244 -331 13 18 110 194 5 -271 -51
4412 -51 99 36 -276 209 128 241 -97 91 -99 -14 60 -210 431 312 78 133 31 -60 207 306 -62 110 37
4435 37 -24 -3 -2 -125 249 -23 155 -369 105 -5 59 -10 97 -108 -56 171 57 282 16 -53 -27 -84 47 -239
4459 -239 266 219 160 -51 73 -86 83 -133 -279 48 22 -121 184 -340 -98 82 -149 219 170 -291 152
4480 152 -109 195 -121 125 61 78 56 -53 132 -140 157 113 38 295 227 304 -296 -115 -32 245 -18 -75 201
4503B01j59j18J4q1N4l4o3P2K86j81J54j1l33O09n60L76j33n5L2k17K89K6k11
4526d3K23k05Q4O9l01L04j13k27K67o4j22J89N1j62L26l07o5J72j53n3J28K07
4548B05l0k20K33K9j33k59J82j18K68j11nm32N25J42k08k82L17k97M28l46K33
4569A21j47j11J36j92l5L74M5k09O5n7P5n9K0o8q9l9J35K96o02L84j0j8q7%j90
4594b62N24q1k97K37l58M52j02j24P5j82J44j39RJ56k40L47q8k23J64lp9qM03
4617C25k70m63L81O6l60K95J67k97K86j23j39K44k66K38j77k46J54K90k19Q3j00
4638a31J88k75K54j61J92J71j69l22L75l41L03k84K83k54K43j33j90K06J55n4
4658E6J73n2j65j53J70l5j1J93k94O9K26o7j12j46K18k40J70k79M08J86k95J25
$$ plain form
4503 201 42 -76 -62 -143 -89 -123 -186 -114 172 -9 145 134 -199 410 -150 226 93 38 70 -147 142 168 -43
4526 -43 180 -25 59 128 -173 131 18 -209 58 -6 -128 61 112 -50 276 -31 -96 76 -77 -130 -2 205
4548 205 175 -45 188 217 84 -175 7 -111 157 46 41 -391 134 276 68 -214 103 -194 234 -112 121
4569 121 -26 -137 -1 -193 -228 146 191 -18 47 -10 65 6 26 -42 -131 -170 -35 261 -341 43 33 15 -72 -72 -262
4594 -262 262 181 -116 121 -237 215 113 -11 64 -118 26 -113 -104 52 -188 159 71 -152 12 9 -70 -78 325
4617 325 55 -408 -27 39 -321 -26 141 -156 130 7 -132 112 -154 84 -93 -339 -185 105 -114 -31 -131
4638 -131 57 -218 36 -125 67 238 69 -253 122 -219 84 -200 83 -171 72 -61 -251 -45 110 56
4658 56 229 177 12 -141 29 -6 -17 176 -118 -49 177 110 -2 -148 70 -170 0 -279 129 315 20 145
4680A45m36N16k34J31p6J74Qk91n7J5R3j12K51j16J76j34m8J54L4l05J71O5k98
4703a74N10k99j10k14L69J97o46K79K03k48KL71m24K08k60L67j66K0J9J88n82
4724c90L91J33j73j84J43j34J7M76j83j21l37L98j75L0K74r5k53k2L51k48m0L56
4746B14J84n64R1J28l29K82q3O5J75O1r5J48l04j08L2J07j02K50L8J1l48K81k61
4769a27J81J30k38O4k62Q0K21J89k00k65K66O4k65K12j93L41O1n5l7k21K31n6
4791A21k7L3k2k09N9j79j19L75J62j16L11k29p3j70n8K18q3J58k3k4N91n04l28
4814a36K56L0J45m43R8J25r5Q4k16M06k09r0P5r4j36m1J88J25J58m31J85l6k70
4837c22L40q9J92j62J50r1p9j70R3L08j32l22p3P38m04nJ30J2l69L29j5q0j45
$$ plain form
4680 145 -291 225 -9 122 46 220 228 -63 -120 -105 -12 -124 127 11 187 53 5 159 193 -112 59 124 -174
4703 -174 336 37 -73 -287 82 279 -367 -88 115 -133 -131 240 -184 24 -236 131 -35 -15 4 192 -390
4724 -390 1 134 -39 -223 -80 -214 -197 279 96 -25 -362 36 -139 -109 165 70 -183 -205 146 -102 -142 214
4746 214 398 -166 -75 53 -276 6 -77 -12 163 224 129 277 -27 -135 -103 4 -98 152 190 201 -147 134 -127
4769 -127 54 184 -54 10 -252 -172 49 238 38 -227 39 103 -162 50 -143 198 259 204 167 -54 177 121
4791 121 94 127 105 -104 -45 -224 -343 32 194 78 389 160 87 -83 -141 77 -6 152 129 105 696 192 -136
4814 -136 120 150 295 -148 -50 75 -20 64 -152 254 45 -45 30 -64 -200 -241 -53 72 230 -201 -16 -52 -322
4837 -322 18 -71 121 -41 109 18 -61 -231 -138 170 38 -284 -357 381 -23 -28 102 114 -255 74 59 -21 -166
4860a66j6K74Lk29L17n2J22j86J5l57N32l71K33j84r6L23K56l95j22L66k70k03
4882b06M2J52l70N70l31J21j00k13N78m22M1J44M4l27N90ll85Jo6J77o4L44m57
4905a40K64j74kj28K27j84L13j07j87L60m3m06P6K00k18J53j25Q5k74K23K80k88
4927i5J02j18j26M58q4j5rL00n59J49j11q0j04L80P6l40K42j49k10K63L66l36
4949@N5M51n62L67n00K1L52p1m35M58l62L77j88j64N0L51l12K24O4m10Qj07Q3
4972b50P5K59k50K40J2j23J84o68M07J92j33J60j29J28m32L34P5R8j78k9l37L05
4994f0J85l71L0M99j23k57J52k39P4r6%K57J75l59r5K85J98l09J65J66j01j02
5016G4m5q1L4lQ7j62K44j86K04m09K94K21Q1j52k67J14k74K95l26K15J72l17J24
$$ plain form
4860 -166 -182 92 95 -134 183 131 253 67 82 -275 257 -114 119 -65 -161 162 418 23 -99 267 -3 -206
4882 -206 -164 -12 -382 188 -143 -22 -122 -335 243 -179 -138 6 50 -277 313 310 -75 -74 -140 37 -27 317 -140
4905 -140 124 -50 -52 -180 47 -137 176 69 -118 242 199 -207 -131 69 -149 4 -121 -36 -310 -87 193 -95
4927 -95 7 -111 -237 221 137 122 113 413 -146 3 -108 -188 -292 88 164 -176 66 -83 -293 -30 336 0
4949 0 55 506 -56 311 -189 -168 184 113 -322 136 -226 151 -37 -201 -151 200 -112 112 176 -234 -226 -333 -250
4972 -250 -175 84 -166 74 86 -37 147 -521 -114 78 -55 105 -24 104 -328 6 81 179 1 -28 -365 -60
4994 -60 125 -246 -216 283 160 -97 55 -184 -110 -206 -206 51 226 -133 -228 57 255 -54 111 277 176 74
5016 74 29 -52 -18 -21 66 -96 148 -38 166 -243 51 272 353 201 -66 48 -226 69 -257 -42 130 -187 -63
5039f3p1l54N15J0J14l03K19k98K28q9r0K54k92K1N36k92k42K43q3J12J11p1J7
5062A32m10M57l03K79J18m37L04Ml17K25r2k8q3j47Q2K17K26Jl65K42l06L62M6
5085B07n3k87N62n68K43J21m05R4m2K77m11L40R6m43M41m6j90J57M9l90L09J25
5107A86j42l98K87L42r3J39m41L9K48l14j0M91m97L79k35N1M4k13l58N90P1Kj07
5130F1o7K03k48O8J78M7j83J08j44L7p0J30K0N3l68k14M11j16J76j5k6L88m09
5153B0J43j46O9n8J70O2m14M04k74j62J59Q4j00j36M27k23k50J77j21J57k43p
5175b62o0J69L04m22J77j08N31l76r1P8K54j14o0J27L7o2M3k39j12M96k33j88
5197a11K35Pr4l33M39k23M6J39p4Q8k40J4O6J17l0n9L0k26K25j04J36m2M7j34
$$ plain form
5039 -63 -134 -488 27 37 151 -152 67 -231 -3 -92 -182 72 -220 -199 337 45 -197 46 -37 75 186 115 132
5062 132 -278 179 -124 155 273 -164 140 144 -173 52 -40 -68 -151 -298 -216 1 227 228 -137 105 -201 161 207
5085 207 154 -133 429 -139 104 225 -180 -86 -128 149 -262 78 174 -269 172 126 -64 93 142 -248 61 186
5107 186 44 -354 -67 275 182 321 -120 -81 167 -147 -157 334 -163 216 -19 32 76 -137 -495 95 166 168 61
5130 61 -6 197 -51 17 195 242 59 167 23 60 -10 120 140 193 -175 -389 22 -94 82 67 41 429 20
5153 20 163 17 86 28 198 260 -154 250 -24 -186 -27 57 -43 -179 248 25 -225 -48 -169 -12 -255 -262
5175 -262 -322 -153 151 -271 -94 -202 329 -47 -138 -60 194 80 20 147 184 122 165 -74 -186 310 77 -111
5197 -111 124 131 37 -296 143 -80 -34 105 31 119 -121 -107 -41 76 46 -13 17 -209 16 -88 48 6 53 -81
5221h1j90N19k07l65N73j16M6j38j68J43J76k5k11m05M71K84j07j68k20L61j74
5242bN2j28r7J80Rj75Q8r6K46P5k94lR1J37n05L00L71k82j61M21j60K3%j54l0
5267i4J24k07O2J59n8q5K00m9n4j5J15n25M45l9q9N5n5q2K65k46k5K04J24p8k01
5292a49K32J74l07N1j4L39l64K19n69J98M33m32N4J47K52j09J0k42J58r2j23J83
5314D9J11m51L5J94Q1l17J25K69j03o3p7Q7j10N35l18L0o6k69r8L15K2j54J95
5337B2k35K24J1j93j25K62j47Q2o6L4m3O7K86J43n3l29L52m03l5N3K26J1j3j5
5361A16k27K85o24M74n8J57j80J19k16j00J68L34L9m34K58l5j69J56J13m32M57
5382B01k95J25l5j0j84j12K29O9k4%k4J80q7j9O3J91o26K94K33k73Q6L0J0l28
$$ plain form
5221 -81 -271 248 41 -324 249 133 179 41 -127 16 192 167 -44 -449 22 306 199 31 -189 172 -2
5242 -2 50 -78 -175 5 14 -161 -73 -169 77 152 -142 -145 -54 83 -422 -122 249 -33 -194 227 67 90 90 -64 -94
5267 -94 30 -177 -115 44 -14 -99 101 52 -2 -17 98 -427 18 -21 -110 -55 -110 -192 73 -173 -198 6 130 52 -149
5292 -149 83 257 -50 1 -13 326 -38 181 -388 -190 243 -189 -135 12 264 155 165 -77 81 -11 -134 49
5314 49 160 -291 -256 -62 19 -298 -173 96 -7 -70 -147 -60 -170 365 47 77 11 -258 -356 -41 -19 -173 22
5337 22 -213 11 22 -171 -296 -34 -181 -99 -165 -131 -174 -107 179 322 269 -60 292 -111 -146 -93 133 144 131 116
5361 116 -111 174 -450 24 -34 123 -57 62 -154 -254 -86 248 287 -147 111 76 -93 63 176 -256 201
5382 201 -94 31 -4 -14 -198 -310 -81 -12 -36 -36 -60 120 33 14 77 268 -358 -64 169 -104 -18 12 22 -306
5406c06K87K13m5Q5l63L1K16j41K2M4l56J89K54J42k59j00J21O7j05L06k17R0
5428A75m57L28L3J66o7j19n01L76j90K22j31N55m16J94K9o32M33k29J57K52K4
5449B02j11m58K38r2Q3j25P2M5j8K03m8l33R0J71l21M62j97O9K70r9j50J40O6
5472A59k68J15K0K33n51J21K72j58P4j14J99K86q1r2j34l33K58J40n0q7o3J01
5494D7k10m8L14q2K29qj0j29k73O3L54j61n2m7k28K80r5J97j23k1M2l5J68l71
5518a99J30J62k70M33m03L18k50N3j6K32j14K82n48m6L46j30m93M63R4k94N07
5539B57m09J51o3K76l01j11N00k34m4K1J96n88L71n66O91J7k91mo9L52Q1l97P0
5562i4mq4J36K8k35M75o5j93lJ47J2l0j08M9Q9k10K21l11L95k13K81m47K02J73
$$ plain form
5406 -306 -19 194 149 234 -129 -98 118 -23 -1 43 -313 -124 130 272 13 -87 34 101 -4 302 85 175
5428 175 -282 46 79 245 178 59 -442 -66 -256 -34 -165 390 -26 168 197 -435 -2 -231 -74 178 202
5449 202 91 -367 -129 -221 -138 -263 -191 -146 -164 39 -9 -342 -252 -81 -402 60 -137 -68 202 103 -47 93 159
5472 159 -109 6 26 259 -292 -171 101 -57 17 -97 102 388 307 215 81 -252 6 146 96 9 -54 47
5494 47 -163 -211 103 21 250 242 232 103 -170 -107 247 86 34 -13 -241 39 -56 141 18 -3 39 4 172 -199
5518 -199 -69 93 -177 256 -147 171 -79 -26 -42 190 76 358 -190 -236 110 -20 -513 -50 44 -250 257
5539 257 -152 -1 -64 212 -89 -200 300 66 22 43 239 -349 22 -544 147 164 -127 -131 -200 152 233 -164 -94
5562 -94 -98 -182 -46 -18 -253 222 157 -36 -39 108 120 90 -18 31 120 -90 131 -180 215 2 283 -164 38 211
5586B11l39pJ73l36M02k45J75J4J12j60N3K55l70L59k62k61L16J00k56j18J90
5607Fn1L7k1j19M61j13j91l32N28j45j41L79l81j66N34l63L01M5l20K55k81R1
5629A3m5O7j2j05k3J22l2m4j79L91K9m03L12k86J41j09J00M19k66j49J63k43J16
5652b3K17k09K11j84L6l6k03K44m1j51L3Rj70N11n36L36j36J07K22l60k0M70j1
5675C16j67k25J35j15j70K95l63M19q2j8J32l07J40k27L17K02o19K80p6K98j37
5696B8k03J95K59j5j60j35j02K56j97q9R9K61l16O3K44k54J28J73l84K21j95J23
5718@N5l51K85j19J26N4M4k31M51m4j46l55K40j28K26j85L31k11J13m58L00J24
5740A21m74M49l5q0Q5j84L1J03l05oK50L06l1j02o1k04K76l42K44j27J06l5J28
$$ plain form
5586 211 -128 -135 38 -298 104 -141 34 48 160 0 53 308 -62 297 35 -226 90 190 -66 -184 6
5607 6 -45 -8 -29 -148 313 200 9 -323 205 60 -81 298 -83 -249 285 -78 223 268 -52 203 -78 13
5629 13 -32 35 23 -82 -105 17 -15 -59 -238 153 182 -221 91 -195 -54 -163 -63 356 90 -59 104 -139 -23
5652 -23 194 -15 196 12 48 12 -191 53 12 -139 -106 -97 -267 244 -292 44 -92 15 237 -123 -143 327 316
5675 316 149 -76 59 -56 -226 69 -294 125 43 25 157 -150 -10 -237 80 282 -337 -57 -133 165 28
5696 28 -175 20 279 264 104 -31 -133 123 -74 -163 -64 197 -119 -56 188 -66 62 235 -149 72 -123 0
5718 0 55 -296 -11 -130 -4 50 94 -137 314 270 124 -231 9 -119 107 -78 253 42 155 -303 -3 121
5740 121 -353 96 61 -19 66 -118 -87 16 -289 -295 -45 261 230 128 67 -137 139 -203 41 -86 20 -15 113
5763A13q1k9j99L54j94K17k13k1K11l28L38k56L29j57R8j43q6M22j78k29k7o2
5785a21P7J63l2J31j67l06P7j16N18l64K50j9j7j14k4J38k03J38J01J75n10O4
5807a61LJ88n4k21oK08k4O0j0JN9m45L40J49k51P9k7J01k14M19k7k4Q9l37Q7J93
5833A75j24k7l59J88n6M96j11L3k94K80l78J03N8j07NK96j66l7J39j17p1j66K77
5856C7j79M63l29J86ml82l07O97l22L11J49j95j73n6K33n9L5o9k8j28K8K4r4J77
5880A5M9k62K04Q2j27K32m5k23J68j32j04R9J16J5o1j77J18J2L5k02J63J45J96
5903C16j23j86j39j24K38k6K31j08j56N4R6k39P2j5k09K55N8Q0k40J40j08J81
5925D8j16L51L7n97K97j51N07k84k72J09R0P1n4k92L36K2n20O98j86q3k26K50
$$ plain form
5763 113 32 3 -196 158 -36 181 -32 -53 158 -170 168 -88 241 84 182 39 -47 375 197 -32 -59 -121
5785 -121 -44 119 87 218 51 -255 -178 -294 224 -140 110 91 74 -40 -64 74 -129 9 110 285 -225 -161
5807 -161 -158 30 -24 -245 -251 -43 -67 -7 -17 -16 43 -402 -62 87 -164 -85 -112 -11 -225 194 167 143 232 -105 -18 175
5833 175 51 24 -335 -147 -203 293 182 215 -79 201 -177 -74 -16 -123 -118 178 12 -25 114 -3 -74 -240 37
5856 37 -142 321 -8 178 174 -208 -515 182 -140 171 320 125 -48 -104 129 70 105 36 8 -120 -92 -68 -162 15
5880 15 64 -198 6 88 -39 193 148 -75 93 -39 -143 -44 72 87 26 -151 -33 -21 14 -188 -25 120 316
5903 316 193 7 -132 -256 -18 -44 187 79 -77 -23 73 -166 -94 -109 -318 -63 -5 75 -165 -25 -133 48
5925 48 -68 283 320 -277 20 -131 376 92 -180 -71 19 90 36 -256 80 102 -418 280 94 11 -215 35
5947C5j40k6R0q2L91k86Q7l8k27N45m75J09j9k32L12L4k91L32l3K7L4l28J98k3
5971fK36j30k6k71L4J67j81J06r3L04l50K83K1M5j97L42k43j86J31j8j37O17o63
5994b15N64p9k26m4P6P6o8K18m53K16J65p1k03L51j59r7j88q1J68J76j49K20k18
6017b1k6K49n32N48j19K43l47Q1L2j54Q1k4J01pJ55l07K91L0j78j98j23k1K42
6040dK80p1k21J24j00j79L01l16K9J56J34ko4R9n54J68K91j18J36M2m47K48k14
6063b82K28j39K48J9j66j89P9Q7J43J03J36k15R4j86R9N6l40J94l6K72p3O6k61
6086f3J08j83J35K10k21K9J04J00k12l56J87J69K07m01K84j98J87J49m55L59m2
6107I7m08L38k11O4J19kk37o7O54l67J88n3j12N2L5O5k58K27J73j79k35m4Q8O5
$$ plain form
5947 35 -105 -131 -41 -123 268 -18 69 31 -196 349 -126 -17 -36 -268 44 78 -213 119 86 113 147 -181 17 -6
5971 -6 230 100 74 -197 -163 4 -177 -71 -164 140 -210 73 94 139 -58 284 41 -145 -14 -32 -169 448 -215
5994 -215 349 270 44 0 76 152 84 302 -151 65 230 159 -44 307 148 51 -137 -218 -50 126 -23 197 -21
6017 -21 -47 202 -330 218 99 342 -5 76 108 -46 35 11 112 105 260 -47 244 274 96 -102 -225 -246 -4
6040 -4 276 205 -16 108 8 -171 130 -186 -157 -1 133 131 67 166 -388 -220 71 -47 89 131 -316 -68 -282
6063 -282 -54 -193 55 74 -92 -281 -202 -115 28 131 267 52 146 -40 59 115 -225 -31 -67 205 132 198 -63
6086 -63 45 -138 -3 207 -14 15 119 219 7 -349 -162 7 214 -187 97 -101 86 235 -220 139 97
6107 97 -311 27 -184 -120 -1 -3 -240 -307 347 -20 168 115 3 55 90 155 -103 124 297 118 -117 -161 -73 -8
6131hL6k08K7J69j75N88n49N8L5N3j9J1Q1k58K40j40j33L55o8P0j00m54N76j56
6155C1J15K8k62R1J21j7j05K69k87J16M4K03l14q5N9k83K14j48M87l62R0m1J06
6178G0j78J78n8R8k3l79L46l92L18rK30j75q2O8j07J35J31m34K79k25J36M11l90
6201e2k99M02jk34m14O05k55K40J13m3k90K94J98k79J16M8r4j01R0R4o4n7m13
6224c96L15L04k13K44r9l9%k25J26j25K17l9J47j13j25K22j61j71k8J12j1k00
6246b58M86k67K0L15m30J55n12O09R0j86K96o90K59L53p8m8k05k7K50l32L45k17
6268g2l2N8mJ10j11k72M51K7k01L20k00k02K40k51L10Ml79R7J97p3j97p5K08q
6292e5K63k53K98j21k06M0PJ04n5k9l22L16J44O4j10j85J73J89j26j73J25J17
$$ plain form
6131 -8 28 -180 -153 16 -159 429 -120 -62 -27 26 7 18 99 -159 81 -59 -192 163 95 165 65 -389 187 31
6155 31 146 174 -88 3 124 107 2 271 -16 100 144 347 33 -52 7 -276 -62 -210 277 -85 5 -36 70
6178 70 -108 70 12 110 87 -292 54 -338 -20 -29 201 26 -56 12 -95 40 171 -263 16 -209 -73 338 -52
6201 -52 -351 51 50 -184 -598 7 -248 -8 105 62 -228 66 264 -15 101 149 55 -46 44 138 74 17 -396
6224 -396 -81 223 10 254 155 116 116 -109 17 -108 109 70 217 104 -21 201 40 -131 -159 -47 -58 -258
6246 -258 228 -39 -19 296 -134 21 -491 118 208 22 318 -372 -113 240 162 114 -91 -118 132 -200 145 -72
6268 -72 -104 -46 -50 60 -51 -323 128 155 -46 274 74 -128 112 -139 171 175 -204 -107 90 17 -180 -255 -47 -55
6292 -55 208 -45 253 132 -74 -34 -27 77 22 -7 -329 -13 131 195 85 -100 73 262 136 -37 88 205
6314B05k62Q7J28j75M4J6J60l91J65j61J53J91l23J37K98m51M70k10j81O5L5n0
6336e0K19l58J24J89k05N6k4K95m37K72k87L75n34L20j15O2K00j96K91K64n56
6357i5J16J54l99Q9K56l44N99j84j24O6l2j80J67N0J88p98L35R2K58k16J17j70
6379e5l9n8J32m6j86J29J19K14k32J50j97K49k49K84l50L64j70o3K19n79K45L43
6401B24k51J78j61J39K1k74N8K0P1K02M4l95L54k6k48J4K06m57K94M9Lm4Q3l73
6425b69J95L1J70k54L21l68K21j2o7P9j43P1r8j93M31k29J88L0om6k31J17K07
6448A45J42l17r6J33l46N40k46j84L93k46K13J19j74J97j25N3l57q0k01K35P6
6469a26J89k61l4K61l67L03n3K34j42qj70L65l12L25o2o3K1p6J58r9j19L8J32
$$ plain form
6314 205 -57 30 158 -17 27 43 203 -188 -23 -184 -31 160 -163 -26 272 -179 291 81 -100 -35 0 -50
6336 -50 169 -189 -65 124 -81 -25 -49 246 -191 81 -206 169 -365 -45 -160 -98 102 -94 197 461 -95
6357 -95 21 175 -224 -135 121 -223 376 192 68 134 102 -78 89 139 327 -471 -136 -44 214 -2 115 -55
6379 -55 -94 -152 -20 -66 -252 -123 -4 210 -22 128 -69 180 -69 215 -135 229 59 -4 215 -364 -119 224
6401 224 -27 151 -10 129 150 -124 -66 -46 25 227 271 -124 230 204 -44 -30 176 -281 13 62 65 21 104 -269
6425 -269 -74 -43 127 -127 194 -174 47 35 -32 47 -96 -25 -123 -316 115 -114 74 104 98 52 -179 -62 145
6448 145 287 -30 -126 7 -339 201 -45 -229 164 -82 131 250 76 273 148 201 -156 -236 -437 -202 -126
6469 -126 63 -198 -232 29 -338 -35 -88 146 4 -4 -174 191 -121 204 142 79 100 24 182 83 -36 2 134
6492A34j62L41p09N12k63K58O8J6m09L24m7j38K6J00l0j13J31r7L9k47M73n70
6514c63N96k08j14K09j65j69L04n5mJ05lJ56k96r7j54K70k8j34L87j24r9J03j90
6537g3q2L76j42M4j75j62Q3M95l84P1O7j63k10L67k31m1J83j56J19K69m12j3M60
6560B90p07J40M49k09K46k3m47L4K93k11n3J46Q3k01J99q0m49N76l09K12k19M59
6582B19l55J04K70o22L85k25O9O7lrPJ29r0J98Nr7K38n03K03j41p9L11k29M03
6606B55l86L6K28k20N2k2K84J21n56M08o4j57j1qK87r9Q3n2j76J22L5k46N5J66
6630A35r7J2q0J2p1K29l4k01k3L87l93j19K00M85m84L14j69o8L56k65j7j9k95
6653b05L23k60jk34M28J90k31K04o7l57J07J74J50p01O25j0M0K2j71q6l22P53
$$ plain form
6492 134 -28 313 -396 116 -147 111 179 195 -214 110 63 -75 -49 51 21 -92 39 -58 -19 -266 207 -363
6514 -363 233 25 -89 120 -45 -214 90 35 31 136 133 289 -7 -104 -258 12 -16 -150 237 113 14 117 -73
6537 -73 -155 221 79 123 -52 -214 -131 364 -20 51 118 -45 -255 112 -119 -160 23 -133 -14 255 -157 -170 290
6560 290 -417 -277 172 -37 209 186 -261 -227 66 -145 -198 -52 31 -170 29 -51 -500 76 -233 -21 -240 219
6582 219 -136 -32 238 -384 1 -224 -155 -88 -91 -100 -93 36 -54 144 149 52 290 -213 -10 -151 -230 81 -148 255
6606 255 -131 -95 133 -87 -35 -57 227 348 -208 200 136 -21 -32 -40 247 148 231 179 3 125 160 -86 -31 135
6630 135 38 50 -30 -18 -89 140 106 -95 -118 269 -124 -243 -43 442 -42 272 103 35 391 126 109 90 -205
6653 -205 118 -142 -143 -377 51 241 10 214 147 -210 -103 71 221 -480 145 135 175 197 26 -60 -382 371
6675C71m13J63k01J18%N6m03J42L58K1j66j68L56k29j4k22J23J67k32l98N56P8
6697F3%o7p3k55N32k36qL32k75Q3k14R5M27n07j5K19m20J35N4N1J36k57K07k1
6721a4l70M82K8k76j19L60J08r1j53M9j82J59j21l0M9K56r9K95k71J61j75K35
6743B81m17rP4k22P27l17k59J93Q6Jj06K33l78O4n5N4m0j97M65j79L09mm36J19
6767a3l85N25J96p57N21n3N1q2J04N5k88J97l39K69j46J26J01J9j21j51K09k0
6789A8L10m96J59Q0p4J42oj49L24k50r4R2k26K0K34j8po3j06n3K61N0Pk55K77
6814A77k79L0j84J97k12K8K91J58k4k56K29j22k05K03l43O62l68k49K83K72k54
6835C4k1O6j81J79j42R4K61m68J7J61M3k19n7K91k34L99l86L69j09j96K04kk15
$$ plain form
6675 371 -42 121 -80 38 38 94 -309 -167 191 212 46 -122 234 5 -9 -231 -108 59 -173 -571 -15 63
6697 63 63 -4 -77 -332 200 -36 -44 288 13 96 -118 -23 404 -103 -118 101 -319 -184 -130 -79 57 -200 7 -14
6721 -14 -384 98 126 -150 -269 91 199 108 -45 4 -178 -19 -140 -170 -121 135 36 331 60 221 46 281
6743 281 -136 -145 -71 -293 434 117 -142 51 137 138 32 265 -113 -49 -104 -50 -90 -287 178 -1 308 304 -132 -13
6767 -13 -398 127 323 -434 87 34 85 3 107 162 -126 71 -268 1 -145 -19 82 101 -20 -171 38 18
6789 18 328 -168 -9 71 -3 139 133 -16 308 58 -36 56 -170 -150 84 66 59 -4 -110 -163 98 148 155 -100 177
6814 177 -102 -72 -256 -59 -271 -243 48 206 182 -74 155 33 -172 31 -312 350 -18 -267 16 288 34
6835 34 13 79 -102 77 -65 29 290 -178 -161 0 43 -176 -233 58 -176 223 -163 206 97 -99 105 103 -112
6858a12L42j93k85L54k66K88k71J1M69m14j7L8K24l50K22k80M41j25k23J15M18
6879C86o74J39M60o45K76m9K69O5k66j36J72P1r7j18K51k17R8J87J21l37j66L40
6901A30n0j5k45J84j65L40k14k24K68j08K0K08j22R9j60J77m5k14K14J38k95k6
6923a05J75j63lk9k09N55j39Jk67L89m3l33L75n99K59J57Mk35K50n8j30J78l9
6946ij17KN8K92m21k5l3K51K89o1l20K73o4j18j50M8k0J9n3O57n00O0P0j39KJ42
6972A33n7j26K0q2k89L16Lk97L65n1K39j68K9J79k74Q3k11K61R7P1j83K02l13
6995e3J24k89J07k9J29J54k0J51k52K42rr6j47K40l77N29j99j14%J08k03n7l4
7018i5j08M96j9j69Q4r8j08n7N3J2q2j55M54l4K18o01j09M31j57Q2k19M37N1j26
$$ plain form
6858 -112 230 37 -248 106 -160 128 -143 -132 337 -77 -94 -56 168 -182 40 -240 201 76 -147 -32 386
6879 386 -288 -149 311 -334 -58 -107 162 227 -39 -175 -3 68 -29 -147 104 -113 -15 172 293 -44 -210 130
6901 130 80 65 -180 4 -161 179 -35 -259 9 -99 -79 129 7 106 -54 123 78 -136 78 216 -79 -105
6923 -105 70 -93 -96 -125 -334 221 82 83 -184 205 162 -171 204 -395 -136 21 25 -210 40 -18 -148 30 -9
6946 -9 -126 -124 -66 226 -195 -220 -253 -2 287 226 -94 179 115 -3 -153 -105 -125 -106 -159 498 -2 58 128 -11 -9 133
6972 133 76 -50 -30 -112 -401 -85 -82 -379 -14 -65 174 6 35 214 -60 23 -188 73 170 241 58 260 -53
6995 -53 71 -218 -111 -140 -11 143 123 274 22 264 255 159 12 252 -125 404 205 91 91 199 -4 -61 -95
7018 -95 -203 293 274 105 189 91 -17 -74 -21 -9 -91 -246 208 174 392 -209 -318 113 -44 38 -181 256 307 181
7042A81j46N5k30J6Q1j89k19P91n57L65k13J78k14j89L35Q3r5o8P9JQ4l69J29
7065a11J96j6k22L6j79K66K08k36J57j48j78J88k02J85m83O13q0N2Lj57K31k52
7087a29j34N09k33j36P5l22N98k97P7Q2j1p3k66L70L8J11n65K05K21j28j62R0
7109h0j39M5M9J10O9l78M28O0j33J33K35l09J78k45k38L52k32k5N39o0k42l11
7131a94J54n6L54m08L33j52j34J36j70L40j43P7l72L92o8r0O7j61j7r6L97j46
7153D3l36J11K11J54k94j04J97m5J69j6o3J46l76K50j04J95k58J0kj31K28L9o4
7176d0n7K05j93O5r3j55K73K1m17J53P6L16k86K25k11r9L64r7j84L4M4J77O0j76
7200El45K45P9J13k41P3M9m0j43J77P4p7K18j63j8J7j92J91K01k83P4o6j16J93
$$ plain form
7042 181 35 90 -140 -124 -43 -232 -451 340 -217 148 -65 113 -101 -290 45 128 33 -35 44 45 129 -240 -111
7065 -111 85 69 -153 -117 -296 -30 178 -58 99 -49 -227 -39 -241 -56 -539 74 -6 46 49 -108 123 -129
7087 -129 -263 246 13 -123 -48 -370 228 -69 8 90 79 6 -260 110 148 259 -306 -101 120 -8 -170 -80
7109 -80 -219 -174 -125 -15 54 -324 104 164 31 164 399 90 268 23 -215 137 -95 -120 419 359 117 -194
7131 -194 -40 -96 258 -150 183 31 -103 33 -137 203 60 137 -235 157 89 -1 66 -95 -112 -208 189 43
7153 43 -293 -182 29 183 -111 -215 -18 -63 106 90 27 173 -203 47 -57 138 -120 -110 -112 -243 -15 24 -40
7176 -40 -97 108 -85 -20 -113 -268 5 26 -391 -238 -162 154 -132 93 -118 -217 147 50 -134 -100 -56 121 181 5
7200 5 -340 -95 -16 97 -144 -71 -22 -62 -205 -28 46 -31 187 24 6 23 -169 22 223 -60 14 -52 -168 25
7224B5J14k3j37J73l44M97k81K56m4l94L35r1j62p1K54l5j32K87k15j16J20l18
7246c02J72J34J58j53j4o7k20J88j5qK83l5k26k42M96q6j02L7J05KRR2o6l42M9
7271a53K54J73l00K89m29J77N5l35J72OL03l5l6l79L90j7M9L1J22r4j22J21o2
7294A80m79K43k3k2J18n0n2Rr3J02%n7no6J6m1J38L68m37J48J30p0q1K44j15j82
7320g7k14L63k66M21k71J85k38j21O9Pk6L32q1l5N3k79r8L67R3l60M57K9k74L88
7344D24l77j74R2k1l9L64j29k0n9J28o9k14QJ85j29M2L5J84o1k13K12k92J41m6
7368b8K91k65r0L58j55J29m25K37Q9R1m24L96n8j92q4M1J0K78o6k64J3r7J99K71
7392B55m68L6J12L16l73l2K17k06J84J36P6j14l47L21l04M46j73j09Ko2m4QJ33
$$ plain form
7224 25 139 116 -21 152 -192 305 24 280 236 -158 177 86 -76 -147 107 72 -60 227 12 -104 16 -302
7246 -302 -130 4 162 9 -5 -72 -292 -104 -119 -127 156 121 -105 -347 149 63 -39 -2 103 105 114 206 140 -202 -153
7271 -153 101 274 -26 263 -166 11 66 -269 -97 -91 212 177 141 -238 152 135 184 215 337 243 121 242 180
7294 180 -299 -56 -79 -101 17 -33 -85 -76 -169 -67 -67 -124 -129 -195 -179 -220 -82 286 -151 -3 127 57 -24 220 105 -77
7320 -77 -291 72 -194 227 -44 141 -97 -218 -149 -142 -168 164 83 48 101 -178 -276 91 184 -176 281 310 36 424
7344 424 47 -127 -35 -56 -95 269 140 120 61 189 120 -94 -86 99 -30 12 47 231 170 -43 169 -123 18 -28
7368 -28 263 -2 -92 266 111 240 -185 52 141 232 -192 204 146 -46 -130 -89 -79 199 133 -131 -118 -215 -16 255
7392 255 -213 -177 -65 251 -122 -154 63 -143 41 177 253 139 -208 113 -191 255 82 -27 -25 -87 -131 -123 10
7415A0j66L81j6j92j65J31j00J28M57l46j72n7M51k69mk03j08p9j54L20K13k03
7437a43K89l29K38J05j61K62k68p2J47P7l18j32K58j05j81L42kK4j43K18j73K00
7459A33l57L2K52mn5r2K25Q0J05l47j4J87K3l17K23J54o9j46j97J16k57M56j04
7482B7L14l47K05k30K02o8m4M27n94k3K80j13m1j00K58K3r9n0j3k13K21O2k01
7505a17m8K75j49j07L31k56M09l68K1P4L6j91L83l58m5K04k2j84M4J33m2k90L71
7528A04k18M15l47J56J98m57j67O21k68j09l86K49K55j08K42n29J57L04j30k30
7548b48k4N54k17r9j28N6K01K52m61j3J86O4j69l5j09K46l15N12m98M87l53K82
7570A71j42K3l53K69l10J70l48N98q9l55N07k69lQ2J19j71J50Qk35N9m0n2J51
$$ plain form
7415 10 -156 225 209 17 -148 -17 -117 11 468 122 -50 -107 344 75 71 -132 -240 -319 -473 -153 60 -143
7437 -143 146 -183 55 160 -1 261 -7 -79 68 145 -173 -305 -47 -152 -333 9 7 31 -112 106 -67 133
7459 133 -224 -192 60 56 1 -91 134 214 319 -28 -42 145 168 -149 74 228 159 13 -184 -68 -325 131 27
7482 27 341 -6 199 -31 171 103 59 486 -108 -131 149 36 -5 -105 153 176 77 27 14 -199 22 84 -117
7505 -117 -165 110 -39 -146 185 -71 338 -30 -9 65 101 -90 293 -65 -110 94 72 -112 -68 65 23 -267 104
7528 104 -114 301 -46 110 308 -149 -316 305 37 -72 -458 -209 46 -62 180 -349 -192 112 -18 -248
7548 -248 -272 282 65 -34 -162 -106 95 347 -114 -127 59 123 -46 -81 -190 56 -259 253 -245 242 -111 171
7570 171 29 52 -301 -32 -342 -172 -520 78 -11 -366 141 -128 -131 -49 70 -101 49 57 -178 -119 -159 -211 -60
7593f0J11j02q6m3O0k34K12L22k42M5Q5k74J09L66j70m2k67K51J21k42J8K67l68
7616a63L50r4j50R0K1K2j94k4J29j4l41L0N25l25K19r9J7j67J33J36P3j98Qj10
7640a26J13k01K87J83j7m2n61M64j51J35k03%P7j63J95K98r0l49L07K1l23J31
7662a5n4K91l35L44L6n22K45m0J87j45o22P12J07m40J91j23J90J11k11J96k62
7683a59L59l08j2J8J59K0K41m20K38p6j79J18k17J96o3J18k74O03l76k8o2k93
7705c97M32j22K77k0n8ml79J54K03M42m72O6j41K40k7l09K40l30K52P7j41K3K05
7728B11j07k77J93j9K87j40j25R0q6k26J89J03J78m73J99R1j78N7j76L62j2j62
7750b1M5m8J99k34L90n03J62K09j15j87k69L26k49L3L95L2jj24Qq8r8K18L2j20
$$ plain form
7593 -60 51 -51 -137 -180 -120 -354 -142 180 -62 -17 68 -206 -97 269 99 57 -210 41 162 -80 -62 205 -163
7616 -163 187 93 -57 33 54 76 -118 -142 -13 -27 -368 -338 187 -138 81 -18 -1 -168 -35 101 174 -24 -16 -126
7640 -126 -13 -214 73 256 239 197 -364 100 -51 84 -119 -119 -42 -205 -10 288 198 -151 156 177 -146 -15
7662 -15 -69 222 -113 231 267 -255 -10 -50 137 -8 -630 82 189 -251 -60 -183 7 118 -93 103 -159
7683 -159 200 -108 -120 -102 57 77 318 -102 136 60 -119 -1 -218 -22 -85 33 -241 362 -14 -42 -104 -397
7705 -397 35 -87 190 170 112 108 -271 -117 86 528 56 122 -19 221 194 -115 125 -205 47 124 -17 6 211
7728 211 104 -173 20 1 288 148 23 113 27 -199 -10 93 271 -202 -3 88 -90 -33 -209 153 141 -21
7750 -21 24 -24 175 -59 331 -172 -10 199 84 -103 -372 -46 -295 -262 133 165 164 40 48 -40 -138 80 112 -8
7774hj13L25j64k0j39J84j42K44l27J88K33l12Q0%l88J17P8n2M14k0k61J35l48
7797b96R0J41J64l58K50p0J40KK35l04o7K06m21M06R0m7k08L02m98L40J12j89
7819B0K33k29l78M73k92J10o7k4L35k96j60K05J10p9k12K13P7J8N5m8r0Q3j67
7842a10J03oK03j84J12J8k34J51j41P8j7J54k29M5k14M34j13j96J28K20j31K03
7864B74k43k35J55k31J81K39m48L24o1J10J33j91J02K05n1m35K1K4Rj37L94k1
7886A18K7L2r5J25j97j51O9n3lo6M56n61K69k87L45p3L2QJ53j54k42J2K64o2j97
7911b31L88j89k56K03rK58j09k42M49l76J79R0l50L11r2L2k24j28M27k45L52l15
7933g7j03K36O7j17L29m57o7L82j00l17K70k76M6O62k70k6k58P8j39M0p0q8M47
$$ plain form
7774 -8 -121 204 40 20 -119 65 -77 167 -160 28 261 -51 29 29 -359 -242 -164 -216 198 178 -83 52 -296
7797 -296 -206 -65 99 -259 -9 -79 61 63 298 -6 -73 133 -288 118 208 161 -47 255 -243 97 209 20
7819 20 253 24 -354 119 -173 -63 -130 -154 181 -115 -275 -70 40 -39 -251 -38 39 57 112 64 -26 57 -110
7842 -110 -7 -13 190 6 118 136 -98 53 -88 -10 -27 127 -102 -57 -271 163 50 -146 -18 202 71 274
7864 274 31 -204 -49 -280 -99 140 -308 16 -45 65 198 7 109 314 263 -172 -151 -127 -118 -255 139 118
7886 118 145 177 82 207 10 -141 -72 -125 -128 -194 262 -299 -30 -317 28 -45 -13 -5 148 -6 -248 -236 28 -34 -231
7911 -231 157 -32 -288 -85 -94 164 55 -187 262 -114 65 155 -195 116 24 56 -168 -296 131 -114 238 -77
7933 -77 -180 56 123 6 335 -122 -189 193 93 -224 46 -230 -184 478 208 182 -76 2 -137 -97 -167 -255 192
7956A92k62j12M63m69M04J17l10J18n04K72N1m6J55j86m4J56K4j08R5k25O90l80
7978I1K1k14K43R3j80K79k5m06k4j77M79l69J99J6m16N84j82J41j58J3l20M50
8000A38p6k6J82n8k27J95j07k70K21J42L14m45J5p4j71J74m3J90K8l37K00k84
8022c19M87J60m74k5K76j14m16M31J33j11J7k81M30k05l10m0J72M3K8K76l97M08
8044A69L2j16n0L8P2l11k53M70l85K44L2j0K46m11L56l07L48j8j74q9j27K45J80
8067A81k23k3K63kjr7M7n6j48J42j53j79J46O7J92k11p1K82l23O9K38j65J25j90
8091i0J11k4k6R8k39K52j66L00j56O4l59N98l21o7J50k71J27m6O5J65J64k26J4
8114A17k02j88K18j30K98m60L71R8k5K61n13n0L24k58J76j20J48j31J42k32J60
$$ plain form
7956 192 -70 -182 281 -188 216 333 23 141 -363 -91 -40 -86 69 -117 -161 -5 19 -89 6 -219 471 91
7978 91 112 -102 141 234 54 333 308 -98 -122 -299 180 -189 10 26 -390 194 12 153 -5 8 -312 138
8000 138 62 36 218 160 -67 128 21 -249 -28 114 428 -17 -2 -76 -247 -73 -116 74 102 -235 -35 -319
8022 -319 168 328 -146 -171 105 -9 -425 6 139 28 45 -236 194 -11 -321 -361 -189 -146 -118 158 -239 169
8044 169 201 85 35 73 145 -166 -419 51 -334 -90 -58 -68 178 -233 123 -184 164 146 -28 -117 -244 1 181
8067 181 -42 -65 198 196 195 98 145 89 -59 83 -70 -249 -103 -36 156 -55 -126 156 -167 -98 140 -25 100 -90
8091 -90 21 -3 -29 69 -170 82 -84 216 60 124 -235 363 42 -25 125 -146 -19 -65 0 165 329 103 117
8114 117 -85 -273 -55 -185 113 -347 24 122 97 358 -155 -205 119 -139 37 -83 65 -66 76 -156 4
8135Dk7K43l84J99j72L00l78R6j27J61L13k59M5j3K9l4J06j00j30M41K3k73j48
8158h5k3r6K19Q1l87K92K01k22M72l85L7j39o6Oj02L07J3J06j32j71J11J61j35
8181F3n3R0m7j5k02L15k87J64K04j95
$$ plain form
8135 4 -23 220 -164 35 -137 163 -215 -119 -246 -85 228 -31 14 1 30 -4 102 2 -128 313 336 63 -85
8158 -85 -108 -204 15 96 -291 1 202 -20 452 67 104 -35 -101 -95 -197 110 123 229 97 -74 37 198 63
8181 63 10 100 53 38 -164 151 -136 28 232 37
8191C7
$$ Imaginary data points
##PAGE= N=2
##DATA TABLE= (X++(I..I)), XYDATA
0@%%%%%%%%%%%qJ6j6J6j6K1k9L2l7M5n2O0o9P9r1J04j18J35j53J72j93K16k42
34a28K71l03L36l74M16m59N08n64O24o91P67q51R46j051J172j314J480j678J918
53A025k217K603l126L873n027P080j1831M3846L200p6894K7355M7045k0485m5931
67b9484K9982L2729k7296k7586L0897J6362k7486j1083K8474J121k6279J409K6104
80A7864m836k1514O100J7863q701j5184P997J3164q296j0707O168J0662n316j0730
94e466L367J1445m506j2970M166J3798m381j4583N473J5099q195j5241R427J4267
108A1700j2292j3438J4572J1932j6697j0367J8782P406k1057n294K2079K127k2499
121a3046J656K2127m852k1173P733J8632j0735j6424J2623J3961j3273j0927J3339
$$ plain form
0 0 0 0 0 0 0 0 0 0 0 0 0 -8 8 -8 8 -8 13 -16 16 -21 24 -28 32 -37 42 -49 55 -63 72 -81 91 -102 114 -128
34 -128 143 -160 176 -198 218 -241 267 -297 327 -364 403 -448 498 -553 619 -695 785 -893 1025
53 1025 -1192 1411 -1715 2158 -2869 4211 -7620 36226 39426 -37468 -10113 36932 16447 -29484
67 -29484 498 33227 5931 -21655 9242 25604 -1882 -12965 15509 16630 -9649 -8240 17864
80 17864 13028 -8486 -2386 15477 6776 -8408 -411 12753 4457 -6250 -82 10580 5264 -5466
94 -5466 -2099 9346 4840 -8130 -3964 9834 5453 -9130 -3657 11442 3247 -11994 -2567 11700
108 11700 -592 -14030 542 12474 -4223 -14590 4192 11598 -9459 -14753 7326 9453 -13046
121 -13046 -11390 10737 5885 -15288 -7555 11077 342 -16082 -3459 10502 -2771 -13698 -359
134c59Q927j4054p120J3767N248j3566l136J2788K229j2039r4J0963r89j0715
148h150J576R622r44q391P43R403j331r027J116R757j662r935K305J0434k932
163B584r699M422R672n618r335O636R382p958q324R007Q220j0100o548J0744N856
178H941j2056m134J2944K234j2594n16J3064j818j2349L237J1350m578r825N410
192f90R170o071q105O864P155p814n988P528N425q625k974P926K714q128j995
207c608P488J082o963j207P159M89o931L1O471L89p496K21P194m11p955J413P401
224D767k079p726L117P095l885o941M523O080m874o092N742N246o756m394O971
239G94M152p612l884Q398K418q776m01Q024k39q033J204P171j741p247K961O654
$$ plain form
134 -359 8568 -5486 -12606 1161 6409 -7157 -10293 2495 4724 -7315 -7409 3554 2565 -8150
148 -8150 -6574 3048 2104 -6287 -5544 3859 2528 -6499 -5383 4374 2712 -7223 -4918 5516 2584
163 2584 -7115 -2693 6979 1361 -7974 -1338 8044 86 -8238 769 8989 -1111 -7659 3085 8941
178 8941 -3115 -7249 5695 7929 -4665 -5181 7883 6065 -6284 -3047 8303 3725 -6100 -690
192 -690 8480 2409 -5696 1168 8323 509 -5479 2049 7474 -1151 -4125 3801 6515 -1613 -3608
207 -3608 3880 4962 -2001 -3208 3951 4440 -2491 -2460 4011 4400 -3096 -2875 4319 3908 -4047 -2634 4767
224 4767 2688 -5038 -1921 5174 1289 -5652 -1129 4951 77 -6015 -273 4973 -1783 -6177 794
239 794 4946 -2666 -6550 1848 4266 -4510 -4911 3113 2874 -5159 -3955 3216 1475 -5772 -2811 3843
255C843l371n544K905N791m298m873M517M514m728l858N069L530n468k418N143
270G54K124n403j434N095J517m980p22N077R80n905J9N498K5n971J116O132j444
287B478o101K259N699k874m808K716N040l216m429L743M131m155l430M315L325
302D693m977k880N721J992n283j717O069L12n359l56N694q23n065J174M794j318
318B671m716J707M476k017m626K560M399l211l755L164L443l511l045L640K706
333C885m009k444M426J626m008j626M114J207n016p81N010O5m737J53M639q11
349A693m738J209M517j927m306K111M139k470l613K558L202l060l103L128L188
364B528l876k319L455K228m272j296M235O01m058n62M228K32m046m63M531m25
$$ plain form
255 3843 472 -5072 -2167 3624 -674 -5547 -1030 3484 -1244 -5102 -33 3497 -1971 -4389 754
270 754 2878 -2525 -3959 1136 2653 -2327 -3049 2028 3008 -2897 -2878 2620 2645 -3326 -2210 3922 2478
287 2478 -3623 -1364 4335 1461 -3347 -631 4409 1193 -3236 507 4638 483 -2947 1368 4693
302 4693 -284 -3164 2557 4549 -734 -2451 3618 3930 -1429 -1785 3909 3086 -1979 -805 3989 2671
318 2671 -2045 -338 4138 2121 -2505 55 4454 1243 -2512 652 4095 584 -2461 1179 3885
333 3885 -124 -2568 1858 3484 -524 -2150 1964 3171 -1845 -2626 2384 2449 -2288 -2135 2504 1693
349 1693 -3045 -1836 2681 754 -3552 -1441 2698 228 -3385 -827 2375 -685 -3788 -660 2528
364 2528 -1348 -3667 -212 2016 -2256 -3552 683 1284 -2774 -3336 892 1124 -2922 -3385 1146 721
380G21m090O20M256j098m102J684L775j843l702K304L658l057k722K758K962l409
396a285k187L347K055l013j948L800J449l969q78L725Q82l640n11M391m57l766
412b005O73L811j111l522J370L565j770l127K004L356k262k807K479K482k548
427E88k598L362K036l236j617L124J176l103q38L520N07l265l35L300K8l499O3
444g87L624j21l829O87L405j019l748K086K864k181k700K441K078k314k780L108
460H14K126k633k405K999J713l497o83L071Q57l607m94L258m9l026L57K854n34
477A121l054Q51K866j182l060J477K892k150k643J989K568k566j789K136K136
492A592k788j628K728J371k861r42K518Q15k705p62K856P42l071k36K907O2l157
$$ plain form
380 721 -3369 -2749 1507 409 -3693 -2009 1766 -77 -3779 -1475 2183 -874 -3596 -838 2124 -1285
396 -1285 -3472 -125 1930 -1083 -3031 769 2218 -1751 -2629 1096 1978 -1662 -2173 2218 1761 -2005
412 -2005 -1332 2479 1368 -2154 -784 2781 1011 -2116 -112 3244 982 -1825 654 3136 588
427 588 -2010 1352 3388 152 -1465 1659 2835 -268 -1106 2414 2921 -344 -679 2621 2649 -850 -787
444 -787 2837 2716 -1113 -426 2979 1960 -1788 298 3162 981 -1719 722 2800 486 -2294 814
460 814 2940 307 -2098 901 2614 -883 -1566 1505 2362 -1245 -1739 1519 1470 -1556 -1199 1655 1121
477 1121 -1933 -1082 1784 602 -2458 -981 1911 -239 -2882 -893 1675 -891 -2680 -544 1592
492 1592 -1196 -2824 -96 1275 -1586 -2528 -10 805 -1900 -2662 194 936 -2135 -2371 536 598 -2559
509b559N14L214j083k621J220K538j383k422J214K351r42k175J769J873j857k340
525b689K517J698j975j828K934Q37k831n13K878M47k696k01K827j28k290M8K516
542A551n29k659J332K430j063k579J460K570j571k566K491J297j799j541K033
557H57J228j683j482K115J254j985j349K399J073k906r9K920n26k330J15K606
573B207m95k714P51K639j061k438J274K038j317k131J145K277j382k165K061J399
589B088k205j519K497J188k591r33K643J17k462m27K575N3k468O4K366l22k416
606a752P10K180r53k315J068K250j020k230J280J795j394j507J256J612j972j160
622b152J709J244j963r81K303Q28k346q10K256N20k252j46K349j98k120M53J932
$$ plain form
509 -2559 -2045 1169 86 -2535 -1315 1223 -160 -2582 -1368 983 41 -2134 -365 1508 -349 -2689
525 -2689 -172 1526 -449 -2277 657 1494 -1337 -1850 1028 1475 -1221 -1422 1405 1277 -1013 -965 1551
542 1551 1022 -1637 -305 2125 1062 -1517 -57 2513 942 -1624 867 2164 365 -1176 857
557 857 2085 402 -1080 1035 2289 304 -1045 1354 2427 -479 -578 2342 1816 -514 -399 2207
573 2207 1712 -1002 -251 2388 1327 -1111 163 2201 884 -1247 -102 2175 793 -1372 689 2088
589 2088 -117 -1636 861 2049 -542 -1475 1168 1285 -1177 -1604 971 1024 -1444 -1380 986 664 -1752
606 -1752 -1042 1138 185 -2130 -1062 1188 168 -2062 -782 1013 -381 -1888 -632 980 -992 -2152
622 -2152 -443 801 -1162 -2143 160 988 -1358 -2168 88 608 -1644 -1790 559 361 -1759 -1306 626
639F26n02j912P84J783p50j583O70K225j351j862J561K036j993j476J957J093
655A306j878l92J792N32j857j092K458K69j585k64K004n4j744J44J786m19j866
672h60P90K092j178j717J265J531j647j150J288J274j110j410J682Q82j512o41
688d21J407J021j937n63J707M29j693k61J835j0j996O0J847l96j718J002J091
705A404m65j910J025J715j187j725J064K108j922j696J900J283j784j081J847
720E76M76j555j006J961L87j830l53K534o34j904L47J603j97j795Q63R36n95j380
738a566R65J177j210q88J135Q37r52q23R79P45j118o85R66R47j264j109J932J51
756B19j403j12J332K44j672K57J449l6j577j51K219l10j914Q41J311n52j711R52
$$ plain form
639 626 124 -1788 -1004 779 29 -1554 -884 1341 -10 -1872 -311 1725 -268 -1744 213 1306
655 1306 -572 -964 828 1360 -497 -1589 869 1138 -447 -711 1293 1239 -505 -361 1425 1006 -860
672 -860 -70 2022 844 -873 392 1923 276 -874 414 1688 578 -832 850 1732 220 -421
688 -421 986 2007 70 -493 1214 1643 -50 -311 1524 1514 -482 -422 1425 1029 -689 313 1404
705 1404 939 -971 54 1769 582 -1143 -79 2029 107 -1589 311 1594 -190 -1271 576
720 576 1052 -503 -1509 452 839 -991 -1344 1190 556 -1348 -1001 602 405 -1390 -527 409 -186 -1566
738 -1566 -601 576 -634 -1522 -387 450 -502 -1325 -346 399 -719 -1404 -438 509 -755 -1864 68 219
756 219 -1184 -1296 36 280 -1392 -1135 314 278 -1299 -1450 769 459 -1455 -614 697 145 -1566 -614
774f14J575j013j477J612J224j651j197J873N95j058o43J339N47j641n5J282N48
791A246j933L11K049r92j349O78J174l97j497R86P54o21q31Q40P28n63j092J077
809E68P36p73q62Q85Q16q87q94J308N10j318l30J142N11j481l30J431J69j498
827b97j18J587j00j924R23J325p34j474N81J510p23j219P37J233r80j584J425
844A68R15j361n86J312M41j045q29J545k6j516J09J398k91j403O33J128o34q69
862i11J83J102p91n51N63J209j020r71Q61K98n13q14Q86Q12r58q36Q92Q35q49
881e73l50Q79j9n32o02R29P82j187m54J326Q3j280J48J406l23j311L50J401q49
900a76p42M39J259j047n60P41O18n94j077J324Q27j253l29J054L30j440J57J506
$$ plain form
774 -614 961 -52 -1529 83 1307 -344 -1541 332 927 -131 -774 565 1112 -529 -584 698 1246
791 1246 -687 -376 1673 681 -668 10 1184 787 -710 276 1030 409 -422 418 1146 583 -509 568
809 568 1304 531 -331 554 1370 483 -411 897 1407 89 -241 901 1412 -69 -399 1032 1201 -297
827 -297 -415 1172 1072 -852 71 1396 662 -812 -231 1279 556 -663 74 1307 327 -1257 168
844 168 1083 -278 -864 448 889 -156 -985 560 534 -982 -873 525 234 -1169 -536 592 -42 -911
862 -911 -728 374 -417 -968 -405 804 -216 -1187 -326 -28 -541 -1355 -469 343 -615 -1451 -559 276 -573
881 -573 -923 -44 -63 -595 -1197 -268 514 -673 -1127 199 282 -998 -850 556 233 -1078 -728 673 -176
900 -176 -918 -479 780 -267 -827 -86 532 -62 -1139 185 1012 -241 -570 484 814 -626 -469 1037
918A037l23j133J96J117l68p00K47P10m16o69N10O85p2j047M71O28l72p19O66
937D48N55n15j151J076K03j60r24J120K03j009l23J116M84j333O8J004oj263J92
956b15J013K39j590N42Q72o51p41L78J006o97o09M50P02q18j026J246L24p47m56
975g78R51M22j371j47J210j38r21M56L85R4q21J11N86J68j237K34P96kj167Q36
995c33M01j31q39L91P15m83p64N67Q15o19r78J168L23q19n71R37M84o30o27P81
1015b12L99p15l8O54M0j191N50P52p4r55M67J012n01q31N58N85n98n26N58L25
1035B59k82m89Q46K73p04l65P48M03j013k4J190k88o48k05J057k15n95J49O30
1054G27o6j068P40N36k71r13P73J81k59n14L35P82m33m34J09O56n16n18P22L30
$$ plain form
918 1037 714 -419 -223 894 526 -174 73 783 367 -302 208 893 821 -226 245 873 501 -218 448
937 448 1003 488 -663 413 616 456 -468 652 855 -154 -477 639 1123 -210 -142 862 856 -407 -215
956 -215 798 1037 -553 -11 861 210 -531 -153 853 156 -453 -3 699 -119 -1145 101 425 -322 -778
975 -778 173 595 -776 -923 287 149 -772 -316 69 163 -658 -547 39 207 -1030 -796 0 -2 -1169 -333
995 -333 68 -63 -902 -511 204 -279 -1043 -476 339 -280 -1258 -90 233 -586 -1157 -220 264 -366 -993 -212
1015 -212 187 -528 -566 88 128 -1063 -513 239 165 -790 -323 689 188 -643 -85 500 -98 -624 -66 259
1035 259 -23 -512 334 607 -97 -462 286 689 -324 -348 842 554 -94 -299 758 543 -52 97 727
1054 727 661 -407 333 869 598 -315 458 639 380 -134 201 983 550 116 225 881 365 -153 569 899
1074H99j120J1Q63M0n79k10P87k26q00KP73j16o84N5J149l12q59L35M41m86m71
1095e08J96Q62p26n88Q28O67r39n11R67P0n57m97R71j52r25R9R95k73n13J35O54
1116B55j31j115L10Q94l27o15M85N19n79o70O91M08n49m03M51N45n49k76O62N8
1136F4k83n09Q99k6o45K46M75l1p40J62P64n21n16M30O43j02r33N00P19j75p82
1157c61M40M40jj109O78N48p18l62J139j00l71o56Q58o0l12J1N11N4n89l2Q32
1178H40j58n95j20Q78j37p65N51J87m11n64N76K76j14j48n0N36j34j062M32Q74
1198H92o88k96R40J7q33l38Q20J52j082L62N37J09p79j75J053k80q49k97J143
1217D08J23r76M73L18l73l46O18L17q45k31M8N34l33l48O80R6n38j43L23J89n29
$$ plain form
1074 899 -221 -210 653 693 114 -96 691 465 -335 -333 440 324 -360 -305 844 532 -327 8 449 -37 -508
1095 -508 -312 550 -176 -764 64 731 -208 -719 248 318 -239 -736 235 83 -842 -743 252 -21 -534 -399 255
1116 255 124 -991 -681 213 -114 -729 -244 275 -304 -974 -283 125 -424 -827 -376 169 -380 -656 6 64
1136 64 -219 -728 171 145 -500 -254 221 190 -550 -388 376 -145 -661 -231 412 310 -623 -123 596 421 -361
1157 -361 79 519 518 -591 87 635 -83 -445 694 594 223 -433 425 365 53 64 575 629 40 8 840
1178 840 682 87 -33 845 708 -57 494 681 270 -294 282 558 444 296 246 782 648 -414 18 892
1198 892 204 -92 848 865 32 -306 514 666 -416 -54 483 592 -187 -362 691 411 -438 -735 408
1217 408 531 -445 28 346 -27 -373 245 562 -283 -514 -466 68 -265 -613 67 163 -375 -518 -195 -6 -535
1238e35j73R34k83l79j41L18k02l80O50J79j12m58K72L50n90j0L9P08k48n34L09
1259b86J38k15j18O10k00m52m02O10L56n25M42K63j3p09K14L79J50l40l93R36
1279D45m42l47m2N76j3r38J054L24m59m24N24J35m12l5K87J36l41j22N51j8k13
1300B26j38M49j91j58j89O12p0p15K53N95l57l34J15L40L06p39N62Q9o01k45M12
1321B22Q0l96k00P75M7n25k32N91o1m52p8P61j97n92k8N55k0k74l61O40J55p77
1343c67K26O70o54o1o5K22j87mj67N87n13k89O17K32l21j15J16K81n44O7L63k33
1365a39n09L22K64j44l77J57N02k6l17K17J58l61j82R5O18m80l31L48K45m40n32
1386i12R36l05j41k04O50k04n3m7L73L54m65l66M24J22k55k32M02K71l91k86L85
$$ plain form
1238 -535 -708 226 -57 -436 -577 -259 -461 -841 -191 -12 -124 -582 -310 40 -550 -560 -521 187 -61 -595 -286
1259 -286 -148 -363 -481 129 -71 -523 -925 -315 41 -484 -42 221 208 -501 -287 92 242 -98 -491 445
1279 445 3 -344 -386 190 177 -761 293 617 158 -266 258 393 -19 -54 233 369 28 -94 457 439 226
1300 226 88 537 346 188 -1 611 541 -174 79 674 317 -17 98 438 744 5 567 656 55 -190 222
1321 222 302 -94 -294 481 528 3 -229 362 301 -151 -229 532 335 -257 -285 270 250 -24 -385 255 410 -367
1343 -367 -141 529 -125 -186 -251 -29 -216 -220 -387 200 -313 -602 15 247 -74 -189 -73 208 -336 -269 94 -139
1365 -139 -648 -326 -62 -206 -583 -426 76 50 -267 -50 108 -253 -435 -340 278 -202 -533 -185 60 -380 -912
1386 -912 24 -281 -422 -626 24 -180 -233 -280 93 447 -18 -384 40 162 -93 -325 77 348 -43 -329 56
1407E6K67l06J1L62m55l5K27J20J77o70O10J50m06k38N39L6p52K17O08k62k64
1428hJ41K47J18m04J77K14p1m98K40K81j35R7p0J29m35k20L63L33j02n44M77l
1450C27j76P0J08J61n42j77L79L16q02j14N75J49o15KL45J38k89k58K94J80n15
1471d44K79L51n2k30k04N06n37j92M53L23m12k12K78L83n44k49R07n95j78k55
1491f24N66j46k82k0N53l02QJ00J07l10k83M37J12r8j02k68N85m82J22L64n9m19
1513d41L01M51k71l59L08J1J26r03Q83o6N3j38m94O25K3m57M40J70j77P3K5O0
1535B43o1m82L32M01j88l24L07K28l40j16O24k69l55j37O23l22M1j27L63k46k39
1556d4K13M34l33k11J19N0J19k97J92L5q2l06M24l47j15R5J68M79n40j12N2K83
$$ plain form
1407 56 323 17 28 390 -65 -100 127 247 424 -246 364 514 108 -130 409 445 -307 -90 518 256 -8
1428 -8 133 380 498 94 271 485 414 -84 156 437 302 399 329 458 23 -197 166 499 397 -147 330 327
1450 327 151 221 329 490 -52 -229 150 466 -336 -450 125 274 -341 -339 6 144 -145 -403 -109 71 -444
1471 -444 -165 186 134 -96 -300 206 -331 -523 -70 253 -159 -371 -93 290 -254 -503 404 -191 -369 -624
1491 -624 -58 -204 -486 -506 47 -255 -247 -147 -40 -350 -633 -196 -84 -182 -284 -552 33 -449 -327 37 -22 -441
1513 -441 -140 311 40 -319 -11 0 126 -777 106 40 93 -45 -539 86 109 -348 92 262 85 158 183 243
1535 243 182 -300 32 433 245 -79 228 456 116 0 624 355 0 -137 486 164 205 78 441 195 -44
1556 -44 169 603 270 59 178 228 347 50 242 277 195 -111 313 -34 -149 -54 114 593 53 -59 -7 276
1578B76n4k55O3O1J34n43J41N44l97l72P67J78q64K58K45Q2m50J49K11j62m03
1599c91L56l5k2P1k07L00M0n37L37L27n93j93N12N9l54j23K19l27L70l53N97j39
1621h6k06q4J51K30j59k2K52l18j81J26Q7j6l23K78L45k99J9J17p0J6l47L97L69
1644B76l36l54L51L79l22m5R2LK2k48K86J19m87L30K75l74l17N62R7l45J92j12
1666D4L70L5m71M74k04l12J40N67k92k08J25ok66J81LJ92k25o5Q2M00k11m24K88
1689B17J41L29j048N69K14m53L28r8J04l81J48O7J5k19J45Q9n6q5J9J47K2k35
1711b1j8Q2J34j38r4L33O1l74N0M8K11l06L6j80o5j55J56R6k9k17L27K91k15l74
1735c61R7K24k90j99L26L03j01l01r7L99k76j64N15l5j18P9k61j0J43l05L04K55
$$ plain form
1578 276 222 -33 30 91 225 -318 -177 367 -30 -402 365 543 -321 -63 182 264 -186 -37 174 12 -391
1599 -391 -35 -70 -92 -21 -228 72 112 -425 -88 239 -354 -547 -35 24 -330 -453 -234 -561 -191 -544 53 -86
1621 -86 -292 -376 -225 5 -154 -176 76 -242 -423 -297 -210 -226 -549 -271 74 -225 -206 -89 -159 -143 -490 -93 276
1644 276 -60 -414 -63 316 -6 -51 41 44 66 -182 104 223 -264 66 341 -33 -350 212 309 -36 156 44
1666 44 414 449 -22 452 248 -64 76 643 351 143 268 262 -4 177 180 372 147 82 164 564 353 -71 217
1689 217 358 687 -361 208 422 -31 297 199 303 -78 70 137 152 -67 78 167 111 26 45 192 214 -21
1711 -21 -39 43 177 39 -55 278 339 -35 15 63 274 -32 4 -176 -241 -396 -240 -144 -173 -390 -63 228 13 -361
1735 -361 -264 -40 -330 -529 -203 100 -1 -302 -399 0 -276 -440 75 40 -78 1 -260 -270 -127 -432 -128 127
1757A27o18K00L80J8j87j34L66k88J14K6j06J32Ll75M97k24j1L13J23k40n4p1
1779ik30p0j11O19K03p55M98N7l9l46j02P62j04o65O31j49l70M42J40j11j10m4
1801A37K30O8o33L83l17O59n00j4M4O8k14N6j9P4r6L1N55l70J68j88L19l63n94
1824e16N04K48k29j16M08J18l07n09M85K80n82J37J64K54l09j25R6j12J38J5K47
1845B89l92R1k33J66L02l67j73N54n44J9j76N98o0m74M1M33k01j88p0N90o00K10
1867a85j06J35M0k3jK62l12K21l2j04k58K25P2m71K65j8J4J33J41j87L92k44k79
1890c20L92K42l99j88K11R6Mj30J25J49k90k71M39P7L1m57O23k48k05j98L40K3
1912D6J00N9k44L0j66L29k24M03k76n8M37m06J36J15J28k79N7j42L31j96q1J46
$$ plain form
1757 127 -491 -291 89 107 -80 -214 152 -136 -22 4 -102 30 33 -342 155 -69 -80 233 356 116 62 -9
1779 -9 -239 -309 -420 199 402 -353 145 202 163 -183 -285 477 373 -292 339 190 -180 262 402 291 181 137
1801 137 367 435 -198 185 -132 527 27 13 57 125 -89 -33 -52 22 -74 -43 512 142 310 122 441 78 -516
1824 -516 -12 236 7 -109 299 417 110 -399 86 366 -216 -79 85 339 30 -95 1 -111 27 42 289
1845 289 -103 -12 -245 -79 223 -144 -317 237 -307 -288 -464 134 74 -400 -359 74 -127 -315 -385 205 -395 -185
1867 -185 -291 -156 -116 -139 -140 122 -190 31 -1 -105 -363 -138 -66 -537 -272 -290 -276 -143 -2 -189 203 -41 -320
1890 -320 72 314 -85 -273 -62 34 38 -92 33 182 -108 -379 60 137 168 -289 334 86 -119 -317 23 46
1912 46 146 205 -39 -9 -175 154 -70 333 57 -1 436 30 166 281 409 130 187 45 376 180 99 245
1934B45k39O6l35P49l96l10L36J30QOj11J68j81J7j54P4L58m04k27P2K30k69K40
1957G3J55l60j5M0O03m48l7l4j57Q3J17Q8o3p4j74J62J06m21J69J47m6Rj95M28
1981A56l0o09K81M45j65r9k51M5R2M2j92K5j29Q1N5k46K24J12J82j45q5M9M5K88
2005A71l35L23l14K53j76o5N07m69K25l20J7O3j77N51j14m88L03M02n76J3J68
2026c8P1J90k05k29M97r1k05NN2oj03J69O3R7k63l1j18P18m75l13N69l55k06L55
2050A48L57k88j26J99k5k60J18J7j53l0Q8K78j27l12L55j96j11J09O9k9k8l51
2072b98L40j21o5j04L40p4J5K6J99l16j06J75k96K75j05Q8J40Ql52j40J19K23
2094b9J49m32J31K90k92J28j37L19j13N0k49j36K09k03K25N0j03J21k85P0j62
$$ plain form
1934 245 6 72 -263 486 90 -220 116 246 254 260 149 317 136 153 -1 73 431 27 -200 -128 102 -167 73
1957 73 228 -132 -147 -107 496 48 11 -23 -180 -97 20 108 45 -29 -203 -41 65 -356 -187 -40 -86 -77 -272 156
1981 156 126 -483 -202 243 78 -21 -272 -227 -135 -93 -285 -260 -389 -308 -253 -499 -275 -163 19 -126 -211 -162 -117 171
2005 171 -164 159 -155 98 -78 -143 364 -105 120 -200 -183 -120 -297 254 140 -348 -45 357 -219 -206 -38
2026 -38 33 223 18 -211 286 195 -10 -5 47 41 -62 107 170 267 4 -27 -145 573 98 -215 354 -1 -207 148
2050 148 505 217 91 290 265 5 123 140 -13 -43 45 323 196 -116 239 43 -68 41 110 81 53 -298
2072 -298 42 -79 -144 -248 92 18 33 59 258 -58 -164 11 -285 -10 -115 -27 113 121 -231 -371 -252 -29
2094 -29 120 -312 -181 109 -183 -55 -192 127 14 64 -185 -321 -112 -315 -90 -40 -143 -22 -307 -237 -399
2115c99L57K19m61r1M01J26o30M43K9j11P1j44K9k83K91j5L52k22j07k9M41m09
2137a42P3J40k26K69L7k41J52M6Q3L84p60J83k96M61m02K18K06k24J36j69j16
2158a88L62k80L79J55m54K96l45q9N93m61q3K69J23l09J70J71j31j48J10k05M52
2179C87k78j28K98l50j47N56l73l3J05K39k85k32J39o7J9K82m57K61N89k10m55
2200a40k21M60J57l60QQ8p0K7n3J44j62r9J32n7j09J35p4P2K2k45M37l34J87j03
2224a58J04J81j2m31J91J50K57k51l32O49l85l48L10n1j3J56l26Q5J85j07J45
2245aq4J8nJ72k55q2r5L87O3m78K60p2j35L58j7J16j62Np2o6l5J34L90l73o9L05
2271B07l87J81q7j88L30j47P9K31k77L96k56R4j02o6J54j7J33k96Q9J97j17J11
$$ plain form
2115 -399 -42 177 -284 -375 26 152 -478 -35 -6 -117 -46 -190 -161 -444 -153 -168 184 -38 -145 -174 267 -142
2137 -142 -69 71 -155 114 151 -90 62 108 191 575 -185 -2 -298 163 -239 -21 185 -39 97 -72 -188
2158 -188 174 -106 273 428 -26 270 -75 -164 429 -32 -115 154 277 -32 138 309 178 30 140 -65 387
2179 387 109 -19 279 -71 -218 338 -35 -68 37 276 -9 -241 -102 -169 -150 132 -325 -64 525 315 -140
2200 -140 -361 99 256 -104 -96 -8 -78 -51 -104 40 -122 -221 -89 -146 -255 -120 -194 -122 -100 -345 92 -242 -55 -158
2224 -158 -54 127 115 -316 -125 25 282 31 -301 348 -37 -385 -75 -126 -139 17 -309 -224 -39 -146 -1
2245 -1 -85 -67 -72 100 -155 -237 -332 55 118 -360 -100 -172 -307 51 34 150 -12 -7 -79 -145 -180 -46 344 -29 -98 207
2271 207 -180 1 -86 -274 56 -91 -12 219 -58 338 82 176 74 8 162 145 278 -18 71 268 151 262
2293B62l86M34l15J70K80j63l24M23Rk40j5j69J07K6j03m0m7J55m8Q6o0J42k19
2316c5k55L07K44k99M5M6R9k09n5j37O42n66m1J42K44j79kM2k44O7P1O0k02o9
2340b84Q3K59k41J06R7k08M6O5J44j66k16L17P9J29n91K48K9K69k77P3j49l8K69
2363D3j84P3J17j33PK46k01k73L02M18n76J48q7J26l78j12K84k2K30k61j0L79
2385A36j67j73M55m68J50n8k0O2k01L55j0Rj16l7Q5k20L85k52J82n1K62K0l23
2408Eq4J59o2O7P2J18j36Mn05J77J36O6O9j79M35l48O1r9L54j72k67J48J55l12
2432a38J0L24k21J08R1j09Q9j94N0J42O1nl16K64j07k51J00K48k60J20j90L8K28
2455H2PJ43l93R4J91l27J18O7j46o6M34m26k98N74J03r5r3k0K35l76J15k6p1n7
$$ plain form
2293 262 -124 310 -5 165 445 282 -42 381 390 150 135 -34 73 99 -4 -44 -91 64 16 102 42 184 -35
2316 -35 -290 17 261 -38 7 53 152 -57 -112 -249 393 -173 -214 -72 172 -7 -9 33 -211 -144 -73 -13 -215 -284
2340 -284 -201 58 -183 -77 20 -188 -142 -77 67 -99 -315 2 81 210 -381 -133 -104 165 -112 -39 -188 -226 43
2363 43 -141 -68 49 -84 -77 169 -32 -305 -3 415 -161 -13 -100 26 -352 -464 -180 -202 28 -233 -243 136
2385 136 -31 -204 251 -217 -67 -125 -145 -83 -284 71 61 70 -46 -83 2 -218 167 -85 97 46 308 328 5
2408 5 -79 80 18 85 157 275 139 143 -362 -185 -49 17 86 -93 342 -6 55 -44 310 138 -129 19 174 -138
2432 -138 -128 196 -25 83 174 65 154 -40 10 152 213 208 -108 156 49 -202 -102 146 -114 6 -184 -146 82
2455 82 89 232 -161 -67 124 -203 -85 -18 -164 -230 204 -222 -520 54 157 62 -31 -51 184 -192 -77 -103 -174 -231
2479b31L16l35L84l09J57J30k19K0NJ54l16o5L09K36l80p8J21L7O9j22J59l53
2501c11J94L57k53k1j34J20Q5l13Q4L96k35j47Q7N2L66l06L2o9j45M50k75J81
2523A95o56P76p2k10K77k77K05k5j33j82P3M11p11K29L00k17K22j74K21l05K45
2544A92j68K65n42L71j44l6O5nj5M10j58m4q7j10L09n37K82L03k12O1M7n69O15
2567B93n35J72L70l97J26L8o3P5l64J04O38l79k1j93J1K19o38O47L4J64n57K64
2589Hj77j85K2L96Q9l76nK32p0j47J8n7J95n0j28J08J65k89L36j32j46k38M64
2612C3k30L34J14n21J70k21o4M37l7J17l77N89k21n6Q0j85K48m20J98K86k84m6
2634e6K47m0P1m72K30L17k76l8r7J91k35j3K33j87M0J95q2K01n09J59M28j60j38
$$ plain form
2479 -231 85 -250 134 -175 -18 112 -107 -87 -82 72 -244 -309 0 236 -144 -222 -101 -64 5 -117 42 -311
2501 -311 -117 240 -13 -34 -168 -48 37 -276 -192 204 -31 -178 -91 -39 327 21 53 -16 -161 289 14 195
2523 195 -461 315 243 33 310 33 238 213 80 -102 -29 382 -329 -100 200 -17 205 31 252 -53 192
2544 192 24 289 -253 118 -26 -62 3 -2 -17 393 235 191 104 -6 303 -234 48 351 139 200 247 -322 293
2567 293 -242 -70 300 -97 29 67 4 79 -285 -181 457 78 57 -136 -125 94 -544 103 137 301 -256 8
2589 8 -169 -354 -332 64 153 -223 -228 4 -66 -213 -195 -252 -57 -107 -235 -127 38 -251 85 -47 -193 -431 33
2612 33 -197 137 251 -270 -100 -321 -385 52 15 132 -245 344 123 67 147 -38 210 -210 -12 274 -10 -56
2634 -56 191 151 222 -250 -20 297 21 -17 -114 77 -158 -171 62 -125 -85 110 28 229 -280 -121 307 147 9
2657Ik02J25J09m8k50k1K00j1J09J71N5n8Q6p8j15j84L46oj98k7L71l92m5q9j77
2682c20M18K1j79j1K01Q5q9m2M92n26j78K00k27J73o2P1K28O1q7l44j80J06J88
2705ak56J41M90m31k16K67l53L01L3J10o8J88m8r9j18K97k00j57k13j4J61k00
2727c86O42m66J64K3R5k18l9J25l00M51j30j36j54J06K37l00L2L68n69N81j47
2748b1N6l20J78N0J69m73M58L9j28J1K67q5m7j74o5K8k1K72l64M7j6rM05j36J30
2773B51r9j00j63J97o2K72m9p5o4M5l19L55l39L95J36k69rj83J65L0Q4j2k46k04
2797b63L40j34M59k84m4j4k33K70j33J36j56J09j30O7n0K10j73K61J1J4k07K61
2819C17l59K68j86j63L17k91K30j78L55m55L54p4K20j51j44k84O1M57k97L10j39
$$ plain form
2657 9 -193 -68 41 -7 -257 -278 -78 -89 20 191 246 188 274 196 81 -103 243 237 39 12 383 -9 -54 -143 -320
2682 -320 98 119 -60 -71 130 215 126 84 576 50 -128 72 -155 18 -44 27 255 316 229 -115 -295 -189 -1
2705 -1 -257 -116 374 -57 -273 -6 -359 -58 -25 85 17 205 157 58 -60 237 37 -120 -333 -347 -186 -386
2727 -386 256 -210 -46 -23 72 -146 -185 -60 -360 91 -39 -175 -329 -223 14 -286 -254 114 -455 126 -21
2748 -21 35 -285 -107 -57 112 -361 97 136 8 19 286 201 154 -20 -85 -57 -78 194 -170 -123 -139 -148 257 121 251
2773 251 152 52 -111 86 24 296 247 172 108 153 -166 189 -150 245 381 112 103 -80 85 115 199 187 -59 -263
2797 -263 77 -57 402 118 74 60 -173 97 -36 100 -56 53 -77 -10 -60 150 -23 238 249 263 56 317
2819 317 -42 226 40 -123 194 -97 133 -45 310 -145 209 135 355 204 60 -224 -163 294 -3 307 168
2840A68j52J98j94k31N47r9l39KJ58l07M0K53o0l28K03J86j54l2L8R5K11m15J24
2863h8n9j41j00O88r8l72p5j7K12n5O4j26M31n27K59j18q5J19k60K22L74j59n4
2886C5k3m9R8J51M7j64R0n0j66k3L5p2K5j59N09j36k3n5r0j09L60k38K32l02L15
2911B38j77N6m24L20J97k61J7N50m88j01j21L74k34P9j57L65k44K0J6j58QJ18
2933gl9J49n1j94M3L05j38k94N8L34j41l1K85j07k40kK55J09k10K6k54l5NjK71
2958I6j19j44L58j40l29J35J17o6M55m85J02j0n5j29K51Pj67r5L41k07L8K97k0
2981B31k21l40p3N49l20J51O4j01j24J31r9J96L13k66k12Q7J07O8Mk71K16k21
3003a31K23l64J05J66O5m7L7q3n9l8K42j0mp8p6q9L51r%Mj50J23L6l89oJ34J45
$$ plain form
2840 168 16 214 20 -211 336 237 -102 -100 58 -249 -209 44 -16 -344 -141 45 -109 -141 -103 -8 203 -212 -88
2863 -88 -147 -288 -388 300 202 -170 -245 -262 -50 -105 -41 -167 264 -263 -4 -122 -207 -88 -348 -126 248 89 35
2886 35 12 -37 61 212 259 95 185 135 -31 -54 -19 -91 -66 -225 284 148 125 70 -20 -129 231 -7 225 -77 238
2911 238 61 117 -307 13 210 -51 -34 516 28 -73 -194 180 -54 25 -132 233 -11 9 25 -133 -125 -7
2933 -7 -46 103 52 -142 -99 206 68 -226 -168 166 25 -6 279 172 -68 -70 185 294 84 110 -144 -179 -174 -175 96
2958 96 -23 -167 191 51 -278 -143 -26 -92 363 -122 -20 -30 -85 -214 37 44 -123 -218 123 -84 -46 251 231
2981 231 10 -330 -403 146 -174 -23 41 -60 -184 -53 -152 44 357 91 -121 -34 73 141 145 -126 90 -131
3003 -131 92 -272 -167 -1 64 17 54 -29 -88 -126 116 106 102 24 -52 -141 210 201 201 205 55 178 214 -175 -181 -47 98
3030I8j44J07K11l97K70k44n1M26j6l71J11q2K06K0l34J80j7q8J14N5j20n4J61
3053D1N8M5Oj50o3J24K51k77J59l95j29N73j72k6j40O8J19M26o01M4k96M70j78
3076d3J82r9K94k10R1k82M8p7%O4j57l5L43Q7j38m7r4J53j6J10l20M6M58n41J30
3101e3j68J66Q8R3l83J02K43J6j26nj09l5N8k68L98R6l79J78m5o6J30Q7K4J02
3125A44k26m2O4m1j2l3K38l00r5O30k40j52o9q9J45L8P2K14m9l30J23J55j13j73
3149a41n6J77k10M16l29k87M84K17j42k3N5J08m82N9M41m34K12j62K21k11m11
3170d98M79L37m27q2m5K87O0N1m1J79l38J20J81k77J25O5o9k61J13J88R0r6k34
3193i3m4M21P3n24j01K72k47J92r7R5J77m27L12j13J75k11N47n35j53J07J12p8
$$ plain form
3030 98 -46 61 272 -125 145 -99 -150 276 260 -111 0 -82 124 144 -190 -10 -27 -115 -1 54 -66 -120 41
3053 41 99 144 150 0 -63 61 312 35 194 -201 -330 243 71 45 -95 -27 92 518 -83 -39 -335 135 -43
3076 -43 139 40 334 124 215 -67 -19 -96 -96 -32 -189 -224 119 206 68 21 -73 80 64 174 -146 -100 358 -183 -53
3101 -53 -221 -55 33 126 -257 -155 88 104 -22 -27 -136 -171 -113 -381 17 113 -266 -88 -133 -199 -69 18 42 144
3125 144 -82 -124 -60 -101 -113 -146 92 -208 -303 327 87 -65 -134 -223 -78 -40 32 246 197 -133 -10 145 32 -141
3149 -141 -197 -20 -230 186 -143 -430 54 271 129 106 161 269 -213 -154 287 -147 65 -97 124 -87 -498
3170 -498 -19 318 -109 -191 -236 51 111 162 121 300 -38 82 263 -14 111 176 107 -154 -41 147 237 141 -93
3193 -93 -137 284 357 -167 -268 4 -243 -51 -148 -53 124 -303 9 -104 71 -140 407 -128 -281 -174 -62 -140
3215a40J12J43l27P5K52j54r7K22o8j27l7K05l13K22j32Q1j84K25Q3k20R7N06
3237D24l80j2J6n48L34Q3j10K42j27p7k23L01L94k66k08K58l8Ml1l2o7J11R4K3
3261A65l88L36j31J42J36l15K95m09K25j47K59L2r4l97K98J80k06K95l69J68J99
3282B74l39N4K90l34K22m8K01k38k5l33J55J05K5J69l51L41j63J35l9k91J51j20
3304a59m5K4L62m08Q8R5j04o6j2L72j00k61J49K55l95K97j3j2j10p3k2K35K10
3327C07k34J8l1k47l95P20l4l86K69L22j50L1o60K63K33n1J44j09k9p0M94p85
3349c80M32m13K38K27q0k87K28r0J33j1j4o7r1J44K77n79K53L25l99m8P8J88k52
3372a88M52l04R7j64Q2R1J51j54k21LM46l82K99j78j75k4K59J37j01k11P6j36
$$ plain form
3215 -140 -28 115 -212 -137 115 -39 -136 86 18 -109 -146 59 -254 -32 -164 -83 -267 -42 41 -179 -82 424
3237 424 44 32 48 -500 -166 -83 -193 49 -78 -155 -378 -77 317 51 -157 101 63 67 36 4 -63 48 142 165
3261 165 -223 113 -18 124 260 -55 240 -169 56 -91 168 200 106 -291 7 187 -19 276 -93 75 274
3282 274 -65 -11 279 -55 167 119 320 82 57 -276 -121 -16 9 178 -173 168 5 140 101 -190 -39 -159
3304 -159 -204 -180 182 -226 -138 -43 -147 -213 -225 147 47 -214 -65 190 -205 92 79 67 -43 -116 -138 97 307
3327 307 73 91 60 -187 -582 138 104 -282 -13 309 159 190 -470 -207 26 -25 119 10 -19 -89 405 -380
3349 -380 52 -361 -123 104 24 -263 -35 -125 8 -3 -17 -84 -175 -31 246 -333 -80 245 -154 -202 -124 64 -188
3372 -188 264 -40 57 -107 -25 66 217 63 -158 -155 291 -91 208 30 -145 -169 90 227 126 -85 -9 -145
3394a45Q5J60k26M05j81j33J81k91K42r9k11p8L06mq7M5R3p3lP7p7N4P8l26L21
3419A13J97k65p6J38R1k79k8Q9r2P5J14k02O7J41j89Q8Q6l7j64J9j1j08N8J55
3443b0J30n4j35J72M6K54n56k1L4N87m60M29j92m03R1K58m44N93k07l18K74K22
3465B80l38M2L9j5K36m56P8J77K60o12J43r3M49j89j39o0Q6L3J02Mj80m2M65n47
3489b77J81j09K49P6k59J06K31m40N5L94j53p5K40ll79J17j96J85m7O6J39q1J87
3512B07N5m03j41L67l31J60m7L31j69K4Q9O2k75k33K82m0K01j11j55J71J74k53
3534c5K21l0k74L3K91k53J27j00J3J30j61J92j91L41j99k10R8Rj7M02q13K95M84
3557C53n25K98k51J10J48j39j85R0J45k70J55L3J53l42L37l21L20j28J50j90J7
$$ plain form
3394 -145 -60 100 -126 279 98 -35 146 -145 97 -2 -213 -291 15 11 -76 -31 62 -11 -14 63 -14 40 118 -208 113
3419 113 310 45 -31 107 198 -81 -109 -20 -112 -37 77 -125 -58 83 -106 -18 68 31 -133 -114 -125 -233 -175 -20
3443 -20 110 56 -79 93 139 393 -163 -184 -150 437 -23 406 214 -189 -98 160 -284 309 102 -216 58 280
3465 280 -58 -16 23 8 244 -212 -134 43 303 -309 -166 -259 190 1 -138 -198 -112 -79 23 27 -153 -195 270 -277
3489 -277 -96 -205 44 120 -139 -33 198 -242 -187 207 54 -21 219 216 -163 -46 -242 -57 -104 -38 101 20 207
3512 207 262 -141 -282 85 -246 -86 -133 198 29 53 142 204 -71 -304 -22 -62 139 28 -127 44 218 -35
3534 -35 186 156 -118 -85 206 -47 80 -20 -7 123 -38 154 -37 304 105 -105 -7 2 -15 387 -426 -131 353
3557 353 -172 126 -125 -15 133 -6 -191 -101 44 -226 -71 -38 115 -227 110 -211 109 -19 131 -59 -42
3578d2j09K95r9Q3l24J36j04J85J25l68K68l19N43k30J7l48N05J76q03K57O9l1
3600a18J93N0K41n61j34O46k88R5k53p5J59p6J25j51J58oj50K65o0j32J35l75
3622c12M84j32j58M4M52m97q2O21k81j91M7oJ52J67J38k34j30j94M14l70K16q5
3644F3m8L67l69K75j42j25j9k85M52l44L62l89j24L08m1k06M35m9J43q1k92J06
3666cL59k80r4K67j08k04K57j68R5J01j65k06M15l78J66K13k64pj03k76M41j73
3688a15P4K20j38K48k54J15p4qj66J72m29K59K63J8K33m41K18j53Rp5L9J00q7
3711B8l13J83m3J35j04J64k62K70P3j86k22oN20n03M18J2J65q4j96j32J41r6J07
3734F9o17O55n8N8J03l86Q4J66j45k89J44O7J49j20M2L41l27K59j42J8J09m4j66
$$ plain form
3578 -42 -151 144 45 128 -196 -60 -164 21 146 -222 46 -273 270 40 57 -291 214 390 -413 -156 -87 -118
3600 -118 75 125 366 -195 -329 317 29 124 -129 -204 -45 -121 4 -147 11 5 -145 120 60 -72 63 -312
3622 -312 172 40 -118 -74 378 -119 -201 420 139 -52 -5 -11 141 308 446 212 82 -112 302 -68 148 63
3644 63 15 382 13 288 146 21 2 -283 169 -175 187 -202 -326 -18 -59 -265 170 121 264 183 -109 -3
3666 -3 356 76 -18 249 141 -63 194 26 121 222 57 -149 266 -112 54 267 3 -4 -107 -383 58 -115
3688 -115 -41 179 41 289 35 150 76 68 -98 74 -355 -96 167 185 418 -23 195 42 51 -24 15 115 28
3711 28 -285 -102 -145 -10 -114 50 -212 58 131 -55 -277 -283 237 -266 152 164 329 245 49 -83 58 -38 69
3734 69 -548 107 49 107 210 -176 -92 74 -71 -360 -216 -149 0 -120 -78 263 -64 195 53 71 180 136 -30
3757c0o4L10j28n6k8N1k82J58p3L17j54J62k2J02k6k08l3j70J09J63j66K02k07
3780g3N2K78l67L9r0K99l00N13k26p5k20kM5M36j34l2l93J12p0N7M57n90J04l2
3804b12R5J64o7l04M24k95J38J08n1k3J08J43k04Pk1J07o8kK2r7j80l0K13j81
3828b06J28l3l1L89j36l10L06j80O9k03K81j60P1R7J04J3o13J56O5k44M42N6j38
3851g7N8k65L79j32r9M34k01k34K01j69K65J37m21pJ98m7k24K04l7J52Q8l18m0
3874a55J77m0j07L17m5J76l85J0L17r1k43QL99l71P9k24L94l72L13r8J26j91J09
3897A03Q1l5q1K6j59p9r1Q8p9J70j80L62m41M62K79m27j12J42K93j96J5J2l72
3920b19K21p0j96L05m65O45J00j92o3j34J59l75J7L93j73M3k5j04J74j00k3L02
$$ plain form
3757 -30 -94 216 88 32 4 55 -227 -69 -142 175 21 183 161 263 237 29 -4 -174 -65 98 -68 134 -73
3780 -73 -21 257 -110 -71 -161 138 -162 351 125 50 -170 -172 -127 309 175 143 -250 -138 -208 -151 306 -284 -180 -212
3804 -212 -117 47 -20 -324 100 -195 -57 51 0 -23 85 228 24 31 10 117 49 47 69 -28 -208 -238 -25 -206
3828 -206 -78 -111 -142 247 111 -199 107 -73 -4 -207 74 -86 -15 82 186 199 -414 -258 -193 -437 5 61 -77
3851 -77 -19 -284 95 -37 -136 298 97 -137 64 -105 160 297 -124 -131 67 20 -204 0 -37 115 203 -115 -155
3874 -155 22 -18 -125 192 147 323 -62 -52 265 174 -69 -61 338 -33 46 -178 216 -156 157 59 185 -6 103
3897 103 184 149 68 94 -65 -144 -235 -147 -226 -56 -236 126 -315 147 426 -1 -113 29 322 126 141 153 -219
3920 -219 2 -68 -264 41 -424 221 321 129 66 -68 91 -284 -267 126 -47 -4 -29 -133 41 -59 -82 220
3942B20m9L6l16M34m42L59j82p4M9l8qp7J29j24K00l55K11q8J49j05Jn3o0L81
3966A98l02j61M69j48l49p5J37O4J27J62K4k48Q4M28l86QQ0j37j10N7m8R3J67
3989A34l51M22k04k06L73m04K80l47M78k11N6O5l66L45k79K98k25l2K28j75R6
4010b5k18K00K67l15J01j37L32Q5no4k6J40l99m5J26l70K45q1j83Q11n02l9K04
4033A02K98m06j47L42j12r8o2r1L56j66q0k47M78J18n31J31N8k7L52%j58N7r2
4056G5j36J41J10l24M95n48J43N7p5K3p6Mj27J72p8J85J01M6J07l07K74o18M02
4079D6J35k54K64l57l0K48J10j15p9j87j15L32Qj84J65J62j77J45k47J82k82L77
4101A47j04M4j09k3M35l38k91J94J84k37J8J51j28j91M01j94m6K80j26q7L9l4
$$ plain form
3942 220 171 207 -109 325 -117 242 60 -14 35 -3 -11 -88 41 -83 117 -238 -27 -115 34 -71 -70 -123 -183 198
3966 198 -104 -265 204 56 -293 -368 -231 -167 -40 122 146 -102 -18 410 24 32 112 -25 -135 -78 -126 -33 134
3989 134 -217 205 1 -205 168 -236 44 -303 175 -36 20 85 -281 64 -215 83 -142 -174 54 -121 -25
4010 -25 -243 -43 224 -91 10 -127 205 290 285 221 195 335 -64 -109 17 -353 -108 -189 -372 439 -63 -102 102
4033 102 400 -6 -153 189 77 -21 -83 -174 182 16 -64 -311 167 285 -246 -115 -57 -84 268 268 110 167 75
4056 75 -61 80 190 -134 361 -187 -44 13 -62 -39 -115 -111 -238 -66 -144 41 142 188 295 -12 262 -356 46
4079 46 181 -73 191 -166 -196 52 162 47 -32 -219 -334 -2 6 -178 -13 149 -28 117 -130 52 -230 147
4101 147 43 87 -22 -45 390 52 -239 -45 139 -98 -80 71 -57 -248 153 -41 -87 193 67 -20 19 -15
4123a5J64p8K3r1j8L83k91j59N7n0L72l33L57m56M29K18m54k69J65P9J16q0j14
4146d5J82l86M35KK16n66J10K31L5r3j56J4j8Q9J83j1j25R9r4l86N83m45J31k10
4170b25J06K04j30j50K76j99q8J37P9j7j36N49q00M76m7j71J98q8K78j60K69k27
4192A34j76k89M1n6L46l8M8k2J86m83L09j2R5j99L6L07j68j47R5L4j10K40l79
4215b08L48k2ok29qp5L53N0k79M04l97K68m2j53l01J63j74K56L61l50J52l3p0
4238HP4j85o8K08j05l4M07m7j49k24Q6k9K88k63k5M0J65k71k44O93k22k15J69
4261E7l82L69j43L84j67n15K59J05L34Q5k07k19N3m18L53k7K15k42L70l90MJ16
4283fn03O64J93j35n57L29J63K30l61k41K65O7j89Q1K29mk07l7k04K79Q6j05J77
$$ plain form
4123 -15 149 71 94 3 -15 368 77 -82 -25 -75 297 -36 321 -135 294 512 58 -211 -46 33 149 69 -45
4146 -45 137 -249 186 188 404 -162 -52 179 214 121 -35 -21 -39 50 233 222 97 196 102 -284 299 -146 -15 -225
4170 -225 -119 85 -45 -195 81 -118 -206 -69 10 -7 -143 406 -394 82 35 -136 62 -26 252 92 361 134
4192 134 -42 -331 -290 -346 0 -38 10 -12 174 -309 0 -12 83 -116 -80 227 59 -88 7 41 -69 171 -208
4215 -208 140 118 112 -117 -125 -200 153 203 -76 328 -69 199 157 4 -297 -134 -308 -52 309 -41 111 78 8
4238 8 82 -103 -171 37 -68 -102 305 258 109 -115 -29 -58 230 -33 -58 -18 147 -124 -368 325 103 -112 57
4261 57 -325 44 -99 285 118 -397 -138 -33 301 386 179 -40 13 -405 -52 -79 136 -106 264 -126 -122 -6
4283 -6 -509 155 348 213 -344 -15 148 378 17 -224 41 108 -81 0 229 225 18 -19 -223 56 142 37 214
4306B14j64j62J8L7R0k62j04L33K24j19j67L43j43j02M5j8J89K0l43J12j80K32
4328I3qK27n88%J99J40P9j74L36l52l0j71r7N11m49K20J31J78l35J93o9L7J89
4351B60K3n04J55L3O4j72J21j64M2N54l34Rq2J16p2j55l7p3k5J56R4J68l13L77
4375B41n16N75l38j5lJ66k21K26l51J14O8J7l41L57J39Lr1j12N25l43j32K88k12
4398D4K3k67J32K35l15L56k38R3qk46L02n0k58K47j35L1P7K83l44j92nO9J11K87
4422B32L7m27J77r9k43N14r0j82o3k58P46k99j95J37N3O2Q6k72j00J43j44J18
4444f7M3j85p0Q2J07Q7j16M1j52M67n56J91m2K76j19j35J31k41L84r8j62R2M58
4467D16n63J65L7j36J52k17K06J5k87K79M3l39J53J79k47K55m25M48Q3l97J89
$$ plain form
4306 214 50 -112 -94 -57 33 -229 -333 0 224 105 -62 281 138 36 81 63 252 272 -71 41 -139 93
4328 93 85 312 -276 -276 -77 63 142 -32 304 -48 -78 -249 -346 165 -284 -64 67 245 -90 103 34 71 260
4351 260 283 -221 -66 -33 31 -141 -20 -184 -142 412 78 87 5 121 49 -106 -143 -216 -241 -85 9 177 -136 241
4375 241 -275 300 -38 -53 -56 110 -111 115 -236 -122 -54 -37 -378 -21 118 121 30 -82 443 100 -32 256 44
4398 44 67 -200 -68 167 -148 208 -30 63 55 -191 111 61 -197 50 -85 -54 23 306 -38 -230 -235 -166 -55 232
4422 232 269 -158 19 -80 -323 191 101 -81 -144 -402 344 45 -150 -13 40 102 188 -84 -184 -41 -185 -67
4444 -67 -24 -209 -279 -197 -90 -3 -119 -78 -230 237 -319 -128 -170 106 -13 -148 -17 -258 126 28 -134 -42 416
4467 416 -147 18 55 -81 71 -146 60 75 -212 67 110 -229 -76 103 -144 111 -314 134 217 -180 9
4488IO7p3K0R9j19o9J23J11j6l25K6K6k49N54J56n57J59J70%o4k46M55j40l33
4512b16J74p2r4K44j40q1K87l63L81k00K99K6m45o2K46l1l4j58L58k4l85N19l26
4535i7n8lJ38j82J02k38L62J81k15J2J96l28L49m74M05k38J67l14J07k62L97r7
4557i0K89l88J74R7m5j44J73k73K11J28j11j00l1J03K7j97M8J36Q5p3OK58j87
4580I6o7l30K22J20j65j26K55l44N18j44Q8j13P0Pp2l40L61r3J01J20l11K68l29
4603b08J84q6j09O9k8k1J79J66k40K43k14r6R6r0L67o2k94j4J04L38l98M5K50
4626A81Q1l64L28l70O01k47l05Q4N3L41m52K96j23k4k34L26j82K07j8R4j93r8
4648a8l05J57M38l55M37m17l3J21J91m4m27K02L01J66m02J29j31j9K71n56J31
$$ plain form
4488 9 76 3 23 122 3 -66 57 168 152 -173 -147 -121 -370 184 340 -217 -58 112 112 48 -198 257 117 -216
4512 -216 -42 -114 -208 36 -104 -185 102 -261 120 -80 219 245 -200 -262 -16 -47 -81 -239 119 95 -290 229 -97
4535 -97 -155 -158 -20 -202 -100 -338 24 205 -10 2 198 -130 219 -255 150 -88 79 -235 -128 -390 7 -90
4557 -90 199 -189 -15 82 37 -107 66 -207 4 132 21 -79 -110 -7 20 -177 -129 7 92 19 25 283 96
4580 96 29 -301 -79 41 -124 -250 5 -339 179 35 123 10 80 87 15 -325 36 -57 44 164 -147 121 -208
4603 -208 -24 -110 -219 -150 -178 -199 -20 146 -94 149 -65 -161 -65 -155 212 150 -144 -158 -54 284 -114 -69 181
4626 181 262 -102 226 -144 457 210 -95 -11 42 383 -69 227 104 80 -154 172 -10 197 179 273 80 -18
4648 -18 -323 -166 272 -83 354 -63 -96 25 216 172 -255 -53 248 414 12 141 10 -9 262 -294 -163
4669a63q6P25n58J99k50R7J55j30J56j55J47J10r7o6l37M42rk72R9m0k54K67k8
4692d8o9Q7L7K85l03p2k8KK85n2p2l09K81r2j14J83j2J19J03p8K32m04O2k98K21
4717e4M81o12K24l6l5l9K16j08K04j79l05K67P9L07m73J68J04K15o91R7J99l20
4739b91M28k42K15M2k39m4P7J0k19L21k67rM26J10k75o1p3J78j81k9l3M46r2L
4763B01J14k35Q3O1j77n7m5P2r6K40l55L98J3k11j10P5o6K4K39o6j79P8k34J53
4787h0K65j36J43k56j4k17o9L04j22L20NK9J58n13J7K2J99j87Q2Q3L00Ko3k54
4811A8j59k1N4P3L19p5p8l0m5k33N17j69L8M7m87K27J90j94p3K86N5l15m0J68
4835G3k31P9O3R5K09l27L46j88K13r3j04K76l44l3K2k35L18l53J81o6J2q8N9J48
$$ plain form
4669 -163 -249 476 -82 117 -133 -36 119 -11 145 -10 137 247 150 84 -253 189 180 -92 7 -33 -287 -20 -48
4692 -48 -117 -30 7 292 -11 -83 -111 -109 176 124 52 -257 24 -68 -182 1 -11 108 211 133 365 -39 23 -275 -54
4717 -54 427 -185 39 3 -32 -71 145 37 241 62 -243 24 103 410 -63 105 209 424 -267 -170 29 -291
4739 -291 137 -105 110 152 -87 -131 -54 -44 -263 58 -209 -218 208 318 43 -18 -91 87 -94 -123 -156 290 198 201
4763 201 315 80 163 224 47 -10 -55 17 -79 161 -194 204 217 6 -104 -29 -95 -71 168 102 -77 1 -233 -80
4787 -80 185 49 192 -64 -78 -295 -364 -60 -182 138 143 172 330 -183 -166 -144 55 -132 -50 33 333 335 272 18
4811 18 -141 -162 -108 -35 284 209 131 101 56 -177 340 171 209 256 -231 -4 186 -8 -81 205 260 -55 -95 73
4835 73 -158 -79 -16 79 288 -39 307 119 332 239 135 411 67 34 56 -179 139 -214 -33 -99 -87 -175 -116 32
4859C2K18j85L96j76l75J78l49L29J99o3p4n6q2J93N3k25L4O7m77N92l12p9K50
4882H8m6J12j55k91O05l30J49j34Q4r3M51m41j30J05o7r3L99J26k51l6n9K65l36
4905g8K33m79N48J39n0l42o2J92k35K69j95J32N4l59L54k70O4J80j53K06l54K37
4927C1K81m53L71p2J08n8m28Q8K19r2L9N5o4KM2k53J4K5r3J56p3K73j57L73m85
4952a51M06j78j04Kk48L69L20m04R6j69k66l86N73QK42r3o2J58m54M39j58J28
4974F8J31j14L0r8J0j40j78M36j44p1L96n53M9Q4J84Pk63J4K20j01j88K67l24
4997b78J34M77l81j63j34J90R0j01J32K93l11j7qk14L55j63L08l05rL63l50R1
5019aN6k43j25K77o9K18l56P6K4K74l01K66M3o4r7q1L16q8n21L47R2j9j39N7l87
$$ plain form
4859 32 250 65 461 285 -90 88 -261 68 267 204 130 74 -8 185 238 13 47 114 -363 229 -83 -162 88
4882 88 42 154 -1 -292 313 -17 132 -2 82 -11 440 -1 -131 -26 -93 -186 213 339 88 52 -7 258 -78
4905 -78 155 -324 224 363 313 -29 -91 101 -134 135 -60 72 126 -233 121 -149 -85 95 -58 148 -206 31
4927 31 312 -141 230 158 266 208 -220 -132 87 -5 34 89 25 27 69 -184 -170 -145 -238 -82 -155 118 -39 334 -151
4952 -151 255 77 -27 -25 -273 96 416 12 108 -61 -327 -713 -140 -132 110 17 -45 113 -341 98 -60 68
4974 68 199 85 115 17 27 -113 -291 145 1 -70 326 -227 -178 -94 90 97 -166 -152 68 -33 -221 46 -278
4997 -278 -144 333 -48 -211 -345 -155 -65 -166 -34 259 -52 -69 -77 -291 64 -99 209 -96 -105 258 -92 -1
5019 -1 55 -188 -313 -36 -105 113 -243 -167 -143 131 -170 96 139 75 -22 -103 213 125 -396 -49 43 24 -115 -58 -445
5044d45Q47l30m05L58L34l73L62m34J8J71k14L2M62j09o78N57q1r6L6k44J37J81
5066H6R5n62L05J76L5k38J53j30J45M3j62r8M4k39O65n39K89j08j49J88L9k19
5088a81M16k81k02K61l73M92k16l4J65J85k25K54n61J28L33j23p2J62m8q7r9M51
5110C45m06J17K8l1L0M1Qj55R0k63j18M06j8k25R0j32J15k5J56l31L41J35p6J06
5134B28o17Q5M99m83N9M63j26k39Q6L00k1m25L47m17n6O43n40L00j47j89o2Q3
5156b29P05n82K82k02NJ52J31k27k30NN6J76R0Nm08L97m71N0P78m96J89j10l28
5179b62M41k51P8R5k43p8L89L8j23J6o9J49j51j21J60p4L32l56L18K6j17k97J5
5202h5J12N4j44J16j65J72k4k52L02j54j16L44k01j07J12n2k08L90k67J52J88
$$ plain form
5044 -445 402 72 -333 25 359 -14 348 -86 -68 103 -111 -79 383 274 -404 153 72 -24 12 -232 -95 86
5066 86 181 -381 -76 100 135 -103 50 -80 65 108 -54 -152 -108 -347 318 -221 68 -40 -189 -1 38 -181
5088 -181 235 -46 -248 13 -360 132 -84 -118 47 232 7 261 -300 -172 161 38 -34 128 80 -7 -106 345
5110 345 -61 56 84 53 83 124 132 -23 67 -196 -314 92 74 -151 -61 -193 -78 -103 53 -278 63 198 122 228
5134 228 -389 -304 195 -288 -229 234 108 -131 -45 255 234 -191 156 -261 -317 326 -214 86 -61 -250 -312 -229
5156 -229 476 -106 176 -26 -21 131 262 35 -195 -190 -134 42 132 137 -271 126 -345 -295 483 -13 176 66 -262
5179 -262 179 -72 6 101 -142 -220 169 207 84 100 31 180 29 -92 68 -6 326 -30 288 314 197 -100 -85
5202 -85 27 81 -63 53 -112 60 36 -216 86 -68 -184 160 -41 -148 -36 -88 -296 94 -173 -21 167
5223A67P5j00m43M93l84R5MN2J46j52k62M65j02j04k95M43M05n11J4l59K48l54
5245d59L11K6L46p5k82J0K03j42r1J55M5o6J4J17j62L7j35K75k30k22M37l7J33
5268B08j42j17J75K01l84J68M9l28K66l75J81J04K54l53Q6Q8k44J29L33l91j99
5289b91M63k55J80k44K01j45J01J93l40K08O6n2J33j84m27M52r5q3Q0J37j19j36
5311a57M6L00j46k36K4K00L41m65M25j34m78M35o31K93NJ99J34k05j38J35J10
5332E7k95M02R1j47m62M46j1jk13J82J79k23J20j80j1J6K50K34m88J00J15L5k05
5355iJ50J16n49N70m08J22J71l89JM43k86M35k44l0l60J29L9j47J11K56n2r5K
5378b4OK45j12M3j46l34j49L88L33l12J56k79J18m3L25k96J87r6j98J14K55k82
$$ plain form
5223 167 242 142 -301 192 -192 -97 -93 -41 105 -47 -309 156 54 -50 -345 98 503 -8 6 -353 -105 -459
5245 -459 -148 -122 224 149 -133 -123 80 -62 -153 2 47 -19 -5 112 -50 -13 -148 127 -103 -325 112 75 208
5268 208 66 -51 124 325 -59 109 158 -170 96 -279 -98 6 260 -93 -7 81 -163 -34 299 -92 -291
5289 -291 172 -83 97 -147 54 -91 10 203 -137 71 137 85 218 34 -393 59 -36 -119 -39 98 -21 -157
5311 -157 -111 189 43 -193 -169 31 372 -93 332 198 -280 155 -476 -183 -178 21 155 -50 -188 -53 57
5332 57 -238 164 255 108 -354 92 81 80 -133 49 228 5 125 -55 -66 -50 200 434 -54 46 161 196 -9
5355 -9 141 257 -292 278 -130 -8 163 -226 -225 218 -68 367 123 93 -267 -138 -99 -246 -135 121 69 -26 -24
5378 -24 -18 227 115 158 12 -322 -471 -83 250 -62 94 -185 -67 -110 215 -81 106 10 -188 -74 181 -101
5400a01O9J17L68m46q6L28j65l47K46K57m18L15l16J18M5L21k64J64m1o01L46
5421i1j41K75m8j84L21k47J00j24J76l12J71L86M5n6l05j57K34j68j76K55j17
5442a63J38R3k53K08j12j85J40L7J32o7K08k09j16O6K07O2k46J32l54j40K72K25
5464G5j39k28L24r8LR6l12L09K38m39jM40m1n6r9o6P4q3l4J15j88M3p2rJ0K74
5490A36l38J63N66o63J4J26J52o0R3J77k26Mj5k40%j07L29N9q6p6P8k40K04l45
5514b95K72J33P3j25m43K19K19k85K11J16j83K18O5K5p3l24J59k3k94M76k11k49
5536c19K42K5J28K62j44l96M89o26J15J88k3L37j89p3n2J66k61L37k58n9L82p6
5558A95k25K7kk5j30J59J25k75k17L15L35j56j65l11M08l41L58j41J51J4K67k06
$$ plain form
5400 -101 -32 85 453 7 -79 249 84 -263 -17 240 -178 137 -179 -61 -16 305 41 205 164 -437 -91
5421 -91 -232 43 -5 -189 132 -115 -15 -139 37 -275 -104 282 327 271 -34 -191 43 -125 -301 -46 -163
5442 -163 -25 68 -185 23 -89 -274 -134 -97 35 -32 176 -33 -149 -83 124 186 -60 72 -282 -422 -150 75
5464 75 -64 -292 32 -66 -63 33 -279 30 268 -171 -172 268 227 171 72 6 80 -3 -37 78 -110 -67 -139 -148 -138 136
5490 136 -202 -39 527 -136 -122 4 156 96 189 366 140 144 129 -111 -111 -218 111 170 84 8 86 -154 50 -295
5514 -295 -23 110 183 58 -385 -166 53 -232 -21 95 -88 130 195 220 147 -177 -18 -41 -335 141 -70 -319
5536 -319 -77 -52 76 338 194 -202 287 -339 -224 -36 -59 278 89 16 -36 130 -131 206 -52 -111 271 195
5558 195 -30 -3 -5 -30 -160 -1 124 -151 -368 -53 282 126 -39 -350 58 -283 75 -66 85 99 366 160
5580A60k38K64k21j11J85j57J40J24j86J83P1J07l94K04r4k8lPK96L8k71J37k13
5603@N9k95K1J22Pm5j81K05J92L2R2m29P6J24J15lk47M14k11L2j36k37L58k09
5627a44q5L35j32j2j31J71j19K10m00P13m18q5M24l53L5j42ML0J8J46J3l5j07
5650f4K43j51J86l94J78J40j55L3m5j98K08j46k9R8M03l17QL8m8J43o3Q5k24k5
5674i6j95K02l48J48J07l9o2J45J79J71j45L8k67N64m42r0K81k08N8Q8R2N9M1
5697B81l49J34pn4k83J03K75k2j0m3P3k15q9K36M4J74l0l39K89Mm62J08k1O03
5721D00n22L47K16k69m70L04J38j99J61l03M41j69k9N3kl21L84%k54K12l29P1
5743a40L44n6m56K08L55k30n7L0K90k62P1J52j24j73K2K50r4L6k75K35l04J56
$$ plain form
5580 160 -78 186 -35 -146 39 -118 22 146 -40 143 214 321 -73 131 37 9 6 13 309 347 76 213 0
5603 0 59 -236 -215 -93 -86 -131 -312 -107 85 117 209 -220 -144 -20 95 92 -155 259 48 80 -56 -293 65 -144
5627 -144 -229 106 -26 -38 -169 2 -117 93 -307 406 -12 -97 327 -26 9 -133 -129 -99 -81 65 78 43 -64
5650 -64 179 28 214 -180 -2 138 -17 16 -29 -227 -19 -165 -194 -96 307 -10 -2 36 -12 131 68 153 -71 -96
5674 -96 -291 -89 -437 -289 -182 -221 -283 -138 41 212 67 105 -162 402 -40 -130 151 -57 1 89 181 240 281
5697 281 -68 66 59 5 -278 -175 100 78 68 25 98 -117 -206 30 74 248 218 -121 168 172 -290 -182 -203 400
5721 400 -122 225 441 172 -298 6 144 -55 106 -197 244 75 46 99 97 -224 160 160 -94 118 -211 -140
5743 -140 204 148 -308 -100 255 25 -32 -2 288 26 97 249 125 -48 -26 224 130 166 -109 126 -178 -22
5765b2P7J7j51j29rM82l27kj36J19N5p4N3K40k69M33m97K9J04J76o4m23L84l48
5789b82K20j30L74k74O9M7k2j03p1l69M16O3K45l81J77j6J58r6J40o8O6l49K09
5812B3J30j14J3q0J19j3r3q9K16k67K46J64j67k50R7N8j60L6L31q5k59J28j06
5835a22l2J27M9j46J90M2p8l00L85j04Q1j9k69K44N6k91J48Q9j35nL75m04L20
5858B01j92j57L80l27K25n86N39o0Jk96L40J18L3M6m96K54j62K09Nm3r5l09N22
5881A50K11n19l0Q4j20K42j37J47J53l9p3j32K86q5o3L5m9r0n9K78j11k62n6Q2
5905a57L8J0k6R9k5J34j33JK0J4J35p4k03OM7n4K61r0q6m2J83k21J22k89M62m14
5931b82N9K88j14J31k11J91q9R9o8k41M07j16j92p5J47J44j70K60m04L33j20J05
$$ plain form
5765 -22 55 72 -79 -208 -217 265 -62 -64 -200 -81 -26 -100 -47 193 -76 357 -140 -111 -7 169 105 -318 66 -282
5789 -282 -62 -192 182 -92 -23 24 2 -101 -172 -541 -125 -62 183 -198 -21 -37 121 25 165 97 163 -186 23
5812 23 153 39 52 -28 91 78 -15 -104 112 -155 91 255 88 -162 -65 -7 -167 -131 200 115 -144 -16 -122
5835 -122 -154 -27 22 -124 66 108 30 -270 115 11 92 73 -196 48 104 -187 -39 50 -85 -90 285 -119 201
5858 201 9 -148 232 -95 130 -456 83 23 24 -272 68 186 219 265 -231 23 -139 70 75 32 -63 -372 150
5881 150 361 -158 -188 -104 -224 18 -119 28 181 142 69 -63 223 138 75 110 61 -29 -88 190 79 -183 -239 -157
5905 -157 -119 -109 -135 -36 -61 73 -60 -59 -39 -25 110 36 -167 -161 -114 -168 93 3 -83 -125 58 -163 -41 -330 132 -282
5931 -282 -223 65 -49 82 -129 62 -27 72 4 -237 170 54 -138 -213 -66 78 -92 168 -236 97 -23 82
5953H2r6j08J49j97M69m50J64J80j87j25M04J2m83N31m30Q8l0j25J97M4l37M47
5975A99k7k37K30J11m09P0l1M54l11m6P3J29l61J35K07j63L98l17m90L76K1j72
5997a61J93k9m1j36J93%o4J02J62j95M03n70L30j06j35L06M8r2l37M46pl7l30
6020e7R2J40J06l20J13n0l8r1K8op5J62j27o4o1k58P57m10K84N3l74J52N7O7r2
6045a2nk42K62K09j03l0n9j48pM79l68K26j59M0Q9n3n9l00J10K28j59Q8L4j14
6069e3J06R5K1l60L69K74n05L25k1k95k49J85Q3K19p0K6n5M1r8J00J92k77jJ10
$$ plain form
5953 82 -14 -122 27 -170 299 -151 13 193 6 -119 285 297 -186 345 -85 3 -27 -152 45 89 -248 199
5975 199 172 -65 165 276 -133 -63 -94 360 49 3 76 205 -156 -21 186 23 421 104 -386 -10 11 -161
5997 -161 32 3 -38 -174 19 19 -45 57 219 24 427 -143 187 81 -54 252 300 208 -129 317 310 273 -57
6020 -57 35 175 281 -39 74 24 -14 -105 -77 -83 -158 4 -123 -187 -248 -506 251 -159 125 178 -196 -44 13 80 -12
6045 -12 -17 -259 3 212 109 79 20 -128 -135 344 -24 202 43 83 172 119 60 -240 -130 98 -61 27 61 -53
6069 -53 53 148 169 -191 178 452 -53 272 251 -44 -293 -108 -25 194 124 150 95 136 38 138 330 53 52 162
$$ [...]
8191a25
##END NTUPLES=NMR FID
##END=
