##TITLE=1H_LR-786-B-C2-OST
 DMSO-d6
 8 sc, 
 30.10.2024
##JCAMPDX= 6.0         $$ Bruker NMR JCAMP-DX V2.0
##DATA TYPE= NMR FID
##DATA CLASS= NTUPLES
##ORIGIN= UXNMR, Bruker Analytische Messtechnik GmbH
##OWNER= root
$$ XWIN-NMR		Version 3.5
$$ Wed Oct 30 14:03:52 2024 Russian Standard Time (UT+4h)  she@DPX200
##.OBSERVE FREQUENCY= 200.1318
##.OBSERVE NUCLEUS= ^1H
##.DELAY= (6, 6)
##.ACQUISITION MODE= SIMULTANEOUS
##.ACQUISITION SCHEME= undefined
##.AVERAGES= 8
##.DIGITISER RES= 18
##SPECTROMETER/DATA SYSTEM= spect
##.PULSE SEQUENCE= zg30
##.SOLVENT NAME= DMSO
##.SHIFT REFERENCE= (INTERNAL, DMSO, 0, 15.7039)
##AUDIT TRAIL= $$ (NUMBER, WHEN, WHO, WHERE, WHAT)
$$ ##TITLE= Audit trail, XWIN-NMR		Version 3.5
$$ ##JCAMPDX= 5.01
$$ ##ORIGIN= Bruker BioSpin GmbH
$$ ##OWNER= she
$$ F:/spectra/data/she/nmr/H-F/1/audita.txt
$$ ##AUDIT TRAIL=  $$ (NUMBER, WHEN, WHO, WHERE, WHAT)
(   1,<2024-10-30 14:02:13.75 +0400>,<she>,<DPX200>,
      <created by zg, POWCHK disabled, PULCHK disabled
       configuration hash MD5:
       00 E9 B6 7A A2 85 ED C7 34 08 36 98 17 FE 4E 26
       data hash MD5: 16K
       D0 15 AB 23 6F E3 70 9F 9B 39 3D 8D C9 19 B7 D2>)
$$ ##END=
$$ 
$$ hash MD5
$$ C2 83 92 41 60 8F 3D D5 EA 4A 71 93 63 35 E5 89
##$RELAX= 
##$RELAX= 
##$RELAX= 
##$RELAX= 
##$RELAX= 
##$RELAX= 
$$ Bruker specific parameters
$$ --------------------------
##$DU= <F:/spectra>
##$EXPNO= 1
##$NAME= <H-F>
##$PROCNO= 1
##$TYPE= <nmr>
##$USER= <she>
##$AMP= (0..31)
100 100 100 100 100 100 100 100 100 100 100 100 100 100 100 100 100 100 
100 100 100 100 100 100 100 100 100 100 100 100 100 100 
##$AQSEQ= 0
##$AQ_mod= 1
##$AUNM= <au_zg>
##$AUTOPOS= <>
##$BF1= 200.13
##$BF2= 200.13
##$BF3= 200.13
##$BF4= 200.13
##$BF5= 200.13
##$BF6= 200.13
##$BF7= 200.13
##$BF8= 200.13
##$BYTORDA= 1
##$CFDGTYP= 0
##$CFRGTYP= 5
##$CHEMSTR= <none>
##$CNST= (0..31)
1 1 145 1 1 1 1 1 1 1 1 1 1 1 1 1 1 1 1 1 1 1 1 1 1 1 1 1 1 1 1 1 
##$CPDPRG= <>
##$CPDPRG1= <>
##$CPDPRG2= <>
##$CPDPRG3= <>
##$CPDPRG4= <mlev>
##$CPDPRG5= <mlev>
##$CPDPRG6= <mlev>
##$CPDPRG7= <mlev>
##$CPDPRG8= <mlev>
##$CPDPRGB= <>
##$CPDPRGT= <>
##$D= (0..31)
0 1.2 0 0 0 0 0 0 0 0.06 0 0.03 0 0 0 0 0.0002 0 0 0 0 0 0 0 0 0 0 0 0 
0 0 0 
##$DATE= 1730282533
##$DBL= (0..7)
120 120 120 120 120 120 120 120 
##$DBP= (0..7)
150 150 150 150 150 150 150 150 
##$DBP07= 0
##$DBPNAM0= <>
##$DBPNAM1= <>
##$DBPNAM2= <>
##$DBPNAM3= <>
##$DBPNAM4= <>
##$DBPNAM5= <>
##$DBPNAM6= <>
##$DBPNAM7= <>
##$DBPOAL= (0..7)
0.5 0.5 0.5 0.5 0.5 0.5 0.5 0.5 
##$DBPOFFS= (0..7)
0 0 0 0 0 0 0 0 
##$DE= 6
##$DECBNUC= <off>
##$DECIM= 24
##$DECNUC= <off>
##$DECSTAT= 4
##$DIGMOD= 1
##$DIGTYP= 9
##$DL= (0..7)
0 120 120 120 120 120 120 120 
##$DP= (0..7)
150 150 150 150 150 150 150 150 
##$DP07= 0
##$DPNAME0= <>
##$DPNAME1= <>
##$DPNAME2= <>
##$DPNAME3= <>
##$DPNAME4= <>
##$DPNAME5= <>
##$DPNAME6= <>
##$DPNAME7= <>
##$DPOAL= (0..7)
0.5 0.5 0.5 0.5 0.5 0.5 0.5 0.5 
##$DPOFFS= (0..7)
0 0 0 0 0 0 0 0 
##$DQDMODE= 0
##$DR= 18
##$DS= 0
##$DSLIST= <SSSSSSSSSSSSSSS>
$$ [...]
##$SUBNAM2= <"">
##$SUBNAM3= <"">
##$SUBNAM4= <"">
##$SUBNAM5= <"">
##$SUBNAM6= <"">
##$SUBNAM7= <"">
##$SUBNAM8= <"">
##$SUBNAM9= <"">
##$SW= 24.0689170037331
##$SWIBOX= (0..15)
0 0 2 0 0 0 0 0 0 0 0 0 0 0 0 0 
##$SW_h= 4816.95568400771
##$TD= 16384
##$TD0= 1
##$TE= 0
##$TE2= 300
##$TE3= 300
##$TEG= 300
##$TL= (0..7)
0 120 120 120 120 120 120 120 
##$TP= (0..7)
150 150 150 150 150 150 150 150 
##$TP07= 0
##$TPNAME0= <>
##$TPNAME1= <>
##$TPNAME2= <>
##$TPNAME3= <>
##$TPNAME4= <>
##$TPNAME5= <>
##$TPNAME6= <>
##$TPNAME7= <>
##$TPOAL= (0..7)
0.5 0.5 0.5 0.5 0.5 0.5 0.5 0.5 
##$TPOFFS= (0..7)
0 0 0 0 0 0 0 0 
##$TUNHIN= 0
##$TUNHOUT= 0
##$TUNXOUT= 0
##$USERA1= <user>
##$USERA2= <user>
##$USERA3= <user>
##$USERA4= <user>
##$USERA5= <user>
##$V9= 5
##$VALIST= <valist>
##$VCLIST= <CCCCCCCCCCCCCCC>
##$VD= 0
##$VDLIST= <DDDDDDDDDDDDDDD>
##$VPLIST= <PPPPPPPPPPPPPPP>
##$VTLIST= <TTTTTTTTTTTTTTT>
##$WBST= 1024
##$WBSW= 4
##$XGAIN= (0..3)
0 0 0 0 
##$XL= 0
##$YL= 0
##$YMAX_a= 217887
##$YMIN_a= -248817
##$ZGOPTNS= <>
##$ZL1= 120
##$ZL2= 120
##$ZL3= 120
##$ZL4= 120
##$ABSF1= 10
##$ABSF2= 0
##$ABSG= 5
##$ABSL= 3
##$ALPHA= 0
##$AQORDER= 0
##$ASSFAC= 0
##$ASSFACI= 0
##$ASSFACX= 0
##$ASSWID= 0
##$AUNMP= <proc_1d>
##$AZFE= 0.1
##$AZFW= 0.1
##$BCFW= 1
##$BC_mod= 2
##$BYTORDP= 1
##$COROFFS= 0
##$CY= 11.3945322036743
##$DATMOD= 1
##$DC= 2
##$DFILT= <>
##$DTYPP= 0
##$F1P= 15.6554695791079
##$F2P= 12.8336369535428
##$FCOR= 0.5
##$FTSIZE= 0
##$FT_mod= 4
##$GAMMA= 1
##$GB= 0.15
##$INTBC= 1
##$INTSCL= 1
##$ISEN= 128
##$LB= 0.24
##$LEV0= 0
##$LPBIN= 0
##$MAXI= 10000
##$MC2= 0
##$MEAN= 0
##$ME_mod= 0
##$MI= 1.114404
##$NCOEF= 0
##$NC_proc= 0
##$NLEV= 6
##$NOISF1= 3.799351
##$NOISF2= 2.8
##$NSP= 1
##$NTH_PI= 0
##$NZP= 0
##$OFFSET= 15.70392
##$PC= 1
##$PHC0= -26509.16
##$PHC1= 14.18743
##$PH_mod= 1
##$PKNL= yes
##$PPARMOD= 0
##$PSCAL= 0
##$PSIGN= 0
##$REVERSE= no
##$SF= 200.130013532006
##$SI= 16384
##$SIGF1= 3
##$SIGF2= 2
##$SINO= 400
##$SIOLD= 16384
##$SREGLST= <1H.CDCl3>
##$SSB= 0
##$STSI= 0
##$STSR= 0
##$SW_p= 3612.71676300578
##$SYMM= 0
##$S_DEV= 0
##$TDeff= 0
##$TDoff= 0
##$TI= <>
##$TILT= no
##$TM1= 0
##$TM2= 0
##$TOPLEV= 0
##$USERP1= <user>
##$USERP2= <user>
##$USERP3= <user>
##$USERP4= <user>
##$USERP5= <user>
##$WDW= 1
##$XDIM= 8192
##$YMAX_p= 0
##$YMIN_p= 0
$$ End of Bruker specific parameters
$$ ---------------------------------
##NTUPLES= NMR FID
##VAR_NAME=  TIME,          FID/REAL,        FID/IMAG
##SYMBOL=    X,             R,               I
##VAR_TYPE=  INDEPENDENT,   DEPENDENT,       DEPENDENT
##VAR_FORM=  AFFN,          ASDF,            ASDF
##VAR_DIM=   8192,          8192,            8192
##UNITS=     SECONDS,       ARBITRARY UNITS, ARBITRARY UNITS
##FACTOR=    0.0002076,     1,               1
##FIRST=     0,             0,               0
##LAST=      1.7004516,     0,               0
##MIN=       0,             -248817,         0
##MAX=       1.7004516,     217887,          0
$$ Real data points
##PAGE= N=1
##DATA TABLE= (X++(R..R)), XYDATA
0@%%%%%%%qJ6j6J6k4L2l2M0n6O6p4R2j14J32j50J76k06K36k71L11l55M03m58N15
31B71n76O48p29Q16r09J012j127J252j387J538j703J883k085K311k561K841l160
48a665L522l940M429n006N702o563P662r115J1137j4178J9316l0165Q9634j48345
62g7575j71189K71410J82682j27124k67156K5073K74419R8299k55007j62795J74317
73c4646K36830p2620k70041m8307K70387J31838k20577k08063J28994K47948j3328
84A48415k59268p8305K35974J57403j67835k03665O6512K27604L5589k28805j33495
95a99876J87888J97458j11702k31015J9603K39044P7438k08112j46515J47949
105b7840J89508o6244k12292l1298K02459J11886j66942j70412J02350K04899
$$ y = [0, 0, 0, 0, 0, 0, 0, 0, -8, 8, -8, 8, -16, 16, -16, 24, -32, 34, -40, 52, -62, 70, -80, 96, -110, 126, -145, 166, -189, 214, -244, 271, -305, 343, -386, 430, -479, 533, -594, 658, -729, 809, -894, 989, -1096, 1215, -1346, 1495, -1665, 1857, -2083, 2346, -2660, 3042, -3521, 4141, -4974, 6163, -8015, 11301, -18864, 70770, -77575, -248764, 22646, 205328, 78204, -188952, -163879, 110540, 208839, -46168, -208963, -34646, 202184, 129564, -140477, -188784, 81603, 213441, -7136, -215199, -86205, 161743, 148415, -110853, -189158, 46816, 204219, 36384, -167281, -100769, 126835, 162424, -66381, -199876, -11988, 185470, 73768, -157247, -137644, 101400, 178838, -29274, -175789, -27840, 161668, 95424, -116868, -148166, 54293, 166179, -763, -171175, -68825, 136074]
115A36074j0463k04261p5475J81061J44282j32737j87680N7401J95898K1431j84318
126e8787r6449J49611J54950q6903j80517J2974J82639O6920j58902j35230J09256
137d0438J71885m8150j83458k3555J68647R2467j29856j41188P8981J69728j3424
148A01639j69517n6061J41159J12651r6005j53019L4467J65585L0612j50527q6935
159a25951J17886J32898o6195j56321O696J55301N0439j33713j02970Q7900J35819
170A01789l0422j46228k7668J36792Q2552j02395j19556N4217J38768j39j42034
181e4324n6346J21338R8474q3848j24492L3688J33835K5616j19766p4639R0953
192i511J08941m9279j26975m195J22597N3461j04782r4423P3268J21023k6634
$$ y = [136074, 125611, -78650, -154125, 26936, 171218, 38481, -149199, -91798, 104100, 125531, -58787, -155236, -5625, 149325, 62422, -118095, -105121, 77518, 144438, -14464, -149694, -40438, 131447, 83297, -100161, -123716, 44931, 137398, 7542, -133646, -54665, 115063, 101639, -67878, -123939, 17220, 129871, 33866, -119153, -84686, 80899, 111511, -39016, -125951, -8065, 124833, 58638, -97683, -90987, 64314, 114753, -18960, -121930, -34030, 101789, 71367, -74861, -102529, 34263, 116815, 14420, -105136, -50919, 87849, 87710, -54324, -110670, 10668, 109142, 25294, -99198, -65510, 68325, 93941, -25825, -100464, -9511, 99430, 50151, -76824, -81019, 41578, 95039, -9743, -104166, -30898, 90125, 63491]
203F3491j24312k1731J12303O7790q5426j01952M4304J13399J33j09582m7004
214h8587R0561Q7464n8088j09651K0822J16867K2996j04901o5035P7011R3136
225H2595m2917j07810P62J02413M1353q0645p4635N2391R9030j5046j04489k4416
237g1414R2332N9387o9910q9712L5559J02638J446r7296l5680P9472O8247m7841
249B7228q7812J3061R2671K0737q4768n5253N9975Q0198k8463r3429m297R3265
261C3113L8393p4388o3865M6261Q0446j3908q7023k0650P6706M8236n5445p0097
273f2221K5959Q3782Q792q1803l8308O8234O2086m3187p7820J0523P9938J9290
285E5265p2624m5609N3676O5000k4508p2973n798P2645L5926o0053n9645L6229
$$ y = [63491, -60821, -82552, 29751, 97541, 12115, -89837, -45533, 67866, 67999, -41583, -88587, 1974, 89438, 31350, -78301, -57479, 59388, 82384, -22517, -87552, -10541, 82595, 39678, -68132, -67370, 35043, 76396, -4249, -78884, -26493, 72537, 57491, -46998, -71414, 20918, 80305, 10395, -79317, -43758, 58880, 60326, -36970, -72650, 6822, 75069, 27228, -60584, -47523, 45148, 65885, -18883, -74136, -14161, 66037, 37574, -55855, -60152, 33113, 71506, -2882, -66747, -20486, 59960, 46052, -40971, -61621, 15085, 63321, 7876, -62221, -36262, 47520, 56312, -25491, -63799, 4435, 66521, 23334, -54486, -43963, 35975, 55265, -17359, -62968, -9292, 55708, 31200, -41773, -47571, 25074, 61000, 947, -58698, -22469]
297b2469P1596q874p5266k0865O7149M6008m8852o1013K5402O9391L738o6454
309b0509l1703N2932N2531l3500o6327O204O8145K1431n9441m3658M4426O0545
321E1076k1314o6261m070O2200K7569n1134m8644L0761N9841o342o1309j8199
333d5826N4321M1528l7583n6077J6911O1998N410n9802k8197M7112M5139k9341
345A5593n5750P719N8196J6324m9436l5994L4646N0463j4679n7286p942N3381
357A5235K7231m3450m3402K6763N3677n564n4272j4224M8065L2945l3690m6343
369c7029J3609N0649O314m8766k6031L8633M1243k2140m9189M418N1653J5252
381C8616m5318l2133L1742M2602j4847m8172n416M4929K3698l4644l6767K0585
$$ y = [-22469, 49127, 40253, -35013, -55878, 11271, 57279, 8427, -52586, -27184, 42207, 45945, -20509, -52212, 720, 53251, 19751, -46576, -40372, 27773, 49204, -10237, -53895, -9469, 51076, 29762, -36499, -40569, 21631, 49200, -1934, -50578, -19817, 40024, 33682, -27627, -45826, 8495, 50023, 12440, -43637, -26726, 35272, 40682, -19120, -47317, -205, 44934, 15593, -40157, -32438, 25758, 42082, -7354, -43348, -8702, 41761, 27082, -30204, -38146, 15235, 42466, -984, -44386, -17623, 36054, 30490, -23782, -38006, 10059, 43004, 9314, -37029, -23420, 27229, 33543, -15223, -41254, -2621, 38622, 16482, -32707, -28289, 23364, 38616, -6702, -38835, -7093, 35509, 20662, -27510, -32926, 12003, 35701, 1057, -35710, -15125]
393a5125M5698k057m6491j5800M0332L0570k9532m2137J2832M5698M909m2518
405a3621k0897L3813L4688j8744m1253K114M1673J4409l6640k9801K4748L9049
417B9538j0465m2975n356M0971K1251l1135l2330J8406L8824k982l9513j3680
429b9446L2881K6190k2472l5656Q600L9855P199l6618k0298K9198L1340j7027
441A3746l7618J737L7086J1788l2147k4185K1618L2730p389l5122o248L3344J9811
454B9151k5908k9934J4116L4672j434l5662j2270L0464K3478k0468l0070Q262
466a5603L3415N835l0538j8181K3075K6713j2904l2363j59L2147J2536k7391k2493
479b5911J9267K9976p150l1730n127K8886J6109k2388k5091J1402K8997J97k8663
$$ y = [-15125, 30573, 28516, -17975, -33775, 6557, 37127, 7595, -34542, -21710, 23988, 28897, -13621, -34518, -705, 33983, 15239, -26014, -23900, 17773, 32182, -4458, -34259, -9511, 29538, 19073, -23902, -29258, 11713, 32964, 1829, -30501, -12095, 26729, 23747, -15766, -29446, 3435, 29625, 7153, -28503, -19903, 19952, 27151, -9467, -29765, -567, 30773, 13746, -23872, -22135, 14951, 26739, -5408, -29593, -7975, 24755, 17366, -17756, -24004, 9340, 29151, 3243, -26691, -12575, 22097, 20663, -14999, -27269, 3195, 26673, 6205, -23865, -15603, 17812, 23647, -6891, -25072, -1997, 24716, 11812, -20551, -20710, 11437, 23973, -3418, -25911, -6644, 23332, 16182, -15548, -20675, 8211, 24320, 1932, -23159, -11757, 17240, 17437, -11226]
492a1226j1876K4999K2107j6478k7865O247K9973N127k7847j6335K0667K3499
504B0992j1496k7269M39K7055J1047k2055j9496J4850K5534m981k7641o379K4888
517E488J5743j9417k3167J0546K6826Jk5422r525K1215J8111j3684k3471M031
530a2725K4634N545k2956j5174J7237K2007q746k4876l50K4490J0216k0013j7756
543a8467J2973K1824m644k3270n085K0595J3474j4987j9754P821K3287J703k2415
556f945j0450J8547J7191j2433k1697L973K1887M432j9257j2151J4477J8433o889
569I118k1029j055K0218R384j6729j6692J0139K0508l039k1215m534J8886J2091
582A6051j3586j6922P136J9635K37j8781q569J4691J4813r118j9209K217K0144
$$ y = [-11226, -23102, 1897, 24004, 7526, -20339, -14092, 15881, 21008, -6839, -23174, -2507, 20992, 9496, -17773, -17334, 9721, 20768, -1287, -20783, -5933, 19601, 14620, -13021, -19400, 5488, 21231, 1814, -21353, -10807, 16019, 16020, -9402, -18927, 2288, 20399, 6715, -16756, -12725, 11909, 17454, -5502, -20676, -3439, 18568, 9822, -15054, -15404, 9086, 19302, -711, -18467, -5494, 16330, 11686, -11584, -16669, 3926, 17400, 2413, -17341, -9520, 13767, 15470, -6945, -17395, 1152, 18343, 5910, -15787, -11814, 10073, 14505, -4752, -16903, -2426, 16007, 9118, -11911, -12966, 7252, 16636, -93, -16785, -6646, 13862, 10823, -10392, -14926, 3960, 16051, 2465, -14457, -7321, 12314, 12551, -6230, -14799, -108, 14705, 5587, -13622, -11405, 8739]
595H739N359j7248j1512J2643J6575o346j9179n18J7766P088j4332j3444Q565
608e844J7459j620j7922m773J5894J1218j1011j6053M982J7912Q38j7567p114
621a3601J3714J2456p874j6017K083J7368M493j4792j0131R730J4381m216j7192
634i598j965J6325P285j2790j1584P677J5534j380j6392m081J4235Q894r884j3196
648a0920L475J5135K182j4849p040J2146J1388o574j4012R04J5275M420j4118
661b588r166R532J2026l870j3957j999J3905P159j0853j0231O226J2853n30j3994
675e487n127J2677Q742r309j1767L965J3127K142j2619o616J0726R995o194j1825
689g570N26J1996M426j1374q785Q316J1332l349j2232j788J2333O651r923r766
$$ y = [8739, 14098, -3150, -14662, -2019, 14556, 8210, -10969, -11487, 6279, 13367, -965, -14409, -5844, 11615, 9995, -7927, -12700, 3194, 14412, 3401, -12652, -7670, 10242, 11080, -6487, -13601, 113, 12569, 4695, -11322, -9239, 8129, 12622, -2170, -12301, -2571, 11810, 7594, -9598, -11563, 4762, 12047, -743, -12327, -4650, 10884, 9504, -6888, -10969, 3266, 12160, 2276, -10920, -7445, 7690, 9872, -4977, -12017, 129, 11517, 4943, -9069, -8165, 7110, 11530, -2588, -11754, -2222, 9804, 5934, -8023, -10022, 3883, 11042, 189, -10042, -3816, 9037, 8507, -5487, -10614, 2063, 10805, 1496, -10271, -6306, 6821, 8963, -3656, -10272, 454, 10449, 4255, -7570, -7044, 4952, 9378, -1996, -10781, -2465, 8867, 5518, -6714, -8502, 3831, 10482, 559, -9207]
703i207N981J0844j154j1305m314J0196Q076p533j0253L494J1633J792j0818o535
717i103R020R513n744j1122Q97J0522L752r221p573P118J0015l288j0196j141
731f551R455N939p868r779M758J0887j130j0378l284Q671P315n828r426K898J0268
746E947R23r413n042O950Q132m222r979L86R902L705q040o718N648R102k368r696
762d783j326Q672M472o898p612L861R237k19r013l213P711O692n042q554J756
777d259Q864J333q318m676O252P139l643q414N80Q746L106p141n925M652P673
792E969j565q569j767P505M548n825o678L441Q103j89p902k808O783N621m746
807A921p509J434P701J570p017m366N318O566k693p337K06P386K778o297n595
$$ y = [-9207, -3226, 7618, 6464, -4841, -9155, 1041, 9117, 1584, -8669, -5175, 6458, 8250, -2568, -9103, -83, 9430, 3686, -7436, -6539, 3983, 7735, -1486, -9059, -1941, 8074, 4786, -5410, -6551, 2904, 8843, 975, -8804, -4046, 6841, 5711, -4667, -7951, 720, 8035, 2207, -7219, -4321, 5947, 6870, -2543, -7585, -635, 7497, 3275, -6704, -6318, 3584, 7289, -751, -7469, -1821, 7281, 4913, -4783, -6109, 2563, 7035, 137, -7475, -3614, 5623, 5404, -3609, -6822, 889, 7581, 2539, -6015, -4259, 4605, 5938, -2380, -7056, -804, 6335, 2692, -5722, -5142, 3604, 6710, -431, -6356, -1704, 5969, 4404, -4165, -5932, 1573, 6121, 296, -6382, -2941, 5162, 4973, -2929, -5737, 1046, 6667, 1921, -5588, -4154, 3547, 5117, -1900, -6266, -948, 5618, 2925, -4412, -4206, 3180, 5958, -339, -5934]
822e934M107P013j641p609j292O653M095m574n963K592P040Q5o896k675N537M785
838E323l843o672J311P252J288o260l667M681N741k140o659k49O346K302n358
853f04m439L182O001r84o540j320O323L636m409n277K060O192K37o288k525M963
869B08M122l169n326R87O102J519n577l379M285M877k224n794n29N609K605m925
885f09m091L269N132p86n338j267N069L285m105m657J947N171L26n342k495M408
901h3M248k790m898J081N068J353m806l121L396M347k062m989j24M793K372l832
917d7l930K769M851p54m915j204M189K883l305m417J750M843jm434j799L693L648
934C820k211m582O10M751Q90m072k916K736M014j406m549P7M507J788l424l224
$$ y = [-5934, -1827, 5186, 3545, -4064, -5356, 1297, 5392, 818, -5145, -2553, 4487, 4572, -2324, -4999, 538, 5323, 1480, -5192, -3881, 3371, 4659, -1601, -5268, -587, 5154, 3014, -3645, -3894, 2452, 4754, -604, -5043, -1861, 4140, 3156, -3384, -4704, 1619, 5255, 846, -4431, -2371, 3821, 4058, -2230, -4755, 208, 4330, 1161, -4165, -3178, 2924, 4443, -1134, -4513, -228, 4649, 2425, -3369, -3898, 1711, 4316, -609, -4700, -1431, 3701, 2915, -2423, -3690, 1379, 4664, 559, -4098, -2151, 3020, 3346, -1996, -4491, -83, 4165, 1375, -3523, -2442, 2626, 3979, -827, -3948, -552, 3795, 1733, -3256, -3380, 1413, 3785, -47, -3977, -1208, 3643, 2889, -2026, -3230, 959, 3842, 537, -3880, -2130, 2713, 2712, -1722, -3521, 172, 3820, 1609, -2973, -2363, 2388, 3278, -794, -3710, -974, 3040, 1634, -2915, -2838, 1669, 3457, 33, -3191]
950c191K130M228o32m584j200L833K458k654l630J205M419M39m107j628L376K952
966C414k068l981K52M195R52l764k348K586L449r60l747m94M038J755l234k788
982b743J686L502l66m038j220L679K356k457l093J214L693M59l541j855K881K612
998B769j859l380K11L460J311l206k265K472L262j026l440m57L241J653k787k727
1014b768J568L087k95l159r08K822K525k152k984R75L299L51l289j747K514K575
1030B414j581l094M58L085R72k525j926J868K756q57l187m55K756J550k277k593
1046b636J396L154k72k854p71K558J825j725k675P74K730L38k796j452K107K301
1062B002j025k742K03K883R76k470j734J450K400p53k727m03K545J302j933j992
$$ y = [-3191, -1061, 3167, 2535, -2049, -3249, 584, 3042, 388, -3242, -2037, 2382, 2821, -1286, -2914, 462, 3414, 1346, -2635, -2383, 1812, 2764, -1000, -3348, -762, 2687, 1727, -2020, -2514, 1524, 3279, 45, -2743, -1057, 2445, 2079, -1959, -3179, 500, 2856, 399, -2694, -1480, 2213, 2672, -869, -2724, 157, 2769, 910, -2470, -2259, 1201, 2512, -694, -2959, -487, 2775, 1749, -1691, -2148, 1093, 2746, -41, -2768, -1200, 1887, 1592, -1567, -2475, 347, 2872, 720, -2264, -1289, 2010, 2361, -928, -2675, -161, 2414, 833, -2261, -1803, 1282, 2254, -271, -2197, -329, 2427, 1570, -1617, -2072, 684, 2234, -43, -2636, -1240, 1914, 1642, -1212, -1983, 575, 2400, 675, -2000, -1226, 1504, 1842, -954, -2406, -299, 2002, 977, -1765, -1562, 1321, 2297, -173, -1907, -457, 1943, 1190, -1537, -1940, 605, 1907, -26, -2018]
1078b018J159K576O6k582j050K192J672j544k381N93K471L89k285j354K015K131
1094B050j099k346J70K359P99k139j779J366K156n97k276l63K163J403j603j873
1110a609J061K195j18k402q74J887J498j311k104N47K245M11j893j139J524J937
1126A855r44k129J3J984O85j814j496J224K127n87k006k67J980J101j447j669
1142a390P47J838Mj991p96J621J472j163j818N19K122L65j847j090J398J512p95
1159G08j964P3J714O46j446j278J079J818k80j891l22J749J015j425j634O53J818
1176A033j08j737n44J380J282q13j555L47J785K13j604r84J002J616o72j858k4
1193a241J737P23j298j093R26J507l67j645k68J351P87j073j343M10J840K4j599
$$ y = [-2018, -859, 1717, 1783, -799, -1849, 343, 2015, 471, -1910, -1317, 1154, 1543, -742, -2096, -81, 2050, 951, -1395, -1225, 1134, 1933, -206, -1985, -619, 1537, 940, -1336, -1699, 464, 1867, 264, -1609, -548, 1647, 1529, -873, -1747, 140, 1638, 327, -1777, -1230, 1015, 1426, -467, -1606, -82, 1855, 911, -1218, -1205, 779, 1464, -350, -1846, -622, 1505, 918, -1088, -1355, 625, 1726, 279, -1390, -643, 1195, 1199, -792, -1588, 33, 1505, 342, -1476, -957, 1165, 1530, -317, -1407, -9, 1503, 708, -1256, -1183, 531, 1177, -269, -1547, -468, 1350, 1070, -821, -1143, 606, 1621, 196, -1438, -785, 1033, 925, -812, -1356, 24, 1306, 493, -1062, -715, 1070, 1283, -321, -1305, -303, 1313, 641, -1217, -1241, 496, 1219, -79, -1172, -246, 1261, 894, -751, -1019, 332, 1119, 46, -1297, -887, 953, 977, -622]
1210f22n24J322J127o96j478J29J576J60j497p12J027J165m61j394j35J602O68
1227A257j250j032O14J411j61j538n33J452P53r73j015N02J360J33j343o45J268
1244B60R33q05j260qJ352M44j289q55J099J095m63j099j27J242O24j150j030P25
1262c12J062j04j240n01J167R74p86j186N51J117J10j154o25J018R11q02j168
1279i68K65J110L89j018p36Q65J031l63j054j30R31N23r87q72O19J020j86j090
1297f51j46J001Q74q09r76L41R89M3r67n90P25R07m97j064K18J074L27q25p22
1316g48P04R41l42j149o9Q93L79p21p57N24R46M6r94k61Q30O15o18r97L03R62
1336D87P3j016m06P73P49m20p93J81Q64K61p58p31N72P71l24r11o8R01N21p25
$$ y = [-622, -1146, 176, 1303, 607, -871, -742, 834, 994, -503, -1215, -188, 977, 516, -878, -1013, 589, 1257, 7, -1025, -411, 1000, 839, -699, -1232, 220, 973, 0, -1015, -513, 847, 980, -363, -1008, 260, 1193, 388, -872, -880, 472, 916, -373, -1228, -129, 966, 503, -596, -723, 519, 1143, -7, -1037, -312, 750, 646, -594, -1095, 72, 1046, 260, -926, -375, 742, 852, -302, -927, 91, 1002, 200, -968, -703, 407, 796, -222, -958, -93, 938, 575, -479, -609, 322, 845, -142, -1014, -395, 625, 439, -651, -797, 204, 1078, 269, -707, -366, 623, 666, -301, -891, -166, 741, 244, -820, -602, 472, 799, -26, -748, -44, 897, 555, -594, -663, 230, 609, -112, -869, -345, 601, 647, -347, -608, 222, 837, 219, -778, -475, 487, 560, -456, -862, -89, 660, 240, -553, -372, 492, 753, -5, -736, -164, 607, 283, -628, -696, 205, 726, 1]
1356Ao47N12Q35j32q20l35O91N57n88p94K43Q75J14o88m71O27P35l50q68J10Q32
1377D39J67p66n05M47P13l33p03O3P27L91m18p84L56P70l9q21l64O44M60m07o74
1398f37K37P94Q4o79k41N02N31k80p29m0O84J98n79m42L25P29o4p50l0P56K55
1419F24n45n53L04O02o3p47j90N11M33k21n17K1P69J14o84k56M21M51k90o10j07
1440e33P25K06n90k97M13N37p6n45k67O01K79n41m10K28N10M0n83k48O68M24l41
1461B00n30J29N02K02n54m15M04L88k48m68M8N51K92m54l73L04N32k13n77o1M23
1482H2K98l61n24K73N14lm39j17M17L40l40n19J71M99j1m46k95L76M22k07m33
1503c03R9M91J39m12l57K33M47j29n60q0M55L32l46l93K61M16M5l94k21M06K48
$$ y = [1, -646, -134, 701, 569, -251, -586, 105, 662, 74, -720, -477, 398, 512, -176, -647, -20, 715, 365, -503, -393, 439, 606, -160, -665, -218, 495, 162, -541, -478, 249, 640, 222, -562, -206, 564, 525, -296, -660, -16, 444, 37, -637, -400, 394, 478, -201, -442, 60, 591, 311, -418, -458, 226, 424, -155, -597, -272, 457, 393, -357, -387, 369, 624, 79, -474, -170, 432, 369, -378, -568, -57, 376, 155, -362, -341, 428, 542, -142, -398, 23, 474, 184, -426, -533, 192, 398, -192, -489, -76, 461, 385, -160, -427, 174, 453, -88, -498, -270, 240, 280, -303, -551, 117, 541, 200, -330, -201, 301, 503, -51, -466, -62, 326, 78, -390, -342, 209, 501, 47, -326, -22, 510, 297, -280, -341, 82, 380, 19, -505, -232, 282, 279, -160, -277, 140, 480, 140, -379, -208, 291, 280, -166, -461, -85, 337, 130, -303, -204, 287, 426, 14, -343, -110, 337, 208, -352, -432, 23, 355, 9, -384, -123, 293, 338, -56, -277, 129, 377]
1524C77k90m51R8M74l2l18k07L50L90j71m54O8M12J05m16k43J15M97j92m42k7
1545c57N01J94k82l08J26M53om47j73K80K05j85l26J40L97M5k87k07L09K54k22
1566A04l37p7M15J11l66j74K02L33%l39j07M40J90l34l02J23L46k8l45k07L85
1587C3K18j38l07J34K25J05l06j37J80K27j71l19p2L65J77k83k48L09K91j09k61
1608h7j15K66J61j95l16O5L25%k49j11K72L03j60l71N8L74L3l08k65L08K06j51
1630D3k73O2K92J26k46k34K17K52r0k03r3J98J36k43k47K16K12K1j76j50L04P5
1652A99j10k02L8J74O3k88o5J22J99p8k39R8K19R1k33j39J13J66j14j79p9K03
1674d1J09p8j54J28J79N1k79n2J98J73k11k26Q7K74k6j85j45K03J52m0k12J0J73
$$ y = [377, 87, -364, -266, 208, 176, -142, -349, 1, 391, 220, -234, -166, 246, 351, -65, -308, -193, 304, 112, -330, -357, 144, 338, 56, -252, -126, 327, 321, -126, -299, -19, 186, 1, -325, -185, 212, 257, -30, -237, 72, 326, 104, -233, -310, 105, 216, -150, -324, -122, 211, 211, -128, -235, 205, 395, 61, -241, -118, 228, 200, -145, -352, 33, 251, 113, -194, -60, 165, 270, -36, -173, 7, 234, 63, -256, -328, 37, 214, -69, -317, -8, 283, 174, -87, -202, 64, 225, 30, -286, -221, 104, 104, -145, -256, 16, 319, 159, -212, -154, 220, 253, -55, -320, -12, 194, 43, -230, -168, 124, 250, 4, -230, -13, 239, 149, -54, -147, 51, 187, -56, -303, -87, 125, 146, -30, -180, 124, 199, 89, -113, -75, 99, 162, -126, -191, -69, 130, 52, -187, -89, 130, 221, -12, -151, -38, 128, 14, -165, -244, -41, 68, -10, -164, -36, 143, 194, -85, -137, 61, 234, 23, -203, -116, 158, 132, -53, -198, 5, 157, 117, -95, -85, 88]
1697H8J32k14j93J01J70l9k09j2K70J00j25j72J12J78o5j65m4J05R5q1k23R9J53
1720F1J12k36r6J85J50j02k33L6J51j4l0j56R8J74m9j28l5J55J54j19k01P7J21
1743G5ok09m1J26J70j48j79J08K60n2j49p1R7J58m7k13m0J80J29j58p6J5J93K0
1767A42j78o3K03j0k1j70J5J00L5j37o4J18J55J1k41L8J84n7q9n4Q1P7r8j07L0
1792a00J34N3o7j06K2J20L8j59l1J14O9q4r1J3N6J72k43J3J48OMk05%J20J02j15
1818a7j32J29J11n8j36J1J59L1j37n8N8J17k8j10j48K04O3o8j5m3J79K0j66n4
1842h8J19J76k32j10P3R2P9j92n1J39L8Q8j44l6R3P0p6j25N8K3J3p8j5M4J10k4
1868D4j38P6J03Rr3j02O7J14j10m8J0J66k5r9q4R9J22o0o5o5M9J46k12mkJ65j5
$$ y = [88, 220, 6, -187, -86, 84, 45, -164, -176, 94, 194, 69, -103, 9, 187, 122, -43, -87, 18, 113, 32, -191, -92, 61, 173, -63, -159, 26, 176, 74, -159, -123, 28, 14, -16, -172, -74, 100, 51, -77, -112, 43, 197, 78, -123, -46, 75, 69, -140, -181, -55, 115, -33, -212, -104, 156, 104, -45, -116, -19, 139, 92, -121, -161, 19, 148, -10, -86, -71, 122, 142, -36, -99, 104, 94, 73, -97, -82, 18, 53, -84, -148, -30, 125, 136, -105, -67, 117, 60, -29, -83, -2, 75, -23, -130, -100, 34, 87, 20, -86, -64, 56, 94, -65, -96, 18, 87, 3, -88, -75, -19, 153, -90, -77, 71, 77, 81, -124, -124, -4, 98, -17, -149, -20, 91, 33, -103, -92, 67, 98, -39, -97, -39, 78, 50, -60, -208, -4, 59, -9, -24, -67, 112, 132, -34, -88, 31, 207, -25, -135, -62, 30, 109, -83, -134, 5, 43, 131, -13, -49, 44, 114, 38, -87, -29, -6, 7, -71, -86, -42, 68, 44, -94, -18, 85, 94, 1, -101, -34, 80, -30, -78, -68, 98, 73, -26, -110, -11, 111, 51, -14, -79, -30, 116, -96, -100, -102, 63, 48]
1895D8q6q5J56N8j27m5M6J18k8l4j39J48O1o2o9k2J68o4m3o3J00K6l9j4p2N7M1
1922C5o2%J1J10J6j04l9N5M2q9K2l8O1k4q5j1J70o1M0k6RlP1n1j17Q5K6j7r3N5
1952a2R4J0j03NM7j8Nk0o0N5J6J3n7k8J77q4n7l2J1J22n1o4k9O1N7j18P2j7L1
1981B6%l2N1L6n7m6n2J5R1J2o4n0J14L2j09m1R4m2J8l8J00n3M9J6o5l5Q6k9o5
2010c8r0O2J55q2p3j7J16l0Jj4L5m1%J6o7J1L4N7k9o4O6J3l1p8R5P5j31knL8L
2041a5j5PP8n4L1r7l6O8P1j0l2oQ3q1l9nM7N1q0l9R3k8M5p8m5J13%n2OqP5l6l4
2074b2m1P4L2op6j1L3j0j7n7N0N6j1J4n2N5M6o1j6J0LM7k6M4rm6n5N9m8R8k3n
2106B9l2L3j9M4o1p5L0N5J4%k3K7K1n0JOK0q9Kk2J48Nq8nK6M6p9m3R8K3J2j42
$$ y = [48, -38, -123, 33, 91, -36, -81, -35, 83, 55, 21, -118, 30, 91, 29, -40, -62, 106, 42, -1, -64, 36, 62, 23, 9, -63, -6, 35, -27, -27, -16, 94, 110, 6, -33, 22, 64, -25, -3, -41, 20, -4, -89, -100, 70, 9, 49, 23, 32, 29, 100, 49, -68, 17, 43, 26, -67, -12, 82, 92, -11, -6, 41, 23, 28, 8, -52, 3, 19, 32, -25, -53, 124, 40, -17, -49, -38, 84, 33, -31, -60, 1, 58, -60, 12, -5, 26, 26, -6, 45, 81, 24, -22, -74, -59, 32, 44, -20, -70, 44, 76, -33, -74, 20, -22, -4, -42, 58, 5, 54, 70, 5, -30, 56, 27, -38, -128, -66, 89, 7, -66, -83, 33, 3, 4, -10, 25, -16, -16, 0, -67, -56, -22, 35, 6, -58, 8, 21, -10, -88, 7, 82, -49, -51, -56, -18, -15, -30, -23, 55, 1, 32, -65, -101, -33, 38, 28, -4, -10, 73, -8, -47, -52, -5, 46, -34, -73, 20, -8, 37, -41, -86, 27, 27, -25, -19, -27, 48, 12, -22, -63, 11, 43, 37, -39, -50, -17, -27, -44, -101, -51, 5, -6, 8, -44, 11, 57, -4, -20, -10, -7, 40, 14, 58, 49, 3, -52, 7, -41, 57, 34, 29, -3, 30, 11, 55, -6, -81, -51, 4, 18, 18, -5, 22, 43, -7, -6, 0, 20, -69, -67, -89, 59, 64, -24, -29, -3, 43, -36, -79, 19, 42, 54, -88]
2138h8M8L7M6k4n9Q3k4rNOk0Q0p0nl2N1J0L5p8k1N1M1k6m4Q3j16J06o0k1R4j16
2169c7M1r3M6Q6j23pR7m6MQ8j26Q6N9j17O0lj6j4k7K5O4q7M6j6l1L8m3RK0k0L3
2200dN6q9o2R7lNN0m3j7J10k8n9l6k2R6j16L8L1k2Pmk7M7l5M9k9J6m4N7q2PJ28
2232G2p8k0k4P2J1m2m9K9M0j0J3k2MQpm8M9K3j4k4J2j42J52mlPl4J06p5o9Q4k9
2264a2K8p8R5Kj8oNNM3p2j0J6kQ9m5l3J5m4O5n5L0pj5K7jq7N3L0l5j6j5N4Nk7
2298a6KN5j14J21o9J1Q7j05O0m4k9N1L7l5Jj3LMr7J28q0P2k2j3n6O3L9o2LQ6k6
2329D2q0K0J3K2l0J3l8K7L6K5m2l2J4Nr1Q2k2L7q0RJ17J1L2n0l7PJ6k5m1j0J2
2360c8J05j4j14P4qK1j8M2m8K2p8OJ7J0M8l5Q7j22m1O5O3j46J38M0j00K9J9j3
$$ y = [-88, -40, -3, 43, 19, -40, 43, 19, 10, 15, 21, 1, 81, 11, 6, -26, 25, 35, 70, -8, -29, 22, 63, 37, -7, 76, -40, 66, 6, -15, 79, -37, 4, -89, -43, 43, -80, -87, 10, -36, -32, 56, -70, 16, 75, -42, 18, 15, -1, -15, -42, -17, 47, -40, 6, -10, -41, -3, -46, -37, -17, -37, -4, 52, -37, -99, -2, -5, 0, 50, 7, -10, 100, 72, 13, -23, -45, 51, -65, -27, 4, -18, -11, -15, -42, 5, -30, 19, -10, 6, -38, 19, -63, -56, 72, -6, -26, -50, 22, 33, -9, -58, -29, 11, 1, 14, -8, -4, 4, -3, -51, -2, 21, 7, -17, -5, -147, 5, 1, -2, 5, -29, 77, 2, -67, 17, -12, 16, -62, 33, 35, 17, 11, 16, 21, 64, -8, -18, -2, -4, 85, 40, 7, 22, -22, 43, -12, 18, 11, -4, 23, 22, -65, -12, 18, -17, -33, -48, 6, 11, -16, -14, 41, -73, 48, -21, -10, 77, -28, 32, -12, -41, 10, 47, 12, 13, 0, 3, 7, -90, 38, -42, 30, 8, -5, -61, 2, 41, -21, -18, 68, 42, -38, -18, -5, 17, -13, 0, -38, -11, 25, 50, 8, -24, -10, -5, -96, -14, -36, 1, -79, -70, 47, 58, 90, 40, 3, 10, 26, 1, -40, -50, -38, 67, 53, -61, 13, 5, 26, 8, 50, 2, 24, -54, -48, -31, -21, 27, -8, 79, -43, -84, -19, 44, -102, 36, 76, -24, 5, 24, 11]
2388A1m2pM3j4k6J9PMJ2n2N6L2j02O6k6Kl2K9K7L1J2pNk7j3jK5k6J2qQm5M5k4
2422fk0J7k7L4n2J04Lj7k9j7L4J9n0QkL4nRj9K5l8m4RM2M9r4PK6J3Pj5J4j5o3
2456e9L1P6k1o9L5Jq1M6J07m2l3m4M3M5p2J5l4j7N3Q2l0n6M2K4j5j7m6J4M4p4
2486e2j4M6Km9L0J08p2J9k3onR5m7k0o9P8%oQp6R2Oq5Jm5L5P8qrM6J3o0m7N3O
2521B3M9o5p0J36q8K1J7n9R6m1j8K3mj8jrj8J9N3n1J2J8K6p7N6J0q1k7Q1M6m8
2552A1k8J4J4O3n1l5mNjK5m8m9OJ07%j8k8j9M8j2k2j2L4P8j22M5m7o0J33j23J18
2583B2m5Q4n6RNK9l3J6J8p8M1K5k0k4K7qJ6l9JN2J0l0k3m7KL5k7N0L7p6QKK3k2
2617a6J0K1J8j8l4J3K9m6J07r5oN0k7m0k8J60q1rj6L4km3N6oMQOl3rj8J0J7k3
$$ y = [11, -31, -38, 5, -9, -35, -16, -9, -5, 7, -45, 11, 43, -59, 7, -19, -17, -49, -20, 7, 38, 50, 43, 48, 21, 8, 7, 32, 6, 18, 10, 18, -27, 18, -6, -26, -9, -36, -2, -54, 50, 53, 36, 7, -10, 24, 43, -7, 1, -1, 33, 28, 37, 18, 43, 5, -39, -30, 12, 61, -33, -26, 0, 13, 20, 5, 19, 4, -59, -28, 48, 27, -42, -7, -6, -87, -41, 66, 24, -9, -53, -10, 35, -37, -22, -56, -73, -20, 62, 32, -24, 18, 42, 27, 10, -36, -22, 22, -52, -66, -20, -18, -67, -37, 71, -1, 18, -5, -11, -16, 79, 32, 12, -57, 21, 21, 15, 23, -53, 39, 45, -40, -39, -84, -49, 29, 21, 12, 58, 71, 11, -36, 17, 23, 72, 7, -63, 73, -15, 6, 23, -36, 60, 19, 1, 24, 20, 2, 1, -8, -26, -7, 46, -5, 7, 25, 51, -26, 30, 40, -41, -68, 13, 59, 11, -17, -3, 11, 74, 23, -12, -16, -11, -12, 13, -35, -84, -78, 29, 29, 11, -17, -36, 12, 0, -22, -34, 0, 78, -44, 1, -46, -106, 27, -96, 22, -23, 61, 5, 14, 19, 48, 15, 31, 49, -29, 12, 37, 17, -7, 20, 12, 28, -11, -10, 42, 52, 22, -1, -48, -46, -11, -38, 12, 49, -27, -19, -17, 6, -16, -6, 15, 33, 15, -19, -6, 23, -23, 84, -11, -17, 33, 6, -34, -62, 98, 17, 8, -8, 26, 24, -19, 37, 31, 35, 43, 49, 16, 7, -11, -1, 16, -7]
2650gj1P2p8K5k6l9J28Qj41kR3k7P0k9l8J4kn3K4N2K5r0K5n8K3N3l0K1m9K8N6
2681C7o1l6M8P9k8p0N2j4q1lJ05k5l2N5K5k4o0Q9n4J1K5l8O2j20J03m6P5p8n3
2710e7R0j13R6j1J1mm1P4p5J8pM1o2L5J1J5jo7mJ19p3j8Rk7OL7m7K4N0k1n0Q7
2742D5j5l7k1L5KjK7m7n0J01m1J5o5P8J8qmk3Lm4K9M9m7J3J8jj04R7oN3j01M8
2774A6nk9N6ol9j4M6J3k2l7L2RKmj1JJq0NJ11o4l6N4o1J06j6m2K6jNk0L6Kk0k5
2809a1M9j7J1o8nK3P7r4Q3l4j8N3n5K1j8j5Pl6P7o1N3k7Jn6R3k0k1J8m2Q2l2o1
2841d3L5m9P9M6q6n5J26j4r7J46l9K0n8K1Mq4M0MK3k9j1M0M5j11M9M2o2O7n3O2
2871E8n9K8J2p4J07j5l9k3M1k5j2Pmj2NJ7k3j6O2o6Lk2J6J7K2k9jlj1L9m4L8L2
$$ y = [-7, -18, 54, -24, 1, -25, -64, 64, 72, -69, -71, 22, -5, 65, 36, -2, 12, 10, -43, -19, 33, 58, -32, -7, -65, -42, 11, -19, 2, -47, -19, 37, -24, -60, -12, 67, 39, -31, 21, 7, -74, -77, 28, 3, -29, 26, 51, 27, -33, 56, 2, 13, 38, 0, 62, -58, 45, -1, 74, -4, -57, 33, -80, 16, 5, 16, 12, -29, 45, -30, -12, -19, 22, -40, -5, 6, 21, 20, -47, -51, 68, -5, -23, -14, -41, -35, 2, -45, -21, 29, 8, -42, 45, 30, -7, -28, 7, 9, 8, 35, -12, -62, 39, -2, 13, -52, 26, 44, 36, 32, 9, 12, -32, -3, 46, -1, 12, 30, 29, -75, 22, 16, 69, -32, 16, 11, -18, 38, 32, -7, -21, 25, 38, 16, -21, 11, 20, 22, 18, 7, 8, 9, -71, -66, 45, -19, -55, -1, -62, 44, 28, -14, 12, 11, 16, -4, 32, 34, 14, -11, 38, 21, 32, -36, -41, -18, 59, -35, 48, 14, -4, 49, -6, 15, -3, -18, -11, -47, 30, -31, 22, -5, -4, -60, 33, 13, -8, 10, -32, 50, 18, -43, -8, -57, 22, 68, -18, -73, 53, 39, -58, 88, 49, 69, 11, 32, 36, -48, -8, -4, 19, -10, -21, 19, 64, -47, 2, 44, -18, 49, -4, 58, -1, 27, 39, -35, 72, 57, 18, -5, 36, 11, -1, 6, 2, -10, -5, 12, -11, -27, 35, -31, -28, -50, -34, -17, 5, -24, -25, -28, -39, 0, -44, -6, 26]
2904B6j1qP4j03O3m3mN8o5j9K1l3N7k4RRj9j8O2p9P7Oj5J7l2K5k6m4J16q9OJ0
2936Dk8K8j2L9p0M3Ol1Po2M5OJ6K3l7M4k2M9q7L0j2N2kKl2j2m9O1pN0l0mj2k5
2970b9Q9r4L0M3j4J8Mm5K6o2P3J0o2M6K6m5J8l3l1l0O1MNK2P2p0l7J3qlk4Q7l0
3003C0J7m6J8m1K3Op0L2M2j7j9K2k5K3n4K3J5Qj3Q1j00qP7Mj0%L2l5l2O3m8%L7
3036C5m8Nj2l3L7Pm7N0PO7o8j9L1M5o4l7L2l7R1o5oKjk6J02n6ROn0M9R5j23O2
3069D0q9%O7q%p5K1K5P4p9Q5n5rL2k6K1K3M5j07k0P1l9M8Nj07K3j9J02km9jK9
3101B6RM1l3Ol2J0l1M8L1j38M6POp4K3R3K7q2qLK2O0n2J5j3j5n7Q2n4P2p4J7M9
3134C0k8J5l2K0k4MmN6l4qM5l7j6M4o3O9o3Nk0K4O0kk2m4M5l8K7n8L7J3o4jO6
$$ y = [26, 15, 7, 81, -22, 41, -2, -6, 52, -13, -32, -11, -44, 13, -11, -2, 7, -12, -30, 32, -47, 30, 36, 21, 38, 6, 31, 5, -39, 77, -12, -6, 4, -24, 4, -8, 31, -39, 4, 10, -21, -14, -76, -31, -25, -9, 14, -23, 21, -1, 48, -39, -9, -21, 31, 29, 31, -1, -13, -62, -1, -8, 42, 12, 8, -4, -29, 60, -34, -4, 39, 25, 43, 47, 2, 28, -34, 39, 49, -13, 33, 59, 14, 32, -1, -32, -62, -1, 3, 8, 30, 102, 32, -5, 8, 0, -3, -27, 60, 30, 47, 1, 19, -22, 1, 7, -63, -31, 11, -6, -25, -3, -28, -5, -59, -36, -21, -13, -26, 55, -45, -53, 24, 28, 18, 18, 50, 15, -17, 46, -2, -2, 35, -13, -8, -20, -53, -16, -9, -56, -6, 1, 68, 0, -19, 12, 57, -7, -44, -12, -49, 42, -23, -29, -27, -28, -54, 48, -8, 1, 7, -43, 6, 101, -22, 40, -49, -49, 18, 10, 10, -65, -44, -19, 55, -24, 61, 6, -3, 29, 3, 24, 47, 92, -15, -35, 36, -3, 45, 50, -57, -34, -53, 49, 47, -2, -3, 26, 35, 76, 43, 49, 17, 27, -4, 44, 75, -63, -17, -10, -4, -78, -55, 38, 65, -17, -25, -22, 0, 60, 8, 23, 10, -5, -62, 20, -34, 38, -36, -19, 30, 2, 17, -15, 5, -19, -15, -19, 37, 3, -5, 40, 3, -13, 31, -32, 37, -26, -21, -41, -17, 43, 41, 19, -25, 20, -18, 9, -49, -12, 1, -63, -64, 2]
3167Bj0m6rM4L4ll3N7k3r9J5M4L7k8K0j5N9p5qR2k9K2j6L1j05P8q0L1L6l8j9J3
3199b1K4M5j03R2k3K3m7J7k7kJ7L6p2M9J6m7K4K7Qo8Q3j11J5J00o8m4P6M7m9K
3229A9L3p4l3N2p3J02k8OnJ2J1l1j0L1J2j0k7RK5J3o4O8p6L1n3Q8k3pL4n7l4L2
3261b7O1j4m4P3r7K4M7j5l9l0J13o1L9jJ2n2j4L5O3p5R3q6rl8j1N3o4R9q2O8l3
3292a2M7k4mk7L9%J3m3j0J8j2K1l8L5L2%o9n6J15n2O3l5J0n4J8l3N9J5nmj7k7
3324c7L1%k4P1J4n3J4J4L0n2p6J9J10p6O2j08P7q6M5O5k2l6ko5K8O5k3k6O6j01
3354g6JL3J0M3O8j28RL4k8J03r4P6l9K0Rj3m5K1j9R6j14N1Jk8N9k9j0ro1M2l0
3385d7J5J2K4K5p4J21o9J1nrj1N2L5j21PjJ9NN0j7k1n1N7M9o6o6N4J4l0N3j3o
$$ y = [2, -8, -54, -63, -19, 15, 12, -21, 36, 13, -86, -71, -27, 10, -18, 2, -13, 46, -29, -37, 55, 26, 48, 32, 63, -42, 36, -44, -13, 23, -15, -34, -21, 3, 48, -55, 37, 14, 37, -10, 7, -20, -22, -5, 31, -41, 8, 24, -23, 1, 28, 36, -32, 51, -60, -45, 55, -13, -57, 19, 66, 17, 19, 52, -22, -55, -3, -76, 26, -2, 4, -1, 11, 22, -9, -19, 12, 24, 14, -13, -4, 21, 34, -30, 38, -38, -7, -60, 28, 5, -2, 32, -25, -59, -27, 34, 20, -24, 49, -48, -24, 23, 8, -31, -61, 52, -9, 30, 29, 41, -11, -25, 10, 73, -2, 91, 5, -4, -42, -53, 0, -64, 35, -47, 21, -12, 35, 11, 7, -20, 19, 19, 32, -11, -21, -3, -15, 6, -32, 3, 35, 35, -34, -90, 25, -27, 36, 1, 11, -43, -25, -58, 1, 16, 11, 7, -10, -37, -6, -6, -30, 41, 55, 2, 16, 30, 60, 8, -68, -49, 61, -15, 47, -61, 16, -70, -25, 40, 18, -18, -20, -85, -57, 8, -15, -41, 25, -76, -75, -42, -32, 11, 79, -49, -40, -6, -34, 69, -25, 51, 12, 32, 41, 28, -17, 4, -15, 81, -33, 18, 19, -9, 50, 21, 11, 2, -59, -17, -47, -32, -20, 4, 29, -45, 76, 7, 18, 13, 4, -7, 45, 80, -41, -34, -35, -16, -11, 39, 22, 1, -50, 7, 56, -10, -76, -22, -8, -38, 15, 2, -4]
3417dJ4m2M2n2O5k3m9K2K3RJ4qLj5l4J5KJ3K6k2l5K2k4nO9o2QJ26j56N1M8o3l
3450b5M3K5j31O0K1ln1O3J6n2O8l9J7m8M5m5JN0M2op4J0J5J4L5o9L4k3LR2r6Q3
3482G5l8OLj0n2mL2nrJ8J4L4j15J9N4nl1Rpll6L6N4n3j6N3J8p6K8l6O1l0M2j1
3516A9Ok6N4Ol7kL7j8m1j4l0L2QN9p9L0PJ7K3op4N1o0N9K1l2%J6Pl0k9M2Kp0K3
3551b9NJ8%j7JK9om7O7m6M7m5jM7J1o1k9M1L1M3p7j3J8J9l1J3L0K0o7QN0J6l2
3584A3K7mo1N0r2N2J2J6n2K2L7k5R4q9lM7n0N7n4mj0j0M3l3Q4j2o5N%Nm8M8j4
3617a4O3j26O6l3J14o1m6M8k2N4j13L5K7k4M5l9L0p5N3nM1J4o%j7%j3K0LOk3m3
3649d1N2NJ4Jj1n6J1J5J5j8l1N3j5oN5l3K0LOl8m9P8k9l0J9l3O8l2%j8M2l1O3
$$ y = [-4, 10, -32, 10, -42, 23, 0, -49, -27, -4, 5, 19, 11, 14, -1, -35, -20, -18, -5, 21, -1, -36, -14, -38, -43, 26, -36, -28, 98, -58, -7, 41, -22, -25, 18, 43, -88, -28, -7, -10, -61, 2, 18, -34, 34, -5, 12, -36, 9, -36, -35, 15, 57, 51, -23, -13, 2, 16, 51, -18, 16, -7, -4, 88, -8, 75, 37, 43, 46, 36, -16, -20, 12, 7, -2, 16, 30, 64, -51, -32, 22, 17, -14, -5, -12, -15, -51, -15, 39, -14, -30, 23, 41, -35, -7, -43, 18, -12, 30, 19, 25, -1, 53, 59, 22, 20, 57, 39, -2, -16, -46, -14, -6, 53, -26, 4, 11, 28, 51, 45, -29, 22, -38, 21, 42, 10, 10, 26, 33, 3, -26, 16, 18, -52, -29, -24, -6, -6, -23, -22, 7, 1, -46, 21, -25, 22, -23, -24, 23, 34, -27, -56, -15, 16, 59, -18, -31, -13, 6, -25, -12, 18, 38, -29, -21, 29, 45, 13, 40, 36, -25, 25, -67, -15, -3, 13, -39, -17, 20, -5, 89, 0, -3, 44, -6, 51, -3, -7, -17, -27, 16, -17, 67, 55, -10, -5, -5, 0, -48, 0, -14, 49, -77, -11, -44, 70, 9, -37, 11, -11, 43, -70, -35, -8, -32, 13, -26, 4, -71, -18, -23, 18, 32, 26, 26, 9, 9, -4, 16, 19, 25, 2, -41, 11, 16, 30, 31, 20, -36, -25, -10, 5, -13, -44, 9, -6, -12, 43, 10, 30, 33, 39, 1, -48, 30, 1, -29, -10, -43, 25, -7, -7, -25, 17, -14, 49]
3682D9mn5O2p2L1m8L1lj4J1j6K8l1O3p5M4K9n6N4o3M2j0Ok9O0m7Q0n5O1n1m4K2
3714@J8j7L1op0R1mj8m4M2m5O8l7q8J37l7j9m7J9j4L5j4L1l8N4k1l6K3k5N6%k6
3746aK8r2M5L3QJ6m8K9K5j9m6N5m3J6nj1l9M9M2p4O3k0L2k4n3N2jLJ9p6J0L0L9
3779D2o0K4pn1k1O5J9k3m9M6j5RNOM4q0K7l5J24j9j1k1n3l5j0J04o2O0k9J9jj9
3811gn7M7j3R1l6n1L7j4J9l1K9kk4l5P5j5J9m4M1k9k3N9j25O5K7j7l8J0lQ6p0
3842b9J3nK4K7j22N4K4O7o3m8O8l3J9K8j0Lj4l6k6K1O3Ro6mN4nj0j5L3r3J03j4
3874A7Jj0kK6l8L3m2K7O7j07L3K5k8kJ5Oj1m7m9R7l5O0l9l1Q5m1jrmJ3m2Q8o1
3907fok3K5j3lK6K0L2o5K9n3R9l2m4Q3j35P4n5M0L7K0p6Q4n4oJ8Pk4J5L0k1rn0
$$ y = [49, 45, -10, 52, -20, 11, -37, -6, -9, -23, -12, -28, 0, -31, 32, -43, 1, 30, -26, 28, -35, 7, -3, 3, -26, 34, -13, 67, 12, 73, 22, -22, 0, 18, 1, 32, 26, -44, 47, 43, 25, -19, 23, -22, 46, 9, -79, 58, 21, 2, -45, -26, -40, -5, -19, 12, -26, 28, 7, -29, -6, -31, 25, 25, -1, 27, -65, -20, 13, 21, 37, -11, 18, 43, 24, -22, 33, -10, 6, 1, -10, -49, 0, 42, -32, 31, 11, 43, 19, -34, 18, 17, 20, 39, -37, -27, 3, 42, -18, 6, -1, -52, -73, -8, 11, -12, -61, -15, -30, -21, -16, -10, 34, -46, -19, -54, 70, 51, 40, 19, -34, -69, -79, 25, -37, 23, -6, 13, 12, -7, -64, -17, -30, 61, 25, -26, 11, -3, 16, -15, 14, 12, -12, -47, 28, 13, 32, -12, 29, 0, -23, 36, -89, -24, 3, -14, -52, -42, -45, 41, -29, -16, -21, 3, 30, -92, -38, -14, 53, -10, -58, 10, -23, -4, 24, 14, 17, 3, -33, -59, -38, 25, 34, -32, -36, 18, 13, 3, -12, 21, -72, 31, 17, 18, 8, 6, 32, -6, 27, -15, 12, 79, -28, 5, 30, 2, 0, 15, 21, 10, -37, -86, 11, -24, 36, -3, -34, 51, 10, 9, 0, -4, 9, -33, 55, -6, -12, -35, -10, -23, -26, 0, 20, 52, -13, 16, -37, 62, 30, -14, 69, -66, 8, -47, -7, 30, 50, -26, 58, 4, -2, 16, 23, -1, 14, 44, 23, 14, -36]
3940c6L6K3l9N0Kl4J4p0L8J8M2q9N8oKl5j5L1k8j4P4On5l4N6M2p0LL6M9j03J12
3972F4q4N1o5QO1j01O6m9L2N4r3L0O5oK4r4N7m8Q7o2N8l5j6j1n2J10r7O6k4RN4
4003E9l9m8j2R3l8k5j2N1km6N6j07N1Mj5n9O7O1n4j0PMK6J7K1j08L4L8JM3j1m3
4035DJ5J6rK5l3l8Lo0R7o7O8l5K2K2r1R1k9M2l7j9K4rj1J1qK3K7j2Qn1N0j08L6
4068c3N7K2p3M3k6n3NM7pk1N1k0K6n2N8o3J9M7q5P7K0n2pJ1k7L6P4m1K1m5J0o
4100A3m6L7J1Mk4j5L5lN8o8j4l6NK1J4j0l6L6M5j7L3j0k6L3q0L7m9m8J08p7L8
4131c1j5P2j1K7q2Q4J8l1n5M8L2o1M4n9J6l6P2J9m7m3R8p6k3Q3j1p1J2Q1p5j4
4161c5Q1p8M2n5N1kp%KRJ4o1rO8Kn0L5j0o1N4l5j2J12p8k7Q5m7L9j7J2J5o3rm
$$ y = [-36, 0, 23, -16, 34, 36, 2, 16, -54, -16, 2, 44, -45, 13, 7, 9, -26, -41, -10, -38, -52, 22, 28, -27, -61, -5, 37, -33, -30, 6, 55, -48, 64, -20, 31, -34, -26, 35, -66, 0, -49, -17, 37, -56, -26, 39, 33, 57, -37, 20, -28, 59, -3, 55, 20, 4, -7, -59, 51, -46, 20, -4, 5, 59, 20, -28, -40, 53, 15, -10, -22, 29, 27, -19, 37, -70, -19, -15, -30, -89, -22, 39, -15, -25, -18, -14, 12, 29, 50, -58, -24, 14, 15, 58, 47, 4, 19, 35, 26, 51, 18, -20, -17, -77, 20, -47, 21, -14, 8, 30, -61, 30, 1, 43, 6, -13, 11, 2, -9, 2, -6, 17, 44, 32, 40, -11, 39, -69, -33, 24, 46, -27, 16, -10, -63, -58, -11, -18, -39, 12, -8, 18, -34, 24, -39, -20, 27, -58, 19, 39, -13, -20, -9, -36, 0, 74, 33, 54, 9, 19, 13, -33, 4, 15, 19, -5, -20, 15, 12, 70, 2, -12, -48, -43, -22, -8, -18, -54, -18, 27, 10, 43, 33, 7, 40, -40, -3, -52, -100, 8, -69, -31, -46, 26, 15, 42, -40, 44, 62, 31, -24, 24, 56, -5, 39, -20, -4, -40, 32, 51, 4, -39, 59, -17, -40, 43, 32, -39, -27, 54, -21, -35, 46, -32, 10, -45, 6, 4, -3, -3, -1, 8, 22, -39, -48, 20, 22, -28, 7, -3, -64, -10, -45, -57, 55, -23, -50, 35, -12, 27, 10, 22, 37, -26, -35, -39]
4195c9J33j29M8n7M3k2k4N3K7p9n9J20m9O7n2j1K8K7l5rM6p1J29r3ON4p0N5q3
4224d6Q7K6o6k8L6QKn3K2J5q6L8L4l3P9j0o2j6J1J9j4M6j0k2lO5k9o0K2Q0l1l3
4256a2P7q4L0l5K9k7j4lL9l9KJ27p1qj2K2l4qN0m7O4K6jj30N0M9L2n2M3j1q0K6
4288bmJ9j2j2Q7j00Qk7j3P3o5N9k8K4J3k5j4O3l4j0o0J10km1q0O0L3J5m9qKoj6
4321d2J23m4jm7J2jkL6k1qj0nJ2j2K9k4L9j2%m3qM9mp8R1L6r3L4%m5M8K6n4K2
4355CP0k6j32O0P9p2J9k9J4N7p9K2k0O0L3j16K3k5M4nL6l7lL5l3L0K7k8Rq5N3
4386a6j5N7K3j1qm7l1M5M2m1l3N0ro0O3j04J03m8j7R2k5Qn7l9O9O%p1J18n0kk
4418a0k3l7O8m5O7K8Rm3o7J02Jp6N0k6Nj0K9l8o3J07O5j23N5k6J1n2O4n4L5Ol7
$$ y = [-39, 94, -35, 13, -44, -1, -23, -47, 6, 33, -46, -105, 15, -34, 33, -19, -30, -2, 25, -10, -19, 27, -44, 85, -8, -2, 52, -18, 37, -46, 41, 67, 1, -27, 9, 17, 19, -34, -12, 3, -83, -45, -11, -44, 35, 25, -37, -53, -42, -23, -37, 9, -1, -23, -26, 39, 10, -50, -28, 52, 21, -12, 65, -19, 11, -24, 5, -22, -36, -39, 0, -39, -37, 90, 19, 11, -1, 21, -13, -21, 29, -18, 46, 72, 71, -59, -9, 40, 72, 20, 63, 52, -28, -2, -6, 13, 1, -11, 76, -24, -16, -43, -56, 17, -48, 11, -17, 7, 20, -5, -19, 44, 10, 0, -60, 50, 48, 7, -73, -13, 20, 35, -14, -22, -20, -26, -42, 81, 37, 36, -11, 1, 0, -2, 34, 13, 5, -5, -10, 2, -10, 19, -5, 34, 22, 22, -21, -29, 20, 16, -62, 29, 65, -28, 6, 6, -39, 9, 35, -19, 3, 73, 47, -85, -25, 54, -18, 1, -28, -14, 43, -36, -14, -34, 26, 59, -57, -34, -59, -15, -20, 16, -21, -24, 11, -22, 8, 35, 7, 16, -69, -16, -31, 26, 49, 38, 30, -17, -48, -3, 39, -2, -35, 15, 6, -54, 9, -95, 8, -40, -57, 35, 10, 18, -39, -78, -9, -3, -3, -74, 44, -6, -8, -10, -33, -70, -2, -47, 20, 48, 57, 14, -53, 49, 50, -26, 24, -2, 3, -7, 22, -16, -79, 28, 93, -30, 25, -1, 10, -42, 22, -32, 3, 9, -28]
4449b8Q2q4J1L2j4l9O1N3pp8P0q9k7N7m4j8P3Pm9J9j3l7M5J0K9j3l6Q1q5m3R1
4480A7n0O5j3Oj3k5p3O4N1q6M8mqN1n6O9q3j4L1N3nLm4Q2o5q2J32k3l8mk7M7r
4513cNj9N5o1o3N5L8ql2k8O7n9M8K4j3n3K0K2ON2m5l5P7m4LkL3m8l3P4k4MON4
4547G3k4r0M0J4Ok8P5Lo1l0K2k7J1J7L7l7m1P6Jon6N8l8l7k5L2K6J00q0L9n4m6
4579e0P2J1n9l2L1M8K1j14J29m3m2N6k0j2P2j12L9J9n6R8o0K9j0l3O9n8K4j05
4607h8Q8nk7N1Qj0j5KN0o0J2J7n8l5Q5l1L6j02P1m1J8K2P6l3l2J2k3n7M4O9q2
4638c8j4k5J39m3Qq0O0n4J05%l9l4O8l2K3j0m2J5J2J8n0m1Q1m8KO6q5Q0k4L1o4
4669a5oN0p3P6o9L3j0M0Nk9K4o1R0j10j4K2j0J1O7q5J03p1J3NNoJ8Mm5O3m4N3
$$ y = [-28, 54, -30, -19, 13, -1, -40, 21, 74, 67, -11, 59, -30, -57, 0, -44, -62, 11, 18, -31, -12, -25, -62, -17, -7, 22, 9, -27, 54, -31, -74, 17, -33, 32, 19, 25, 12, -13, -86, -22, 29, -57, -9, -13, -21, 30, -26, 43, -40, -54, -23, 30, 25, 28, -16, 66, 1, -81, 51, 28, -10, -14, -41, 6, -3, 2, -17, 38, -23, -86, -31, 7, -1, -33, -61, 6, -53, -5, 19, 6, -47, -27, -5, 1, 53, 8, -27, 50, 6, 9, 7, 40, -8, -41, 33, 9, 13, 19, 73, 49, -41, -1, 13, 19, -9, 66, 69, 8, -22, 0, -27, -16, 1, 38, 1, -40, 36, 37, 31, -25, 33, -5, -42, -67, -35, -9, 91, 11, 50, -4, -50, 22, 33, -26, -58, -27, 21, 42, -72, 57, 14, -28, 28, 8, -4, 68, -44, -5, 14, -42, 56, -4, 25, 15, -18, 51, -7, 17, -88, 0, -5, -32, 19, 27, 17, 2, 4, 54, -6, 6, 23, -35, -70, 15, -16, 20, -82, -11, -52, -34, -12, 64, 31, -1, 11, -12, -69, -25, 44, -38, -52, -77, 62, 19, 27, -53, 7, -47, 58, 58, 19, -15, 53, 21, 44, 34, -8, 7, 19, 37, -13, -54, 27, -21, -19, 47, -38, 42, 18, 49, -15, -21, 29, -44, 32, -37, -4, -14, 26, 31, 2, 26, -35, 55, -55, -69, -47, -57, -46, 21, -64, 39, -32, -19, -14, -9, -15, 3, 7, -38, 25, -19, 34]
4701C4j4n6M0m6L3m2M7K9m0M4l2j2k6K5L3%rLnJ1q1J51r5lJ7k7L5l4rO3Kk6m5
4734c5L0k2RMn4O4J7n2rL5N0n9L4K6k1J0m4%J9J4m9K8j1J7j9O3n5lM0R0r6jL4
4767E4n7k0oL2jJ4k6mN2n3J1qJmm5N1k2N1j4k2j8J1J1K1qj7Q3j07l1O2N4q6j4
4800e5K5L2n4P9p3l9O7KmlL3k4o9P5L2kk6L6j6NL3q9L1M5q2M0l3P5K1q9k6j0M7
4833a6k8%Q4J4l8Rj3o9P3m5l1N1L9n1j2P7Nn9lO0m0Mk0k6K2J4RNm7P3n0M5n6o9
4867h9J29k2PJ9p5OL0jL7o5Pkm7RN2L5on5mN5j7L5j1q0P6j3j3L7l6MJ7K1j06R5
4901B9q0N7j1Pm3Lm5R8J2l0l0M9L%m0n7Q5j6ml1M9L1n2J2J6ll0pP4K3k8l2N7o2
4935DO9r5P1%m6L3p8O7m0RL2J5L1p6L9p3k9P1j2K9M5p2qj3J0K9Oj8O4q4kN4k1
$$ y = [34, 20, -36, 4, -42, -9, -51, -4, 25, -15, 29, -3, -15, -41, -16, 17, 17, 8, 11, 6, 17, -64, 87, -8, -11, 6, -21, 14, -20, -29, 34, 36, 10, -35, -5, -27, -18, -14, -68, -4, 13, -39, -48, -13, 37, -22, 12, 38, 17, 27, -17, -17, 2, 16, -33, -5, -16, 1, -18, 45, -10, -13, 27, 117, 21, 20, 54, -3, -23, -29, 3, 2, 16, -10, -14, 38, -15, -4, -12, -11, -15, -60, -9, -31, 20, 6, -16, -34, -23, -12, 9, 1, -16, 67, -40, -71, -9, 45, -41, -55, -30, 2, -52, 27, -46, -85, -18, -16, -20, -23, 10, -14, -83, -8, 24, 22, -4, 32, 16, 21, 54, -35, -4, 41, -41, -1, -34, 41, 62, -27, -53, -63, -16, -44, -44, 40, 54, 16, 25, 12, -57, 16, -29, -60, -9, 30, -21, -33, 44, 49, -10, -13, 47, 7, 11, -9, -35, -13, 1, 10, 15, -32, 41, -9, 36, -20, -89, 40, 18, 25, 44, -31, -25, 5, 4, 41, -24, -17, -19, -66, -57, -5, 30, 24, -31, -35, 20, 3, 38, 27, -53, 23, 10, -3, 34, -2, 2, 19, 40, -66, 29, -51, 6, -5, 2, -41, -38, -83, 15, 27, -3, -33, 16, 19, 19, -21, -78, 7, -9, -13, -44, 5, 36, -16, -4, 12, 9, -21, -28, 46, 69, 41, 9, 66, 4, 73, -22, 49, 49, 3, 36, -42, 25, -15, -6, 26, 41, 72, -4, 35, -38, -67, 4, -8, 21, 66, -6, -14, -27, -17, 12, 18, 0, 64, -20, -22, 32, 11]
4968A1m9m5R7m4j3j2K2J7OM4n8L5L8o3J0m3M7o6K5N3j1oK9mjm4M6K7o1J00p9m3
5000c5J07j9r4K9J9PlJ1p8O7k9K9n8M1J6L5m7j02J89p5K0n1jL4m6K4N5p2L2Ml2
5031b3l1Q9j28R0L1p2M2l7NK9mK6ok4K7k1K9k3k8LM8Q6n4k4L0l0m2Kn0R6o4O1
5063C3k3m7O4k2K9j0qp1J05m8J6QK5m8m8O0OL5q5j8Q8Pl7J8j6m7j5R2q1NJ1J8
5095dj8K1K8j0n1NN6l2jK8lk9N2q9k2K0K5R1r8L4k5K6J6oj4Pk0M1k5K5p5M7N6
5128E6q4%m8L8J7Pl2O1k3J1M5n3J7k1J0k6QO4j20R5K7n6m4O8K0o7O4L5l3Kn4P7
5160F1o2L5jo0Oj3O4pq8O9LlJ1Ll8k5J28j26%K2j6L9kj9N6r2K8L9n1P2m5O3l9
5193A2p6J40p6n3J02l4n6P7r8M4rP5n0m9L3M5p5J10r4K9k2L6k2M9o9O2o6Q4j4
$$ y = [11, -38, -83, 14, -30, -43, -55, -33, -16, -10, 34, -24, 11, 49, -14, -4, -47, 0, -66, -41, 12, 1, -5, 24, 20, 19, -25, 21, 48, -13, 87, 8, -35, 72, 53, -41, -12, 7, 14, 11, 22, -56, 11, -18, 11, -47, -6, 10, 45, -2, -104, 85, 10, 30, -21, -22, 12, -34, -10, 45, -27, 5, 9, -23, -54, 35, -93, -3, 28, -44, -2, -39, -34, -5, -9, 17, 11, -13, 14, -7, 22, -1, -29, -26, 22, 108, 54, 30, 60, 30, -12, -10, -60, 36, -28, 33, 10, -37, 27, 5, 34, 24, 16, -55, 50, 2, 18, 26, 51, 3, -45, 15, 21, 56, -29, -47, 41, 48, 11, 29, 13, -34, -49, 43, -38, -33, -22, -4, -22, -1, 27, 17, -34, -29, 27, -5, -6, 22, 19, -10, 42, -47, -69, -49, -24, 67, -31, 3, -22, 4, 20, 14, 0, 7, -13, 28, 3, 28, -47, 0, 56, -28, -28, -76, -38, -21, -14, -46, 15, -8, 3, 48, -5, 12, -9, 1, -25, -17, 47, -73, 22, 49, -7, -51, 17, 37, -30, 34, 69, 36, 38, -16, 61, -1, 34, 33, -27, -21, -34, 30, 23, -65, 4, 7, 4, 15, 18, -20, -45, 83, -43, -43, -21, -37, 2, 0, -19, 37, -55, -27, 12, -39, 33, -12, 51, 12, -64, 76, 0, -53, 49, 15, -41, 36, -62, -18, -27, 48, -2, -51, -18, 27, -48, 62, -32, -3, -25, 11, -11, 38, -31, 31, -35, 49, 35]
5222C5q2O8qN3n3pL7o1pL0r1P9J8l8J9J6k3J1Ql2mOK3J7r7O4L2p8L1nk6M4nm1
5256f7N9J3oN4j02ML9Kj2qNK0lRj4j9Rj6R4n6J5n3l3J09l1k5l7L7P4l6n1NnK4
5290bk3OrQ2j40N3J1kL3m6K8J0%j1M7l3j0pMm2O9m9k0M9p6O7L1l5rN3o7R0n1J2
5324A3N8m2lj2o9L2j3K2K3oJK5m6J7K1m0j2K1K0K7j02K6K7J4l6l4P2J8q6Q6q4
5355f2N8l4M0K6k7m5M6Km5r7J09L7K8m2Om5mK7QO3n1l1M9k7O1l0m3QK2n9N8K4
5387C0jm5k3J6K3l1PP0p5L4J7m3j6L5m6j0L9K5l2K0Plm2M7J6j08J12m0Jk1M4o5
5419e8N2k1K6k3n4M7N4m2kOK3J0m2j2N1k3K9pn0N4m0K2J2m7N2m3l0O6L0q6N4l7
5451b9J2J8n5Q1j3j25J14kj4j2k1m5J01j8l3l2J53j09Q8l8n8L9l2K3M3l2P3j12
$$ y = [35, -47, 21, 13, 66, 13, 6, 43, -18, -25, 5, -86, -7, 11, -27, -8, 8, -15, -4, 4, -28, -32, -26, -3, 14, -83, -19, 13, -65, -34, -39, -65, -21, -26, -67, -8, 5, -1, 53, -49, -45, -6, -4, -16, -24, -19, 1, -2, 7, -7, -26, -17, -33, 61, 5, 20, -33, -66, 43, 12, -13, -50, -13, 61, 25, -26, -21, -26, -2, -25, -19, -28, 54, -86, -33, -22, -24, 9, -37, -9, 1, 1, -10, 37, 4, -6, -13, -9, -51, 18, -31, -51, -2, -78, -11, 20, -15, -24, 29, -38, 52, 1, 13, 71, 29, 26, 14, -55, -23, -36, -14, 9, 3, 4, 29, -17, 0, 21, -19, -31, -10, 10, 37, -65, -39, -12, 2, -34, -68, 4, 22, -64, 22, -62, -4, -38, 2, 28, 1, -44, 2, 4, -41, -138, -29, 8, 36, -6, 0, -45, -49, -22, -14, 49, -2, -33, 16, -11, 50, 20, -23, -15, 7, -52, 6, 30, 29, -16, -39, -23, 0, -31, -24, 46, -29, 5, 22, -21, -37, -2, -48, -58, -19, 6, -26, -6, 1, -2, -44, 3, 19, -89, 23, -17, -16, -37, 7, -58, -6, -27, -1, -24, -78, -31, 23, -19, -21, -15, 8, 18, -24, -36, 15, -8, 21, 14, -36, 18, -22, 0, 12, -35, 17, -26, -56, 10, 40, -46, 8, -29, -17, 1, -54, 27, 14, -111, 3, 1, -13, -25, -46, -91, 10, -8, -41, -73, 80, -29, 59, 21, -37, 2, -30, -7, 36, 4, 77, -35]
5479c5m1J04q2R8j01L2L7k1lJ0J9j7J9L2n7N0k4l4j5K7K9j0K1j1m2J9K9l0l8j6
5509e1O6km3K6M8n5j8N5n4k1Q0qq5K4O9j2k5q5N6N3l2RO6k9o6O7k4L3j24J14k9
5540CPK8n7j3N7NNl3j8JJM0q3N4K3l5J1KJ3j9K7l0Q1n6J2m5j1M0K8k5jp6R3lK9
5575E5r7K2K2Rj9J8l9J0J7j2o5L3L0l0M9pk2L0n1M6n3N4N5m1J4j9p5O3J8J8k1
5606A2J2M5j15R5p5QR7p5L2n1P3n1mKo3J20k8nk6Nqo4Q8l0m8K9O3m2k2J3J3j0
5638a0Ro6J9M0m2O4k0L8r6N9j7k9P0j13Q8L7o1M5L3o4lk5K3K0Ro1OO4q3nQ6j9
5670dJ2p2J41j47Q6q8N8mQJ4j3rJ0RJ2k3Pnm5N0J5k2rr3J08%M2l2oj4L9l9L5o
5704A5PK7n0kOn8N2L5k9M2l4j7Mk5K3l4M3O9l2n0N0j0l2L6q3O8qk6O1o4n1P0K7
$$ y = [-35, -76, 28, -54, 44, -57, -25, 12, -9, -12, -2, 17, 0, 19, 51, -6, 44, 20, -14, -29, -2, 27, 17, 38, 27, -15, 4, 33, 3, -35, -51, 15, 13, -30, -4, 44, -11, -29, 26, -28, -49, 31, 23, -62, -38, 31, 19, -6, -91, -35, 18, -14, -5, 61, 32, -34, 33, 9, 42, -82, 32, 3, 10, 38, -19, -32, 25, 30, 35, 2, -16, -15, -14, 26, -57, -3, 20, -15, -4, -2, 11, -8, 19, -11, 70, 14, 26, -19, -30, 10, 38, 13, 12, -64, 29, 26, 55, -42, -20, 2, 11, -8, 10, -29, -19, -2, -14, -79, -46, -16, -46, 3, -4, -26, 4, -47, -1, -54, 0, 55, 14, 28, 9, -66, -3, 15, 33, 12, 24, 69, -46, 49, -26, -18, 79, 4, 36, -15, 58, 7, 3, 5, -58, 62, 34, 29, 3, 8, 0, -64, 24, -6, -54, -25, 38, -4, -26, -13, 0, -10, -1, -67, -48, -8, -50, 14, -6, 32, -64, -5, -22, -51, 19, -94, -6, 31, -30, 15, 48, -16, -19, -44, -21, -1, 8, -53, -47, 17, -66, -71, 15, -4, 8, -64, 77, -70, 16, -72, -14, -18, -10, 4, -9, -18, -8, 1, 13, -10, -3, -8, -53, -3, 12, -10, -19, -112, -4, -4, 38, 6, 0, -14, 25, -14, 21, 15, 22, 49, -1, -3, 3, -55, -3, 32, 3, 45, 11, -6, -2, -27, -4, -38, 5, 74, 42, -8, 42, 32, 0, 36, -47, 21, 13, -13, 48, -16, -67, 3, 30]
5737C0L8n2ok5k3O6p4N4Km7P2lo2pJ1M6k6Q0p0j3k7O3k3j1JJ0l2RRP4j03K6K7
5770A4k4O5p4Pl5L4Lk6R1l5Mj8M9K4p1j4N9m9MJ1Ok1kp3Q0q6M0k2Q4l8o6RnJ44
5804F9k8n5nJ3m3M7K1j6pk5nJ2m5R8oK9k1l0K2Qqo1KM2J4m6J2j3K8k5J02r4k2
5837c6Q2p6k0M4J2L5j6J1k2J5qp2K5k8j3R3k0l5L8n1O8j5n1k8J08Qk4Rj15J16
5867C4o5Kj8K0L2m3j5P4p3L4K4o9J34m8o6j9Q9N6o5M3o9k2J5M8l9k5J5OML0l1
5898gL8K2p0N5q9O6rj3nM5rp8J6k9Q8l7RM3l3J4m8j7J8k5KQ8m3k7J7K6K2o9P8
5931C9J3o4O7K8j07RL9k7r4P0J5JK9k3R9r9n0N0n7L9J6j1o1N6N2qk0m4K6LM1q
5963A9n2N8n4K5K7n0l8LQ6j9jK4l9L2J1n1M4J4l3K3j5m3J6K0M7J3n7QK3n0Qn9
$$ y = [30, 68, 16, 10, -15, -38, 28, -46, 8, 10, -37, 35, 32, -30, -37, -26, 20, -6, 74, 4, -9, -36, 27, 4, -7, -6, 4, -28, -19, -10, 64, -39, -13, 14, -10, 55, -19, -12, -47, -13, -10, -36, 55, 20, 24, 6, 55, 79, 8, -6, 53, 4, 8, 19, 25, 4, 2, -71, 9, -77, -37, -59, 25, -13, -79, -70, -75, 69, 41, -14, -19, -6, -49, -2, 19, 3, -4, -29, -34, -22, -67, 31, 25, 54, 33, 3, 25, 33, 25, -36, -34, 8, 22, -24, -12, -25, 3, -22, 80, -14, -36, 46, -30, -50, -6, 6, 41, 25, 36, 14, 29, 21, -51, -26, -54, -67, 26, 6, -29, 9, -42, 26, 11, -40, -68, 40, 48, 24, 33, -82, 34, -31, -29, -47, -27, 5, -38, -53, 21, -52, -18, 6, -63, 71, 23, -43, -62, 27, 83, 18, 61, -8, -30, -15, 33, -6, -31, -16, -10, -6, 24, -7, 31, 53, -17, 38, -51, 15, 6, -7, -12, 33, 24, -54, -38, -67, 21, -16, -7, 36, 3, 17, -31, -48, -30, -55, -53, 35, -8, -35, -18, 8, 30, -39, 39, 52, -12, 55, 83, -24, -15, 24, -3, -97, -27, -12, -11, 18, -5, 94, -5, -55, -5, -62, -23, -7, -18, -79, -23, 29, 21, 1, -43, -17, -14, 27, 19, -33, 25, -29, -4, 23, -27, -65, -62, 24, 5, 4, 28, -11, 21, 32, -19, 25, 39, 6, 29, 14, -29, -13, 7, 54, 67, 10, 18, 41, -9, -1, -60]
5995f0K7M1Lj5kRpM7r1L3K4J9Lp0jM5o5L7N9k1l9M6n9k8Q0mj6k0j6N8m1M9j02
6028g7O4QOJ6j6jJ4p1P8L2n0jJ7j6n0J04o0Qm7N4j1m0P2No7J2l9J7Q8m0k0R0j16
6061c7M6K0m7Kmk7K1K3k0K4l7j5M7oKM4oo7N3k6%j4RM6q6J39q4k2J8J5K3p2n0
6094h8R2j3LN4n7M5m7l8N1M6nPo7O0m6j4L0j8J0pL6Mp4L8j0L0m0O7Mo7N3J0n0
6127aM0l7J6j7qk5J6K2j1M5r4J27j73J31nj9m0M2l4k7L8P2o9j7L2N0q7N3N3p4
6157aj0M8oMm5k0M7j17N1L0Q9o6J6O6qp3m4JP0J0PJKo0J7j7j4M2l0k6P0o8K3l6
6191d7N1M1o3M3p9J48r9N3n6lN1o8J7LJ0oL3l8L4J0p0N0j3N6m3K1l4J6km9lO7
6223C1K9j15J19r0L0p6O1N0l7Rnlk6M4J7N4q2o9k6R2Lj7J1k0j2Q6m5KLrpK0k0
$$ y = [-60, -33, 8, 11, -4, -6, 3, -4, 43, -48, -15, 9, 28, 31, -39, -40, 5, -60, -23, 36, 15, -24, 22, -37, -65, 15, 11, -5, -25, -41, 17, -24, 25, -77, -13, -5, 1, 17, 1, 0, 14, -57, 21, 53, 3, 2, 19, 3, -47, 57, -3, 5, -42, 12, 1, -39, 33, 38, -29, -17, -56, -39, 49, 9, -11, 79, -37, 9, 29, -18, -16, -20, -47, -26, -3, -23, 1, -36, -51, -4, -10, -8, 36, 30, -37, 16, -10, -10, -24, -15, 31, -55, 84, 0, -22, -4, 11, 34, -38, -88, 4, -9, -6, 48, -9, 36, -11, -49, 2, 48, 43, 50, -17, 43, -3, -17, 13, -5, 5, -2, 34, 38, -36, 2, -8, 22, -18, 49, 53, -14, 39, 49, -1, 39, 2, 18, 1, -7, -32, -16, 6, -5, 40, -54, 73, -100, 31, 26, 7, -33, 9, -25, -52, -14, 58, -11, -28, 4, 54, -33, 20, 73, -1, -11, 37, 31, 35, -10, -30, 17, -100, -49, -19, 70, 4, 20, 86, 78, 5, -39, -38, 32, 42, 49, 50, 52, -8, 9, -8, -22, 20, -10, -36, 34, -34, -11, -47, 4, 45, -18, 25, -54, 94, -5, 48, -8, -11, 40, -28, -11, -8, 2, -4, 29, -9, 25, 35, -35, 15, 2, 58, 15, 36, 2, 18, 16, -33, -36, 31, 60, -55, 64, -26, 4, -72, -11, 39, 2, 11, 6, 3, -23, 21, 38, 92, 10, -59, -85, 7, 10, -7, 4, -16, -28, 58, 13, 15, 18, 9, 2, 22, 2]
6256BM1o8O4o7k6J09j33M2M9p7N4jQ4p0m9J6J06p8J1L3k1j8Jk5K5j4l1R6k8K6
6286E3o3M4o0M8j4k2N3n4L3l6PL3j9qJj9LM1k0k0R9j30Q3jj9%L5q3M6Lo5J22r3
6319b2n4J04l7L7L2n5J4n2MO9o0pkJ8Pm1k9J24k4o4J8N8KnJ6qk4rO7p3K4o0n4
6352h6J12n6mK2%K1J6j24J37p8j3k2M8j3L7l7P6L7r7k6R7l5k9J4J9p0M7l0L8r
6382hKQ5j0j6l3Ql0R3j13KP3j9nM3n5L3Jm5OK7k7k2NL6K0m6n7L9L8k0p6MN9m2
6416e0J3P1m7J6J2J0o4K2l6Q4m1n9Q4l8lM6k2jL4pl9K6RJ1Pm5J6j8N4j19O3R0
6448G9r6oK1K7j2O7o7j2kJ2jl9M1o1O1l1j3K2%j9p3N3OlL8J5j07Q1k5ON9K2o6
6481b3P9q2j5N4q0J05Nl0l3N1k7J0J6K3o9m3K8RML8k9k2K8K4p8O3j9P5j00K2J2
$$ y = [2, 43, -25, 39, -28, -54, 55, -78, -36, 13, -64, -10, -11, 73, 3, -46, -30, 76, -2, 9, 42, 21, 3, 4, -21, 4, -10, -41, 55, 27, 53, -10, 34, -26, 22, 8, -14, 39, -15, 18, -18, -11, 22, 3, -5, -4, -23, -20, 21, 1, -19, 80, -50, 33, 32, 13, 13, 48, -35, 11, 14, -51, 71, -22, -76, 28, -9, 28, 60, 5, 19, -33, -29, 40, -20, -27, -29, -11, -4, -45, -74, 50, 26, -38, -20, 38, 40, 35, 51, 43, 19, 10, 77, 4, 28, -32, -86, 26, -30, -34, -12, -12, 9, 25, -99, 38, -40, -53, -75, -27, -40, -3, -40, 36, 73, -24, -50, 47, 12, -17, -3, 16, -54, -7, -37, 1, -8, -6, 79, 69, 53, 20, 28, -2, 91, -22, -20, 53, 34, 29, 72, 17, 50, 51, 6, 12, 39, 12, -10, -5, 31, 51, 5, -52, -13, 25, 5, -71, -67, -8, -50, -37, 34, -13, 3, 15, 25, -39, -17, -53, 31, -10, -69, 15, -23, -26, 20, -2, -3, 31, 24, -15, 11, 20, 31, 38, -7, 9, -9, 45, -74, -11, 79, -17, -23, -2, 25, 13, 80, 13, 1, -1, 11, 10, -29, 12, -49, 12, -19, -32, -10, -10, -29, -102, -49, -43, -46, -8, 7, -100, -19, -44, -38, 21, 43, -23, 56, -26, -41, 13, -67, 38, 43, 13, -20, 31, 4, 14, 30, 53, -16, -59, -31, -22, -18, 20, -9, -31, -3, 21, -57, 6, -13, 62, -38, -16, -4]
6512dN3n4m2J17p0M7mpr4K7K2K5J4n5rPk1QPKQk4N3L8j06J13r3J47j09J3LK9r
6545C2l2l4K0L2pk0N9p7l4qM1K7M0k3k4M5l2j6J2J8m0N6j6%K3j4j7k8J03m0m7
6576an7L8O9p5M9L4n7n0L6j5N2p5J08kK0j43M3MKM2OO5o6%mm4N5K0r5K1kRM3L6
6610F6L5o3k8k6J2j3N6o2L4j4Q0r2k6L2J2M2K5o1J4l5M7j7Oj5j8j5j0L2n2O9k3
6641hl0%L0K5Pq5N4k0OJ1L1m4O4l1k8J03q5k8lK8M9l7MO8q9Kj7k1P4k2oOpoM2
6676C7o3M2l2k2O0J1K0m4J6j20J24p5J3K4rj7L7q3J04m0J9M5p1M3o4M3q5L4K9
6705b4J0L1j6ql0O0p1L7K0Ro9L4nk2L5N2j9j3n9J09j01N4J9k7j1K5jM0m0j9k0
6736b0L0m6j8R7p5N7Qr8K1OjK0j1J5j3m4R4j7lK1j2L2r5j0O0O7p8QJ4RoqM3mk2
$$ y = [-4, 49, -5, -47, 70, 0, 47, 43, 36, -58, -31, -9, 16, 30, -25, -34, -27, -48, -40, -33, -31, -23, -47, 6, 44, -62, 51, -42, 105, -4, 9, 12, 41, 32, 0, -34, -14, 18, 11, -9, 50, -27, -61, -69, -28, -1, 39, 16, -8, 37, 5, -11, 1, 19, -21, 35, 19, 19, 42, 28, 11, -17, 86, 46, -1, -58, -20, 49, -26, 23, 57, 0, -50, -14, -29, 23, -52, 56, 54, 74, -69, -26, -22, -20, 22, 28, 93, 27, 27, 23, -21, 34, 54, -41, -20, -22, -13, 30, 66, 101, 38, 10, -16, -4, -17, 39, -23, 11, -3, 77, -15, -41, -9, 3, 45, 70, 9, 23, -12, 35, 18, 24, 9, -9, -24, -34, -2, -54, 15, -8, -38, -38, -8, 17, 24, -61, -7, -27, -21, -10, 21, -23, 41, 10, -18, 85, 0, -28, -31, -3, 46, 9, 13, 81, -8, -6, -23, -44, 30, 8, 2, 8, 1, -5, 37, -26, 16, -16, -38, 22, 33, 53, 9, 25, -95, 29, -46, -33, -9, -18, -35, 2, -81, 23, -17, 2, 47, -24, 19, -45, -2, -87, -53, -24, -14, 17, 1, -7, -37, 23, -48, -11, 9, 18, -51, -17, -22, -44, -9, 43, 24, 11, -48, 61, -40, 14, 33, 6, -5, 20, 19, 59, 19, 0, -20, 10, -36, -54, 43, -32, 25, 33, -65, -44, -38, -39, -19, -30, -15, -28, -72, 22, 5, 2, 23, 11, 43, -52, -62, -2, 65, -13, -5, 9, 18, 12, 4, 47, 43, 21]
6771B1On8rQ0j2O8p5m0P6j08K6J9P6J8r2M7o5m1P9K8mMp6K4n9J07j7o8K9L6p2
6802e2oP6o8R2n9m8L8KJ8k4j9J2J3M2J1m2J6mk1L7q4N2OLk3N2J7Nk2l2L9l8L8
6835B7lNJ8L8j79P7K9l3O1k8l3N4j2q3J08p5N9o3l1P4m8J06m1k6j6j7K9J2l0K7
6865FL5p2QQ5o6J3m0K1j3J5K2q7M2J26j11L7o6K2J7OQ3o3J3l4qK9m5M9KM7mp2
6897cl6KK8J2J1j1Q2n9r4Q3m7K2M0l8N6m7n7N2o6L0J2O8kOj13O6o4L8k7N3K2n8
6929c9O9o6O3j9J4j3K1l6M7m7O0o2K0l7KK5m8M1N9j02J2O7l7P0p3O0p9k0J2l6
6959g2N2L4Pk7L3J2p1J3Ljn0O0J7o2N9K9q3K4j1R5j19Q3r7O9%m1MQ5Nn1l7K7l7
6992d8K9R8j19Q3K5q9lK7LM7o0L3n0O1q2N0K2Jll1k9N2l8nQ4n1k1lK9K4q0L1m6
$$ y = [21, 27, -31, -40, 40, 28, 96, 21, -19, 57, -51, -25, -6, 70, 88, -4, 43, -22, -63, 16, 44, 40, 44, -32, -8, -67, 40, 23, -45, -16, 20, -52, -58, 18, -50, 42, -17, -65, -27, -25, -7, -31, -50, -38, -25, 17, 28, -14, 2, -2, -23, 14, -70, -18, -12, -9, -32, 20, 37, 42, 20, -12, 27, -11, 27, 24, 29, 47, 85, -94, -17, 12, -21, 40, 12, -21, 33, 21, -62, 46, -29, 30, -33, -64, 10, -38, 68, 27, 1, -15, -32, -3, 9, -21, 6, 41, -31, -23, 62, -4, 9, -31, -10, -23, -8, 14, -73, -31, 95, -16, 21, -45, -23, -6, 0, 83, 20, 33, -1, -9, 20, -25, 24, 26, 73, 69, -3, -39, -37, -9, 3, 14, 3, 85, 26, -68, 15, -32, -10, 30, -8, 48, 1, -56, -4, -70, -40, -28, 40, 38, 44, -69, -3, -67, -29, -56, -3, 19, -39, 30, -36, 27, 8, 22, 9, 30, -6, 41, -6, 54, -8, 12, -25, -23, 2, -46, -5, 54, -48, -36, 31, -6, 64, -9, 51, -28, -48, -36, -72, -20, 14, 21, -6, 27, 39, -32, -19, -16, -17, -67, -7, 10, -52, 7, 36, -47, -23, -34, 61, -58, 25, -72, -3, -3, -44, -40, 45, 50, -1, -38, -11, -48, -19, 79, -40, 43, 68, -21, -24, 3, 6, 53, -7, 26, -24, 37, -45, 5, 27, 28, 25, -6, -35, 17, -21, -26, 58, 7, -14, -17, 12, 36, -44, -13, -59]
7025e9R3n7L0j7mL0l8J8QL1O2l2p2O7r2L5r3R4J5M5J3q2rM1n1P5q5M8J3j0M3k8
7057C2p0Q2p6P6k7Jl4J10r6Q9j33O8J09j37%P6l9j2k3k1pJ3m5O3J7l6jK2j9j1
7087b9L6lj18Q1p0J18m6P7q0j2O3j4J2%o7NL7q4Q3KRKK4m9N2m9M6k3K4m1m4Q9
7119C1L7m8k6Qn1O9oL3%l2n3L8K0k4K9j9J8n4O0k9J3p2J07l7Pk8jj3N1Jk3o6P5
7152A5L0l3pJ3L0l8K7n7RJ0R8r1l6K5J1j4k9J33j31L5K1n6P6j14K9J0KM3No4J13
7183F5l0k9q6N1O3%k2j3K6q9J37j12P6m9L4q9K6M3p1P8l1L0pnnn5O5o0J02k0M
7214B7m8J4l0M3%j9M3J0n8j0QM6r5M6N4MO6j28Q4q1J2l%KjN5o0k1J08l7mj5J2
7247B4r9L8L7o3K6k5P4l4K5K7rl9J8k9Rk4j2R0j2l4j9N6Qm2J7k2P0q0M4l4LL5
$$ y = [-59, 34, -23, 7, -10, -14, 16, -22, -4, 4, 35, 97, 65, -7, 60, -32, 3, -90, 4, 19, 64, 77, -5, -14, 27, -24, 51, -34, 14, 27, 17, 60, 32, -38, 44, -32, 44, 17, 18, -16, 94, -2, 87, -46, 22, 131, -6, -6, 70, 31, 19, -4, -25, -32, -19, -64, -1, 16, -20, -21, 1, -18, -29, 7, 4, -114, -33, -103, 15, -31, 46, -34, -46, 17, 3, 15, 15, -52, -47, -10, -94, -11, -9, 0, 2, 26, -23, 29, -20, 26, 3, 27, -14, -58, 31, 68, 20, -6, 2, -49, 20, 14, 47, 47, 15, -38, 0, 20, -4, 25, 6, 24, -30, 30, 1, 14, -58, 49, 12, 19, -9, -10, -23, 28, 29, 6, -60, 15, 45, 12, 5, 18, 48, 10, 37, -20, -11, -1, 97, 6, -30, -5, 6, -8, -37, 96, -35, 0, 21, -35, 41, -73, -44, -34, -32, 11, 16, -48, 65, 35, 6, -80, -29, 34, 34, 12, -1, 25, -64, 73, -39, 37, -12, 22, -67, -41, 2, -69, 9, -22, 8, 1, -4, -9, -64, 1, -59, 43, 23, 27, -21, -7, -37, 6, 6, -13, 30, 40, -18, -28, -20, 26, -69, -23, 31, 35, 101, -27, 57, -24, -12, -15, -15, -13, -14, 41, -19, -40, 68, 31, 27, 12, 24, -75, -37, 0, -63, -37, -62, 12, -22, 3, 30, 21, -18, 0, -29, -20, -44, -56, 34, 22, -12, -31, 25, 33, -9, 8, -14, 56, -24, 20, -14, -11, 24]
7279B4QL4m7l5M1j4m6N5J4o4n4R5l9K3k5Lk2JL7L6k0Pk3Jl2P3Lm0k0Q6p6mNj9
7313c4N0m0KM5Rp9J4K1L1lll5kJ08r9K3L3m2O9l8M9o0n1J06p3K5j03P1qKO7q8
7345c3M1j5M1J0j2Po2O4oj8k0L9p7L9m6M1J1M6r8J00r9l2O3j6P3Mk3l5kK4j9j8
7377b8mL2L3p8J6L1o0P8j4l4OJ7J2k8JM6l3O8q1L9no0R1n5O2k6l2K5l3O5j4m7
7409a0jm5P1r8R8M1n5mp8O6L6k4m3N5p3P8k4m0Q5l4kJ4m6L1j5NRMl4L8J5N1o5
7442Fj1P9p2l7k0j9Q4OL9o5O5m6k9mL5J5M4p9L9j6j3M4o9L0R6j63J02o6J8rRL
7474dJ4L9p7M7q9J9L0K0k6O2j6l9j7M8j7K2K6o3Lk1j%L2PM1k6K9n5J3o1Q4k2l3
7507c1J8RjpoQO6n8oN8n2L2J1j1l2K%k1J2K9q6%L3O1n9O7p9K0rj1O2n0J8L%j5
$$ y = [24, 32, 66, 19, -16, 25, 11, -35, 20, 34, -30, -84, 11, -28, -5, -30, -27, -49, -48, -11, 25, 5, 12, -11, -10, -42, 31, 34, -6, -26, 60, -16, -20, -15, -34, 16, -24, -22, 23, 32, -47, -33, -12, 19, 16, 13, -22, -24, 84, -15, 8, 41, -1, 68, 30, 79, 19, -32, 74, 1, 26, -77, -6, -14, -12, 55, -33, 8, -7, 34, 44, 32, 39, -23, 41, 35, 17, -3, 36, -41, -2, -48, -7, 4, 50, -48, 52, -47, -79, -16, -32, 41, 45, 22, -13, -15, 9, -10, -28, -32, 0, 33, -45, -29, 2, -58, 20, 6, -28, -22, -5, 7, -21, -20, 26, -7, 61, -20, 19, 14, -46, 45, -10, 52, 26, -6, 19, -14, 51, 37, -10, -11, -56, 15, -83, 15, 56, 1, -3, -81, -15, 21, -3, -46, 9, -64, 14, -10, -50, 35, 1, -1, 13, -33, -2, -17, -12, -3, 1, -33, 5, 20, 71, 6, -5, 74, 2, -35, -55, -74, 10, 16, 55, -10, 55, 9, -20, -24, 11, 26, 70, -9, 30, 14, 1, 45, -24, 6, 102, -61, 41, -25, -7, -16, -7, -4, 10, 49, -28, 19, -70, -51, -21, -1, -27, 35, 19, -20, -37, 11, -6, 16, 42, -21, -18, -39, -40, -40, -8, -1, 40, 14, 43, -12, 1, -60, 24, 2, -31, -13, -4, -5, -12, -18, -10, 56, -2, -8, 50, -2, 30, 41, 30, -2, 0, 0, -21, -9, 20, -66, -66, -33, 28, -31, 36, -43, -23, -32, -43, 19, -31, -13, -10, -10, -25]
7543b5M2Lo4Q0m7n7Q6N7l5k0Kn9K3J9L2Rn6K2nj2m9P3L2rJ4p1J7K7Nj4l5L1n0
7576c4M8k4j0M9k0k8L2ln1J6L9j3lk3M3J1j3j6n7R7n6j9R1m2Ql5L2k1p2J31L0
7607H7J7r3N4o8j8O6l2Np5Q9k1j4L1p1K9nJjN6L7l5o3L4o1K5j4K1jJ1K1j1pQk2
7641b0j1L8j5M2k3l9l6L8N0j4p1M6L2j6K5l0K2N2j02N3L2p9P5m3lN0o8L6L6q3
7671b6M4k2N5p0PL9k1L1n6m7R2J1q8L1N0l8N0m6Mj9M8n2M3n3L5k1mL4L3r7N3K2
7703B2Rm7q0J26M3o4K7k6l7N6r3K3Q7o9k6M7l4J4L1L7k9M6LJ6q6O0Nn6j9K5pp
7735ck1L7k5Q5j32R4Qm1M9q5J6klO6j0k7Rjl6Q%J1M5k3q0O2M4j41P5J1LL3o7J4
7769b7L7o6K6j7N5N1k7p8O5n3Pj2M5Ko5J6M0M1J0q2J0L3Km1j0Q9o5j1K6m0NL1
$$ y = [-25, 17, 20, -44, 36, -11, -68, 18, 75, 40, 20, 22, -37, -14, 5, 37, 46, -10, 12, 7, -5, -54, 19, 51, 42, 56, -15, 2, 29, 34, 20, -15, 16, -34, 14, -10, -20, 29, 9, -19, 13, 10, -41, -25, 14, 1, -2, -25, 18, 29, 16, 0, -57, 40, -16, -35, 56, 14, 22, -13, 19, -2, -74, 57, 87, 104, 11, 65, -3, -21, 45, 13, 18, -57, 32, 11, -3, 28, -43, -14, -19, -18, -19, 37, 74, 39, -24, 10, -51, -26, -40, -19, -20, -9, 12, 1, -6, 2, -20, -31, 7, -8, 34, 11, -28, -64, -26, 24, 10, -61, -15, 17, 1, 26, -4, 18, 70, -32, 21, 53, -26, 49, 6, 3, 53, -15, 21, 57, -26, 18, -4, 51, -19, -12, 27, 6, 37, -19, -66, 26, 37, -51, -20, 30, -8, 42, -4, 0, -19, 29, -23, 20, -33, 2, -19, -23, 11, 44, -53, 0, 22, 31, -16, -96, 30, 73, 9, 36, 10, -27, 29, -64, -41, 46, -23, -49, -2, -36, -22, 9, 46, 17, 63, 66, 82, -4, 56, 61, 5, -14, 11, 4, -3, -24, 13, -12, 73, -59, 35, 43, 2, 51, -34, -18, -20, -23, 43, 33, 6, 15, 14, -22, -14, -14, -3, 42, 19, -61, 1, 45, -96, -21, -10, -7, 26, -41, -27, 10, -56, -30, -47, 8, 59, 32, -46, 19, -34, -27, -39, 6, 8, -57, -41, -1, 40, 50, -32, -22, 11, 13, -28, -38, 51, -14, -25, 1, -39, -34, -3]
7801cm2L8Lj6N6o2m2k7N4KO7p7J1L2j0MN9mo9Q9j21J35q1l4k5N0R7r6K1j7L8j1
7833A9Kmm0P7Kp8J11l0n0j4k0J0l2rO8k6J6k0k5L2pJ6J4l4K9j4J4rm1N5kmj0M
7867@Ok6K2m2Q8lo4j1L5m2N9L5q9rK2M8Pm5J3N7r6K5N8p8Q4o9J0J2oN8Jn9l2O8
7901C7jk6k2K5L8k3jn2L7L0r9N7k9N2k4lJ7l0Ljl5MM7l3PL2o1K2Nl0R2l1o1J02
7935D5n2Rj3PO8l6q8N3m4L4m5J33L5j15l3J1Q6r2K0N4k2j2J1oO7j27N4k4k2Qk
7966c8%M2l5L2L3o9N6p4N9QRk7J2n9K1J4K7j1k8M7K7l7n0N2nLl9N6m5J9j1J2k0
7999a9M7jK5q5R4j29P4koO8p1%P6j19M7M1o9N1q6M4qK8L1kn5J21j05m5J07j9o4
8030c1P9n5J1q7J1P0m7J14m7p0Q4r8l2O7M9p9P7kj3p5R3K5l7m1QL8J5K0o1J3M6
$$ y = [-3, -45, -7, -4, -20, 36, -26, -68, -95, -41, -39, 28, -49, -38, -6, -16, -12, 47, 43, -26, 63, -58, 77, -4, -38, -63, -13, 84, -12, 9, -8, 30, 19, 21, 17, -23, 54, 56, -22, 89, 59, 9, -5, -25, -15, -47, -56, 12, -14, 2, -18, -43, -11, -18, -2, 12, -22, 7, -7, 7, -2, -43, 12, 10, 6, -4, 0, 6, -20, 2, -40, 48, 45, -19, -30, 5, -37, 22, 57, -32, -41, -19, 29, 36, -9, 4, 61, -35, -10, 48, -30, 54, -15, -5, 7, 1, 59, 60, 1, -31, 37, 36, 10, -12, 13, 51, 28, 27, -25, 12, 42, -57, 0, -29, 23, -1, -4, 13, -17, -14, -15, -50, -46, 1, -32, -25, 7, -54, -32, -27, -57, 35, 4, -57, 45, -7, 2, -11, -4, 64, 28, -60, -7, -51, -17, -62, 71, 106, -9, -42, -31, 55, -37, -17, 37, 15, 3, 14, 8, 75, -52, 2, -22, -44, -36, -38, -38, 4, -31, 1, 34, -35, 21, -53, 6, 14, 23, -4, 8, -51, -30, -16, 11, 0, -28, 19, 46, 9, -41, 11, 6, 9, -30, 26, -19, 0, -11, 1, -19, 28, 27, 52, -33, 61, -68, 6, 4, -2, 66, -5, -5, 71, -48, -1, 40, -29, 22, -64, -20, -28, 0, 31, 29, -26, 95, -10, -55, 52, 33, -31, 48, -7, 4, -83, -72, -2, -49, 65, 18, -52, 32, -66, -98, -31, 18, -61, 16, 14, 1, -74, 19, 44, 7, -34, -26, 12, 27, 47, -14, -1, 45]
8061D5j4j8Lq7Q9k1qK0M8nl5k6J8l9K0J4Lk7l9O0m7lP2l5lJ6j00J08ll2K6lj7
8094b0J3k5K7Oj2Ro7J3J07r7k2O1M2J3o2J6n5P0k5m7L7K3k9J7O2r4P3p8N3LJ1
8125B3j9n8kJ0J1RK7p9J02n0J9j8J4Lk4L3k5m5O4k1K0m1L5K7p3pL9k6L2J4J9k5
8157a2jj1QK7j4pL8l7n6K3J4L7j7N4j3K2q5L9l7J5K2k0M1k1l7Lk1O9o2K5l9O4
8189A1K8M1
$$ y = [45, 31, 13, 16, -71, 18, -3, -11, 9, 57, 52, 17, -9, 9, -30, -10, 4, 7, -20, -59, 1, -46, -49, 23, -12, -15, 1, -99, 9, 6, -26, 0, -3, -20, -7, -32, -5, 1, -11, -2, -69, -56, 51, -46, -68, -7, 35, 48, -14, 2, -53, 17, -8, -55, -18, 5, -24, -7, 55, -39, 34, -44, 9, 12, 23, 4, -54, -56, -46, -35, -26, 1, -78, 24, -26, -7, -25, -11, -8, -32, 1, -24, -69, -5, -26, -6, -47, -12, 15, -58, -65, -26, -52, -20, -6, 13, -12, -13, -24, -16, 11, -3, -10, 28, -9, -65, -42, -28, 9, -8, 46, 33, 55, -30, 9, -28, -13, 9, -11, 30, 9, -28, -25, -46, 23, -39, -14, -53, 11, 39, 80]
8191H0
$$ Imaginary data points
##PAGE= N=2
##DATA TABLE= (X++(I..I)), XYDATA
0@%%%%%%%Qj6J6j6J6k2L0m0M8m8N6p2Q8j04J20j36J54j78K08k37K69l07L46l87
31b04M34m89N46o08O78p53Q36r29J032j143J263j398J549j715J902k116K357k632
49a390K956l336L789m349N056n975P229r055J1969j7332L0365j15610j53134L10676
63F1859J56028j87068k36353Q4855K71522M6446k75204j29267K15720K03823j30238
74H2123k56504P308K77275R1140k49710j73372J81729K31812o8803k57924l3916
85a68842K51836J21041k08715j84291J17926K17924j6024k32042q7159K14566
95B6220J70407j52239k16979O7714K39085L0450k28635j16310J80392J70073j10322
106E9856k04228J7324K11411P4984j87387j43405J39193J91833n7850k08432l4760
$$ y = [0, 0, 0, 0, 0, 0, 0, 0, 8, -8, 8, -8, 8, -14, 16, -24, 24, -24, 32, -40, 48, -56, 64, -72, 82, -96, 112, -125, 144, -163, 183, -204, 230, -259, 287, -321, 357, -396, 440, -489, 543, -600, 663, -735, 814, -901, 1001, -1115, 1242, -1390, 1566, -1770, 2019, -2330, 2726, -3249, 3980, -5075, 6894, -10438, 19927, -95683, -248817, 61859, 217887, 30819, -205534, -120679, 150843, 197289, -77915, -207182, 8538, 212361, 82123, -174381, -167073, 110202, 201342, -48368, -221740, -40011, 191801, 122998, -134926, -168842, 82994, 204035, -4680, -188971, -71045, 146879, 130855, -101187, -188346, 26220, 196627, 44388, -172591, -104877, 134208, 164658, -63977, -180287, 105, 170178, 59856, -144372, -127048, 84363, 159347, -28040, -171445, -32252, 159581, 101731, -106701, -141461]
117a41461J94940J11949j61065j70394R7002J95590j7566j91909n9588J70912
127B8410J29521j20852j71591N0887J83978K6701j74774j04449J36315J57327
137A41473p9836j80323J3428J79637N9945j51136j19512J05855J58308m7888j73919
148i3968k2265J57890Q6115j20466j35498O6963J63434j062j60657n9844J36500
159A7142J11743r4090j48145L6339J58294K2022j47369p8062J13481J22637n9417
170E4575j43301J373J44452N6421j22459j03765P9004J30876k8142j43099k8717
181a02782J34599P9925j04104j13169O0650J31897l977j29531n2204J06644R3262
192A01210p1957j20773K3115J27165K9978j14780p4992R1291J10577n1100j25311
$$ y = [-141461, 53479, 165428, 4363, -166031, -69029, 126561, 108995, -82914, -142502, 28410, 157931, 37079, -134512, -83625, 100353, 127054, -47720, -152169, -15854, 141473, 61637, -118686, -105258, 74379, 134324, -16812, -136324, -30469, 127839, 79951, -93968, -116233, 41657, 127772, 7306, -128192, -61229, 102205, 101143, -59514, -119358, 17142, 128885, 34795, -113350, -77011, 81283, 103305, -44064, -122126, -8645, 113992, 54575, -88726, -87353, 57099, 113520, -8939, -112704, -33700, 97176, 69034, -74065, -102782, 31817, 111742, 7638, -105531, -44881, 87016, 83039, -46492, -98696, 7948, 101210, 29253, -91520, -68405, 58760, 88738, -26042, -101034, -9743, 100834, 49734, -75577]
203g5577K047J19835M5329j01259q7438O5932J10162k2201j13051k3342J02259
214B2696O9182p5197j00797L9980J15193L05j13552m5443R2078Q0879o0787j02358
226g7821K2765J07905K1237r2676n8894O7323Q8387l4687j04636n223R9859M2160
238G5699q2458p5742N3881R9021j6593j01615j8524R0092N2749o5012q0212L0090
250c8624R1627L552r0717l8480P4100O9577m4326q8077J2502R5559K1861q5918
262a7364n2548O0765P2954l0735q5680l629Q3767L5529o6909n9679M1829P8631
274E6931q472q4653k4484P6204N0793n7295p1582K7058Q0398N089p7467l2837
286f0317O4939N6633l9658p0205R366P3886K0918o8218m9193M9000O6820k2873
$$ y = [-75577, -73530, 46305, 91634, -9625, -97063, -31131, 79031, 56830, -56221, -79563, 22696, 91878, 16681, -84116, -44136, 71057, 71362, -42190, -87633, 4445, 85324, 24537, -77821, -55056, 52849, 74086, -18590, -77484, -10161, 78226, 43539, -61097, -66320, 33539, 75699, -6759, -82501, -28620, 70401, 53808, -47807, -66331, 23761, 76510, 11498, -68714, -38624, 53003, 56555, -34162, -72642, 1458, 71035, 26709, -61368, -48866, 46693, 68554, -17364, -69912, -9147, 63807, 33072, -52608, -56237, 27530, 63059, -3850, -63529, -21700, 56931, 48459, -36194, -60678, 15526, 66319, 9024, -62558, -35500, 44898, 49987, -27480, -60317, 4622, 61255, 21597, -48608, -39242, 34644, 55562, -12656, -61849, -12849, 53971, 31098]
298C1098p4488n918P2923L4726n8796n4578L7812O6219j1507o9399j8626O0539
310A0005M2902m4161o0456K0589O8979Q199o4626l3116N2866N3152l3759o5002
322d4428Q418O5066J5867n7815l8784M1931N5809j8602o1565n721N9059L0487
334D9722m7027n0128K7363N9870o036o2221j7184N4592L7631l8696n1144J9249
346b4009N8374M514n4980k6942M2516M3792k5304n5251L170N6500J8131m9092
358h581l5660L5956M9787j6189n5057m512N1974K3792m2078m0801K3916M9412
370C1959l608n0517j6248M4934L4594l0718m5891J3494N1127N290m9791k4458
382c9833L9059L7976k3745m6285N097M7792J5233m0310l0774K8157M2033j1727
$$ y = [31098, -43390, -49308, 23615, 58341, -455, -55033, -17221, 48998, 37491, -31908, -50534, 10005, 52907, 8746, -51710, -31121, 37858, 46057, -18569, -51685, 1181, 54333, 20574, -44428, -36010, 29056, 44923, -12892, -51676, -9745, 46064, 27462, -34103, -39824, 19235, 49722, 2695, -47433, -20070, 39800, 33764, -28457, -45641, 8951, 46582, 7886, -43258, -24009, 34365, 38879, -16101, -43043, -527, 43265, 17961, -37290, -34120, 22380, 40511, -8581, -44241, -8285, 41502, 25313, -29744, -34256, 17718, 41510, -568, -41369, -17453, 31959, 28351, -22166, -38414, 6520, 41114, 10396, -35495, -22001, 29126, 34416, -15375, -39833, -774, 37202, 13457, -32828, -27731, 20061, 35294, -5016, -35790, -7633, 34400, 22673]
394B2673m7179p359M3951K3452l5733l7003K1735M5017l753m4610j3126L9087
406G152K8459k6936l8926J0384M1946O078m0155k2553L1317L5305j7577m1613
418b7119K828M2911J3811l6928k7445K5088L5966j1098m0223n592L6987K0379
430B9565k7999l1163J6013L8714n70l8851j4162L3291K5981k3713l5320R345L7948
443A9079N301l5126j8210K7654K9424j4655l4571O05L4722J3101l0428k5569K0027
456h646L2917p817l5761n422L3986J8492k5734k7264J4591L2297j259l2811j2516
469b4947K7063K2792j8461k9980O588L2985O775l0067j7754K3828K6743j3535
481A2030l1597Q07L0641J0724k6208k1088J7188K7766n494k9134o048K7585J7331
$$ y = [22673, -24506, -31865, 12086, 35538, -195, -37198, -15463, 29554, 25801, -18809, -31935, 7152, 35611, 8675, -30251, -19867, 22079, 28157, -11998, -34551, -3234, 32071, 14494, -27119, -24291, 18620, 32431, -4497, -31942, -6854, 29112, 18014, -22209, -27801, 9186, 29565, 1566, -29597, -13584, 25130, 24560, -14291, -28453, 4838, 30819, 7106, -28214, -18869, 19079, 24380, -10746, -28956, -1302, 28122, 13467, -21104, -20499, 14223, 27324, -3104, -28673, -8646, 24271, 16454, -19307, -24729, 9257, 27749, 2015, -25249, -10658, 21639, 20380, -12431, -24947, 2116, 24908, 6447, -23533, -16945, 16040, 22815, -7252, -25006, -1178, 25565, 12030, -19567, -18760, 11881, 22605, -3603, -24691, -7503, 20263, 14769, -14365, -20413, 7172, 24503]
494B4503k1181k5625J1450K9202p44k9533j1115K4785K0344j6039k5757O105K7863
507A4258N628k5010j5713J8616K2941j0343k7286p79K6766J1267k2475j9719J5448
520f401K5634n239k6520m904K3681J3975j7934k1296Q833K4393Q28k4272j0429
533a9651K0693J9141j3214k3827M329K5154N300k2762j4429J6577K0050q944k2932
546a4515j98K2468R697j8084j6887J1746K1961l209k3383o315K0709J3954j5759
559B185k0010Q463K2339L42k0836q235J7219J5639j0946k0227K979K0890N126
572A4928j8962j3308J3676J9116o629k1185o27K0602Q355j6330j4959J0431J8516
585A3624l589j9698m629J7093J1966j2020j7274N882K0265J627j9020q619J5136
$$ y = [24503, 3322, -22303, -10853, 18349, 17605, -11928, -23043, 1742, 22086, 6047, -19710, -13605, 14258, 19886, -5124, -20837, -2221, 20720, 10377, -16909, -17688, 9078, 20345, -2130, -21849, -6401, 19233, 13994, -12526, -17430, 6251, 20226, 2292, -19004, -10171, 14222, 15050, -9222, -19651, 1042, 20183, 6969, -16858, -12529, 12625, 17925, -4837, -19266, -2689, 17361, 8417, -14515, -14713, 7755, 17452, -632, -17519, -5773, 16188, 12979, -10404, -16719, 3990, 17944, 2185, -17825, -9362, 12977, 13319, -7517, -15752, 1467, 17106, 6160, -14067, -11088, 9802, 14928, -4034, -17342, -3666, 15450, 8821, -12364, -12991, 7611, 15966, -364, -15323, -4892, 13624, 10035, -9663, -14292, 2801, 14767, 2747, -14527, -8645, 11620, 13247, -5773, -14392, 744]
598G44J4275r875j8324K904J8760L938j6370j0340J1767J5921n043j8084j588
611a1315J7237Q053j3816j3971P807J7399k051j8195l903J6079J0075j0837j4450
624a1888N053J6999J217j6570p499J2397J2196p042j5917J027J7177M876j4800
637b774r361J0476J3699m564j6291j622J5527O576j2457j1258O808J4461l96j5196
651f372m691J3916R379r483j2942L570J4791J724j5090o979J2140J0766o757j3015
665i043R56J4322M871j2752q922Q769J1595l592j3701k523J3589P171j1284j0331
679a0875O962J2719o96j3172m503J1792Q422q715j1149L342J1960K087j1910o673
693a0409J0130J0351n914j1866P73J2514M276j1389q524P996J0451l639j1295
$$ y = [744, 15019, 5144, -13180, -10276, 8484, 12422, -3948, -14288, -2521, 13400, 8357, -9727, -11315, 5922, 13975, 159, -13812, -6005, 11394, 9343, -8852, -12755, 3324, 13399, 2562, -11888, -6835, 10164, 11381, -5189, -12688, -291, 11905, 4863, -11054, -10027, 7150, 12026, -2774, -12135, -1659, 12040, 7476, -8815, -10437, 5090, 11666, -791, -12049, -5241, 9220, 8824, -6372, -11063, 2853, 12232, 2749, -10193, -6623, 8168, 9892, -5198, -12177, -37, 10729, 3972, -9043, -8087, 6235, 11106, -1646, -10568, -1799, 9796, 6204, -7497, -10020, 3569, 10740, -544, -10875, -3913, 8806, 8110, -5062, -9565, 2227, 10649, 1934, -9215, -5873, 6087, 8174, -3736, -10409, -279, 10072, 4158, -7708, -6935, 5579, 9855, -1534, -10058, -2062, 8389, 4750, -6545]
706f545j631J0943O579q954r284N706J1068q76j1397m570J0061Q290p737j0488
720h835L466J1009J545r895n792Q443R065n361j0359J009R964L564q995q082O408
735b846J0671k947j0772r55R726N408p262q602M461R980j251j0041l156Q389O679
750G482n665r228K514J0236J784r188n239O879Q030m162r628M02R337K901p951
765a496o052N676Q578j981r291j473Q522N003o510p859L344Q755k16q762l016
780f778P520O043m911p919K259Q788J162q142m591N837O877l191q302j04Q137
795B685L387o696n617M752P558j850q191j375P422M176n851o761L066P759J36
810D600p410k983O370N598m018p019J373P408J222p097m186N228O392k962p342
$$ y = [-6545, -8176, 2767, 9346, 392, -8892, -3186, 7882, 7006, -4391, -8961, 1100, 9390, 1653, -8835, -5369, 5640, 7185, -2710, -8502, -59, 9006, 3645, -6714, -5705, 4259, 7823, -1172, -9254, -2846, 7825, 4878, -5894, -6849, 2877, 8285, 1023, -7579, -3118, 6862, 5611, -4430, -7586, 803, 7482, 1817, -7411, -4897, 5339, 7123, -2065, -7304, -425, 7605, 3443, -6185, -5783, 3554, 6455, -1496, -7548, -1872, 6706, 4725, -4566, -6039, 2483, 7486, 976, -6883, -3539, 5216, 5000, -3762, -6778, 742, 6785, 1874, -6045, -3786, 5002, 6164, -1978, -6569, -732, 6145, 2954, -5348, -5452, 2685, 6072, -624, -6241, -1489, 6069, 4219, -3972, -5347, 2075, 6251, 400, -6361, -3295, 4464, 4600, -2810, -5793, 577, 6175, 2157, -4862, -3489, 3919, 5141, -1956, -6142, -914, 5478, 2516, -4826]
825d826L84P196K877n772n095L611O634j325p159j453O167L849m817n767K749
840b747P137M2o852k502N577M771l460o509R15O626J247n958l410M379N363k027
856B592o346r9O557K421n405m536L144N788r76o328j479N796L451m095m642K039
872b118N852L13n989k615N025M165l344n409P28N818J690n371l257M143M734k073
888B292n288k52N207K299m736m122L073N056r27n183j471N000L670l748m668J981
904a817N001J04n043k336M101L873k943m690J114N003J353m364l230L417M486
919D029j830n048l05M601K023l843l682K654M717q75m647q72M210K832l005m346
935c387J344M714K5m472j896L533L464j993m371P99M732Q29m002k611K717L737
$$ y = [-4826, -4442, 2754, 5631, -141, -5236, -1625, 5009, 3684, -3475, -4928, 1239, 5088, 271, -5496, -2747, 4390, 4432, -2420, -4922, 655, 5426, 1966, -4543, -3628, 2998, 4245, -1713, -5123, -744, 4619, 2592, -3754, -3853, 2704, 5125, -280, -4816, -1672, 4116, 3140, -3188, -4667, 1129, 4580, 485, -4157, -2118, 3734, 4047, -1942, -4557, 468, 4633, 1289, -4120, -3392, 2426, 4116, -1255, -4512, -369, 4365, 2292, -2996, -3248, 1959, 4258, -478, -4600, -1527, 3529, 2602, -2581, -4052, 948, 4618, 870, -3798, -1817, 3184, 3288, -1755, -4091, 10, 3883, 940, -3750, -2636, 2367, 3720, -644, -3874, -457, 4029, 2199, -2849, -3154, 1447, 3470, -373, -4055, -1401, 3316, 2441, -2206, -3078, 1132, 3964, 959, -3387, -2043, 2671, 2696, -1776, -3672, -139, 3325, 1332, -3039, -2240, 2492, 3321, -681, -3292, -575, 3162]
951C162j327m714k23M358J807l228l026J992M131k15m430j136L812K302k856l549
967c140J101M168L96m059j664L440K910j742l653K77L791J155l742k431K553L128
983B488j053l707m55L963K004l088k875J908L408m59l665j237L177K255k418l087
999b841J192L470O37l373j742K892K822j820l420J92L362J071l128k335K275L071
1015B325r83l020l25L150J631k513k778J491L139l28l379j033K828K235j930k834
1031b324J065L154L10k851j544K249K335j489l066J87L045R84k451k033J829K945
1047B345p57k950m17K754J299k304k281J223K717k05k780p73K428K003j580k510
1063a788N84K797M86k856j470K035K142j231k615K34K752R99k332j659J590K326
$$ y = [3162, 1835, -2879, -3102, 1256, 3063, -165, -3191, -1199, 2932, 2717, -1713, -2849, 963, 3265, 409, -3140, -2039, 2129, 2525, -1534, -3198, 242, 3152, 1410, -2243, -1966, 1825, 2980, -762, -3193, -640, 2488, 1435, -2272, -2727, 1236, 3240, 152, -2723, -815, 2593, 2134, -1531, -2768, 409, 2664, 246, -2841, -1649, 1821, 2458, -915, -2657, 235, 3057, 1237, -2183, -1991, 1371, 2442, -686, -3021, -746, 2325, 1342, -1678, -2003, 1147, 2778, 265, -2513, -1022, 2117, 1789, -1590, -2623, 205, 2440, 510, -2324, -1259, 1895, 2205, -646, -2190, 59, 2394, 905, -2161, -1974, 1071, 2055, -396, -2429, -600, 2345, 1588, -1362, -1779, 975, 2274, -30, -2311, -1088, 1629, 1424, -1356, -2129, 299, 2302, 722, -1788, -1204, 1593, 2079, -777, -2247, -212, 1930, 699, -1916, -1682, 1070, 2069, -263, -1922, -332, 1994]
1079A994n58k726n75K406J396k022k002J053K527m3k367q04K224J663j594k182
1095a610N40K373K93k399j285J777J957q62k238J32K323R09j989j639J342K042
1111A666o12k452l44K103J238j617j810R86K287J02k199q80J744J489j245k059
1127a603M31K162L63k057j129J738J787q16k030L1K115O05j694j466R96J813l94
1144H52k017l15J964J086j368j677R05J936Kk020q35J589J363j241j728L97J924
1161H17L19j541r55J254J654o58j953j8J784O75j627j386J037J799m30j661k29
1178a119J639Q99j122j406M75J694o7j724o67J339J241p85j725L96J904L96j632
1195b64q50J085J281n94j673k4J464N40j177j041Q45J581j45j725l64J529Q61
$$ y = [1994, 1436, -1290, -1865, 541, 1937, -85, -2087, -1034, 1493, 1450, -917, -1721, 503, 2166, 572, -1610, -1070, 1303, 1596, -803, -2088, -311, 1646, 784, -1454, -1322, 1001, 1910, -79, -1718, -376, 1666, 1054, -1398, -1742, 361, 1599, -18, -1828, -842, 1445, 1547, -652, -1532, 212, 1701, 456, -1603, -1172, 990, 1353, -704, -1833, -95, 1692, 876, -1154, -1123, 992, 1597, -97, -1563, -567, 1246, 852, -1165, -1480, 484, 1570, 202, -1475, -570, 1366, 1368, -652, -1487, 102, 1465, 224, -1504, -1107, 817, 1136, -405, -1360, -106, 1548, 890, -1063, -1081, 703, 1378, -249, -1635, -598, 1201, 771, -890, -1119, 520, 1419, 297, -1109, -634, 1060, 993, -731, -1398, -59, 1182, 397, -1328, -932, 972, 1368, -264, -1114, -29, 1252, 658, -1015, -1039, 425, 965, -212, -1253, -408, 1173, 1028, -697, -1061, 468, 1329]
1212A329j110j387M27J545K5j481n63J255J090p68j258J70J604L69j528q97J025
1229a53J119m36j452j66J460P03j232q19P87J183p7j464m49J309P84j075j126
1246a104L93J296L35j322o83J219R51p29j106J88J183L27j349p71R88J014m21
1263D09j050j67J197P63j041j034O53J114j58j238m79J152P43q51j100O36J243
1280G92Q4j097o40J001R04p40j026P0J059K83r19q25Q88J042l50j121r6J150N66
1299A025r49r17N21R76j72j038l98R46Q53o71r69M24J094O4j051n02P78P81n43
1318B52j075R5J094K80q38n06N50Q85k02j002q8Q48M75p69r52N16J057j37j005
1337e22k08R25O05n94p46K74Q48J7r31m00O58O42m13q49J89Q60M27q12o41P10
$$ y = [1329, 219, -1168, -741, 804, 829, -652, -1215, 40, 1130, 362, -896, -726, 878, 1247, -281, -1178, -153, 966, 530, -922, -1088, 372, 1075, -157, -976, -189, 994, 917, -547, -996, 313, 1097, 22, -1104, -711, 585, 920, -402, -1085, 134, 1085, 356, -750, -562, 621, 948, -401, -1172, -184, 830, 409, -641, -808, 389, 1152, 111, -923, -270, 844, 686, -552, -1031, 121, 864, 13, -1087, -451, 792, 876, -221, -861, 140, 1044, 304, -722, -652, 407, 690, -229, -1054, -166, 876, 526, -595, -691, 459, 1025, 76, -841, -320, 656, 484, -554, -952, -6, 847, 176, -793, -369, 725, 789, -262, -764, 14, 795, 252, -823, -728, 366, 646, -192, -698, -148, 737, 535, -467, -555, 293, 768, -1, -953, -437, 620, 483, -522, -730, 195, 800, 206, -540, -266, 582, 599, -332, -732, -74, 568, 155, -694, -505, 355, 782, -30, -671, 39]
1357C9P64m60p97j38P56L58o13o74N08Q09j20o75l54P59O29n02r61K73Q32jp65
1378c33l95N92P42m15p71K85P52J30o35n22M15P00j94q96p2O59M58n69n34L97
1398b06Q16o9q37j31N90L22m59o02J43P23J23o00l83N44N98k44p44J22O65J58
1418E29o94m29M05N59p5p23p9P30L18m90m37K15N85R5q39j65N84L10l50o16K14
1439c53Q07J6o72k30N62L75k23n66p7N35K60o15m04M36M88q5n61q7O87L35o01
1460B7n05M44L83p5n25k74N08M08k72n13J77M85J81n26l22M31M75l45n83K5M81
1481H5L11m40m31M06M98j25m52j31L85M15m96n04K14N84j01m45j76M37L71k51
1501A54n01K35M72n5m76j73J71M45j31m89K8N19K37l96m25L28M14j61l73j08M10
$$ y = [39, 803, 343, -454, -592, 164, 522, -91, -765, -257, 552, 432, -243, -597, 162, 791, 289, -672, -399, 433, 432, -333, -728, -136, 606, 191, -580, -295, 457, 587, -48, -570, -155, 545, 351, -545, -617, 42, 500, -69, -603, -206, 610, 541, -296, -427, 163, 485, 26, -576, -433, 290, 413, -187, -570, -26, 572, 328, -416, -294, 371, 529, -165, -594, -189, 370, 295, -428, -507, 223, 541, 51, -386, -171, 414, 509, -330, -495, 89, 399, 49, -567, -353, 454, 470, -202, -432, 130, 505, 282, -284, -361, 174, 434, -181, -585, -149, 339, 254, -307, -394, 293, 628, 27, -478, -34, 349, 274, -251, -525, -17, 391, 119, -394, -217, 268, 449, -77, -399, 32, 507, 162, -421, -396, 85, 396, -44, -475, -69, 429, 304, -148, -279, 106, 521, 25, -479, -265, 319, 218, -227, -403, 34, 405, 154, -347, -112, 360, 305, -171, -344, -173, 272, 141, -348, -320, 199, 436, 40, -385, -57, 357, 196, -177, -285, 125]
1522A25J15k71m19L03L95l4l97j2K79K92k40m18J35L33P1m48k51L56L67j96m04
1543c19J62M38R8m07k45K80K49j03m37m3L70J79l06j76J37L84Ll29j24L11J93
1564C15k91l90K10L03J6l18j02J92L66j11k91m7L49J35l54l02J85L28q5l62j0
1585b64L40K00k29k59K10L11l4l80j29K28J76j29k17k2L08J17k62j60K51K43j80
1606A19k70l1L04j0j93k61J94K65kk28j12L01J11j54k33J44K54j4l29j32L13J04
1628A40n9k56R8K16R6k65j77K18J47m2k84oK64Q0k05j74J44K94j16j60o4K42M4
1651A75j49k99J64K35n0j93j02K65J00p1k02J04J91R0l69j27J84J76j08j87O0
1672a13K23O0j39j00N4J50l8k56rJ93J58k03k61J82K57j4k06n6J57J26r5j91N5
$$ y = [125, 240, -31, -450, -147, 248, 214, -183, -195, 84, 376, 136, -282, -147, 186, 257, -191, -442, -86, 281, 85, -319, -157, 281, 379, -28, -273, 7, 256, 153, -284, -327, 43, 222, -84, -260, -123, 261, 264, -65, -189, 122, 315, 24, -366, -156, 147, 163, -155, -257, -65, 301, 190, -101, -148, 201, 336, -18, -320, -135, 193, 108, -254, -264, 76, 276, 47, -212, -2, 309, 275, -105, -234, -6, 170, 41, -176, -198, 110, 227, -35, -195, 56, 299, 119, -151, -182, 122, 112, -81, -342, -148, 117, 115, -113, -225, 76, 187, 33, -200, -56, 198, 184, -145, -277, 36, 140, 81, -175, -77, 139, 235, -30, -207, 11, 158, 116, -168, -174, 90, 170, -35, -209, -65, 229, 113, -47, -111, 131, 175, 26, -273, -109, 126, 76, -117, -219, 46, 146, 75, -127, -23, 168, 258, -111, -238, -54, 122, 14, -173, -113, 110, 170, 31, -69, -15, 135, 97, -159, -168, 25, 183, -20, -281, -99, 158, 144, -62, -118, 39, 165, 70, -121, -66]
1695f6J12L2j75n6J53J60o8k30L7K18N5j52k19J75J39m0k99K8J94J02j22j07N8
1718g1K05J9k07m0J26J80j81j93K4J96M0k10kO4K40j78j22M8J21Q3r3j78Q6J48
1742A05K2k18j10K51P6q6j59P4K24l4k65k3J48P4m1k05L9K28M7j41j58J27J77
1765A52p0k19qK17K6j43m6PK05p9r2j1J05P5n4j34J2J70K5k09q0P2J24k2j43j2
1791a32K30L8j22j07P7R0k6j30qJ07j3n8rK4J47J4j51o4K17j2j20j59J44J33q8
1816B2j09M3k0J52m9m7k4J39n2j21k7J6J21L0k09%J60J44j04r2MP5O0j75o6J55
1842B6J13j88r3J07P5O1j67k7J04J29j26k0o5J41n3j29M4J2J26l4j02l5J38J21
1866A58j06j45N6J09n2n0q7Q3Q5m8p7J5R5Q7j09p9J13J4p3o1k0J05Np7k3J19N9
$$ y = [-66, 46, 78, -97, -153, 0, 160, 92, -138, -101, 117, 172, 20, -199, -24, 115, 75, -224, -196, -2, 100, -22, -129, -71, 134, 153, -54, -94, 32, 212, 31, -162, -138, 58, 98, -112, -114, -50, 190, 12, -110, -62, 59, 142, 49, -129, -43, 105, 127, -91, -201, 50, 126, 40, -119, -45, 179, 145, -120, -143, 5, 79, 38, -167, -128, 100, 147, 6, -152, -25, 152, 82, -137, -145, 72, 98, -45, -91, -84, 121, 42, -50, -61, 44, 119, 65, -69, -57, 113, 138, -71, -151, -79, 45, 23, -120, -132, 98, 136, 14, -93, -16, 74, 48, -82, -90, 17, 4, -54, -63, -39, 108, 122, -29, -93, 124, 112, -8, -167, -23, 110, 22, -87, -44, -64, 88, 39, -8, -32, 107, 55, -66, -93, -77, 44, 74, -135, -135, 25, 169, 65, -27, -23, 52, 112, -63, -129, 26, 139, -49, -142, -35, 40, 101, -66, -93, 11, 140, 14, -6, -71, 70, 17, -112, -68, -56, 70, 36, -66, -101, 37, 158, 52, -93, -37, 72, 20, -30, -117, -34, 51, 3, -74, -59, 36, 123, 14, -65, 48, 62, -11, -72, -92, 13, 18, -59, -82, 37, 96]
1893I6o4m4J4P0L8j03o5K6J03o1k3o3O9P6j12m2J05J13q6o1q4J36j4k3j15P7N9
1920B2L4j17k6R1N3k6k8p2J31o7j5l9O8Q2q0m2l3J12O8r0o7K7P2j0p9r9P7N2p6
1949g7o3M0J16J4l7m9qJ45n8k7mJ8N2p4l3qQ5J8l2o4J13L7rj55J5J33m5n2k2K1
1979a0M6n2MRQ6Kr4O9r1L6J6p5n3J15lm1q2J50J6m6k2m2J18l2m7Km1J9N7o5J2
2010c9L2M6j1L5p3NL7j62K5N1L4J1l9LJ01q0K2q2O6P1l9pm3L9Mk8J7M6L8qm1j9
2042A2M4Jj6r8k3P6J8l7o6JJ38m3l5O0p1J07j19K5p4N4M5Nq9N3P9k7m2j1M2L3
2072D2j0m0L6K8q6mK2QJ0rmjnJ6J5q0K9P4m7J1K9Mj5j04N8M5KN4j1n0mJ8l3l0
2106c2N8L4r5l2L2QJ12j32L8L9%l7oo0R0M8j23J4J0k8O9p3R5p8J66r0j13J03R
$$ y = [96, 32, -12, 2, 72, 110, 7, -58, -32, 71, 10, -13, -76, -7, 69, -43, -85, 20, 133, 47, -14, -98, 38, 24, 1, -114, -37, 22, 56, -61, -87, 4, 57, 31, 3, -69, 62, -5, -20, -59, 9, 91, 11, -31, -64, 48, 116, 26, -41, -14, 58, 48, -31, -130, -53, -1, -77, -140, -100, 16, 30, -7, -56, -64, 81, 23, -4, -8, 10, 62, -12, -45, -53, 32, 50, 18, -46, 67, 104, 95, -60, -45, 88, 43, -9, -31, -10, 36, -16, -12, -3, 83, 85, -9, 60, -31, 5, 21, -54, -107, 8, 5, -36, -118, 32, 48, 2, -20, -62, 56, 24, -23, -21, -62, -43, 14, -51, -39, -7, 39, 28, 63, -10, -5, 32, -130, -105, -54, -20, -9, -48, -45, 56, -24, -2, -84, -18, 53, 14, 7, -36, 3, 7, -21, -4, 42, 80, 72, 31, 12, 56, 57, 41, -57, -80, -4, 14, -23, -89, -88, 50, 7, -28, 32, -39, 68, -51, -26, -100, -46, -1, 4, -85, -32, 47, 20, -22, -33, 9, 42, 32, -8, 28, 56, -30, -34, -12, -4, 6, -3, -7, -8, -13, 3, 18, -62, -33, 41, -6, 5, 34, 38, 23, -81, -23, 22, 24, 78, 67, 17, 13, 31, -2, -32, 26, 60, -35, -67, -35, -27, 85, -47, -9, 30, 30, -7, -13, -73, 17, 65, -58, -44, -34, -62, 7, -66, 29, -49, 117, 27, -86, 17, 26]
2135B6j5p1P9j3j9N5o8K9J7Pm3N0J7jPj02L4L6M4p2RLlJ3J6k8k3N4l0KK7pL8l6
2169C2q0J5M0J3o7R0p3L9KnJ3l9n6RM9N1n0PJ9l4M5k3J7j13Q9n2M8M3p6Q4n5k4
2201d2N8J4ONl4Jk7M6k4rJ1K3j13J32j1q4P9Km6l5J3ok2J5L5P4j46Q1k0J5N5n1
2233el0l0L7K8j4j5nO0j1J3o5M8j1N8m3qnnK2l3N9k8l2Pk3N8j3l8llQ2k9j12P7
2267a2L6o4k5l0P2L8k1n8O8L6k1n8O4j5JOn3l0R6j3o1Q5Qm9j8LjJ1L7l2j8J9J4
2300A5ooL4q6J2P4m8K7N1j6n1m9R2J0p6jJ6k7l2J25j27L0N5lo5JQ3l1ml0L6L1
2332C4q8K0N7%pj2k3N5j10N2L3l6rM1jnRK2p0M6p3J1j5M8kl0R7o2M6l5j8J37r0
2365B2l2jN7m5l0P4m5j5n1M0P8l5k6J6Kj8M8n3K4r0P5J0K1n6L4o4P9k8P8n1m5
$$ y = [26, 11, -60, 19, 6, -13, 42, -26, 3, 20, 27, -16, 34, 51, 50, 57, -45, -11, 25, 69, -3, 6, 9, 6, 19, 35, 7, -16, 38, 8, 10, 37, 30, 68, 32, -48, -33, 7, 20, -47, 43, -30, 9, 11, 6, 19, -20, -76, -67, -18, 33, -17, -10, 9, -25, 20, -3, 14, -99, -10, -62, -14, 29, -47, 37, -18, -42, 16, 30, 36, 41, 7, 8, -19, 27, 3, -6, 5, 28, -85, 47, 36, -48, 31, 33, -13, -48, -35, -41, -63, -48, -13, 61, -85, -4, -24, -9, 46, -5, -35, -65, -28, 0, -14, -29, -34, 26, 15, 28, -37, 11, 0, 58, 15, 7, 2, -3, 19, -14, 45, 17, -15, -8, -31, 27, 14, -24, -27, -30, 52, 23, -89, -12, 24, -40, -65, -95, -23, 15, -6, -64, 4, 40, 19, -39, 25, 10, 11, 17, -36, -66, 30, 17, -44, 41, 49, 0, -18, -15, -16, -5, 32, 0, -18, 1, 15, 9, 3, 37, -49, -37, 37, -11, 16, 67, 51, 0, -49, 43, 53, -23, -24, -8, -35, -67, 58, -69, -39, 16, 13, -52, -51, 32, 1, -3, -33, 3, 34, -54, -34, 23, 23, 16, 4, -19, 36, -74, -22, 11, -25, -34, 7, 6, 1, 10, 32, -38, 8, -65, -54, -69, -21, -23, -53, 44, -18, 28, -7, -25, 112, 22, -10, -11, 46, 1, -29, 45, 0, -15, -66, -26, 52, 17, -9, 7, 9, -9, 39, -14, 10, -80, -5, 5, 26, -30, 4, -60, 19, -9, 69, 18, -27]
2396b7J0J0K0n9O3mqM9m8n3N1l1K1j0k0j9M3K2p6P4o0mJ65k2r5j4K4QL5j2J8k9
2428B2l8l7Q6n4j3oJ1j7M1Rk7P0PJj31N3J2O4mo5P1j3k8k0Mk7l7R1p8O3j05J20
2460B5k4k1rM3nl6KK2K2k0K5k8Qjj01J23o6M3LJ1M2n5LK0n1KL6L3q5K6lL4k9l2
2494d3O5lj8j7M1n9O5q5l9K3N2mK2K1Pm1K6k9JK6n8Q3k0o7L3L6k6k2R2j33R5n4
2526c0o4J15k9pLN5k1n4j2P0k6N5o7K1m8P1L8n1K0j7l0m3L7L7K5j00Rk6R8Nm8
2557a4O6j5m1N9j6o2j8R3kj6j3l1Op5P9J2l9OLRM0k6k1J6K9q0%Q0Jk1L0l9o1K3
2591c8P3o4m6R8k7M0lPl4l9J15l7q4J4Q5q2j5K9N7l4m8L2k8k7RL6L5m1K4K1j4
2622A4J6p7J33j48O6J2j2l8K5nkj2K7j7K6JM9l6m6N6l0N2j04qJ32r7l4N3kK6l7
$$ y = [-27, -17, -7, 13, -46, 17, 13, 5, 54, 6, -47, 4, -27, -6, -16, -36, -55, -12, 10, -66, 8, -52, -56, 109, 87, -8, -22, 2, 10, 45, 33, 51, 22, -16, -53, 33, -21, -34, -40, -29, -46, -5, 4, -23, 47, 54, 55, -76, -23, -11, 53, 49, -16, 55, 42, 14, -6, -2, -29, -66, 25, -53, 10, -95, 25, 1, -20, -29, 14, 9, -27, -25, -3, 19, -1, 24, -4, 4, 3, -98, 25, -41, 2, 5, 16, 58, 3, 6, 26, -25, -23, 13, 46, -39, -13, -16, 18, -11, -43, 22, 19, 1, -16, 25, -34, 31, -54, -93, -70, -18, -22, 0, 21, 28, -13, 13, -16, -15, 11, -47, 36, 16, -51, -18, 18, -8, -30, 62, -71, 24, -30, -94, 21, -8, -15, -12, 43, 22, -32, -44, 26, 0, 55, -12, 9, -39, 32, 70, 19, 39, 22, -8, -51, -14, 23, 48, -52, -43, -69, 29, 34, -14, 52, 37, -4, 55, 39, -23, -41, 52, 50, 34, 21, -10, -4, -79, 0, 12, -27, -21, -18, -9, 31, 5, -16, 0, 29, -51, -51, 29, 30, 9, 39, 0, -61, -38, 35, -29, -75, 23, -4, 36, 33, 40, 6, -33, 82, 45, -39, -25, 60, -22, -37, -8, 49, 15, -33, -1, -29, -56, -47, -11, 24, -17, 7, 28, 14, 30, -47, 86, -62, 4, 16, 4, -34, -9, -14, -16, -28, -1, -18, 8, 9, 58, 22, -24, 32, 2, 54, -50, -58, 74, -23, -57, -4, -6, 20, -17]
2653a7K9l8J4l0R4M3j52P5J7p4jk1R5jl3k9K3O4j32J66j10N0n9J5L0km4M9o3M4
2683BJ1J8o2K5m9P9p7oP8k0J6L7q6nL7rJ7J4Pj8j02J28l1l8rJ9K7PL1j8m1l2k6
2716g6P7nl9P4m2OJ1M0l1Qmn6P7n5O6l8l6pKN8q4R6l7oj1l3P9or0J22m3Ln7M2
2750EpM4N9n3%L4p0J9qm0l3L9MRP0j44R6j3p4j2M1P5l8m1QL3Olk7k2M6l0L5m7
2784c9Q5o0n0P5Ql8mM7p8P0l0qn5M5O3o3L9k9L2n4J7L8j7J2lJ6qL3o9L3JJ2n8
2817c7M2k0j3K2J6n2K1Q1o6N9J0o2rJ9l9MO5n0J4kJ0k8l6J12o1K6J9n4K4l9P2
2848D8r4MLM8nk5j7J3L5K4Pl3LK0l5L3m3M3j0qJ3oo0mK5l5J3pQ7j0j08K6N8j2
2882iM7k5J3K6o1j0Q9r9M4j5L6q2J00k7n8O3j5ol6k8RJ22j10m3J20j6m7K9J6J4
$$ y = [-17, 12, -26, -12, -42, 52, 95, -57, 18, 35, -39, -40, -61, 34, 33, 0, -29, -6, 58, -74, 92, -18, 32, -27, -12, 18, 16, -28, 21, -42, 2, 13, 31, -31, -6, -55, 24, -53, -59, 19, -1, 15, 52, -34, -39, -2, -11, 6, 20, 27, 9, -93, 35, 4, -34, -43, -24, 3, 10, 41, 23, -18, -50, -76, 1, -4, -43, 31, -11, -5, 6, 46, 15, 23, 19, -37, 40, -15, 51, 13, -23, -30, -28, 30, -54, 42, 5, -1, -12, -45, 34, 28, -62, 60, 17, 20, -37, 5, -2, 42, 101, 48, 48, 82, 12, 31, 23, -17, -50, -11, -7, 2, 72, -72, 24, 11, -63, -75, -34, 41, 3, -38, -30, 3, 9, 6, -21, -43, 3, -27, 8, -39, 46, -14, -64, 11, 19, -19, -23, 24, -54, 16, -14, -22, -77, -32, 31, -32, 7, -22, 10, -44, -27, 11, -6, 6, 3, 19, 11, 44, -25, 8, 9, 21, -37, 5, -15, -28, -6, 10, -42, -21, 60, -6, 53, 63, 1, -8, 11, -28, -24, 41, -9, 5, 3, 13, -15, -51, 61, 0, 26, 45, -9, 15, -24, 48, -46, -42, -39, 9, 4, -21, -38, -25, 10, 34, 41, 8, 11, 31, -4, 29, -14, 29, 19, 11, 24, 18, -42, -46, -21, -56, -43, -50, 37, 27, -81, -55, 3, -9, 38, 13, 26, 52, -9, -19, 70, -29, 15, 0, 36, -46, 54, 27, -31, 32, 17, 11, -25, -53, -44, 78, -32, -75, 45, 29, -18, 11, 27, 41]
2912D1p9NP5l4J9N7r8L9K0n5Q3n1J06j27K1J3p5O3l2K9NkJ9l9n9M1QN9m5M9m5
2943A1K9l5K8n7L6MLj5m2N1l2J7Qj4O2n3KmO3o6k1K0K6k6L7m4k8K2%K6K1j9l8
2976b8O0o9J10j1o2L4l3Q1m4Rl4j8P2j2o7L7k5m4Q2q1J08q6J2Qm1Q5j3m9PP4j15
3007e3L9J1M7n8J3n9L1K8N8r8QM8lq0O0j1n1N3P2r7M7J7m1j4J8ORK8j15J34p1
3038b4L7k7J5jK0pl1J1O4n1N3q4o7N1N4l7j3J3J0K0L6k5k6J5O7r2J2pNo4N2M0
3070A9m6L4Jk4l2P7p8J07j9j3j0o7N6k7N1Om0NNk9K0J8j9k8J9j8k7R7j6Q3o9p3
3102c7L2J0m1Q1J9k4j14Q5J3l7K3lk2KLK7K5r8M5K2ok5l0R1n1K8J4o6M0N1l3j7
3134Gkk4K6j8o4J36q1Mj9M5n0O6j6NP0o7M7m6K5k9K3j4k2K9L0n2J0j00L0R2m4
$$ y = [41, -38, -33, 42, 8, 27, 84, -14, 25, 45, -10, 73, 22, 128, 1, 22, 35, -40, 23, -9, 20, 25, 23, 42, 3, -56, -15, -7, 52, 7, 56, 11, 40, 5, 33, -24, 12, 16, 19, 4, -38, 13, -19, -2, 6, -8, 54, 1, 3, -1, 62, -4, -25, -5, 21, -5, 32, -12, -40, -18, -18, 8, 29, 10, -28, 32, -37, 73, 62, 0, 34, 1, 82, 38, 47, 13, -5, 67, 55, -12, 25, 0, -44, 38, -43, 65, -21, -9, -1, -42, 43, 30, -19, -12, 62, -53, -14, -3, 44, -14, -1, -60, -29, -1, 57, -41, -33, 15, 12, -68, -8, -19, -70, -17, 55, -42, 5, 22, -19, -33, -15, -9, 0, 28, -87, 47, -24, 13, -14, 1, 0, 20, 13, -18, -7, 57, 6, 59, -25, -92, -41, 13, -24, -37, -24, -14, 6, 42, 17, -9, 6, 73, -19, -7, -14, -9, -73, -21, 19, -27, 7, 8, -16, -48, 29, -49, 58, 39, 26, 16, -51, 5, -22, 29, 35, -5, 0, 5, -24, -4, 14, -5, -33, -14, -32, -59, 38, 22, 105, 36, -37, -5, 5, -36, 45, 64, 40, -74, 11, 24, -13, 10, 7, -15, -13, -10, 17, 42, -56, -11, 11, 5, -20, -50, 41, -10, 18, 32, -34, 6, 57, 24, 7, 5, -19, 7, -11, -75, 61, -20, -16, -35, 10, -40, 26, 10, 15, 85, 18, 65, 19, 44, 15, 38, 24, 2, 31, 61, 9, 19, -81, -51, 41, -3]
3165cL0jj0Nlq6N7j2O9p2qj2Q4K2j13L3O0pp2K1N7j01R6k5l4L7m9J28n0m2M0M6
3197H5m0j8j4OKlk1m8O9j5j8P4p4O3p2N3L2m9j7j4rJ3O0o8N8o3P5j2l1M0p4K7
3229cm5M6r0O4k7Q7j4l8Q5o5o8P5n5OP8m2LLrL6l7K0j5M9o0L2Km1K4J7l5M0k4
3262aoM5n2n1J13m1m1k3Q9o1L4n6%R1p3J05p7j9J8knP1k6l9L2%l3N1k7K9j3Oo7
3295b9J8mmM2o7K8O6k1k3j6M5l0K9Mp5L6l0j3O4j1M3m1QP7q5J4n1k4N2L5L3j11
3327d1N0j4Q9j05M6m1J3L4Np1N3J6j1k0%K7j0m4jL7Ml8jK1j3PJ4j5K5j5J5m6M4
3360A4J1l7J3K3o3J1M2l9j3P2m2K1J7Lq3J2M8J9l8j7JK3J7Jj3On4J8M7Op0N2j6
3393hN4l9O4q7O9j9o5K1nJ3LO6j42J07q4Q9p1J8o0P9m9l1P1m2k5P9J9O1j16K3
$$ y = [-3, 27, 26, 16, 21, 18, -68, -11, -23, 46, -26, -34, -46, 38, 60, -53, -20, 40, 33, -39, -18, 39, -62, 34, 9, -25, 12, -37, 91, 41, -1, 39, 85, 45, 27, 13, 19, 21, 18, -3, -51, 18, 3, -15, 59, -15, 48, -24, 29, 61, 12, -5, -19, -28, -15, 45, -23, 35, -28, 47, 35, 4, 44, -30, -3, -48, -2, -92, -28, -55, 32, 18, -20, 65, 0, -68, 7, -48, -42, 36, -6, -3, 0, -9, 27, -10, 10, -5, 44, -16, 16, 18, -23, 1, 18, -17, 23, -1, -7, 38, -14, -65, 48, 7, -34, -57, 32, -29, 5, -51, -51, 40, -33, 72, -5, -24, -6, -8, -13, 58, 32, -7, 25, 25, -8, 43, 16, 45, 32, 38, -29, -11, -15, -19, 23, -44, -16, 50, 29, 6, -10, 35, 5, 34, 38, -37, -1, -31, -44, 20, 9, 52, 11, 19, 96, 11, 25, -26, -50, 2, 37, 70, -41, 9, -5, 84, -21, 25, -16, -3, 31, 36, -35, 18, 34, 23, 3, 3, 30, 20, -24, -25, 12, 16, -22, -23, -2, -15, -8, 6, -9, 16, 1, 16, -30, 14, 25, -12, 1, 24, -39, -28, 14, -25, -38, 34, -8, 13, 30, 33, -50, -38, 10, 29, -9, -26, -25, -2, 15, 16, 3, 9, -45, -27, 20, 26, -44, 8, -8, 46, 7, 71, -16, 53, 34, -31, -10, -15, -2, 1, 67, -75, 32, -52, 37, -34, -16, -76, 3, -46, -77, -6, -48, -73, 6, 25, 86, -30, -7]
3423gL7o4QN4n4K7k9kj2P3j0J0n7MQkM1p9M9Jn8O6K1m8Kj2M8J6j5KkJ9l3N%k2
3459a5l2L7J5m1M2p9Q5L0j21N1LP6m5n1M1o0P5m7P5r2J02j6o4J4N6j14N7L6l6
3488a8L0o7Q4Pm2m4NJ11k5j6o0K9n5M9J2n9K8P4j15Q4k4Q%J3o8J4K6k0N7kjo6
3520e1N5n9M6P5q1QK2k5L1m1P4l9pjK4K2j2m8Pk1m4J41l9o2P3k4n2R4j33O2m6
3551e1K8M4m0pj8N1pn2J13j9r2N5rk8k7k4L3K8J4K1l8L3Om6OK7n0M3M7j3q6O3
3583ErJ0Lj2J5k2l6R6Ll0r0O8j3K5N5j09N7k7L6J7p2RJ3M7l8J4J7j01N6L5p5Q
3615d5L1K4k9N0k4K5j9j3J8k7m6Q1p4K0N0J5q2M2P6r1M7n1M0r1Q8k5o3J11o9L1
3645@j0M5p4J9M6n9K2j6L2k1O8k0l4m4N5Qo0Jm2K8J12q5K8k2L2j8J2o8L8k4L6
$$ y = [-7, 30, -34, -26, 28, -26, 1, -28, -30, -42, 31, 21, 31, -26, -22, -14, -16, 25, -54, -5, -4, -62, 4, 25, -23, -21, -33, 15, 31, 16, 18, 16, 35, 2, 7, 7, -15, -47, -10, 5, -36, 6, -73, 12, 42, -79, -28, -25, 51, 6, -45, -4, -64, 11, -36, 39, -53, 49, 33, -31, -17, 39, -75, -18, 18, -18, 12, -55, 29, 36, -6, -50, -45, 66, 41, 25, -35, -6, -61, -12, 0, -59, -31, 43, -72, 12, -12, -4, -4, 9, -59, -45, -19, -39, 18, 16, 15, -51, 4, -55, -9, 66, -15, -7, 15, -10, 21, -20, 54, 15, 8, 7, 31, 53, 41, -7, 0, -21, -65, 76, 37, -25, 48, 24, -28, 66, -67, -5, -51, -23, 21, -19, -26, -44, 7, 0, -52, 61, 42, -50, 5, -4, -32, -59, -83, -50, -22, -8, 13, -25, 8, 14, -32, -26, 1, -49, -6, 41, 28, -58, 5, -4, 6, 9, -3, 12, -10, -46, 50, 53, 23, -67, 1, -12, 13, 68, -41, 16, -11, 25, 42, -30, -21, -8, 39, 1, 15, 32, -69, -13, 22, -53, -45, -14, 10, -19, 31, 7, 32, 13, 0, 18, -9, -55, 26, -48, -28, 22, 37, -45, -3, 73, -18, 29, -22, 18, -73, 15, -10, -73, 38, -31, 0, -10, 35, -39, -20, 26, -33, -11, -27, 5, -16, 52, 32, -2, -46, 9, 17, -43, -42, -84, -56, 56, -29, -1, -23, 9, -9, 3, -65, -27, -51, -15]
3676a5k4j1P1p8P5l5o2J00l1nm7J06q6J3M1l9J1L1J5J8l4j9K5L7j06N2QJ8Moo
3707B1K8l6l0jK0JJ0nL0o8M9m4M6l3OO2k6Qp9P5l8J1k8No7J11j13M8Q2n5J6l7
3739c1rO8r8Q8j8P7jj36J36j19M8ml4K1k2M7J1o1O4n4L0n4K8J00p8L7j6M6m8M4
3769F2m8K7o2N8m0k9Q9q0K7nm7N7J0Nk8J1n4l4R8j1l7K4m3J16j01M6n9KO3n4M8
3800A1oj8mj5J9Q0p3m6Q0n0K2L9n4m0L6j7O8J7j22O5O0n5jL4N7p1j3O0o2nJ1j8
3832a1J4j2J5L8o5J4M7J7n5m2O4l7J0j1J8Rpo3M5N2m0K6o7Q0p3m6P6jk8N3l4K2
3864HL2o9N1o5L0k4R2l1l6k8P0j8jNm1L6l0oJ6O6j09J5L6R1j60N4l0M2K2L9l8
3895A9j1JrL9j19N7J3J7kK5o6j9K9O9L0p3n5L5l2P4O3n2Kl5LjnK3m7K5P2p8M0
$$ y = [-15, -39, -50, 21, -57, 18, -17, -79, 21, -10, -15, -62, 44, -42, -29, 12, -27, -16, 15, 30, 48, 14, -5, 20, 57, -49, 3, 11, 29, 33, 27, 21, 49, 13, -17, -18, 2, 3, 13, 8, 38, -30, 19, -25, 21, -12, -6, 56, 30, 38, -41, 34, -4, 7, -21, -16, -83, 28, -85, -37, 45, -10, 6, -31, -40, 28, -70, 18, 0, 77, 76, -60, 76, -43, 5, 1, -33, -12, -34, 13, 24, -37, 27, -27, 3, -51, -23, 77, -1, 36, 20, 66, 18, 62, 14, 41, -21, 37, -3, -32, 57, -23, 4, -1, -48, 9, 19, 24, -4, 7, -47, -81, 17, 6, -31, -7, -50, 66, -35, 11, -48, -46, 17, -37, 11, 5, -13, -17, -32, -13, 67, -6, -52, 28, -22, 0, 39, -15, -55, -19, -36, 32, 49, -73, -8, 52, -3, -4, 30, 87, 16, 3, 63, 1, -4, 7, -11, 3, -9, 6, 44, -21, -7, 40, 57, 2, -40, 24, -13, -3, -14, 4, 13, 6, -57, -12, 40, 0, 26, -41, 39, -34, -80, -4, -5, -33, 20, -14, 8, 40, -29, 22, -43, -13, -37, 55, 24, -12, -40, 30, 12, 11, 16, -25, 11, -19, -25, -9, 57, -52, -37, -1, 90, -70, -16, -46, -4, 18, 57, 19, 8, 9, 0, 39, -80, -23, -10, 7, 5, 30, -36, -55, -26, 43, 73, 0, -55, -20, -52, 22, 85, 33, 35, 0, 3, 2, -3, 20, -27, -2, 70, -8, 32]
3928C2l1K9n0J7KL7r3N1mk3O7J6p6J8j1M4M6j08L2K6nJ2j3l5%k4k4O3OK3l4M4
3960C4j0m9Qk6J1j9N5l2K4l5L3j6k0O1n1L8L5m3K7K8m4J4j1n0L2J1k2mM2m7R1
3991F5r1Q5j8m4%l0N5o2P1o0RK3pJ3j8N0n2N4q5N8l2kM5l8%K0k1j06J14n6Q8k7
4023AM5Oo1J0Ok1mpnQ0m1P7q2k1L1NK9q8N5q8R7nK0k1k3Ol6K8m4O5kJ2m3l7Q0
4058B4m5N1jk9M4m9j6M6j5m3j4PM7j1k5M0mn8P6K1q6j4N9mJ04j21j6K9k4M2K6
4089D1nJ3mr0K1R2m2mrl8L2m6K7j7O2k3L1n8RJ4m2L7M4o0N5o3K5m5jN6K1jJ5r5
4123d8L6P3j21K5L3Jm3J20l9l0J6o3L4J5M0l9j3j8O1o3M3J1m4QJ5k2kJ8J2J6j
4154C1j1LJ0ml8L8K0j7l7j2NJJ9j9L7j2OJ8n6O1qrm1k3L1L3J7j09Jj5M1MM8m9
$$ y = [32, 1, 30, -20, -3, -1, 36, -57, -6, -10, -33, 34, 50, -26, -8, -19, 25, 71, -37, -5, 21, 16, 28, 15, -20, -20, -44, -68, -5, 1, 24, -10, 34, 24, -25, -17, -43, -32, -51, 4, -28, -4, -39, -6, -22, -42, 19, -32, 6, 41, -2, 25, 53, 9, 23, 12, -38, -6, 5, -17, -21, 21, -26, 65, -26, 59, 41, -3, -3, -33, 22, -40, 31, -29, -20, 3, -4, 9, -9, 41, -11, 43, -42, 16, -16, -18, 27, -11, -11, 9, -12, -118, -4, -60, 28, 1, 46, 52, -9, 1, 7, -14, -18, -25, -30, 50, 9, 86, 4, -17, 14, 19, 48, -40, 15, -73, 24, 19, 39, 18, -5, 1, -35, -7, -51, 14, 12, 24, -19, -56, 24, -21, 30, 29, 0, 44, -5, -21, 25, 10, -33, -47, -40, 7, -4, -29, 11, 7, -51, 25, 46, -40, -54, 5, 1, 105, -16, -32, -3, -27, 15, 41, 36, 49, 45, -45, -24, 68, 26, 22, 13, -25, 7, -39, -12, -29, 33, 10, 41, -17, -8, 6, -36, 1, 45, -15, 40, -23, 2, -43, -44, 12, 33, 32, 47, -48, -12, 61, -60, -35, -2, -1, -44, 76, 37, 7, 23, -40, -6, 9, 49, 10, -3, -21, 40, -23, 20, 31, -13, -5, 10, -12, -14, 4, 16, 32, 31, 20, 23, 33, 29, -9, 29, 49, 32, -5, -17, -12, -11, 8, -11, 26, 14, 20, 38, -18, 43, 35, 26, -15, -38, -7, 26, 43, -66, -65, -80, -39, -35, 13, -36]
4188c6N3lNok2K7L6m1L4n9N1o5L1l0m0P0o8L2KM0j4M3k9k7o0J09n6M9k7j6jOo
4221a8k0%P9L6N2j16O0p7l1j2l5Q9Ol5K9j9m5Q2J2l7K8kn2MKm8R3j4l4N2L6n4
4253A1j4J3j08P8JK9P3q1J6K3m0m3N7om1O2K6n5j1j8nK7J5K1J6r6K5rK9k9K1o1
4285g4Q6j1K1J4k6M7j30L6M6j2J3K5kqo2l2rQ7j7Ol8Q0n0Q8j19O4Njm8N7k6%K8
4318C8k0m0Q5m5k0j08O1L6L3j4l2K9J4K8q5K8K9p9M4k3O2M0j12J8j9K3M7n5R5
4347E8k5J0m6K2K6j3n0j1N2o5J14p1l3K3QL8Lk2n4N8l9OL6l3j2K3O2n4K3l3L2
4378C3o6N6j3K2pn7M2jPK2n3L0k1pN9o6J24n9n1J1pK4n3L4o8Q3m9J8L5o7L0M7
4410C2n7k0M5q7J06j7k4J2N7pl9l3K3N7r1J1N5k8P4o0l8M4nK9oo3J9L2l3R1j03
$$ y = [-36, 17, 14, 19, 13, -9, 18, 54, 13, 47, -12, 39, -26, 5, -25, -65, 5, -63, -31, -29, 11, -3, 40, 11, -16, -76, 33, -23, 26, -1, -17, -18, -12, -18, -38, -38, 41, 77, 129, 13, 73, -4, -35, -47, -82, 7, 13, -22, 7, -12, -57, 25, 37, 0, 28, 26, -26, -22, -20, -68, 25, 11, -23, 29, 65, 11, -3, 10, -98, -20, -19, 10, 83, 2, 18, 41, 1, -42, 15, 9, -32, 30, 56, 1, -10, -28, -33, -6, 9, 30, 46, -50, -25, -34, -5, -34, -13, -74, 12, 1, 22, 36, 10, 57, -73, -37, 9, -3, 10, 35, 33, 25, -37, -69, -78, 9, -8, -2, -40, 40, -10, 78, -41, 23, 28, 27, -21, 36, 10, 10, 38, 18, -22, 63, 18, -2, -110, -49, -13, 20, 6, -26, 3, 17, 45, -40, -12, 17, -62, -18, -41, 21, 61, -51, -33, -52, -29, 18, -37, 58, 33, 43, -3, 19, 45, 32, -18, -29, 23, -42, 72, 1, -32, -9, -1, 37, 40, 18, -36, 22, -17, -11, 25, -8, -20, 3, 65, 11, 34, 1, 33, -33, 23, 10, 32, 25, -32, 10, 9, 16, 38, -15, 15, -6, -13, 46, -20, 104, 45, -6, 5, -2, 22, -31, 3, -65, 18, -31, -13, 22, -45, -15, 32, -25, -45, 0, -87, 19, 2, -22, -10, 47, 40, 1, -32, -9, 48, -43, -32, 23, -5, 69, 9, -29, 15, 10, 39, 33, -30, -11, 21, -12, 79, -24]
4441b4j3O6%j0J1m9m4J7K4P1j7j5k1j8KL4n5L6m2O2o1oM4m7K3M1J5Lq0K9K1J9
4473A6L3m6L8l5k7n3J33l7Qqk8NL3l7J4l8L6M4k4k3Nl1O5n0M4p1j2J17q0J2K2
4504B5m7J17j23L5K8p8P6Jpn3J2k4MJ5l7Q3j5N6p6M0oJ7p6J8nLJ0P8j28oQ2p8
4536e9R5q3J51r4mL3k8qNm1L5J7OPm3K1pM6p8O9Krj21N9PJ4N1j7oj1j9n0O0L2
4570C2mn5J8M7n0j7J5l2M6k2N3pj7l4L2j0K1m3L0M4n7j7L4K2m0j9N4j1m0K3K6
4601B2N2m0n8rL6pJ5n2O6jm8R7r6M7k7k3K3k6PJ7j8MQj5R7j18K2K8k4k9Q8o2K6
4634Bn3J18l8q2J12o0K7N3p4J9m2mmQK3J8m7M9p7N6M3j16J07J2j2Klj25J32pk9
4665Hl5l7O8J1Rl5j0N2m3M0j9p6N0J4j6K2j7p3J34j3kl9M2o4L4njj4J5K0k7j1
$$ y = [-24, -37, 29, 29, 19, 30, -19, -63, -46, -22, 49, 32, 17, -4, -22, -20, 14, -41, -5, -47, 15, -46, -52, -8, -55, -32, 9, 24, 27, -53, -24, -3, 16, 49, 3, 41, 6, -21, -74, 59, 22, 30, 22, -6, -1, 32, -5, 9, -29, 7, 51, 27, 4, 9, -22, 43, -7, 37, -34, -46, 71, -9, 3, 25, -22, 95, -28, 7, 35, -43, 33, 34, 27, -26, -14, -38, -34, -19, -56, 27, 12, 68, -8, 32, 26, 43, -33, -15, -20, -17, -7, 71, -57, -63, 19, -59, 36, -47, 104, 10, 6, 39, 11, 3, 8, -33, 2, 19, 25, 32, -11, 10, 3, 49, -29, 40, 42, 33, -88, -29, -22, -8, 43, 26, 20, 9, -10, -60, 0, 32, 28, -27, -9, 38, -12, -29, -14, -46, 0, -22, 31, 24, 7, -27, 5, -5, 16, -27, 3, 47, -10, -27, 7, 29, -11, -30, 24, 13, -27, -4, 22, 74, 34, -24, -33, 3, -4, 11, -41, 25, 24, -24, 73, -23, 24, -3, -26, -3, -29, -22, -5, -23, -19, -11, -26, 71, -47, -25, 3, -21, -50, 38, -24, 2, -51, 67, 29, -53, 59, -1, 26, 79, 5, 24, -18, -22, -26, -18, 5, 23, -24, 25, -52, 4, 47, -69, 38, 50, 38, 40, 37, -88, 44, 37, 8, -27, -64, 4, 15, 24, -11, -21, 31, -12, 28, 9, -67, -17, -3, -19, 3, -14, -87, 47, 34, 32, -7, 35, -29, 5, 0, -1, -15, 0, 20, -7, -18]
4697a8%L2N6l1L2l6j3m5l8lO5K0J0K0k4m4j0L8pOl4L4M7m2pMr6Q7l8J8J2j8J9
4730dK8n3O6p7J5J1O7j4r0R4K6n0J2n5J2L3n0L6M0q6rL9K5l7Q7r6K7J2K8L5o9
4761Cl1P1Ol3k0mlo2J14l1K0l7J5M8p2j6M9POn2J0J8k0k6J8K2L6j6L5l8l3L9m
4794A9n6L9k5M6Oj8J%k8O7k2l6j7K0o6L3n1N1K0L0N7j14Q9mJ8n3oN9p4kN1l1P
4827A0k6J2k2L7Kj7L7N8j44L5o6R6l1O2m8mK2j12R5P4p1k1J8J7n3K4j3RN1k8k4
4858b1M9o2O2N3q5M7n2K6l3l5JJ15r3K8N5j8j4o3P6m4j3J6l4lN6k9N9l7J1j7l8
4889c7P9k8M2j12O1o7P6k3M1j4jJJ0o6R9p3QO1j5l1m7N6K9%o9Rj8Nj3K8j2K5K3
4922B7m7J5K8J2p1J22q1K1o3Q8Ml7k6l0J00m8J4n2J8m5N3j6j6J7J2JL1j5o8Q2
$$ y = [-18, -18, 14, 70, 39, 71, 35, 22, -23, -61, -64, 1, 21, 31, 51, 27, -17, -27, 11, 4, 10, -24, 10, 57, 15, 8, 12, -84, 3, -35, -17, -5, -23, -4, 24, -29, 37, -40, -25, -14, 53, 39, -51, 43, 69, 19, 31, -24, -12, 21, -29, 7, 47, -39, -48, -9, 16, -21, 66, -30, -3, 9, 37, 72, 3, -28, 43, 49, 16, -4, -8, -11, -73, 41, 10, 30, -7, 8, 56, -16, -32, 17, 24, 30, -22, -12, 6, -14, -40, -22, 0, 36, 20, 55, 17, -16, 23, 19, -37, 2, -23, 23, 29, 11, 12, 12, -16, 51, 29, -7, -24, -4, -70, -37, -88, -37, -17, 13, 70, -44, 45, 41, 59, 6, 0, 59, -15, -17, 34, 3, 10, -16, -4, -26, 11, 13, -4, 33, 91, -53, -18, -84, 12, -19, 43, -5, -9, 13, -99, -4, 70, -1, -22, -4, 13, -40, -16, -29, -20, 31, 3, -21, 28, -34, 28, 81, -4, 43, -9, 17, -16, -51, -50, 65, -28, 0, 55, 37, 23, -40, 36, -8, -21, -5, -39, -42, 14, -15, 44, 7, 18, 1, -37, 42, 14, 56, -56, 5, -62, 14, -9, 32, 18, 17, 18, 28, -38, 61, -12, -4, 57, 42, 11, -36, 20, 49, 49, -20, -11, -29, -24, -37, -9, -21, 4, 27, -20, -5, 23, 35, -36, 86, 5, 26, -37, 51, 55, 18, -8, -38, 62, 14, 28, -24, -6, -51, 2, -14, -30, -13, -1, 0, 31, 16, -52, 30]
4952C0Oo5K8J1K5o4J2Jj0J7L7l5pJ0Pr5J38J7k9J9p7J08q0l4l2M8J6LoJ1K3l9
4984fL7m8JK8o8N5nn9N2M5j1nj7K2J1o4O4k7pLjrJ7m4Q9q5J5O1j01P7k5J1j5K0
5018A1k8K8k6k8O3j5l9K0p4O6m8P9MK9j0l5k4P3n3jPlN9m7p3R6pm6K7jL4k4PQ
5052B9m6N3k5k3l9OJ00n0N6p5N6o4N4j7l7L5J4L4r4M5k6L0j4M2n1k9J8o1R1j8
5082fJ8JJ3o6j1PJ3pJ1K8oMl4M2NM8r3L9M9q3J04j10m0K1M5L9n1M5lpp8M8M0k2
5116CN7k5j1r3P8n1j2J0N5N4q3l4J0j1M5J4l8J2J7m9K2L2k1M1J2l3RK6o0l4K5
5147c3J02r8O0o1K6k2K2N4o3QkL1pl7mRn1N2rJ9Om2N3Rk3j8J4L6Ol0lk0%J5J9
5182A8p2lM1k3O1k5o3J4N5K4Ln8k5J6N2Q3j10pL6m2N2j4j7PL0j6pJ8k8M0nRJq0
$$ y = [30, 36, -29, -1, 10, 35, -29, -17, -16, -26, -9, 28, -7, -14, -4, 3, -92, 46, 63, 34, 53, -24, 84, 4, -30, -62, -14, 2, 5, -1, 10, 33, -6, 31, -17, -16, 12, -56, -1, -6, -65, -13, 32, 21, 16, -1, 21, 32, -32, 32, 5, -2, 1, 0, -9, 8, -36, 53, -32, -17, 44, -57, 20, -5, 6, -9, 11, -17, 11, -15, -43, 20, 5, -34, -14, -88, -22, -70, 9, 13, 42, 32, -3, -27, 46, -7, -8, -1, -4, 55, 8, -65, 31, 24, -22, 5, 4, 38, 14, 21, 29, -17, 36, 11, -12, -51, -45, 55, 5, 61, -14, 42, -22, 32, 15, -22, 13, 27, 61, -33, 12, -14, 16, 2, 44, -7, -36, -18, -79, 12, -6, 12, 13, 26, -40, -51, -44, -31, -38, -27, 1, -5, -1, -35, 7, 12, 60, -33, 6, 55, -28, 76, -34, -74, -53, -8, 31, -20, 25, 22, 15, -63, -15, 25, 3, 60, 35, 24, -69, 9, -42, -54, -44, 11, 65, -18, -52, -42, -53, -8, 6, -32, -20, -3, -52, -30, 2, -19, 22, 34, 1, 10, 36, -24, -58, -33, 69, -29, 31, -30, -4, -26, -4, 50, -13, -5, -7, 24, 17, -20, -24, -15, -66, -14, -23, -4, 2, -40, 13, 22, -1, -19, -5, 31, 37, 7, 4, -16, -16, -1, 18, -54, -57, -16, -39, 22, -3, -66, -52, 3, 27, 30, -28, -53, -37, 15, 98, -12, -19, 17, -25, 27, 13, -4, 3, 33, 17, 10, 28, 0, 40, 35, 44, 45, -35]
5216c5J44p7n4P0k0J8om8m8L1j8Q8p1qP5Nl7nJ4m0k5O1p9M0K1oL9k2lj0%PJ1l9
5250b7N4j0m3J3L0K6k4k2%Kl2N6p5K0m0J19l3L2j6lp7N3kK6j08M9lnRP4r1k1P3
5283Dmo2j6N5k6K7L0l3NL7m0pK6J2l4mON0j7j0L3p4O0o9N2J9pk2m4Q3j30Q7N0
5316C7l9j9K2j7L6Qj4j3j7Q3j08Q8Rn1lOK0m2Q8o3m7L9n6J3L4M3K4m1j3M6o2l3
5348d2N3L3m2K7J5r7N8j9mK3K0m6MK3K3n4J0K0N4p9N1Jq0O9Pj1k5Lj5L6q6J00
5380C0L0o3l9L1N4o5qK9k3R9j14MKl1pJ0K7qPl8M8J5J1l2L9L8m4QjK7q6O8Qm1
$$ y = [-35, 109, 32, -22, 48, 28, 46, 40, -8, -56, -25, -43, 45, -26, -34, 41, 46, 9, 4, 18, -22, -47, 14, -65, -25, -4, -10, 29, 7, 4, -6, -6, 1, 12, -27, 27, 17, -26, -13, 17, 43, 19, -3, -3, -1, -33, 23, -52, -32, -72, 47, 14, 46, 30, 27, -50, 3, 1, 27, -81, -32, -35, -40, -31, 43, -48, -69, 4, 0, -62, -78, -23, -49, -22, 8, -25, -20, 17, -23, -30, -4, 8, -26, -30, -24, 26, 9, -1, 32, -42, 18, -51, 1, 20, 13, -9, -53, 30, -100, -13, 37, -2, -21, 1, -16, 20, 28, 14, 1, -16, 67, -41, 47, 56, 5, 2, 8, 28, -14, 74, 11, -36, 3, -53, -40, -6, 37, 61, 20, 7, 53, -9, -42, 11, 44, 2, 29, 44, -53, 5, -14, -18, 5, 25, -21, -17, 6, 29, -25, -15, 5, 59, -20, 31, 32, -48, 21, 28, 17, -8, -5, -20, 16, -70, 30, 60, -3, -42, -11, 43, -22, -30, -1, -24, 75, -39, -35, -33, -64, -71, -61, -34, -42, -35, -73, -25, -10, 1, -31, 8, 46, 2, 10, 9, 36, -50, 18, 26, -15]
$$ [...]
8191D
##END NTUPLES=NMR FID
##END=
