##TITLE=1H_LR-785_R3-C3X
 200.13MHz, CDCl3,
 8 sc
 
 17.2.2025
##JCAMPDX= 6.0         $$ Bruker NMR JCAMP-DX V2.0
##DATA TYPE= NMR FID
##DATA CLASS= NTUPLES
##ORIGIN= UXNMR, Bruker Analytische Messtechnik GmbH
##OWNER= pz
$$ XWIN-NMR		Version 3.5
$$ Mon Feb 17 16:51:17 2025 Russian Standard Time (UT+4h)  she@DPX200
##.OBSERVE FREQUENCY= 200.1313
##.OBSERVE NUCLEUS= ^1H
##.DELAY= (6, 6)
##.ACQUISITION MODE= SIMULTANEOUS
##.ACQUISITION SCHEME= undefined
##.AVERAGES= 8
##.DIGITISER RES= 18
##SPECTROMETER/DATA SYSTEM= spect
##.PULSE SEQUENCE= zg30
##.SOLVENT NAME= D2O
##.SHIFT REFERENCE= (INTERNAL, D2O, 0, 14.3821)
##AUDIT TRAIL= $$ (NUMBER, WHEN, WHO, WHERE, WHAT)
$$ ##TITLE= Audit trail, XWIN-NMR		Version 3.5
$$ ##JCAMPDX= 5.01
$$ ##ORIGIN= Bruker BioSpin GmbH
$$ ##OWNER= she
$$ F:/spectra/data/she/nmr/H-C/1/audita.txt
$$ ##AUDIT TRAIL=  $$ (NUMBER, WHEN, WHO, WHERE, WHAT)
(   1,<2025-02-17 16:49:56.54 +0400>,<she>,<DPX200>,
      <created by zg, POWCHK disabled, PULCHK disabled
       configuration hash MD5:
       00 E9 B6 7A A2 85 ED C7 34 08 36 98 17 FE 4E 26
       data hash MD5: 16K
       46 A9 60 C7 9D 26 08 0F 32 14 A4 0B 5B 33 46 93>)
$$ ##END=
$$ 
$$ hash MD5
$$ 18 CF 3F C8 9B B1 96 D0 4E A9 50 F6 87 77 75 69
##$RELAX= 
##$RELAX= 
##$RELAX= 
##$RELAX= 
##$RELAX= 
##$RELAX= 
$$ Bruker specific parameters
$$ --------------------------
##$DU= <F:/spectra>
##$EXPNO= 1
##$NAME= <H-C>
##$PROCNO= 1
##$TYPE= <nmr>
##$USER= <she>
##$AMP= (0..31)
100 100 100 100 100 100 100 100 100 100 100 100 100 100 100 100 100 100 
100 100 100 100 100 100 100 100 100 100 100 100 100 100 
##$AQSEQ= 0
##$AQ_mod= 1
##$AUNM= <au_zg>
##$AUTOPOS= <>
##$BF1= 200.13
##$BF2= 200.13
##$BF3= 200.13
##$BF4= 200.13
##$BF5= 200.13
##$BF6= 200.13
##$BF7= 200.13
##$BF8= 200.13
##$BYTORDA= 1
##$CFDGTYP= 0
##$CFRGTYP= 5
##$CHEMSTR= <none>
##$CNST= (0..31)
1 1 145 1 1 1 1 1 1 1 1 1 1 1 1 1 1 1 1 1 1 1 1 1 1 1 1 1 1 1 1 1 
##$CPDPRG= <>
##$CPDPRG1= <>
##$CPDPRG2= <>
##$CPDPRG3= <>
##$CPDPRG4= <mlev>
##$CPDPRG5= <mlev>
##$CPDPRG6= <mlev>
##$CPDPRG7= <mlev>
##$CPDPRG8= <mlev>
##$CPDPRGB= <>
##$CPDPRGT= <>
##$D= (0..31)
0 0.7 0 0 0 0 0 0 0 0 0 0.03 0 0 0 0 0 0 0 0 0 0 0 0 0 0 0 0 0 0 0 0 
##$DATE= 1739796595
##$DBL= (0..7)
120 120 120 120 120 120 120 120 
##$DBP= (0..7)
150 150 150 150 150 150 150 150 
##$DBP07= 0
##$DBPNAM0= <>
##$DBPNAM1= <>
##$DBPNAM2= <>
##$DBPNAM3= <>
##$DBPNAM4= <>
##$DBPNAM5= <>
##$DBPNAM6= <>
##$DBPNAM7= <>
##$DBPOAL= (0..7)
0.5 0.5 0.5 0.5 0.5 0.5 0.5 0.5 
##$DBPOFFS= (0..7)
0 0 0 0 0 0 0 0 
##$DE= 6
##$DECBNUC= <off>
##$DECIM= 32
##$DECNUC= <off>
##$DECSTAT= 4
##$DIGMOD= 1
##$DIGTYP= 9
##$DL= (0..7)
0 120 120 120 120 120 120 120 
##$DP= (0..7)
150 150 150 150 150 150 150 150 
##$DP07= 0
##$DPNAME0= <>
##$DPNAME1= <>
##$DPNAME2= <>
##$DPNAME3= <>
##$DPNAME4= <>
##$DPNAME5= <>
##$DPNAME6= <>
##$DPNAME7= <>
##$DPOAL= (0..7)
0.5 0.5 0.5 0.5 0.5 0.5 0.5 0.5 
##$DPOFFS= (0..7)
0 0 0 0 0 0 0 0 
##$DQDMODE= 0
##$DR= 18
##$DS= 0
##$DSLIST= <SSSSSSSSSSSSSSS>
$$ [...]
##$SUBNAM0= <"">
##$SUBNAM1= <"">
##$SUBNAM2= <"">
##$SUBNAM3= <"">
##$SUBNAM4= <"">
##$SUBNAM5= <"">
##$SUBNAM6= <"">
##$SUBNAM7= <"">
##$SUBNAM8= <"">
##$SUBNAM9= <"">
##$SW= 18.0517328524113
##$SWIBOX= (0..15)
0 0 2 0 0 0 0 0 0 0 0 0 0 0 0 0 
##$SW_h= 3612.71676300578
##$TD= 16384
##$TD0= 1
##$TE= 0
##$TE2= 300
##$TE3= 300
##$TEG= 300
##$TL= (0..7)
0 120 120 120 120 120 120 120 
##$TP= (0..7)
150 150 150 150 150 150 150 150 
##$TP07= 0
##$TPNAME0= <>
##$TPNAME1= <>
##$TPNAME2= <>
##$TPNAME3= <>
##$TPNAME4= <>
##$TPNAME5= <>
##$TPNAME6= <>
##$TPNAME7= <>
##$TPOAL= (0..7)
0.5 0.5 0.5 0.5 0.5 0.5 0.5 0.5 
##$TPOFFS= (0..7)
0 0 0 0 0 0 0 0 
##$TUNHIN= 0
##$TUNHOUT= 0
##$TUNXOUT= 0
##$USERA1= <user>
##$USERA2= <user>
##$USERA3= <user>
##$USERA4= <user>
##$USERA5= <user>
##$V9= 5
##$VALIST= <valist>
##$VCLIST= <CCCCCCCCCCCCCCC>
##$VD= 0
##$VDLIST= <DDDDDDDDDDDDDDD>
##$VPLIST= <PPPPPPPPPPPPPPP>
##$VTLIST= <TTTTTTTTTTTTTTT>
##$WBST= 1024
##$WBSW= 4
##$XGAIN= (0..3)
0 0 0 0 
##$XL= 0
##$YL= 0
##$YMAX_a= 98665
##$YMIN_a= -131042
##$ZGOPTNS= <>
##$ZL1= 120
##$ZL2= 120
##$ZL3= 120
##$ZL4= 120
##$ABSF1= 10
##$ABSF2= 0
##$ABSG= 5
##$ABSL= 3
##$ALPHA= 0
##$AQORDER= 0
##$ASSFAC= 0
##$ASSFACI= 0
##$ASSFACX= 0
##$ASSWID= 0
##$AUNMP= <proc_1d>
##$AZFE= 0.1
##$AZFW= 0.1
##$BCFW= 1
##$BC_mod= 2
##$BYTORDP= 1
##$COROFFS= 0
##$CY= -3
##$DATMOD= 1
##$DC= 2
##$DFILT= <>
##$DTYPP= 0
##$F1P= 0
##$F2P= 0
##$FCOR= 0.5
##$FTSIZE= 0
##$FT_mod= 4
##$GAMMA= 1
##$GB= 0.15
##$INTBC= 1
##$INTSCL= 1
##$ISEN= 128
##$LB= 0.25
##$LEV0= 0
##$LPBIN= 0
##$MAXI= 10000
##$MC2= 0
##$MEAN= 0
##$ME_mod= 0
##$MI= 1.114404
##$NCOEF= 0
##$NC_proc= 0
##$NLEV= 6
##$NOISF1= 3.799351
##$NOISF2= 2.8
##$NSP= 1
##$NTH_PI= 0
##$NZP= 0
##$OFFSET= 14.38212
##$PC= 1
##$PHC0= -468.1124
##$PHC1= 11.99222
##$PH_mod= 1
##$PKNL= yes
##$PPARMOD= 0
##$PSCAL= 0
##$PSIGN= 0
##$REVERSE= no
##$SF= 200.129724274929
##$SI= 16384
##$SIGF1= 3
##$SIGF2= 2
##$SINO= 400
##$SIOLD= 16384
##$SREGLST= <1H.CDCl3>
##$SSB= 0
##$STSI= 0
##$STSR= 0
##$SW_p= 3205.1282051282
##$SYMM= 0
##$S_DEV= 0
##$TDeff= 0
##$TDoff= 0
##$TI= <>
##$TILT= no
##$TM1= 0
##$TM2= 0
##$TOPLEV= 0
##$USERP1= <user>
##$USERP2= <user>
##$USERP3= <user>
##$USERP4= <user>
##$USERP5= <user>
##$WDW= 1
##$XDIM= 8192
##$YMAX_p= 0
##$YMIN_p= 0
$$ End of Bruker specific parameters
$$ ---------------------------------
##NTUPLES= NMR FID
##VAR_NAME=  TIME,          FID/REAL,        FID/IMAG
##SYMBOL=    X,             R,               I
##VAR_TYPE=  INDEPENDENT,   DEPENDENT,       DEPENDENT
##VAR_FORM=  AFFN,          ASDF,            ASDF
##VAR_DIM=   8192,          8192,            8192
##UNITS=     SECONDS,       ARBITRARY UNITS, ARBITRARY UNITS
##FACTOR=    0.0002768,     1,               1
##FIRST=     0,             0,               0
##LAST=      2.2672688,     0,               0
##MIN=       0,             -131042,         0
##MAX=       2.2672688,     98665,           0
$$ Real data points
##PAGE= N=1
##DATA TABLE= (X++(R..R)), XYDATA
$$ [...]
1830G4o5R6m08M7L60q08L90K52j73M65J43o28N80l48l48J047l57k15K85l15k00
1851a26L01o46M57Q0m80K86Qr7O7O5j53L92j64p4N40m81l6J87K3J12J89q31N20
1874A39o0j81L93p53L15K00j67R9K61m55J71R3j28L23r3OJ23j4m07N13l25j34
1896h1K27l91J57R6l74M3M59l99K29L28o21L34J95l7L10k12m13O96m92j06Kl32
1918c82L27M41n76J2K79m97L89l20L5L26m0k3L37l25P2J58k02J79K38o15K75K11
1940B99l85K95m50j15M31m58J47L61m54K63P6n8k50M18j33M77m89j4J88j94K00
1961A55J47k47k60K27l58M39j69j57K15J3l00M84k52j85M72q8R0N9k27l4J83l75
1983a68K94L84o67K43M3m32M54O1m37K31j68k69O80l10q7O39m02l5P2q5L00j23
$$ plain form
1830 74 9 105 -303 -256 104 -704 -314 -62 -235 230 373 -255 325 -23 -371 676 319 104 389 74 -126
1851 -126 175 -471 -14 66 -414 -128 -120 -217 -150 -85 -238 154 -10 -84 456 -25 -61 126 149 261 450 -381 139
1874 139 79 -102 291 -462 -147 53 -114 -15 246 -209 -38 55 -73 250 157 163 286 272 -135 378 53 -81
1896 -81 146 -245 -88 8 -366 -323 136 -263 -34 294 -327 7 202 165 475 263 -150 546 54 -52 -50 -382
1918 -382 -55 386 -190 -178 101 -396 -7 -327 -292 34 -6 -29 308 -17 55 213 11 190 428 -187 88 299
1940 299 -86 209 -241 -356 75 -383 -236 125 -329 -66 10 -48 -298 120 -13 464 -25 -39 149 -45 155
1961 155 302 55 -205 22 -336 103 -66 -223 -8 5 -295 189 -63 -248 224 136 226 285 58 24 207 -168
1983 -168 126 510 -157 86 129 -303 151 212 -225 6 -162 -431 249 -61 -148 491 89 54 126 41 341 218
2005B18k63J12K17p10O02m68J76K72l55L6K19k45Q8J61k12K84J08k75L39l31j20
2026a47J36m1%L29m74J58K11m69J29J83j90Q9J18j88N83l07l56L91N5l94L45m00
2048b39K04M66m87L9L8j90K24l0k23oJ35J20J8k01L7K51n1K21N3o64K83p4K04
2071A28J46k86j23L31j04j24K0p8j3J23k91LJ62j39K84m1J25K98m30j69K88k18
2093a08N7L26j71Q5Q7m18N03j83n37L28K04m55M79k92k11L08O7q6J81l97K7M67
2115B61r3l27L18q1m7j25J3J82k34k16J15J6K55j40j59J06J53k23L72J99m45M49
2137C49j05k06M88o73N8M92o61L01J04m70K41m3J42o0k4n2J24j40J33J13j52P1
2159C0K21j84p6J70l42R2k86K59L87j66k34J42l69L94Q1k07l3K69r8P1L6k09J93
$$ plain form
2005 218 -45 67 284 -426 176 -292 -116 156 -199 -163 56 -189 -101 60 -152 132 240 -35 304 -27 -147
2026 -147 -11 -52 -52 277 -197 -39 172 -297 -168 15 -175 -86 32 -156 427 120 -236 155 210 -184 161 -239
2048 -239 -35 431 -56 -17 21 -169 55 25 -198 -204 -69 51 69 -132 -95 156 105 326 379 -285 -2 -76 128
2071 128 274 -12 -135 196 92 -32 -12 -90 -103 20 -271 -268 -106 -245 39 -2 123 421 -9 -178 110 -108
2093 -108 -51 275 104 189 276 -142 361 178 -359 -31 173 -282 197 -95 -306 2 69 -17 164 -233 -206 261
2115 261 168 -159 159 78 31 -94 -81 101 -133 -349 -234 -218 37 -103 -262 -156 -3 -226 146 345 -100 349
2137 349 244 38 526 -147 -89 403 -258 43 147 -323 -82 -125 17 -43 -67 -119 5 -135 -2 111 -41 30
2159 30 251 67 -9 161 -181 -89 -375 -116 271 105 -129 13 -356 38 119 -88 -121 148 50 121 157 -52 141
2182A41J71n16M65l11j30L19m00K44N5j97M1K77l92K37R6k94J80n2m7N87n11J65
2204A28O9k34p4K94l66J22K50n30M33l30J85J89l76q3N00l83L10j07J6L18p0l28
2226f7J14J00l72K93R3m33L56l19N28j17l77J87J84m13K39j8k08J14J99n0k8J95
2248B00k26J34m4J71l89LJ22N3j73K34j80K4j25J06Q5R1N2k51M02j28J87j08j75
2271F5j20K59l15r4J70o5L57l9n20M53l09J58J63k69J63r8K8j11K43m8k86M39
2293B24l05K99J9k74K74l67L24l78l02M81Q2l36J43K76m91L74L5j23P7P1l39M51
2315B15k71M0L13k15q5J49m03K58N5j05j42J28n9K7J87j22M3o4k30L21l43J20
2337a83M03k51J20j10j91M41k81R1J23m53K80R2k00k55M40J1j9j19j5K32j12j42
$$ plain form
2182 141 312 -204 261 -50 -180 139 -261 -17 38 -159 -118 159 -233 4 100 -194 -14 -66 -113 474 -37 128
2204 128 197 -37 -111 183 -183 -61 189 -341 92 -238 -53 136 -240 -323 177 -206 104 -3 13 331 261 -67
2226 -67 47 147 -225 68 161 -272 84 -235 293 176 -201 -14 170 -243 -4 -22 -230 -116 83 33 5 200
2248 200 -26 108 64 235 -154 -151 -29 24 -149 85 -95 -71 -196 -90 -5 86 138 -113 289 161 348 240 65
2271 65 -55 204 -111 -205 -35 -100 257 218 -302 151 -158 0 163 -106 57 -41 -13 -124 119 71 -215 224
2293 224 -81 218 237 -37 237 -130 194 -184 -486 -5 77 -259 -116 160 -331 43 78 -45 32 103 -236 215
2315 215 -56 -16 297 82 -3 146 -257 1 56 -49 -191 -63 -122 -95 92 -30 13 -51 -281 40 -303 -183
2337 -183 220 -31 89 -21 -212 229 -52 39 162 -291 -11 81 -119 -374 66 77 58 -61 -76 156 44 -98
2359i8L22k29P0L39j12k40J55l09L25k07r0J00k38K45j82J06j13p9J37n2L67l06
2381h9l10L65o7J97l0p7o9J22j13p6O7j54N4l5J54P4p8J07RJ1MK77k13J99m13
2406h4j2J66K3l74L70k93L56O8n03L09K6k58J58Q6J83l7l43J95J22q8L8j15K80
2429B73m19N85o86L30P4j78J3K18l2k88J63oj3j20K42j46R7q4l8k34J83L02j75
2452F1J34m8Kp9L2k34p3L60m21Q3j92M49k06J42j28J81N8k63K83O0j47M8p7R7
2476A22j67L9J00k84m8L59p2k7J74k88K65k38J87k9k14J38K51l33R1k30K04K01
2498B01m2o3L1kk47J79P2m48K98L9j93J47k26L83Q9j65J47j28q0K66m9j35J00
2521A74j41o8K2l11r2M67k30L59r9j45j67L52m58O76k77k01K44k57N9K49j02l9
$$ plain form
2359 -98 224 -5 65 404 292 52 207 -102 223 16 -74 26 -212 33 -149 -43 -156 -235 -98 -150 217 -89
2381 -89 -399 -34 -101 96 66 -11 -80 42 -71 -147 -80 -234 -180 -215 -61 13 -65 42 51 62 66 343 130 329 -84
2406 -84 -96 70 93 -281 89 -204 152 220 -283 26 52 -206 -48 38 221 184 -159 36 158 70 108 -7 273
2429 273 -146 439 -247 83 157 -21 -8 210 178 -110 53 47 34 -86 156 10 107 23 -15 -249 -66 236 61
2452 61 195 147 149 70 102 -132 -205 155 -266 -183 -375 74 -132 10 -118 63 121 -142 141 201 54 102 25 122
2476 122 -45 -6 94 -190 -238 121 49 22 196 -92 173 -65 122 93 -121 17 268 -65 26 -204 0 201
2498 201 159 96 127 125 -122 57 129 -319 -21 18 -175 -28 -254 129 218 53 200 72 -8 258 209 74 174
2521 174 33 -35 -13 -324 -416 51 -179 180 81 -64 -231 121 -337 339 62 -139 105 -152 -93 156 54 15
2543A5M42j57l59L19m21J04j1m7M0K24l15j25L58l55M54k90J12K34j41J72q9j13
2565E1j83J25J00j30K23j43J41l79K94k52K57j06J58k82L13j48O8k40P7Q7J19
2586A50j61j99N51l51j58J23j42J06L10l65j34L21m27N67l34J28j28J74l7L00
2606B94j22j75L58k69J14k11n8J18K55m24K09k51K00k98L24K23l33P5K5J97o6
2627A85O1j13k60J24j83K41J70o2m00L06j90J13R1J03j93K39k17j11N8k10L46
2648I8M1r2M3K56l98J99Nk98N36k63N8l32K4L95j90j86N%j34J87L1K61j12K6l28
2673a68M53l42n6O4m1L71l18L47j53l21J03j11K25J31k44j7k7L9k15L20j01L54
2695B93p0j80J94OO1n67J86J96q5R8l33J61l9o9O4J12j23M01j9l46J60L1j93J93
$$ plain form
2543 15 457 300 -59 260 -161 -57 -68 -115 -75 149 -166 -291 67 -288 166 -124 -12 222 81 253 164 51
2565 51 -132 -7 93 -37 186 43 184 -195 99 -153 104 -2 156 -126 187 39 107 -133 -56 31 150
2586 150 -11 -210 341 -10 -168 -45 -187 -81 229 -136 -270 51 -376 191 -143 -15 -143 31 -6 294
2606 294 172 -3 355 86 200 -11 -69 49 304 -120 89 -162 38 -260 64 287 -46 29 54 251 185
2627 185 246 133 -127 -3 -186 55 225 163 -237 69 -121 -8 83 186 -7 232 15 -96 -38 -248 98
2648 98 139 47 90 346 -52 147 152 -146 390 127 185 -147 -123 272 82 -104 -99 -99 -233 -46 -15 246 134 160 -168
2673 -168 285 -57 -113 -49 -90 281 -37 310 157 -164 -61 -172 53 184 -60 -77 -104 -65 -280 40 -61 293
2695 293 223 43 237 243 304 -263 -77 119 34 132 -201 -40 -79 -148 -84 28 -95 306 287 -59 101 132 -61 132
2719A32l9q5m6j41N6L4l1K38N6m09K12J07L7j50k25k2K47j31J34O5K83l81J30
2742G1o2j03N48p76L51N9j2j1j7l00K48N6m16K99j21J17K61j10j75R0K20j27P3
2765A63k23K95j99P7J1p6J19k50J7N3j39m0J85q2l1K92p5j72K39q8j38R4j28K75
2789A79j94j56K20j82J81j43J3L9q0j11L15n0j01J64j35OO3m1L59k82M3l65L65
2812A07j5j10J15j37N1J6QN8k3%J22l39J25L50m90K74J11j86K3J4j06K18j23j47
2836h4K13j04k54J06J71k33J70m0R3J75m03K77m1jk3j72R9J68K2j8K45l04k48
2859a86L63k07PK20k29r0J73lj91K15m24L27K63m29L56R5k68L5J31k70M36j26
2881A98r4J52k23k82J11J9K31k04M1K2r0R4J35j73K75j24k87L06M9j94P1l1k9
$$ plain form
2719 132 93 8 -38 -179 -123 -89 -120 118 174 -235 -23 84 121 -29 -254 -276 -29 -160 -26 39 322 -59 71
2742 71 9 -94 454 -322 29 88 76 65 48 -252 -4 52 -364 -65 -186 -69 192 82 -93 -3 217 90 163
2765 163 -60 235 36 113 124 48 167 -83 -66 -13 -152 -192 -7 -89 -120 172 97 -75 164 76 -62 32 -96 179
2789 179 -15 -171 49 -133 48 -95 -82 -43 -123 -234 81 31 -70 94 -41 -35 28 -13 346 64 107 -258 107
2812 107 92 -18 97 -40 11 27 35 93 70 70 192 -147 -22 328 -162 112 223 37 60 74 -32 186 63 -84
2836 -84 129 25 -229 -123 48 -185 -15 -55 38 213 -190 87 46 45 22 -150 -51 117 139 121 366 62 -186
2859 -186 177 -30 -23 197 -32 -122 51 48 -143 72 -352 -25 238 -191 165 260 -8 27 158 -112 324 198
2881 198 104 256 33 -249 -138 -119 112 -92 -51 -29 -119 -25 110 -63 212 88 -199 107 156 -38 33 2 -27
2904b7p9J84j87j68K49r9j04K95j59k35L84j32J26o9j3O2MJ44j17j68M52n42M04
2927B05j18q7j5r3k49J43J25l1j10r5K41L18k02n8K22o7j56J05J16j09j59K57
2949A83o3j12O7k43K14l23M83m08L46k80K75l36K26K8P6o8j74J79j42K34k42J53
2971G3o2J29J0k67L5K35M9j43p7K34k04j83J70p1q9P1K77j75M2j95k66O29r3l5
2995I4j95o2q1O6j37LM03k13J85r6QJ0j44K82j50l5j61P3o7O0L13j33j24J62l9
3020B2O6k02K76l2k73N2K69j62%J8k15J77O4j32q4J82J0n2Q4k16L01k16O3k72
3044b72J51m9K88m50L89kl98L82K09Q7k96J24j42J14k29L4L3j69J7R3j0O8k06
3067b34Q8M36m29m3J06J78j38n2M53o9k5k63j16K53k47J41n0N4P0k48O8q7K97
$$ plain form
2904 -27 -106 78 -109 -277 -28 -127 -231 64 -95 -330 54 -78 48 -21 -34 28 32 176 59 -109 343 -199 205
2927 205 87 0 -15 -108 -357 -214 -89 -120 -230 -325 -84 234 32 -26 196 129 -27 78 194 85 -74 183
2949 183 120 8 75 -168 46 -277 206 -202 144 -136 139 -197 29 57 133 65 -109 70 -72 162 -80 73
2971 73 11 140 150 -117 -82 153 202 59 -18 216 12 -171 -1 -72 -161 -90 187 12 54 -141 -407 222 129 94
2995 94 -101 -163 -244 -178 -315 -312 91 -122 63 -33 -25 -15 -159 123 -27 -62 -223 -150 -217 -157 156 23 -101 61 22
3020 22 88 -114 162 130 -143 -91 178 16 16 34 -181 -4 60 -72 -156 26 36 -16 68 -148 153 -63 0 -272
3044 -272 -121 -170 118 -332 57 55 -343 39 248 335 39 163 21 135 -94 -60 -27 -196 -179 -86 -96 -28 -234
3067 -234 -146 290 -139 -182 -76 102 -36 -88 365 296 271 8 -108 145 -102 39 -11 43 113 -135 -67 -154 143
3090A43k41j6O7L6J15j17Nj04J95Q3j69M62m12J80l71L10k71k8L50n98P8L10J34
3113A41j72j60K29j50j05K40P2j14q8J65M8q7r5K67r1L6j69K07k27qJ72q9j02
3136h0J17l2j75J54N5l38L74J11j04j8j11L54l31j11j33L17l14J13K22p1j08j45
3158b54L13k3k6K8Q4l11J71k51L57o2J99j49j00L03k54K00j72l25K17J0J58k07
3180i4n6J73j45Q2M1L62l12J69k61q6L53l49L83j94J27k88kRR5p2j13J23J31N8
3204A34n10L62m4J77k11pj43J77K16k9j23M0m4m3Lj93L83k35O7p1O7P6M8k06M27
3229C18m71K16l18Q4J01K28j02Q1j27M5J9j38J59l11K96j52N6R8K7k71K05l0q9
3252g6M9J02q4K44n20J29K4L38k0l05Q8KJ03j68O9J83j65l62J84K47k15K65j03
$$ plain form
3090 143 -98 -114 -47 -11 104 -13 -8 -112 83 166 -3 459 47 227 -144 166 -105 -133 217 -381 -303 7 141
3113 141 -31 -191 38 -112 -217 23 95 -19 -107 58 106 19 -76 191 100 136 -33 174 -53 -61 111 22 -80
3136 -80 37 5 -170 -16 39 -299 75 186 82 64 -47 307 -24 -135 -268 49 -265 -152 70 -1 -109 -254
3158 -254 59 36 10 38 122 -189 -18 -269 88 26 225 76 -24 279 25 225 53 -272 -55 -45 113 -94
3180 -94 -150 23 -122 -40 1 363 51 220 -41 -127 226 -123 260 66 193 -95 -97 -88 7 -65 -178 -55 76 134
3204 134 -376 -14 -58 119 -92 -99 -242 -65 151 122 -1 39 -5 -48 -45 -238 145 -90 -23 -94 -27 49 97 -109 318
3229 318 -153 63 -255 -171 -70 158 56 137 10 55 74 -64 95 -216 80 -72 -16 82 109 -162 43 13 -76
3252 -76 -27 75 -9 235 -285 -156 -132 206 186 -119 -31 -29 74 -94 -25 158 -7 -369 -185 62 -153 112 9
3275Ip4PJ31p3L5M36o42J54K32k73J77m7p6L1N4l40J47N5q3J98O7l62q4L22j77
3300a76J76J71k60lK97k28K9J16J29j82%j9J58j20k08J07L4j59J86P6j21Q7m22
3323c32K82j12M6L3J52J10k89J22j47n2O7r5K31J64k82P4J50j13m3NJ6k61K15
3346e9J32j27J77j79k4l49L28K73k98k8J50r4J36j87M5K26Qm93M30k81K6J53M39
3369D04o58L02J61k72j0P3J00l72Q5K06j29K92m81J72q2K30j8N4J88l02l6L83
3391B90l86j74J62l3j57L87m6j37K1LJ09J45l7k92M14n22K53O6n2l0o1J01J39
3414A63k28k1J55j99J52J22j48J34k45J19J08j92J10k6R4o6m2L03k52J19k8k42
3436a10k46M73j32K2J61k17J66j34l20L27kJ09k5J6j68k81K39p7L2N2L15n90K63
$$ plain form
3275 9 -65 -58 73 0 35 471 -171 -17 215 -58 119 72 -4 27 81 -259 -112 -57 -140 58 125 -237 -321 1 -176
3300 -176 0 171 -89 -92 205 -23 6 122 251 69 69 50 208 88 -120 -13 21 -138 48 124 3 90 -332
3323 -332 -50 -162 -116 -83 69 179 -110 12 -135 -187 -120 -215 16 180 -102 -28 122 9 -34 -29 -13 -274 -59
3346 -59 73 -54 123 -56 -80 -429 -101 172 -126 -154 -4 -98 38 -149 -104 122 130 -363 67 -214 -188 -35 404
3369 404 -254 48 209 -63 -73 0 100 -272 -187 19 -110 182 -299 -127 -209 21 3 57 245 -57 -93 290
3391 290 -96 -270 -108 -141 -298 89 43 -94 -73 -70 39 184 147 -145 269 -253 0 66 14 -16 -77 24 163
3414 163 -65 -86 69 -130 22 144 -4 130 -115 4 112 -80 30 4 98 32 -10 293 41 160 132 -110
3436 -110 -356 117 -15 7 168 -49 117 -17 -337 -10 -12 97 72 88 -80 -361 -122 -199 -167 -115 200 -390 -127
3459a27R9J7K01R6k01k12oK6j83j00K06p0J46J11j26q9J36r8L56k39K82k14r1
3482h0J34J15m9l3j57p9M08Lk59l01J84J81j2O4k67L98l51R7jJ69m00L94j38L5
3506E5o3k77M09j55Q5pj08l3K0R9K8J36k97J45m20O05p9J4k36K33k47l2p6O1k50
3531c90L43J43k68J92k0j9L3K9n84N03j62J46J75r6J14k31J97j27J26nK36r6l29
3554i0q8L4K81j4n4j66j48O5L5J17j82n9J01j39K57k7L8J34ll0N0N1j29L6j49
3579g9n7J12j71K29j58L25j05k6j00R3r1R1NlR3k16K69j37j3j91M8L43k35j75
3603a49K62j34L3J47k52J65j74m6K6K18J3k88N3J68O2l1P1J87m84PJ23k99P9J58
3627h5L8J84k37P1M8L2N3L3lj43o0K28m6k14k5M19k59j07K36N7l15K97j75K47
$$ plain form
3459 -127 -28 -11 190 286 85 -127 -133 -107 -290 -390 -184 -254 -108 3 -123 -212 -76 -174 182 -57 225 11 -80
3482 -80 54 169 120 87 -70 -149 259 262 3 -298 -114 67 55 119 -148 250 -101 -4 -5 164 -236 158 20 55
3506 55 -8 -285 124 -31 54 47 -61 -94 -74 25 53 189 -108 37 -383 222 143 157 -79 154 -93 -125 -201 -140 -390
3531 -390 -47 96 -172 20 0 -19 14 43 -541 -38 -200 -54 121 25 139 -92 105 -22 104 99 335 239 -90
3554 -90 -178 -144 137 123 69 -97 -245 -180 -145 -28 -210 -269 -168 -307 -50 -77 -39 95 92 62 112 163 34 70 -79
3579 -79 -136 -24 -195 34 -124 201 96 70 -30 63 -28 63 68 65 158 -58 211 74 61 -130 -82 261 26 -149
3603 -149 113 -21 12 159 -93 72 -102 -148 -122 96 109 -179 -126 42 104 73 144 331 -153 -146 -23 -322 -243 -85
3627 -85 -47 137 -100 -29 19 51 104 137 134 -9 -69 159 113 -101 -126 293 34 -73 163 220 -95 202 27 274
3651B74k83o9P6j0j77J81J0j9L1J4r8j44K77n8RJ57j90nk05J63l59K32M22j93
3675C6M5j85N5k03L78k55J92j55J68m2o2j81O3J71Q2l04k4N7R5J78q7R7k66J26
3699b1k14K51l0J3J70k05m1j35J6L84m21L61J85j95j34j85K06j23J22K4k57K45
3721A6o0j85J9K40O4l13M01j64k57J36j37L32j88J15j55J13j68L50M8m33J39j59
3743b46J18J35K02k88K65j99N0j10k2P9L76j35m64M79j49J96j80k49O84o33M9
3764d2J25l36M18k00P1L0m9k6O0J62o7j28K46l90o3R2Q0lPP4q5j3M1J31m59L03
3790b1o5J48k92L89j90J69l82K98K52j69k14J22j26j30K87j73N4kM6R6l2k63J34
3813f4L15j69j24K61m29M16l12rj1j6K44k2J61j68j27L2n4l1p8K63j36L8J18j0
$$ plain form
3651 274 -9 -78 -2 -12 -189 -8 2 -17 14 28 -70 -214 63 5 14 171 -19 -24 -229 -66 -425 -193 229 36
3675 36 81 -104 -49 -252 126 -129 63 -92 76 34 -28 -209 -146 25 107 -197 -221 -164 -69 109 22 119 -147 -21
3699 -21 -235 16 -14 -1 169 -36 -77 -212 -196 188 -233 128 313 118 -16 -201 5 -118 4 28 -229 16
3721 16 -44 -229 -210 30 94 -219 182 18 -239 -103 -240 92 -96 19 -136 -23 -191 159 207 -226 -87 -246
3743 -246 -128 7 209 -79 186 -13 37 -73 -95 -16 360 225 -239 240 91 287 107 -142 542 -91 -42
3764 -42 83 -253 165 -35 36 66 17 -9 51 213 146 18 264 -126 -189 -97 -17 -20 -13 61 -24 -37 4 135 -324 -21
3790 -21 -86 62 -230 159 -31 138 -244 54 306 137 -77 45 -81 -211 76 -97 -43 -45 1 97 65 -198 -64
3813 -64 251 82 -42 219 -210 206 -106 -115 -126 -142 102 80 241 73 -54 -22 -76 -107 -185 78 -58 -20 98 88
3837H8M7j49J38j95j7R6k7K24l73J62j48K03P9Q3l32K0L95j80k23k79L69Q6J03
3860A70l81K32k3n6L19r4k88J44J24r6k15K33j38P9Nj21jJ55J19k3j30j69K08
3883E3K2k19M10m4J5j19l04K58rJ05q1r9j7j31J70p9J25l31L18K5J96k85K17J51
3907C47j55k00j40L33l85M58k31Pn3j21K00J09l6l24K77J49o01M36j61J71Q7%
3929A67k90j00o8J81L8J16J32o02L23j3K25l7J66l97J87R3q3J47m8m7nj94Q1K10
3953A82k17nl1J85Rj70L01l21LK2r8k51J44J74j12M12j02j50K9O7J27m5k94K40
3977I9l3J68m02J37j57N1J34k19M6J02J41R2k09l16M11j66K73p3m6r7j11l1K71
4000F5L9L1l89J6p7N76O2l21J58j96J2p2J11N0j83K31n7J26o9j10N8k14K53k46
$$ plain form
3837 88 135 -14 124 -71 -88 8 -19 205 -168 -6 -154 49 128 211 -121 -101 294 114 -109 -388 -19 67 170
3860 170 -211 21 -2 -58 261 167 -121 23 147 51 -164 69 -69 10 15 -106 -107 48 167 144 14 -155 53
3883 53 75 -144 266 222 237 118 -186 72 63 168 87 -12 -29 -160 10 -69 56 -275 43 68 264 -21 196 347
3907 347 192 -8 -148 185 -200 258 27 34 -19 -140 60 169 133 -191 86 235 -366 70 -91 80 167 167
3929 167 -123 -223 -291 -110 -72 44 176 -426 -103 -116 109 72 238 -159 28 121 38 185 137 90 85 -109 -28 182
3953 182 -35 -40 -71 114 123 -47 254 -67 -64 -42 -140 -391 -247 -73 -185 227 125 -25 4 71 198 153 -141 99
3977 99 66 234 -168 -31 -188 -137 -3 -222 -176 -74 67 159 -50 -366 45 -121 152 79 33 -64 -175 -206 65
4000 65 104 135 -254 -238 -315 261 323 2 160 -36 -24 -96 15 65 -118 113 56 182 113 3 61 -153 100 -146
4024a46Q4J76r2Q7o0k07K31k0K20m93L66Q2m30J68N4j39J92j07k4Q5n3j00JK43
4048A18o6J01o7J7k77l6J99J39J35l00K20j35n0rJ06j15J26J41k96J24O7k60J50
4071C2Q8j32K5km9l6J66r5j24J97q6J51j79L0J81j64R9L4J1l5l39j19N29j03l54
4096b74K97j74rL02J21l57K7M4j67j3m2L37m4k07P3K63m60K73O1r6L5K25j05K07
4120C17j14k10j87J49P6M0K33l68P3j80K27k11J76j20L45q1O1m8L8l23K9J94n4
4143F2j7n4j30L04r3q4K00o4k18J4J07J93k43m1k06M74l10O2K53K68m10J62j75
4166E4r9nm4k45K76K6k2j27K18j85J32P4L6j12k07L20L7o5k93O83l56J40j49O7
4190A54j38k04K75q9k39L63j84k5l8l4J42j07J21K8J20k46J13k4J38qm6R2k04
$$ plain form
4024 -146 -62 114 22 109 49 -158 73 53 273 -220 146 228 -202 -34 20 -119 73 -34 -58 27 -26 -126 -125 118
4048 118 52 153 86 103 -174 -210 -11 128 263 -37 183 48 -2 -11 95 -20 106 247 -49 75 142 -118 32
4071 32 120 -12 13 11 -38 -74 92 -3 -127 70 -16 135 -44 -14 167 3 102 136 147 112 -227 -346 183 80 -274
4096 -274 23 -151 -160 142 263 -94 -67 -23 -190 -203 -245 92 48 -159 -86 177 -283 -10 51 -45 -10 215 110 317
4120 317 203 -7 -194 -45 31 71 304 -64 9 -171 56 -155 21 -99 246 165 226 178 216 -107 -78 116 62
4143 62 45 -9 -139 165 72 -12 188 124 -94 -80 27 220 -23 -64 -270 204 -106 -44 209 477 67 229 54
4166 54 -45 -50 -94 -339 -63 -37 -59 -186 32 -153 -21 53 89 -23 -230 90 127 62 -231 452 96 236 87 154
4190 154 16 -188 87 -2 -241 122 -62 -87 -125 -159 -17 -124 -3 25 145 -101 12 -12 126 118 72 164 -40
4213d0J03l87K37K7M1J99k19rJ09k11R0l33N36Kl43pK59j3M8k5k5Q7l44R2J21
4238eK0k2m8p7K31K63m72o3p2M21k88o3J3J42K86k82J70l71J36J20J45j83K30
4261B31k33N9K11k71k10j16O38l83K30J71k59J65l22p9L36J26l81L5j00NJ65j92
4283a74K35j62J08N1n9J80k49N0L04l50JJ67k08J81Q6k96j8P7K12o1k53L05o1
4306F6R8j90Jj53L71j71j33J09M55l98j39J58j19R8J29K1k08KJ33j60n8J70m6
4329C6n2N4n9j23L51k55r3r6K70M3J2qJ20j16o2k0m9j64J89K36l13o7k2J86Rk00
4355a93K86o8j48j45K78r5K27%j50j71J68J08L6j28O6M3r7Q9l19j10M71O0j37
4378G1M1k68p2K52L07l39o9P0n9J8L32n04N53j20j80O0M9j09j60M4j31L30j35
$$ plain form
4213 -40 63 -324 -87 -60 -19 180 -39 -48 61 -150 -60 -393 143 145 -198 -205 54 41 89 64 39 126 -218 -126 -5
4238 -5 15 -7 -55 -132 99 362 -110 -173 -245 176 -112 -175 -162 -20 266 -16 154 -217 -81 39 184 1 231
4261 231 -2 57 268 -3 -213 -329 309 -74 156 327 68 233 -89 -168 168 294 -87 -52 -152 -147 18 -174
4283 -174 61 -101 7 58 -1 179 -70 -20 284 -66 -65 102 -106 75 161 -135 -153 -76 136 75 -178 127 66
4306 66 164 -26 -25 -178 193 22 -111 -2 453 55 -84 74 -45 53 182 203 -5 -3 130 -30 -88 82 36
4329 36 -16 38 -21 -144 207 -48 -141 -237 33 76 88 80 200 84 22 2 -47 -211 -22 214 -99 -166 -188 -2 7 -193
4355 -193 93 25 -123 -268 10 -85 142 142 -8 -179 -11 97 133 5 71 114 17 106 -213 -323 148 208 71
4378 71 112 -156 -228 24 331 -8 -77 -7 -66 -48 284 -220 333 213 33 93 142 33 -127 -83 -214 116 -19
4401a9l4K21k87rJ25j36oJ09J46ko1q1K06j71n5j00P08p08K05p1P1O5j25j18K36
4426A09k13J48k95K96J33p1j2k07j0j9p7N55o50K64J1k4O0j86L16J01k02k36J46
4449f3J72K3j56J04k57J27J3j50K28k60L4Q9O9K35k98m9K56n6R5j74l6K54j80
4472B0r6k8P5r3K07N5l01M5K47j75K45j00m5J91l68L89l58j93K81k87N92l14k2
4495c3J31k31J44L16j55l92Q4K01j58J40j48K00J51j63k75L32j89j66L38pk28
4516a08K62k50K86k57m4L78m69O1j3J19k5k3R1L14n75J92r6K16M4k45K5J57j73
4539a33P0N1K23J16j40j45J46l42J25J4o5m8P6Q1q8m3L78j61l5Qj48J65j43j30
4563a68L57k74p6K74m99P01m22J57q3K20j25J90k52J11j5j24J30k05J64N7m59
$$ plain form
4401 -19 -53 168 -119 -128 -3 -139 -145 -36 110 108 47 -34 172 1 -54 -154 554 -154 51 -20 51 116 -9 -127 109
4426 109 -104 44 -251 45 178 107 95 -112 -122 -141 -218 337 -313 -49 -38 -62 -2 -188 128 229 27 -209 -63
4449 -63 109 132 -24 80 -177 -50 -37 -187 41 -219 -185 -96 -27 208 -90 -139 117 61 156 -18 -54 200 20
4472 20 -76 -104 -29 -122 85 140 -161 -116 131 -44 201 101 56 247 -121 268 -90 -283 -2 -289 303 -11 -33
4495 -33 98 -133 11 327 172 -220 -136 65 -93 47 -101 99 250 87 -188 144 -45 -211 127 120 -108
4516 -108 154 -96 190 -67 -111 267 -202 -141 -154 -35 -60 -83 8 322 -253 -61 -157 59 103 -142 -117 40 -133
4539 -133 -63 -12 211 327 187 42 188 -154 -29 -15 -80 -128 -52 29 -59 -102 276 115 80 88 -60 105 -38 -168
4563 -168 189 -85 -161 113 -386 315 -107 50 -33 187 62 252 0 111 96 -28 102 -103 61 118 -341
4584c41K58J03l2OK7Q7RN8o3k36J32K20k51j59J62J19jL9j63K5L59l91m6L33l27
4609g3Q8p9L7K15j13j56O6j2K01l25Q9m5L90l21Q0j13j21J04N0J29o7l82M83L7
4633A62n3J62m75JK03p1J58K40m11l3J21J32k61j38J29j01J10N7J62l01L10j28
4655b5K49j55K4j09m6J16r0p8K96j17K15j61j79K5l7N1j77L29k54J54m34L14L72
4678B83k58J42j16k32J59K81j89jk21J86J2n2J4l09L68o9j12K54P0l04J06J89
4700B01j77k17P3R1o6J22n4Q6l4J0j50J78k13L1L0K79j97K00ok27J1M8r2O7J11
4725A05j06o9L7MJ11J01j87o5l42K66r8L33Mo4K26k34m8K23k00J34r3n0j22K30
4749I6k33L2k7R8m61M65K14r2Q5j88O3R3j68q6K5J81m18L86o3o9J08MJ60k30J41
$$ plain form
4584 -341 -83 20 -12 -6 21 108 117 175 112 -124 8 228 -23 -182 -20 99 98 137 -26 -1 358 -33 -79 254 -73
4609 -73 15 -64 -27 188 75 -81 -15 -27 174 -151 -62 -107 283 -38 42 -71 -192 -88 -38 91 24 -358 125 162
4633 162 109 271 -204 -203 0 -71 87 327 -84 -117 4 136 -125 -263 -134 -235 -125 -68 94 -207 103 -25
4655 -25 224 69 93 -16 -62 54 -36 -114 182 65 280 119 -60 -35 -72 -21 -198 131 -123 31 -403 -89 283
4678 283 25 167 51 -181 -22 259 70 69 -152 34 46 -6 8 -301 67 -2 -114 140 210 -94 12 201
4700 201 24 -193 -120 -29 -95 27 -27 59 25 35 -115 63 -150 -119 -89 190 -7 193 187 -40 -29 19 -73 -6 105
4725 105 -1 -70 -33 -29 82 183 -4 -69 -411 -145 -243 90 94 30 256 22 -26 197 -3 131 38 -12 -134 96
4749 96 -137 -105 -132 -34 -495 -30 184 92 177 -11 52 145 -23 -109 -84 97 -321 65 2 -67 41 45 205 -25 116
4774A16j55J65j11lK65m22K67r2k11L64k38J72j66Q6K0l01J31L15j11N0q8L00
4796C53k02j8j43J80m07K47l6p2J52o4J63k6n2qj20N8O9m45M31k28J09L6K35k72
4820f0J7p9N3R4j52K57j96J69k23P6N6m7J01N4j01J72l47K95j10l6L12m56J59
4843HJ07j77J00j74Q3k9k8J08n2j70J97k12p1J94M6J43j9j99q4M37q3j58L8k16
4867b11O6J45J8J31q5m5k50M32l21o5M7jJ61j29K53k31R4m8j91K29j90J89PP8
4891H3l46J47k2L5P4m0L8m7J55j32K71k57j04J00K4j43L29j80j09j00L17l48L23
4914F8j27J98j50O3l16K82L2j49j7K11P6j35oJ20M4n01J80K07j9P2o0q0j20KK65
4939A40k57J7Q0J38k04k5j18K36j82N1J33j86J82K75k53j38K35o4O2l23M20k31
$$ plain form
4774 116 -39 126 15 12 277 -145 122 30 -181 183 -55 117 -49 37 57 -244 -113 202 91 141 53 353
4796 353 151 133 -10 170 -237 10 -26 -98 54 -10 153 127 75 67 -53 5 74 -371 60 -168 -59 -23 212 -60
4820 -60 -43 -122 -69 25 -127 130 -66 103 -120 -44 12 -35 66 120 19 191 -156 139 29 -7 305 -151 8
4843 8 115 -62 38 -136 -53 -82 -110 -2 -54 -224 -27 -239 -310 -116 -70 73 54 -145 -229 208 125 -33 5 -211
4867 -211 -145 0 18 149 64 19 -231 201 -120 -185 -138 -139 22 -107 146 -85 9 -39 -230 -1 -191 -2 5 83
4891 83 -263 -116 -138 -103 -29 -69 -31 -78 77 -55 216 -41 -145 -45 -21 -164 165 -15 -124 -224 93 -255 68
4914 68 -59 139 -11 52 -264 18 50 -99 -116 95 171 36 30 150 194 -307 -127 80 61 133 73 -7 -127 -125 140
4939 140 -117 -100 -20 118 -86 -111 -229 7 -175 -124 9 -177 5 280 27 -111 124 60 122 -201 219 -12
4961a2j50Q6K19j52o5J2K48l43J11j37K68%l21J83R1j15K58k72o6k2J07K4o8L3
4985h3J82j75J05K53m71K42j24K94j59on6M8J34p6J7k43R1J8P3l49L53j21k71
5008c24J31M32lM6j11q5l30ML76P9k73l4J90k30K97j64n1R2k1r1LO7O6P2l54K26
5034A0R3J08k1Km51L13J50k04M2o9J51N8k87J95j10M4N7o3j10j51L47k71n2K48
5058B9L9K15k27k3oM8j57k2J18k03L22j63l7l8J57L2j19K23k58Q6m10M91J16r4
5082A19p4J8Q4k66J34j83k6q1M74j32j51K42k39J94l48K53J01l05K54Q8n9L7q3
5105E1Q3j14n1j73N17k33N9k7j04K29o3k18j7J72j34o1m6N7J82j43o6J87Ll4j22
5130f6K9J76k32k4J34N8j73j82L75j45O2K7j75N6J54r0r5lp2J3K3J75j05N9q2
$$ plain form
4961 -12 -162 -76 143 -9 -74 -62 186 -157 -46 -183 85 85 -236 -53 38 -77 181 -91 -157 -179 -72 -48 -116 -83
4985 -83 99 -76 29 282 -189 53 -71 223 64 58 2 50 184 108 125 -118 -27 -9 64 -285 68 -53 -324
5008 -324 -193 239 236 282 171 86 -244 -240 136 215 -58 -92 98 -132 165 1 -50 42 21 -70 -67 0 66 138 -216 10
5034 10 103 211 190 192 -259 54 204 0 42 -27 124 182 -105 90 -20 24 81 18 -92 -243 104 -167 -219 29
5058 29 68 283 56 33 27 75 -82 -104 14 -189 133 -30 -67 -105 52 84 -35 188 -70 16 -394 97 213 119
5082 119 45 63 147 -119 15 -168 -194 -275 199 67 -84 158 -81 113 -235 18 119 -186 68 156 97 134 51
5105 51 134 20 -31 -204 313 80 139 112 8 237 174 -44 -61 111 -23 -84 -130 -73 109 -34 -100 87 90 56 -66
5130 -66 -37 139 -93 -117 17 75 -98 -280 95 -50 12 39 -136 -80 74 -16 -111 -114 -186 -173 -150 25 -80 -21 -103
5155a03J14J43k2l9o7k3l0J6j33Q6oJ73N1j14k33k2K87K02j48k00qJ70j93R6M4
5180D1l4O2l06L76m00Q5L79j73P0J23k85N4ON1j51J53M6r4k65M19j15j84J86k2
5204B2m6L09m65J63J1o5l4L8r0K4R2j23j04N0P8J45l2n7L0K28k71P3n1M5OO6j02
5231f0k36L48j08n4K97r3J64l82K34k82J89j26K08k68L3J35j77O4J53j18J10n4
5253b3k22K96j72J08K00k28L4K13k31p6J45L3n7K75l78N5M2j21K9J29J6p6Q2k6
5277D7l69K48j61L33p7K90l88j5K56l34K12k61J40m0J65R3R1j94j74J8M20m65
5299a65L19%k84k4L10n5k24J13k05K08q3n1K87o6P5m00J96j02L07K9Ok20l06J88
5323a47k4J80P7p2L70n49J57j77oR9j79K00K8M3K34j47Jo6k83J87L77l70P9j9
$$ plain form
5155 -103 11 154 132 93 26 3 -27 -11 -144 -58 -64 109 160 46 -187 -209 78 280 132 -68 -76 94 -99 -3 41
5180 41 7 69 -237 139 -261 -176 203 30 100 223 -62 -8 -2 49 -102 51 97 3 -262 157 42 -142 44 22
5204 22 -24 285 -180 -17 -6 -71 -105 -67 -157 -133 -41 -164 -268 -218 -140 5 -27 -84 -54 174 -97 -24 -75 -30 -24 42 -60
5231 -60 -296 52 -56 -110 187 94 258 -124 110 -172 17 -109 99 -169 -136 -1 -178 -114 39 -79 31 -23
5253 -23 -245 51 -121 -13 187 -41 -7 206 -25 -101 44 77 20 295 -83 -28 14 -107 -78 51 67 -9 73 47
5277 47 -322 -74 -235 98 21 311 -77 -92 164 -170 42 -219 -79 -119 46 139 230 36 -138 -120 300 -165
5299 -165 154 154 -130 -154 156 101 -123 -10 -215 -7 -90 -141 146 80 155 -245 -49 -151 156 185 191 -29 -335 -147
5323 -147 -171 9 86 14 384 -165 -8 -185 -191 -92 -271 -71 -43 0 234 87 88 22 -261 -74 303 -67 12 -7
5347gj52K30k03K05j55j58M72m18J88J83k53J5p6M04l36P1j02J31J50k02PJ20
5369A14j91n3L23J70m51j21K65q9nn8k54L09k9J50N4l26J5K21K02R7m13J43J38
5392B11j93k8o0nJ14j5j30q6OK00N8K61l12r4o9K86j03k51K70K35l42j05J81J14
5416A43j29r6M10l39q1J18O2k0q5j5j11J67k1J1j51J29K4k21L82k91O3K77m56
5439b30L9J16J03k45J53K46j02L4l09p7J30Q7M31l81q5l3J40K25l53J89j59n7
5461a38j6K41j21O7n4K15j32O0l10J46K94k17j76J96J71k05j0j32J09J40r0J10
5483A48O3j99k2l0p9P2R4l29N04m1j56J19j45j12K32K80k48j07J0k01K38j00J03
5506I4k21L6L58l0l06OL18Q8m92N4pR3K52q2l26O3R3j6K16k55M15k95Q6j90l2
$$ plain form
5347 -7 -159 71 -132 73 -82 -240 232 -186 2 185 -68 -53 -129 275 -61 10 -92 39 189 -13 -6 114
5369 114 -77 -130 193 363 -88 -209 56 -33 -38 -96 -350 -41 -70 80 134 -192 -177 44 246 343 -70 73 211
5392 211 18 -10 -70 -75 39 24 -106 -192 -186 14 72 333 21 -73 -142 144 41 -210 60 295 -47 -152 29 143
5416 143 14 -82 328 -11 -92 26 88 68 -17 -32 -143 24 3 14 -137 -8 16 -205 177 -114 -51 226 -230
5439 -230 -191 -75 28 -217 -64 182 80 114 -195 -272 -142 -55 376 -5 -90 -123 17 242 -111 78 -81 -138
5461 -138 -154 87 -34 33 -21 194 62 122 -188 -42 252 35 -141 55 226 21 11 -121 -12 128 38 148
5483 148 211 12 -10 -40 -119 -47 47 -282 222 181 25 144 -1 -113 119 399 151 44 54 -147 91 -9 94
5506 94 -127 -91 267 237 -69 -63 255 343 -149 -95 -102 -9 243 161 -165 -102 -9 -25 191 -64 351 56 142 -48 -80
5531h0J35p6J17j27M8L0J18l04K54p0J32P3l01k73L47Q7M6j8l61K56J60o6j05
5554B2Lk3MM3J35l19j16J1J11K21J18k10K44l56J37q6k51M02j10J14k22J67j46
5577a07N3J78l16J62J08j23k8j07J42J0j61L63M0j19j36J95k53M2j73J72o7K37
5599A12p2J56J56j70N3k63K0J75k75J75q4N7K08l21m3j36K89J0J9j49M7L39m79
5622a76K2J47p9l6J22J2L25k37k18K46j67l8l7L50k91k1j0K39k20K50k03o6P9
5645gj34L45k61K80l67M00k62J58j00l54N32j19j06r3k03K44K36n93L53q5K14
5666G8R8mol69J59l6L8m7J94k67J02r2J52J21r5o8R4l05M26l18L62k37k57J02
5690a75J15j65J15QK06l77J6K38j24K16q1pJQ8K7j64J51j5J09j15p0J83m06J95
$$ plain form
5531 -80 55 -21 96 -31 17 47 165 -139 115 45 177 250 -51 -324 23 110 156 138 -223 33 193 127 22
5554 22 25 2 6 49 184 -135 -251 -240 -129 92 210 0 244 -112 25 -61 -312 90 -20 94 -128 39 -107
5577 -107 -54 124 -192 -30 78 -45 -73 -180 -38 -28 -189 174 214 95 -41 154 -99 -57 -230 -58 -125 112
5599 112 40 196 352 182 235 -28 -8 167 -108 67 -17 40 248 -73 -116 -252 37 47 66 -83 -36 303 -176
5622 -176 -154 -7 -86 -122 0 12 337 100 -118 128 -39 -77 -114 236 -55 -76 -86 153 -67 183 -20 -86 -7
5645 -7 -141 204 -57 223 -144 256 -6 152 52 -302 230 111 5 -88 -291 -47 189 -404 -51 -136 78
5666 78 176 172 166 -203 -44 -80 -42 -89 105 -162 -60 -152 0 121 26 -42 52 -253 173 -145 217 -20 -277 -175
5690 -175 -60 -225 -110 -102 104 -273 -257 -19 -143 73 -8 -15 -14 74 101 -63 88 73 182 67 -3 180 -226 -31
5714c1L3j78K11k81L73j60J29j75J88J34j52l1O7l09M59k29q0J05N4q8k61J09
5736a13K35j17q6k4O8M17k25k59O5J70k95K53q9l4m5J57k07q1J27L92j19J42J1
5759C43n01L1K50R7j81k20L25N4k28q8J73q9n9K82j27m6j50n2J42k88K66j54J14
5782a06j8P9L97k09j41r6J58n3m4r8J69n1k9J09k5M1k73M27j32k40J60m17J76
5805b16L83m6j7J17j72O5j86K3J20l56L81jo7j53q2K49J02n5k62L38l88L21q3
5828A5J33p3j73J27P3n6N1n4j11K35o7j46r7L49j09j31K11j43l5n5l8J95pq4j02
5853i2K16k45l52J78M57p4j58K6J28o3N2j64N3o5M4M7k04M55l32J95l07J39P9
5876A3r9k14O1L72J57k73q5L90l61j2n7mK9L78k81P4m8p9J59j46l3M0P4j77j21
$$ plain form
5714 -31 2 -176 35 -246 127 -33 96 -79 109 243 91 60 127 -182 277 48 -32 73 127 39 -222 -113
5736 -113 122 5 -81 -105 -37 380 155 -104 -39 131 -164 89 0 -34 -79 78 -129 -210 -83 309 190 332 343
5759 343 -158 -127 123 220 39 -181 144 198 -30 -118 55 -34 -93 189 62 16 -134 -186 -44 -332 -66 -220 -106
5782 -106 -124 -45 352 143 2 -94 64 11 -33 -131 38 -13 -42 67 42 83 -190 237 105 -135 25 -392 -216
5805 -216 167 121 104 221 49 114 -72 -49 71 -285 96 95 28 -125 -207 42 144 89 -173 165 -223 98 15
5828 15 148 75 -98 29 102 46 97 43 -68 167 100 -46 -143 206 97 -34 177 34 -1 -56 -94 101 94 10 -92
5853 -92 124 -121 -473 -295 162 88 -70 -44 84 21 73 -91 -38 -103 -59 -12 -216 239 -93 102 -205 -66 13
5876 13 -86 -300 -239 133 290 17 -68 322 -39 -51 -108 -112 -83 295 14 88 40 -39 120 -26 -59 -19 55 -122 -243
5901b43J49m6P9J79k97j02L61J36j87k6p1L8j33L38k61K69j76P4k81K41n8J3M1
5924C7MR6l96L20k94L43k48K06j1P2L4j89j26k0J47K47j39J72j86oj27L5K04k71
5948i6J13j96J97M3n6j06r1O4L78k74J50j6r8J47n6j08j73L79m97N54j8q7K6k78
5972i9K72k36L0J4J07J48l25J09Qp9R1k00O3J16j04L7p5J2K5o6K0J51RO3P9l15
5998a45j45J38J40J12j75LJ11K4k36K35j2p7L08k13k0j54r0J28K27M1k36M3J82
6021A89k41N2O6j97L71l51N3J19o5J94l65R4K98l25j31L81n9r3m5j79K77k51L6
6044a72L08j02J20r8L7m4m4l17J09R3j2K19P7k2K25m58J14j58J91j17J84o1J83
6067B55K2k78m0J9K8N6Qj49k8j82L35l7p8Oj49M16k91J78J80l52J01qL8k74L9
$$ plain form
5901 -243 -94 -140 -61 118 -179 -281 80 216 29 3 -68 -30 -163 175 -86 183 7 81 -200 41 -17 -4 37
5924 37 41 137 -259 61 -233 110 -138 68 57 129 163 -26 -152 -172 -25 222 83 255 69 63 -64 -29 175 -96
5948 -96 17 -179 18 61 5 -101 -192 -128 250 -24 126 110 12 159 103 -5 -178 201 -296 258 240 153 179 -99
5972 -99 173 -63 -33 -19 88 236 -89 20 28 -51 40 -160 -97 19 -85 -48 -123 -111 -86 -152 -132 19 28 91 170 -145
5998 -145 -290 -152 -12 100 -75 -72 39 63 -173 62 50 -27 281 68 48 -106 -196 -68 159 200 -36 7 189
6021 189 -52 0 66 -131 240 -111 -58 61 -4 190 -175 -81 217 -108 -239 142 83 -10 -55 -234 43 -208 -172
6044 -172 136 34 154 56 93 49 5 -312 -203 -110 -122 97 174 152 377 -81 33 -125 66 -51 133 72 255
6067 255 277 -1 -41 -22 6 62 70 -79 -107 -289 46 9 -69 -63 -212 204 -87 91 271 -81 20 12 50 -224 -185
6092a85K43j24o7P5l9JJ4L4oJ27j22N3M2J69m07K14N6j92k5n8j6J20qQ9K10l1
6118A67Q5j98L6j01O2j06k8O2J4J28p7k02L06K2j24j02O1R2n7Rk32Q4K01K07m87
6143a78OJ82q1k59L72o9Q4J06k35J52k08J99j28n3qK83k37n2J2J30k47K8J25k0
6167i6K06j17J95k31O6L8P8k36O5J19J30j42l16J16P8R8j41L0K01J14j14n35J40
6190b54K96l4N0O1k83J65k24K88j00K11p0J45l42J11n5N3O4j63K58p6q2N8n2o8
6214d3Q7J30L6p3m9j62Kn3J53R6j01L48l65j04K22j86P1j28J48k3j09K36k93K47
6238H7Q0n8j8mj94P3K7k64L88j02n1R2J69q3l24K00Q8K2k27q1L48j28K78k29M5
6263A34M4r5j10j2J96q1j55J31k4R1n2k68L06LR9l13j6k5K75l25K31M6l06J08
$$ plain form
6092 -185 58 -66 -133 -58 -97 -96 -82 -48 -54 73 -49 4 46 215 -192 22 78 -114 -139 -197 -213 -93 -101 -12 198 167
6118 167 252 54 90 -11 51 -55 -83 -21 -7 121 44 -158 148 170 46 -56 5 97 40 49 -183 -99 102 309 -178
6143 -178 -172 10 -71 -330 42 -27 57 163 -72 80 -128 71 -57 -110 -118 165 -72 -124 -112 18 -229 -201 -76 -96
6167 -96 110 -7 188 -43 23 61 139 -97 -32 87 217 75 -241 -125 -47 51 -90 -60 141 255 141 -394 -254
6190 -254 42 8 58 119 -164 1 -223 65 -35 176 106 251 -91 20 -35 18 82 -81 177 101 19 77 25 -43
6214 -43 44 174 210 137 88 -74 -72 -125 28 124 23 371 6 -98 124 -62 9 -119 29 6 -103 133 -160 87
6238 87 167 109 91 87 -107 -34 -7 -271 117 15 -36 56 225 142 -182 18 106 128 -99 -180 168 40 318 89 134
6263 134 178 83 -27 -39 157 76 -79 52 28 119 67 -201 105 108 207 -106 -122 -147 128 -197 34 80 -226 -118
6287a18J27J19k46J62K83m46K50k65PK43k1j66l46L54R4q4K5Mj26K57N5k57O9
6310b6k74J99L50j83j56k04K39rJ12j76M82k42j29l6q1K09Rr4K2QJ25Q3j1rk60
6335e2OM4P3j68J00j78K93L5j9q9q9L25k68R2J1k10J13K2J07j45K91n04J71l4
6359g3P2m4R6k42K69Oj7K14l58K33k24N9R3J9j77p8K90j99K63k10K29q5l11K94
6383A19j66K56k10j37K12n0r9L3J25q3j97J78Q4j47J50K3k21K90j81Mr4k6J55
6406A8P0j32K31o7Rj52l4K46k93L34k10q5K74j58k92L92k85K44N6m13K33J95r4
6429H7m67L19K09j35J03l23K25Mj39K16j98q7O7l9l5J27m8L57k67q4m3Q2P2o1
6453e8R1k60K81j58J13j00m6m2N6J87j11J83J0j65q6l1K59J25k11l68M77j51j91
$$ plain form
6287 -118 9 128 -118 44 327 -119 131 -134 -127 116 95 -71 -417 -63 31 -53 -28 -24 -150 107 162 -95 -26
6310 -26 -300 -101 249 66 -90 -294 -55 -64 48 -128 354 112 -17 -53 -134 75 84 -10 12 20 145 228 217 208 -52
6335 -52 -46 -2 71 -97 3 -175 118 153 134 45 -44 281 13 105 116 -94 19 41 148 3 294 -210 -39 -73
6359 -73 -1 -45 51 -191 78 84 67 281 -77 156 -68 -9 84 103 -74 -152 138 -61 202 -8 221 136 -175 119
6383 119 -47 209 -1 -138 74 24 -75 -42 83 0 -197 -19 65 -82 68 91 -130 160 -21 -17 -111 -137 18
6406 18 88 -44 187 120 129 -23 -57 189 -104 230 20 -65 209 51 -241 151 -134 110 166 -247 -14 181 87
6429 87 -380 -61 148 13 116 -207 18 22 -117 99 -99 -186 -119 -158 -193 -66 -114 243 -24 -108 -151 -69 3 -58
6453 -58 33 -227 54 -104 9 -91 -137 -179 -123 64 -47 136 146 -19 -105 -136 123 248 37 -331 146 -5 -196
6476a96N04q36O70j75N1LL30l65l3J53j18J13m1j27J34k0j61M07k84J8K07k46
6498a2K99l01j73K13p0K94m56L4J62K0J27j93N3N8J26j78J4M5q8J85j49LP0k22
6522a39K20m6J51n27K60J28mN1j87L24l59R7J29K3j63K16j59K8j51L30k49j60
6544a87J15j01J30j06L9K70K40n54j7P8p7K04n7O7K8L3j01n6J36M55o79L85l15
6567g0RK30N3o7j14M33m80k22K01O7R4m61K39K49k63j03J38Q9K9K0j53J43j13
6590e2J36l88K59L52n31M10j78L6j63L59j76N6J24l06J82o8k4j01j14K75k68K7
6612a53L04j90K65l55N5J69j91q3J31R5o5j57K08P9p1j25J56j06J71j66j71L34
6634A34j2j94J81m3k02J51K04j08j73P4k13J48K90j68l36L40k51L7J77j60P2K6
$$ plain form
6476 -196 308 -528 142 -33 18 21 351 -14 -47 106 -12 101 60 -67 67 47 -114 293 9 27 234 -12
6498 -12 287 -14 -187 26 -44 250 -206 -172 -10 10 137 -56 -3 55 181 3 17 62 -26 159 10 13 83 -139
6522 -139 81 35 186 -341 -81 47 43 94 -93 231 -128 -31 98 121 -42 174 15 43 -108 222 -27 -187
6544 -187 -72 -173 -43 -149 -110 160 400 -154 -171 -93 -170 34 -23 44 72 105 4 -52 84 539 -140 245 -70
6567 -70 -61 169 222 155 41 474 -6 -228 -27 40 134 -327 -88 161 -102 -205 -67 22 51 71 -82 61 -52
6590 -52 84 -304 -45 307 -224 186 8 44 -119 240 64 120 244 -62 120 52 28 -73 -187 88 -180 -153
6612 -153 151 -39 226 -129 -74 95 -96 -179 -48 47 -18 -175 33 112 41 -84 72 -34 137 -29 -200 134
6634 134 122 -72 109 66 -136 15 219 111 -62 12 -201 -53 237 69 -267 73 -178 -141 36 -124 -52 -26
6656b6p2K03j76n6K3l9N9q0L19J1k44k6J08j36J17K04J36l17N6L8Q7l2m34M02
6680A25o91K91Q6L90q3j62J78l56K88r8%m8K10l20N3Q2P7k10L59K00l98J93j47
6703A9k5K33J37m50J31L77n33R2k61K29rK32m48K3L27j78m29N00m8l04L93R3p0
6726C1k96K77j07O6o0K95l87K31j6j29m5m1K75j86J72L4m9P0K08l83JJ32l47L22
6750F8n5J81k05m9K29j42j7K52l60J30K79n28K55j56m5K78k65P1j00P9l1L74j75
6773F8o1M1M04n24J10Q9n6j37N8j66P0j73J51K90Q9k64O4K19r5p2j13q4q0J93
6797B1M2o3q2J52r1K46l64K4K36j76K73k42J46k01j6J00j83J95k21K20j80L7J84
6820E7L1m2n3r8L7J16J37j53O1j91K05k00K47j88L09o4l79J91O0k3k32j61L72
$$ plain form
6656 -26 -98 105 -71 -127 -104 -143 -84 -164 155 166 -78 -104 4 -132 -15 189 325 8 64 102 189 157 -277 125
6680 125 -566 -275 -189 201 118 -44 134 -222 66 -32 -32 -80 130 -190 -137 -55 22 -188 171 371 -27 166 19
6703 19 -6 227 364 -86 45 422 -111 -19 -280 -51 -60 172 -276 -253 74 -104 -533 -33 -81 -385 8 101 31
6726 31 -265 12 -95 -29 -89 206 -181 50 34 -95 -140 -181 94 -92 80 114 65 135 343 -40 -39 93 -254 68
6750 68 13 194 -11 -60 169 27 10 262 -98 32 311 -217 38 -118 -163 115 -150 -79 -179 -100 -131 243 68
6773 68 7 48 452 -72 38 127 71 -66 -8 -174 -104 -277 -126 164 253 -11 53 272 177 105 -8 -92 -172 21
6797 21 63 0 -82 70 -21 225 -139 -115 121 -55 218 -24 122 -79 -95 5 -178 17 -204 16 -164 -127 57
6820 57 88 46 -7 -105 -68 48 185 32 93 -98 107 -93 154 -34 275 211 -168 23 83 60 -172 -333 39
6843C9j32J19K63l54K17o7J80j78j7m62N43k93J14J26j46J84j96M1j81K19j04
6864h5j4%J26j89J69k24J72K12l69j00J77K97l37J24N0K04k37R5k08K67k48K00
6886H2j71L1J19j47K82k86o7K90k88K03J05o4l2j11L00m50J08K63l67K81j37R3
6908C7J44j77k65K62q8j00L00l89M13r1L5N1j40j8K14j34J96R9l85P2JL39k24
6931A52j10j87J10M9k03L26j62p7O8L72j63k29J53k03K29N5Nl15L40m61R8L73
6953B20l08k0J49j7k44k2K22K41m57N4J85J06j08K25l99J37j47N1K08l09L10O1
6975A38l48R2J54P4l4j45J21j07K5P2j43q4J03J70r0P7l28L38q3kJ97k16j24M7
6999i6j24j02L45J5M1n4j16J54k39K61r4k6J31k46j65L27j6L25k64Ol27K27L26
$$ plain form
6843 39 -93 26 289 -65 152 85 265 87 70 -392 151 -142 -28 98 -48 136 -60 -19 -200 19 -85
6864 -85 -99 -99 27 -162 7 -217 -45 167 -202 -302 -125 172 -165 -41 9 213 -24 71 -137 130 -118 82
6886 82 -89 -58 61 -86 196 -90 -157 133 -155 48 153 89 57 -54 246 -204 -96 167 -200 81 -56 37
6908 37 181 4 -261 1 -87 -187 113 -276 137 46 81 132 -8 -26 188 54 250 349 -36 36 37 376 152
6931 152 42 -145 -35 14 -189 137 -25 -102 -34 338 175 -54 99 -104 125 180 185 -130 210 -251 -153 220
6953 220 -88 -108 41 24 -220 -242 -20 221 -236 -182 3 109 1 226 -173 -36 -183 -132 76 -233 77 138
6975 138 -210 -118 36 110 76 -69 52 -55 -30 42 -101 -185 -82 88 -2 75 -253 85 2 0 197 -19 -143 -96
6999 -96 -220 -322 23 38 79 25 -91 63 -176 85 -9 -35 96 -150 -315 12 -4 321 57 63 -264 -37 289
7022B89k90j99K96K3m26J23J83J21K9j51k9O7N8l26N12l80j23J75K17k53j9J61
7044E8N2k78J49l2j23QJ11K2P0J95j53K29k64J05j16j45M92n44J67pL58j45j06
7067A03O5m58L80o6r1PJ71Q9k94P5K32r7j73p2L03j71m9J27L5j29p3J99q5N2j65
7092h5M7j15R2j95M67J03n04mK73K5J6O9l18N3n7R5J49n4l59J29Q6K4L2J28l12
7117b15J83j7p2o2J95J06q5q4J16J9j94q4K83J49k31N5k05P2r3K61J4l1j20K31
7141A91q1k73J04r6J8J3J43j1q9o7L02p1n9R3L9k20p4J87ok12J66L31l72J96j29
7166B3jJ43l21j5N0O2K19P5j22p2j52Q3J47k93K7L66j2n9l13L2L6L54l92L24j99
7191a0M1k3J81J97k03j71J57j43L7r7k0O9q5J35l43J92o9Q8P2O3m7j42L48m46
$$ plain form
7022 289 -1 -200 96 119 -307 -184 -1 120 149 -2 -31 36 94 -232 280 -100 -223 -48 169 -84 -103 58
7044 58 110 -168 -19 -51 -174 -166 -55 -33 37 232 79 308 44 149 33 -112 380 -164 3 -4 354 209 103
7067 103 168 -290 90 24 -67 -60 111 200 -94 -19 213 116 -57 -129 174 3 -46 81 116 -13 -86 113 28 80 -85
7092 -85 -38 -153 -61 -256 211 314 -190 -194 79 104 120 189 -129 -76 -133 -38 111 57 -302 -173 -87 -63 -31 97 -215
7117 -215 -32 -49 -121 -183 12 118 33 -51 65 84 -110 -194 89 238 7 62 -143 -71 -164 97 111 80 -40 191
7141 191 110 -163 -59 -155 -137 -124 19 8 -81 -148 154 83 24 117 156 -64 -138 49 43 -169 -3 328 -44 152 23
7166 23 22 165 -156 -171 -121 -59 160 235 113 41 -111 -28 119 -174 -147 219 207 148 -165 -133 -97 257 -135 189 -10
7191 -10 31 8 189 386 183 12 169 26 63 -34 -54 15 -70 65 -278 -86 -155 -67 5 68 21 -121 227 -219
7215b19M01m77J46K37l46K43J21j11K52N9k28R2r3o0L73l35J92j85j75J32J51
7236A70k61L15k66n9K72k22j45J47j4J32j36J65j79J7l0J93l08M45k54j16L69
7257B35j64m9K9j92m5L13J0k58R6J35q9k67K31J07k21J30qK1K48R0l05K4J3k3
7281F1l7l2r0%j26J09n0L7J63j05J49lk34o1K45Q0k13J80k9K6k3j63n4L6K79j95
7307e0J6P7k71K70k27K12o6K37j14P0l03L7m1P1M9J05j91K33K16k67j69M5Kl9
7331i8j27N84K7l92R4j99J77j18k3L4K18l23K08N6l08J81j25P7j84L88l50K45
7353D2J47p2p8j89M67m43K61j61k4K22L0j94j66K93j04j51J31m9K0M7k62J03N8
7376g2k0L6r4J28j6l64O75k07J8J18k26JO2K82l57j39J17Jo7R7J3J43k44Q6K34
$$ plain form
7215 -219 182 -295 -149 88 -258 -15 106 -5 247 306 78 170 77 17 390 55 247 62 -113 19 170
7236 170 -91 224 -42 -101 171 -51 -196 -49 -63 69 -67 98 -81 -64 -94 99 -209 236 -18 -134 235
7257 235 71 22 51 -141 -186 127 137 -121 -25 110 21 -246 -15 92 -129 1 -7 14 262 352 47 71 84 61
7281 61 24 -8 -98 -98 -224 -115 -165 -128 35 -70 79 76 -158 -219 26 106 -107 73 44 70 47 -116 -170 -134 145 -50
7307 -50 -34 43 -228 42 -185 27 -39 198 84 154 -149 -112 -153 -82 -33 72 -119 114 330 63 -106 -61 -59 -98
7331 -98 -225 359 386 -6 88 -111 66 -52 -75 -41 177 -146 62 118 -190 -9 -134 -57 -241 147 -203 42
7353 42 189 117 39 -150 317 -126 135 -26 -50 172 202 8 -158 135 31 -120 11 -38 -18 29 -233 -130 -72
7376 -72 -92 -56 -150 -22 -38 -402 273 66 84 202 -24 -23 39 321 -36 -175 -58 -57 -124 -27 -14 129 -115 -29 205
7401B05j57k08K39J7q0J02j24K5k71J67K77j90J33L8m27M0N45l83L51j99LLK3
7424A29k58j83n8M43P6k87O3L9j09Q2MR0k3Q2Q0l34J6L8L5K47J8l42L05j25R7
7449A25p8j5j28m2Q2j36J28m8L4K63l06L40J57k43j07j51L2Q2O4j52J29J58j13
7472G5J08o7j05q5K77k76Q1m2J64M7j83K56k50k8J91q7j25J28n7j19J44J03j93
7495d3O4K94k98k7L4j6l83L48j56K03rj98J6J50r6j03N73n78J19j38N9L76j56
7518C5q1m48M11J06j89K13j62K56j15l9k18K96j96O4J19j11qRK18k5k83n8J41
7541f5m6PlK09k9j58J31j03K39j17j66k5J47j3k80K37J8J60k87L20l12R4J01J05
7565A64k85K03m39N81k79q7j16L49k54K3J33J55J53l91J40j55K00k70J6J32J53
$$ plain form
7401 205 48 -160 79 96 16 118 -6 19 -252 -85 192 2 135 173 -254 -214 331 -52 299 100 103 106 129
7424 129 -129 -312 -370 73 149 -138 -75 -36 -145 -63 -59 31 8 90 170 -164 -148 -110 -75 172 190 -152 153 28 125
7449 125 47 32 -96 -138 -56 -192 -64 -112 -78 185 -121 219 376 133 26 -125 -93 -11 53 -99 30 188 75
7472 75 183 116 11 -74 203 -73 8 -34 130 177 -6 250 0 -28 163 76 -49 79 22 -97 47 150 -43
7495 -43 21 315 17 -10 24 8 -375 -27 -183 20 11 -187 -171 -21 -117 -220 353 -225 -106 -244 -185 191 35
7518 35 -46 -494 -83 23 -166 47 -115 141 26 -13 -231 65 -131 -67 52 -59 -67 -58 160 135 -148 -206 -65
7541 -65 -111 -104 -107 102 73 -85 46 -57 182 65 -101 -126 21 8 -272 -35 -17 143 -144 176 -136 -42 59 164
7565 164 -121 82 -357 224 -55 -142 -258 91 -163 -140 -7 148 301 -90 50 -105 95 -175 -159 -27 126
7586A26n6k96K18j28j05L96k05qL29j43j74q7K53Pj56J4N2m6K39j44l0r6j63L82
7610A79j38O3M5k39K13L7m2j60L8J04m3N1J60j68n7K45l39L8J91k66K23j64j36
7633a65J74j06k3M1L26l34L29o8J2l90K97K75k76o5p4J35j44j04J16J14k38J0
7655a58r0J25%p7J90J10J41q8M1r7l29L02r6q6M8Q8j9k86N60l96K06J52j45l83
7679b87J11J83Q5l85M34k02O1n6K2k03J27L65j53j4l8P2K1l98L54Oj50j21L02
7702A36j35Ro7j13J6O7j13L46k02K09o2J70j06j71q1J04J52q7O6j98L5J67n4j57
7726f9L0K9m1J20n5j91M5L64k31K33K6l45J06p3R4R5n3l24J12J70O7k57L19r9
7750G2j07J64n1j35L3L6K2k81K0M99j6j54o4J70l19l1L57n3k52j40L19J8m38M14
$$ plain form
7586 126 70 -226 -8 -136 -241 155 -50 -58 271 128 -46 -133 120 127 -29 -15 37 -9 230 86 56 -40 -203 179
7610 179 41 104 149 -90 123 160 118 -42 -4 100 57 108 268 100 43 288 -51 -13 178 -88 135 -29 -165
7633 -165 9 -97 -120 -79 247 -87 242 174 186 -204 93 368 92 27 -47 88 -56 -160 -44 70 -168 -158
7655 -158 -248 -123 -123 -200 -10 100 241 153 194 97 -232 70 -26 -112 -64 24 5 -281 279 -117 89 241 96 -287
7679 -287 -176 7 92 -293 141 -61 0 -56 -34 -237 -110 255 102 88 50 122 143 -255 99 105 -45 -166 136
7702 136 1 10 -57 -170 -154 -87 -200 146 -56 153 91 261 155 -16 -97 7 159 72 138 -60 -25 142 88 -69
7726 -69 -39 -10 -51 69 14 -177 -132 232 1 234 260 -85 21 -52 42 137 84 -240 -128 42 109 -148 171 72
7750 72 -35 129 78 -57 -24 12 34 -247 -227 272 256 102 38 208 -111 -142 215 162 -90 -230 89 107 -331 83
7774H3M5J32q4j01l7m70O10j74r1J19j2J93k07q9L77l98K29j08J61k76J64q9J24
7797A01n7l65M38k15M23l10J20l84K35J95l02L00l1j79J25J25j99J36O9k35J8
7818Hl9K56l19J81q8k6J31q9j36J10n6R1l0j11K80k17k36K59l7o3J41K15k27J20
7842A18l37K33J74j06K57l22o8r1R8J30j55R6Jk16K11k9kK4k15M82l82j8J4j0
7866a13L02j23p1j24K49J01j70m5M6j00m9j77K18K66k55J33j46o8K44l51M86l69
7888a16M6J94j88J72J05l16Q2M5L0j39J58j64K34P2k57J8r9j00L45K4O8l44L74
7911B44l78pJ08k23J04J10j68J96Mn9K58k88J50J32j79p7j52L98j50J26n4j56
7933f1M6o6O9P4q9J8J80nl34L09J49m49K18q2l4MQ3k97K78p2J76n6Mr4J4P8J08
$$ plain form
7774 83 128 260 176 75 38 -432 178 4 -87 32 20 213 6 -83 294 -104 125 17 178 -98 66 -23 101
7797 101 44 -321 117 -98 325 15 135 -249 -14 181 -121 179 148 -31 94 219 20 156 225 -10 8
7818 8 -31 225 -94 87 -1 -27 104 15 -121 -11 -67 24 -6 -117 163 -54 -290 -31 -68 -131 10 225 -2 118
7842 118 -219 14 188 82 339 17 -51 -142 -44 86 -69 27 28 -188 23 -6 -8 16 -199 283 -99 -117 -103 -113
7866 -113 189 66 -5 -129 120 221 51 6 52 -48 -97 -274 -56 210 -45 88 -58 -126 118 -233 253 -116
7888 -116 -70 124 -64 108 213 -103 -21 24 54 -85 73 -91 143 215 -42 -24 -123 -223 122 146 214 -130 244
7911 244 -134 -141 -33 -256 -152 -42 -210 -14 -10 -69 189 -99 51 183 4 -73 -225 173 23 149 95 -61
7933 -61 -15 -81 -12 62 -27 -9 171 166 -168 141 290 -159 59 -23 -57 -53 30 -267 11 -61 115 59 63 -31 -17 61 169
7960A69j2k30L7r4M42j75j88R9k65J56J7n5L05m40L55n3k96K33K57k97J47l10
7982a98J63k14L42Q2j55m0J53j67k27J38J06k48N06l10J66k11k8L37j92p0M14
8003C47l11o7P4j35K77k16J45j96K08j43j15K96l6m9R9k94j78M41k67J52qj59
8025a35K43k67K15%j85J90K10k09O3j37L2k35J52Rj7J70j16k33J47N3NJ38q3M4
8049E4j19j05J04OJ73k06j87N42m50k7K01R9k45K53j15j32M04k91K1k03K19j18
8071a22Q8J35r2k02K13K79l28q1J04k4L67l43k6j7J25j00J68k85J82o4O0L2l1
8094C8j51O4j2J61j86K88l0j51R0k10L49j55j68Q9K7L3j33n5K06NP4l74j48M85
8118A36k99jp7K37J6J16Kj41o0J22R4l53K53p7L0KN5qL2n6J01l66K49j04J54J6
$$ plain form
7960 169 157 -73 -36 -130 312 137 -51 48 -217 -61 -44 -99 206 -234 121 68 -228 5 262 -35 112 -198
7982 -198 -35 -249 93 175 20 -20 133 -34 -261 -123 -17 -265 241 -69 97 -114 -142 195 3 -67 347
8003 347 36 -31 43 -92 185 -31 114 -82 126 -17 -132 164 128 79 178 -116 -294 147 -120 32 24 -135
8025 -135 108 -159 56 56 -129 61 271 62 125 -12 20 -215 -63 -54 -71 99 -17 -250 -103 -50 -45 93 10 54
8049 54 -65 -170 -66 -60 113 -93 -280 262 -188 -215 -14 85 -160 93 -22 -154 250 -41 -20 -223 -4 -122
8071 -122 -34 101 9 -193 20 299 -29 -110 -6 -30 337 -6 -32 -49 76 -24 144 -141 41 -23 37 69 38
8094 38 -113 -49 -61 100 -86 202 172 21 111 -99 250 95 -73 16 43 76 -57 -112 94 99 173 -201 -349 136
8118 136 -163 -164 -241 -4 12 128 130 -11 -71 51 145 -208 45 -32 -2 0 55 47 79 23 124 -242 7 -97 57 73
8144G3j50R0M4P5n5l04L78j89n2j53J29J85Rm6j86K03j91L01j5q8K6r1j14J08
8168a3j52M05k49k0J13q6l7j64M09m39M42k80K37J8k46J48kk47M76k51j84J82
8190F0r6
$$ plain form
8144 73 -77 13 57 132 77 -227 151 -38 -90 -243 -114 71 80 34 -152 51 -140 161 146 58 84 -7 -121 -13
8168 -13 -165 240 -9 -29 84 -2 -39 -203 206 -233 209 -71 166 184 -62 86 84 -163 313 62 -122 60
8190 60 -36
8191c6
$$ Imaginary data points
##PAGE= N=2
##DATA TABLE= (X++(I..I)), XYDATA
0@%%%%%%%%%%%%%qJ6j6J6j8K6l2M0m8N6o6P4q8J04j20J38j61J85k10K39k73L09
35A63l48L91m38M90n46O08o78P55q36R24j022J129j244J370j510J665j833K019
53A059k229K461k721L017l355L746m202M743n404O229p283Q689j0679J3725j9028
68a1232L0876j09104L9340J41513j33469l4340P7384O4202n4800m4463N8043N7432
80H1382o8701k9360K8067J4410r566l1760j4797M0061r828k8840J0737O317N329
93f549m793l6146L4606N1788l2246k4013L2118K7342o542m3676J2651N4193m4969
106A3764n7647L9811J7680l7812k4235J8905M5358k1838m5356O1081L4567n9202
118a4924M994M5182j2253k0272P5J2913k917k5371J4417Q397l2615J6072K1196
$$ plain form
0 0 0 0 0 0 0 0 0 0 0 0 0 0 0 -8 8 -8 8 -10 16 -16 24 -24 32 -34 40 -48 56 -64 74 -87 98 -112 127 -146 163
35 163 -185 206 -232 258 -288 320 -358 397 -439 485 -537 592 -652 718 -792 873 -960 1059
53 1059 -1170 1291 -1430 1587 -1768 1978 -2224 2519 -2885 3344 -3939 4750 -5929 7796 -11232
68 -11232 19644 -89460 -50120 91393 -42076 -76416 968 65170 10370 -34093 23950 81382
80 81382 12681 -16679 11388 25798 16232 -15528 -30325 9736 -92 -28932 -18195 -11878 -6549
93 -6549 -11342 -47488 -12882 38906 6660 -17353 14765 42107 35565 -8111 4540 58733 13764
106 13764 -43883 -4072 13608 -24204 -48439 -29534 15824 -6014 -51370 9711 44278 -14924
118 -14924 -9930 35252 22999 2727 2802 15715 12798 -12573 1844 10241 -22374 -6302 14894
131A4894l3550j559J9172o823k075k778J4793J7718k7774J912L7671j6655j6223
144a277J5783l420o651j1493n681J9771j7803k2388L3318L378k3718J9538J3073
157A2430p418n778q21K3831m683l7132K0620K3054l3969o212K2011K19j1924j1012
171a6784J8366J4414l1062K521K7202j8715m581J7759r097J844P021o153L020
184E755n294J917R795k4594k450K8070j8735j7559K0768O233l872o679K457K6613
198B2425r856k6706K3735J1763k3901o201N862R070n669k3213J6841J9402k6065
211a2513l53K0465n836l101O13Q87R713r036k027J3294j2206J27J4063j7596l263
226f769J5791j1307q855K891M163M513j5178P27K7565j1280j4902K3287N086j1170
$$ plain form
131 14894 -18656 -20215 -1043 -7866 -9941 -12719 2074 19792 -7982 -6070 31601 14946 -1277
144 -1277 14506 11086 4435 -7058 -12739 7032 -10771 -33159 159 3537 -20181 -643 12430
157 12430 5012 -766 -1587 22244 17561 -19571 1049 24103 -9866 -16078 5933 6152 -5772 -16784
171 -16784 1582 15996 -15066 -12545 14657 -4058 -8639 9120 23 1867 8888 2735 5755
184 5755 461 2378 12173 -12421 -14871 13199 -5536 -23095 -2327 3906 34 -6645 -4188 22425
198 22425 12569 -14137 9598 21361 -2540 -8741 -2879 6191 522 -22691 -5850 13552 -12513
211 -12513 -12866 7599 1763 -1338 -725 162 9875 839 -1188 12106 -100 27 14090 -3506 -6769
226 -6769 9022 -2285 -11140 -8249 -4086 427 -14751 -14024 13541 2261 -12641 10646 15732 4562
240D562Q36J37N987o150j6110J3307J863j9222P362N999o139M122l857L966R648
255F311j1591L587J2899j2416J520J0731p610Q12O79k523N392r791m050J2002
269E952j2995o822J4329p421n219R959k04K010N47R63J2231p762q217J7278m791
284I838j5772R485R20p825j371k174P302j475j2909J2365O553j3033M704N525
298B133k422M203m294R69R875q318j536R045q039o98K709p542L291q57p637O178
314b940k145k443R691n440k272J3258m021n399O606K62L17n016m883J2560n067
329C068j4228J2379M047j1122K580K150J303R7p155O575N617j0998L980O285n965
344a387M067N71m618O267k155m108M309n361J101M208q464K006O492o905K554
$$ plain form
240 4562 5398 5535 11522 5372 -10738 2569 4432 -14790 -7428 -1429 -7568 -3446 -7303 -3337 6311
255 6311 -5280 -1693 11206 -1210 310 11041 3431 4243 4922 2399 7791 -2000 -6050 5952
269 5952 -7043 -13865 464 -6957 -12176 -2217 -2421 -411 136 1099 13330 5568 -2649 14629 9838
284 9838 -5934 3551 4471 -3354 -4725 -6899 403 -1072 -13981 -1616 4937 -8096 -3392 2133
298 2133 -289 3914 -380 589 10464 2146 610 9655 1616 918 3627 -3915 -624 -1481 -9118 -2940
314 -2940 -5085 -7528 2163 -3277 -5549 7709 3688 -1711 4895 5157 5474 458 -4425 8135 3068
329 3068 -11160 1219 5266 -5856 -3276 -1126 177 274 -6881 -306 5311 -5687 -1707 4578 -1387
344 -1387 2680 3251 -1367 4900 2745 -1363 2946 -2415 -1314 2894 -5570 -3564 2928 -3977 -1423
359a423L271k732M666l931m004J0000m273p287P361j22k815L81k173O730m16r581
375f348R507K851j0442M868K669m935K142k348J195L547o691K887M850p425L041
390f32L783p061L700K191m077L330j059m11N028o152L59P406o803j271M928n430
406b171P55O63m297N298j666m356P081j57l324M367j381J624K094o278M429K467
422E148q412L653L763p375K019J448k777K207l375Q50M217n825K370N247n926
437b768K894M651m931K661J965l283K613k794j926M317n830j942N283m621r93
452d704L899k959K375J403k809N619m91l820N708j322k281L763l924n9L640o116
468b078Q14L568o010J285K290l826J802j20p22M016k232L05N341m054M67N480
$$ plain form
359 -1423 1848 -884 3782 -149 -4153 5847 1574 -5713 1648 1526 -1289 -908 -3081 3649 3233 -6348
375 -6348 3159 6010 -4432 436 3105 -1830 312 -2036 -841 2706 -3985 -1098 3752 -3673 -632
390 -632 3151 -3910 -210 1981 -2096 1234 175 -236 4792 -1360 -1001 6405 -398 -1669 3259 -2171
406 -2171 -1416 -753 -5050 248 -1418 -5774 1307 1150 -2174 2193 812 2436 4530 -1748 2681 5148
422 5148 -3264 389 4152 -3223 -1204 244 -2533 -326 -3701 -2851 1366 -4459 -2089 3158 -2768
437 -2768 126 4777 -154 2507 4472 1189 3802 1008 -918 3399 -2431 -4373 910 -3711 -4704
452 -4704 -805 -3764 -1389 14 -2795 2824 2333 -1487 4221 2899 618 4381 457 398 4038 -2078
468 -2078 -1264 2304 -3706 -2421 -131 -3957 -2155 -2275 -2997 1019 -1213 -908 4433 379 846 6326
484F326n363K50L221m540M09p5k661K797l004j576N015l801j079N559k850J10
500a262L525l374L094J090l840L955j36l751L595j749k422L488l536j502L353
515E28l644M18K549l455K584J193k205M255q70j965M560k555j779M614m109j325
531a206L980l501p66J421j929J888o82j997M158k314k340N667k640k091M838k566
547h0k96L159l483J870J343l737K598j76l011L025j888j992L948k551r69L746
563A506l143Q44K231l327K355J065l176K947n14k328L567j510j677L901k813n59
579f31K516k816R08J103l543K935o3l708M205o22l396M556r20k267L331j812J30
596i4J948k781J815P62l001L229p46l302L697j169k605L386k073j163K715k628
$$ plain form
484 6326 963 1213 4434 -106 303 228 -2433 364 -2640 -4216 799 -3002 -4081 1478 -1372 -1262
500 -1262 2263 -1111 1983 3073 -767 3188 3052 -699 2896 1147 -1275 2213 -1323 -2825 528
515 528 -3116 -2698 -149 -3604 -1020 173 -2032 2223 1353 -612 3948 1393 -386 4228 119 -1206
531 -1206 2774 -727 -1493 -72 -2001 -113 -795 -2792 1366 -948 -3288 2379 -261 -2352 2486 -80
547 -80 -376 2783 -700 1170 2513 -1224 1374 1198 -1813 1212 -676 -2668 1280 -1271 -2240 1506
563 1506 -1637 -793 1438 -1889 466 1531 -1645 1302 788 -1540 2027 517 -1160 2741 -72 -631
579 -631 1885 -931 -23 1080 -2463 472 409 -3299 906 284 -3112 1444 524 -1743 1588 -224 -94
596 -94 1854 -927 888 1650 -1351 1878 1132 -2170 1527 358 -2247 1139 -934 -2097 618 -2010
612b010Q17K173l073K424J349k989L001K66k896L663j298k317L269k586q39J953
628I07l092J051J908l806K259J023l396L170O03k378L076o31p80K498j668K13
644I57J768k849J138P20l648K006O2l362K315M5k456L168q11p24K811j499P66
661D07K243k992K014J117l275K446O1l659K944j152k363K251j861l66K564l118
677b739J234K248k907K093J601k494K876N26k530K617j290q42J971k766k69J970
693A299l436R12J830l857K141R22k312K853r3j556L056j087m22K334k649O59K156
710B750l207J294J026l983K191J23l038K609m78j399K813k230L92K537k272O81
726a91K448k940J420J615k856J652lk068K271j399j410K592k779J55K372k952
$$ plain form
612 -2010 -1193 980 -2093 331 1680 -1309 1692 1958 -938 2725 1427 -890 2379 -207 -1046 907
628 907 -2185 -1134 774 -3032 -773 250 -3146 24 627 -1751 1325 694 -86 2412 744 957
644 957 2725 -124 1014 1734 -1914 92 154 -3208 -893 -848 -3304 -136 -947 -1671 1140 -359 407
661 407 2650 -342 1672 2789 -486 1960 2021 -1638 1306 154 -2209 42 -1819 -2185 379 -2739
677 -2739 -1505 743 -2164 -71 1530 -964 1912 2438 -92 2525 1235 393 2364 -402 -671 1299
693 1299 -2137 -1225 605 -3252 -1111 -189 -2501 352 259 -1297 1759 672 250 2584 -65 594 2750
710 2750 -457 837 1863 -2120 71 194 -2844 -235 -713 -2112 701 -1529 -1137 1400 -872 -191
726 -191 2257 -683 737 2352 -504 1148 1145 -923 1348 -51 -1461 1131 -1648 -1493 879 -2073
742b073Q87K353k753J692P03j919K201j74j443K552j944j46K381k851K28J976
758A670l111R00J242k399J650K17k055K294r01r74K750j315r21K871k263J89K243
775B087k989J193J147k086J451q3k006K370j390r44K210k069o29K909k623M70
791i82J888k239J673N97j958K171l51j643K543j228j026K151j929k79J975k648
807a285Q46J174k597J477L82k081K703r17j492L182j413n43K643j955l0K252k612
824b66Q45O97k174J421j44j855J868j360j158K875j826n25K525j824O00J568j699
841d32J211P85k013K227o81j809K386j189j666K520k394k75J682k188P43J197
857A04j941J864K85j862K674lj482K305j094r38K037j635j18J246k463P48N89
$$ plain form
742 -2073 -1186 1167 -1586 106 809 -1110 1091 917 -526 2026 82 -64 2317 -534 -306 1670
758 1670 -1441 -541 701 -1698 -48 169 -1886 408 -493 -1467 1283 -32 -953 1918 -345 -156 2087
775 2087 -902 291 1438 -648 803 720 -1286 1084 -306 -1250 960 -1109 -1738 1171 -1452 -982
791 -982 906 -1333 340 937 -1021 1150 799 -844 1699 471 -555 1596 -333 -612 1363 -1285
807 -1285 -439 735 -1862 -385 -3 -2084 619 -298 -1790 1392 -21 -564 2079 124 94 2346 -266
824 -266 579 1276 -898 523 379 -1476 392 -968 -2126 749 -1077 -1602 923 -901 -301 1267 -432
841 -432 779 1564 -449 1778 1097 -712 1674 485 -1181 1339 -1055 -1330 352 -1836 -1093 104
857 104 -1837 27 312 -1550 1124 1121 -361 1944 850 -88 1949 314 196 1442 -1021 -273 316
874C16k336J929J23k111K364m80j469K636j272k01K235k016Q30J352j883J117
890A134K79k149J813p28k052K451j239j679K532j479k35J830j877J055J298j720
906g66J662P21k012J926m3j945J987j413q06J640j746L4J063j981R54Q30j857
923a752J676K06j519K171l14j213K215j115l69J479j340L94Q87k160J071M35k528
940a776K095q2k070J919r3j439J923o03n86J818j479J007P65k328J622P11j863
957d59J164k18j688J786p14j115J708j139q9J161j713Q63J178j854J420O63j761
974h07J634l49j008J758j084k83J738k029K81R13j735P63O45j859J436K1j499
991a464J685m38q19J888j052m7J417j525M21J652k208Q24J175k021Q75r8j188
$$ plain form
874 316 -2020 -91 32 -2079 285 -195 -1664 972 -300 -501 1734 -282 548 1900 17 1134
890 1134 1413 -736 1077 349 -1703 748 -491 -2170 362 -1117 -1352 478 -1399 -344 954 -766
906 -766 896 1617 -395 1531 1488 -457 1530 117 -689 951 -795 -761 302 -1679 -725 105 -1752
923 -1752 -76 130 -1389 782 468 -745 1470 355 -14 1465 125 519 1406 -754 317 752 -1776
940 -1776 319 237 -1833 86 -7 -1446 477 -126 -712 1106 -373 634 1399 -929 693 1404 -459
957 -459 705 487 -1201 585 -129 -1244 464 -675 -764 397 -1316 -453 725 -1129 291 954 -807
974 -807 827 478 -530 1228 144 -139 1599 -430 -149 764 -971 -208 437 -1422 14 35 -1464
991 -1464 221 -217 -1036 852 -200 -247 1170 -355 66 1718 -490 334 1509 -512 363 265 -923
1008i23J119n28p25J360j016n9J515j545L82J099j692J450M89j284J451m43r81
1025c31J491j319m38J281j187J26R91j424M74N91j763J318L92j536J911j96r02
1042e21J390r32R9J644j712J13J310j780N33N59j640R30r9j233J432p19m96J603
1060D81j113rJ686j352K00J397j581R22N59j420J373p81j264J414o27j069J587
1077D03j284j82J355j501P36Q95j702J364O18j111J452j56r34J455j118m99J624
1094A415j549j43J165k133R64Q7q38Q89j31j046J921j069j59J690j053j64J673
1111A519j626J37J171j342P02pj552J166j56j105J318q28o63J613q77r9R81p13
1129c61L00R67j147Q63L99j274J030L8j343J206p06m33J196j416K3J044j326M23
$$ plain form
1008 -923 196 -332 -1057 303 -713 -772 743 -802 -420 679 -1013 437 926 -358 1093 650 -331
1025 -331 1160 -159 -597 684 -503 -377 614 -810 -336 255 -1508 -190 202 -1334 577 381 -521
1042 -521 869 -63 36 1680 -32 81 1391 -389 144 703 -937 -7 -106 -1339 93 -626 -1122 481
1060 481 -632 -641 1045 -307 -107 1290 -291 631 1190 -230 1143 362 -902 512 -115 -1184 403
1077 403 -881 -1063 292 -1209 -473 422 -1280 84 702 -409 1043 887 -47 1408 290 -209 1415
1094 1415 -134 -277 888 -1245 -281 -194 -1032 -143 -274 -1320 601 -468 -627 1063 10 -154 1519
1111 1519 -107 30 1201 -141 561 554 -998 168 12 -1093 225 -603 -1266 347 -530 -629 352 -361
1129 -361 -61 906 -241 622 1021 -253 777 815 -528 678 -28 -461 735 -681 -658 386 -940 -517
1147e17P19p76P91qr27J300m12m50J262o31o62J494j165k61R98j546O46N93j551
1166a103J217j23q99J092m14l05Q43l96j01J038j146M44R34j286O89L19j365J408
1184H46l75r82Q11m19o44J433j140m16J038o77L5P63j031J092L03j037J237l29
1202E08p83J212m04o84Q94q90O7O91j383P19R8r30O80L44j066R91L64q35R86n74
1222Ep0J174j058J89O55j118M46M30j292Q16p6q62Q60m87o31J117p03L3J075r94
1242d91O15M75q06P87K24j128R69m6j244J167j57p70P20j053J02Q93o85PO75j143
1262h89O54O70p33Q09K14m12Q19j171J73Q35r40k92J041j450N15L76j131Q61P
1281d4r74J118k54o19J139m36j54R73o09K24N16q83O61J59j046M88L2j018N93
$$ plain form
1147 -517 202 -574 217 209 -718 582 170 -280 982 351 -311 1183 18 -243 755 -791 -145 448 -1103
1166 -1103 114 -9 -908 184 -230 -535 308 -88 -189 849 -297 147 1081 -205 484 803 -562 846
1184 846 471 -511 300 -119 -763 670 -470 -886 152 -525 -490 273 -758 334 637 -400 837 508
1202 508 -275 937 533 -151 743 -147 -80 611 -772 -53 45 -885 -205 139 -927 64 428 -407 579 5
1222 5 -65 1109 51 240 895 -223 223 653 -639 177 101 -761 99 -388 -1019 98 -605 -572 503 -491
1242 -491 124 599 -207 580 804 -324 645 599 -645 522 365 -405 315 -738 -636 257 -428 -421 254 -889
1262 -889 -235 435 -298 511 725 313 1132 -39 134 969 29 -263 778 -672 -157 219 -912 -51 -44
1281 -44 -1018 100 -154 -773 366 -70 -224 749 140 364 880 -3 658 817 -229 259 291 -727 -134
1300a34j2o35Q52p02k9J005q10L78M98p82P28K67j021J105k19o98J139p90l22
1319a82M46m79m03O76m83K9L06o38O74J48n86Q07k37k35J138p88j88O37q08L75
1339B09L87j033M41J85q07O50ko22P04K09j018P74l79p5Q77n77J36O36q41K34
1359H8L39o35O66n38k67O13l09n68Q69q90P8P11n52K25L28n95N49N29o61K37N
1380B22l59Q87m07l46M25l25l82P92r06K61K29o52K94M44o44O41k81k88P61n41
1400a75J07R47j104L81P67r86M51K9p77P18k16p33P16m12n83J060m64k07P91o84
1420c74J27P19o19N65J51p94P63l7p09N29l73k33O95p35k70N01l03M0O9k56L26
1441b18O7l11N67K70l73M47l25j34N78o49J11M91q53N84L5q93O89m4o63P84k39
$$ plain form
1300 -134 -146 -781 71 -631 -660 345 -465 -87 411 -371 357 624 -397 708 489 -209 930 140 -182
1319 -182 264 -215 -618 58 -425 -396 -90 -728 -54 94 -492 315 78 -157 981 193 5 642 -166 209
1339 209 596 -437 4 189 -618 32 30 -592 112 321 -697 77 -302 -377 500 -77 59 695 -146 88
1359 88 427 -208 458 -80 -347 266 -43 -611 258 -632 -554 157 -395 -170 158 -437 112 641 -20 217 222
1380 222 -137 750 343 -3 422 97 -285 507 -399 -138 91 -561 -267 177 -467 174 -107 -395 366 -175
1400 -175 -68 879 -225 156 923 -63 388 417 -360 358 142 -591 125 -287 -870 190 -274 -481 310 -374
1420 -374 -247 472 -147 418 569 -225 538 501 -208 321 -52 -285 410 -325 -595 -94 -397 -357 -288 -544 -218
1441 -218 -151 -462 105 375 2 449 124 -10 568 -81 30 521 -332 252 287 -606 83 39 -624 160 -79
1462g9o88J014k66J01l6O3J01K66n46L90J60r37M86J55m93J61k55j71P94p09P1
1483d18N39k02j61P03q02M44L89p08P41j29p34Q21k23n02O74n61l70Q37q90K67
1503b85L83o61M26J21l92N99m47J8M67Ll33L12j45L6N13p59M41O4q05P81m89m27
1525e79M95m6k28M54jj85L43m38J09K83m29N05Ok91M26l74l01L82k51m72Q22o95
1547d65pM29l81k6O36p16M40K73n17O47J02m36O36o08J60L53n35J81L93j239O19
1568f1K02q98P62j40m54P69l27m62R83p06J74N06o40L41L41m15K95J69n94K33
1588G8j28j40P03p81p6N02k75k97M90n39L90L51m43M64K9m03O22k21o68N97l81
1609a26m5M91l70j87L81n60M86j00m99N38M3n18N87j46k31N08j56K0N43o89J44
$$ plain form
1462 -79 -767 247 -19 82 46 109 210 476 -70 320 480 -457 29 184 -309 -148 -403 -574 220 -489 -418
1483 -418 121 -81 -242 461 -341 103 492 -216 525 396 -338 483 260 -242 432 -129 -499 338 -552 -285
1503 -285 98 -563 -137 -16 -408 191 -256 -238 229 232 -101 211 66 102 615 -144 297 361 -444 337 -152 -579
1525 -579 -84 -130 -358 96 95 -90 253 -185 -76 207 -222 283 289 -2 424 50 -251 131 -120 -592 230 -465
1547 -465 -472 -43 -424 -450 186 -530 -90 183 -334 313 415 -21 615 7 167 520 -15 166 559 -680 -61
1568 -61 141 -757 5 -135 -589 180 -147 -609 374 -332 -158 348 -292 49 390 -25 270 439 -155 78
1588 78 -50 -190 513 -268 -344 158 -117 -414 76 -463 -73 278 -165 299 328 -75 547 326 -342 255 -126
1609 -126 -171 320 -50 -237 144 -416 70 -30 -529 9 52 -466 121 -25 -256 252 96 116 659 -30 114
1630A14N07n12m5J40m87K59m9j42K59j26m90P59o7m85N79k59R0K23l61M64j59
1651B12l04L86l35j61N64m19k41L86l62Q1n4k2l1M83l1j61J18k81O22k90r0L49
1673D19k53j7N45p68L66l8p20J41M39n73N23J32q71Q58l74j87L99K0k59M81m93
1694b30M75L89n36J67J28m78N4n5l75N50n28n8M85k90L73J36m75L00J58l29L46
1715B07j37m59P47O0n00K96l07j8J69k50J4l8l5K46J32l53K37L02n91O77r8l33
1737c2J56l6J20K68o03q0M24k14P9j21n00Q06m61k41M55k42r1M05k85L53J65n03
1759a78K53K55k43J95po12O26j83j13J40k81m4K62m28J12N46m74O6O0r8L54j07
1781A01k65L14K68o47N15j81j39L58m84J21L29m79J36m3l81K23J24P8K72k75l40
$$ plain form
1630 114 621 109 64 204 -283 -24 -73 -215 44 -82 -572 187 120 -365 214 -45 45 268 -93 371 212
1651 212 -92 294 -41 -202 362 -57 -298 88 -274 -193 -247 -269 -300 183 152 -9 109 -172 450 160 70 419
1673 419 166 149 694 -74 292 254 -466 -325 114 -459 64 196 -675 183 -191 -378 21 41 -218 263 -230
1694 -230 245 634 98 265 393 -85 -31 -86 -461 89 -439 -497 -12 -302 71 207 -268 32 190 -139 207
1715 207 70 -389 358 418 -82 214 -93 -111 58 -192 -178 -216 -251 -5 127 -226 11 313 -278 399 301 -32
1737 -32 124 88 208 476 -127 -207 217 3 82 -39 -539 267 -194 -435 20 -222 -313 92 -193 160 325 -178
1759 -178 75 330 87 282 275 -337 289 106 -7 133 -148 -192 70 -358 -246 300 -174 -108 -48 -146 208 101
1781 101 -164 150 418 -229 286 105 -34 324 -160 -39 290 -189 -53 -96 -477 -254 -130 -52 220 -55 -395
1802c95R04l72l02N46m06j35M40n85N69o9p40O08l00J72K13l18j28K17l8j67K06
1823h0J6j60N21o86Q72L2o31K04j1j04K96l52L1L54q25L51jq0L36K8k61p5K52
1846B7N9L39l63J66J84m16q0N30k05l40K05j59N3L34p91M84j35j54O62m32k33
1867b65N58l58K8L83m89L51j08l6M0O0j25K86j91r4j06n9l6M75m84O9K57k66J13
1890CM53q47J95L56m13O60j69m76M33j55j3J96j58p2j17k21J78P6j64L37k98J93
1912b3J47J5k0K68k5j29L46n12J76N08j064K14J21l11L45j35k47L91m59N49l04
1933a49N5j67N29m05l6O13n58N67k15k42M11k41j60K21l94j46L80m88K69N9j51
1954b48r4M04k40J89k9l3L18k09lK35j75n9K81m57R8K84n88L24K06l91L5J02j61
$$ plain form
1802 -395 509 137 -165 381 -25 -160 280 -305 264 195 -545 63 -237 -65 148 -170 -298 -81 -119 -286 -80
1823 -80 -64 -224 297 -389 483 515 -116 88 77 -27 269 -83 -52 302 -523 -172 -173 -253 83 111 -150 -225 27
1846 27 86 425 62 228 412 -4 -84 446 241 -99 106 -53 0 334 -457 27 -108 -262 400 -32 -265
1867 -265 293 -65 -37 346 -143 208 100 64 104 164 39 325 134 40 -66 -125 -161 314 -170 -101 156 -110 3
1890 3 456 -391 -196 160 -253 407 238 -238 195 40 27 223 65 -7 -124 -345 -167 -91 -255 82 -216 -23
1912 -23 124 139 119 387 362 233 579 67 243 751 -313 -99 22 -289 56 -79 -326 65 -394 155 -149
1933 -149 -94 -261 268 -137 -173 440 -118 449 234 -8 403 162 2 223 -171 -317 63 -425 -156 -97 -248
1954 -248 -342 62 -178 11 -18 -51 267 58 55 290 115 56 337 -120 -22 262 -326 -2 204 -187 -152 -50 -211
1977b11K95k30K01M4m1P6K93n36J66J27l91M43l6j76K89N9p23K29P1N1p3l8M3
2000f8L27l29Oj8J59NK3l02K87J47m85N67l47k72M77n01Q9K48l28J52L6OL6O4
2024b1M4K02j4m14N51j15k52M37l08j26N4k15j09K20j94K24n1k69J3M00k82K25
2046@p9L5K20J7k24K07o5J26P1m13L02j08n9P3j63q6J31r3r6J32R0j5J67l05J37
2071BN8l67J34K34j33M10j50j35k39J81PJ0Kk01J32n4n0K78k66L70l27o4K62l66
2095b72L27k4j74L71L1o10N36K0l31k2L25m42K07k4l2K94k24J32K2k33K2N60m47
2118A2O9J79o14L97L9k14K92m9l65L10k46K12K6m15J45K5j76J51J30R1k8J90l40
2141a79O09l44J08l47J62j67K74l04Q6l9j77L10N7k81L20o1l86N14j21J75k62
$$ plain form
1977 -211 84 -146 55 99 58 134 427 -109 57 184 -207 236 200 24 313 372 -351 -122 -51 0 -73 -111 -68
2000 -68 259 -70 -64 -82 77 82 105 -197 90 237 -248 319 -28 -300 177 -324 -235 13 -315 -163 -127 -121 -85 -21
2024 -21 23 225 211 -203 348 233 -19 418 110 -16 38 -177 -286 -66 -260 -36 -87 -356 -343 57 -225 0
2046 0 -79 -44 176 193 -31 176 111 237 308 -105 197 89 30 103 -60 -146 -15 -108 -204 -72 18 3 170 -135 2
2071 2 60 -307 -173 61 -72 338 188 53 -186 -5 2 12 14 -187 -55 -109 -159 119 -147 223 -104 -168 94 -272
2095 -272 55 31 -143 228 259 -351 185 205 -126 -148 177 -265 -58 -82 -114 180 -44 88 110 -123 -101 459 12
2118 12 81 260 -354 43 82 -132 160 111 -254 56 -190 22 48 -367 -222 -197 -373 -222 -92 -1 -29 161 -179
2141 -179 430 86 194 -153 9 -158 116 -188 -102 -141 -318 -8 49 -232 88 27 -359 155 34 209 -53
2162e3k03M66J91p02L73J0j74L92j02m82N29m40J59K1j09L49j98k48L80n9k13
2183a13J94J6Q5k36L20k27N2m04M07J67n78K92o1j55Q1J03j7J53j98K0R2J68k36
2206g5L02j60p5L59n60K27J06j68R6N0m21J16l8J38J5J76l87M11Qk76N57l73K5
2229E3K81l32l7K65l70L13k10j38K80k56Q4K13l47j14L80k76K35L75o73N48n00
2250b26O6O43k56m48L40J97l16Q7j77J8M26n97J22O0k73L14n7j57L21o2m14K62
2272a27L07k58L65l41K30J38k59j67L0k1J79j44l35M50m26M54k8j39k20L99p6
2293A1K9mq6K82j91k60J43J21j1K10m52l3K17p1j19J85n0J28j90j88L70J08j28
2316B1J87j81j6l6J58j31L03j69k29L72l54M05j72k01k35K81l85N56j99k93N19
$$ plain form
2162 -53 -256 210 401 -301 72 82 -92 300 198 -284 245 -195 -36 -15 -124 225 27 -221 159 100 -113
2183 -113 81 97 182 -54 266 39 91 -313 94 261 -317 -25 -86 -241 -160 -57 -74 79 -119 -99 -7 161 -75
2206 -75 227 67 -8 351 -209 18 124 -44 52 102 -319 -203 -241 -103 -88 88 -299 112 120 -156 401 28 53
2229 53 334 2 -35 230 -140 173 -37 -175 105 -151 -67 146 -201 -315 65 -211 24 399 -274 274 -226
2250 -226 -160 483 227 -221 119 316 0 87 -90 -72 354 -243 -121 -61 -334 -20 -77 -234 87 25 -389 -127
2272 -127 180 -78 287 -54 176 314 55 -112 -82 -103 76 -68 -403 47 -379 75 47 -92 -312 87 11
2293 11 40 36 -50 232 41 -219 -76 45 34 244 -208 -241 -24 -95 -214 -29 -79 49 -141 -329 41 149 21
2316 21 208 27 11 -25 133 2 305 136 -93 279 -75 330 158 -43 -278 3 -382 174 -25 -318 201
2337B01k47r5K72k08J64J70m20R1L93k96j93N82m16O0k03O6K1j6M50k36l09j41
2359c10N78m83K36P7k53J39Pj4K46Q7k53K17j98k18K59k99l4K48j77K04J26m08
2381b23L16J7j86K76j80N9p2l5k3L17m83J03M75l37J08J9l8j06j51o9J64k77K9
2404b97L65k41K82J07l86K28K60l44J96j18j14J24J89j05j98L5j53k7nm1J03J74
2426C4j0k13k9K48o5J3J93MO0J28m30M9Q7j67J19J84j42N6k26R4n7j8K2j4L4k03
2452b49K63O7k24J87j49J32k6m2p5P6%K03l71J47J40p6k10L76k91O9L76n94L87
2475A16m8K0p8L3q3K69k19j40K88J0l02K23l08k1P5j22P9K37K0l08R0M19l95K14
2499F9M6j75J93k18K78k17L1P5j78L27l64kK57k89J03l1j25N4PK37l2J91j59L
$$ plain form
2337 201 -46 -141 131 -77 87 257 -163 -72 321 25 -168 414 -2 58 -145 -79 -58 -74 376 140 -169 -310
2359 -310 268 -215 21 98 -155 -16 -9 -23 223 310 57 274 76 -142 117 -182 -216 32 -145 59 185 -223
2381 -223 93 110 -76 200 20 79 7 -28 -51 266 -217 -114 361 24 132 151 113 7 -144 -213 -49 -326 -297
2404 -297 68 -173 109 216 -170 58 318 -26 170 52 -62 62 251 146 -52 -17 -170 -197 -202 -243 -140 34
2426 34 24 -189 -218 30 -35 -22 171 175 235 363 -67 -18 69 -98 21 205 63 119 -107 -13 -70 -88 -66 -80 -46 -249
2452 -249 14 81 -143 44 -105 27 1 -41 -116 -40 -40 163 -208 -61 79 3 -207 169 -122 -53 323 -271 116
2475 116 68 88 10 43 -40 229 10 -130 158 168 -134 89 -219 -240 -165 -287 -208 29 49 -259 -169 250 -145 69
2499 69 115 -60 133 -85 193 -24 7 82 -96 231 -133 -135 122 -167 -64 -95 -220 -166 -159 78 46 237 78 81
2523H1j57K25j78J68k43R7N6N9k15Pj6K68l75P9J08k37K91j88L93k59K35r0m2
2546F7L3j20k12J9J54o4J20n8p5J6J43p7n6l0K33k31M9J69m4l9q4J36Q0k38K48
2571A39k47J42K04k74j6O2J12L9m4q0N4k07Q8k04J62J13P0J64k15j8J79k58L29
2594B94k71j36N6k60L70k22J81R9j05j81PK59l52L50j88Q7K13O8k65j5L33l69
2616d7L16l61K7K56l96L07k49r5Q3J03p8L26k49j63O7J45q0M32j92LQ5k57J43
2639A26k66j10L59j6J90l61l8k24K74j47J89N2r1J58o5J6M9n4k19K63n0Q7L3N9
2663B14j49j19k7L4OM17m62K78q0k24K69j33M0N3l00M51j74q9M59m55nl7j15L67
2687B19m35J82j09o5J35J99n37N43R0k04j09K29J5J06j58O9l04J44L0k7J96m12
$$ plain form
2523 81 -76 149 -29 139 -104 -7 49 108 -107 -100 -116 152 -223 -144 -36 -273 18 -170 223 -36 199 109 67
2546 67 100 -20 -232 -213 -59 -123 -3 -61 -136 -120 23 -54 -110 -140 93 -138 -89 80 36 -3 -87 49 129 -109 139
2571 139 -108 34 238 -36 -52 10 122 161 117 37 91 -116 -28 -232 -70 43 113 277 62 44 223 -35 294
2594 294 23 -113 -57 -317 53 -169 12 111 6 -175 -168 91 -261 89 -99 -12 201 269 4 -11 322 -47
2616 -47 269 -92 -65 191 -205 102 -147 -242 -159 -56 -134 192 -57 -220 -153 -8 -88 344 152 155 240 -17 126
2639 126 -140 -250 109 93 283 -78 -116 -340 -66 -213 -24 28 -63 95 30 46 95 41 -178 85 35 122 155 214
2663 214 65 -54 -81 -47 -41 376 -86 192 112 -112 157 24 64 117 -183 268 94 5 464 9 4 -33 -148 219
2687 219 -216 -34 -143 -208 -73 126 -411 132 222 18 -91 138 153 259 101 170 -134 10 40 13 209 -203
2709b03J50j33P2j07O4K49j86N0RP2j93L89m55L67j69J2PKj9j68M45n23K14l3
2733h7J46j10o5L5K67m81L34K85n11M9o0K28L5m3L3K04l14J63jj01k67L01o0p
2757b7k2P0J6k05J38K62P4l67k5q1J33j7J1k29L40j4J5k0k79K37J48j32J12l65
2781b27K03J77o5o7K38r6l07K91l24q2L86r6L7J55k34k02L5J14J91O2k18k5M3
2804a1r9K39j54j99K54j08L01j25Nl7o1K4J14L3m60L69M7L5l82J17m4J32O7p7
2828b0M6j02j68oK08P9j70K84k08K13j1j76O8j45J06j05j18K07N7q1r0K82l13
2851a63J62N7o5r5L6k2l4J12K1kJ48k41o4j22L01J00k02J6N8k06R5K78m66K39
2875e9lK40k72O9P5J1k04K81l11J52j34R3N02n58K81m40L68j0j15j49N36k33l25
$$ plain form
2709 -203 -53 -186 -114 -221 -157 92 -94 -44 -35 37 -156 233 -222 145 -24 -12 -5 -3 -22 -190 255 -268 -54 -87
2733 -87 59 -51 -116 -81 186 -295 39 324 -187 -138 -198 30 65 22 55 259 -55 108 107 6 -261 40 -20 -27
2757 -27 -49 21 37 -168 -30 232 306 -61 -86 -167 -34 -51 -40 -269 71 57 72 52 -227 10 158 26 138 -227
2781 -227 -24 153 88 21 259 163 -144 147 -177 -259 127 31 68 223 -11 -213 -178 -64 127 189 -29 -54 -11
2804 -11 -110 129 -25 -224 30 -78 223 98 103 66 5 29 143 176 -284 85 132 167 -215 -98 -142 -10 57 -20
2828 -20 26 -76 -244 -250 -42 37 -133 151 -57 156 145 -31 37 -108 -2 -107 -225 -18 39 -42 -132 150 -163
2851 -163 -1 56 -9 -104 -68 -90 -124 -12 9 7 155 -86 -150 -272 29 129 -73 -57 1 -205 -110 168 -298 -59
2875 -59 -62 178 -94 -25 50 61 -143 138 -173 -21 -155 -62 440 -118 163 -277 91 81 -34 -183 353 120 -205
2898b05R8K66l23L97l91P8J84l60K09K57j94J1M1J4j48R7J43l46J45J05r0m5J1
2921d6J54k69L3J92J75m00N04l49j38L10l93L10l11L22j91J42j66K13j32K26R7
2942B83l64j4K10K7PJ03k16m19M17j89N9K18J4Q0o07M69k37j14M43k26j49P0K66
2965A31k6O7j38L3K69j80j15K2K55j52j48n1j79N72l98LJ34o8K80l37j32K88j65
2988c5L2L1j54M20j84m55M02K51J21j76n69K27K69m64L42m0k2k62M04k81n5K09
3010A1J16k73K53j88L8L83l21L28k68O1j16m9L47k53j12K55l41M39l02k03L51
3031A56N3k71k30J69J79k80K03l00L27L00n14L82j00k27P3m0n2L72m77K59j98
3052b16J77n4j6L09O0k46K43l84P2K74k55r6L3n7K8K27p9j64r0J32L2J6J79k39
$$ plain form
2898 -205 -107 159 -164 233 -158 -80 104 -256 -47 210 16 27 68 82 -66 31 174 -172 -27 78 -12 -57 -46
2921 -46 108 -161 -128 64 239 -161 343 -6 -144 166 -227 83 -228 94 -97 45 -121 92 -40 186 283
2942 283 -81 -95 115 142 149 252 36 -383 34 -155 -96 122 136 216 -391 78 -159 -273 170 -56 -205 -135 131
2965 131 105 172 34 67 336 156 41 63 318 166 18 -33 -212 360 -38 -35 99 31 311 -26 -158 130 -35
2988 -35 -3 28 -126 294 110 -345 57 308 429 253 -316 -89 180 -284 58 18 -4 -266 138 -143 -198 11
3010 11 127 -146 107 -81 -43 340 19 347 79 140 24 -25 322 69 -43 212 -129 310 8 -195 156
3031 156 209 -62 -292 -123 56 -224 -21 -321 6 306 -208 174 74 -153 -80 -120 -172 200 -277 -18 -216
3052 -216 -39 -93 -109 200 260 14 257 -127 -55 219 -36 -132 -99 -156 -128 99 20 -144 -234 -102 -70 -54 125 -114
3076a14n5J94m3J08J7K9J06k31j31M10j81q5o7R7K67q4l43L21r9j06J54j61o1
3099e8j85L59jl54J38J74k9k1j03P0K34o6j21Rk75j34N18K5k22Q6j80O5J36j82
3123a17K26l8J57q7l6j32l7N8J5jKj75K69k07q0O5K9K97mj52%k0o8l3K06N2k44
3150e5K95k94K87j19p3K65k33k31P2K1J32K8j99O9Q6K2n5L4r5K21q6J33r5l08
3174a78J88K03k30K8J81l41J49K17m35M00l03K62m8q3o0J30k18K42j47M23m73
3195i3R2r7k0L68j06k18j5j3j00K7K38j12k12K04O9K1K82l69k8QL29k76j37m3
3219b01J62L17m20N58k15l65j1K96r0l0N4J6K4O5k99J22J37P8o7k45K15R9l15
3242a15K43r1q0J7P0J36k33k58K83J05M7j9j28j6j67L12o9J01l34N5L41m10L19
$$ plain form
3076 -114 -169 25 -18 90 107 136 242 11 -120 290 109 24 -43 54 321 237 -106 215 116 10 164 3 -58
3099 -58 -243 116 115 -239 -101 73 44 23 -80 -10 224 158 37 46 -229 -363 155 180 -42 44 -136 -71 65 -117
3123 -117 109 71 228 141 105 -27 -64 -6 9 8 10 -165 104 -103 -183 -118 -89 208 204 52 52 32 -36 -69 137 189 -55
3150 -55 240 -54 233 114 41 306 73 -158 -86 -65 67 95 -104 -35 51 73 18 52 -43 178 92 225 130 -178
3174 -178 10 213 -17 11 192 -149 0 217 -218 182 -121 141 93 10 -50 80 -138 104 -43 380 -93
3195 -93 -1 -98 -118 250 144 -74 -89 -102 -202 -175 63 -49 -261 -57 12 33 315 -54 -82 -74 255 -21 -158 -201
3219 -201 -39 278 -142 416 201 -164 -175 121 31 1 55 71 95 160 -139 -17 120 198 131 -114 101 200 -115
3242 -115 128 37 -43 -26 44 180 -53 -311 -28 77 124 105 -23 -39 -206 106 37 138 -196 -141 200 -210 109
3265A09j64j46J11J79k21J41j0j81K63k37J56O0j68OJ72l0k6L3k1j23j80N15n1
3288A87j44k2j31L29j73R3j50m9J12J39p1l39J45N2K8Q6J37m01O9J15l4N9Q4r8
3312B3r9L72l83M54j54k31M4L2j68N9j53J73K76j60r8O6p7J05K8j95L23l08J99
3335A28l86J97j48R7J70M1J04l77L06j57J11mk77q5j2J72j4J00j2n5J74K24m25
3358a28J15J31K9k01J60m9N6o1m0M2J32p5m6n0k5O2m7l4R5j39J75j06J57J08m83
3383b22K22N8k9k81K76J48k89J76j01j07K38j26j5m4N9L3K02k29J14k0jr2MqK63
3408B29l21K5Q7o1P1j95J98j81J75J55k57j38L96k22MJ98l00K7QK79k54J36j14
3431e5L80m48K95j74Q8l06N59j73o37N81l8j61J4J2nj53J65L6j9K49r1m5j83J80
$$ plain form
3265 109 -55 -201 -90 89 -132 9 -1 -182 81 -156 0 60 -108 -102 70 40 14 47 26 -97 -277 238 187
3288 187 43 21 -110 219 46 139 -11 -60 52 191 120 -219 -74 -22 6 92 229 -172 -103 12 -22 37 121 23
3312 23 -76 296 -87 367 213 -18 26 58 -110 -51 -204 -31 245 85 -13 53 -24 81 109 -86 237 -71 128
3335 128 -258 -61 -209 -112 58 99 203 -174 132 -25 86 82 -195 -280 -292 -120 -134 -34 -46 -101 73 297 -128
3358 -128 -13 118 147 -54 106 57 113 52 12 54 186 111 65 15 -10 52 5 -29 66 -73 102 -4 153 261 -222
3383 -222 0 58 29 -252 24 172 -117 59 -42 -149 89 -37 -52 -96 -37 -4 198 -31 83 63 62 -30 -26 -34 229
3408 229 -92 -67 20 -41 30 -165 33 -148 27 182 -75 -213 183 -39 -35 163 -137 -110 -102 177 -77 59 -55
3431 -55 325 -123 172 -2 86 -220 339 166 -471 110 72 -89 -75 -63 -68 -221 -56 -20 -39 210 119 74 -109 71
3455G1q8Nl3l76K02J80k1J79J1m9q1j58L7J57j03O5J23q7j96L60K8q7K4m47L29
3480D5r8p1k8J56j52p6L58j76J40j6q4k3r5J46K7n9j13J17L3k8q3j5K68j77O4
3505F0q4J67r6k11J66l1p3J92j96J26j59K30Q2j93j23L7Q7K17j59r7J39J7k2J41
3529B17j2j29k76OJ16J82N6K1J03m57M0J12q6K74r5K6j34o1K4K23j62J63j42m9
3553d0j48m7K24m3M18j20j88j00O3l0J07m8k64N0N9k10L21p3Q3Q9NR4q0jj65J84
3579A40j51L0J12j15r7J8k23K92M5r4l0j30M49j62o0m4Q8m43L13L13o52M19j07
3602h9J98l28L17R3k88j21N8L69M5l88L9R7l4P2P6j61J66J29k06L14l63Q3j1k03
3626a36k01M78o0K8l8L35j95k42O5l3k61J50j00L1J06J20j73N3n5%L66k61J04
$$ plain form
3455 71 -17 -12 -45 -421 -219 -39 -60 119 130 81 0 -158 -121 36 -67 -2 121 34 -162 198 226 139 163 -284 45
3480 45 -53 -124 -152 4 -148 -224 134 -42 98 82 -2 -25 -120 26 53 -6 -119 -2 31 3 -80 -95 173 -4 60
3505 60 -24 143 47 -164 2 -29 -102 90 -106 20 -139 91 173 -20 -143 -106 -19 198 39 -58 81 98 76 217
3529 217 205 76 -200 -194 -78 104 160 181 284 -173 -133 -21 -107 167 72 98 -36 -97 -73 150 -12 151 9 -40
3553 -40 -188 -235 -11 -54 364 244 56 -44 19 -11 96 48 -216 -166 -107 -317 4 -69 14 103 108 202 122 121 -44 140
3579 140 -11 19 131 16 -81 -63 -286 6 51 -43 -73 -203 246 84 24 -20 68 -375 -62 251 -401 18 -89
3602 -89 109 -219 98 191 -97 -218 -160 209 254 -134 -95 2 -32 40 116 -45 121 250 44 358 -5 78 67 -136
3626 -136 -337 141 81 109 71 406 211 -31 34 1 -260 -110 -210 -179 -73 47 -126 -73 -128 -128 238 -23 81
3649H1J86j37j92J57l04K62j12P4j44K58q2q2m2P9J29J36m91K00K77l78J28J34
3671A37j56J73%j03j10p4K04k85L10J67k32K0k50J40p8l3L17o2r5p3Q3Q4J25l10
3695a01K63j13j19j49K60j15n6J6p5K68l27N09r9k72K21l3k09k9N25k88r9J69
3717A47m52L31Q1m20O08k96l8L66p18L33Mj09L05j81K73l05O4kj20J12l5j43K47
3740E2r9J09q0J21l74L37j73J68l16K9M54n75K57J47M3K6j78J4J40M7k47J97J53
3763B52m06K9K09k40N8J71k02L7k39J08L31k49L9J19lnJ61j37K5J06j18J98k72
3786b8K58q3l05K20J2q8o5J58L6k58k8R1J19J29j96L9L2J13O2o1n6o6l1j04L02
3811B02k77o2J65k58L53k71j3M2m1L18l06N9M0q3J81L11l71r8l2L21m90K96RJ
$$ plain form
3649 81 267 130 -62 95 -209 53 -59 15 -129 129 47 -35 -77 2 131 267 -224 -24 253 -125 3 137
3671 137 -19 154 154 51 -59 -133 71 -214 96 263 31 51 -199 -59 -137 -170 147 85 -10 -83 0 84 209 -101
3695 -101 162 49 -70 -219 41 -74 -130 -114 -189 79 -248 261 162 -110 111 78 -131 -160 365 77 -22 147
3717 147 -305 26 107 -313 295 -1 -39 327 -391 -58 -54 -163 142 -39 234 -71 -7 -9 -129 -17 -52 -195 52
3740 52 -47 62 -18 103 -271 66 -107 61 -255 -226 228 -347 -90 57 100 126 -52 -38 102 149 -98 99 252
3763 252 -154 -125 84 -156 -98 73 -129 -92 -331 -223 108 -141 -102 17 14 9 170 33 58 164 46 244 -28
3786 -28 230 147 -158 62 74 -14 -79 79 115 -143 -171 -80 39 168 -28 11 43 156 218 157 101 35 4 -100 202
3811 202 -75 -137 28 -230 123 -148 -161 -119 -160 158 -148 -89 -49 -132 49 360 -11 -109 -141 180 -310 -14 -5 -4
3835dj67J11L2K46j83J99j47K1j28j19R4J18k2j29K30k93Q8J37q4mK44r0j97J59
3859A12P9k76k9Q4K94n59L94j63J34l5M9R1j31j10L60j68j10n2K2j18j9K61k68
3882a58K08J89n49J85j26L42N3l17J08O3p8j18K27k2j23K68j52J68l39k9K74k09
3904a35N3o0J0J10o9j04J54r2P9rk02J89R5j72P3J23p5K40k41J3j35J06P5kp3
3929d9k83N14k79J23J02j10p3L8j04o4K18Jl5J67k25J16p8j16J09P4R2m50K64
3952d8m0j19L68l68K1N33l02p4N6l0K9Qm0k02J50M9K26m48K71J96k56Q3j80N0
3976f7j53K96P1l6j2O2l09J38P5j39L9j14P6Q2k62K71J01k12J04J47k12n8L9l0
4000a03J5J92k89J37M8j91LM13j88J77p6k60n7M4L25j52J2j92j2K06p9k16J49
$$ plain form
3835 -4 -171 -60 -28 218 35 234 87 108 -20 -139 -45 73 51 -78 152 -141 -53 84 0 -4 240 150 -47 112
3859 112 191 -85 -114 -30 264 -295 99 -64 70 35 84 175 44 -66 294 126 16 -36 -14 -132 -151 110 -158
3882 -158 50 239 -310 -125 -251 91 144 -173 -65 -2 -80 -198 29 7 -116 152 0 168 -171 -200 74 -135
3904 -135 -82 -142 -132 -22 -91 -195 -41 -133 -54 -63 -265 -76 19 -153 -80 43 -32 208 -33 -20 -155 -49 26 24 -49
3929 -49 -332 182 -97 26 128 18 -55 -17 -121 -185 33 34 -1 166 -59 57 -21 -137 -28 46 138 -312 -48
3952 -48 -88 -207 161 -207 -186 347 45 -29 27 -3 26 34 -6 -208 -58 -9 217 -231 40 236 -20 63 -117 -67
3976 -67 -220 76 147 111 99 161 -148 -10 65 -74 -35 -149 -73 9 -253 18 119 -93 11 158 -54 -112 -73 -103
4000 -103 -88 104 -185 -48 0 -191 -188 225 37 214 138 -122 -179 -135 190 38 50 -142 -154 52 -27 -243 -94
4023i4o6J78k61K68j16J04j91K57l36K49j37n7L62j93O4j20l8M7J33N23o53N2
4045b5j9o0M0K08J0k74J43K12l88J17q0K88m5j8J7j66M5J70k00N2K19R6m98J90
4069C4O8l58K63K2P9j55q4o5J13J17m6m9P0K28k52J62M3k71j00J60OQ0j9J59k0
4094A85l46j51K01j00J43O3J12j64j72J79J06j06L7o9O6o8r0J71J24J2j84Q5J81
4117B15q8r3N1K1l48J47K04l5q7n0j58K01L43m44J58k75K78N8j17l99K27L08k15
4140i8J21K85r3m24K18M1N9k87N5K06k15J67j39q2J30K06m29K77K10k9m38M67
4162B08O3o1l79j19MK97j9NN0q5p8r4m1oL71R5j73N5j72R0M1P3j80K03k47Q5J62
4189A48k24r3J39P1o5K04k89J83p4r1j44K24n7j89K27N1K53l18l6L36j53j85K76
$$ plain form
4023 -94 -160 18 -243 25 -91 13 -178 79 -257 -8 -145 -202 160 -33 31 -89 -127 -80 53 576 -77 -25
4045 -25 -44 -104 -64 144 154 -120 23 235 -153 -36 -116 172 127 109 126 -40 5 175 -25 27 246 342 -156 34
4069 34 102 -256 7 29 108 -47 -131 -196 -83 34 -12 -61 9 237 -15 147 190 -81 -181 -21 -15 65 46 205 185
4094 185 -161 -312 -111 -211 -68 -5 107 -57 -229 -50 56 -50 -13 -82 -16 -84 -174 -3 121 133 -51 34 215
4117 215 127 34 85 106 -242 -95 109 74 -13 -63 -221 -20 323 -121 37 -238 40 98 -19 -418 -191 117 -98
4140 -98 23 308 215 -209 9 50 109 -178 -123 83 -132 35 -104 -186 -56 150 -279 -2 208 179 -259 208
4162 208 271 210 -169 -288 -284 13 -6 -1 49 -36 -114 -208 -249 -255 116 211 38 93 -79 11 52 125 -55 148 -99 -14 148
4189 148 -76 -169 -30 41 -24 180 -109 74 0 -91 -235 -11 -68 -257 -30 21 274 -44 -80 256 103 -82 194
4212A94J10k50k22qJ49O8m0J13Mr8M1j32m6j12L79M8j96K74m29K68l6J8j83P3
4236a3j08j55M14k15K36j81L4m4l65K52K13j49k06L19j47L1J61L5j94K32j00k3
4258B7j37J03K44k96l4nK95k32l71L10j7L79l05j35M27p8k75J75o2Q1l57K46J86
4281A69j8l35L47J45l80J04K02k35r6L0j22k7J68J31K39l15J32L0j12j66k1J05
4303b5K30j62Q7n1Q8m6l05M5K63j97j65L74l28N1J46L5qK4K6j59m8K01l47J31
4327a40J40J61j78l03M31k14q8J52J78k30j30J55p6K46k23J09Nj17l3j74M28Q4
4349A83k35P2rm3M6j92L39l06M8J3J82rN4j83q7J18m5K88k08J86m51M07p2j59
4373f3P0kn6j93K36P4Kl2k89J41pK14j34L9K43j80J84k55j37J44M9r5J41n3R6
$$ plain form
4212 194 304 54 -168 -176 -27 41 1 114 118 20 61 -71 -117 -229 150 198 2 276 -153 115 79 97 -86 -13
4236 -13 -121 -276 138 -77 159 -22 12 -32 -397 -145 68 -81 -287 32 -115 -84 77 112 -82 150 50 27
4258 27 -110 -7 237 -59 -93 -98 197 -35 -406 -96 -113 266 -39 -174 253 175 -100 75 13 94 -263 -17 169
4281 169 151 -184 163 308 -72 32 234 -1 -97 -67 -189 -216 -48 83 322 7 139 169 57 -109 -130 -25
4303 -25 205 43 130 79 167 121 -184 -139 124 -73 -238 136 -192 -141 5 40 32 56 82 -77 -125 76 -271 -140
4327 -140 0 161 -17 -320 111 -103 -191 -39 139 -91 -221 -66 -142 104 -119 -10 -5 -122 -155 -329 99 183
4349 183 -52 20 11 -32 14 -178 161 -145 -97 -84 98 89 143 -40 -127 -9 -54 234 26 212 -239 168 96 -63
4373 -63 7 5 -51 -244 -8 66 68 36 -253 -112 -119 95 -39 0 243 63 247 -8 -145 -1 48 -47 94 41 137
4398A37k53J00j8K26l11K02oJL39m81k3J07l4OK6K64k09nk16K88k56M47k09k32
4422a10K8L1pK10j75j55K52J2O3j6k7l71N64r0k47l1rK40j50p0k41O05l50K7j27
4447a44K47J86k92j95K71q2J84k66j75K40j0J00p8p5P3J85j71L0JO5L3pm3j91
4471a14r1J78K46k16j95NK59l12L96r4j3p5J11k5j89L14j03R1j61N0k12K71j49
4494b8p9j41N85l54K95k71K76n11M5K78q3k6jJ83Qk98L65k30Rr2k8J46j04J33
4518G7n8r6o2j6K68j19o9K45k09j42N7Q5J97j37L5j31J15M4r1J11j69M4j3Q2k16
4543a68Q4j3N2O4j45K09j9j77J28R8j51j21J13j40P46n16k39M36k16m4J22j45
4565d2J05k21J35R4m0l5j46P7J68J43m23J14k10J46L52k26j1q6j05J66j21K3R9
$$ plain form
4398 137 -116 -16 -34 192 -119 83 77 78 417 -64 -87 20 -14 -8 18 282 73 68 -148 140 -116 331 122 -110
4422 -110 -82 -51 -58 152 -23 -178 74 86 149 133 106 -265 299 209 -38 -69 -78 162 12 -58 -299 306 -44 -17 -144
4447 -144 103 289 -3 -198 73 -9 175 -91 -266 -26 -36 64 -14 -89 -16 169 -2 28 29 94 127 120 77 -114
4471 -114 -205 -27 219 3 -192 -187 72 -240 156 62 49 -26 85 60 -129 185 82 173 12 62 -150 121 -28
4494 -28 -107 -248 337 -17 278 7 283 -228 -183 95 12 -14 -15 168 176 -122 243 13 22 -70 -98 48 -56 77
4518 77 19 -77 -139 -155 113 -6 -75 170 -39 -181 -124 -39 158 21 56 -75 40 84 -7 104 -65 -21 -34 48 -168
4543 -168 -84 -97 -45 19 -126 83 64 -113 15 113 -38 -159 -46 -186 560 44 -195 241 25 -19 103 -42
4565 -42 63 -158 -23 71 31 -4 -150 -73 95 238 -185 -71 -281 -135 217 -9 -20 -106 -211 -45 -166 -143 -44
4588d4J29j28J39K68l67r9J79R9P8j84J11j25J28P7m75K15K19l78K39k7j27K08
4610A35j31j3J58m12M29j83J29m9k7j4K43l09r7K63k19Q4o0J99k85K06nj26J29
4633D5K10M4k87k84M53l15K72q8k2Oo8lR5n6j56R1M35o5m95J15l7K53l75L59j1
4658A16M5q9J36l36j3P3R8k04K09pO8k75L38j13j93k1jN55n57K82J8R7n4l18K28
4683H2k30P6K34M0l78j34M01l82K72o5j99M32M3l04J47r2P7j22R5oJ72j18j18
4706g7j44J43K07k42L91k20r3J58m5K0k64L78J3k23P2k02m9K26L4j70J79k06K18
4729A04l44K61j37J68o2R9k83L07m8j18J81j01N3RK34l62m5J97P3k95O7Q9K1k
4753F6O4p8J96m73J98j28J83Q9j26m6L37l52K40j97J57k11K73m52k7L4K33K34
$$ plain form
4588 -44 85 -43 96 364 -3 -102 77 176 254 70 181 56 184 261 -214 1 220 -158 81 54 -73 135
4610 135 4 -9 149 -263 166 -17 112 63 36 22 265 -44 -141 122 -97 -13 -73 126 -159 47 42 -84 45
4633 45 255 299 12 -272 181 -134 138 50 28 34 -34 -37 58 2 -154 -63 372 307 -188 -73 -110 143 -232 127 116
4658 116 161 72 208 -128 -141 -68 30 -174 35 28 96 -179 159 46 -147 -168 -169 386 -171 111 129 226 172 -146 82
4683 82 -148 -72 162 202 -176 -310 91 -291 -19 -84 -283 149 192 -112 35 -57 20 -102 -7 -13 159 41 -77
4706 -77 -221 -78 129 -113 278 58 -35 123 78 98 -166 212 225 2 74 -128 -177 49 83 -87 92 -114 104
4729 104 -240 21 -116 52 -10 89 -194 113 65 -53 128 27 80 89 323 -39 -84 113 186 -109 -42 47 68 66
4753 66 130 52 248 -225 -27 -155 28 117 -9 -55 282 -70 170 -27 130 -81 192 -260 -287 -253 -20 214
4775B14m62K90l17L83k34J19n1J38j74J8j42K8J07n4J3m1M17O8l66K3q3L01l43
4798a48K85p8k08M4P6pO5K7l4j7J18j00j96j02K71J87k20k7K42J06j34k55J17
4821A2K18Nlj27l6j8k36M58k67N7%N4j85j29K97k18J34p8J13l41M16n6k35o3J36
4846i2R3j64K01J6j83n8O5j64M01n1O1P4l23K55k4j54M56o45L3L37L95k98j42
4869H9j70J67J2J17l40J79j58K10k87K59l42L60k78R9p4J82J20j73q3K39q0j88
4891a40P7J1K0M6m0k05J76Q3j20l4K82k86L81K6m26L19j32L4j74m6J50j12K56
4914A46p6kN6M9n9p1oJ5j9K67n43JL96k84K95j62%p8j29L21r1p2j11L84k51K20
4940A96l40R1P2R6p1m1K64j81j89L7J42K3M7l2J26k15K0K04l41L84m47L37L5l09
$$ plain form
4775 214 -248 42 -275 108 -126 -7 -58 80 -94 -76 -218 -190 -83 -137 -124 -165 252 320 -46 -23 -106 195 -148
4798 -148 137 59 -149 -105 -29 -36 29 56 22 5 123 23 -173 -275 -4 183 -37 -64 178 284 150 -105 12
4821 12 230 235 232 105 69 51 -185 273 6 63 63 117 -68 -197 100 -118 16 -62 51 -290 126 70 -165 -228 -92
4846 -92 1 -163 38 54 -129 -187 -122 -286 115 64 125 199 -124 131 107 -47 409 -236 -203 134 529 231 89
4869 89 -81 86 98 215 -125 54 -104 106 -181 78 -264 96 -182 -83 -157 25 145 -28 -111 128 48 -140
4891 -140 -63 -52 -32 14 -26 -231 -55 28 -92 -126 156 -130 251 277 -149 170 38 72 -102 -148 2 -110 146
4914 146 70 68 124 173 114 43 37 52 33 300 -243 -242 154 -130 165 3 3 -75 -204 117 26 -46 -157 227 -24 196
4940 196 -144 -53 19 115 44 3 267 86 -103 -66 76 99 146 114 240 25 45 249 -92 292 -155 182 217 -92
4964i2K35O2j69p3j41N3J17J61j20m0J41j34j06K7L62n61L91j54J75K24n37J26
4986e3o8L01J50k95j01k9j11J04K39R2J03l95K95j47j47J47J27j38n7l04L67j39
5008e9K08J6k2o7l52R3J09J67j18K14l32M45m96J85k4j32J84j38L28k23j0k61
5030b85L6L08r5J19l9Kj95J28K19M2r0kj04j62K33j30J50l41N75m02O0r0L1J22
5054I0k17j09L25j03J7Om6Q9l96L55j17j55R7K95p7J02p3j61J24k0p5J66o8j33
5078h4J37jo3K62l65J30k2L6l0l07L89j70p3N10n49k4K43j0n3J55k62J55j6L05
5102B93n18J69J64l06L22j78n2Q3K00j65k4J12j61R1rj12J29j33L48k27k24L78
5124A80k72j4n6m6K93j75o9R2Q1j01K24k54j6K09j33k4J69k18L66k76J87N8l34
$$ plain form
4964 -92 143 205 36 -37 -178 -125 -8 153 33 -7 134 0 -106 -79 283 -278 113 -41 134 358 -179 -53
4986 -53 -121 180 330 35 -66 -95 -206 -102 137 229 332 -63 232 85 -62 85 212 74 17 -287 80 -59
5008 -59 149 165 143 76 -276 -183 -74 93 -25 189 -143 302 -194 -9 -33 -165 19 -119 209 -14 -24 -285
5030 -285 -249 59 -36 83 44 46 -149 -21 198 240 150 148 44 -118 115 -15 135 -206 369 -33 27 -63 -32 90
5054 90 -127 -236 89 -14 3 9 -37 52 -344 11 -106 -261 -164 131 54 156 83 -78 46 26 -49 117 49 -84
5078 -84 53 52 -11 251 -114 16 -6 30 0 -307 82 -88 -161 349 -200 -224 19 9 -44 111 -151 4 -12 293
5102 293 -225 -56 108 -198 124 -54 -106 -23 177 12 -12 100 -61 30 21 -91 38 -95 253 26 -198 180
5124 180 -92 -106 -162 -208 85 -90 -159 -67 14 -87 137 -117 -133 76 -57 -81 88 -130 236 -40 147 205 -129
5147a29k8L34r2l22J61O0k10J46O1%K82j41l34J47Rj72K33m2j46M2j25L10r5J74
5171A23p8q4L02l40M9jK88n6k04j63J26J49J70m53N1j25J20RL47K2l65K91j66
5194A2K02j68n7J25k51J84j68N00k38j68K08k32N0n9K50l46J00j4k1R5J56j80
5216b0J00k32J72j64R1PJ78j4j04R3l98K57J41k7k15J23R1j27l4J85J5l27K74
5239F5j02Q1Q2l53K58Q1j82J58k25P0K76j56j42J10r1l7R8NM8j20l5J49j17K71
5263A92K2j77j11K42l20Ml8K63J3k45M16m71r5L67j97K21j96PP9K46l95J76K56
5286B59o87L36M0p4O0J5J87j30K20l10M55l81l04K82K3j93K23J46j77lm1M9k89
5309b94N00l50K40j9j42j21N2M67l34nl0k67L77j15m9R7r5R1K21j75mL7J65l69
$$ plain form
5147 -129 -157 177 85 -237 -76 -16 -226 -80 -19 -19 263 122 -212 -65 -56 -228 5 -37 -183 -141 -266 44 -51 123
5171 123 45 -39 263 -77 -28 -29 259 203 -1 -164 -38 111 281 -172 -121 -246 -126 -117 230 252 -113 178 12
5194 12 214 46 -11 114 -137 47 -121 379 141 -27 181 -51 -1 -60 190 -156 -56 -70 -91 4 160 -20
5216 -20 80 -152 20 -144 -53 -46 132 118 14 107 -291 -34 107 80 -135 -12 79 -48 -82 103 118 -209 65
5239 65 -37 44 126 -227 31 112 -70 88 -137 -67 209 53 -89 21 -70 -107 -9 -4 44 -76 -111 38 -79 192
5263 192 214 37 -74 168 -152 -148 -186 77 90 -155 261 -210 -305 62 -135 86 -110 -103 -24 222 -173 3 259
5286 259 -428 -92 -52 -126 -66 -51 136 6 226 -84 371 -10 -314 -32 -9 -202 21 167 -10 -13 -54 -5 -294
5309 -294 206 -144 96 77 -65 -186 -134 333 -1 -6 -36 -303 74 -41 -90 7 -88 3 224 49 45 82 247 -122
5333a22J54j9O9J37k27J01j43L2Q4j81M85k03k42K29j94J6K38k37J36L6k96o5
5355b12L67k19K13l68J67L8p0M5R0J10l38K96k56M33j66r1K75m71J06M7L42k66
5377G2l65L18k8p6l7J02j23J70k07M0J41n7j50L29k82K74k73j29J55J12k2J31
5399I5k2j9Q7l9j21K16k73N0J66n05M93OO2j97l9k15K89n4Q2Mr2J87j09r5p6j8
5425a37L8j19J56N1j72K49o3j78j05M02k90P7q7J55K37l17J05N2J30rQ8k13J27
5448A77l71J61J51rj84M8j11n2J65j87M01M3j71J85l66K08l92J95K21j83K47l31
5470a55K76r4j63J72l5j97J85p3p9M5J16j32K29k49K91p2j71J89o1k3l11L92k44
5493a64j35L28j15P6j35L22l67J17J42P7J46m00J87r5jj17K15p6K3l2k53L71k88
$$ plain form
5333 -122 32 13 82 219 -8 93 -50 -18 66 -115 370 167 -75 154 -40 -24 214 -23 113 149 -147 -212
5355 -212 155 -64 149 -219 -52 -14 -84 -39 51 161 -177 119 -137 296 130 39 314 -157 -51 -4 338 72
5377 72 -293 25 -3 -79 -116 -14 -137 33 -174 -134 7 -50 -200 129 -153 121 -152 -281 -126 -14 -36 95
5399 95 73 54 141 102 -19 197 -76 -26 140 -365 128 134 196 -1 -40 -255 34 -20 62 66 -26 161 52 -43 -119 -137
5425 -137 -99 -218 -62 -11 -183 66 3 -175 -280 122 -168 -91 -178 -23 214 -103 2 54 184 175 263 50 177
5448 177 -194 -33 118 109 -75 -27 -138 -190 -25 -212 189 232 61 246 -120 88 -304 -109 112 -71 176 -155
5470 -155 121 27 -136 36 1 -196 -11 -84 -163 -118 -2 -134 95 -154 137 65 -106 83 22 -1 -312 80 -164
5493 -164 -299 29 -86 -10 -145 177 -190 -73 69 146 292 -108 79 -16 -17 -134 81 5 28 -4 -257 114 -174
5516a74K06k42K75O0j16j13L3K5J21N0j29k8J51%k83k9K09j65K4K16n58M74j33
5539a26K53j05J30k42l4K80j74k35K77r5R2R5j72J80j48l2L34m66K60j2K9O7j37
5562A9pL8L7l61K21K53l02j15K09j36J44k93N48l73K83j77j91J32j7M6Q4J33Q0
5585B55k78p0Lp8K21j67mn0k6K77k04J95k5J32j38j14m4J33M4L2J00q4k03K56
5609A63j28o7o6j21L59q4j67o5K59j23P3j98RJ41j11m5k19K13L52Q5j42pk1J12
5633B02j71j40M2q0K68j15L6l8J5j00Q2qQJ60j41l2N2J16m07J70L06l01kK31k16
5658f3j00O6L61j38o6N9k94L0K83q5j59L32l67L20k6k12J44j01J41k69J7K20j19
5681b6J48K4j04k81J07P5Q5j01L8O9k37q0K60Q1k51j1p6N97m48J16J69l2j17k13
$$ plain form
5516 -174 32 -210 65 125 9 -104 -71 -46 75 125 -4 -32 119 119 -164 -193 16 -149 -125 91 -467 7 -126
5539 -126 127 22 152 -90 -124 156 -18 -253 24 -71 21 116 -56 124 -24 -56 278 -188 72 60 89 156 19
5562 19 12 50 87 -274 -53 200 -102 -217 -8 -144 0 -293 255 -118 165 -12 -203 -71 -88 -42 42 175 255
5585 255 -23 -93 -90 -168 53 -114 -118 -168 -194 83 -121 74 49 181 43 -71 -115 18 62 94 194 110 -93 163
5609 163 35 -32 -98 -219 140 56 -111 -176 83 -40 33 -165 -156 -15 -126 -171 -390 -177 175 260 118 111 90 202
5633 202 31 -109 -67 -147 121 6 42 4 19 -81 1 -7 1 161 20 -12 40 156 -251 -81 225 -76 -78 153 -63
5658 -63 -163 -97 264 126 60 119 -175 -145 138 53 -106 226 -141 179 153 -59 85 -16 125 -144 -127 93 -26
5681 -26 122 146 42 -239 -132 -57 28 -73 -35 34 -203 -283 -23 58 -193 -204 -280 317 -131 -15 154 122 5 -208
5705b08M35l50k68L60m1J64j00L1K34k81J17j52l6L5J56j18%K33j6r4r2k46J76
5728f1l6K22K0m21K96J77l43M1J28K47j31j68K32j45r3P5j83K79n8P3j20NK27
5751B63l2j38p0n3j16KJ95K6q0K9k4L8n4l3j6kJ10k7L7k65J72r6J45K5J06l41
5777a99L13l0k7j02j98L21J30l24Lr9J69l9K0K3M3j16O2M3J44m73R3K63j68J89
5801D1j51R7J67k64K9K09j67J00k68J8K41N2k54m4j52L25j98k7K55q6M41k25k34
5824i5J15J6K21m18M1RL4O6Rn1P8O6j30L62k14l74K52j16M01l50J74k21r8K23
5848@r7j81J05M19r3l46n3N34j25r0o6K9K28l09k67M11m2j56K33Kk35K5j06K79
5872I9q2L93m62J04j96K16J4J24k76J63n2l33P13k24k74j2Q7j00L7j8R6K0k56
$$ plain form
5705 -208 227 -123 -391 -31 -72 92 -8 23 257 -24 93 -59 -95 -60 96 -22 -22 211 195 101 9 -237 -61
5728 -61 -97 125 145 -276 20 197 -146 -105 23 270 139 -29 203 58 -35 40 -143 136 78 151 31 36 263
5751 263 231 93 23 -30 -146 -144 51 77 -3 26 2 40 -14 -47 -63 -65 45 18 55 -210 -38 -134 11 36 142 -199
5777 -199 114 84 57 -45 -243 78 208 -116 -113 -212 -43 -82 -62 -39 4 -112 -50 -7 137 -336 -243 20 -148 41
5801 41 -110 -13 154 -110 -81 128 -39 61 -207 -189 52 104 -150 -194 -346 -21 -219 -246 9 -77 364 139 -95
5824 -95 20 36 257 -161 -120 -111 -77 -11 -2 -53 25 91 -39 323 109 -265 -13 -129 272 -78 96 -125 -223 0
5848 0 -97 -278 -173 246 153 -193 -246 288 163 73 7 36 264 -45 -312 99 57 -99 134 136 -99 -74 -180 99
5872 99 17 410 -52 52 -144 72 86 210 -66 97 45 -288 425 201 -73 -85 2 -98 -61 -79 17 37 -219
5895b19J36J58j50J39n7R3q0j30J0K37j94L65l52L0J26q7r1j47L07m01K80p9K61
5918A55l11K44j97J99j93q2K90l96N02k87O7J25r8K99m20J21K52l64K18k53K0
5939a09J6k02M34j9l44K59j89M5j4Q8J36j37QK80L5j31P2p8l38K50j75QN1k4K46
5964A68k56M2M5j22L90m75M77j12k78J6jn8M4J31j75K5R1J2J46J21k93J4O7n3
5988c4J57J73k32k7K23k65j53K47l1j46J55l57N23k0j77J47k96k13M21j23K4m4
6010d8L33m67O3r2J97M6k08K83j79k04K94q9K37o8j61K6m1l7J91j07l3K24k78
6033a18J21P3J16k06j29o1K06o2J22K93n95J94Q2K50l20j03j0K43l5N9k35k53
6055c68N34l71O9Q1K7J26j72J77j53j6j92J74Q1j46N4R6kJ40p0n9r5j66J54q7
$$ plain form
5895 -219 -83 75 -75 64 7 100 20 -110 -100 137 -57 308 -44 -14 112 25 -66 -213 94 -307 -27 -106 155
5918 155 -156 88 -109 90 -103 -185 105 -291 211 -76 -9 116 18 317 -103 18 270 -94 124 -129 -109
5939 -109 -93 -295 139 120 -224 35 -154 -109 -123 -35 101 -36 -28 252 287 156 228 150 -188 62 -113 -105 -54 -78 168
5964 168 -88 -46 -1 -123 267 -208 269 157 -121 -105 -106 -164 -120 11 -164 -139 -48 -36 110 231 -62 -48 19 -34
5988 -34 123 296 64 37 260 -5 -158 89 58 -88 67 -290 233 213 36 183 -113 -326 95 -28 -4 -48
6010 -48 285 -182 -119 -211 -14 32 -176 107 -72 -276 18 -71 166 98 -63 -37 -78 -115 76 -31 -64 160 -118
6033 -118 3 76 192 -14 -143 -204 2 -60 62 355 -240 -46 36 286 -34 -137 -147 96 61 120 -115 -368
6055 -368 166 -205 -136 -55 -28 98 -74 103 -50 -66 -258 -84 -3 -149 -95 1 -1 139 69 10 -85 -251 -97 -184
$$ [...]
8191A85
##END NTUPLES=NMR FID
##END=
