##TITLE=1H_LR-785_R2-C!X
 200.13MHz, CDCl3,
 8 sc
 
 6.2.2025
##JCAMPDX= 6.0         $$ Bruker NMR JCAMP-DX V2.0
##DATA TYPE= NMR FID
##DATA CLASS= NTUPLES
##ORIGIN= UXNMR, Bruker Analytische Messtechnik GmbH
##OWNER= pz
$$ XWIN-NMR		Version 3.5
$$ Thu Feb  6 13:53:49 2025 Russian Standard Time (UT+4h)  she@DPX200
##.OBSERVE FREQUENCY= 200.1313
##.OBSERVE NUCLEUS= ^1H
##.DELAY= (6, 6)
##.ACQUISITION MODE= SIMULTANEOUS
##.ACQUISITION SCHEME= undefined
##.AVERAGES= 8
##.DIGITISER RES= 18
##SPECTROMETER/DATA SYSTEM= spect
##.PULSE SEQUENCE= zg30
##.SOLVENT NAME= D2O
##.SHIFT REFERENCE= (INTERNAL, D2O, 0, 14.3821)
##AUDIT TRAIL= $$ (NUMBER, WHEN, WHO, WHERE, WHAT)
$$ ##TITLE= Audit trail, XWIN-NMR		Version 3.5
$$ ##JCAMPDX= 5.01
$$ ##ORIGIN= Bruker BioSpin GmbH
$$ ##OWNER= she
$$ F:/spectra/data/she/nmr/H-C/1/audita.txt
$$ ##AUDIT TRAIL=  $$ (NUMBER, WHEN, WHO, WHERE, WHAT)
(   1,<2025-02-06 13:52:33.54 +0400>,<she>,<DPX200>,
      <created by zg, POWCHK disabled, PULCHK disabled
       configuration hash MD5:
       00 E9 B6 7A A2 85 ED C7 34 08 36 98 17 FE 4E 26
       data hash MD5: 16K
       E4 13 F0 99 20 D6 27 4C 44 59 8D 68 2C 98 3A 05>)
$$ ##END=
$$ 
$$ hash MD5
$$ 21 FC 7C 22 36 A2 CE 37 C9 1E 3B 14 2E 85 D2 E5
##$RELAX= 
##$RELAX= 
##$RELAX= 
##$RELAX= 
##$RELAX= 
##$RELAX= 
$$ Bruker specific parameters
$$ --------------------------
##$DU= <F:/spectra>
##$EXPNO= 1
##$NAME= <H-C>
##$PROCNO= 1
##$TYPE= <nmr>
##$USER= <she>
##$AMP= (0..31)
100 100 100 100 100 100 100 100 100 100 100 100 100 100 100 100 100 100 
100 100 100 100 100 100 100 100 100 100 100 100 100 100 
##$AQSEQ= 0
##$AQ_mod= 1
##$AUNM= <au_zg>
##$AUTOPOS= <>
##$BF1= 200.13
##$BF2= 200.13
##$BF3= 200.13
##$BF4= 200.13
##$BF5= 200.13
##$BF6= 200.13
##$BF7= 200.13
##$BF8= 200.13
##$BYTORDA= 1
##$CFDGTYP= 0
##$CFRGTYP= 5
##$CHEMSTR= <none>
##$CNST= (0..31)
1 1 145 1 1 1 1 1 1 1 1 1 1 1 1 1 1 1 1 1 1 1 1 1 1 1 1 1 1 1 1 1 
##$CPDPRG= <>
##$CPDPRG1= <>
##$CPDPRG2= <>
##$CPDPRG3= <>
##$CPDPRG4= <mlev>
##$CPDPRG5= <mlev>
##$CPDPRG6= <mlev>
##$CPDPRG7= <mlev>
##$CPDPRG8= <mlev>
##$CPDPRGB= <>
##$CPDPRGT= <>
##$D= (0..31)
0 0.7 0 0 0 0 0 0 0 0 0 0.03 0 0 0 0 0 0 0 0 0 0 0 0 0 0 0 0 0 0 0 0 
##$DATE= 1738835552
##$DBL= (0..7)
120 120 120 120 120 120 120 120 
##$DBP= (0..7)
150 150 150 150 150 150 150 150 
##$DBP07= 0
##$DBPNAM0= <>
##$DBPNAM1= <>
##$DBPNAM2= <>
##$DBPNAM3= <>
##$DBPNAM4= <>
##$DBPNAM5= <>
##$DBPNAM6= <>
##$DBPNAM7= <>
##$DBPOAL= (0..7)
0.5 0.5 0.5 0.5 0.5 0.5 0.5 0.5 
##$DBPOFFS= (0..7)
0 0 0 0 0 0 0 0 
##$DE= 6
##$DECBNUC= <off>
##$DECIM= 32
##$DECNUC= <off>
##$DECSTAT= 4
##$DIGMOD= 1
##$DIGTYP= 9
##$DL= (0..7)
0 120 120 120 120 120 120 120 
##$DP= (0..7)
150 150 150 150 150 150 150 150 
##$DP07= 0
##$DPNAME0= <>
##$DPNAME1= <>
##$DPNAME2= <>
##$DPNAME3= <>
##$DPNAME4= <>
##$DPNAME5= <>
##$DPNAME6= <>
##$DPNAME7= <>
##$DPOAL= (0..7)
0.5 0.5 0.5 0.5 0.5 0.5 0.5 0.5 
##$DPOFFS= (0..7)
0 0 0 0 0 0 0 0 
##$DQDMODE= 0
##$DR= 18
##$DS= 0
##$DSLIST= <SSSSSSSSSSSSSSS>
$$ [...]
##$SUBNAM0= <"">
##$SUBNAM1= <"">
##$SUBNAM2= <"">
##$SUBNAM3= <"">
##$SUBNAM4= <"">
##$SUBNAM5= <"">
##$SUBNAM6= <"">
##$SUBNAM7= <"">
##$SUBNAM8= <"">
##$SUBNAM9= <"">
##$SW= 18.0517328524113
##$SWIBOX= (0..15)
0 0 2 0 0 0 0 0 0 0 0 0 0 0 0 0 
##$SW_h= 3612.71676300578
##$TD= 16384
##$TD0= 1
##$TE= 0
##$TE2= 300
##$TE3= 300
##$TEG= 300
##$TL= (0..7)
0 120 120 120 120 120 120 120 
##$TP= (0..7)
150 150 150 150 150 150 150 150 
##$TP07= 0
##$TPNAME0= <>
##$TPNAME1= <>
##$TPNAME2= <>
##$TPNAME3= <>
##$TPNAME4= <>
##$TPNAME5= <>
##$TPNAME6= <>
##$TPNAME7= <>
##$TPOAL= (0..7)
0.5 0.5 0.5 0.5 0.5 0.5 0.5 0.5 
##$TPOFFS= (0..7)
0 0 0 0 0 0 0 0 
##$TUNHIN= 0
##$TUNHOUT= 0
##$TUNXOUT= 0
##$USERA1= <user>
##$USERA2= <user>
##$USERA3= <user>
##$USERA4= <user>
##$USERA5= <user>
##$V9= 5
##$VALIST= <valist>
##$VCLIST= <CCCCCCCCCCCCCCC>
##$VD= 0
##$VDLIST= <DDDDDDDDDDDDDDD>
##$VPLIST= <PPPPPPPPPPPPPPP>
##$VTLIST= <TTTTTTTTTTTTTTT>
##$WBST= 1024
##$WBSW= 4
##$XGAIN= (0..3)
0 0 0 0 
##$XL= 0
##$YL= 0
##$YMAX_a= 207471
##$YMIN_a= -202004
##$ZGOPTNS= <>
##$ZL1= 120
##$ZL2= 120
##$ZL3= 120
##$ZL4= 120
##$ABSF1= 10
##$ABSF2= 0
##$ABSG= 5
##$ABSL= 3
##$ALPHA= 0
##$AQORDER= 0
##$ASSFAC= 0
##$ASSFACI= 0
##$ASSFACX= 0
##$ASSWID= 0
##$AUNMP= <proc_1d>
##$AZFE= 0.1
##$AZFW= 0.1
##$BCFW= 1
##$BC_mod= 2
##$BYTORDP= 1
##$COROFFS= 0
##$CY= -3
##$DATMOD= 1
##$DC= 2
##$DFILT= <>
##$DTYPP= 0
##$F1P= 0
##$F2P= 0
##$FCOR= 0.5
##$FTSIZE= 0
##$FT_mod= 4
##$GAMMA= 1
##$GB= 0.15
##$INTBC= 1
##$INTSCL= 1
##$ISEN= 128
##$LB= 0.25
##$LEV0= 0
##$LPBIN= 0
##$MAXI= 10000
##$MC2= 0
##$MEAN= 0
##$ME_mod= 0
##$MI= 1.114404
##$NCOEF= 0
##$NC_proc= 0
##$NLEV= 6
##$NOISF1= 3.799351
##$NOISF2= 2.8
##$NSP= 1
##$NTH_PI= 0
##$NZP= 0
##$OFFSET= 14.38212
##$PC= 1
##$PHC0= -115.6714
##$PHC1= 20.79221
##$PH_mod= 1
##$PKNL= yes
##$PPARMOD= 0
##$PSCAL= 0
##$PSIGN= 0
##$REVERSE= no
##$SF= 200.129724274929
##$SI= 16384
##$SIGF1= 3
##$SIGF2= 2
##$SINO= 400
##$SIOLD= 16384
##$SREGLST= <1H.CDCl3>
##$SSB= 0
##$STSI= 0
##$STSR= 0
##$SW_p= 3205.1282051282
##$SYMM= 0
##$S_DEV= 0
##$TDeff= 0
##$TDoff= 0
##$TI= <>
##$TILT= no
##$TM1= 0
##$TM2= 0
##$TOPLEV= 0
##$USERP1= <user>
##$USERP2= <user>
##$USERP3= <user>
##$USERP4= <user>
##$USERP5= <user>
##$WDW= 1
##$XDIM= 8192
##$YMAX_p= 0
##$YMIN_p= 0
$$ End of Bruker specific parameters
$$ ---------------------------------
##NTUPLES= NMR FID
##VAR_NAME=  TIME,          FID/REAL,        FID/IMAG
##SYMBOL=    X,             R,               I
##VAR_TYPE=  INDEPENDENT,   DEPENDENT,       DEPENDENT
##VAR_FORM=  AFFN,          ASDF,            ASDF
##VAR_DIM=   8192,          8192,            8192
##UNITS=     SECONDS,       ARBITRARY UNITS, ARBITRARY UNITS
##FACTOR=    0.0002768,     1,               1
##FIRST=     0,             0,               0
##LAST=      2.2672688,     0,               0
##MIN=       0,             -202004,         0
##MAX=       2.2672688,     207471,          0
$$ Real data points
##PAGE= N=1
##DATA TABLE= (X++(R..R)), XYDATA
$$ [...]
1858a42K31j82O3p5K57k56OM15j85n5j45J66m1k29Q8K81l04J11k04L52k58J01
$$ -142 89 -93 -30 -105 152 -104 -98 317 132 77 -68 98 57 -172 -84 197 -107 4 -200 152 -106 -5
1880eJ20J2l11K06k16L36J85o56K06L80j28O3J2k01J74r8j6J01l42l5O19p35k5
$$ -5 115 127 -184 22 -194 142 327 -329 -123 257 129 192 204 3 177 79 63 164 -178 -213 406 -329 -354
1903c54L0L33N1k20J92J6J11j15K24j5k88K38k5J27n92K66J14j36j91M34k46j45
$$ -354 -324 9 60 -160 32 48 159 44 268 253 -35 203 178 305 -287 -21 93 -43 -234 200 -46 -191
1925a91o5J13q9N9J8K14l5m00M74K50k97k57M00N4j65k13R5N7J80n46K67K14l23
$$ -191 -256 -143 -232 -173 -155 59 24 -376 98 348 51 -206 194 248 83 -130 -35 22 202 -344 -77 137 -186
1948a86mK33J10l54Q8J42K57m26M60J4j43l42J82K42l90r5L59l47j19M31k26J25
$$ -186 -190 43 153 -201 -113 29 286 -140 320 334 191 -151 31 273 -117 -212 147 -200 -319 112 -114 11
1970A1Q5k42L00p0j88M5L81l59mJ25O7P4j91m9l08K73m8K63k34j22K72L0J03m11
$$ 11 96 -146 154 84 -104 -59 322 -37 -41 84 151 225 34 -15 -323 -50 -98 165 -69 -191 81 111 214 -197
1994a97J85o4K31j20L52l28L5MJ37P8j73j93pJ15k41O3L39m23k42L66K56r1l92
$$ -197 -12 -76 155 35 387 59 94 98 235 313 140 -53 -60 55 -186 -123 216 -207 -449 -83 173 82 -310
2017c10L19Q6j10l03M76q0j20ON57l84k01K86j40Pj78N6o4L12m46N7Q3J05k20
$$ -310 9 95 -15 -318 158 78 -42 -36 521 137 -64 222 82 89 -89 -33 -97 215 -231 -174 -91 14 -206
2040b06J58K45n29N20N1%m0k44M86J00p76L80j55l38K12P0Q3j64N6K63l93J33
$$ -206 -48 197 -332 188 239 239 199 -45 441 541 -235 145 -10 -348 -136 -66 17 -147 -91 172 -221 -88
2062h8k22M16J56n32M56K1k14l1K53j16o0N3k14J36J3r6K21k47l6K8J14q3j00
$$ -88 -310 106 262 -270 186 207 -7 -38 215 99 39 92 -122 14 27 -69 152 -95 -131 -103 11 -72 -172
2085a72LL22m94K67K35K2j56k08K48q9K09j38M2J63l72j21L97j32K82k43j38j7
$$ -172 -169 153 -341 -74 161 183 27 -181 67 -22 187 49 91 254 -118 -239 158 26 308 65 -73 -90
2107i0n7j35J29q3J14O8K84k38K40L89o10r7J95j57J24k58K2K70q5j52Q3P8m9
$$ -90 -147 -282 -153 -236 -122 -54 230 -8 232 621 11 -86 109 -48 76 -182 -160 110 25 -127 -44 34 -15
2130a5lQ4K86l12r2J66K59o39K90n3L48l21j78L30n00j17J82L18o2m76L47J52
$$ -15 -18 66 352 40 -52 114 373 -266 24 -29 319 -2 -180 150 -350 -467 -285 33 -29 -505 -158 -6
2152fj10K99M7k36JJ12j67K72J09l27J00j6j5O8l14K81Q1j63j36K49m70K01R4
$$ -6 -116 183 230 -6 -5 107 -60 212 321 -6 94 78 63 131 -183 98 179 16 -120 129 -341 -140 -46
2175d6K0k1L5J48j73k5M35n19m1L84P8o45J17L37j76n7J68Q1j70J37k02K4K44
$$ -46 -26 -47 -12 136 -37 -62 373 -146 -187 197 275 -370 -253 84 -92 -149 19 100 -70 67 -135 -111 133
2198A33k27P0J36q3n0m9qJ59j01J32m8k84K13J40j44k73M42j54j12P9j21Q8J58
$$ 133 -94 -24 112 29 -21 -70 -78 81 -20 112 64 -220 -7 133 -11 -284 158 4 -108 -29 -150 -62 96
2221I6k46J10P4J06k30O8O1K8j30J20j03J79k69P4K3k16J38k5O4k5K5J68M2Lk0
$$ 96 -150 -40 34 140 -90 -22 39 67 -63 57 -46 133 -136 -62 -39 -255 -117 -142 -78 -103 -78 90 132 135 115
2246A15l7K67l72O5J89p9l03K59J00m07J39r9j87K58l6R4n7R2J56j3j01j79J97
$$ 115 78 345 -27 38 227 148 -155 104 204 -203 -64 -163 -350 -92 -128 -34 -91 1 157 144 43 -136 61
2269F1P6J3J28l86K17N9l49L66r4j59o0j05J98m57O13p5j67J15k40L99K8l05J74
$$ 61 137 150 278 -108 109 168 -181 185 91 -68 -128 -233 -35 -492 121 46 -121 -6 -246 153 181 -124 50
2292E0p3j34K26OO1o6J41j26K02l47j71M19m35M1L31p1J47l67L90k8k02q3M70
$$ 50 -23 -157 69 75 136 70 211 85 287 -60 -231 188 -247 -206 125 54 201 -166 224 196 -6 -89 381
2315C81m03k0J72j41L19j93j43J54n8o5J20k40J03n7n0j3j64K39q0j87J84R2K98
$$ 381 -22 -42 130 -11 308 115 -28 126 68 3 123 -117 -14 -71 -121 -134 -298 -59 -139 -326 -142 -50 248
2338B48o3l63J46K48m41L56j09M7k1l20L10l69L53k57J03J71m4K27l40K2K89n66
$$ 248 185 -178 -32 216 -225 131 22 69 48 -272 38 -331 22 -235 -132 39 -5 222 -118 -96 193 -373
2360c73M73j64R4J02k68K05J72l49M5k7l7L7n5L85m17J36j98k6M61j54j22R8o1
$$ -373 100 -64 30 132 -136 69 241 -108 -63 -90 -127 -90 -145 240 -177 -41 -239 -265 196 42 -80 18 -43
2383d3N2Q5L66l62j13J57r8j07K7P3m1P9M1k46M3J5K1K9K39l30K29K10m55K49
$$ -43 9 94 460 98 -15 142 44 -63 -36 37 -4 75 116 -130 -87 -72 -51 -22 217 -113 116 326 -129 120
2407A20j53K66j98j30L45m39o4L19j20J49k97J73L2k1%K61k02J43m9j3j86R8J6
$$ 120 -33 233 35 -95 250 -189 -253 66 -54 95 -202 -29 3 -18 -18 243 41 184 135 122 -64 34 50
2430E0O2j72LJ0k9K19M4q7l36K65k90K16j37K08M4j75m0J84m6R7j07r9L57n02
$$ 50 112 -60 -57 -47 -76 143 187 100 -236 29 -261 -45 -182 26 70 -105 -145 39 -7 90 -17 -116 241 -261
2454b61J28J13r3J54%lr5r7L14j98J27k35L77k54ok4J73k5o3J1J70j95J44l20
$$ -261 -133 -20 -113 41 41 38 -57 -154 160 -38 89 -146 231 -23 -29 -53 120 95 32 43 213 18 162 -158
2478a58J8M50n56J34m7J79N0o9J94l06M8J0J73Mj88RM0L79m71K0k0J27R8k11J86
$$ -158 -140 310 -246 -112 -159 20 70 1 195 -111 -63 -53 120 124 -64 -55 -15 364 -107 -87 -107 20 118 -93 93
2503I3l31L19j45L9j57N3J17l30L53J60k69P3j18J64Q1K20j12j86j51K76k38J38
$$ 93 -238 81 -64 -25 -182 -129 -12 -342 11 171 -98 -25 -143 21 102 322 210 24 -127 149 -89 49
2525D9p6J95j72j28j7R3Q8P8l00J97j67J82j5M9m7k37M54j83K00j21n4m7J89L
$$ 49 -27 168 -4 -132 -149 -56 32 110 -190 7 -160 22 7 56 9 -228 226 43 243 122 68 21 210 213
2549B13k67J0n5q3L04k87L25l58J76k75K17k5K1j0K22j60R3j52J59k7L8j31Q9
$$ 213 -54 -44 -99 -182 122 -165 160 -198 -22 -297 -80 -105 -84 -94 128 -32 61 -91 68 41 79 -52 37
2572C7j85K88l56J02R6j2L09n87J40J21o6j1J99P9k6k87N29n51r8R5K14k23J10
$$ 37 -148 140 -216 -114 -18 -30 279 -308 -168 -47 -113 -124 75 154 128 -159 370 -181 -279 -184 30 -193 -83
2595h3k9K09k3P7j84K26k81R9J95k63j00L59j98L0j81N8K81k0o5R3l63j01K09
$$ -83 -112 97 74 151 -33 193 -88 11 206 -57 -157 202 4 34 -147 -89 192 172 107 200 -163 -264 -55
2618e5K53k49L4j36J85j79J83l6n9J51l06J80L29l33K80p5l52M63j92N7l1p3o8
$$ -55 198 -51 -17 -153 32 -147 36 0 -59 92 -214 -34 295 -38 242 167 -185 278 86 143 112 39 -29
2641b9j37K36nk10L2M52l38J71j34j40M93m20j34K43k38K83j24n6J65%k48k7J21
$$ -29 -166 70 65 -145 -113 339 1 172 38 -102 391 -29 -163 80 -158 125 1 -55 110 110 -138 -165 -44
2664d4lQ0j2k3K2o2l1M5k50L97j3j80K12n2jlm8N2k4m75L19K60k23j04N3J69P1
$$ -44 -47 33 21 -2 20 -42 -73 -28 -278 119 106 -74 138 86 85 82 34 86 62 -413 -94 166 -57 -161 -108 61 132
2691A32j81j61j12N42po5j02l5J77n6M1k98j16M59j32K8l41K43j00r9j44K68j10
$$ 132 -49 -210 -322 220 213 148 46 11 188 132 173 -125 -241 218 86 114 -227 16 -84 -183 -327 -59 -169
2714a69L44p9j67L04m92N42o12L97j88L55j58k49M04j47j48J48j4j28P2QR2j9
$$ -169 175 96 -71 233 -259 283 -329 68 -120 235 77 -172 232 85 -63 85 71 -57 15 23 115 96
2736I6p7q8j76J68N2K61j01K09j38q6j05R2j44N2k11K82K5l8j82K24Ro5l14M23
$$ 96 19 -69 -245 -77 -25 236 135 344 206 120 15 107 -37 15 -196 86 111 73 -109 115 124 59 -255 168
2760A68l84M9L19p4J06k41j97J97K6L8J08p4m31J43J92L5K3k27K85k65J3J87k28
$$ 168 -216 -167 152 78 184 -57 -254 -57 -31 7 115 41 -390 -247 -55 -20 3 -224 61 -204 -191 -4 -232
2783b32J39k01J76J59J73Nk68P2k58J17J58j36L68l82K12k21Q2K67j36m9Q1k11
$$ -232 -93 -294 -118 41 214 219 -49 23 -235 -118 40 -96 272 -110 102 -119 -37 230 94 45 126 -85
2805h5q1K16j2J01m5O1l23Q5o5K37jj05R1j75l8N5p5K66j42P6J55p5l69N00k68
$$ -85 -166 50 38 139 94 155 -168 -83 -148 89 88 -17 74 -101 -139 -84 -159 107 -35 41 196 121 -248 252 -16
2830a6l26K75J08N5n0O4j20k14L06j90j0K1k9L0%j19R9J56n7j73K41p9o7j49L02
$$ -16 -342 -67 41 96 46 110 -10 -224 82 -108 -118 -97 -126 -96 -96 -215 -116 40 -17 -190 51 -28 -95 -244 58
2855E8L46l83j94K80j17J79R7j59j39k5L0j51K13Q9p8J02K5K8k38r1k8M42m7n36
$$ 58 404 21 -173 107 -10 169 266 107 -32 -57 -27 -178 35 124 46 148 173 201 -37 -128 -156 286 239 -297
2879b97N45j34K2Q2k88K35j53M1J94l53O9q2J77k33K8K76j73P8j93J62l3K27k14
$$ -297 248 114 136 218 -70 165 12 53 247 -106 -37 -119 58 -175 -147 129 -44 34 -159 3 -30 197 -17
2902a7j6m7L8k90L79o8l8K07k56k50J62J56J26q4j06J17k80L80q4L75l21M9m1
$$ -17 -33 -80 -42 -332 47 -21 -59 148 -108 -358 -196 -40 86 2 -104 13 -267 113 29 404 83 132 91
2925I1l71J73qL84m55K46k57J50N0j22j31K93k8j40M6Q8J96k81J64j72J04j3J90
$$ 91 -280 -107 -115 269 -186 60 -197 -47 3 -119 -250 43 15 -125 -79 9 205 -76 88 -84 20 7 197
2948A97j86ln9K4m8l3K09j41j51L01j05m16M41O0K3l02M2J44j46K6M08K5j95r9
$$ 197 11 8 -51 -27 -75 -108 101 -40 -191 110 5 -411 30 90 113 -189 -147 -3 -149 -123 285 310 115 16
2972A6l09J82r8J41J72Ml55L76j20k97K04n0L9K41k33J71J05kj09M48l81p6O5
$$ 16 -293 -111 -209 -68 104 108 -247 129 9 -288 -84 -134 -95 146 -87 84 189 187 78 526 145 69 134
2995A34j79j5O7N2j97J49j45M6L7L4j88K61k51K4J97J6l11J82j58L48j53q2p4
$$ 134 -45 -60 7 59 -138 11 -134 -88 -51 -17 -205 56 -195 -171 26 42 -269 -87 -245 103 -50 -132 -206
3018b06K08o3J92r3l9j15J87j13j6J6p1j27R6K30J09j69j06J40r1r6J9J83J5j76
$$ -206 2 -61 131 38 -1 -116 71 -42 -58 -42 -113 -240 -144 86 195 26 -80 60 -31 -127 -108 75 90 -86
3042h6J7Q3J27P1j52j02Q8pk29n1J07K55j97K4q6L95j63j89P6k67R3J29J01l7
$$ -86 -69 14 141 212 60 -42 46 39 -190 -241 -134 121 -76 -52 -138 257 94 -95 -19 -286 -193 -64 37 0
3066@o7L7P1rp5j00J32L3K1O0o8j10J46Qj77L32j62j10O2o1L49m84K51K0J23l61
$$ 0 -67 -30 41 32 -43 -143 -11 22 43 103 35 -75 71 79 -98 234 72 -38 24 -37 312 -172 79 99 222 -139
3092a39K60k9l48J35m6K2K05j12O9O3l53L02m1J75k11R9j39R1J25k39m7P5K6j05
$$ -139 121 92 -256 -121 -167 -145 60 -52 17 80 -273 29 -12 163 -48 51 -88 3 128 -111 -158 -83 -57 -162
3116a62J12o1L78j86j29j14L08o1r1L81m27Q7J59q9M8k26k21N02m3k57J95M6j74
$$ -162 -50 -111 267 81 -48 -162 146 85 -6 375 -52 35 194 105 153 -73 -294 208 165 -92 103 149 -25
3139b5J97p9j83K0k2J34j96J34J89k67K28j12K51m62J24J70l4M5n8j47R9j12n
$$ -25 172 93 -90 -70 -92 42 -154 -20 169 -98 130 18 269 -193 -69 101 67 112 54 -93 6 -106 -111
3162a11m2J22j33K30o6j03K20j27N9J76l59L74m58K10m3J79lm1l37L12r9P6k09
$$ -111 -153 -31 -164 66 0 -103 117 -10 49 225 -134 240 -218 -8 -51 128 125 84 -253 59 -40 36 -173
3185a73J36q2o4J27J26J0j19N6O1n2k0J48l25K06p4l0J12r4j94j0K08j55R6L37
$$ -173 -37 -119 -183 -56 70 80 -39 17 78 26 6 154 -171 35 -39 -69 43 -51 -245 -255 -47 -202 -106 231
3209B31k22k21K36K9o5J05n2r8P9l6l9o1P0K31j88K85l71l0J72k12J59LJ16k06
$$ 231 9 -212 24 53 -12 93 41 -57 22 -14 -53 -114 -44 187 -1 284 -87 -117 55 -157 2 5 121 -85
3233h5k7J81l56P72j95m33J43k6J45r5l9J3j0j14k1J58j01L78n76J86M48n08L39
$$ -85 -112 69 -287 485 290 -143 0 -26 119 24 -15 -2 -12 -126 -147 11 -90 288 -288 -102 346 -162 177
3256A77k72m2K69rk11P7M8M7k97j4M09j26%r4k59J44k1J14J08j69K11J57k18k4
$$ 177 -95 -137 132 123 -88 -11 37 84 -213 -227 182 56 56 -38 -297 -153 -174 -60 48 -121 90 247 29 5
3280Er7P7P9J55j68K2p3m16J78K54M6L9j63L8J39k87K50l8k83K93Rj2K10k06J33
$$ 5 -92 -15 64 219 51 73 0 -416 -238 16 62 101 -62 -24 115 -172 78 40 -243 50 59 47 257 51 184
3305A84k62K17k60J83j97K19r8%j3k2n3j7j41M22n7j82L39l21J49Qk11J34J62
$$ 184 -78 139 -121 62 -135 84 -14 -14 -27 -49 -102 -119 -260 162 105 -77 262 -59 90 98 -113 21 183
3328A83j86J50j7r6N4o8N6j56k44L09k44J43K31j15K76l30K9r4J22J79l02K60
$$ 183 -3 147 130 34 88 20 76 -80 -324 -15 -259 -116 115 0 276 -54 -25 -119 3 182 -120 140
3350A40k12J15k06O0K46K50k97k75J32m8O5l00J83J76k50K25j25R6Q1j40K49j34
$$ 140 -72 43 -163 -103 143 393 96 -179 -47 -95 -30 -330 -147 29 -221 4 -121 -25 56 -84 165 31
3372C1m2O8K5o2N1k20K66j28K47j07n9j71L52m68J43M2j40J30K2J61r3j36J34
$$ 31 -11 57 82 20 71 -149 117 -11 236 129 70 -101 251 -217 -74 -32 -172 -42 -20 141 48 -88 46
3395D6p9m3L26k64Q5J95k35j12J63J07O4k88K0k57K92J4j25J80k5k22M4l1L04
$$ 46 -33 -76 250 -14 71 266 31 -81 82 189 253 -35 -15 -272 20 34 -91 89 64 -158 -114 -145 159
3418A59r8O9j63K0r7j15J57M9NK09k85J31j06J23o0K3j35p4L09L0L5J15m31P5
$$ 159 61 130 -33 -13 -110 -225 -68 -19 -14 195 -90 41 -65 58 -2 21 -114 -188 121 151 186 301 -130 -55
3442e5K34l01M5N1JN7o8P5k66Q6J41l24M01k16J19J09j02n9J88k30J36K31k15
$$ -55 179 -122 -77 -26 -25 32 -36 39 -227 -141 0 -324 77 -139 -20 89 -13 -72 116 -114 22 253 38
3465C8J45J49m40J06O9p3j07J10k9Q0k2P1l29P3M44n42J18J92M0j13J55On0k15
$$ 38 183 332 -108 -2 67 -6 -113 -3 -32 48 26 97 -232 -159 285 -257 -139 53 93 -20 135 141 91 -124
3489a24N5k1J12o8P4o6J53j34Q3r1N3k30O55n17j86R6J96P7j48K17k71K41k70
$$ -124 -69 -90 22 -46 28 -38 115 -19 64 -27 26 -204 451 -66 -252 -156 40 117 -31 186 -85 156 -114
3512a14J78k8PK8k3k16J40j7j11R4K05m63J32K62j69j63M35j13j57K11j01K02
$$ -114 64 36 43 71 48 -168 -28 -45 -156 -62 143 -320 -188 74 -95 -258 177 64 -93 118 17 219
3534B19q1l31K5K10j09K5L3k6R8N6o5J66l57K71k4j33O5j13K75k39l04K81J44
$$ 219 138 -193 -168 42 -67 -42 -9 -35 63 119 54 220 -137 134 110 -23 42 -71 204 -35 -339 -58 86
3557H6k66M46n12L9JL87l07J30J54qJ38m69L09l64J23p8J50j93J62L8k4J8j10
$$ 86 -180 266 -246 -207 -206 181 -126 4 158 150 288 -181 128 -236 -113 -191 -41 -234 -72 -34 -58 -40 -150
3580a50J87J39l67M24q9k17L81o21K73J70m51L80M2k25L75l70K36l16M24n4j28
$$ -150 37 176 -191 233 144 -73 308 -313 -40 130 -321 59 101 -124 251 -119 117 -199 225 171 43
3601D3J07n0j73j21K03n3J6j55n6J35m4K03k0K17k88J14m2r8oK04l23J72qj50
$$ 43 150 100 -73 -194 9 -44 -28 -183 -239 -104 -148 55 35 252 -36 78 36 -62 -68 136 -187 -15 -23 -173
3625a73P4J09K1K4j26J13Ko1j4q8m0J33O6l29L38rk37M07l33K34J22J30l58K57
$$ -173 -99 10 31 55 -71 42 44 -17 -31 -119 -159 -26 40 -289 49 40 -197 210 -123 111 233 363 5 262
3649B62k97jK41n10K99k55J70KO9J29q5j82K92k08n1K92j91l1J42J2k8l4j15L7
$$ 262 -35 -36 205 -305 -6 -261 -91 -89 -20 109 24 -158 134 -74 -125 167 -24 -55 87 99 71 37 -78 -41
3673d1Oj44J23K4L3l2J00J0N1m26M15q7J7J28l37L81m11J85k65K55J65j95m7L31
$$ -41 -35 -179 -56 -32 1 -31 69 79 130 -296 119 32 49 177 -160 221 -190 -5 -270 -15 150 -45 -92 239
3697B39j51j91J96k44K27M5j92RP1lq6K59j03o7r5l9J04L0j34L7L79m53k2K24
$$ 239 88 -103 93 -151 76 121 -71 -62 9 6 -80 179 76 9 -86 -125 -21 9 -125 -88 291 -162 -184 40
3721D0m10L88M8l17L96k97J10R2R7l95L54kJ15j86k30J24M1L2r9K35j37N7Q3k57
$$ 40 -370 18 66 -251 145 -152 -42 50 147 -248 106 104 219 33 -197 -73 -32 0 -99 136 -1 56 139 -118
3745a18K63p2Q7j39k24K49j1n26M52j97K36P4l7K54l32J77R8k25q7J30j40J00
$$ -118 145 73 160 21 -203 46 35 -491 -39 -236 0 74 37 291 -41 136 234 9 -78 52 -88 12
3767A2k11P1R8J72k3k16P5j44J84M6K56m08K04j86Q9rK05j94J33k70o6J91j29
$$ 12 -199 -128 -30 142 119 -97 -22 -166 18 64 320 -88 116 -70 19 10 215 21 154 -116 -182 9 -120
3790a20JJ60j9K40o9k10M3k3J19l37N58j59j85q3Lj74L6L15j93j04K26q1K1K29
$$ -120 -119 41 22 262 193 -17 26 3 122 -215 343 184 -1 -84 -81 -255 -219 96 -97 -201 25 -56 -35 194
3814A94l48n6L37j03j59L04l35K05O6Q6k71K85j42r8J44j15m3K08m0k5K3j01m
$$ 194 -154 -210 127 24 -135 169 -166 39 105 191 -80 205 63 -35 109 -6 -49 159 119 94 117 16 12
3837A2NQ4R5l27K9Q8L2P6J74L2m36K27Kj78K2o8J65l67M60j5l33j9K84R0J19m74
$$ 12 17 101 196 -131 -102 -14 18 94 268 300 -136 91 93 -85 -63 -131 34 -333 127 112 -221 -240 44 134 253 -221
3863b21K94jq3K25j45J0k1K19Lr5l34K11j03j37Q5K01j54K8J03l1M2l39K19K29
$$ -221 73 72 -11 214 69 79 58 277 280 185 -149 62 -41 -178 -93 108 -46 -18 85 54 96 -243 -24 205
3887B05l58j12K78n6J45k42M41m21J75j54j94M52k62MJ2J21j2K2j34J84j92J76
$$ 205 -153 -265 13 -43 102 -140 301 -120 55 -99 -293 159 -103 -99 -87 34 22 44 -90 94 -98 78
3909G8k10J10o3K61j97r6K44k68K7J27K6NK27m47K97k58K00k20L14j94%L6k6l9
$$ 78 -132 -22 -85 176 -21 -117 127 -141 -114 13 39 44 271 -176 121 -137 63 -157 157 -37 -37 -1 -27 -66
3933f6K43j43K35j81J3j37K38n0k46M7K3J41m76L08k95J73J37rK80k06l25O02
$$ -66 177 34 269 88 101 -36 202 152 -94 -47 -24 117 -359 -51 -346 -173 -36 -45 235 29 -296 306
3955C06k61O5j74M6j19J7j3J53k9q5K95k32JP1k62L19j64o0l3J27J54q1NQ0o1
$$ 306 45 110 -64 -18 -137 -120 -133 20 -9 -94 201 -31 -30 41 -221 98 -66 -126 -159 -32 122 41 46 126 65
3980F5j01J50j63k3L41J4m44K73k28o9K56j61R3q9J57j48n7J73j24jL02n6k89
$$ 65 -36 114 -49 -72 269 283 -161 112 -116 -185 71 -90 3 -86 71 -77 -134 39 -85 -86 216 160 -129
4003a29k1J73j28k62N07j39m0M4j5J46n4k19K40j06q6r6m9L42J77l66j79J77K85
$$ -129 -150 23 -105 -367 140 1 -39 5 -10 136 82 -137 103 -3 -89 -185 -234 108 285 -81 -260 -83 202
4026B02L0o33M49J11j46p1L4P2L9m7j72K60l16J65M3k85K03K45j34Q5mj54k63
$$ 202 232 -401 48 159 13 -58 -24 48 87 40 -132 128 -188 -23 20 -265 -62 183 49 134 130 -24 -287
4049b87J12L59j91o9J58k23K85j30l4j79K38J17k21K79l40j1J88p5J7Q1N5O8j04
$$ -287 -175 184 -7 -76 82 -141 144 14 -20 -199 39 156 -65 214 -126 -137 51 -24 -7 74 129 197 93
4072I3k22J43j8m5l8J44j95K61Ql11J32J28j37q2L6m6j31J91q1mK08n1k24J31
$$ 93 -129 14 -4 -49 -87 57 -138 123 131 -180 -48 80 -57 -139 -103 -149 -280 -89 -170 -174 34 -17 -241 -110
4096a10J18J05l10k3L45K4l52J75J85j09P2ll84L96j87j64J45K60j15M1N5o7k68
$$ -110 8 113 -197 -220 125 149 -203 -28 157 48 120 117 -267 129 -58 -222 -77 183 68 109 164 97 -171
4119a71L05o2k31J09K2K25j39J25k19p5L8j9K6K57l17J59L5j08M5J80N1k71N6
$$ -171 134 72 -159 -50 -28 197 58 183 -36 -111 -73 -92 -66 191 -126 33 68 -40 5 185 236 -35 21
4142B1%j24q1K57j01K4p7j09K53p2O6n1O9k22K99j78J26J4j62Pk6K03M9k21j76
$$ 21 21 -103 -184 73 -28 -4 -81 -190 63 -9 57 6 75 -147 152 -26 100 114 -48 -41 -67 136 185 -36 -212
4167b12J56J17j16K74l97J7M77k84r4N9K08k61NJ0k93M75N1j93P8k21Q2rO4O3
$$ -212 -56 61 -55 219 -178 -161 316 32 -62 -3 205 -56 -51 -41 -334 141 192 -1 77 -144 -62 -71 -7 56
4191E6r8Q5l5P6l26L92k35kR6N9P3j63k2J50j24k42L91j43K9R4j40R1J0r6J42
$$ 56 -42 43 8 84 -242 150 -85 -87 9 68 141 -22 -44 106 -18 -260 131 -12 17 111 -29 62 72 -24 118
4216A18n2O5Qp0k78K30J24k15J84j83J82k53L32j15l69L92K3j17J34l5j16p1n7
$$ 118 66 131 139 69 -209 21 145 -70 114 -69 113 -140 192 77 -292 100 123 6 140 105 -11 -82 -139
4239a39%J31k51M73k56l1K8J93j62n6L20l11l7J22Mn2K36k48M1j9Ok94q3K23L83
$$ -139 -139 -8 -259 214 -42 -73 -45 148 -14 -70 250 -61 -98 24 28 -24 212 -36 5 -14 -8 -302 -385 -162 221
4264B21n34K47J00n6R9j91n7j97N15KPj96J34k45J34K5j63J70j82N5j28J25Q0
$$ 221 -313 -66 34 -22 77 -114 -171 -368 147 149 156 -40 94 -151 -17 8 -155 15 -167 -112 -240 -115 -35
4287c5N1J28O1l11K14j56k44J30J94l40L3L58k85J57J01J58l84J72J53j88p6j08
$$ -35 16 144 205 -106 108 -48 -292 -162 32 -308 -275 83 -202 -45 56 214 -170 2 155 -33 -109 -217
4309b17L43P6k05K84k25j89L87l38K50j18Q3j16j37K05l02L73j42k2N0l34K02
$$ -217 126 202 -3 281 56 -133 254 -84 166 48 131 15 -122 83 -219 154 12 -10 40 -294 -92
4330i2K94k5j66L9J43j08k26L25k24J71j5J17l59K28K4p6K18m18L4o9L15l78J60
$$ -92 202 177 11 50 193 85 -141 184 -40 131 116 233 -126 102 126 50 268 -150 -116 -185 130 -248 -88
4353h8L5p4j6L27j34J00k9p5j44L3J76jm0Lj37O3J28L3P2l26K22j93J0K96j63
$$ -88 -53 -127 -143 184 50 150 121 46 -98 -65 111 110 70 73 -64 -1 127 160 232 -94 128 -65 -55 241 78
4378G8k50P4L08j50q2J25J22j88N9o8p1j6o2J36r9Q8k15J23k90L78J7l24K78K10
$$ 78 -172 -98 210 60 -22 103 225 37 96 28 -43 -59 -121 15 -84 4 -211 -88 -378 0 17 -307 -29 181
4402A81l41J83P8r3K05k07P8j08l52L89k0J47l88K26J33j07o8j33M66n5k07R1
$$ 181 -160 23 101 8 213 6 84 -24 -376 13 -7 140 -248 -22 111 4 -64 -197 269 214 7 98
4424I8j38k6n2J39K24k21o1n5L3K53l33r9L25O2m40M29j48J21K2p9oK2l01L09
$$ 98 -40 -66 -118 21 245 24 -37 -92 -59 194 -139 -238 87 149 -291 138 -10 111 133 54 48 70 -231 78
4448G8k0l48O47m78O3L6K3n7J63k65J65J68m29L06K37k47k41J14L03k08r2M42
$$ 78 58 -290 357 -121 -58 -22 1 -56 107 -158 7 175 -254 52 289 42 -199 -85 218 10 -82 360
4470C60l66p0L27l67NK29r2K05l09R8Oo1p5J75Po1k8j38K5K94k83M37j72j87K64
$$ 360 -6 -76 251 -116 -111 118 26 231 -78 20 26 -35 -110 65 72 11 -17 -155 -130 164 -119 318 146 -41 223
4495B23l15L72k78j53L18j99m4O1j39l6J04N8J14j96L47j39L3k59Q8j70M07kK7
$$ 223 -92 280 2 -151 167 -32 -76 -15 -154 -190 -86 -28 86 -110 237 98 131 -128 -40 -210 197 195 222
4518B22o1k29j59K17J45j88K00J8p8j02J94m56J46K03J6o6P9j90K0K22j05k30
$$ 222 161 -68 -227 -10 135 -53 147 165 87 -15 179 -277 -131 72 88 22 101 -89 -69 153 48 -182
4540a82L31k23J04P7k28L03j40j31l88N69R5k17n5m0n0L19L9l53P7K74p4p1n5
$$ -182 149 -74 30 107 -121 182 42 -89 -477 92 187 -30 -85 -125 -175 144 183 -170 -93 181 107 36 -19
4563a9k76M33j01j00J65j98L1j51J03K01j12O9j67K46k03n6L38m03K51M8P2M1
$$ -19 -295 138 37 -63 102 -96 -65 -216 -113 88 -24 45 -122 124 -79 -135 203 -200 51 99 171 212
4585B12k27O3M9o6P4j36j64M73m30K03j10p0J0K04p0j0K89j83p8K49l24q2L71
$$ 212 -15 48 97 31 105 -31 -195 278 -152 51 -59 -129 -119 85 15 5 294 111 33 282 -42 -124 247
4608B47m11L24k7l47J35J09O1N8J3m26K86K07m36P9K18j55M8M5n7P2O6Q5k34k22
$$ 247 -164 160 133 -214 -79 30 91 149 162 -264 22 229 -207 -128 90 -65 -17 28 -29 43 109 194 -40 -262
4632b62L16R3J51l01N6M4pJ22k55j54M1N64l31l4L20m68K16j31k40J12K17J63
$$ -262 54 147 298 -3 53 97 90 212 -43 -197 -156 408 77 43 363 -105 111 -20 -260 -148 69 232
4654B32k77J05j15J20j1j39J51o0N8j01j18K83k1j15RO4k25KK09j6KK10Km05O9
$$ 232 -45 60 -55 65 54 -85 66 6 64 -37 -155 128 107 -8 1 65 -160 -158 51 35 37 247 249 -156 -87
4679h7M1K19j08L0l1K7m25M28j37J25p9R8j07l6j13JL0k4q9J62o6J42j9k9L4K03
$$ -87 -46 173 65 95 64 91 -334 94 -43 82 3 101 -6 -42 -155 -154 -124 -148 -237 -75 -141 1 -18 -47 -13 190
4705A90l21R7J27j02J52k87m3l8M46L5p5j3j03K5K81l73J56k21N0J15m9k1M3J17
$$ 190 -131 -34 93 -9 143 -144 -187 -225 221 256 181 168 65 90 371 -2 154 -67 -17 98 49 28 71 188
4729A88j01k74K43l77M72k79K65k35R3J51j45Q4k64M45k17k21K28l03J14J59j99
$$ 188 87 -187 56 -321 151 -128 137 -98 -5 146 1 85 -179 266 49 -172 56 -247 -133 26 -173
4750a73M27l46N6l7K69m7P2l68P3n4J72j15K9o9K53o9j05j11R4j2q4L4O6J74r5
$$ -173 254 -92 -36 -73 196 149 221 -147 -74 -128 44 -71 -42 -111 142 73 -32 -143 -49 -61 -145 -111 -45 129 34
4775C4J35j57P1l39K94o7j37J55m12M14Rj08j10j9M41j91J88j61l86M66l1m4L0
$$ 34 169 12 83 -256 38 -29 -166 -11 -423 -9 0 -108 -218 -237 204 13 201 40 -346 120 89 45 75
4798G5k10J69p6Q4j83O8Q3o5L12j44j36q8L43k03j78j47K96l8lL8J87J46k28k41
$$ 75 -135 34 -42 42 -141 -73 10 -55 257 113 -23 -111 232 29 -149 -296 0 -38 -41 -3 184 330 102 -139
4822a39j34M53oj59mk8r0J43k28Q2L1J88j7k04K8P6OJ51j38j38j0L73j50j69o
$$ -139 -273 180 174 15 11 -17 -107 36 -192 -110 -79 109 92 -112 -84 -8 -2 149 11 -127 -137 236 86 -83 -89
4847h9K13j29J59k14J28m08P7L98j76r3J58j76J89j2j12N4J15%n2l31KJ95j07
$$ -89 124 -5 154 -60 68 -340 -263 135 -41 -134 24 -152 37 25 -87 -33 82 82 30 -301 -299 -104 -211
4870b11M64Lk60K6r5K22r3L7J03j42j26R9Q2J71J3l32K68l46k2OJ67j8J65k98
$$ -211 253 256 -4 22 -73 149 56 93 196 54 -72 27 109 280 293 -39 229 -117 -139 -133 34 16 181 -117
4894a17K51k96j17L30O9m37K74J47k65R0J73l11J99j11J53k1j94L30k16K12J04
$$ -117 134 -162 -279 51 120 -317 -43 104 -161 -71 102 -209 -10 -121 32 11 -183 147 -69 143 247
4915B47l95J90l7Q4j28J06J08k29K40m99R0J78j73O8L33k52J43k21K94k1P2k11
$$ 247 -148 42 5 89 -39 67 175 -54 186 -313 -223 -45 -218 -150 183 -69 74 -147 147 126 198 -13
4937a3K67k76nJ66k71N1j9J10p2j11P9l2m7Q5J83n0J7j15j60o5J9N16k38j97L17
$$ -13 254 -22 -27 139 -132 -81 -100 10 -62 -173 -94 -126 -173 -88 95 45 62 -53 -213 -278 -259 257 19 -178 139
4962A39j58P3K43j59j66l08K87J03M0k40J95j8P8k02O5M3Q7j10q6K19j2k12J84
$$ 139 -19 54 297 138 -28 -336 -49 54 94 -146 49 31 109 -93 -28 15 102 -8 -94 125 113 -99 85
4985H5m7j78j87J07M00l75L6L26l15J07R6o9J6k9l0j22K22q8P4j41Q4M3Qk80K39
$$ 85 38 -140 -327 -220 180 -195 -159 167 -148 -41 55 -14 2 -27 -57 -179 43 -45 29 -112 -28 15 23 -257 -18
5010a8K05l21NP8j55N6J32N6j05J15k19Q5Q8K46m25K59Q7l69K98q0o1K27k30j41
$$ -18 187 -134 -129 -51 -206 -150 -18 38 -67 48 -171 -86 2 248 -177 82 169 -200 98 18 -43 184 -46 -187
5034a87K77L3l65N05k38j63J34mL1m8m6r9J2Q5L0m1R1N6M2P7p4j36m3J68M6j77
$$ -187 90 123 -242 263 25 -138 -4 -8 23 -25 -71 -170 -158 -73 -43 -84 7 63 105 182 108 -28 -71 97 143 -34
5060c4L2K7j86Kr3R8K30r3K10k80K29k81J14K81m4j00k52K65j69P9l5Q5J22k82
$$ -34 -2 25 -161 -159 -252 -154 76 -17 193 -87 142 -139 -25 256 212 112 -140 125 -44 35 0 85 207 -75
5084g5k5j26M4k6K91j13j05P6q4j59M01r6l6J2k2J52o5R5k09j84L0K71k74J07
$$ -75 -100 -226 -182 -208 83 -30 -135 -59 -143 -302 99 3 -33 -21 -43 109 44 139 -70 -254 -224 47 -227 -120
5108a20J65j77L44j49l80J42nM22k98J04r7m2K04l7NK72l61j00J83j00J16n0p
$$ -120 45 -132 212 63 -317 -175 -180 242 -56 48 -49 -91 113 76 81 353 -8 -108 75 -25 91 41 34
5131C4n1J61r7k7P7l14K70l0j38K94j32n8r1j40K17j01K92k11K51m24M05l17P5
$$ 34 -17 144 47 20 97 -217 53 23 -115 179 47 -11 -102 -242 -25 -126 166 -45 206 -218 187 -130 -55
5154e5P9j61M16l87K49j2j10J86K19m10LK31r3k62J92j53k02J44N2J78l09j9J93
$$ -55 24 -137 279 -108 141 129 19 205 424 14 17 248 155 -107 85 -68 -270 -126 -74 104 -205 -224 -31
5177c1J4r7L6L5J06k87PLj0J55j8J62mj14n2j25J78Q0L7M9q0k92L30P1k73J34
$$ -31 -17 -114 -78 -43 63 -224 -217 -214 -224 -69 -87 75 71 -43 -95 -220 -42 38 75 124 44 -248 82 153 -120 14
5203A4J11qj60Rj17J69j78M18k22j10j1K22m7q8J15j05J22r5n26O47k74j00K7
$$ 14 125 117 -43 -34 -151 18 -160 258 36 -74 -85 137 90 2 117 12 134 39 -487 160 -114 -214 -187
5226a87k1L12q1j72J78m5J05k15nJ31j27J53J00j44j53R4J2L04q5l1j91k33L01
$$ -187 -208 104 23 -149 29 -16 89 -126 -131 0 -127 26 126 -18 -171 -77 -65 239 154 123 -68 -301 0
5249@R0q4J9j63K01r0J68k1j74p9K71j57K9j7K04k01l8J77PQ1l77O5K11o43M70
$$ 0 90 6 25 -138 63 -27 141 120 -54 -133 138 -19 10 -7 197 -4 -42 135 142 223 -154 -89 122 -521 -51
5274e1p0j2R9k36N6J49n7N15k68j13J98j24K9J11k85K6o1Q1K00M7k16K31j82j91
$$ -51 -121 -133 -34 -270 -214 -65 -122 393 125 12 210 86 115 226 -59 -33 -94 -13 187 234 18 249 67 -124
5298a24J51RJ63k24n7oL10j21l2j75q2K57l3p6L9j34O3j04N8P4K16j00k87M6K92
$$ -124 27 36 199 -25 -82 -88 222 101 69 -106 -188 69 36 -40 -1 -135 -72 -176 -118 -44 172 72 -215 -169 123
5323A23j31J85j13K17M8m50m3L06k21l2J79p9P7q2J46o1kn1O9p7o9K01k06J84
$$ 123 -8 177 64 281 329 -121 -164 142 -79 -111 68 -11 66 -16 130 69 67 16 85 8 -61 140 -66 118
5347A18p8k50N46l61j09L2K24Q9m8K6l74o2K17K38l51O1J87K5m15K87K21lk24
$$ 118 40 -210 336 -25 -134 -102 122 211 163 189 -185 -247 -30 208 -143 -82 105 130 -285 2 223 220 -4
5370dP3J05k80M0K56J00j54L3k4j31J54K29m80J54L69m73l08N50l28J19J90j02
$$ -4 69 174 -106 -66 190 290 136 169 145 14 168 397 -83 71 440 -33 -341 209 -119 0 190 88
5392H8Mr7L9J69m06Q1J95J1k06O7j47N2J40O0n0O3o8k26L13n8J19k31n3J2K95
$$ 88 92 -5 34 203 -203 -122 73 84 -122 -55 -202 -150 -10 50 0 63 -5 -231 82 24 143 -88 -141 -129 166
5417A66k63M6Kj02K4J62j91p4j41L85R0l20M72l16Q7O4k41q5M22j00m07K02J53
$$ 166 -97 -51 -49 -151 -127 35 -156 -230 -371 14 104 -216 256 -60 27 91 -150 -235 187 87 -320 -118 35
5440C5m9J4Q0R9k71K16j92J66j28k5R2pK11qk79j54N44n24L5J95J23j71J6R6l31
$$ 35 -14 0 80 179 -92 124 -68 98 -30 -55 37 30 241 233 -46 -200 344 -180 -145 50 173 2 18 114 -217
5465b17L8J76R1m59J95R1J33o2oK91o6k16k0O7L31n78L55k00J23j83J73q9J89
$$ -217 -179 -3 88 -371 -176 -85 48 -14 -20 271 205 -11 -31 36 367 -211 144 -56 67 -116 57 -32 157
5488A57N7j27k11Q0k76L70J94L5l98r5K21p1j9n6K87l12N5J54j5J69j73l9n0J81
$$ 157 214 87 -124 -44 -320 50 244 279 -119 -214 7 -64 -83 -139 148 -164 -109 45 30 199 26 -13 -63 118
5512A18j7p1Q0J21k84P8l07N24l67K67m8k50J55o8K97k5k48k6j02K04J1j29R1
$$ 118 101 30 110 231 -53 25 -282 242 -125 142 94 -156 -1 -69 228 203 -45 -71 -173 31 42 -87 4
5535DN0n4J54k3k00k28J87K93k17m6K22Q9P6l40R5qk77L47k44k76L47J24n6j87
$$ 4 54 0 154 131 -69 -297 -110 183 -34 -80 142 231 307 -33 62 54 -223 124 -120 -396 -49 75 19 -168
5559a68J32P2N8j97R5K48m00j4j54L55j19R7k60M04j09j83J54l6j00J98r7l1j79
$$ -168 -36 36 94 -103 -8 240 -160 -174 -328 27 -92 5 -255 149 40 -143 11 -25 -125 73 -24 -55 -234
5582b34Q0J39Q5R9J57m75n4M89m2k84J41k46LJ25l0R3N0j75J90j9P4j55J62R3
$$ -234 -154 -15 70 169 326 -149 -203 286 244 -40 101 -145 -142 -17 -47 46 96 -79 111 92 166 11 173 266
5606B66m31O6R6j39k9K23J61k96K54J19l54j44J31l22K68j16L07l30K37n1J74
$$ 266 -165 -99 -3 -142 -171 52 213 -83 171 290 -64 -208 -77 -399 -131 -247 60 -270 -33 -84 90
5627I0j10J84k77J81q7k2R2J09k17J87j8J51m87P5L40n9j41L8l3J67k25j0j94
$$ 90 -20 164 -113 68 -19 -41 51 160 -57 130 112 263 -224 -149 191 132 -9 29 -4 163 -62 -72 -266
5650b66J06J47j51J09K18l15J97j56J66OJ43j99K23k42J74O0m54L18n05M85n9
$$ -266 -160 -13 -164 -55 163 -152 45 -111 55 61 204 5 228 -14 160 220 -234 84 -421 64 5
5671EP1j16K11n15L28m0M5J93k80K72j92K1J23n5M4p8J48J82n28J07J37l59J1
$$ 5 76 -40 171 -344 -16 -56 -11 182 -98 174 -18 3 126 71 115 37 185 367 -161 -54 83 -276 -265
5694b65K07n4N4p4M2J70k26R2K4r8J61J67r5L3p7j61j41J37J52q2O8r4M9K2J51
$$ -265 -58 -112 -58 -132 -90 80 -146 -54 -30 -128 33 200 105 138 61 -100 -241 -104 48 -34 34 -60 -11 11 162
5719A62j26R6l09L6J80K1J4q6N4j85P2J03K6j97L45L9k17l3M9jj50r8L78Q5m67
$$ 162 36 132 -177 -141 39 60 74 -12 42 -143 -71 32 58 -139 206 245 28 -5 44 43 -107 -205 173 258 -209
5744b09L41J1o5J24l3j22J38j77j9K01Q0k05J01n4K44m15K09j76qr7MN0p2J89
$$ -209 132 143 78 202 169 47 185 8 -11 190 270 65 166 112 356 -59 150 -26 -34 -131 -127 -77 -149 40
5768D0k36L24m90L52L29l75o9O7J17k06J25L6K0j22J62J78j42k96j21J39K14L2
$$ 40 -196 128 -362 -10 319 -56 -125 -58 59 -147 -22 14 34 -88 74 252 110 -186 -307 -168 46 78
5790G8q2L22o71L27J00k79J91K84L6j08K08k16k09r5L0Q0j53L39j66K3j79K49
$$ 78 -4 318 -353 -26 74 -205 -14 270 306 198 406 190 -19 -114 -84 -4 -157 182 16 39 -140 109
5812A09j76MM12o70J75kR4L1j14J85j92Q0j01L08j69J07j22J05P6j89J73j55J20
$$ 109 -67 -63 349 -321 -146 -148 -54 -23 -137 48 -144 -64 -165 143 -26 81 -41 64 140 -49 124 -31 89
5835H9k98N31l81J34J20k76M3J8J24r5j6j4j82J12L01k83m4K1L04j43k49K10R7
$$ 89 -209 322 -59 75 195 -81 -38 -20 104 9 -7 -21 -203 -91 210 -73 -117 -96 208 65 -184 26 123
5858A23j03J99l31J33k33K70L5P9l26K6J50J0K73l71j19k7L82l81K10p1j91M45
$$ 123 20 219 -112 21 -212 58 93 172 -154 -128 22 32 305 -66 -185 -212 170 -211 -1 -72 -263 182
5880A82j73J04P4k98P9q4m5L59k58L1L5O8k87J38K5j11P4o3J72Q9l60J70k7K23
$$ 182 9 113 187 -111 -32 -116 -161 198 -60 -29 6 74 -213 -75 -50 -161 -87 -150 22 111 -249 -79 -106 117
5904A17j39j91L16j95K00N9l74L83m12L63N7l84J25M4n2k3M55o24M15n83M00j61
$$ 117 -22 -213 103 -92 108 167 -207 176 -236 127 184 -200 -75 -31 -83 -106 349 -275 140 -443 -43 -204
5926b04K47J84l32L2L47q7k14kJ43j01O7j25J84k48K2KL64k82P1j27l9p7J23j16
$$ -204 43 227 -105 -73 274 187 -27 -29 114 13 80 -45 139 -109 -87 -85 279 -3 68 -59 -98 -175 -52 -168
5950a68J62J8j00j65K36J50k31L04P3r2L2k51j28L26k08j24l2L80j19Ok3J36j2
$$ -168 -6 12 -88 -253 -17 133 -98 206 279 187 219 -32 -160 166 -42 -166 -198 182 63 69 46 182 170
5973A70k22O6m0J43j50Nq3p0J46K12j60k22J62K07k72L15k81J64O0Oo9j43J30
$$ 170 -52 14 -26 117 -33 -28 -111 -181 -35 177 17 -205 -43 164 -108 207 -74 90 150 156 87 -56 74
5996G4k79J77j9k5J86J94l78K48k68J2L1J55J46j62q4j65N3K37o9k8l0K50m9j89
$$ 74 -205 -28 -47 -72 114 308 -70 178 -90 -78 -47 108 254 92 8 -157 -104 133 64 36 6 256 207 18
6020A8R0L5j06p9L05m08K43K20k25q2k22K82%J38j39O1k04J95%N6m9r9J28J17
$$ 18 108 143 37 -42 263 -145 98 318 93 11 -211 71 71 209 70 131 -73 122 122 178 129 30 158 275
6044B75k77K27Ol74K24l7k89M46l18n9K35j91j91K08P4K68l88J92J29j69j73O0
$$ 275 -2 225 231 -143 81 44 -245 201 -117 -176 59 -132 -323 -115 -41 227 -161 31 160 -9 -182 -122
6066a22L5j0K49l55P2J09J0r3K11P6m10M81k83j46P9M7k8r1L09k78q1J91r7M8
$$ -122 -87 -97 152 -203 -131 -22 -12 -105 106 182 -228 253 -30 -176 -97 -50 -78 -169 140 -138 -219 -28 -125 -77
6090g7n5J46j08k3K41o4r7j51K47M5J55l83j66M30k97r8N35l30k1k0O5O7K33m07
$$ -77 -132 14 -94 -117 124 60 -37 -188 59 104 259 -124 -290 140 -157 -255 280 -50 -71 -91 -26 41 274 -133
6114a33J78j53J36k26K17K08k70k9j0J16n6P6j12j5J04l09M55O6k84J60j31K98
$$ -133 45 -108 28 -198 19 227 -43 -72 -82 34 -22 54 -58 -73 31 -278 177 243 -41 119 -12 286
6136B86k53j29mq0J74N1k47K48J62k95j22j4J17L10k97L39N0l83M4K29p0j92j21
$$ 286 33 -96 -100 -180 -6 45 -202 46 208 -87 -209 -223 -106 204 -93 246 296 -87 -43 186 116 -76 -197
6159a97L84j39l49L77K3o6J78o6J09q1j02O9L05l24m46M20Q7j51q5K65j76j84
$$ -197 187 48 -301 76 99 33 211 145 254 173 71 140 445 121 -325 95 182 31 -54 211 35 -149
6181a49K64j59L28n52K67j21J30k83K69%r0P5j34K36K4P2j13L6k19M8r8J12K43
$$ -149 115 -44 284 -268 -1 -122 8 -275 -6 -6 -96 -21 -155 81 105 177 64 100 -119 -71 -169 -57 186
6204A86l35K94n2k65J44j0K3K42k26K25j54j0l8k0j18k3L63m33O0R0k6j7N1J19
$$ 186 -149 145 93 -172 -28 -38 -15 227 1 226 72 62 24 4 -114 -137 226 -207 -147 -57 -83 -100 -49 70
6228G0N7j17n9J43j71J20j47O9J15j75K31l15M7K43j67K03k27J63j61l6K53l75
$$ 70 127 10 -49 94 -77 43 -104 -35 80 -95 136 -179 -132 111 -56 147 -80 83 -78 -114 139 -236
6250b36J57J13r0L6J0L3j54L55o5j46j84J16p0J09j38N2K47o5j09j06K08r9q8
$$ -236 -79 34 -56 -20 -10 23 -131 224 159 13 -171 -55 -125 -16 -154 -102 145 80 -29 -135 73 -26 -114
6273a14J48J66l51j14J6K91O4J5j62pj44K16R1k87P7M0n8R0R9l63L61j66m15N59
$$ -114 34 200 -151 -265 -249 42 106 121 -41 -48 -192 24 115 -172 -95 -55 -113 -23 76 -287 74 -92 -507 52
6297E2rp6R9l6j31K8P4J43l21Q6J19j48R5k09L28l4R7j4k47K58m0k11N90n97K10
$$ 52 43 -33 66 30 -101 -73 1 144 -177 -91 28 -120 -25 -234 94 60 157 143 -104 154 114 -97 493 -104 106
6322A06j9j32j18J63j57J01n5O8J48k74K75l70K65Q5j08M9Q2Q4q2P4qk72j15N38
$$ 106 87 -45 -163 0 -157 -56 -111 -43 105 -169 106 -264 1 86 -22 27 109 193 111 185 177 -95 -210 328
6346C28k65J2M1k44K88l8l74K96M8K7j12j64j33K50j61J18mj7J0J54k7j14Q4q4
$$ 328 63 75 116 -128 160 122 -252 44 92 119 7 -157 -290 -40 -201 -83 -87 -104 -94 60 33 -81 3 -81
6370h1L37l88J55n0k64J85L4J10l29L93J36j89J19k82k16L57j0j08K7K99k74k7
$$ -81 256 -132 23 -27 -291 -106 -72 38 -291 102 238 49 168 -114 -330 27 17 -91 -64 235 -39 -66
6392f6n8L45J73n76j42Q8K72M4j32j39K26j78K83k25pKM2K6p1r2L20M3k1k07K03
$$ -66 -124 221 394 -182 -324 -236 36 80 -52 -191 35 -143 140 -85 -92 -90 -48 -22 -93 -185 135 178 157 -50 153
6417A53k59q3N34q2K92o30R3J39k46L95k50j28J2K45j32k5Q8k70J84J24K8j68
$$ 153 -106 -189 345 263 555 -75 18 157 -89 306 56 -72 -60 185 53 28 116 -154 30 154 182 14
6439A4Q4L0r9L4j84M5K5K91l00R1m04M63n7m57K72J02K16k52K8J84o0j09p5K04
$$ 14 98 128 29 63 -121 -76 -51 240 -60 31 -373 90 33 -424 -152 -50 166 -86 -58 126 66 -43 -118 86
6463H6R7L7Nj11j65km5J31L26k27j34J25k84O2L31j59k47K35J05j14l02L87k62
$$ 86 183 220 225 114 -51 -53 -98 33 359 132 -2 123 -161 -99 232 73 -174 61 166 52 -250 137 -125
6486a25p4M2K01j98J74j28K17j46R4l06K33n5L17k16o7j64K8K65J34m36r1L26
$$ -125 -199 -157 44 -154 20 -108 109 -37 57 -249 -16 -71 246 30 -37 -201 -173 92 226 -210 -301 25
6508B5K5p4J86k7l09K98L0j60l1J8J2J40m27jO8L6RJ26j3%j89N34j50j46j60J93
$$ 25 50 -24 162 135 -174 124 154 -6 -37 -19 -7 133 -294 -295 -227 -191 -182 -56 -69 -69 -258 276 126 -20 -180 13
6534A3Pj2O0N0m22K76j27N80k95j59K67k53L23l93L07j58q4K0L2j43m0oJ91K50
$$ 13 20 8 68 118 -304 -28 -155 425 130 -29 238 -15 308 -85 222 64 -20 0 32 -111 -151 -157 34 284
6558B84j98J3j87j35M1K21j2j58j8p2L79j45K59m57J40l05L59k16P5M03j33R6
$$ 284 86 99 -88 -223 -182 39 27 -131 -149 -221 158 13 272 -185 -45 -350 9 -207 -132 271 138 234
6580B34l96L20K47k13k35J04L7L2j48K26j46rM7j01mL9K5J16l75J23K38k64j83
$$ 234 -162 158 405 192 -43 61 98 130 -18 208 62 53 100 -1 -5 34 59 175 -200 -77 161 -103 -286
6603b86J24J69K08j76k80M28m01L15q1k30J79KK54l72l3O4j67K92r0K85k56L5
$$ -286 -162 7 215 39 -241 187 -214 101 20 -210 -31 -29 225 -147 -180 -116 -283 9 -81 204 -52 -17
6625a7j29J48q8n8k98O78m14J35J80k30J01j55L36R4j57M3j16M6Q3p6j71J51j62
$$ -17 -146 2 -86 -144 -442 236 -178 -43 137 -93 8 -147 189 283 126 169 53 99 182 106 -65 86 -76
6648g6p9No0J37J95k5p8K07M0l13p8M32l24Q5m7J31l2l70J36Q2J28l69L86k68
$$ -76 -155 -150 -210 -73 122 97 19 226 266 -47 -125 307 -17 68 21 152 120 -250 -114 -32 96 -273 113 -155
6672a55J5J67kq2l1M4o2J34J55m25K90p6o7L55r0k38O7O9l71K71k3n1J83q4J36
$$ -155 -140 27 25 -57 -88 -44 -106 28 183 -242 48 -28 -95 260 170 -68 -1 68 -303 -32 -55 -106 77 -7 129
6697A29k20J10K87m81J63J07k2K00k93L4L5k94n0M26m43L89j02J55l7q7j35k3
$$ 129 -91 19 306 -175 -12 95 73 273 -20 14 49 -245 -295 131 -312 77 -25 130 93 6 -129 -152
6719a52J43o2K09j12m5J2J9j37J65j69K05L7j93K7p2K07j18k14L04j69N9L4o6
$$ -152 -9 -71 138 26 -19 -7 12 -125 40 -129 76 113 -80 -53 -125 82 -36 -250 54 -115 -56 -22 -88
6742h8R8j03K40r9J96j20k16K26j66k08R5J79K69k04k94N7J13J86J08k11n7k9
$$ -88 10 -93 147 48 244 124 -92 134 -32 -240 -145 34 303 99 -195 -138 -25 161 269 58 1 -28
6764b8o5K90k75K6M34k42j68j92M8O9j58J47K33K65m34J41l3r2qj4Q1q6J21K3
$$ -28 -93 197 -78 -52 382 140 -28 -220 -172 -103 -261 -114 119 384 -50 91 58 -34 -42 -56 25 -61 60 83
6788H3j6j9J81k85k36N6J20K90j51J18j07R1j49P3q3M9j15O1J3K3j09J20K40n06
$$ 83 67 48 229 -56 -292 -236 -116 174 23 141 34 125 -24 49 -34 15 -100 -39 -26 -3 -112 8 248 -258
6812b58N27m35J63m9m5K41k49K00j15K7L3m2j79J2M13l62K8L8r1J54M0j91Rj5
$$ -258 269 -166 -3 -52 -97 144 -105 95 -20 7 40 -2 -181 -169 244 -118 -90 -52 -143 11 51 -140 -131 -146
6836a46q0K83N5m27K26n5J05K1J9p4O4j98L83k66M8k00L13k35M9q7M7L2J88j05
$$ -146 -226 57 112 -315 -89 -144 -39 -18 1 -73 -9 -207 176 -90 -42 -242 71 -164 -115 -202 -155 -123 65 -40
6860d0J13J6k35K16j12j01J33J02q7qJ67K31j64l34k16J98K69pm92L29J21k40
$$ -40 73 89 -146 70 -42 -143 -10 92 5 -3 164 395 231 -103 -319 -121 148 141 -351 -22 99 -141
6882a41K7L64j98j81o9j30K75r1J33j54L08J7q7P7k90o1J7J76L3K35r5j89k34
$$ -141 -114 250 52 -129 -198 -328 -53 -144 -11 -165 143 160 73 150 -140 -201 -184 -8 25 260 165 -24 -258
6905b58K25L8r0L7j4P7K47n22L09r6J78m7j23K73j61q0Q9j48K2R2j20K66l27K58
$$ -258 -33 5 -85 -48 -62 15 262 -260 49 -47 131 84 -39 234 73 -7 82 -66 -44 48 -72 194 -133 125
6929A25j0J80k44m8J19j89J27mj88j25J49J55q7k06L44O0O3j19M3m7N9j48O3K01
$$ 125 115 295 51 3 122 -67 60 56 -132 -257 -108 47 -40 -246 98 158 221 102 145 98 157 9 72 273
6953B73k51nk09J74J6k0K79k72J41o7j56K69j85j80j19L28J19K08m67L28j98m3
$$ 273 22 17 -192 -18 -2 -22 257 -15 126 59 -97 172 -13 -193 -312 16 135 343 -124 204 6 -37
6975c7R8l08L39n1R7k52K01j87PP8j00J03J45J43j90n0k43L15l1j18l16N95j97
$$ -37 61 -247 92 41 138 -114 87 -100 -93 -15 -115 -12 133 276 86 36 -207 108 77 -41 -357 238 41
6998D1o5k21J96J77P0k87K2K67j70O9k05Q7J52k3n1J85k49J29j49N0J84j53M5
$$ 41 -24 -245 -49 128 198 -89 -67 200 30 99 -106 -19 133 110 59 244 -5 124 -25 25 209 56 101
7021A01j75K59k56K90k89Q3j24J48J38l20O8J50k75K07K67l36K0q7K45N0P1l42
$$ 101 -74 185 -71 219 -70 13 -111 37 175 -145 -77 73 -202 5 272 -64 -44 -131 114 164 235 -107
7043a07J30K67l12j97K90j57mK55k78j94J84k0K08k56J37j2P0k04o6J21L32j52
$$ -107 23 290 -22 -219 71 -86 -90 165 -113 -307 -123 -143 65 -191 -54 -66 4 -200 -266 -145 187 35
7065C5j62j9J35J54l36K97J95q2R9m69P8J60P4j61j90J57q0J40L2Rr9j2J11M1
$$ 35 -127 -146 -11 143 -193 104 299 217 316 -153 -75 85 159 -2 -192 -35 -115 25 57 66 -33 -45 66 107
7089A07j70p0J88J31k45P7p9L7k6m9K64j15M1k63L1L36k21J65M8q7J23l75J89
$$ 107 -63 -133 55 186 -59 18 -61 -24 -50 -99 165 50 91 -172 -141 195 -26 139 187 100 223 -152 37
7112C7K60n6j50m4j99K95j45j41J59L7n5J75k87j50L24L50l46j71J11R4Nk51J05
$$ 37 297 241 91 47 -152 143 -2 -143 16 53 -2 173 -114 -264 60 410 64 -107 4 98 103 -148 -43
7135d3L15k71O5pr9rl7J20N8O8l61J82O4J30k01o1J35j72J28M07k91k09K07j08
$$ -43 272 1 66 59 -40 -49 -86 34 92 160 -201 -19 45 175 -26 -87 48 -124 4 411 120 -89 118 10
7159A0k46J7L63n7N9l17j11L68L6Lp3mj5R5r5r1Q2L3q9J73n2J7L3q7m5o4j84M95
$$ 10 -236 -219 144 87 146 -171 -282 86 122 125 52 48 33 128 33 -58 24 57 -32 141 89 106 139 52 7 -57 -241 254
7187B54j03j19r6J51k11K39lp3k13J20L07n67L04Q1j49m2J54J44k37n1N9M8j38
$$ 254 151 32 -64 87 -124 115 112 39 -174 -54 253 -314 -10 71 -78 -120 34 178 -59 -110 -51 -3 -141
7210a41J76o7j26q6L21j63K60j08l02M59k55K04l8j72j52K41l32K31J09j2l30
$$ -141 35 -32 -158 -244 77 -86 174 66 -236 223 -32 172 134 -38 -190 51 -281 -50 59 47 -283
7231b83L93j89N5j5j10L09j89J90j49K23k50k9kj78J02K34k17J86l54K06P4J32
$$ -283 110 -79 -24 -39 -149 160 -29 161 12 235 -15 -44 -46 -224 -122 112 -105 81 -273 -67 7 139
7253A39k66K36J74j7l38m8k2J56N6q1j03k13L40K58k29J51p4k63l2L26k20K87
$$ 139 -127 109 283 266 -72 -120 -142 14 70 -11 -114 -327 13 271 42 193 119 -144 -176 150 -70 217
7275B17j56l40K79n6K38m31J73J9n7L14nj08j06l6j29M80n46L91L52l98J70O0
$$ 217 61 -279 0 -56 182 -249 -76 -57 -114 200 195 87 -19 -55 -184 296 -250 141 493 95 265 325
7297C25k86k58L16r7K12k90J03m5J94k55K89K25k60Q6n02L18j50J57j25L12k97
$$ 325 39 -219 97 0 212 -78 25 -20 174 -81 208 433 173 259 -243 75 -75 82 -43 269 -28
7318b8N8q6K47k14j00L59o8k89L3n0J36k27N01l10o8J38mJ52m36K20L57n62M42
$$ -28 30 -56 191 -23 -123 236 168 -121 -88 -138 -2 -229 272 -38 -106 32 28 180 -256 -36 321 -241 201
7341B01l37p5J21Q9K71m38Q2j74K67QJ63k24o3NO1j16L5J26k13J34j19k3J33P1
$$ 201 -136 -211 -90 -1 270 -168 -86 -260 7 15 178 -46 -109 -104 -43 -159 -124 2 -211 -77 -196 -219 -86 -15
7365a5k5L7M4L8j79R6M0o3j15J54r2m2L40o4j80p2O9J1J6J09j69K42j04j70J70
$$ -15 -40 -3 41 79 -100 -4 36 -27 -142 12 -80 -122 218 154 -26 -98 -29 -18 -2 107 -62 180 76 -94 76
7390G6n9j87J61n0r6J06n3K02q9k91L19K14Nl20J12K2m9Rj62J57j3ql46L63J34
$$ 76 17 -170 -9 -59 -155 -49 -102 100 11 -280 39 253 258 -62 50 72 23 32 -130 27 14 6 -340 23 157
7415A57j28O8r3j9K6j58J11P2P6j86jq1RJ93l1j3p1K09k56P2K1N5k8j06l4K12
$$ 157 29 97 4 -15 11 -147 -36 36 112 -74 -75 -156 -147 46 15 2 -69 140 -116 -44 -23 32 4 -102 -136 76
7441G6j19O1o7o4J19J31J74k86j55M37m74M2j23J00L02j7j2o6j01o7J04j30J28
$$ 76 -43 18 -49 -113 6 137 311 25 -130 307 -167 -125 -248 -148 154 137 125 59 -42 -109 -5 -135 -7
7464gq0n0QJ79k47L17k62P3J88j25o1J12p3j60L47n2J1o3J61j37l7j9k00R6Q0
$$ -7 -87 -137 -129 50 -197 120 -142 -69 119 -6 -67 45 -28 -188 159 107 118 55 216 79 42 23 -177 -81 -1
7489aJ1J45k86J77K77n53M28Q6n24M67l24L09n4l37K48L4j07K28L1l56K51o2m
$$ -1 10 155 -131 46 323 -230 198 284 -240 227 -97 212 158 -179 69 103 -4 224 255 -101 150 88 84
7512H4j37O6k5j5J38m7j8l68K22m9K7M40k93L0p7j07jJ0K22j97K25j98J13k25
$$ 84 -53 13 -12 -27 111 64 46 -322 -100 -149 -122 318 25 55 -22 -129 -130 -120 102 -95 130 -68 45 -180
7536a80K36L2j35J36J49K03n78L48j11k37L83o8j54l1p0N4N7J53k70J42k37J83
$$ -180 56 88 -47 89 238 441 -137 211 100 -137 246 178 24 -7 -77 -23 34 187 -83 59 -178 5
7558EN7r2O2J66j68j35J14M0L48m79L22j10N3k52L66m18K0K7N7K56o1p3J00k74
$$ 5 62 -30 32 198 30 -105 9 49 397 -82 240 130 183 -69 297 -121 -101 -74 -17 239 178 105 205 -69
7582f9k2K42j72j91K98kk23P2J30M2K6k74J3J47o3j61J94J10m6J58j77K31k60
$$ -69 -91 151 -21 -212 86 84 -139 -67 63 105 131 -143 -130 17 -46 -207 -13 97 51 209 32 263 3
7605CjJ40O8j86Km3J70k20L38j96p2J86j08q0O4o3P9J42j49J69m32Q0q0J91j81
$$ 3 2 142 210 24 26 -17 153 -67 271 75 3 189 81 1 65 2 81 223 74 243 -189 -109 -189 2 -179
7630a79J30J30J11n42J54L17l50K72j27J09j60J94j92k7K25k51K64mP3k87K43
$$ -179 -49 81 192 -350 -196 121 -229 43 -84 25 -135 59 -133 -160 65 -186 78 74 147 -140 103
7651A03j39R9j15Jl33K08K8L16j79J00j41J86o0J11k46m06P19m45L22l73K17J4
$$ 103 -36 63 -52 -51 -384 -176 -148 168 -11 89 -52 134 74 185 -61 -467 252 -193 129 -244 -27 -13
7673a3r7k2J39N9m0j89L6L34m5n25M41k64J87K76q5l25L8K50l22M05l42L27m8
$$ -13 -110 -132 7 66 26 -163 -127 207 162 -363 78 -186 1 277 192 -133 -95 155 -167 238 -104 223 175
7696A75O4j44L5k60J13L7q6j8N9J19j37k9m5n3K15o1L9P2j44m0P9J75n5n8k40
$$ 175 239 95 130 -130 -17 20 -66 -84 -25 94 -43 -72 -117 -170 45 -16 23 95 -49 -89 -10 165 110 52 -188
7721a88L63k13L05l37m7J61m0P5L5j87M9j31J02l7j21M40k0l10K40j13j95K53
$$ -188 175 -38 267 -70 -117 44 4 79 114 -73 -24 -155 -53 -90 -211 229 209 -101 139 26 -169 84
7743H4q1J08n0J03k6j34k4O7m9l34K72L27k85J03j25p1J93l2j28r6N25l84k82
$$ 84 3 111 61 164 138 4 -20 47 -2 -336 -64 263 -22 81 -44 -115 78 46 -82 -178 347 -37 -319
7766c19O03l23M77l99M7j33J47N4j34n1K36j14k81o4J50K19j60k01L77r0j63k8
$$ -319 284 -39 438 39 86 -47 100 154 20 -31 205 91 -190 -254 -104 115 -45 -246 131 41 -122 -150
7788a50J56J23j7j01k21L29j66r2L25l49J87o2j20K52k62j18L31mP5J7j86j9j39
$$ -150 6 129 112 11 -210 119 -47 -139 186 -163 24 -38 -158 94 -168 -286 45 41 116 133 -53 -72 -211
7811b11L86j92j7J14k47J71RJ81l25J93J16l57N42l78o2J22M8P5j57L1j86M45
$$ -211 175 -17 -34 80 -167 4 13 194 -131 62 178 -179 363 -15 -77 45 93 168 11 42 -144 301
7833C01l13Q4J77j53M9k38K47j23l02M4K01P7j33pJ23o5k39L89j85n1J37q2n5
$$ 301 -12 72 249 96 145 -93 154 31 -271 -227 -26 51 -82 -89 34 -31 -270 119 -66 -117 20 -62 -117
7856a17J72q6l08R1L10n3o8J5J8R8J6P3l24M67l54o9K08M2m15N93j79k40%M4J50
$$ -117 55 -31 -339 -248 62 9 -59 -44 -26 72 88 161 -163 304 -50 -119 89 131 -284 309 130 -110 -110 -66 84
7881H4N1j3j28Q3l73L62L03l01o1k28O2K96J7r0k24O7J15j73J66K5J76k06m5Q3
$$ 84 135 122 -6 77 -296 66 369 68 7 -221 -159 137 154 64 -160 -93 22 -151 15 40 216 10 -35 48
7905D8Lo5k02M4J12K36k03l33K70k9J7J94k52L41k53J5o0L31m49J14J82k62R6
$$ 48 51 -14 -216 -172 -60 176 -27 -360 -90 -119 -102 92 -160 181 -72 -57 -117 214 -235 -121 61 -201 -105
7928a05J48K21l89K47j09k60N1L0M02k16mj92K15j7lk43J32J76m22P15j06k42
$$ -105 43 264 -125 122 13 -247 -196 -166 236 20 16 -176 39 22 19 -224 -92 84 -338 377 271 29
7950B9j4k57L06j23j35K45N82p66m6l4J90J40o8K64n03K44R1j26K9l34J25m4K97
$$ 29 15 -242 64 -59 -194 51 633 -133 -179 -213 -23 117 49 313 -190 54 145 19 48 -286 -161 -205 92
7973I2k18J36j38j85N59k61lk12K20k81K51j38K35l8K9k14k4K4J12j69Q4J51J33
$$ 92 -126 10 -128 -313 246 -15 -18 -230 -10 -291 -40 -178 57 19 48 -166 -190 -166 -54 -223 -139 12 145
7996A45j2J89n61Q2Q1K41j0n6qk29K15l93L18l63L39Q2k22R4j5J80j48p8j24J29
$$ 145 133 322 -239 -157 -76 165 155 99 91 -138 77 -316 2 -361 -22 60 -162 -68 -83 97 -51 -129 -253 -124
8020a24pK41P7j82K07M5m40L21o0r2L3n5J13r4j79J71K07k20O3J57n1l48L61j81
$$ -124 -131 110 187 5 212 257 -183 138 78 -14 19 -36 77 -17 -196 -25 182 -38 25 182 131 -217 144 -37
8044c7J91l5k63kP4k63K56J68J60k89K9K18l95K07K29J3l14L9L31n69P9K13j03
$$ -37 154 119 -144 -146 -72 -335 -79 89 249 -40 -11 207 -188 19 248 261 -53 -14 317 -252 -173 40 -63
8067f3o7j80O09k39j84Q7p6J12j18J90K3Q9l76L63o2k23J66j91J56J11j86L04
$$ -63 -130 -310 299 60 -124 -37 -113 -1 -119 71 94 183 -193 170 108 -115 51 -140 16 127 -59 245
8089B45J09k60R1k94Q1J70k13K06L15m92k34N15l46R7l07L45M3L2j02K2j11N2
$$ 245 354 94 185 -109 -28 142 -71 135 450 -42 -276 239 -107 -10 -317 28 71 103 1 23 -88 -36
8111c6N8j16K7Q8p8o5O8k15J91K06j16k2K17j93k1K53k36J67k63m9K18Q1j87J62
$$ -36 22 -94 -67 21 -57 -122 -54 -269 -78 128 12 -10 207 14 -7 246 10 177 -86 -135 83 164 -23 139
8135A39n5q0k11o0J30L05j2k19J9q8N5l3j21K60o3N4N5r3J67j55r6k80N02k04
$$ 139 84 4 -207 -267 -137 168 156 -63 -44 -132 -77 -110 -231 29 -34 20 75 -18 149 -6 -102 -382 120 -84
8159h4K94m33L30k22K51J1o1m2j10K27l62pOL21k18k4J63n4j80K17j51J13M1k01
$$ -84 210 -223 107 -115 136 147 86 44 -66 161 -201 -208 -202 119 -99 -123 40 -14 -194 23 -128 -15 26 -175
8183a75L43k27j9Q5j30K24l9l51
$$ -175 168 -59 -78 7 -123 101 62 -289
8191b89
$$ Imaginary data points
##PAGE= N=2
##DATA TABLE= (X++(I..I)), XYDATA
0@%%%%%%%%%%%oJ4j6J6j6K2l0L2m0M9n7P0q0R2j08J28j51J72j97K27k59K95l36
$$ 0 0 0 0 0 0 0 0 0 0 0 0 -6 8 -8 8 -8 14 -16 16 -24 25 -32 38 -42 50 -58 70 -81 91 -106 121 -138 157 -179
34a79L81m28M81n40O04o74P51q36R28j029J139j260J391j533J690j862K051k259
$$ -179 202 -226 255 -285 319 -355 396 -440 488 -541 598 -662 729 -804 886 -976 1075 -1184
52a184K490k747L033l355L720m136M615n178N848o661P671q964J0691j3125J6837
$$ -1184 1306 -1441 1592 -1763 1957 -2179 2436 -2742 3106 -3555 4116 -4848 5843 -7282 9555
67I555k3259L7376j25851J02433K07217k81000j00189K53552Q1465k70060j1465
$$ 9555 -13704 23672 -102179 254 207471 -73529 -173718 79834 161299 -108761 -120226
78a20226K40467j9203k25801P1342J80458r7789j46819J30277R2728j46766n3847
$$ -120226 120241 101038 -124763 -53421 127037 29248 -117571 12706 105434 -41332 -95179
89i5179J59535J626j58600M0215J56154q3779j38325J19049J24169j48025r8745
$$ -95179 64356 65982 -92618 -52403 103751 19972 -118353 696 124865 -23160 -121905
100a21905J68828P6255j82278m8050J87289K1747j88309J616J76751k5040j65019
$$ -121905 46923 123178 -59100 -107150 80139 101886 -86423 -84807 91944 66904 -98115
111i8115M1928J44400n4966j20288O5199R5891o7571o8953O7151M4399n9898k0339
$$ -98115 -56187 88213 33247 -87041 -21842 74049 6478 -62475 4676 49075 -10823 -31162
123c1162N1187J187m0050J5785K7986l1068j7292L8626N811m5876K066M9997r254
$$ -31162 20025 21212 -18838 -3053 24933 -6135 -23427 15199 21010 -24866 -22800 27197 17943
136A7943n1733J3991N3214j6118n2133J6687N1767j4213m9279J1395M9581p467
$$ 17943 -33790 -19799 33415 17297 -34836 -18149 33618 19405 -29874 -18479 31102 23635
148B3635m9476K201M8815J341m9308o970M9861J0251n0001j3168N0848J4301n1271
$$ 23635 -25841 -23640 25175 26516 -22792 -29762 20099 30350 -19651 -32819 18029 32330 -18941
161a8941j5589N0822J5852m9933j2828M9321R906m5774m888M1311o88l6080O666
$$ -18941 -34530 16292 32144 -17789 -30617 18704 28610 -17164 -22052 19259 18571 -17509 -10843
174a0843K8879j2670k0227J8207R575k4165P69K7235j2750l0359K3870L2008l4006
$$ -10843 18036 5366 -14861 3346 12921 -11244 -10475 16760 4010 -26349 -2479 29529 -4477
187d477l1167M5029L0748n4616k7433O3085K3885o8712j9124P4142J3347p7689
$$ -4477 -35644 9385 40133 -14483 -41916 21169 45054 -23658 -42782 31360 44707 -32982
199c2982q017P8440n63p8812O837P5578j4255p1300K2085O5914k9145n6759L6534
$$ -32982 -40999 37441 36878 -41934 -35097 40481 26226 -45074 -22989 42925 13780 -42979 -6445
212f445M8332m2359l5915M7881K3594n0638j0394N2795n465n4164J9104N1410
$$ -6445 41887 -472 -36387 11494 35088 -15550 -25944 26851 21386 -32778 -13674 37736
224C7736l5355m7584M8709M1412o1159l2863P2264K3851q0773j1521Q8037o7r0234
$$ 37736 2381 -45203 3506 44918 -16241 -49104 23160 47011 -33762 -45283 42754 42687 -47547
237d7547J4055R0615k6507q8382L8631Q1025n1328p3562O0579O0703o8495m7069
$$ -47547 -33492 57123 30616 -57766 -19135 61890 10562 -63000 -2421 58282 -10213 -57282
249e7282P3968L1999p6523j5192P6522j088p2359J8929O7026l3644n7136M7981
$$ -57282 16686 48685 -27838 -43030 33492 32404 -39955 -21026 46000 12356 -44780 3201
261C201M5077o0058l2640O7930J7086p4744j988P6907j4009p6086K8227P2221
$$ 3201 48278 -11780 -44420 23510 40596 -34148 -36136 40771 26762 -49324 -21097 51124
273E1124m1154o5376N3068N6729o0582m4827O7866L2830p0245k0091O9835O525
$$ 51124 9970 -55406 -2338 54391 -6191 -51018 16848 49678 -20567 -40658 29177 35702
285C5702o7600M775O1876j6345n5144K5845M5175l3516l4970L8982K3819m2122
$$ 35702 -31898 -27123 34753 18408 -36736 -10891 34284 768 -34202 4780 28599 -13523
297a3523j1969M3795J936m1840Q730L9680j7606l4941K4242K8828k9652k2736
$$ -13523 -25492 18303 20239 -21601 -12871 26809 9203 -25738 -1496 27332 -2320 -25056
309b5056L2314J6834l4770j0833L3945M735l3167Q5K9869l358k5452O344K2580
$$ -25056 7258 24092 -10678 -21511 12434 17169 -15998 -15913 13956 10598 -14854 -8510 14070
322A4070p255j8301P805J4618p432j1298O317Q787m515p694L472N948k919n933
$$ 14070 6815 -11486 -3681 10937 3505 -7793 -1476 7311 2796 -4898 -1426 4522 1603 -4330
336d330J362N637j362o146K169O698k704o630M929O494o612n566Q922M829j1075
$$ -4330 -2968 2669 1307 -4839 -2670 4028 1324 -5306 -377 6117 -495 -6061 2861 7690 -3385
351c385k931J3678Q13j6245J701J6770n644j8621R037J8568j2842j7431J6473
$$ -3385 -6316 7362 8175 -8070 -6369 10401 4757 -13864 -4827 13741 899 -16532 -59
364e9J6160j9774j3408K3193J0424k5215n646K6980J814k7267L151K6494q545
$$ -59 16101 -3673 -17081 6112 16536 -8679 -14325 12655 14469 -12798 -9647 16847 8302
377H302k5588J2825K2001j7126j8893K0350J4347k3688r178K5508L935k5854K001
$$ 8302 -17286 -4461 17540 414 -18479 1871 16218 -7470 -16648 8860 12795 -13059 -11058
390a1058K6027o631k3656J2306K1711j6081j9537J9498J5549k3061j1764K4699
$$ -11058 14969 8338 -15318 -3012 18699 2618 -16919 2579 18128 -4933 -16697 8002
402H002O976k5955l105K6006j852k5962O097K4494r477k1685J3596J9868j5623
$$ 8002 14978 -10977 -14082 11924 10072 -15890 -9793 14701 5224 -16461 -2865 17003 1380
415A380j6296J8336J2680k0181r408K1419M735k1660r46K0088k666k0205N902
$$ 1380 -14916 3420 16100 -4081 -13489 7930 12665 -8995 -9941 10147 7481 -12724 -6822
428f822J8321r236j6165J2123J4423j3490j1375J6050Q869j7058o089J8306K705
$$ -6822 11499 2263 -13902 -1779 12644 -846 -12221 3829 12698 -4360 -10449 7857 10562
441A0562j8281k91J8284k736j8071M961J6472q054j5810J0249J4036j2359j1994
$$ 10562 -7719 -8010 10274 7538 -10533 -5572 10900 2846 -12964 -2715 11321 -1038 -13032
454a3032J4974R803j5842o503J7529L175j7481j32J7909k955j7112N746J5360
$$ -13032 1942 11745 -4097 -10600 6929 10104 -7377 -7509 10400 7445 -9667 -3921 11439
467A1439r078j4135J0913J1064j2764q897J4068O620j4475l913J5568N99j4782
$$ 11439 2361 -11774 -861 10203 -2561 -11458 2610 9230 -5245 -9158 6410 7009 -7773
480g773K339J4253l944j3183O671J1664q188j0674R739Q117j1683o282J1472M247
$$ -7773 -5434 8819 4875 -8308 -1637 10027 1839 -8835 904 9021 -2662 -8944 2528 6775
494F775j2195j744J2166j20j1958K959J0622m106r400O184Q860p289o516P749
$$ 6775 -5420 -7164 5002 4882 -7076 -4117 6505 2399 -7001 -817 8043 754 -5762 1987
508A987M855q353l685Q224J653q522l53P454m91p076J280O433k190o018L305N567
$$ 1987 6842 -1511 -5196 3028 4681 -3841 -4194 3260 2769 -4307 -3027 3406 1216 -4802 -1497 4070
524D070k804m738L547M430l570m380M548L046n232k251M974J675n352j547N532
$$ 4070 1266 -3472 75 4505 935 -3445 1103 4149 -1083 -3334 1640 3315 -2037 -3584 1948
539A948J41n461J29N691j072n347K358N233k029m871L086M713l935l848M170L573
$$ 1948 2089 -3372 -3243 2448 1376 -3971 -1613 3620 1591 -3280 -194 4519 584 -3264 906 4479
555D479m991k927N217J759n640j883O299k79o344J096O783k152o069L497O133
$$ 4479 -512 -3439 1778 3537 -2103 -3986 2313 2034 -4310 -3214 3569 1417 -4652 -1155 4978
570D978m585m712N885L679o541k379O774R20o709J83O309k268n828K396M955l282
$$ 4978 393 -4319 1566 5245 -1296 -3675 3099 4019 -2690 -2507 3802 1534 -4294 -1898 3057 -225
586b25m624M148M200m442k610N296J435m855o68N551l17m821O33M859j798m387
$$ -225 -4849 -701 3499 -943 -3553 1743 3178 -1677 -2345 3206 2889 -1932 -1299 3560 1762 -2625
602b625K119L130k970l317L348K484m003j243M137N86l390l13M284o02l144J520
$$ -2625 -506 2624 -346 -3663 -315 2169 -1834 -3077 1060 1646 -1744 -2057 2227 1625 -1519 1
618AK943j727k033J481J124j806j482J163R21j394p00J335N49j747j14J192O76
$$ 1 2944 1217 -816 665 1789 -17 -1499 -336 585 -809 -1509 -174 375 -1372 -1486 -294 382
635C82j315L68J604M40j261j95J763m59j623K42J181j086j463M11J844j225j393
$$ 382 -933 -565 1039 1479 218 23 1786 1327 -296 -54 1127 41 -1422 -1011 833 -392 -1785
652a785J312P53j131n61J652P52j306k95J696N15j579p2J441n43j609N76R69n22
$$ -1785 -473 280 -851 -1412 240 992 -314 -609 1087 1602 23 -49 1392 849 -760 -184 785 263
670B63j308P43R69j497r90J506N30j043K27J350L27j355L00J323o38q75O43J044
$$ 263 -1045 -302 667 -830 -1820 -314 216 -827 -600 750 1077 -278 22 1345 707 -168 475 1519
688A519j259q24R39K03q15n10P16j79l92k3R1J76q9N74o1Q4J33K29j18k30L55
$$ 1519 260 -564 375 578 -237 -747 -31 -210 -602 -625 -534 -358 -447 127 66 150 283 512 394 164 519
709E19k97O1K46o9n41j10K03k52n44O1Q85o60m24P36J090j154p07J369L78q86
$$ 519 222 283 529 460 -81 -191 12 -240 -784 -723 162 -498 -922 -186 904 -250 -957 412 790 -96
729i6k69J405k50j100L10J655j216j381O97J097j834n25J438O99j790r6J738Q0
$$ -96 -365 1040 790 -310 0 1655 439 -942 -245 852 -982 -1507 -69 630 -1160 -1256 482 562
747E62k036R10J986p37j757J493J430j059j708J491Q65j904o34J493O11k203j86
$$ 562 -1474 -564 1422 685 -1072 421 1851 792 -916 575 1440 -464 -1098 395 1006 -1197 -1383
764a383K112m03j896N93J698o59j483J345J773r50j508J712O04j397r83J688K17
$$ -1383 729 326 -1570 -977 721 62 -1421 -76 1697 747 -761 951 1555 158 -825 863 1080
781A080j999o0J612k14j898K0K142n67k157J211J868r09j193J659J280j422j245
$$ 1080 -919 -979 633 419 -1479 -1459 683 116 -2041 -830 1038 129 -1064 595 1875 453 -792
798g92J597R89k036r62K451J73k553q2K292o43k480O47K210q19j896J467K372
$$ -792 805 1794 -242 -1204 1247 1420 -1133 -1215 1077 434 -2046 -1399 811 -8 -1904 -437 1935
815A935j791j711K466J357k788p48K769N02l016j55L021n91l586J033L028j706
$$ 1935 144 -1567 899 2256 -532 -1280 1489 1991 -1025 -1180 1841 1250 -2336 -1303 1725 19
831A9k631J912K700k560j582K732J816l250q25L500K03l572M71L325o91l508J363
$$ 19 -2612 -700 2000 -560 -2142 590 2406 -844 -1669 1831 2034 -1538 -1067 2258 1567 -1941 -578
848e78K968k577k640K377K372l259j168L003J271l368l89L560J99l517R02K707
$$ -578 2390 -187 -2827 -450 1922 -1337 -2505 498 1769 -1599 -1988 1572 1771 -1746 -844 1863
864A863o40l055K063K212k102k492K576J463k851j278L113O61l146j05L028j91
$$ 1863 1223 -1832 231 2443 341 -2151 425 1888 -963 -2241 872 1533 -1613 -1718 1310 1119
880A119k882P84K879j120k583J682K008j340k042K005J594k338j145K073R70k655
$$ 1119 -1763 -979 1900 780 -1803 -121 1887 547 -1495 510 2104 -234 -1379 694 1664 -991
896i91n04K469J44l036N49K405p38k238J384K385j119k017J418K041j905j615
$$ -991 -1495 974 1118 -1918 -1369 1036 298 -1940 -556 1829 710 -1307 111 2152 247 -1368
912a368K056J257k632q58K734J52k571k43K317j56k699O27K632p79k558J819K657
$$ -1368 688 1945 -687 -1545 1189 1341 -1230 -1473 844 688 -2011 -1384 1248 469 -2089 -270 2387
929B387k322k137K452K141k461j860K779J344l196r12L325m1l436J81L440j300
$$ 2387 65 -2072 380 2521 60 -1800 979 2323 -873 -1785 1540 1499 -1937 -1756 1684 384
945C84l135J738L111k054k428K669K472l163j560L553J001l533p23L650j28l832
$$ 384 -2751 -1013 2098 44 -2384 285 2757 -406 -1966 1587 2588 -945 -1668 1982 1854 -1978
961a978P11L359j478l848K037L385k571k533L181K291l684j345M024R63l946k25
$$ -1978 -1267 2092 614 -3234 -1197 2188 -383 -2916 265 2556 -1128 -2473 1551 2514 -1432 -1657
977a657L843j15l998Q58L914k169l444J973L413l134k651L672J723l574j194L946
$$ -1657 2186 2071 -1927 -1069 2845 676 -2768 -795 2618 -516 -3167 505 2228 -1346 -2540 1406
993A406M09l487M32L511q98l429J622L237k094k744K155K403k893k192L509J171
$$ 1406 1815 -1672 -1240 2271 1373 -2056 -434 2803 709 -2035 120 2523 -370 -2562 947 2118
1009B118l755o10L611ql455M35L701r14l106J640L218k444k433K601K053k753
$$ 2118 -1637 -2247 1364 1356 -2099 -1664 2037 1123 -1983 -343 2875 431 -2002 599 2652 -101
1025a01j930K797J242l163q86L422J72l117K78K666p82k579J202K637k037j504
$$ -101 -2031 766 2008 -1155 -2041 1381 1553 -1564 -1286 1380 598 -1981 -779 1858 -179 -1683
1041a683K142J839k488j554K567R02k546p80K820K22k937K60K738p54l133J394
$$ -1683 459 2298 -190 -1744 823 1725 -821 -1601 1219 1441 -1496 -1236 1502 748 -2385 -991
1057i91K706j645k260K010K375k372j690K559J219k231j063K630K72k481K3K099
$$ -991 1715 70 -2190 -180 2195 -177 -1867 692 1911 -320 -1383 1247 1519 -962 -939 1160
1073A160L5k471M83K105j111k047J647J550j633j292J647J459k115q15K356N11
$$ 1160 1195 -1276 -793 1312 201 -1846 -199 1351 -282 -1574 73 1532 -583 -1398 958 1469
1089A469k044n95K557j41k525O08K540j243k462J062K478j758k038J888J637k091
$$ 1469 -575 -1170 1387 1246 -1279 -671 1869 626 -1836 -774 1704 -54 -2092 -204 1433 -658
1105f58j402K655J071k453l77K441L69k697K54K493p08k391P38K313j486k359
$$ -658 -2060 595 1666 -787 -1164 1277 1646 -1051 -797 1696 988 -1403 -665 1648 162 -2197
1121b197J687J997k145j161K141J125k737j63K960m39k454O01K856j139k408J218
$$ -2197 -510 1487 -658 -1819 322 1447 -1290 -1453 1507 1068 -1386 -785 2071 932 -1476 -258
1137b58K245j470k584K008J937k534j329K413J255l236o45L323n5k394L0L266
$$ -258 1987 517 -2067 -59 1878 -656 -1985 428 1683 -1553 -2198 1125 1070 -1324 -1294 1972
1153A972p31k576J448K196j586k331J893J417j926j564K641M24k773Q5K743l98
$$ 1972 1241 -1335 113 2309 723 -1608 285 1702 -224 -1788 853 1277 -1496 -1411 1332 934
1169I34k929Q48K767j414k026J842J959j921j691K248J377k484q58K555K3k366
$$ 934 -1995 -1147 1620 206 -1820 22 1981 60 -1631 617 1994 -490 -1348 1207 1230 -1136
1185a136j55K805l95k681O10K150j291j572J539J818k031j101K115P47j896m89
$$ -1136 -1291 1514 1119 -1562 -952 1198 -93 -1665 -126 1692 -339 -1440 675 1422 -474 -963
1201i63K051L17k150R0J820n97k053Q63J848j290j526J144J214j272o36J433Q29
$$ -963 1088 1405 -745 -655 1165 568 -1485 -622 1226 -64 -1590 -446 768 -504 -1140 293 1122
1218A122j532m57J846J10j742NJ861m40j572M56J751j186j281Q34J135j312p88
$$ 1122 -410 -867 979 1089 -653 -648 1213 773 -799 -343 1408 222 -1059 -225 910 -402 -1190
1235a190J221Q62j359p88J763K31j140k25J402L8j485N28J122n66j095P73R52
$$ -1190 31 893 -466 -1254 509 740 -400 -625 777 815 -670 -142 980 414 -681 92 1044
1252A044j014r99P21J093j119o77R18P40j654J47J363J73j262k0J486j28j571
$$ 1044 30 -969 -248 845 -274 -951 -33 707 -947 -800 563 736 -526 -546 940 812 -759
1269g59P77J128j013j003R60P26j224p49J258R25j547n34J286N11j480l1J403
$$ -759 18 1146 133 -870 90 816 -408 -1157 101 1026 -521 -1055 231 742 -738 -769 634
1286F34qj364M36J299k75j358O72J174j155o13Q32N08j220m35J403k04j321J95
$$ 634 626 -738 -302 997 722 -636 36 1210 55 -558 274 782 -438 -873 530 326 -995 -800
1304h00J256k69j224O75J435q09j085P68J049j014o55J257N90j578k31J385J72
$$ -800 456 187 -1037 -362 1073 264 -821 -53 996 -18 -673 584 1174 -404 -635 750 922
1321I22j789O2J356l76j046J79J374p51p85R48R64r96o48J066K24r91r6J335R0
$$ 922 -867 -805 551 175 -871 -692 682 -69 -854 94 1058 62 -586 480 704 -287 -383 952 1042
1340A042j615L1J340p03j177O61R07p86o16O65P36r43m13J302K68n25o78R78J69
$$ 1042 -573 -542 798 95 -1082 -421 486 -300 -916 -251 485 -458 -871 431 699 174 -504 474 643
1359F43j011J48J453q47j001J32Q25l99n10L38Q13q97o65J149K70o96l05J058
$$ 643 -368 -220 1233 386 -615 -483 342 -57 -567 -229 584 -313 -978 171 441 -255 -560 498
1377D98k7q12J86J171n21j068M49R13o29q40N94O25q23j95N22J85o32n07J234
$$ 498 471 -341 -155 1016 495 -573 -124 789 160 -680 -86 539 -284 -479 43 228 -404 -911 323
1396C23q7o15pP82J33r76J94R37l69o63N29J57m81n95N74K39n74M5N49Kp09J11
$$ 323 236 -379 -386 396 529 -447 -253 684 315 -348 181 338 -143 -738 -164 75 -499 -454 95 97 -612 -501
1418e01O16m8o31Q28L8l41j63J66N76m25l81L35M47o79k94N58k0n80j11R29l77
$$ -501 115 67 -564 264 302 -39 -202 -36 540 115 -266 69 516 -163 -457 101 81 -499 -610 319 -58
1439e8p13K91R75l70k76J50N08m57l66N45M57o54l05N65K42n01l84O07m64n8N7
$$ -58 -771 -480 495 125 -151 -1 507 50 -316 229 686 32 -273 292 534 33 -351 256 -208 -266 -209
1460b09L67l45l04P23J68m66l05L50N07n66j76N85o8l09M1J6K91n07R1K23j01
$$ -209 158 -187 -491 232 400 -66 -371 -21 486 -80 -256 329 261 -48 -7 9 300 -207 -116 107 6
1481Fm40J09L19j44k23L23K47j95l21N90M1k22rK29J67o33L27j10o3l17J95K4
$$ 6 -434 -325 -6 -150 -373 -50 197 2 -319 271 312 90 81 310 477 -156 171 61 -2 -319 -124 -100
1503a00j68o5P6K45j84m5L00K33k78o0J69K06k98l88Q20k53m84J78M23m75l56
$$ -100 -268 -333 -257 -12 -196 -241 59 292 14 -46 123 329 31 -357 463 210 -274 -96 327 -148 -504
1524e04L63J24Q9n81M07m4L8R0L00l0m9j51N1K54l87K9K36p2k30P3J68m67o1L89
$$ -504 -141 -17 72 -509 -102 -146 -108 -18 282 252 203 52 103 357 -30 -1 235 163 -67 6 174 -293 -354 35
1548C5k32j44L68O3M35p01J65K98k92k48M39K02k15l13K73K52j05l92L0J53l17
$$ 35 -197 -341 27 90 525 -176 -11 287 -5 -253 186 388 173 -140 133 385 280 -112 -82 71 -246
1569b46k20L52R2k14o6M82J44n43J48K44j65lj35J66O4m26L39M10m62JL0j8n5
$$ -246 -466 -114 -22 -236 -302 180 324 -219 -71 173 8 5 -130 36 100 -326 13 423 -39 -38 -8 -26 -81
1592h1O7N9J6l11m6L14Kj35r5K00K1k42K13L53l82L8p9K62k37J25j53r5J7J57
$$ -81 -14 45 61 -250 -296 18 20 -115 -210 -10 11 -231 -18 335 -47 -9 -88 174 -63 62 -91 -186 -169 -12
1616a2L8m3m2N3j8J92r8J19j96J62j09K75j62n9L5K64k53k82Q5KL86n53n2J47
$$ -12 26 -17 -59 -6 -24 168 70 189 -7 155 46 321 159 100 135 399 146 -136 -51 -49 337 -216 -268 -121
1640a21K05k46J41j22M9L24k76L68J23l62n4M3J13j04j56J15j88R7n5m0J23j13
$$ -121 84 -162 -21 -143 -94 230 -46 322 445 83 29 72 185 81 -75 40 -148 -51 -106 -146 -23 -136
1662a36j0L8p7N3K1JK32J84j92K30j61j51K3J84k46R9M8k37k5j9R4k27L73k36
$$ -136 -146 -108 -185 -132 -111 -110 122 306 114 344 183 32 55 239 -7 92 140 -97 -122 -141 -47 -274 99 -137
1686a37N4Q5j83J83R1OkJ2O5k16O1l7K39j25j53K7Q9k69K87j64M1j43K1K29j23
$$ -137 -83 2 -181 2 93 99 97 109 174 -42 19 -18 221 96 -57 -30 59 -210 77 -87 -46 -189 -168 61 -62
1711f2j45N69ll83K16j87M77n17r8K40j71n1L87j33k07j54k97M41M6j30K81J4
$$ -62 -207 362 359 -24 192 5 482 -35 -133 107 -64 -115 272 139 -68 -222 -519 -78 -32 -162 119 133
1733A33k96J91M3J20J18o0k1j47Q1J26j34k63J08r4l0L3k52L26R2m24L93j20L04
$$ 133 -163 28 71 191 309 249 228 81 162 288 154 -109 -1 -95 -125 -92 -344 -18 74 -350 43 -77 227
1756B27l26J5L36r1N3O6j02j12j70K95K1j62L8o1m0j97p3M71k57j18J35kP7J51
$$ 227 -99 -84 252 161 214 280 178 66 -104 191 212 50 88 27 -13 -210 -283 188 -69 -187 -52 -54 23 174
1780A74J4j29J72m3m09M54k5j24N4j8K0k15M0L9k84J68R0j6j55K80k02K73K41
$$ 174 188 59 231 188 -221 233 208 84 138 120 140 -75 -35 4 -280 -112 -22 -38 -193 87 -115 158 399
1803C99m50K84q9J4J86k33q1j24K54j70k01r3K98j61j27N8K45L7m29J85K62l53
$$ 399 -51 233 144 158 344 111 30 -94 160 -10 -211 -304 -6 -167 -294 -236 9 46 -383 -198 64 -289
1825b89L97rL38l42k16J65N2j3m43N81k65K73k87j16j34L02R4k27j4o1K31n6J11
$$ -289 108 99 437 95 -121 44 96 83 -360 221 -44 229 -58 -174 -308 -6 88 -139 -153 -214 17 -39 72
1848G2l44M04%j05m9L74m0j68K11l85j61o4J47L09m21p2J97O8O4rJ09J03l75Q8
$$ 72 -272 132 132 27 -22 352 312 144 355 -30 -191 -255 -108 201 -220 -292 -95 -27 37 28 137 240 -135 -47
1872d7L55j93J12j90L16k72j67J64j74m5n1K39Q7j91j2J8M4m82J24L49J60l9l29
$$ -47 308 115 227 37 353 81 -86 78 -96 -141 -192 47 134 -57 -69 -51 -7 -489 -365 -16 144 105 -224
1895b24J61K1J62j18K56k67k14R2kJ28r6K28p0k41j08L40j57J97k02J31j83L46
$$ -224 -63 -42 120 2 258 -9 -223 -131 -133 -5 -101 127 57 -184 -292 48 -109 88 -114 17 -166 180
1917A80m5j03O8k49K24K46l28j24L23m1j44q8J36K2k34J74K8r7rN1K85m15P4K75
$$ 180 135 32 100 -149 75 321 -7 -131 192 151 7 -81 55 77 -157 17 45 -52 -61 -10 275 -140 -66 209
1941B09m8m4r2K9m8j2n9J35j78k40L10p9P0k11o0L80l8R5m03N16m62J16M38k91
$$ 209 161 117 25 54 6 -6 -65 70 -108 -348 -38 -117 -47 -258 -318 62 24 119 -284 232 -230 -114 324 33
1965C3q9J53M8j82L75m92K13p4l83L30K32k64J17J70j96Q7l38L20j73M12l50K16
$$ 33 -56 97 145 -37 338 -154 59 -15 -398 -68 164 -100 17 187 -9 78 -260 60 -113 299 -51 165
1987A65K5m48L01L8n1o6Q7j6K81n14J44nK1j99K37N2k34L06j76J00k36L53j9j33
$$ 165 190 -258 43 81 30 -36 51 35 316 -198 -54 -59 -38 -237 0 52 -182 124 -52 48 -188 165 146 13
2011A3n5r9K45q4k62J17J05j50k1P1j11j97N48jj56L2J51r2K00k18Q0j34J33j61
$$ 13 -42 -141 104 20 -242 -125 -20 -170 -191 -120 -231 -428 120 119 -37 -5 146 54 254 36 116 -18 115 -46
2035d6P9K64l51O9J54l95j30K94J38k52k58L18K67q0o5J7L58l84J49jk54M15j82
$$ -46 33 297 -54 15 169 -226 -356 -62 76 -176 -434 -116 151 71 6 23 381 -3 146 145 -109 306 124
2058A24n5k63l5k9J91Q7k89K64J60k71J49j06q7L25k43R3L59l24j73L37J18k20
$$ 124 69 -194 -229 -258 -67 20 -269 -5 155 -116 33 -73 -160 165 -78 15 374 50 -123 214 332 112
2080A12j27J35r9m57K64K70J5l14R2K35j73j67N02m64q9L10j1K41j22j19j42L01
$$ 112 -15 120 21 -436 -172 98 113 -201 -109 126 -47 -214 288 -176 -265 45 34 275 153 34 -108 193
2102A93j75k2L16o45K94k32L86k63l5L07M8l94k03K13L83p3p0L84p2l68J22J09
$$ 193 18 -4 312 -333 -39 -271 115 -148 -183 124 172 -222 -425 -212 171 98 28 412 340 -28 94 203
2124B03j83m4lnK23j31Qm05K11m5k29J55K45k03K72J47j56J99j00R7k10l2J35
$$ 203 20 -24 -27 -32 191 60 68 -337 -126 -171 -400 -245 0 -203 69 216 60 259 159 256 46 14 149
2147A49M8j90O4O0j94Q7o3J2q4j38L45J35j74J33k3n6l62J8M47j07k4Q3j54J24
$$ 149 197 7 71 131 -63 24 -39 -27 -111 -249 96 231 57 190 167 111 -251 -233 214 107 83 166 12 136
2171A36QN3l23J24J83l01Jm7J24J68k34L01j21k00K29j79Q2R2L75m17J02n1o1
$$ 136 144 197 -126 -2 181 -120 -119 -166 -42 126 -108 193 72 -128 101 -78 4 96 471 54 156 105 44
2194D4J9pm0j01J48j36K23n05M89l27j62O3L34%j53O6L15l38K57l47K20l5j64
$$ 44 63 56 16 -85 63 -73 150 -355 134 -193 -355 -292 42 42 -111 -45 270 -68 189 -158 62 27 -137
2217a37J89j86K24k3j54j4L2N1K31o37M23J84k08J1O5J20j03L6q7j97J38K33l41
$$ -137 52 -134 90 67 -87 -101 -69 -18 213 -424 -1 183 -25 -14 51 171 68 104 17 -180 -42 191 -150
2240a50J21J8j67l9J32l7J3J76p6J83k06K14k88J74l9l2J35l23J65J07j57n1j44
$$ -150 -29 -11 -178 -217 -85 -122 -109 67 -9 174 -32 182 -106 68 29 -3 132 -191 -26 81 -76 -127 -271
2263b71M08J05k55j61L17L6j47o6k27L58j68q1J50N3J15l50J61J33j1K7K5j81
$$ -271 137 242 -13 -174 143 179 32 -34 -261 97 -71 -152 -2 51 166 -184 -23 110 99 126 151 -30
2285c0k90M94n8l99L35j27K08n18K40J23jJ33j54K1M1J53j43L62l87m1N8J81k22
$$ -30 -320 174 116 -283 52 -75 133 -385 -145 -22 -23 110 -44 -23 18 171 28 390 3 -38 20 201 -21
2308b1k73L69j3k8j80J31k89J57J7J23L40m03K3O1j5j49J9K31j11K23j44J9j78
$$ -21 -294 75 62 34 -146 -15 -304 -147 -130 -7 333 -70 -47 14 -1 -150 -131 100 -11 212 68 87 -91
2331i1K1L06l85K51j83%L7N5p5L0K12k0j56J23j75q7K03J09k98L36k61J15j47
$$ -91 -70 236 -149 102 -81 -81 -44 11 -64 -34 178 158 2 125 -50 -137 66 175 -123 213 -48 67 -80
2354h0j38J29k9j0K25j99l0J1J69J29k14j34K84p3J41l42p7N04n17J41K32K8m42
$$ -80 -218 -89 -118 -128 97 -102 -132 -121 48 177 -37 -171 113 40 181 -161 -238 266 -251 -110 122 150 -292
2377b92J77K94j05L4j54j90q6K04j13k4K35k06K39Q1m8k04R9J36m3j14J41q1N6
$$ -292 -115 179 74 108 -46 -236 -322 -118 -231 -255 -20 -226 13 94 46 -158 -59 77 34 -80 61 -20 36
2400C6j34J21j82K0J36j52K18k23K8K29m5j86J79j03q3j3L44k85L2j25J62J19
$$ 36 -98 23 -159 -139 -3 -155 63 -160 -132 97 52 -134 45 -58 -141 -154 190 -95 -63 -188 -26 93
2422I3q1k14K73o7J32k41L37m20J33J95N6j25Q5MRl70R2K12j65kJ66k65R8l4j77
$$ 93 12 -202 71 4 136 -105 232 -188 -55 140 196 71 156 160 169 -201 -109 103 -62 -64 102 -163 -65 -99 -276
2447b76M02k86M25k34j27KJ86r5J31jk61K75j94j31M46j73R1j15R8k04m5K24n31
$$ -276 126 -160 265 31 -96 -94 92 -3 128 127 -134 141 -53 -184 262 89 180 65 163 -41 -86 138 -393
2470c93N92k28P0m7N6j06J3O2Q7o8L00Pk94nq9J3j95O5M6l0j3J86J36j83qJ99
$$ -393 199 -29 41 -6 50 -56 -43 19 106 38 338 345 51 46 -43 -30 -225 -160 -114 -144 -157 29 165 -18 -26 173
2496A73l39k4r5N17j6j92J55k14K80l15K12l5J1m32K46J58j9j56rQ5J04l69q7
$$ 173 -166 -190 -285 232 216 24 179 -35 245 -70 142 107 118 -314 -68 90 71 -85 -94 -9 95 -274 -361
2519c61M22n4j67q8K05J32k3k08N3M9J42j18k07J51o1N3m9O3R3j41K61k02O2j26
$$ -361 61 7 -160 -248 -43 89 66 -142 -89 -40 102 -16 -223 -72 -133 -80 -129 -66 27 -114 147 -55 7 -119
2543a19M67l97K32j74N4RK3k72L73k04J94k67J76j53j59M03k59P4K7k79N46j72
$$ -119 348 -49 183 9 63 72 95 -177 196 -8 186 -81 95 -58 -217 186 -73 1 28 -251 295 123
2565A23q9j3l0J30k42L96m58J70q1K59l31K26l60j16M30LJ9J4q0J68j86j25L07
$$ 123 34 21 -9 121 -121 275 -183 -13 -94 165 -166 60 -300 -416 14 17 36 50 -30 138 -48 -173 134
2588A34l1j68p2M58k41J69o0j59Q0q6k25K45j63P7k56K82R7l04Q5M83n59O9J20
$$ 134 103 -65 -137 321 80 249 189 30 110 24 -201 44 -119 -42 -298 -16 81 -223 -138 345 -214 -145 -25
2611b5J41j64K12k17o6L8j23M75m68J68k19l8J96O9J1k25K10K77k70l40L43j68
$$ -25 116 -48 164 -53 -119 -81 -204 271 -197 -29 -248 -286 -90 -21 -10 -235 -25 252 -18 -358 -15 -183
2633a83K17J90j76K34r3O3l24j42L50k71L63n50M5K69m3J71k6PN9l6k31o5J19
$$ -183 34 224 48 282 189 252 -72 -214 136 -135 228 -322 -277 -8 -51 120 94 101 160 124 -107 -172 -53
2656e3J03j31P2KJ64n4j1P3k78P0J53k84j27k2JK51j85L46o8R0q9Q4p9K26k58
$$ -53 50 -81 -9 -7 157 103 92 165 -113 -43 110 -174 -301 -323 -322 -71 -256 90 22 112 23 107 28 254 -4
2681dJ49j41k95J83K32jJ70l17k08L51J72l78m7J72j02P8k11M8J93j41L39Q0m40
$$ -4 145 4 -291 -108 124 123 293 -24 -232 119 291 -87 -134 38 -64 14 -197 -149 44 -97 242 322 -118
2704a18m0J25j24J84N6j43lk15L00r4RJ60j10q6j1N4J14oj38L4JR1k84O17j72
$$ -118 -158 -33 -157 27 83 -60 -63 -278 22 -72 -63 97 -13 -99 -110 -56 58 52 -86 -52 -51 40 -244 373 201
2729B01j19k0k37L97m67P0M33l43Lj7J71K7L7k48J4m8J86j34M7OK6j1J31k81o4
$$ 201 82 62 -175 222 -245 -175 258 -85 -82 -99 72 99 136 -112 -98 -146 40 -94 -47 -41 -15 -26 105 -176 -240
2754b40K83j89K01M1j27k00L35pk47J91J1j95L2J70k5j47q4K80o6Qk06L32J92
$$ -240 43 -146 55 96 -31 -231 104 97 -150 41 52 -143 -111 59 34 -113 -197 83 17 25 -181 151 343
2777C43l67m3K41k8o8j17k16J77Q4j35M4M6kK8O8J12k48L23m0l27N2L7m8j83J62
$$ 343 -24 -67 174 146 78 -39 -255 -78 6 -129 -85 -39 -41 -13 55 167 -81 242 202 -125 -73 -36 -84 -267 -105
2802a05P9k36J95j24K30p3k30K72l66N10k6l07K30K2N5l0k53R2P7K13N0l25J00
$$ -105 -26 -262 -67 -191 39 -34 -264 8 -358 152 126 -181 49 71 126 96 -157 -65 12 225 275 -50 50
2825E0j32J43k00n2J12L6j42K37M6j53n8p4L94j25j61L32m60K02o2RML07k00j99
$$ 50 -82 61 -139 -191 -79 -43 -185 52 98 -55 -113 -187 207 82 -79 253 -207 -5 -67 -58 -54 253 53 -146
2849a46J13M8j8K5O2l43N21n3q0O4j12N5q4O2K5k26k7P3N9k27L23k73K04o2j9
$$ -146 -33 15 -3 22 84 -259 262 209 129 193 81 136 52 114 139 -87 -114 -41 18 -209 114 -159 45 -17 -36
2874c6n9K37k10k21K48n3q0Q5P8j20K03q6O1j35k63M68k42L88m77k0L69q1j02
$$ -36 -95 142 -68 -289 -41 -94 -174 -89 -11 -131 72 -14 47 -88 -351 117 -125 263 -214 -234 135 54 -48
2897d8j56J92J0L55l36J92m88L44P2l4m91K03J86l6N9N2o1l1j46K16k25K79j49
$$ -48 -204 -12 -2 353 17 209 -279 65 137 103 -388 -185 1 -35 24 76 15 -16 -162 54 -171 108 -41
2920d1k53K14p9J09J95j64r9M61j61k33Q9k0J3K14l49r7J45j43M38l06J88k5j92
$$ -41 -294 -80 -159 -50 145 -19 -118 343 182 -51 38 18 31 245 -104 -201 -56 -199 239 -67 121 96 -96
2943i6K06m3k41J11Q6j17J75k44L14n6j44L0j14K20j58MJ00r9J16j62O8j34Q8
$$ -96 110 67 -174 -63 23 -94 81 -163 151 95 -49 -19 -133 87 -71 -67 33 -66 50 -112 -44 -178 -90
2966i0L6M1j14p5j01o4J67J37j7L69L5m06K06n1j69J71K16k76j66J74k98P2L07
$$ -90 -54 -13 -127 -202 -303 -367 -200 -63 -80 289 324 -82 124 73 -96 75 291 15 -151 23 -275 -203 104
2989A04J4j81J66j49n3M6j61L74O5jl32K20J05k74J43j66K25j72l1J17j69o3J89
$$ 104 118 -63 103 -46 -99 -53 -214 160 225 224 -108 112 217 -57 86 -80 145 -27 -58 59 -110 -173 16
3012A6L2r0J28L6j29R9nP5j05l8q2K5K84k89j2j82M31k45m8m3J89j28Q6R2j28
$$ 16 48 -42 86 122 -7 92 87 162 57 19 -63 -38 246 -43 -55 -237 194 -51 -99 -142 47 -81 5 97 -31
3037c1p1P3K10j71l3k1R3K2q8j08q2M93l76K68j21k43L4J10K0k9Q0q1L4j34J22
$$ -31 -102 -29 181 10 -23 -44 49 71 -17 -125 -207 286 -90 178 57 -186 -152 -42 -22 -51 29 -52 -18 -152 -30
3062c0k7K20j49J0J0j00q3L40R2l86J08k0j00k2J75N5l47N8K00j76K11l9J04K6
$$ -30 -57 163 14 24 34 -66 -149 191 283 -103 5 -15 -115 -137 38 93 -254 -196 4 -172 39 0 104 130
3086A30q8j70M85l09J46j25r0k36J14K70K7k77J09jk28K52j89J95p8J44q5M0m2
$$ 130 42 -128 357 48 194 69 -21 -257 -143 127 154 -123 -14 -15 -243 9 -180 15 -63 81 -4 36 -6
3109fR0j36o8j08K46K53k33qj01k46L88j45l9k6J59j24R7J08m29L47q9J48l5M
$$ -6 84 -52 -120 -228 18 271 38 30 -71 -317 71 -74 -113 -139 20 -104 -7 101 -328 19 -70 78 43 47
3133D7O2j89J91q0J13n39K56J33j5J80l34j54M94j7j71J49k54K70j31K27k62L48
$$ 47 109 -80 111 31 144 -395 -139 -6 -21 159 -175 -329 165 148 -23 126 -128 142 11 238 -24 324
3155C24m53J63k08L37l93M49l96J61J66j71R8k25L39L8o7r2j23J9R0J2J23l46
$$ 324 -129 34 -174 163 -230 219 -177 -16 150 -21 77 -148 191 229 162 70 -53 -34 56 68 191 -155
3177a55K47k1J5p5n0J80M4j78r3j79J77j24Q0M5l2J04N8j7Q6k14j25M77k94K92
$$ -155 92 71 86 11 -39 141 185 7 -86 -265 -88 -212 -132 -87 -119 -15 43 26 112 -102 -227 250 -44 248
3201B48r4n9k62J66j70J94K75l15l6M6J99m61J92J85J81j29j14j68j6K16j05J32
$$ 248 154 95 -167 -1 -171 23 298 -17 -53 -7 192 -269 -77 108 289 160 46 -122 -138 78 -27 105
3223A05N0M2k63K0J0R2j8j87l9J20L07K4j2k94j19L21J92j59K5k33l0J35n8j68
$$ 105 155 197 -66 -46 -36 56 38 -149 -188 -68 239 263 251 -43 -162 159 351 192 217 -16 -46 89 31 -137
3247a37L68k31J63j10M8k13J59r5k25K46j00l4J61Q7LN4l85L23k49L50m88L02
$$ -137 231 0 163 53 101 -112 47 -48 -273 -27 -127 -161 0 87 90 144 -241 82 -167 183 -305 -3
3269cj00K47l2K4k41j30R0J75K0k35L12j68O5j46M01l23J53j96k15j06P07n09
$$ -3 -103 144 112 136 -105 -235 -145 30 50 -185 127 -41 24 -122 279 -44 109 -87 -302 -408 299 -210
3291b10L64N5j64j41L8j08L2J55j51J19k65K68O9l10L44J49l09j25L48m29L79
$$ -210 154 209 45 -96 -58 -166 -134 21 -130 -11 -276 -8 61 -249 95 244 -65 -190 158 -271 108
3312A08l76L44K67m69M4L9Po4J07n9p9O6L3l49N68m35J05K44j70K38j27ll82L48
$$ 108 -268 76 343 -126 -82 -43 -36 -100 7 -52 -131 -65 -32 -381 187 -248 -143 101 -69 169 42 39 -343 5
3336Ej00P3J06N9j29k01K25M5k74L80k59J01j24P5j84L43l35J51j47N1J33j04
$$ 5 -95 -22 84 143 14 -187 38 83 -191 189 -70 31 -93 -18 -202 141 -194 -43 -190 -139 -6 -110
3358a10r1J33NK00n05K71J94M3k03p0K70J00j33j92K34k98J70j31j7P5J51P1j97
$$ -110 -201 -68 -63 137 -368 -97 97 140 -63 -133 137 237 104 -88 146 -152 18 -113 -130 -55 96 167 -30
3381c0J4M7L4oL83j63k76q9n6J08J41k50J7p4K25k07K87l86J23L22k39J17m1J53
$$ -30 -16 31 65 59 442 279 3 -86 -142 -34 107 -143 -126 -200 25 -182 105 -281 -158 164 -75 42 1 154
3405A54j61k56J64l2j7J03J06J99m31J64l60O3N27R9k03l82J29K10q4j73K24L8
$$ 154 -7 -263 -99 -131 -148 -45 61 260 -171 -7 -367 -304 223 322 119 -263 -134 76 -8 -181 43 81
3427H1l26M62k46n8K86l48N0K8j5j28L27j22K97m06N2m1K42j17J28k38K35l67
$$ 81 -245 217 -29 -87 199 -149 -99 -71 -86 -214 113 -9 288 -118 -66 -107 135 18 146 -92 143 -224
3449b24K31J79j97J10q3J64p2p7ol48M08MK0M5j95K16k83J86n89N23J8k38J70
$$ -224 7 186 -11 99 16 180 108 31 25 -323 85 89 109 154 -41 175 -108 78 -511 12 30 -208 -38
3472c8J2j06j56M10l38L50p6k0j59L89o60K62k38Q0K34J43N5rl4k15K63n5k44
$$ -38 -26 -132 -288 122 -216 134 58 38 -121 268 -392 -130 -368 -288 -54 89 144 135 101 -114 149 94 -150
3495a50j22K77j85p7L08m1r8J92K05j61J02j25j91K01k99L61k43R0J11mj05j32
$$ -150 -272 5 -180 -257 51 10 -88 104 309 148 250 125 -66 135 -164 197 -46 44 155 151 46 -86
3517h6j3J70k65K35j15R7j74J92J94j43j56R9j13mq6J35R2j37K5J38J08j71o5
$$ -86 -99 71 -194 41 -74 23 -151 41 235 92 -64 35 -78 -82 -168 -33 59 -78 -53 85 193 22 -43
3540d3N0K5O1j01M7j07j46K73j39m9K49l65J61L36l63J42K7l05J24J08j61PJ42
$$ -43 7 32 93 -8 39 -68 -214 59 -80 -129 120 -245 -84 252 -111 31 58 -247 -123 -15 -176 -169 -27
3563b7R8P4k69O1m0m0J95J07j61j86L09k76J38J22M8j58J17k65J27P8j18j98L52
$$ -27 71 145 -124 -63 -103 -143 52 159 -2 -188 121 -155 -17 105 153 -5 112 -153 -26 52 -66 -264 88
3586H8j98J98j08q0K18j53pk6Q7j08K8P1J06q6k50L81k62J1L4m9R5k02P2K60m6
$$ 88 -110 88 -20 -100 118 -35 -42 -68 19 -89 -61 10 116 30 -220 161 -101 -90 -56 -105 -10 -212 -140 120 74
3611G4Q1l24O2nJ16l8j26n7L30J1j93O2M0j8Q1PKJ20ok47r6n2J25k21K93J12j1
$$ 74 155 -169 -107 -112 4 -34 -160 -217 113 124 -69 -7 33 15 96 103 105 225 219 -28 -124 -176 -51 -272 21 133 122
3638A22J00j56k07L28k11j5J62j63R8J13j20p9L1l2L4r0K4l9O5r2K05k86K49J43
$$ 122 222 66 -141 187 -24 -39 123 -40 58 171 51 -28 3 -29 5 -85 -61 -100 -35 -127 78 -208 41 184
3662A84j00k57R8L00j32k8j94P6J80lL7Q7k43j81L50o3M6k67L45k65R1j86K66
$$ 184 84 -173 -75 225 93 65 -129 -53 127 124 161 248 5 -176 174 111 157 -110 235 -30 61 -125 141
3685A41L6q1o3K20j82Mk24K20j26K90j17K2j77J65j36k6p5k65K20P6J84l3P3j81
$$ 141 177 96 33 253 71 75 -149 71 -55 235 118 140 -37 128 -8 -34 -109 -374 -154 -78 106 73 146 -35
3709c5m2J74k15kK23kO9k97q7P8R3K3J54l89J89Q3J08l7J04j73rj3n4J70j78q6
$$ -35 -77 97 -118 -120 103 101 170 -127 -214 -136 -43 -20 134 -255 -66 17 125 88 192 19 10 -3 -57 113 -65 -151
3735a51L02k41o7O9j48K3L88k02l8K54j98L52l66j34O1J14j33J86k52J07J48k03
$$ -151 151 -90 -157 -88 -236 -213 175 -27 -65 189 -9 343 -23 -157 -96 18 -115 71 -181 -74 74 -129
3757a29K42J31r5l9j72K7R0O5J19k30k81P16m13r1j10K35J07j59N1k27l1Q7J28
$$ -129 113 244 149 110 -62 -35 55 120 239 9 -272 444 31 -60 -170 65 172 13 64 -163 -194 -107 21
3780B1j49M10n46K63j64J48J48j73J40j56mj2k80L74n0k7l4J72q5K3M7p5M0Q1
$$ 21 -128 282 -264 -1 -165 -17 131 -42 98 -58 -62 -74 -354 20 -30 -57 -91 81 -4 19 66 -9 31 112
3804A12N6j20p9J42K7j36k21J75m4j78K88O0j89K53J89m37K56k41j66J48k7J39
$$ 112 168 48 -31 111 138 2 -219 -44 -88 -266 22 82 -107 146 335 -102 154 -87 -253 -105 -132 7
3826GK52l32j6o6J06m2K1K3N3p9R0j10J48q3J03k00L36l94p4M64j69N37n89J07
$$ 7 259 -73 -89 -155 -49 -91 -70 -47 6 -73 17 -93 55 -28 75 -125 211 -183 -257 207 38 575 -14 93
3850I3q8l5P3O2J05n17K80k54J40K89J19j81j01l88M58n7K28Q9l71l5j54J49L44
$$ 93 5 -30 43 105 210 -307 -27 -281 -141 148 267 86 -15 -403 55 -2 226 315 -56 -91 -245 -96 248
3873B48k46p4J53j35P6P4j01M9M2R1k30J01j44K23p9P5l23L78j89k9O9P5l9n3
$$ 248 2 -72 81 -54 22 96 -5 44 86 177 -53 48 -96 127 48 123 -200 178 -11 -40 29 104 65 12
3897A2K73k12J16k45qK13Q5m05J56k41J63k8J30p3rJ29J91k55N2q2J87k48P1O1
$$ 12 285 73 189 -56 -64 149 234 -171 -15 -256 -93 -121 9 -64 -73 56 247 -8 44 -38 149 -99 -28 33
3921C3j1Mj48j45M19l8k01o7Q5J34j21p6K0K60k64K66j46k1J4l3K38k21j4J38
$$ 33 22 26 -122 -267 152 114 -87 -154 -69 65 -56 -132 -112 148 -116 150 4 -17 -3 -36 202 -19 -33 105
3945A05k91K44k77J19R8k1j8oJ2j39R7jL55k23p5J93q2m7K91j36j2K1k06o5m0
$$ 105 -186 58 -219 -100 -2 -23 -41 -47 -35 -174 -77 -78 277 54 -21 172 90 43 334 198 186 207 1 -64 -104
3970a04n4J60J05P0k34R4q9n7K46k47K65j68k83K47K75l13K04j20L2J00J49k80
$$ -104 -158 2 107 177 -57 37 -52 -109 137 -110 155 -13 -296 -49 226 -87 117 -3 29 129 278 -2
3992bJ74j93K05l85J62j33J95jJ59k02J63K8j81N4J84l08k35K99K81j63k17L05
$$ -2 172 -21 184 -201 -39 -172 23 22 181 -21 142 170 -11 43 227 -81 -316 -17 264 101 -116 189
4014A89o4k47J68k04J55j3J33p4j33Q4j62L30k07J78j67L2mJ04j8o9J12O6n33
$$ 189 125 -122 46 -158 -3 -16 117 43 -90 -6 -168 162 -45 133 -34 -2 -6 98 80 11 123 189 -344
4037c44K77K13j35k2L8M1r5L35j49n06J39M80l72K2oK1L7J54j14k73L52o8N1k86
$$ -344 -67 146 11 -11 27 68 -27 308 159 -347 -208 272 -100 -78 -84 -63 -26 128 14 -259 93 25 76 -210
4061b10L71k41J20J65m3m82L61l5K76l50L9nj81L56q0J89k08k23J22l6j2P0N7
$$ -210 161 -80 40 205 162 -320 41 6 282 -68 -29 -34 -215 141 61 250 42 -181 -59 -95 -107 -37 20
4084B0k80J95j33R3P0J85J63o00K93K61l93J60p5L9l9J61k30L83k82k58N6N2J48
$$ 20 -260 -65 -198 -105 -35 150 313 -287 6 267 -126 34 -41 -2 -41 120 -110 273 -9 -267 -211 -159 -11
4107a1L5k4j20J02j99J42L90l10k73N00j33k20K61m0k53K89j46Q4j08j77N03l75
$$ -11 24 0 -120 -18 -217 -75 315 5 -268 232 99 -121 140 100 -153 136 -10 74 -34 -211 292 -83
4129h3j42J80J89l80K83K26l21N9O9k61j2L52k64K29j91k9K69j28J29j14jK5M0
$$ -83 -225 -45 144 -236 47 273 -48 11 80 -181 -193 159 -105 124 -67 -96 173 45 174 60 59 84 124
4152A24k74J99l8j46L13j55l00K04K3qL86k12L0j54j22N86m98j8K90n49R1R5J06
$$ 124 -150 49 11 -135 178 23 -277 -73 -50 -58 328 116 146 -8 -130 456 -42 -60 230 -319 -228 -133 -27
4175b7M44o09J90k09P1K33p4n2kk1K80k22J94k7j73j13K36r1PK23j03k78J35J97
$$ -27 417 -192 -2 -211 -140 93 19 -33 -35 -56 224 2 196 169 -4 -117 119 28 35 258 155 -123 12 209
4199B09m44M82k89l8K24r0k19j27J92M7J81j69J71m18L46k32L25j28k9k3K85k6
$$ 209 -235 247 -42 -80 144 54 -165 -292 -100 -53 128 -41 130 -288 58 -174 151 23 -6 -29 256 230
4221B30l67lJ87R3k79J82Q9k04Q5K1k57Q8L51Jl10j84J89K44l73j8L24L87n11
$$ 230 -137 -140 47 140 -139 43 132 -72 13 34 -223 -135 216 217 -93 -277 -88 156 -217 -235 89 476 -35
4244c5K06j86j99M61j71k1k05J79k44J66Q0j14J40J66l82N3j38J05K28j6j5l54
$$ -35 171 -15 -214 247 76 55 -150 29 -215 -49 31 -83 57 223 -159 -106 -244 -139 89 73 58 -296
4266b96K60J76M5j02q2k4J38j58r1K24p7K6k81J04J75M1k46R9M22n69J94J17k66
$$ -296 -36 140 185 83 1 -23 115 -43 -134 90 13 39 -242 -138 37 78 -168 -69 353 -216 -22 95 -171
4289a71K84k80l7K60J41o5q0j33J02J15j06m0m8q4k03K65m9P3O1p9p2J14K35k01
$$ -171 113 -167 -204 56 197 132 52 -81 21 136 30 -10 -58 -142 -345 -80 -129 -56 5 -74 -146 -32 203 2
4313Bn9K79k84J03k42M19k16j19j17K33j69J51j6j02K00l9o2L5p6j27L24n2j4
$$ 2 -57 222 -62 41 -201 218 2 -117 -234 -1 -170 -19 -35 -137 63 24 -38 -3 -79 -206 118 66 52
4336E2MQk3J00j51R3k22O6O7K48r5N5k57k0jL20k88j67L44M8k57K03k48j80K84
$$ 52 56 64 41 141 -10 83 -139 -73 -6 242 147 202 -55 -75 -76 244 -44 -211 133 181 -76 127 -121 -301 -17
4361a7j3m8p9j35L16J13j70P1j94N0J9k5k2K34j0O5k90l1kk6J89k83L24j90K14
$$ -17 -30 -78 -157 -292 24 137 -33 38 -156 -106 -87 -112 -134 100 90 155 -135 -166 -168 -194 -5 -288 36 -154 60
4386F0j20p8J56n6K55l34O9J63K38n36M61k97mJ6R4rj9Pk73L67l00J61J5q5K52
$$ 60 -60 -138 18 -38 217 -117 -48 115 353 -183 278 -19 -23 -7 87 78 59 66 -207 160 -140 21 36 -49 203
4411B03k52k8L7K2o6o1m1K07k82K79J9k02l21K32J66J17j58m3M40l78J25L6o8
$$ 203 -49 -77 -40 -18 -84 -145 -186 21 -261 18 37 -165 -486 -254 -88 29 -129 -172 268 -110 15 51 -17
4434a7P1k6l7O7l4j10L07j65k73N7K3K83k00r7J33M3J87l00J91k98K68K2k76j76
$$ -17 54 28 -9 58 24 -86 221 56 -217 -160 -137 146 -54 -151 -18 25 212 -88 103 -195 73 95 -181 -357
4458c57M02J07k3j58J32k81K57K49o00L19j61P9K52k44J9o4R7k50K57J37j48k0
$$ -357 45 152 129 -29 103 -178 79 328 -272 47 -114 -35 217 -27 -8 -72 25 -225 32 169 21 1
4480AK29m89j5J27L21k11J17k24K39R3n85J41K12P9Rk6O2m2n6J23n0j67J19m72
$$ 1 230 -259 -274 -147 174 -37 80 -144 95 188 -397 -256 -44 35 44 18 80 38 -18 105 55 -112 7 -465
4504d65K12N37l35K10j86j86L03j51J84l1k32R6J8J42k5j37r5K89j61Q4j64OK35
$$ -465 -253 284 -51 159 -27 -213 90 -61 123 92 -140 -44 -26 116 91 -46 -141 148 -13 71 -93 -87 148
4527A48l52J17J93N4k95P2J8j61N04k67J15k33o5M38k48r1J12k63J9K43j17j48
$$ 148 -204 -87 106 160 -135 -63 -45 -206 298 31 146 -87 -152 286 38 -53 59 -204 -185 58 -59 -207
4549b07K99j79K27j36j7Nn1Km0kJ20J47m66N0L37j22m2O7J41l12K11j93p4N2M9
$$ -207 92 -87 140 4 -13 -8 -59 -57 -97 -99 21 168 -298 -248 89 -33 -75 -8 133 -179 32 -161 -235 -183 -134
4574a34L96k94j70J18k67O7L12m4Qo1J2K36j96K84m93Q2lN46m97J10J2J18k52
$$ -134 262 -32 -202 -84 -351 -284 28 -16 -8 -69 -57 179 -17 267 -226 -144 -147 399 -98 12 24 142 -110
4597a10K64l74n4j5L93J6k87K83K2k12J71q6j75L69k41r5K92r5j65Q8N1oN1j75
$$ -110 154 -220 -274 -289 104 120 -167 116 138 -74 97 11 -164 205 -36 -131 161 66 -99 -11 40 34 85 -90
4621i0Q3o7K29K8j52O6l47K26k02M10o3k55O5J46l0j83j25M46l20K47j01P9o1
$$ -90 -7 -74 155 183 31 97 -250 -24 -226 184 121 -134 -69 77 47 -136 -261 185 -135 112 11 90 29
4644B9j97j17J58k1J94J69l11r5K42lJ02k42P1K36m53N3K25J06l76M68k59J61
$$ 29 -168 -285 -127 -148 46 215 -96 -191 51 48 150 -92 -21 215 -238 -185 40 146 -230 238 -21 140
4666A40K6O5l65J85k6j10j23L08R8j51j27P8L78n95K06RK6j12K13k48L64j2m10
$$ 140 166 231 -134 51 25 -85 -208 100 198 47 -80 -2 376 -219 -13 -4 22 -90 123 -125 239 227 -183
4689a83J59R3m4L1j79N5j99K27R3k13J13L9kJ66j94J23l1j08o1J79M2j48K8j64
$$ -183 -24 69 25 56 -123 -68 -267 -40 53 -160 -47 -8 -10 156 -38 85 54 -54 -115 64 106 -42 -14 -178
4713a78J41Q8K61m64R1K36j85k10J58J51o9Q0oQ6Rm08L04O1M9k30L0J46k38m4
$$ -178 -37 51 312 -152 -61 175 -10 -220 -62 89 20 100 94 180 189 -219 85 146 195 -35 -5 141 -97 -141
4737a41J2j54K65p1L96j86J28k74j71J43k14J51J9N6J45j82K06j7j33J10o0r0
$$ -141 -129 -283 -18 -89 307 121 249 -25 -196 -53 -267 -116 -97 -41 104 -78 128 111 -22 88 28 -62
4759f2r1R3J66k20J58oNj32J13K6j74Jo4R4J14k43K23j67J52J28o9j87o0J96k71
$$ -62 -153 -60 106 -114 44 38 43 -89 24 50 -124 -123 -187 -93 21 -222 1 -166 -14 114 45 -142 -202 -6 -277
4784b77R1J11K07j63N3j32M76o21K50J07k12n2j01M52j10R2n4Nj20R4j82Lj03
$$ -277 -186 -75 132 -31 22 -110 366 -255 -5 102 -110 -162 -263 189 79 171 117 122 2 96 -86 -83 -186
4807a86J9J05Q1J55k47rn5L33j44J17j07k23K99k9r0r3P5r9Q9P1q8R6P2j54pJ16
$$ -186 -167 -62 19 174 -73 -82 -137 196 52 169 62 -161 138 109 19 -74 1 -98 -9 62 -26 70 142 -12 -19 97
4833I7j69J39j40J56R0j70p6R6O6k44O5j35J36K09Nj22k68M27k41M6k84K73L75
$$ 97 -72 67 -73 83 173 3 -73 23 89 -155 -90 -225 -89 120 125 3 -265 162 -79 -33 -317 -44 331
4856C31k34l37K94J50k32M38n15k23M48K69m32J97r0J07l74K6L91j63N1J1j79
$$ 331 97 -240 54 204 -28 410 -105 -328 120 389 -43 154 64 171 -203 -177 214 51 102 113 -66
4877f6J21pR3k93J44M5J56k55r3K84k1j05j25K43j3j71J61k57J40j3j06k9M87
$$ -66 55 48 141 -152 -8 37 193 -62 -155 129 108 3 -122 121 108 -63 98 -159 -19 -32 -138 -167 320
4900C20l00q1K86j59K63l74J7K11j03J64l76L78l24K3O0l6K37l55L46j76N9n7
$$ 320 20 -61 225 66 329 -45 -28 183 80 244 -132 246 -78 -55 5 -31 206 -149 197 21 80 23
4922B3j42J12j16k5M58l10j12J21J39q9j80J84k56M40k14j03M7P2k21N1K30j88
$$ 23 -119 -7 -123 -148 310 0 -112 9 148 59 -121 63 -193 247 33 -70 -23 49 -172 -121 109 -79
4944g9l0m0O2J71P3l04o0N10n9k87J10k08J80rj32j44M08j19J84l26J67q0m3J50
$$ -79 -109 -149 -87 84 157 -147 -207 303 244 -43 67 -141 39 30 -102 -246 162 43 227 -99 68 -12 -55 95
4968I5j26J63k41J9J04n5K23k89n0K48j31K6j85J99M2j3j48j65K47P2K47l19j43
$$ 95 -31 132 -109 -90 14 -41 182 -107 -157 91 -40 -14 -199 0 42 29 -119 -284 -37 35 282 -37 -180
4991a80J46k43N58l66Q5j92J75j06j63K6J46P1J99k1J64j92j48j11pL21k23L00
$$ -180 -34 -277 281 -85 0 -192 -17 -123 -286 -260 -114 -43 156 135 299 107 -41 -152 -159 162 -61 239
5013B39k09J23j27m0O3j21L46k81L0J9J3Pl5j69J66o3j41L27M1k74J26k00l1L37
$$ 239 30 153 26 -14 49 -72 274 -7 23 42 55 62 27 -142 24 -39 -180 147 188 -86 40 -160 -191 146
5037A46l70K44N4l19L48K09k22k20K70J09k94M4J36j35q3l4J16j53k1J32jO2j06
$$ 146 -224 20 74 -245 103 312 90 -130 140 249 -45 -1 135 0 -83 -117 -1 -154 -175 -43 -44 18 -88
5060h8NK8j46L01j26J73j67j79pK58O3p8J33o7j48j4R8R6k35K81l60R7N8m2J72
$$ -88 -83 -55 -201 100 -26 147 -20 -199 -206 52 115 37 170 103 -45 -59 39 135 -100 181 -179 -82 -24 -66 106
5085A06j89J27J27l83L95l0k8J67m69L0J42k11K20j85J71R0l09M17Qk64K41k44
$$ 106 -83 44 171 -212 183 153 125 292 -177 -147 -5 -216 4 -181 -10 80 -229 188 196 -68 173 -71
5107g1L87n08L11J62j48k95O9M3M7P1j42J04j45k32L45l71M59J10K3o4k73J35
$$ -71 316 -192 119 281 133 -162 -93 -50 -3 68 -74 30 -115 -347 -2 -373 86 196 219 155 -118 17
5129A7j3K24k65o8J06J39j40K62l81NJ62o7K23l05k56M13K51k54j89M57j81o0
$$ 17 4 228 -37 -105 1 140 0 262 -119 -114 48 -19 204 -101 -357 56 307 53 -136 321 140 80
5151H0k20K52r5l66J34J40J57j88K13l51Q7K08m7M7o9l31L37l1J67j66J67J12
$$ 80 -140 112 17 -349 -215 -75 82 -106 107 -244 -157 51 4 51 -18 -349 -12 -43 124 -42 125 237
5173B37j73Qm9M7r1R3k31M4P9J8j46P6K56k16J32l44J75K13k38j13M53k27l43
$$ 237 64 72 23 70 -21 72 -159 -115 -36 -18 -164 -88 168 -48 84 -260 -85 128 -110 -223 230 3 -340
5196c40N55j27j13J03j48r0R2K14p6p5QJ48r5N5m8j00K42k88J40r3J17J19j54
$$ -340 215 88 -25 78 -70 -160 -68 146 70 -5 3 151 56 111 63 -37 205 -83 57 -36 81 200 46
5219D6j98K51l32L39j27j84J93OJ05J5p0J07k63J04L4R6J32m06j64K51K51k88
$$ 46 -152 99 -233 106 -21 -205 -12 -6 99 114 44 151 -112 -8 26 122 254 -152 -316 -65 186 -102
5241a02R4o3L4J42J16k11J00j7p9p3K50j89pR1k89J51l6K16o4j05Q0Q5j00J02
$$ -102 -8 -71 -37 105 221 10 110 93 14 -59 191 2 -5 86 -203 -52 -88 128 64 -41 39 124 24 126
5265A26l97L03o9m2R8k4j39k62N17l50Om3K66J6o8k3l3J62r7P6l1lm3M0J36k23
$$ 126 -271 32 -37 -79 19 -5 -144 -406 111 -239 -233 -276 -10 6 -62 -85 -118 44 -53 23 -8 -11 -54 -14 122 -101
5291a01J94k49K34l03K50oK7j4m4k85K92j7J50j44M3j89J96k26L66k24L8K65l96
$$ -101 93 -156 78 -225 25 19 46 32 -12 -297 -5 -22 128 -16 27 -162 34 -192 174 -50 -12 253 -143
5314a43K8J1K05o09M18k6J33p3K64q4j62j29L4j48L44j53J3K8J24l0K7k48L05
$$ -143 -115 -104 101 -508 -90 -116 17 -56 208 124 -38 -167 -133 -281 63 -90 -77 -49 75 45 72 -176 129
5337A29o7Q6j94J76k47J50J68l37K67l29M80j75j79J76k20K00l3q3o3j11N21J0
$$ 129 62 148 -46 130 -117 33 201 -136 131 -198 282 107 -72 104 -116 84 51 -32 -95 -206 315 325
5359C25l24N8j50K26r0j43M4J65J4K9k33K90j59J12l16k1K36o2p6P6J14j37j29
$$ 325 1 59 -91 135 45 -98 -54 111 125 154 -79 211 52 164 -152 -173 63 1 -75 1 115 -22 -151
5382a51K65j00k17K68p3j10L21k83J84r7p4J42l3l1k74M28q8mk10Q3M07l82R9
$$ -151 114 14 -203 65 -8 -118 203 -80 104 7 -67 75 42 11 -263 165 77 73 -137 -54 353 -29 70
5405G0m39K73Q2N3m7m7K82m37J55L24l82j25O2J89oP7O4q2j51J13L52k38q9RJ61
$$ 70 -369 -96 -14 39 -8 -55 227 -210 -55 269 -113 -238 -176 13 7 84 148 66 -85 28 380 142 53 62 223
5430B23l72M9J9O1Q3j88K4P7J08M0j52O5J32l00P6J65j06j57N8M6K61j00r2j63
$$ 223 -149 -100 -81 -20 63 -125 -101 -24 84 124 -28 37 169 -131 -55 110 4 -153 -95 -49 212 112 20 -143
5454a43L86l00P0J00l5k6k62M95k12J80m53R4q5K58j00O2j9j39J62j86K0N5J86
$$ -143 243 -57 13 113 78 52 -210 285 73 253 -200 -106 -191 67 -33 29 10 -129 33 -153 -133 -78 108
5477A08J47k27J58J42l21l52O14p7k04L4N5l08N05j13k01p2L02o8n0J95j67k52
$$ 108 255 28 186 328 7 -345 269 192 -12 22 77 -231 274 161 -40 -112 190 122 72 267 100 -152
5499a52j75N07k66J67k39L33l19L84k93K5L39k13j20jl40L20j01R8j19L3J93R3
$$ -152 -327 180 -86 81 -158 175 -144 240 -53 -28 311 98 -22 -23 -363 -43 -144 -46 -165 -132 61 154
5521A54J29l45L9L8j41K33j47q4o8L06l99M94n3Nj69M2K18j79j42L7j84L46l02
$$ 154 283 -62 -23 15 -126 107 -40 -124 -192 114 -285 209 156 161 -8 34 252 73 -69 -32 -216 130 -172
5544a72L83m27L44J37l94M2O7L09k35l68M27p5J4J2j99o1Q5R9L2O0k18J8J24m9
$$ -172 211 -216 128 265 -129 -87 -20 289 54 -314 113 38 52 64 -135 -196 -111 -12 20 80 -138 -120 4 -45
5568d5R4L0Q5k32ok3O5M10l73J26Pl26J2K04k47R1J54q7J26l5j76r5K82J01R4
$$ -45 49 79 164 -68 -74 -97 -32 378 5 131 138 -188 -176 28 -219 -128 26 -61 65 30 -146 -241 41 142 236
5593B36j52j97K80l14P7l6J18n0J57k66J26R4L6k5j37J24k85M40m75J56%J01O6
$$ 236 84 -113 167 -147 -70 -106 12 -38 119 -147 -21 73 109 84 -53 71 -214 226 -249 -93 -93 8 74
5616G4j15J49r8Qq5J6j14L7j1J03K24j86q6j21L18j37j12o8J45P7j30o7j28O20
$$ 74 -41 108 10 18 -67 -51 -165 -128 -139 -36 188 2 -84 -205 113 -24 -136 -204 -59 18 -112 -179 -307 313
5640C13k13j78J12r9J15q6K8j73K37%Mj95K10m3j36J90o5J44j11q1k33M31j42
$$ 313 100 -78 34 -65 50 -36 -8 -181 56 56 60 -135 75 32 -104 86 21 165 54 -27 -260 171 29
5663B9j95O6J07j63N3J7O4O2k58J57K47k10M18m85J31N9l17L68l00O7J46j94L93
$$ 29 -166 -100 7 -156 -103 -86 -22 40 -218 -61 186 -24 394 -91 40 99 -218 150 -150 -83 63 -131 262
5686B62k90Q2O2J2N2j21L8j71J50qk53K09l1q0K2k10J37kK39k34j42K48j11O6
$$ 262 -28 54 116 128 180 59 97 -74 76 68 -185 24 -7 -87 -65 -275 -138 -140 99 -135 -277 -29 -140 -74
5710g4J87j03lN0j31JK24k23J76j43k94J94j3M75l52J47j49lj60M28n45N32j3
$$ -74 113 10 7 57 -74 -73 151 -72 104 -39 -333 -139 -152 323 -29 118 -31 -34 -194 234 -311 221 208
5733B08l06J77k64J22J66lj83J50j10K14J1j80oJ7j55M9LJ1j15K29l44L67n5L77
$$ 208 -98 79 -185 -63 103 100 -83 67 -43 171 182 2 -4 13 -142 -93 -90 -79 -194 35 -309 58 3 380
5757C80m01l0J17r8K9k4M5J56k36J38m0m30L74J80k04K53m74K38j3J03k8j72N4
$$ 380 -21 -51 66 -32 -3 -27 18 174 -62 76 36 -394 -20 160 -44 209 -265 -27 -40 63 35 -137 -83
5780h3O7J59j8k72J88k2J84m74K40J08l00K95j57k64L49J42j98n8j1j1J6J61J24
$$ -83 -16 143 125 -147 41 19 203 -271 -31 77 -223 72 -85 -349 0 142 -56 -114 -125 -136 -120 41 165
5803A65k41J08k24J99J44l79N5K05j59L5J09K75j65n33L55lL64p6j54P6l80Q6
$$ 165 -76 32 -192 7 151 -228 -173 32 -127 -92 17 292 127 -406 -51 -54 310 234 80 156 -224 -138
5825a38K13LN2J2N6j43J23m46J82L02k1p9J21k23m17K23J27J66r7k03K63j79R4
$$ -138 75 78 130 142 198 55 178 -268 -86 216 195 116 237 14 -403 -180 -53 113 16 -187 76 -103 -9
5848ir1P8Q8j89K07j07n2L18m69L06k17K03J0n9J33j79R8n81L62J33r3Q7J94j64
$$ -9 -100 -22 66 -123 84 -23 -75 243 -226 80 -137 66 76 17 150 -29 69 -512 -150 -17 -110 -23 171 7
5872GR2J25l75p3J02o0l9J77R6L0J48m19K72J04kn06L14K51j85j27n1J13J36j14
$$ 7 99 224 -151 -224 -122 -182 -221 -44 52 82 230 -189 83 187 185 -321 -7 244 59 -68 -119 -6 130 16
5896A6j90%J29K14k8m33K93k06K14J50k77J43o3J85k39J98l13J64o3J05J25k78
$$ 16 -174 -174 -45 169 141 -292 1 -205 9 159 -118 25 -38 147 -92 106 -207 -43 -106 -1 124 -154
5918a54J23J48M2k84j03K71R4k30J72n9%K55l89N0L44j05j60l33M42j7j67K67
$$ -154 -31 117 159 -125 -228 43 137 -93 79 20 20 275 -114 -64 280 175 15 -318 124 107 -60 207
5940B07m38J51L22j34k60j43J65J66k99J50J70q1j6KJ90j14m1k16L77j24k95N22
$$ 207 -231 -80 242 108 -152 -295 -130 36 -263 -113 57 -24 -40 -38 152 38 -3 -219 158 34 -261 261
5962B61j96k1N0k49K00j74K17M9l28R9J79k45J47Q3q2J45nj02L9q2J61k05J12
$$ 261 65 44 94 -155 45 -129 88 137 -191 -92 87 -158 -11 72 -10 135 130 28 67 -15 146 -59 53
5985E3m3J82k57M0K6j36J51k68K94L8k67LL28j50j36J71P2J76k85P2j89K85k77
$$ 53 10 192 -65 -25 1 -135 16 -252 42 80 -187 -184 144 -6 -142 29 101 277 -8 64 -125 160 -117
$$ [...]
8191G5
##END NTUPLES=NMR FID
##END=
