##TITLE=1H_LR-785-R2-C3
 200.13MHz, CDCl3,
 8 sc
 
 10.2.2025
##JCAMPDX= 6.0         $$ Bruker NMR JCAMP-DX V2.0
##DATA TYPE= NMR FID
##DATA CLASS= NTUPLES
##ORIGIN= UXNMR, Bruker Analytische Messtechnik GmbH
##OWNER= pz
$$ XWIN-NMR		Version 3.5
$$ Mon Feb 10 13:40:45 2025 Russian Standard Time (UT+4h)  she@DPX200
##.OBSERVE FREQUENCY= 200.131
##.OBSERVE NUCLEUS= ^1H
##.DELAY= (6, 6)
##.ACQUISITION MODE= SIMULTANEOUS
##.ACQUISITION SCHEME= undefined
##.AVERAGES= 8
##.DIGITISER RES= 18
##SPECTROMETER/DATA SYSTEM= spect
##.PULSE SEQUENCE= zg30
##.SOLVENT NAME= CDCl3
##.SHIFT REFERENCE= (INTERNAL, CDCl3, 0, 14.3821)
##AUDIT TRAIL= $$ (NUMBER, WHEN, WHO, WHERE, WHAT)
$$ ##TITLE= Audit trail, XWIN-NMR		Version 3.5
$$ ##JCAMPDX= 5.01
$$ ##ORIGIN= Bruker BioSpin GmbH
$$ ##OWNER= she
$$ F:/spectra/data/she/nmr/H-C/1/audita.txt
$$ ##AUDIT TRAIL=  $$ (NUMBER, WHEN, WHO, WHERE, WHAT)
(   1,<2025-02-10 13:38:03.81 +0400>,<she>,<DPX200>,
      <created by zg, POWCHK disabled, PULCHK disabled
       configuration hash MD5:
       00 E9 B6 7A A2 85 ED C7 34 08 36 98 17 FE 4E 26
       data hash MD5: 16K
       98 49 7E 6B 74 8C 42 35 F6 33 6F 39 C7 E8 66 30>)
$$ ##END=
$$ 
$$ hash MD5
$$ 20 1F 8B 90 2E 99 DC C0 CC 7D 5B 64 22 0E 0B E7
##$RELAX= 
##$RELAX= 
##$RELAX= 
##$RELAX= 
##$RELAX= 
##$RELAX= 
$$ Bruker specific parameters
$$ --------------------------
##$DU= <F:/spectra>
##$EXPNO= 1
##$NAME= <H-C>
##$PROCNO= 1
##$TYPE= <nmr>
##$USER= <she>
##$AMP= (0..31)
100 100 100 100 100 100 100 100 100 100 100 100 100 100 100 100 100 100 
100 100 100 100 100 100 100 100 100 100 100 100 100 100 
##$AQSEQ= 0
##$AQ_mod= 1
##$AUNM= <au_zg>
##$AUTOPOS= <>
##$BF1= 200.13
##$BF2= 200.13
##$BF3= 200.13
##$BF4= 200.13
##$BF5= 200.13
##$BF6= 200.13
##$BF7= 200.13
##$BF8= 200.13
##$BYTORDA= 1
##$CFDGTYP= 0
##$CFRGTYP= 5
##$CHEMSTR= <none>
##$CNST= (0..31)
1 1 145 1 1 1 1 1 1 1 1 1 1 1 1 1 1 1 1 1 1 1 1 1 1 1 1 1 1 1 1 1 
##$CPDPRG= <>
##$CPDPRG1= <>
##$CPDPRG2= <>
##$CPDPRG3= <>
##$CPDPRG4= <mlev>
##$CPDPRG5= <mlev>
##$CPDPRG6= <mlev>
##$CPDPRG7= <mlev>
##$CPDPRG8= <mlev>
##$CPDPRGB= <>
##$CPDPRGT= <>
##$D= (0..31)
0 0.7 0 0 0 0 0 0 0 0 0 0.03 0 0 0 0 0 0 0 0 0 0 0 0 0 0 0 0 0 0 0 0 
##$DATE= 1739180283
##$DBL= (0..7)
120 120 120 120 120 120 120 120 
##$DBP= (0..7)
150 150 150 150 150 150 150 150 
##$DBP07= 0
##$DBPNAM0= <>
##$DBPNAM1= <>
##$DBPNAM2= <>
##$DBPNAM3= <>
##$DBPNAM4= <>
##$DBPNAM5= <>
##$DBPNAM6= <>
##$DBPNAM7= <>
##$DBPOAL= (0..7)
0.5 0.5 0.5 0.5 0.5 0.5 0.5 0.5 
##$DBPOFFS= (0..7)
0 0 0 0 0 0 0 0 
##$DE= 6
##$DECBNUC= <off>
##$DECIM= 32
##$DECNUC= <off>
##$DECSTAT= 4
##$DIGMOD= 1
##$DIGTYP= 9
##$DL= (0..7)
0 120 120 120 120 120 120 120 
##$DP= (0..7)
150 150 150 150 150 150 150 150 
##$DP07= 0
##$DPNAME0= <>
##$DPNAME1= <>
##$DPNAME2= <>
##$DPNAME3= <>
##$DPNAME4= <>
##$DPNAME5= <>
##$DPNAME6= <>
##$DPNAME7= <>
##$DPOAL= (0..7)
0.5 0.5 0.5 0.5 0.5 0.5 0.5 0.5 
##$DPOFFS= (0..7)
0 0 0 0 0 0 0 0 
##$DQDMODE= 0
##$DR= 18
##$DS= 0
##$DSLIST= <SSSSSSSSSSSSSSS>
$$ [...]
##$SUBNAM0= <"">
##$SUBNAM1= <"">
##$SUBNAM2= <"">
##$SUBNAM3= <"">
##$SUBNAM4= <"">
##$SUBNAM5= <"">
##$SUBNAM6= <"">
##$SUBNAM7= <"">
##$SUBNAM8= <"">
##$SUBNAM9= <"">
##$SW= 18.0517599122864
##$SWIBOX= (0..15)
0 0 2 0 0 0 0 0 0 0 0 0 0 0 0 0 
##$SW_h= 3612.71676300578
##$TD= 16384
##$TD0= 1
##$TE= 0
##$TE2= 300
##$TE3= 300
##$TEG= 300
##$TL= (0..7)
0 120 120 120 120 120 120 120 
##$TP= (0..7)
150 150 150 150 150 150 150 150 
##$TP07= 0
##$TPNAME0= <>
##$TPNAME1= <>
##$TPNAME2= <>
##$TPNAME3= <>
##$TPNAME4= <>
##$TPNAME5= <>
##$TPNAME6= <>
##$TPNAME7= <>
##$TPOAL= (0..7)
0.5 0.5 0.5 0.5 0.5 0.5 0.5 0.5 
##$TPOFFS= (0..7)
0 0 0 0 0 0 0 0 
##$TUNHIN= 0
##$TUNHOUT= 0
##$TUNXOUT= 0
##$USERA1= <user>
##$USERA2= <user>
##$USERA3= <user>
##$USERA4= <user>
##$USERA5= <user>
##$V9= 5
##$VALIST= <valist>
##$VCLIST= <CCCCCCCCCCCCCCC>
##$VD= 0
##$VDLIST= <DDDDDDDDDDDDDDD>
##$VPLIST= <PPPPPPPPPPPPPPP>
##$VTLIST= <TTTTTTTTTTTTTTT>
##$WBST= 1024
##$WBSW= 4
##$XGAIN= (0..3)
0 0 0 0 
##$XL= 0
##$YL= 0
##$YMAX_a= 181927
##$YMIN_a= -193817
##$ZGOPTNS= <>
##$ZL1= 120
##$ZL2= 120
##$ZL3= 120
##$ZL4= 120
##$ABSF1= 10
##$ABSF2= 0
##$ABSG= 5
##$ABSL= 3
##$ALPHA= 0
##$AQORDER= 0
##$ASSFAC= 0
##$ASSFACI= 0
##$ASSFACX= 0
##$ASSWID= 0
##$AUNMP= <proc_1d>
##$AZFE= 0.1
##$AZFW= 0.1
##$BCFW= 1
##$BC_mod= 2
##$BYTORDP= 1
##$COROFFS= 0
##$CY= -3
##$DATMOD= 1
##$DC= 2
##$DFILT= <>
##$DTYPP= 0
##$F1P= 0
##$F2P= 0
##$FCOR= 0.5
##$FTSIZE= 0
##$FT_mod= 4
##$GAMMA= 1
##$GB= 0.15
##$INTBC= 1
##$INTSCL= 1
##$ISEN= 128
##$LB= 0.25
##$LEV0= 0
##$LPBIN= 0
##$MAXI= 10000
##$MC2= 0
##$MEAN= 0
##$ME_mod= 0
##$MI= 1.114404
##$NCOEF= 0
##$NC_proc= 0
##$NLEV= 6
##$NOISF1= 3.799351
##$NOISF2= 2.8
##$NSP= 1
##$NTH_PI= 0
##$NZP= 0
##$OFFSET= 14.38212
##$PC= 1
##$PHC0= -455.9419
##$PHC1= -4.007794
##$PH_mod= 1
##$PKNL= yes
##$PPARMOD= 0
##$PSCAL= 0
##$PSIGN= 0
##$REVERSE= no
##$SF= 200.129724274929
##$SI= 16384
##$SIGF1= 3
##$SIGF2= 2
##$SINO= 400
##$SIOLD= 16384
##$SREGLST= <1H.CDCl3>
##$SSB= 0
##$STSI= 0
##$STSR= 0
##$SW_p= 3205.1282051282
##$SYMM= 0
##$S_DEV= 0
##$TDeff= 0
##$TDoff= 0
##$TI= <>
##$TILT= no
##$TM1= 0
##$TM2= 0
##$TOPLEV= 0
##$USERP1= <user>
##$USERP2= <user>
##$USERP3= <user>
##$USERP4= <user>
##$USERP5= <user>
##$WDW= 1
##$XDIM= 8192
##$YMAX_p= 0
##$YMIN_p= 0
$$ End of Bruker specific parameters
$$ ---------------------------------
##NTUPLES= NMR FID
##VAR_NAME=  TIME,          FID/REAL,        FID/IMAG
##SYMBOL=    X,             R,               I
##VAR_TYPE=  INDEPENDENT,   DEPENDENT,       DEPENDENT
##VAR_FORM=  AFFN,          ASDF,            ASDF
##VAR_DIM=   8192,          8192,            8192
##UNITS=     SECONDS,       ARBITRARY UNITS, ARBITRARY UNITS
##FACTOR=    0.0002768,     1,               1
##FIRST=     0,             0,               0
##LAST=      2.2672688,     0,               0
##MIN=       0,             -193817,         0
##MAX=       2.2672688,     181927,          0
$$ Real data points
##PAGE= N=1
##DATA TABLE= (X++(R..R)), XYDATA
0@%%%%%%%%%%%%%%%%%%%%JnJ1j5J6j6J6j6K0k5K9l2L6m1M7n4N7o5P5q2R0j01J12
43E8j23J36j51J69j86K02k23K46k69K97l28L64m03M48n01N62o35P20q29R72j161
64f35J422j816K471l755P209l5371j11704K7466J34058J02950l8646j31519q6854
77a34724M8632J31805R2123k5096j03393q7996p220O0753P0980L4750j1605m3353
89B5656m8317k4856K0678N9096N3807k618o6964p7285j7806N7264P5836K1066
101G5557m5931n6416k991M9218L8916k1129n7953k4998M4016O7335J3876o2283
113A7217p6713j0716O6203P4253P885o0048o3079j0545L5788L5526N793j0728
125A0836m931Q7j0991k2707p957K5998M2343J3716l3618n0158j6835L3087M4712
$$ plain form
0 0 0 0 0 0 0 0 0 0 0 0 0 0 0 0 0 0 0 0 0 0 1 -4 7 -8 8 -8 8 -8 12 -13 16 -16 20 -21 26 -28 29 -36 39 -43 47 -54 58
43 58 -65 71 -80 89 -97 105 -118 128 -141 156 -172 192 -211 237 -264 298 -337 383 -446 526 -635
64 -635 787 -1029 1442 -2313 4896 -30475 -142179 -114713 19345 122295 83649 -47870 -134724
77 -134724 -86092 45713 137836 112740 9347 -78649 -85869 -25116 45864 80614 69009 25656
89 25656 -22661 -47517 -26839 32257 86064 83446 16482 -60803 -78609 -21345 54491 75557
101 75557 29626 -26790 -29781 19437 58353 37224 -20729 -45727 -1711 65624 79500 17217
113 17217 -59496 -70212 -4009 70244 78129 18081 -44998 -55543 -19755 15771 21564 10836
125 10836 5905 5992 -4999 -27706 -35663 -9665 32678 46394 12776 -37382 -54217 -21130 23582
138B3582R184l2167l3846J354K8041J5528j7590k6733J676L4567K7759j4181m5640
151b8466k7968K2011N0658K6580k4026m6626k0175K4166L6567Q574k3174k1677
163b3556O800K2384N439k1044k0389Q654L3899K0802j5088l4782j7177J7348L0261
176A3551J2095j2983j6245k202O287l98q596n40J8205K0773l137l1278l0740M788
190c0420M0571L7319l754m0621l5475L935L6386K9230n398k8470j7306R017K0153
203A5167L718j6110j3941Q338K1811Q332j7382k5889n920K0466K4482L234j7745
216H561j6756j80R712L162m887q24J0916J1162q118k5263j7921J1490L3229K1714
230C5997j3177l5761k3648R957L0197J8809p108k0176j0433N444Q936j263p155
$$ plain form
138 23582 32766 599 -33247 -31893 -3852 11676 -5914 -32647 -30971 3596 31355 17174 -28466
151 -28466 -56434 -34423 16235 42815 18789 -27837 -48012 -23846 12721 21295 -1879 -23556
163 -23556 -16756 5628 11067 -9977 -30366 -21712 12187 32989 17901 -16881 -34058 -16710 13551
176 13551 25646 12663 -3582 -5784 503 105 -8491 -9031 9174 29947 26810 -4468 -35208 -30420
190 -30420 10151 47470 43716 3095 -32380 -28445 7941 37171 31773 3303 -14003 -4986 15167
203 15167 18885 2775 -11166 -2828 18983 27315 9933 -15956 -21876 -1410 23072 26306 8561
216 8561 -8195 -8375 1337 4499 -388 -1212 9704 20866 12748 -12515 -30436 -18946 14283 35997
230 35997 22820 -12941 -36589 -26632 3565 22374 15266 -4910 -15343 -9899 -963 -2226 -9381
243i381P03J1904R434o522j9356j2755P668K0595J3246o535j6921r313N567Q942
257b724N10o204n91J0963J0705n400k0542j5826P941K7092K0485o078k6210k0599
271b6478J838J9429J7074K546p574p930m110k783k566K870J1699J2732P32j4749
285B730j7759l890J4513J8193N339j0604j3284k776Q145N355l262o091J791J0850
299I250Q194n827j6971j1299O792K0330J3519n062j8196j4403J464J3240J0922
312A1953J510n577n349l265j987j598K776P308O118j755r580q727J194Q971O685
327H677k422p730k822M274N846k171q533n532N526J2098N668p675j4660o969O992
342i433J4188P987m894j2681p828K739Q328O063n94m193l093j316l25K79J639
$$ plain form
243 -9381 -8678 3226 12660 6138 -13218 -25973 -18305 2290 15536 9001 -7920 -17233 -11666 -2724
257 -2724 -2214 -8418 -9009 1954 12659 7259 -13283 -29109 -21168 5924 26409 20331 -5879 -26478
271 -26478 -24640 -5211 11863 14409 6835 -1095 -5205 -7988 -10554 -7684 4015 16747 17479 2730
285 2730 -15029 -18919 -4406 13787 19126 8522 -4762 -7538 607 5962 2700 -3391 -1600 9250
299 9250 17444 11617 -5354 -16653 -9861 10469 23988 18926 730 -13673 -12209 1031 11953
312 11953 13463 7886 2537 -728 -2715 -4313 -1537 5771 11889 10134 554 -8173 -6979 1992 8677
327 8677 6255 -1475 -4297 -23 5823 3652 -4881 -10413 -4887 7211 12879 5204 -9456 -16425 -9433
342 -9433 4755 12742 7848 -4833 -12661 -9922 -1594 4469 3875 -318 -3411 -4727 -5052 -4773 -3134
357c134K892K050j651m795l064K164N129K922k337m322o04L427K887k055m503
372d994p15M848N839p65p189o425J814R104P253j779r465p038J553Q409P214k64
388G400n955n182j088L178L992J844j33j550j536j710j024J312K473K477ok452
404B040k256m57J305J772l59n17N91K430M18l411m970j023M792P525K579n457
420E002q653m047L831P581M616j545n615m019n11J885J989J681J221L09j483l145
436i03k811l20K507L129K315n46k601l386k684j93L308L807L196o60m464n709
452f015k739L060O755N886l59n972p591k858L737O821M463q96m131m090j795P31
468d993J549K888K587R62j695l787l675k83L820M453K697p64l518l734k034J042
$$ plain form
357 -3134 -242 1808 157 -4638 -7702 -5538 -409 2513 176 -4146 -4750 -1323 1564 -491 -4994
372 -4994 -5709 -861 4978 4213 -2976 -9401 -7587 1517 8770 6991 -2474 -9512 -7959 450 7664 7400
388 7400 1445 -3737 -4825 -1647 2345 4189 4056 2506 970 -740 -1764 -452 2021 4498 4492 2040
404 2040 -216 -673 632 2404 2045 1528 2119 4549 4967 1556 -3414 -4437 355 7880 10459 5002
420 5002 -3651 -7698 -3867 3714 8330 6785 1170 -2849 -3360 -1475 514 2195 3416 3725 2242 -903
436 -903 -3714 -4034 -1527 1602 3917 3371 770 -2616 -5300 -5493 -2185 1622 4818 4158 -306 -6015
452 -6015 -8754 -5694 1061 6947 6588 616 -6975 -9833 -6096 725 5188 4292 161 -3929 -5724 -4993
468 -4993 -3444 -556 2031 2993 1298 -2489 -6164 -6447 -2627 1826 4523 3759 241 -3493 -5527 -4485
484d485L058M636K223j474m718m239j312L433M949L200l51l627m043j609J109
499c250L677L094J359j267k591k343j403P51K252K666K184k46l583l345j627J280
515b392L782L462R53k290l573k973j153K402M499L525O2l787m733k332J749M160
531A361L248O35k229l253k612m65J720L092K118J42k457k721j383O24J711K120
547A651N35o66j395j990n74R42J497J019K15j069r10q22J50R8L45P12L20m53o31
566a026l83j54O99N51n38l46L32L83K16o63p51N3Q00O70Q9p5J41l23p75l51J32
587a319M20J072N11n90m04j89j09j87M4Q51P26M85o00j113o35j85O19J100Q04
606A301P30m98j045k181o38J747K443K028n66k354k329j259J020K290K340J162
$$ plain form
484 -4485 -1427 3209 5432 3958 -760 -4999 -6311 -2878 2071 5271 4920 1293 -2750 -4359 -3250
499 -3250 427 3521 4880 3613 1022 -1321 -2724 -1973 279 2945 5129 4883 1300 -2045 -3672 -2392
515 -2392 1390 4852 5805 3515 -58 -3031 -4184 -1782 2717 6242 6304 2517 -2216 -4548 -2799 1361
531 1361 4609 5244 3015 -238 -2850 -3315 -1595 1497 3615 3757 1300 -1421 -2804 -2180 -469 1651
547 1651 2186 1520 125 -1865 -2439 -1497 0 1019 1234 165 -745 -1567 -1417 -1319 -974 -262 58 -395 -1026
566 -1026 -1409 -1563 -864 -313 -851 -1197 -865 -482 -266 -929 -1680 -1627 -827 -157 -68 -143 -2 -325 -1100 -1451 -1319
587 -1319 -899 173 684 94 -310 -499 -608 -795 -751 100 826 1311 711 -402 -1037 -1222 -603 497 1301
606 1301 2031 1533 488 -1693 -2331 -584 1859 3887 3321 967 -1362 -2621 -1601 689 3029 4191
622D191j083k923k687m66J796L311K218l70k003l213j637M16K289K703J939q83
638C598l207k745j131J434L170K380N38k250k875k066k66K068K945K329p95k747
654C80l179r74J056K478K546Q17j487j796k447r07R49K367K053M53j496j979j574
671b740k51J090K277J494O14j470k582j966j8K089K578J761n96k058k838j225
687c841P69K734K346J157j210k980k256j79J939K807J570k37j772k564j489J25
703c081K435K760J137q91k465k250m80J362K181J687O63j472k065j945J40J814
719d70K549J246j141j930j771m32O74J635J485N13n75j867j598L22J008J446N08
736A602R2j252p87l60q4M80R06Q69q3n73j172r17J89P13P92O36j62o1j096j029
$$ plain form
622 4191 3108 185 -2502 -2968 -1172 2139 4357 3987 1984 -1229 -2866 -2450 -161 2542 4481 3598
638 3598 391 -2354 -3485 -2051 1119 3499 4037 1787 -1088 -3154 -3420 -1352 1593 3922 3127 380
654 380 -2799 -3773 -2717 -239 2307 3124 1637 -159 -2606 -3513 -2564 -197 1856 2309 813 -1166 -2740
671 -2740 -2991 -1901 376 1870 2484 1014 -1568 -3534 -3552 -1463 1115 2876 2280 222 -2616 -3841
687 -3841 -3072 -338 2008 3165 1955 -1025 -3281 -3460 -1521 1286 2856 2619 847 -1717 -3206 -3081
703 -3081 -646 2114 3251 2360 -105 -2355 -2835 -1473 708 2395 3058 1586 -479 -2424 -2284 -470
719 -470 2079 3325 2184 254 -1517 -1949 -1275 360 1845 2358 1783 -84 -1682 -1360 -352 1094 1602
736 1602 1694 442 -345 -705 -789 -309 597 1466 1383 810 -362 -1279 -1090 -377 415 1051 889 828 -268 -1297
756a297k9R93J269N54m62j336m57l86M86P99J56N14n05p76l59k43Q60L80K97j24
776C34m53n42m19M87K89K95j71L7j0m08L62r8P85o78l28k28J03P43L66K0o09p64
798h87R6K7P48O10M89o77o55r86K94Q30J516K60q99j426r64J11J247J267O50m24
818A227j139q62o30O32Q89J452Ok92r57j253l11M96J521J300m25p16j047j224
836a333M90P04R05R68k72q44j527o32M69Q62J779N23o88j279q90m30J97Q91J240
855A133O78k29j337j603m76M08J841J134N74q19j782j715l7J024J902J043J6j223
873E32j747r13J02J512J816J087p28j487k163q42Q44K712J248L53j685j704j180
890b243J62J155J439J137k00r74j890r15M38J651J401N39q57j384j007o6O13R89
$$ plain form
756 -1297 -1326 -333 936 1490 1028 -308 -765 -1151 -665 134 290 804 299 -477 -836 -1079 -219 161 458 334
776 334 -119 -661 -1080 -593 -304 -9 -180 -143 -153 -561 -199 -297 488 -190 -518 -746 -643 100 466 486 -123 -887
798 -887 -791 -764 -16 594 1083 406 -249 -1235 -941 -111 1405 1665 766 -660 -1624 -1513 -266 1001 1651 1227
818 1227 88 -774 -1404 -772 117 1569 1575 1283 326 -927 -1238 -742 779 2079 1654 938 -109 -1333
836 -1333 -843 -139 766 1734 1462 618 -909 -1541 -1072 -210 1569 2092 1404 125 -765 -1195 -998 -107 1133
855 1133 1811 1582 245 -1358 -1834 -1426 415 1549 2123 1304 -478 -2193 -2230 -1206 696 1739 1755 532
873 532 -1215 -2128 -2026 -514 1302 2389 1661 174 -1989 -2831 -1987 725 1973 2326 641 -1063 -2243
890 -2243 -2081 -926 513 1650 1450 476 -1414 -2329 -1891 -240 1161 1700 843 -541 -1548 -1614 -1001 -12
908a2J086M34o41p53j033m96O54J283P19K79q68j384o31L06Q35O59P32j12n63
927D94j099k30mK67J135J033L11j519r90r39R53J058R06L5n64j225k05l4R8P89
947B70R46P1m68j094j028Q8J003J347L10m93j140q51L61O75L49K20J59m79l37
966i1k93m84P13L23L50rm40n01q1j1M13K30j50j15K86l3K86o62l55K77M06O27
988F86m75m14k14M01k36J1j77N9P98J26m18r65m89L21J069Q08P6r63p13k28L79
1009e58N37M18k02K30l65l83k40j43O00Q90l0j36q57n76M66K77L62p7K5R8K54
1030E90l15p42k96n3J283J138k7j089j238l89L26J184N14O1k70m76o29p43J01
1049a070R74J493K96m93j469j132R7J085N98J087N5j020q98p72J53M44J236R99
$$ plain form
908 -12 1074 1508 867 114 -919 -1415 -761 522 1241 1520 652 -732 -1363 -1057 -222 437 1169 1057 494
927 494 -605 -835 -839 -572 563 1596 1907 388 -602 -1541 -588 470 1376 1411 847 -378 -583 -617 -519 270
947 270 1216 1287 819 -275 -1303 -1215 -212 1135 1445 952 -188 -1039 -678 -3 346 566 725 246 -91
966 -91 -384 -868 -155 168 518 509 69 -432 -513 -524 -111 119 -31 -146 140 107 393 -269 -624 -347 59 686
988 686 211 -203 -417 -16 -252 -241 -418 -359 439 565 147 -818 -1307 -986 83 891 967 4 -709 -937 -558
1009 -558 -21 397 195 425 60 -323 -563 -706 -106 784 754 618 -239 -815 -349 -72 290 213 238 336 590
1030 590 275 -467 -763 -816 467 1605 1578 489 -749 -1138 -812 372 886 947 677 201 -428 -1171 -1070
1049 -1070 -96 1397 1693 1200 -269 -1401 -1304 -219 379 1466 1521 501 -397 -1169 -1016 -572 664 1663
1067A663j69j114j456j048R04J720J173j6j036j599l01K99M02P11Q10m8j20r74
1085a99o90r99Q34J451R68J59j312j354j69L92R91M15L40P2n63q91r35j66J247
1104d09J209J034n53j543j412L58M58R26O97J05o08m91n58l91K03J089O29L40
1122A083l71j192q15j68J321J045M64p91p34q06M67K09L45L67N10m3q63n63q20
1141a355P11J496J57j70p17q96J76L82N21O5k27J47m4j55m97j98J67N99P12m19
1161D55o32l30j27O67J27J84m37K64M34K5p39n94o2O43R58k88k91m77k71L63L17
1182A89J19k35j43K61m4m53n43L58N67O19n8l64p93k9O40N0l06K14j20K79J52
1203C60n57l92N8L68N85N16q48m24o1J85J97J60k00L26%l77j21j016P29L91N98
$$ plain form
1067 1663 1494 380 -1076 -2124 -1220 500 1673 1657 621 -978 -1279 -980 -578 133 943 895 775 -199
1085 -199 -889 -1888 -1054 397 1365 1524 212 -1142 -1311 -919 72 487 827 899 336 -555 -1490 -1656 -409
1104 -409 800 1834 1281 -262 -1674 -1316 -858 68 765 870 262 -229 -787 -1178 -975 114 743 1083
1122 1083 712 -480 -1295 -1463 -142 903 1367 576 -158 -964 -497 -288 57 424 934 891 28 -535 -1355
1141 -1355 -644 852 1009 839 122 -774 -598 -216 305 370 143 290 246 91 -406 -604 -437 162 874 455
1161 455 -177 -507 -634 33 160 344 -93 171 605 630 -109 -703 -765 -122 836 548 257 -220 -491 -128 189
1182 189 308 73 -70 191 147 -306 -849 -491 76 695 637 273 -520 -549 91 141 -165 49 -71 208 360
1203 360 -197 -589 -531 -163 422 938 90 -334 -395 -210 -13 147 -53 273 273 -104 -225 -1241 -512 -121 477
1224D77N07k55j220q17M08J105O04l73l8k89o79l56K97L77R81O24l63j170q88
1243a068j56J127O59M01k30n32o42k72K55L2P87O14K42q06q50p34K00J213Q82
1262A122j70n35n42p05K34M75L02N17k8P3r36n52k29M28P14J022qq70p84o13K24
1283h61N66O82O48n17k03p62l59k36P11J146L90k44r11r23l70P09Q31R63m63o08
1303A89n98l96l52L66J236M80j16n08p39m85J95N79Q43J77k33p80p53K79K06K01
1323b09O03K46k82k61o55q5l5J011N69m67j91n21l85j3P66o6L13J13k67Q2m19
1344a53j27J72J52M84N0k62m78l24l1L49O05k09J92r5m3n06r3M2K55N42N5n44
1366C3k26n17L78M37P2K00k77l62J42j06o5K87O3J88J35m47k70j02K46N88l18
$$ plain form
1224 477 984 729 -491 -1308 -900 205 809 436 398 109 -570 -926 -629 -252 729 1353 990 -180 -1068
1243 -1068 -1224 -97 562 963 733 201 -441 -713 -458 -426 361 975 1217 411 -439 -1173 -973 240 1122
1262 1122 952 417 -125 -830 -596 -121 181 698 670 743 -193 -745 -974 -546 168 1190 1182 312 -472 -1085 -861
1283 -861 -295 387 1035 518 315 -447 -806 -1042 -331 815 1205 961 50 -873 -1243 -534 297 1260 797 189
1303 189 -409 -805 -1157 -791 445 925 809 301 -438 -923 -728 -149 694 871 638 -142 -895 -616 -410 -209
1323 -209 394 640 358 97 -558 -643 -678 333 902 435 244 -277 -662 -675 91 25 338 451 184 266 -153
1344 -153 -280 -108 44 528 578 316 -162 -486 -517 -168 437 228 420 325 282 -224 -317 -275 -20 522 577 33
1366 33 -193 -710 -332 105 177 377 100 -262 -120 -226 -291 -4 59 247 382 -65 -335 -437 -191 397 79
1387G9M14n61J2k12k18K29P5L17J49k64L8l72K92k06J56K66k81K2R3j38l05K11
1409b04J8K51L37P6k95r67k0L42M78K70K9n6m34j72k43M17M49J4M92n37l41l60
1431d56l57L83O00L92J54p63l88M1J78K74j78M95j67j30m49k47L02L37O12K7k97
1452C63o22k03K86j60M61J30L46k05n66k41l31M20K39O72l4l74k63r8m26M86O02
1473D82L9m7n29m46J32l57N91N29K47k7o23m48j15Q4N87M07J5j61k43n05q2K81
1495a89K01L72K75l57n26k10R1L46K19L84q0m85k75m65K68M44N7M45j45k00m61
1516b91j02j29L65O39J05k57j05j008J71J41L99M47P6m8l07o01n9J52K64M29J37
1537D18O4o00o28K93J96L43M51p6k11m37k66JM04M11K16o19J38m33L3l37N97M51
$$ plain form
1387 79 493 -68 -56 -268 -486 -257 -182 135 284 20 58 -314 -22 -228 -72 194 -87 -65 28 -110 -415 -204
1409 -204 -186 65 402 478 183 -784 -804 -462 16 286 315 259 -175 -347 -590 -173 276 290 782 245 -96 -456
1431 -456 -813 -430 170 562 716 -47 -435 -394 -216 58 -120 375 208 78 -371 -618 -316 21 633 660 363
1452 363 -259 -462 -176 -336 125 255 601 396 -170 -411 -742 -322 -83 589 555 181 -82 -180 -606 -120 482
1473 482 521 474 -55 -501 -369 -726 -135 394 641 614 -9 -457 -572 -488 99 506 521 360 117 -388 -470 -189
1495 -189 12 384 659 302 -224 -434 -343 3 222 606 526 41 -234 -699 -431 13 70 515 370 170 -291
1516 -291 -393 -522 -157 482 587 330 225 -783 -612 -471 -72 375 451 403 96 -505 -564 -412 -148 281 418
1537 418 482 -118 -746 -453 -257 86 537 461 250 -187 -453 -452 -48 363 579 -40 98 -335 -302 -639 -42 409
1559D09M1J61n47m70j26L71K09L43L61m27m22Q9j93O8K9M74J38l17l09k19mo6
1581d07O56J87q6m5k85j6l23q0N31M50l71K3m18l03L3K72M87m5o3J58n18j0k86
1604d59L78L01K31Jm05m75J81O8o5M57J14K23k41m65r4pL22M15j03k3l00l56n8
1627c60J86k13O70n7K4k31k88n3J41M2o5N53j31n7k79m51J77O64j48J06l75l7
1649a82m0j11J91L75J85l7p0l18l17j67L57O03r9j3j72m42k43O9M10J73L17N3
1671E22m83j31l76j2N93M29j72K5m69k45j68L36L69J29K31k41m35k79Q3M7K73
1692B6K63j04j22j35o8m10N17L3N22m7j69m90j82n8L59L05J59K22m09o13Ml45
1714g42M20N52L46m4j73o33l20K43L47M16j3r0l23l47r4J22M15L83jm16j48n33
$$ plain form
1559 409 450 611 64 -406 -532 -161 48 391 752 325 -97 -8 -201 -133 -104 370 508 191 -118 -337 -341 -407
1581 -407 249 436 350 305 20 4 -319 -399 132 582 211 234 -184 -487 -454 -182 305 260 197 355 -163 -173 -459
1604 -459 -81 220 451 452 47 -428 -247 -179 -244 213 327 550 309 -156 -250 -257 65 480 377 354 54 -302 -360
1627 -360 -174 -387 283 226 250 19 -269 -322 -181 -139 -204 349 218 161 -118 -569 -392 272 124 230 -145 -182
1649 -182 -222 -333 -142 233 418 381 311 -7 -324 -491 -134 469 370 357 185 -257 -500 -431 -21 152 469 522
1671 522 39 -92 -468 -480 113 542 370 395 -74 -319 -487 -151 218 347 578 337 -98 -377 -294 -247 26
1692 26 289 185 63 -72 -140 -550 -33 0 522 475 306 -184 -366 -424 -65 240 399 621 212 -401 -397 -742
1714 -742 -322 230 576 532 359 -274 -594 -351 -4 412 399 309 -14 -361 -455 -333 82 465 464 48 -100 -633
1736f33K63K54K24L41l8k72l42P8l38L91J93M37l19k32k81k69K83M52J28m5j59
1757A16k13l67PM61K18Q0r8j08o1m48K25Q4J98M54j42k08l19j97l3L57J77K3O4
1780B70K05p37K4nL97L4K81k81k61o4j85J38L34J7M82k93l39l84M3R1J44L43j56
1803I8J80o05J57o01M17M56j00N25m25j34k19Q3k7K74R8K89m57n8l30J3M05J2
1825E1K8J90J12n41R3j10L08P7l7R0j10m23O4j86M2M04M28m11Kk67k01j66M49
1848a14K41J69k17N6m21ok3J87L80P4l17O0j82l59L25K36Q0N0k85J63j13l93M01
1871hj86M27J80k71n4k04k45K20K81K3Q2R5l57m31J84L10J86p1J73p6l55l46K05
1894b38J35L3L52J74j66n76nl15L51K14O70j93p01Q9k51L08NM82k21M8l88J1l23
$$ plain form
1736 -633 -370 -116 108 449 411 139 -203 -125 -463 -72 121 558 239 7 -274 -543 -260 192 320 275 116
1757 116 -97 -464 -457 4 222 302 204 96 35 -413 -188 -104 94 548 406 198 -121 -318 -351 6 183 206 270
1780 270 475 -262 -238 -243 154 188 469 188 -73 -137 -322 -184 150 167 649 356 17 -367 -324 -233 -89 254 98
1803 98 278 -327 -170 -771 -354 102 2 527 102 -32 -251 -168 -195 79 177 466 9 -49 -379 -366 39 51
1825 51 79 269 381 -160 -67 -177 131 208 171 261 151 -272 -208 -394 -352 52 480 69 71 -196 -397 -563 -114
1848 -114 127 296 79 135 -286 -292 -315 -128 252 326 9 69 -113 -472 -147 89 169 219 -66 97 -16 -409 -8
1871 -8 -194 233 413 142 88 -116 -361 -141 140 163 245 340 -17 -448 -264 46 232 161 334 258 -97 -443 -238
1894 -238 -103 -70 282 456 290 -286 -291 -606 -255 -41 629 436 -265 -176 -427 -119 -114 368 147 195 -193 -182 -505
1917e05n6P21N9JO9m48K85n58K97K27N6K39m7o56k82J69K53K84K3J58k2p46q3
1940e62L83n4K71K90j10j85j67j42M0K18K68M36m32k71M9n03J78M18J66Q5j91
1961A85L8n28O2m4L15N68k45m68J05k62J41j72M77R1K69o33m87P3M7N12L09J5
1983C68k05k00l61K83j01m9P19j8k09m06m4o4j99L68R7L43l05j20K7j51J70K57
2005B00k16K54l18k3M4k02K48J45J93j41j85n1N2j37P3K43M5L3j76j34j28K64
2027H3l86L01M08M3l30k17P1k05K32J58L1J74n4l69k26N38m20J58p0J44j1r2k18
2050b57J06K74J21j20l11K90k19j01j01M65QJ14Ol85j72pK32J14J19j09J93n54
2072b94J93J46o1J48K70l51R6k62k87K36J68j77K26Q7j73R3j49j97J90K35Q6n5
$$ plain form
1917 -505 -561 160 219 220 289 -159 126 -432 -135 92 148 387 340 -316 -598 -429 -176 108 131 289 267 -479 -562
1940 -562 -179 -233 38 328 218 33 -134 -276 -236 -18 250 686 254 -17 32 -471 -293 125 291 376 185
1961 185 223 -305 -243 -287 28 596 351 -117 -12 -274 -133 -305 172 263 532 -101 -588 -515 -468 44 353 368
1983 368 163 -37 -398 -115 -216 -265 454 436 227 -179 -223 -287 -486 -118 -21 322 17 -103 -76 -227 -57 200
2005 200 -16 238 -80 -103 -59 -261 -13 132 325 184 -1 -52 0 -137 -64 179 224 257 81 -53 -181 83
2027 83 -303 -2 406 449 119 -98 -27 -232 0 158 189 363 309 -60 -286 252 -168 -10 -80 64 53 -39 -257
2050 -257 -151 123 244 124 -187 103 -116 -217 -318 147 155 269 275 -110 -282 -289 -57 57 176 67 260 -294
2072 -294 -101 45 -16 132 402 51 147 -115 -402 -166 2 -175 51 138 -35 58 -91 -288 -98 137 223 168
2094A68l16qp7k7J25K82K08k05j96k51j31K46L28J89k3j32k52l73J66j71K51L00
2116A01K83k89m19J50j27J22L63K63l06K2j69m47QR3K88L45Nl46r0j10M02l16
2138a74N89k78J43k79Lj39k12N60q9N5N6j61l23K2K76R4J28J7j79j36k83J8K89
2161cK17K07j37K1m66m2r1K24M25k00M78p71l8n6l3K18J62M6P1k86j66r7K7O22
2185C32J71k58k43j71m18M12m7L20P9K08m68J3n8k02J35K28L38J02m13k30j35
2206c05K65pm7J90J23K10m62m9k5R6j86M47M9n72L13m26L30J84o1J33K66m87l73
2229c94J98J77K13j09K90r5k89j18j95P1L90Q6l4j17k0k72j16j2L64L50k10k14
2251e6k26J83q1L69j93KK82k92j51k88J25J39M08l2k10P6k53k3%j03M47j64P7
$$ plain form
2094 168 -148 -156 -233 -260 -135 147 355 150 -46 -297 -428 -182 146 335 312 180 -72 -445 -279 -450 -199 101
2116 101 384 95 -324 -174 -301 -179 184 447 141 163 -6 -453 -445 -352 -64 281 286 -60 -150 -260 142 -174
2138 -174 415 137 280 1 4 -135 -347 213 124 179 235 74 -249 -227 49 143 271 288 109 -27 -310 -292 -3
2161 -3 214 421 284 305 -161 -203 -294 -70 355 155 633 -138 -176 -232 -265 -47 115 161 232 -54 -220 -317 -290 332
2185 332 503 245 2 -169 -587 -175 -222 98 177 385 -83 -70 -128 -330 -195 33 371 473 60 -170 -305
2206 -305 -40 -47 -94 96 219 429 -33 -82 -107 -11 -197 250 299 -273 40 -386 -56 128 67 200 466 -21 -394
2229 -394 -196 -19 194 85 375 280 -9 -127 -322 -251 139 225 191 74 54 -218 -334 -346 18 368 158 -56
2251 -56 -282 -99 -180 189 -4 -2 280 -12 -163 -451 -326 -187 221 189 -21 55 -198 -221 -221 -324 123 -41 36
2274C6k3J70k79k65K65J37m7P9j43lk81J21K34N9K23j18o4m77M9L14K26r1P4p5
2298A21k23j1K6J07k9L07j36j43k12n2K05j25l9J19K67p0k88P0j98J13J98P4R4
2321A75l88j11J43k28J66K60K14n21K26j44j83M56R0K1k16K52o60N63k85K49k32
2342a53M50l6J63p71lJ73j65M55L2N9R3j78k04j59N1K55O3K53m02l05k4J19J50
2365h4K54M2K30m21P5l74J66M05j71N4j61J06j22J41l94j68N37N8K39k68m20J17
2387a59N7K55L17m4k07k23k32J22J90J53j21L53l32l11O9Q8m9K67j87K37r2j34
2409A7l11J08L8K66N7L15o51l7J04K10j46j51M42k26Q0j25k57L34k11K41k17J39
2431A9k42J23k98M19L7PK76k8l23p9N1r7L53P4l24K0k4l17L1J82J20L70j87q0
$$ plain form
2274 36 13 183 -96 -361 -96 41 -6 73 -70 -73 -354 -233 1 60 283 165 101 -376 -327 -13 213 122 196 121
2298 121 -102 -113 -87 20 -9 298 162 19 -193 -245 -40 -165 -204 -85 182 112 -176 -106 -304 -191 7 81 175
2321 175 -213 -324 -181 -409 -243 17 231 -290 -64 -208 -391 65 155 176 -40 212 -448 115 -170 79 -153
2342 -153 297 261 424 -347 -350 -177 -342 113 145 204 297 119 -85 -244 -193 62 125 378 -24 -329 -353 -234 -84
2365 -84 170 212 442 21 96 -278 -112 293 122 176 15 121 -1 140 -254 -422 115 173 412 144 -276 -159
2387 -159 -102 153 470 426 219 -4 -236 -114 76 229 108 461 129 -182 -113 -25 -74 193 6 243 151 17
2409 17 -294 -186 -148 118 175 490 -161 -198 -94 116 -30 -181 261 35 115 -10 -267 67 -144 97 -120 19
2431 19 -223 -100 -398 21 58 65 341 313 -10 -89 -38 -135 218 292 -32 -12 -36 -353 -322 -140 -20 350 163 83
2455H3k00j74J13L11M2j87M77n53k30P7J41K19m5j57M53j57n84K09n5J77OK52
2477B18k59R9j08n90N17L27j20P4k88m8R9N6j28P6N43m46m7k19j07j75M62J69
2499A05K96k75J23m79l6J02M9K53R6r9l96J29j99K83r9J79O2Kj49j78n1J69J03
2522a0L14n8k82K6j11J59kR4J69K9m08J82j94r0L17m3j5P0k15j96K29j72l6J48
2546i5R6k5L00n52N1L3k5K15L92k70J0k93j29L87k18J83R4r3k3k1j50K79l99K62
2570IJ42R9m31J17j43K00J0k51M13j61M50n94P7k21L91J18J7j59j83r9k6L9M30
2593B44j32M4O0j46m41K92P0J37J8j04Q8m51K83m04N85K50j81k52J44k2k08n5
2615a81L12o4J44k08j90m1j57K12L34K4q2j58n8j56K9O0J01J94j4j58l1j11j42
$$ plain form
2455 83 -117 -291 -178 133 175 -12 465 -88 -318 -241 -100 119 74 -83 370 213 -371 -162 -217 -40 -34 218
2477 218 -41 58 -50 -640 -123 204 84 158 -130 -178 -79 -23 -151 -75 468 22 -25 -244 -351 -526 -64 105
2499 105 401 126 249 -230 -266 -164 -115 138 234 135 -261 -132 -331 -48 -147 32 94 96 -53 -231 -282 -113 -10
2522 -10 304 246 -36 -10 -121 38 36 130 299 328 -80 102 -92 -182 135 92 77 147 -68 -264 -35 -207 -243 -95
2546 -95 1 -24 276 -276 -225 -192 -217 -2 390 120 130 -163 -292 95 -123 60 154 61 38 17 -133 146 -253 9
2570 9 151 250 -181 -64 -207 -7 3 -248 165 4 454 -140 -63 -284 107 225 242 83 -100 -199 -225 -186 244
2593 244 112 156 216 70 -371 -79 -9 128 146 42 130 -321 -38 -442 143 393 212 -40 104 82 -126 -181
2615 -181 131 67 211 3 -187 -228 -385 -173 161 185 103 -55 -113 -269 -240 -180 -79 115 101 -57 -88 -199 -341
2638c41m9M48j00K5N4j69j26M9J13K31r9K74M9m45J9K23N0kk12L06k67j37n6P0
2662i2J71J82j92O8k57k07J57M74j04J17k18j43P0k83L93k95K26o7K30k49k61
2683b80J51o5R7J0J63j0M9O5n0k27O0K50n8r7l71J18O0J4o0K24K9j38K17n20n7
2708d26L94k58K87J57k00M1l06L03j16j42M17J48k36J8L0r6R9k00Q7K35j62o9
2730Em69J88q8L57L73k35r2p5L6j03J70m1J27M3l34j55K43l6K93l17L31J18n11
2753a72J15L00k95J13J33k64L34m04k01L52lJ8n3J08R5J4k21j41K33R4K31l59
2775B7j14j8nm84L75K89J87o8l44M5r7j19N93k67J0l3j64p3J09J57p1J51L9k34
2799a09m8q8L17n6Q8j01K13K26m11l48L53k32M04j45M3j9n8k08n7L80k11J08K03
$$ plain form
2638 -341 -390 58 -42 -17 37 -132 -258 -209 -96 135 36 310 359 -86 -67 156 206 204 -8 298 31 -106 -162 -92
2662 -92 79 261 69 137 -120 -327 -170 304 200 317 99 -44 26 -257 136 -159 67 0 230 -19 -280
2683 -280 -129 -194 -97 -87 76 66 115 180 130 -97 -37 213 155 58 -313 -195 -135 -121 -181 43 72 -66 151 -369 -426
2708 -426 -32 -290 -3 154 -46 -5 -311 -8 -124 -266 151 299 63 81 111 15 114 -86 1 236 74 5
2730 5 -464 -276 -364 -7 366 131 39 -36 0 -103 67 26 153 196 -138 -293 -50 -86 207 -110 221 339 -172
2753 -172 -57 243 -52 61 194 -70 264 -140 -341 11 8 26 -27 81 176 190 -31 -172 61 155 386 27
2775 27 -87 -105 -110 -594 -219 70 257 189 -155 -110 -207 -326 267 0 10 -23 -187 -260 -151 6 -65 86 125 -109
2799 -109 -157 -245 72 16 104 3 216 442 31 -317 36 -196 208 63 106 87 29 -179 -236 144 -67 41 244
2822B44J63n77j19J1J96J48k81L03k47l5K2n5J54N7M10m89r8J86k08M7Q5M25k7
2845C15l64J69j14l29L87l2N4J44o7k03L0P2k73L77J80L4m47K26l15J25K36n4
2867A51k04K34l54L70k65k42N00j58L79n6n84J40L6%PJ49J2j08K9k21p5k6N46
2890B60J7l57L1K76k82m3J28L0R3l18L78k42L0l06K68L52l36r2L75l99J87o00
2912e50M46J94j7K09k64o9nj79M11j06rr0PRl1k63J02K09Q6j29K18j87k53k7R6
2937a92J62J57rj9k55J07k52K28k6K09l3k47l07J79M32J7k98N34k30j97N0k46
2959b36M07j60K98k88k43M74m57M00k07o4K44j36n0r8L5R2R2j63L76k45k50L26
2981A47n00K67J61j77J06R7q6j47J82l56J09L02j59J08J60k19J98j79K75k99J04
$$ plain form
2822 244 407 -170 -289 -278 -82 66 -215 88 -159 -194 -172 -227 -73 -16 394 -95 -193 -7 -215 -168 -83 342 315
2845 315 -49 120 6 -323 64 32 86 230 163 -40 -10 62 -211 166 346 380 -67 159 -156 -31 205 151
2867 151 -53 181 -173 197 -68 -310 190 32 411 355 -229 -89 -53 -53 -46 103 115 7 36 -185 -260 -286 260
2890 260 277 -80 -49 227 -55 -98 30 60 153 -165 213 -29 1 -305 -37 315 -21 -113 262 -137 50 -550
2912 -550 -104 90 73 282 18 -51 -56 -235 176 70 61 -29 -22 -13 -44 -307 -205 4 90 -39 179 -8 -261 -288 -192
2937 -192 -30 127 118 99 -156 -49 -301 -73 -99 110 77 -170 -477 -298 134 151 -147 387 157 -40 10 -236
2959 -236 171 11 309 21 -222 252 -205 195 -12 -76 168 32 -18 -116 -81 11 103 -60 316 71 -179 147
2981 147 -353 -86 75 -102 4 101 15 -132 50 -306 -197 105 -54 54 214 -5 193 14 289 -10 94
3002I4k36o1M44k37MK41k03N2j88p6O2R5M3j96L99N9m30j08J49j40n2M42k12J04
3026D9l44L68k57j02L32J46J00r9j8j01j53k6l0L90k47m0l5q0M9K2L25K3m4o9
3050A59m62R0J77q5N5J56R1j23k36J30J49m2j73N66n87m6K41l01J43J57j02J13
3072G0j56L9j24j81L49j83K01L36k39k03K2m1R2J71j44N5Q2o6j04nP2j02L50n4
3096B37k48J27k28rJ78J29k55j31Q2J83j79j40M11j25Q2o1l05J98J13j95O4J89
3118A17J0n4q2L03n59L93j86L02k01j1p1j46N6L05j81J49J3M8m86J50N7N0K21
3141A97n6j8j45q4k31J27K03K04k26L41l50O4j4j96K20M9J17l13O3P5k00Q6j32
3164b19K59r8n0J09n3k79L12p9J29m4L33k85k31J70Q9J6k70j8J94L63m02N0j08
$$ plain form
3002 94 -142 -203 241 4 8 249 46 98 -90 -166 -104 -9 34 -162 237 296 -134 -242 -93 -233 -285 157 -55 49
3026 49 -295 73 -184 -286 46 192 292 193 175 74 -79 -105 -135 255 8 -32 -67 -147 -98 -76 249 272 228 159
3050 159 -303 -213 -36 -121 -66 90 181 58 -178 -48 101 59 -114 452 -135 -181 60 -241 -98 59 -43 70
3072 70 -86 -47 -171 -352 -3 -186 15 351 112 -91 -69 -110 -18 153 9 64 146 80 -24 -29 43 -59 291 237
3096 237 -11 116 -112 -121 57 186 -69 -200 -118 65 -114 -254 157 32 114 53 -252 -54 59 -136 -72 117
3118 117 127 73 -9 294 -265 128 -58 244 43 32 -39 -185 -129 176 -5 144 157 205 -281 -131 -74 -24 197
3141 197 141 123 -22 -106 -337 -210 -7 197 -29 312 -38 26 12 -184 36 85 202 -111 -48 27 -173 -87 -219
3164 -219 40 -58 -108 1 -52 -331 -19 -98 31 -13 320 35 -196 -26 63 79 -191 -209 -15 348 -54 -4 -112
3187a12J87k60K49Q6K0j45j29j1J41O7K43l41k03K62l27L34R3j79K93k43m8q4
3209a07j79L77K9q2o4n5J1j54L46m27M86j74R0M8m24K33K49m4j43l1P2K13m54
3232a84p2M22r5L7K07l29n4J46k28JJ93K20l21J51n24Q9K96L65n37J74R4P1j44
3255b2J36l58M80K0j79j20K04m28K18K42l34j3L63j93J3P5j87m8J95N3l10K35
3277D2j96R3K1M9k11M14j81k51j84K59L36k24J02O7q8J07l44J75M1l1m3K44j29
3300F8j58l4p3N10n28J13K31p6K17l24k31K86j37J24j8R8L3Pl60K76m3J32k79
3323a66K74k22m1O8j26K57n1K90k05l00J05J31j07N0N3Q1j24rk75K56K06j86K88
3346B47j68j09q2j5n2j35L28j14J96J25k35pk5J12J66n44L58J83k18q2J76l17
$$ plain form
3187 -112 75 -185 64 150 170 25 -104 -115 26 93 336 -5 -208 54 -273 61 154 -25 268 25 -23 -107
3209 -107 -286 91 120 38 -26 -81 -70 -224 122 -305 181 7 97 145 -279 -46 203 159 16 -15 57 270 -184
3232 -184 -256 166 71 108 315 -14 -68 78 -150 -149 44 264 -57 94 -430 -341 -45 320 -217 -43 51 122 -22
3255 -22 114 -244 236 256 77 -43 161 -267 -49 193 -141 -154 209 16 29 104 -83 -131 64 117 -193 42
3277 42 -154 -61 -40 9 -202 212 31 -220 -404 -145 191 -33 69 136 48 155 -189 -14 27 -4 -47 197 68
3300 68 -90 -124 -197 313 -215 -102 129 53 270 -54 -285 1 -136 -12 -30 68 101 108 -252 24 -19 113 -166
3323 -166 108 -114 -155 -87 -213 44 -7 283 78 -222 -117 14 -93 -43 10 91 -33 -42 -317 -61 145 -41 247
3346 247 79 -30 -112 -127 -179 -314 14 -100 96 221 -14 -21 -46 66 232 -312 46 229 11 -71 105 -212
3368b12J29J14J60k15j87Q8K17Q7j39P1l49L18m39P78l81JM41j82j98j98J09l48
3390c35M18k07K42m7J71m90K49j96j74K99K42l21r3NK68k76J59K52k2K8j08l7
3412B7m2K40l86L60k36J02q5Pj98j2M04j64j27K78m33N2K6K08J46j45K18m58J30
3435h8k71N6N02l09K21k5j2K8j45J8K44k1j36J06k86K17j91L69k72Q1K5N6r1l20
3459b44J58L12k16K8k5K6l9p2K6K25j07rl82M58j46p2j78N59j66L8p6J03l77l7
3483b13J06J11No8K30k09R8l38L59N6l92N03k68K6N9k74L91k66L1j4M6K1j58K56
3507I8j59LJ64J62l22J60l50K38o1R0P6p9jj59J01k62J87L04l31k8R2m2j27P7
3531a69L68k96L63k86K5Nm0q2M9J08K83k38k3j33j17m7J38K01K25k79j27K29o2
$$ plain form
3368 -212 -83 31 191 -24 -211 -123 94 181 42 113 -236 82 -357 421 40 41 482 300 102 -96 13 -335
3390 -335 83 -124 118 71 242 -248 1 -195 -369 -70 172 -149 -242 -237 31 -245 -86 166 144 172 64 27
3412 27 -15 225 -161 199 -37 65 -20 -13 -211 -223 181 17 -110 168 -265 -213 -187 21 167 22 240 -218 -88
3435 -88 -359 -303 199 -110 111 86 74 102 -43 -25 219 198 62 168 -118 99 -92 277 5 86 111 167 76 -244
3459 -244 -86 226 10 38 13 39 0 -72 -46 179 72 63 -319 139 -7 -79 -257 302 136 174 98 201 -176 -213
3483 -213 -107 4 9 -59 171 -38 60 -278 81 137 -255 248 -20 6 65 -209 182 -84 -53 -67 -21 0 -158 98
3507 98 -61 -58 106 268 -54 106 -244 -6 -67 23 99 20 19 -140 -39 -301 -114 190 -141 -169 -77 -119 -246 -169
3531 -169 199 -97 266 -20 5 10 -30 -112 -63 45 328 90 67 -66 -183 -230 -92 109 334 55 -72 157 95
3554I5Ln4l5Jq5R4q2j45M8J50p1M09k64l17R2M0J40O2m4l9K7j91O3KJ77J20k70
3581g4n3j71J74Q2j29N8K45M3J97m60L5L15j66j2j5j25k1Kk68M48j96J55n9O4
3605F9j60n2J26j62R6o8K90j53j06o3M3K29j53nN5K19l3k53J2N9l88K03L55k8
3629A32k71J51j41m4J15j66L40P7l50K33K61m50K40m3k4K4j00j10l2L0K57Q0k16
3652gr3K3P2j78K37j62K07j76j6R3K3n7j56J37K89N7k97j8K9M5p1J61O4m13J55
3677e2Q1k54J96M4R1j64J09N6n8j85j53K54R5L6K6l10J59j9K37k71K42J54j68
3700A46k28j48J99L3P2j38K22j73k46L64k62M82j83k69ML35l84L53m44K34K14
3721A83r5k28j94J52K24j0N8N7j34j10N8j45J28j43K45K79l32J9J99n93Q2M52
$$ plain form
3554 95 98 44 9 10 -75 19 -63 -208 -160 -10 -81 328 64 -253 -161 -121 19 81 37 -2 25 -166 -103 -101 76 196 -74
3581 -74 -127 -298 -124 -42 -171 -113 132 175 372 -88 -53 262 96 84 69 -56 -77 -75 -343 105 -91 64 5 69
3605 69 -91 -143 -17 -179 -83 -151 139 -14 -120 -183 -140 89 -64 -69 -14 205 172 -81 -69 -10 -398 -195 160 132
3629 132 -139 12 -129 -173 -58 -224 116 193 -157 76 337 -113 127 84 60 84 -16 -126 -158 -128 129 209 -7
3652 -7 -100 -77 -5 -183 54 -108 99 -77 -93 0 23 -34 -190 -53 236 293 -4 -22 7 52 -19 142 206 -207 -52
3677 -52 29 -225 -29 15 106 -58 51 107 49 -136 -289 -35 60 96 122 -188 -29 -48 189 -82 160 314 146
3700 146 -82 -230 -31 2 74 -64 158 -15 -261 103 -159 323 140 -129 -125 210 -174 179 -265 -31 183
3721 183 88 -140 -334 -182 42 32 90 147 13 -97 -39 -184 -56 -199 46 325 -7 12 211 -382 -300 152
3743A52k64J09P0j11m4O1L3nK09k06Q1l3k94J07N2J88K29k25j46L3j18j0j50M72
3767A90J16n2j44J88m14J80J29J0p3j80m9j2K17k24K35l06K64Jl6R1l08J52K1
3790dKJ23j26J44k62K23k34J45N1%j13K93j33l99K97j20J28q9J86p9Q4m16N00
3813B01k34J2J21K6l33M69k58J29J85j08J3m31J94J40j78R8j40mK81k31N3j84
3835a79M0PJ59j57Q0p4J65l08J88J5j2K32p3K45n66J62k47J95N48q3q0n8l21p8
3859b00J20J92j78N7R9j25k37L95k31L77k72rJ67j52j17J54l82L03J21J34k08
3880Hj32L2j7J97k8j77M0J40K87m45l45L99j33L30q5L7n7m56J09K19N8J06J29
3903B16k88K73m42L40J37l35m5M2N3J88l07M9J64j5l4o3L85j96j10O6j48K75K0
$$ plain form
3743 152 -112 -3 67 -44 -88 -27 6 1 210 4 85 52 -242 -135 -83 105 334 109 -37 -4 -122 -132 -282 190
3767 190 306 254 110 298 -116 64 193 203 130 -50 -99 -111 106 -118 117 -189 75 76 40 131 -177 -25 -4
3790 -4 -2 121 -5 139 -123 100 -134 11 62 62 -51 242 109 -290 7 -113 15 -74 112 33 117 -299 201
3813 201 -33 -21 100 126 -207 262 4 133 318 210 223 -208 -14 126 -52 46 -94 -98 183 -48 5 -179
3835 -179 -139 -132 27 -130 -50 -124 41 -267 -79 -64 -76 156 83 328 -238 -76 -323 -128 420 337 257 199 -122 -200
3859 -200 -80 112 -66 -9 90 -35 -272 123 -108 269 -3 -12 155 3 -114 40 -342 -39 82 216 8
3880 8 -124 -92 -109 88 60 -117 -77 63 350 -95 -440 -41 -174 156 71 108 51 -405 -296 -77 -19 87 216
3903 216 -72 201 -241 99 236 -99 -144 -102 -49 139 -168 -119 45 30 -4 -67 318 122 12 78 -70 205 225
3926B25j83Q0j95K38j65K2J53L1l44J16L7j78j48M22k7J58l86j16K11K73o9j41
3948A4j80n6J08J28J93k28p8r8K97j54L7J1m3k8k7L43k72q1q0J54L61m51J5L29
3972B14j4k53k0J20l85L09N3n7J94q2K3kj29J88j28j73r1O5J6J13J5j29j53O25
3996C19l12l8K6j73M13j06j38M8J40l49m9K96k13J49J8L06k33j69k58K09J40q6
4018f0J32J30q6j07J71j85n9J96J14n1m76K24J51O4n0m55K81n4J92J22j86p7J00
4041C1qj40Q3j02MJ27j9j88K42J28k63j32P4j34K87Qq5J55J07j11k09r9K45J0
4065A1j69K46j03k00L12l9j2j78K99j68Q8j28lN7k39L10j3k72J69N7k95R5J15
4088f0N3j08N3J4k30M84l96K1L1J4L39l46J2N9r1k02K1J80J92J86m27O4K08j68
$$ plain form
3926 225 42 122 -73 165 0 22 175 206 -138 -22 15 -163 -311 111 84 242 -144 -260 -49 224 155 14
3948 14 -166 -222 -114 14 207 -21 -99 -197 100 -54 -17 -6 -49 -77 -104 239 -33 -114 -194 -40 321 -130 -115 214
3972 214 200 -53 -73 47 -338 -29 24 -33 161 79 102 100 -29 159 31 -142 -233 -168 -152 -39 -24 -153 -306 319
3996 319 7 -31 -5 -178 235 129 -9 39 179 -170 -219 77 -136 13 31 337 104 -65 -323 -114 26 -60
4018 -60 72 202 116 9 180 -5 -64 132 246 195 -281 -57 94 158 108 -347 -66 -120 72 194 8 -69 31
4041 31 23 -117 -34 -136 -132 -5 -24 -212 30 158 -105 -237 -163 -297 -10 -2 -87 68 175 64 -145 -244 1 11
4065 11 -158 88 -15 -215 97 58 46 -132 167 -1 87 -41 -44 13 -226 84 71 -201 -32 25 -270 -175 -60
4088 -60 -7 -115 -62 -48 -278 206 -190 -169 -138 -124 215 -131 -119 -60 -151 -353 -332 -152 40 226 -201 -137 71 -97
4112i7J48j6J6Jj74K37%l35K28J7R9k19j9r8K51K3j45K67j34p3J83k31r1L23k42
4137h1J7L10l85K9J43Q4k07J71J65m81j22M14L5n5P8k2o0j71K40J8K18k21o4m85
4161d32L97Nk1M6lK09K6k0m87J24N4j79K18k8O4J98j11j36OJ85m1J06q7j66M9
4186b4J44m25R6J22R5J21k14J63k78oK26J07l54K55q8J13j27K95m23K41p9j51
4208a91K42K17l74J98j78R1j39j51J74rL8M8K36k93J00O4j59k42L72j86O91n67
4230a8j61J98No7N2p3j25K16Q5J4j09j96J62J67J3n81M28P5k47K10j85k9N04m06
4254f8Q1l48L37j20P7J00J34j71J03l15M6K87j86n4j27M70l60P4j26K54j13j21
4276a46J69j77J51L9M4m67M69J3o3J77j64K6M3j00j69K75J73j42k44j77K95k12
$$ plain form
4112 -97 51 35 51 52 -122 115 115 -220 8 25 124 -95 -114 -212 39 62 -83 184 50 -23 160 -71 -162 161 -81
4137 -81 -64 246 -139 -110 33 117 -90 81 246 -235 -357 57 92 37 115 93 33 -138 102 120 338 117 53 -432
4161 -432 -35 -30 -51 -5 -8 201 227 207 -280 -156 -102 -281 -63 -91 -27 171 60 -76 -70 115 74 180 93 -73 -24
4186 -24 120 -305 -209 -87 8 129 -85 78 -200 -206 20 127 -227 28 -60 53 -74 221 -202 39 -40 -191
4208 -191 51 268 -106 92 -86 5 -134 -285 -111 -120 -82 -34 202 -91 9 73 -86 -328 44 -142 549 -18
4230 -18 -179 19 24 -43 9 -64 -189 27 112 126 17 -179 -17 150 163 -418 10 85 -162 48 -137 -166 338 -68
4254 -68 13 -335 2 -118 -41 59 193 22 125 -190 -144 143 -43 -97 -224 246 -114 -40 -166 88 -25 -146
4276 -146 23 -154 -3 36 80 -387 82 95 32 209 45 71 114 14 -155 120 293 151 -93 -270 25 -187
4298a87J06J79q2j75OK44K4l52J65K57j37k2j64k55L44q8L18n0m37J68K28j87
4320i7p5L28j44J3j05J25p3k79K85J77O7j52N3j66R7N1k92K31N7L8l36J15j3J49
4344E4P5J06k03k96K18J60j29j99P7J45J4m4J98j76J66j72m3J92l2jP0k72r8L61
4368A71k04n8J37Q9j7p1K2R0l41R4L28k09m8J7l24J29O3L87l02Q3J08J09m3k52
4392d2K50k22P2N8n3K5k68K12N6q5k61K68j13P2R7o0K2J97m0l21J50p3L71m02
4416i0J93n0p8J30J97k61r1Q8L77n65J39J94l14jK19O9J7j01JK27j72k88M1K06
4440H7m0r0m1L04j56j21J58j69L92j91o0j83J17r2J98j1k18L03o1n52L87j08k58
4463d05O18j36J17n70L39K29k72k07L02l7R1k56K36j42J76k43J49Q4Qn4j15J4
$$ plain form
4298 -187 -81 98 16 -159 -153 91 115 -237 -72 185 48 26 -138 -393 -49 -137 181 131 -306 -138 90 -97
4320 -97 -172 156 12 25 -80 45 -28 -307 -22 155 222 70 123 -43 54 105 -187 44 101 139 -197 -82 -95 54
4344 54 129 235 32 -264 -46 114 -15 -214 -137 8 22 -22 176 0 166 -6 -49 143 111 110 180 -92 -190 171
4368 171 -33 -91 46 135 118 47 69 159 -182 -88 240 31 -17 0 -324 -195 -132 255 -47 36 144 253 210 -42
4392 -42 208 -14 58 116 63 88 -180 32 88 3 -258 10 -103 -31 66 6 28 225 185 -136 14 -59 312 -90
4416 -90 103 53 -25 105 302 41 -50 38 415 -150 -11 183 -131 -132 87 156 173 72 73 300 128 -160 -119 87
4440 87 47 -43 -84 220 64 -57 101 -68 324 133 73 -110 7 -85 113 102 -116 187 126 -426 -39 -147 -405
4463 -405 213 77 194 -376 -37 192 -80 -287 15 -22 69 -187 49 -93 83 -160 -11 73 81 27 -88 -74
4485g4J59L3l05K30l66K25p2l7K18J2k06L20j92J25L6l88L96L5p2j12J69n9o9
4508FJ8kL1M1rj17J55l50L00k42P6R6M11m71Lj34r3P9M22k53N9k38J82P3q0J95
4534A58j04n5p3K54k53l5K92o3p5k3m4j29L6O2q3O5K68k44l8J10j76J30J76j98
4558d2K09j97O3N8j58j89L30j3l24M12j48o8J23n4P5J26l99M09l53M05l26m1J37
4581C5O2k33n1K12j87k4K28k72P5J84K45M2m02p8k09J16L03r1j86j7J90j58pL17
4605I4l82K53p5J89j80L94l07r5L7K1J17r1rK3j6M7j30oK43j57l2J91q3l9m50
4630d43K54L9O4J22kL8J42j0l76J58J34j31k00N36j88K0j1m3j24J64l79K30J40
4653A34m3j17k98L56L5j91N49o39K37m3N5J33j45J74j73j22J59o9j84P1%J23J88
$$ plain form
4485 -74 85 118 -187 43 -323 -98 -170 -207 11 23 -183 137 -55 70 106 -282 114 149 77 -35 134 75 6
4508 6 24 22 53 94 85 -32 123 -227 73 -169 -93 3 414 -57 -54 -188 -281 -202 220 -33 26 -212 -30 43 -37 158
4534 158 54 -1 -74 180 -73 -108 184 121 46 23 -21 -150 -114 -52 -135 -70 198 -46 -84 26 -150 -20 156 -42
4558 -42 167 -30 33 91 -67 -256 74 61 -263 149 1 -67 56 2 77 203 -196 213 -140 265 -61 -102 35
4581 35 97 -136 -187 25 -162 -186 42 -230 -155 29 274 316 -86 -164 -373 -257 46 -45 -231 -248 -58 -216 -223 94
4605 94 -288 -35 -110 79 -101 293 -14 -109 -72 -51 66 -25 -34 -11 -27 20 -110 -116 127 -30 -62 129 46 7 -443
4630 -443 -189 -150 -86 36 34 72 214 204 -172 -14 120 -11 -211 325 137 157 146 103 -21 143 -236 -6 134
4653 134 91 -26 -324 32 67 -124 425 -214 23 -20 35 168 23 197 24 -98 61 -8 -192 -121 -121 2 190
4676A90l42M80m22j72K45j3N4n2K00k26l31K43J07K47j22nj96J94l47P4L62j81
4698a3L5P2l08J40p7J3j1J59p6K88l21p2J50L1j31M15l35L19k83k08K99m25L93
4721E4J32j52k29J71j60K73j08j11M42k78k82K13N9j50N3J82q7J14k39K10j34
4742b7J16k1q4J08N6k16l4M2O8l19L25O6q5j93L98l0j96J55j63k34K20j57M59
4765B54k68q2L50L9k36j29K4l38L19j72K75L7K0l57R1M13l13J41N1Pk2K76n75
4788a95O1P1o0O4M3N0j48J85K0R1l07J1P8K81k04j87J67q0M8L27l21J10J54k12
4812D7k62O6J51j47M1J1KK48k93J15J1J67Q1m14K15n4k53L82j85n5J78j22O5k7
4836c2j19K38k40J88K34k18l72L23k69L11l79Q2L00K4m4p9J56k65K88j61m8R6
$$ plain form
4676 190 -152 328 -94 -266 -21 -34 20 -32 168 -58 -389 -146 -39 208 86 81 -115 79 -268 -194 168 -13
4698 -13 22 94 -214 -74 -151 -138 -149 10 -66 222 -99 -171 -21 10 -121 294 -41 278 -5 -213 86 -339 54
4721 54 186 34 -195 -24 -184 89 -19 -130 312 34 -248 -35 24 -126 -73 109 22 136 -103 107 -27
4742 -27 89 68 -16 92 148 -68 -102 -60 8 -311 14 80 -5 -198 200 170 -26 129 -34 -268 -48 -205 254
4765 254 -14 -96 254 293 57 -72 -48 -386 -67 -239 36 73 93 -264 -173 240 -73 68 119 126 104 380 -195
4788 -195 -134 -63 -123 -59 -16 34 -114 71 91 182 -125 -114 -36 245 41 -146 21 -59 -11 316 -5 105 259 47
4812 47 -215 -149 2 -145 -104 -93 -91 157 -136 -21 -10 157 238 -176 39 -15 -268 114 -71 -126 52 -70 -5 -32
4836 -32 -151 87 -153 35 269 51 -321 2 -267 44 -335 -253 47 71 27 -52 104 -161 127 -34 -82 14
4858A4r5P8K81l13J5L93l99l5P9j38J12j74l2M94k82J08j4J7m8R3Jo3J06k25m25
4883d52O23j48l24M31n2j20Pn9L6J79j75J30k0k94K76L01m55J25J04k6j82M6j67
4906b16L11k5j82K7j41P8N7P7j3j71L51k17K02j9j49J44j23j10J91p2r9N8N2l15
4930c04L00k29K43n4J1j43K60K06k60J90j92Ok05P9L7P7k76J98R8o5K96l03L19
4953B89l11J40j05J68k31q8NJ36n8J18j89J00N4q8j5j57O11m65L5J1k2J94k84
4976a52J9J81l7j39N7K8K54k00K7J81k76M3O2j6q0J82k21o6P9j14J32P6L7m45
5000c88L64j45q2J97l15J15K07j8L9m2j76K24J38j94N6J04j04o3J81q7J0k34L49
5023A36j41k54L20j64R1K25k15Q0r7J18J90l22k45L05l43J87J28K26j80J02m9
$$ plain form
4858 14 -81 -3 278 -35 -20 373 -26 -61 18 -120 -8 -182 -214 280 -2 106 92 109 61 154 155 92 198 -27 -452
4883 -452 171 23 -301 130 78 -42 -35 -94 -58 121 -54 76 56 -238 38 339 -116 9 113 87 -95 -49 -216
4906 -216 95 70 -112 -85 -226 -148 -91 -14 -27 -198 153 -64 138 119 -30 114 -9 -119 72 0 -99 -41 11 -304
4930 -304 -4 -233 10 -44 -33 -176 84 290 30 220 28 34 -171 -92 -55 22 -254 -56 42 -23 273 -30 289
4953 289 -22 118 13 181 -50 -138 -133 3 -55 63 -126 -26 28 -60 -75 -232 379 -86 -51 -40 -62 132 -152
4976 -152 -133 48 11 -128 -71 -43 211 11 38 219 -57 -14 48 32 -48 134 -87 -153 -74 -188 -56 20 57 -388
5000 -388 -24 -169 -251 -54 -369 -254 -47 -65 -26 -68 -244 -20 118 -76 -20 84 -20 -83 98 11 21 -213 136
5023 136 -5 -259 61 -103 -12 213 -2 78 -19 99 289 -33 -278 27 -316 -129 -1 225 45 147 98
5044I8k74K98J2k64N8K50k85J93KJ11k44O7j23J2J84j03J29l24J33J4j27K94P5
5067A86k55K04p5k33k7J65K52m14pL19j28r0r5K12L66k10j23k11J55l0K6K59j60
5090H6M4%J04o21M04p4J69N7J12j40j66J31k75J28j4K96k47J01k59M13k64J44
5112A29n0L38m44J4k51J22q4L40J03k70nj3L07l84p8J85O7J08n1O2k74P4J46l59
5136b68K00n6L03j4j95L3k5K41Rj98jj06K2p5J14k44L78P4k23k7J62LM5J06m94
5161b36K13o4R3r5j35K72R0j76J27j26K57j57j40J56j62L34j65j03Jk38M47N3
5183B46l10J93k45K76j89l00K45k68N91k32nk1J03j43Q8J18k97J00j38K5R2J61
5205I0L6j72J7o6j3R5J30l2j62L6L30k11k27n2K17J4O8j04j17R6q3k7K8j65L14
$$ plain form
5044 98 -176 122 134 -130 -72 178 -107 86 88 199 -45 22 -101 -89 95 -8 121 -203 -70 -56 -183 111 186
5067 186 -69 135 60 -173 -200 -35 217 -197 -204 115 -13 -103 -198 14 380 170 47 -164 -9 -39 -13 246 86
5090 86 130 130 234 -387 17 -57 112 169 281 141 -25 106 -169 -41 -55 241 -6 95 -164 249 -15 129
5112 129 79 417 -27 -13 -264 -142 -226 114 217 -53 -58 -71 236 -148 -226 -41 26 134 83 145 -129 -55 91 -268
5136 -268 -68 -124 179 165 -30 3 -22 219 228 30 29 -77 -55 -130 -16 -260 118 192 -31 -58 104 107 152 258 -236
5161 -236 -23 -87 6 -89 -224 48 138 -38 89 -37 220 63 -77 79 -83 251 86 -17 -16 -254 193 246
5183 246 -64 129 -116 160 -29 -329 -84 -352 239 7 2 -19 84 -59 29 147 -150 -50 -188 -163 -71 90
5205 90 126 -46 -29 -95 -108 -13 117 85 -77 -41 289 78 -149 -201 16 30 98 -6 -123 -27 -110 -137 -109 -274 40
5230D0L5jj82J62k22J72q1P2K47j23j92L8k59J12j4J94j8K56k53J55k64J05j29
5253a50K87j67O1j51k29J50K75m4Kl3J32j21R2j83k18L65j55J2J78j57k09J90
5275g3o1J77Q2ok06J83rn0q2Qn3J38k10j36L92N7l97K79k47P0J13j48j6L36j6
5300A25j11p8J91n4j29N0p1j73L43j33J94L1k22j71k3J63J91j81j82J78n8n9J94
5323A5j38J05j08L82q4N2k51P2j49J46p9J17j05J12K56j14m29L46K9j44k21K32
5345D2k51L20n2J65m95M14JO3k24J52j37k9J59n2k5m7O6Q4j11k7j1l0J16J28l76
5370a57N4M3K73k75K27j48l03M66O8j77q9P4p4J43L29q12M13R8j3k86J05L9r4
5393i6j08M26j32j56k7m1J50j26K6O0j24L00m95N29l24J3L06j23K01l49M6q3L71
$$ plain form
5230 40 75 74 -108 54 -168 4 -77 -5 242 119 -73 -35 -294 -182 -196 -2 -20 236 -17 138 -126 -21 -150
5253 -150 137 -30 31 -120 -349 -199 76 32 34 1 133 12 104 -79 -297 68 -87 -75 103 -54 -263 -73
5275 -73 -134 43 125 119 -87 96 87 37 -45 -37 -90 48 -162 -298 94 151 -246 33 -214 -144 -31 -179 -195 141 125
5300 125 14 -64 127 73 -56 -6 -77 -250 93 -40 154 185 -37 -208 -231 -68 123 -58 -240 -62 -120 -179 15
5323 15 -123 -18 -126 256 172 224 -27 45 -104 42 -37 80 -25 87 343 229 -200 146 175 31 -190 42
5345 42 -209 111 59 224 -271 143 144 207 -17 135 -2 -31 128 76 51 4 70 154 43 16 5 -25 91 219 -157
5370 -157 -103 -60 213 -62 165 17 -286 180 248 71 -18 56 -18 125 454 -358 55 153 140 -146 -41 -2 -96
5393 -96 -204 222 90 -66 -93 -134 16 -110 -84 -24 -148 152 -343 186 -138 -125 181 58 259 -90 -44 -127 244
5416B44k79J89J72o17K64J65j66J36k76q8K89j6K07r0M4j03l39J00R6Q2J93j48
5438E9j3j21K4K62k07J03j34q6J56k71K02K01j82J87j86jL88l36j60R3K13k01
5460a0JQ0J87l80K26p0j24M5K1pK7J35j19L1j89L48m18K37n4R6J81j28l62O0J80
5485fp7J19o6J66k6j20r3M6K64k83J19j4L4j26j53K63Q0l9O7l11J7J51j00M84
5509C96k22j20n6j59K65k6j71p5N6J46p3M3k32J27J04P6m0M33m02l4J31Rj24j38
5533h6m7R8qj43R8NJ06k05K36O7m9p7P0j91L30j85oq9j29K41Lo2K00J18l98K94
5559A91l26j5p3L16l44K52k93L75j25n3J21L2j80J09M4l77M42j93RK29l89R7L0
5582a21K09j47O9j36J40N3j74M9K15l23m5J05l11N07O8j54J37m66L59j65K80q7
$$ plain form
5416 244 -35 154 326 -291 -27 138 -28 108 -168 -256 33 17 224 134 178 75 -264 -164 -68 14 207 59
5438 59 46 -75 -51 211 4 107 -27 -113 43 -228 -26 175 -7 180 -6 -7 381 45 -115 -22 191 -10
5460 -10 -9 71 258 -122 104 34 -90 -45 -24 -31 -4 131 12 43 -146 202 -216 21 -33 63 244 116 -246 -186 -6
5485 -6 -83 36 -30 136 110 -10 -103 -57 207 -76 43 29 63 -63 -216 47 127 88 155 -156 -139 12 -88 396
5509 396 174 54 -2 -161 104 78 -93 -168 -112 34 -39 4 -228 -101 3 79 39 472 70 36 167 176 52 -86
5533 -86 -133 -35 -43 -186 -88 -83 23 -182 54 121 72 -5 65 -126 204 19 13 -76 -205 36 39 -23 177 295 -103 191
5559 191 -135 -150 -223 93 -251 1 -292 83 -42 -95 26 58 -122 -13 31 -346 96 -97 -88 141 -248 -151 -121
5582 -121 88 -59 10 -126 14 67 -107 -58 157 -166 -211 -106 -417 90 158 4 141 -325 34 -131 149 62
5604F2k60K95k75l2L31p6L0J9j0J62m48J60p8j42M64l71J21N7qk4P6o5L06l05
5628a1J09l08L02j16J41Q3k34k72L96J42l18Q4K9O5p4J44k54K44Jr0l65M83j57
5651B4l1m3M22k16P9l04RJ42j67K1j13J30k8J19j73O3k2K38j60k7L22m54L32m20
5675b57M31j18m6N1k34J80J25j40J06j60K21m30q4K21j5L20p4k57Q1j79L62K50
5697C54o08J65K6J42Pp7nj80K6J77O2J7k23J47j33Q8j13J01k2J16n3l17K87k48
5721b64P9K17N2K31k05k02K6M1K42j10l3J05Nk07m3J69j90J36P9j85L31k56J64
5744A82p4j13k00R0o2Q4K18k34q6K15k47M2K82k60K35K6k20J1R2Q5NJ12l36K44
5768I1K2o8j49k4K42k01M4J50O9M2k49L4m9Q6R9j76J27r9J27l75L44n8n0N1r2
$$ plain form
5604 62 -198 97 -178 -210 121 45 75 94 84 246 -202 -42 -120 -262 202 -169 -48 9 1 -23 53 -12 294 -11
5628 -11 98 -210 92 -24 117 200 -34 -306 90 232 -86 -2 27 92 18 162 -92 152 153 63 -302 181 24
5651 24 -7 -50 372 156 235 -69 -60 82 -85 -64 -177 -47 -75 44 -129 -66 -88 150 -10 -37 285 -169 163 -257
5675 -257 174 56 10 61 -173 7 132 -8 98 -62 159 -271 -355 -134 -149 171 97 -160 -79 -258 104 354
5697 354 -254 -89 -63 79 86 9 4 -176 -150 27 89 106 -117 30 -103 -15 -128 -27 -49 67 14 -303 -16 -264
5721 -264 -185 32 84 315 110 -92 -66 -25 217 107 74 179 184 -23 -66 103 -87 49 128 -57 274 18 182
5744 182 108 -5 -205 -115 -177 -93 125 -109 -195 20 -227 -185 97 -163 72 98 -122 -111 -19 66 71 183 -153 91
5768 91 113 45 -104 -128 114 -87 -43 107 176 218 -31 3 -46 40 139 -37 90 -9 118 -257 87 29 -21 30 -62
5793f2M50n20J58k41J65n3j01L96n20M29j0k68L68J0j77kj02J31K25k17j94o4
5815a99L23j16J12k78P3m7K37j24L2J08j28L79l02j57M6n7J49j52L12j61j34k9
5837a13L95n68J71Q0K11j90l8P6K04N5j95k37L75j85n6n1j21n9J63R7j99L16K11
5860C42j34m14N07k99o5J98R1j20l19L11j62K1K07j47m1j56R4p7L14j21j40K42
5882A32j14J14l48L44j22L8m6J09oj00o1m0J2M5k59L86m40M73j19q2J61n5k6p0
5906g4L07n38K70L71m21R5J51k91J49J64l65M19k56K07j8k30j19P4J57l02K29
5927b1J31K63l15m5P1o3J69Nm41K21L62k75j84J56p1L5K83l71P4j75K62qj58K55
5951A60R4k43j0p9o0J51J55j87J15j46L6j36l0k7M16l31M43k74J23k86M03k07
$$ plain form
5793 -62 388 -132 26 -215 -50 -103 -204 192 -328 101 91 -177 191 201 24 22 -80 51 276 59 -135 -199
5815 -199 124 8 120 -158 -85 -132 105 -19 13 121 -7 372 70 -87 -41 -98 51 -101 211 50 -84 -113
5837 -113 282 -286 -115 -35 176 -14 -52 24 228 283 88 -149 226 41 -15 -66 -187 -246 -83 14 -185 131 342
5860 342 208 -206 301 2 -63 135 226 106 -213 98 -64 -43 164 17 -24 -180 -86 -163 151 30 -110 132
5882 132 18 132 -216 128 6 44 -2 107 101 1 -60 -100 -88 -43 -302 84 -356 117 -2 -84 77 22 -4 -74
5906 -74 233 -305 -35 336 -85 10 161 -130 19 183 -182 237 -19 188 170 -60 -179 -105 52 -250 -21
5927 -21 110 373 58 13 84 21 190 195 -246 -25 337 62 -122 34 -37 -2 281 -90 -16 -191 71 63 -95 160
5951 160 254 11 1 -78 -138 13 168 -19 96 -50 -14 -150 -180 -207 209 -122 321 47 170 -116 287 80
5973H0L54l00N2k95k5J69j79Q0P7M2O3L9j04J71o37M86m4O4l35M0L91k28M1j1
5997ij31K84j91j61K44J54j29j12J45k3j31J60N1j34j01ln4MJ43o6J61k04J32
6020B9J36l2l2k17L7J91j52J48L32k62n2j22M4r6J43KOl69Q2J62o0L25k73o1J69
6045G8k05J4nK96q1q6m9N1M1j0k42N26l72j7k68J87L05J86l04J04O3k88J78P4
6069A76k7j29k24L11j93J01l14L34j44K09k35K7M58q6k44r0M57n14lM5n7K55r7
6092A6k45L45l37L12j16J24Q0j99M8k51L91l65L99m3L6j51J2J78k28J70l05K11
6114H2j00K93k73J01J51k65j7L06k48M4k9j97L54j88Q4q5R4j53J84p7j85k6K23
6137G3r4l6m6J93L7j19M15o34L09q4j77K23L35l62m7M7K80l06R0j91k62L18J79
$$ plain form
5973 80 434 134 186 -109 -134 35 -144 -64 13 55 118 157 53 224 -413 73 29 93 -242 -202 189 -39 2 -9
5997 -9 -140 144 -47 -208 36 190 61 -51 94 71 -60 100 151 17 -84 -87 -141 -137 6 -60 101 -103 29
6020 29 165 133 101 -116 -79 112 -40 108 440 178 126 4 48 -48 95 97 103 -266 -184 -22 -82 243 -30 -91 78
6045 78 -127 -113 -118 178 97 11 -38 13 54 44 -198 328 -44 -61 -329 -142 163 349 45 149 212 -76 102 176
6069 176 149 20 -204 107 -86 15 -299 35 -109 100 -135 -108 350 264 20 -70 387 -127 -130 -85 -142 113 16
6092 16 -229 116 -221 91 -25 99 179 -20 28 -223 168 -197 202 159 195 44 56 234 6 176 -129 82
6114 82 -18 275 2 103 254 -11 -28 278 30 74 45 -152 202 14 98 13 107 -46 138 61 -124 -150 73
6137 73 -21 -57 -103 90 127 8 423 -211 98 14 -163 60 395 33 -14 33 313 7 97 -94 -356 -38 141
6160A41N6j48M2M2J80k20N8j1k33K57K93j66j93P0l88J95k04K51J52q0Kl94J45
6183a53K33P4r0P4R3l04k3J02M5q5l8N0L2L3n7M8km7Q3K7j51Mk5L83j25o9k19
6210a07K03M5q7j63L1N4K1k36M95j18k45J72k41L49q4j06l55L88J01P8m48L87
6232A34j6q8k22N8J86J93k87j53K18J51J35k87k05J44Q4p1K21K1j27j79L2K50
6254A92l36m2L87K1P2j52r1J81l84K92J52j62j10j03n1P8J78k46K15o6p9L1R5
6277G2j24Q3j12M6J17j7k59K83r9r0l5k36p3O79j95o5K46k57j3L2n0r3J98j32
6301i4L24O5l32j66L49k18j7J1Rn9J17J92k1p3j21r3J62M7l60L65k89K99j19q3
6325a05J12j10K45j69o5j85L86lp7j42O9l4M2j37L0O6K2J51j8o6j37J14O5P2k96
$$ plain form
6160 141 197 49 91 133 313 93 151 140 -93 164 457 291 98 168 -220 -25 -229 22 174 94 96 -298 -153
6183 -153 80 154 64 138 231 -73 -96 6 51 -34 -72 -22 10 43 -14 34 32 -15 68 95 -56 -52 -77 306 181 112 -107
6210 -107 96 141 54 -109 -78 -24 -3 -239 256 138 -107 65 -176 173 89 -17 -372 16 117 195 -253 134
6232 134 118 30 -192 -134 52 245 -42 -195 23 174 309 22 -183 -39 45 -26 195 216 89 -90 -58 192
6254 192 -144 -186 201 222 294 142 51 232 -152 140 292 130 20 -83 -134 -56 122 -124 91 25 -54 -23 72
6277 72 -52 31 -81 -35 82 65 -194 89 -10 -100 -135 -371 -444 235 40 -25 221 -36 -49 -17 -67 -160 38 -94
6301 -94 230 295 -37 -203 146 -72 -89 -78 -69 -128 -11 181 160 87 -34 -127 35 82 -278 87 -202 97 -22 -105
6325 -105 7 -103 142 -27 -92 -277 109 106 29 -113 -44 -78 -36 -173 -143 -77 -55 96 78 12 -125 -11 54 126 -170
6350a70K76J22l30Q0q6J42q3p3n6M04r1j35k2n5L4R9r2L12k70j58J29J4j89J35
6374f3l8M7P3M4On4K95k55J46l16M3K35m77M66Q7m25K44Q2m18p8L66J03k8J06
6398A91l91K01P0k12J08j38K43j44j18L82j36j44L2K09k05k24J40K29Kk90L45
6419A50k28J39j23L75k40j0j02R7j07J08k31J39L19k63K85l35q7o2N3K79j58P7
6441G5k11J1J98Q2r3j43J04K68l85j9K17l69J26J89m6j06j27L20j08K32j32j19
6463c6J50k3k24L82j15J62m63R7PN42m53j5N4J19m61P0J81k9j97L68oq1j41K66
6487A54j02k39j25M40l12J92J30j47K19k53J66k53r8J81r8j07J40j21Q5L86q2
6508A56np2m6q2J70j78Q8m7r7O8j08L71j40o5q3K75j53k87K92q3K1j66K81k26
$$ plain form
6350 -170 106 228 -102 -22 -108 34 -49 -122 -178 226 135 0 -22 -77 -43 56 -36 276 6 -152 -23 -9 -198 -63
6374 -63 -101 -54 19 63 69 15 310 55 201 -115 -72 163 -314 152 239 -186 58 140 -278 -356 10 113 85 191
6398 191 -200 1 71 -141 -33 -171 72 -72 -190 192 56 -88 -56 153 -52 -276 -136 93 95 -195 150
6419 150 -78 61 -62 313 73 63 -39 58 -49 59 -172 -33 286 23 308 -27 -114 -176 -123 156 -2 75
6441 75 -136 -125 73 155 62 -81 23 291 -94 -113 104 -265 -139 50 4 -102 -229 91 -17 215 83 -36
6463 -36 114 91 -133 249 134 296 -167 -70 -63 479 26 11 65 184 -277 -207 -26 -55 -252 116 110 29 -112 154
6487 154 52 -187 -312 128 -184 8 138 -9 210 -43 123 -130 -228 -47 -145 -252 -112 -233 -148 238 156
6508 156 151 79 33 -49 121 -57 31 -16 -113 -45 -153 218 78 13 -70 205 52 -235 57 -26 -5 -171 110 -116
6532a16MP5J39l9k9R8o9J19k37J48k46R5o9M7O7K5n7J78j66O2l5J86k05j9L65
6557C21j9l79j73J13q0J87J14j63j75J83K89j77K5Oj23qL13l51K16m3k09J12l4
6580e5j7M9m2r7L30J65j39j07j42J19r6j8K70l52K07n6K38l32K6J50l00M12k82
6603f9l9m9L62K74m35k12P2J46l45K66K18m02O1K85j09M9p9Q3K25k54O6q8p3J
6627d6j98L92j80J49j38LJ03k8Nk51K92Q3m21P2P8Q9j20J67l3K09j13j26pk38
6651b57L85l74M99l35J94K9l11J00k4J15k18K54k77K84j95L08j14j89K82j02j26
6672g2j24K30p2L29j27n34J97j34N44l18k8m4M8j24K77O5o6MJ35m57P2N06k70
6695C7r9J05j57L54j49j50PJ72j48l33K03J65k75K29J73k07o2J04L41p7j10J92
$$ plain form
6532 -116 -112 -37 102 63 34 132 63 182 -55 93 -153 -58 -127 -80 -13 12 -45 133 -33 29 -6 180 -25 -44 321
6557 321 302 -77 -250 -137 -217 -30 84 -79 -254 -71 218 41 66 72 -51 -59 254 -97 119 76 -133 -21 -55
6580 -55 -72 -23 -65 -162 168 333 194 87 -55 64 -32 -50 220 -132 75 19 257 -75 -49 101 -199 213 -69
6603 -69 -108 -157 205 479 44 -168 -96 50 -295 -29 189 -213 -152 133 24 73 -6 77 302 48 114 26 -47 -46
6627 -46 -244 148 -32 117 -21 -18 85 57 62 -189 103 186 -235 -163 -85 4 -116 51 18 227 114 -12 -19 -257
6651 -257 128 -246 253 -82 112 141 -170 -70 -94 21 -197 57 -220 64 -131 177 63 -126 156 54 -72
6672 -72 -196 34 -38 291 164 -370 -173 -307 237 -81 -109 -153 -105 -229 48 113 47 51 186 -271 -199 307 37
6695 37 -62 43 -114 240 91 -59 -52 120 -28 -361 -158 7 -268 -39 134 -73 -135 -31 310 233 123 315
6717C15m59MK08k1J05k04P5j20K78j03J31n42K24j76M52j15j45R1j96K68q0K90
6739B80m27L57l39L31l6j82k18J33M5K53k02k0m3K84l51L47k95n9R2L01r1O2l09
6762h7n9R9n6J69j01j42K39o6J2q4p0j54M01o1m1k18K55j79K20K3j43J05K8j36
6786d6j65J64J4Q3P4j06M8k78K30k56j14J33K44r5o1pL7J35J5j25q2M50j91p6
6810B5r4k5K12j34K11K6j42q6l3J34n5N4j33r1L59m9r3j31p1K24J14k32R1j48
6834f7l21M56l6k63K07O6j28Q5J14k41L36j80m3k4K9J92j14j44K39m81K45J60
6856H7l45P5L60m39K82K51k51J13l87R7k6J85L9k67k9K09j21J85L30n73K99R9
6878A73l50n2L40j01rJ75l47M39l80n4J51j40j51M30M0j91J34ol54K33J20k49
$$ plain form
6717 315 -144 -140 68 47 152 -52 23 -97 181 78 209 -333 -109 -285 167 52 -93 -2 -198 70 -10 280
6739 280 -147 210 -129 202 166 -16 -234 -101 -56 197 -5 -25 -68 216 -135 212 -83 -142 -50 251 160 222 -87
6762 -87 -146 -47 -103 66 -35 -177 62 -4 8 -76 -146 -300 101 40 -1 -219 36 -143 77 100 -43 62 90 -46
6786 -46 -211 -47 -33 50 124 18 66 -212 18 -238 -352 -219 25 -70 -131 -138 -101 34 49 -76 -158 292 101 25
6810 25 -69 -94 118 -16 195 221 79 -7 -40 94 39 93 -40 -131 228 179 86 -45 -116 108 222 -10 81 -67
6834 -67 -388 68 32 -231 -24 42 -86 -1 113 -128 208 28 -15 -39 -10 182 68 -76 163 -318 -73 87
6856 87 -258 -183 177 -262 20 271 20 133 -254 -157 -183 2 41 -226 -255 -46 -167 18 348 -225 74 173
6878 173 -177 -229 111 10 1 176 -171 268 -112 -166 -15 -155 -306 124 164 -27 107 101 -253 -20 100 -149
6900a49J49J51k24J45j19J51l0j41qK50j22K07o6l18J69l14L95o7k7l2J04j78
6922g4K60J88l50J3r0L27m79J35L18m74L58Oj31l7n2q9J46K20m06P8L35j57j66
6945a21K90j25o5j29M01m15J74K64n33J65j42J36l4j08L02K1k18J04K40j41j14
6966d8P2j47J36j95J13K95k37j26K66j00Q7k3Rn7P8L6j28RL2l6q7J90P1L9O8k94
6992B3k3P4J2k23J75j70J27q6K51m11m4L12J45j5j15Q1k44J97N7k62J15j14j92
7015c30K92K08P3K2l51mk80M27j96J4J82J78lk05j68L78j40o1j3q3QJ32j52J82
7039A10k04Q0Qk59L62j26Q5j69j33K38r4k46L46j1l3K64j29l2L5j86J26k60K51
7062B3J1J68k80L28j84l56L31mk34M20j92j41J84j01n1jJ20j45L46l00N7R4J0
$$ plain form
6900 -149 0 151 -73 72 -47 104 74 -67 -75 175 53 260 194 -124 45 -269 126 59 32 0 104 -74
6922 -74 186 374 24 37 -53 274 -205 -70 248 -226 132 138 7 -30 -82 -171 -25 195 -211 -133 202 45 -121
6945 -121 169 44 -21 -150 251 -164 10 274 -259 -94 -236 -100 -134 -242 60 81 -137 -33 207 66 -48
6966 -48 24 -123 13 -182 -69 226 -11 -137 129 29 116 93 102 45 123 159 31 40 72 36 -51 139 210 249 317 23
6992 23 0 74 86 -137 38 -132 -5 -91 160 -251 -295 17 162 147 32 113 -131 66 123 -139 -24 -138 -330
7015 -330 -38 170 243 265 -86 -90 -370 57 -139 -125 57 235 232 27 -141 237 97 36 23 -60 -52 80 -72 110
7039 110 -94 -14 -6 -265 97 -29 56 -113 -246 -8 -102 -348 -2 -13 -46 218 89 57 92 -94 32 -228 23
7062 23 34 202 -78 250 66 -290 41 37 -197 223 31 -110 74 -27 -78 -79 41 -104 242 -58 -1 93 103
7085A03o0K7J4j35K1nj93M2o8K09k02L14l61K16n1J72O1P1m06J98j22J9J25R6
7109H5j84j73N12J5k50Q4p2P4J65p0k78L2J67k63J0J6n3K00m5J19k69j73J04K16
7133c1M9j32J45J8j61n4O1J37J45j14j28j1J11k0K19q0k85J12J48j48J30k49L01
7156A63r9j18J03k29K5j58L66j88L0j9N41l51m3p8N4J13j83j19K46K8o8j90J52
7179b2KK4k81K77J01k12J65J71m91M69l04m5J54j51J61K40j88J1l32L31L7k51
7201a34J72J61j92m2O6j95J30K46J6j34J83o8m1k71n8L28r7J09l70M80j61j61
7223c3J6J64r5J02k44J02j66J21K23k00j33K04J11j54J55m56L57j34N1R8j82N2
7245d1Q9L0k15k3Q9J52j06j78N6j8J13K1Q4K0oJ55j48o5M8J36k38kP4k72N1o9
$$ plain form
7085 103 43 70 84 -51 -30 -35 -228 -186 -254 -45 -247 67 -294 -78 -129 43 104 175 -231 -33 -155 -136 -11 85
7109 85 -99 -272 240 255 5 89 17 91 256 186 -92 -60 107 -156 -146 -130 -183 17 -28 91 -178 -351 -247 -31
7133 -31 18 -114 31 49 -112 -166 -105 32 177 63 -65 -76 35 15 234 154 -131 -19 129 -19 111 -138 163
7156 163 64 -54 49 -180 -155 -313 53 -135 -105 -124 417 66 23 -55 -1 112 -71 -190 56 84 16 -174 -22
7179 -22 -20 4 -277 0 101 -111 54 225 -266 203 -101 -146 8 -143 18 258 70 81 -251 80 117 -134
7201 -134 38 199 7 -35 31 -164 -34 212 228 94 277 209 168 -103 -161 167 70 179 -191 289 128 -33
7223 -33 -17 147 52 154 -90 12 -154 -33 190 -10 -143 61 172 18 173 -283 74 -60 -9 89 -93 -41
7245 -41 48 78 -137 -160 -71 81 -25 -203 -147 -165 -52 -31 53 73 67 222 74 9 57 193 -45 -47 27 -245 -194 -263
7271b63K49R7j14L28k41m6L69o81K43K3J56r5k29L07j5j63N7K53k77Q5j02J23
7293F4k10J82p6J52p5K06j90j17J06J47j96RK83o29J28N1L34L3j73k00K06j05
7315g0q6j3l5n5M60j02L7O4j79l3Q4JJ64k68L07j02j17l23K11L40m76K07m5qJ37
7340A00Q5l9L7k43K78j99j19J24Jj96J18R4Q5l41P0L76k8j15k16N04n95L13j83
7363h9L9m4M0j81M79m39N4k9L28k38o1J66q9L2K1N3m30M48j89K81J66l74m02M71
7387A3p8J91j43O2K58l46j5J06k30P4R9J24n8Q5j29K0N5J02l06P4J67k62J53J24
7411A40M2p4j56j25J84J52n43M75Qj16p0j64L4K24j26J56JJ63j43k54K61J67o2
7434A74l02p5L20M1j32k27J85l0k7J17r8L1J33j24l0L7K4j05J95k35J30m7K02
$$ plain form
7271 -263 -14 83 -31 297 56 10 379 -302 -59 -36 120 25 -204 103 88 -75 -18 235 -42 43 -59 64
7293 64 -146 36 -40 112 37 243 53 -64 42 189 -7 2 285 -344 -216 -165 169 202 29 -171 35 -70
7315 -70 -156 -169 -204 -259 201 99 136 200 21 -12 72 73 237 -31 276 174 57 -266 -55 285 -191 16 -29 -37 100
7340 100 185 146 183 -60 218 19 -100 24 25 -171 -53 41 126 -215 -145 231 203 88 -128 376 -219 94 -89
7363 -89 -50 -94 -54 -235 244 -195 -141 -170 158 -80 -141 25 -64 -32 -11 42 -388 60 -129 152 318 -56 -458 13
7387 13 -65 126 -17 45 303 -43 -58 48 -182 -108 -9 115 57 142 13 33 88 190 -116 -42 125 -137 16 140
7411 140 182 108 -48 -173 11 163 -380 95 103 -13 -83 -247 -213 11 -115 41 42 205 62 -192 69 236 174
7434 174 -128 -203 117 158 26 -201 -16 -46 -73 44 -54 -23 110 -14 -44 -7 17 -88 107 -128 2 -45 157
7457A57k78k0k3J70k5Q0k08J85k14K79j33L3J94k1j56o3Q2J25l06K10j45j46K90
7480F7p8R6Qr7K50q6q9l48M07L60m20K99o29m4M21j83Q0J85l57J77l36N12k3k23
7504e1J36j39n2K11J10m27N2L4J12J32m8l35K53j19o1K12J71n12M42m6L5m1m8
7527B1R1l04j18K04p1J42l2M66n92L98n5l17K54j43j22%R7j7J46n1NQ8K3m00L22
7552C5p1O7j01J96k35L3J71p4l04K55j08M00O2l41r7L7P3J1j53J39p6n5L42r2
7576A14n7n4R5k08J17K49j46p2q4K2p7J12K03j43j66J09r0q6K23L4j06q5J25J06
7600A35j23r9MK9j86J98K94k21q8j41k7J89m3J32j97N3q9rJ37O0k4k32L20m12
7624c40L49p9K90k9l27K3K68q2m8L20l75K82k14Nj10k3P6P6P7R7l16J14j98J54
$$ plain form
7457 157 -121 -141 -164 6 -19 61 -147 38 -176 103 -30 3 197 176 20 -43 39 164 -142 68 -77 -223 67
7480 67 -11 85 93 -4 246 160 71 -277 130 490 70 369 -260 -304 117 -66 14 199 -158 19 -317 195 172 -51
7504 -51 85 -54 -106 105 215 -212 -160 -126 -14 118 70 -265 -12 -131 -192 20 191 -321 121 75 110 69 21
7527 21 112 -192 -310 -106 -177 -35 -67 399 -193 205 150 -167 87 -56 -178 -178 -81 -98 48 -3 2 90 113 -287 35
7552 35 -36 31 -70 126 -109 -76 95 21 -283 -28 -136 264 326 -15 -112 -75 -2 9 -144 -5 -81 -136 206 114
7576 114 57 3 98 -110 7 256 110 38 -46 -24 -101 11 214 71 -95 14 -76 -162 61 95 -11 -96 29 135
7600 135 12 -87 -83 -54 -240 -42 252 31 -57 -198 -225 -36 -79 53 -144 -91 -180 -189 -52 8 -16 -248 72 -340
7624 -340 9 -70 220 191 -136 -113 155 73 25 345 -30 252 38 43 -67 -90 -14 62 139 236 -80 34 -164 -10
7648a0l9K94l00p8R1L01j68j80K46k56N7J57Mj24l8J7J55r6k95J04J72o8P4K1
7672D1lj06J3m6J30k04J85k76J66j9m2J36M1o9rL25j43k8l2J8M9jK8J7j04jJ17
7699A83N7k65Q1j17KJ0j8j75K27j2R6J22m08L11j12k97N59j93j50L73l19j0J00
7722D5j62R0l30K90K07j2j91j83Q6M3L1J37l62K96K2j06J84q2L55o7j32m30L99
7745A28m45M44n6l28L86l80K18J02j87L45l79lJ72Ro0k06K89j27J28p4k4M9K7
7768B8N0K4j55q3Q3J99l46K7L2j52K94k69M75k60j17K36Q9k29r2K6R2l65N35j
7792A21j58K71l90J45K27j50j62L23m40K17K7L1l52K91j25J81p6Kp1L09j86k5
7814A0Q4N5k15J22j11p3N7j1L91k6k38k61l3J38o0r3K35J56k91K28j2q5qj73K28
$$ plain form
7648 -10 -49 245 -55 -133 -42 259 91 -89 157 -99 -42 115 119 -5 -43 -26 129 33 -262 -158 14 -54 20 41
7672 41 38 -68 -55 -101 29 -175 10 -266 -100 -119 -161 -25 16 -53 -62 263 120 92 60 78 127 126 154 171 67 66 183
7699 183 240 -25 56 -61 -59 -49 -67 -242 -15 -27 69 191 -217 94 -18 -315 244 51 -99 274 -45 -55 45
7722 45 -117 -27 -357 -67 140 128 -63 -246 -160 -117 -86 51 -311 -15 7 -99 85 3 358 291 159 -271 128
7745 128 -317 127 71 -257 129 -251 -33 69 -118 227 -152 -155 17 26 -34 -240 49 -78 50 -24 -48 1 28
7768 28 78 102 -53 -136 -53 146 -200 -173 -141 -293 1 -268 207 -53 -170 66 155 -74 -166 -140 -48 -413 122 121
7792 121 -37 234 -156 -11 216 66 -96 227 -213 4 31 62 -290 1 -124 57 -19 -17 -88 221 35 10
7814 10 94 149 -66 56 -55 -128 -71 -82 309 283 45 -216 -249 -111 -171 -264 -29 127 -164 64 52 -33 -41 -214 14
7839A4l51L15J97q6klN1q7M33l74j6k70L01j97J6K11j89O0j44m7J59k6j20L88
7863B33l70L83j23j60qR8K5k62L64n8J7q5J10k38j03M09m61J50P5J1J75n7l21
7886a96J53m8j8J10j26J27jj84K78j36l11K30L04k14K77k06o2R7J4J32k36j39
7908a55J57M03m09M5R9l28P9n2J05K69j76J65l76L12J14Mk70K90l83P4o0O7R1
7931F5L2k98J07J19J7R3j62j19j92L03q6J66L30n99J26j03N28m73j4J16K09o6
7953I9l16J37P5Q4l01L29P7k7j36j01j14K23J58J3k88R4m8J08k72K19J50j33j36
7976a06j40N45n4j43k61L49l12L44l10J46k70K10M6ll36L23p8j32J37N32n35L6
7998a2j38J68M1j09L30k64J78l22J34k31J08M23j02m49K87l31K81K57l42L29j97
$$ plain form
7839 14 -337 -22 175 89 87 84 135 48 481 107 91 -179 122 -75 -59 152 -37 23 -121 -168 -9 -35 -155 233
7863 233 -137 246 123 -37 -45 53 78 -184 180 122 139 54 164 -74 -177 232 -229 -79 -4 7 182 125 -196
7886 -196 -43 -91 -109 1 -125 2 1 -183 95 -41 -352 -122 182 -32 245 39 -23 74 88 220 -16 -155
7908 -155 2 405 -4 41 140 -188 -109 -161 -56 213 37 202 -174 138 252 256 -14 276 -107 -33 -93 -26 65
7931 65 97 -201 -94 25 42 135 -27 -146 -338 -35 -121 45 375 -224 -98 -201 327 -146 -160 -44 165 99
7953 99 -217 -80 -5 79 -222 107 184 157 21 -80 -194 29 187 200 -88 6 -42 66 -206 13 163 30 -106
7976 -106 -246 299 245 102 -159 190 -122 222 -88 58 -212 -2 44 41 -295 28 -50 -182 -45 487 -48 -12
7998 -12 -150 18 59 -50 280 16 194 -128 6 -225 -117 306 204 -245 42 -289 -8 249 -93 236 39
8019C9K53j55K17p9j66p6j03m7K13O4k40K08j04J44j42o4j50L49j32Q2Q1l65J2
8042a61q7j1L66k43L40o4j34N5j58K45j75q4j33M25k99J51L3m6L26l17J0mP1J31
8066B37j36o7P0k1j80L23k41j44K8q7J75k53M78j82k3r5OlLq7J65J64r2j47K99
8091A90l55P3K29j74Q6K2k77J66Q6L1Kj2k0K8J22K1m36J93N2J31k97J56k7r0K00
8116A00j24K9J60j83K22j98j5J87j25r5q6K29K6J08k79n0rJ02k4Q2m9Kn0Q5j16
8141g1J4p7K32k75K04J59l04L31k95j00L6K06Q7j56O4J32n8j05j51jK48l19L21
8164A22k63L39l20j4R9K95j88k2K38m58K36J38o6n0n36L02j19M07k84J44p1J22
8186E1k0P3K3l78K58
$$ plain form
8019 39 292 137 354 275 109 33 -70 -117 96 160 -80 128 24 168 26 -38 -188 161 29 111 192 -173 -161
8042 -161 -248 -259 107 -136 204 140 6 61 -97 148 -27 -111 -244 181 -118 33 66 20 346 29 39 35 106 237
8066 237 101 34 104 83 -97 226 -15 -159 -131 -218 -43 -296 182 0 -23 -118 -112 -115 -112 -199 -34 130 38 -109 190
8091 190 -165 -92 137 -37 49 71 -206 -40 46 77 79 67 47 75 197 218 -218 -25 27 158 -139 17 -10 -100 100
8116 100 -24 5 165 -18 204 6 -9 178 53 -42 -128 101 127 235 -44 -94 -103 -1 -25 57 8 10 -40 45 -71
8141 -71 -57 -134 98 -177 27 186 -118 213 -82 -182 -146 60 147 -9 55 187 129 24 -127 -128 120 -199 122
8164 122 -141 198 -122 -136 -37 258 70 48 286 -172 64 202 136 86 -450 -148 -267 140 -144 0 -71 51
8186 51 31 104 127 -251 7
8191G
$$ Imaginary data points
##PAGE= N=2
##DATA TABLE= (X++(I..I)), XYDATA
0@%%%%%%%%%%%%Qj6J6j6K4l2L3m1N3o1P2q8J04j20J37j61J89k14K42k78L18l62
34a93M10m63N20n82O52p27Q09r01J001j108J228j357J496j652J823k008K210k435
52a277K684k961L270l616M010m461M983n595O324p209Q313r738J1657j4390J8630
67A0624k6174M3698j66634n5331K75567J00177n0644j85595r0731L1787J24239
78A0983O3997j5135p2061l4490L115K9186O605q12k655J3787P782J042j1103n949
92e708j0803j5869j7862J3081M8076N3393J099o2707p5359p746P7320R6568J9865
105A13348p8219j04207l0102O8122R4519K9019n2930o9493j5066M0289L8575p042
117B6813l2302q920K7783K6699j0988l8342j8942K3594M0300J3640k3920k9601
$$ plain form
0 0 0 0 0 0 0 0 0 0 0 0 0 0 8 -8 8 -8 16 -16 17 -24 29 -32 40 -48 56 -64 73 -88 101 -113 129 -149 169 -193
34 -193 217 -246 274 -308 344 -383 426 -475 526 -582 646 -711 785 -867 956 -1052 1158 -1277
52 -1277 1407 -1554 1716 -1900 2110 -2351 2632 -2963 3361 -3848 4465 -5273 6384 -8006 10624
67 10624 -15550 28148 -138486 -193817 81750 181927 131283 -54312 -145043 -113256 10983
78 10983 74980 59845 -12216 -46706 -43591 -14405 -7800 -8612 -11267 2520 10302 11344 241 -5708
92 -5708 -16511 -32380 -50242 -37161 10915 64308 65407 2700 -72659 -80405 -3085 93483 113348
105 113348 35129 -69078 -99180 -31058 63461 92480 39550 -29943 -45009 -4720 33855 26813
117 26813 -5489 -14409 13374 40073 29085 -9257 -28199 -4605 35695 49335 25415 -4186
129d186m889J5982Q649r987r116J1984K3500J012l5178l9184J412M8296M8788
142E7083k374n2978m9970K462M8499M1685m775l9454k7919Q883K5445O579j9205
155f039j5145J3124K8561O101l1744l9075k807M1192M2916J96m1593l9025K025
168d1313L4365K7132m001k1416j1561O354O067o871q954O070K0440J1609j5051
181B870k8246j1172J9916K9645P631k0531k2989J709K2702J4019j2090k2547k991
194b2074K4331K5494n789l4247k7133J0929L9738K8830j1310l9121k6475J0449
206b6378L2467K1434o820j9794r257N995O431k863l967O934J5164M617j6538k3354
220a5929m570K1374K5096K978k0934k0513J190J7281R957q070j3209J660J7562
$$ plain form
129 -4186 -9075 6907 15556 5569 -3547 8437 31937 32949 -2229 -41413 -40001 8295 57083
142 57083 54709 1731 -48239 -45777 2722 44407 39632 178 -27741 -18858 6587 13166 -6039
155 -6039 -21184 -8060 20501 26602 -5142 -44217 -47024 -5832 37084 37280 -4313 -43338 -41313
168 -41313 -6948 20184 16183 -5233 -16794 -10440 -4373 -11244 -20198 -14128 6312 17921 2870
181 2870 -25376 -36548 -16632 13013 20644 113 -22876 -21167 1535 15554 3464 -19083 -22074
194 -22074 2257 27751 21962 -12285 -39418 -28489 11249 40079 28769 -10352 -36827 -26378
206 -26378 6089 27523 20703 909 -8348 -2353 4078 1215 -2752 4182 19346 23963 7425 -15929
220 -15929 -20499 875 25971 28949 8015 -12498 -11308 5973 15930 7860 -5349 -3689 13873
233A3873J0768j2239k4998j0612J7754K9465J1268j8035k9258j3040J2621K1707
245I274J0275o050r932n040q22m242n018L271J5222J5362k871k3583k3593LK4574
260c170K6011K553k1389k2977l433J4512J3347m98q460k449O255L539o968j2208
274a5335k754J2125J5772L259j2174j4269l827P285Q462K425q24J582K174m162
288b61j1379r051O339J9480J5352m455k1893j9468J900K0894J9385J514j5491
301B866j5015j101R452P829j032m335Q12N808K210o019r274k462Q784J1671L396
316A3590o738r187l473K408L654K785L365L764J6p571j0544m067R585J5802P306
331B0695r127j7314r226P601J5567Q720n322j2267o517M293Q483K718m877n165
$$ plain form
233 13873 24641 12402 -12596 -23208 -5454 24011 35279 17244 -12014 -25054 -12433 9274
245 9274 19549 13499 3567 -1473 -2295 -6537 -11555 -8284 6938 22300 19429 -4154 -27747 -27744 -3170
260 -3170 22841 25394 4005 -18972 -22405 -7893 5454 4956 -3504 -5953 302 3841 -3127 -15335
274 -15335 -18089 -5964 9808 13067 893 -13376 -17203 -9918 -1456 969 145 1727 3901 -261
288 -261 -11640 -20691 -14352 5128 20480 16025 -5868 -25336 -23436 -2542 16843 18357 2866
301 2866 -12149 -13250 -3798 4031 2999 -1336 -524 5284 7494 1475 -7799 -10261 -1477 10194 13590
316 13590 6852 -2335 -5808 -3400 254 3039 6404 10168 10184 2613 -7931 -11998 -2413 13389 20695
331 20695 11568 -5746 -14972 -7371 8196 16916 11594 -673 -7190 -2897 5586 8304 3427 -1738
345a738M56M913K664k977n734k314L847N527J532l480m675j364J693J970K72Q06
361A398P47p1l048m095r21N234O320L27p112p769j68P793P405q51p796o606J834
378g379O790M816k795n834k243L486M791J01m095l631P92M886L513j330m737l730
394f599N03M142L821R28j377l494l296l13K106M475M252K59m689o635k484M309
410d092P727N004k623p429n220J409M942M521o46k154j013Q82L77k581k399J413
426a882N072M381k38n419o254j475M176O159L255o97m549m881k447J696M435M918
442F250J163k460n088m702O6M168M950K664j672l902l536k27J476J443J407N77
458B577P90n71k424l666k289K078N852M361j071n727o067j323L881N391L584m56
$$ plain form
345 -1738 -1282 3631 6295 3318 -2416 -4730 -883 4644 6176 2696 -1979 -3343 -1650 320 592 1398
361 1398 2145 2074 -974 -5069 -5990 -756 5564 5891 -1221 -8990 -9158 -1365 6040 5189 -2607 -9213 -7379
378 -7379 -589 4227 1432 -4402 -6645 -3159 1632 1733 -2362 -5993 -5201 -315 3198 1868 -2869 -6599
394 -6599 -6096 -1954 1867 2795 1418 -2076 -5372 -5685 -3579 896 5148 5407 718 -5917 -8401 -4092
410 -4092 3635 8639 6016 -1413 -6633 -5224 -282 4239 3593 1439 426 1308 1685 -896 -3295 -1882
426 -1882 3190 7571 7333 1914 -4340 -5815 -1639 4520 7775 7078 2529 -2352 -4799 -3103 1332 6250
442 6250 7413 4953 -135 -4837 -4771 -603 4347 7011 5339 1437 -2099 -2326 -850 593 2000 2577
458 2577 3367 2796 372 -3294 -5583 -3505 2347 6708 5637 -90 -6157 -7480 -3599 1792 5376 4920
474D920l586m241k786n9L247M659K794j377m428m521j568K407L519L540M84j726
490A278l305k921j179J959L639L802J108k520m709l764j67L769N357L178j322
505D203n018m836j135K419N181L330J2k717l884k624L61L031L884K529r13k912
521I11l456j009J611K770K012J49m43j525j932j304K10K095K527J327q31k401
537G11j948o51Q88K077K072O90q69k460j921n84J572K319J829o43j401j737j564
554a620L05J450J845J248r87j590k250L7J059J681N61o8p32r12p63j38N83R71
572F80N06n39j243p68L64R60Q27n40q58n68J96M78M91K30j66q02j235R5M87J766
592C61J390o89k135j557k74J267J610J470kj136j919j794J12K137K776R49j433
$$ plain form
474 4920 1334 -2907 -5693 -5752 -2505 2154 4948 3571 -857 -5378 -6946 -4539 -1020 2520 3004 1278
490 1278 -2027 -4948 -6127 -4168 -529 3273 4381 1861 -2848 -6612 -6779 -3010 2347 5525 4203
505 4203 -815 -5651 -6786 -4367 814 4144 4156 1439 -2445 -5069 -4708 -1677 2207 4736 3823 911
521 911 -2545 -3554 -1943 827 2839 2988 2545 1020 -912 -2216 -2006 89 2616 3943 3112 711
537 711 -1237 -1888 -1000 1077 3149 3839 2970 510 -1411 -1995 -423 1896 3725 3082 1681 -56 -1620
554 -1620 -1315 135 1980 3228 2241 651 -1599 -1562 -503 1178 1739 1671 939 27 -736 -874 -291 680
572 680 1186 647 -596 -1364 -1000 -40 787 247 -611 -1179 -983 -505 -14 216 50 -752 -1987 -1892 -1405 361
592 361 1751 1062 -1073 -2630 -2904 -1637 -27 1443 1441 305 -1614 -3408 -3296 -1159 1617 2566 1133
609A133k271j664q7J140J995J381N25j022j875j932k23J336K370J504o2j171k441
626a364j226J14J594K219J689o1j626k717j486O52K449K035J299j086j823k283
642a621j189R11K704K316R48j454k760k257k95J478K864K013N19j795l073k491
658c182J57K704L103J822j138l171k837j171J359L439K656O72k233l402k390K62
674c350K342L156J540m79l009k667j233J126K595K457N99j416k671j942l18J406
690a864K849J412o5j577j956j631j80J559K488J143l81j841k264p08J033J734
706b49J793K05n06k156j422m13Q80K098J769l04r54j784j357J69P85J686J565
723A805K84j362j854j381O74J467J661P59j23j626j611r46M68K180K100J90j373
$$ plain form
609 1133 -1138 -2802 -2889 -1749 246 1627 2152 1130 -745 -2677 -2900 -1564 806 2310 2248 1077 -1364
626 -1364 -2590 -2476 -882 1337 3026 2965 1339 -1378 -2864 -2212 237 2272 3571 2485 662 -1621
642 -1621 -2810 -1899 805 3121 4069 2615 -145 -2402 -2697 -1219 1645 3658 4177 2382 -691 -3182
658 -3182 -3025 -321 2782 4604 3466 295 -2542 -3713 -2354 1085 3741 4413 2180 -1222 -3612 -3350
674 -3350 -1008 2148 3688 3209 200 -2467 -3700 -2574 21 2478 3077 1661 -1010 -2952 -3270 -1864
690 -1864 985 2397 2332 755 -1201 -2832 -3012 -1453 1035 2178 1797 -44 -2308 -3016 -1983 -249
706 -249 1544 1749 1243 -913 -2335 -2748 -1868 230 1999 1695 741 -1043 -2400 -2231 -1446 240 1805
723 1805 2089 727 -1127 -2508 -1834 -367 1294 2053 1930 304 -1307 -2253 -1785 395 2495 2685 1312
740A312k268j139L67J452K002L66q8j469j471m58N78J494J021K56r95j485l93
757i18J11Q03R09L44j60n54j011NjO25M76K71m06n92k26K84L55k10R5j32rr4J58
780A23O2j49j73j82j85L63P09k95l48m27m19Q2L34P67L88k93k54n18o98R1N81
801d41O11M43l78m31l36j11n6K38M18K22J59o9n83k27n51R3Q82J030n9m28j246
822h20n46p9O16J525P04k22j037j335l63K57J004J792K69l28j529j521k07J119
840g01J433J158k5j089j305j089J10J287J508J211l00j623k257m85P14J714J720
857A981O79j391j620j332j35J301J935P88k68r30j713q42L5J274J480J183p37
874A688j245j556o87O51J509J305Kn15j136r40n51J41J505J114M42n68j367j477
$$ plain form
740 1312 -956 -2095 -1728 -276 1726 2092 2004 535 -936 -1394 -816 678 1699 1955 960 -525 -918
757 -918 -807 -4 905 1249 1089 535 -476 -471 -472 153 629 900 494 -98 -324 -40 315 105 200 68 59 -35 123
780 123 185 36 -137 -319 -504 -141 568 273 -75 -502 -921 -839 -505 262 650 357 103 -415 -1113 -1022 -441
801 -441 170 613 235 -196 -532 -643 -699 -461 -43 179 338 269 -314 -541 -1092 -999 -117 913 854 426 -820
822 -820 -1366 -1445 -829 696 1400 1178 141 -1194 -1557 -1300 -296 1496 1765 1437 -92 -1613 -1820 -701
840 -701 732 1890 1865 776 -529 -1618 -1508 -221 1287 2498 2198 575 -1682 -2167 -1453 261 1981
857 1981 2660 1269 -351 -1683 -1818 -517 1418 2206 1938 1008 -705 -1547 -1512 -238 1242 2425 1688
874 1688 443 -1113 -1800 -1149 360 1665 1667 1152 16 -924 -1475 -1334 171 1285 1727 1159 -208 -1685
892a685m03J272J437J104k62q92j277r64r1P75J448J746n53j478j901p30J030
909a424J484J486L42j294j399o90m03Q58J263J441j01j106j357r48J64J063J460
926H39Q68p76j099j245m69J187R50P73N1o17p20r33l9N31P17Q90L02m76j243q61
946a370N78R31P24Q5p41l33j75J98l43J51L49O26K76m08o09p10N5L58R88M43m35
967F38l82l55j61k6L42M00J18j06l28o99n56Q40O32R79n00p40m29R0J95L40k76
988A6j10J82M15J56r46n76K87Q00M02j54o69n17M88J65j1O7m51M24L49J83n43
1009d3m43n52L19P12L91K39l57l63p11n4J13O49N25K87O8j189q46j23O82J252
1029E56R90o37j035r53q0O09O27R03n23J46j44r27j029N20O83J327M31o70j514
$$ plain form
892 -1685 -2088 -816 621 1725 1463 571 -706 -1670 -1761 -986 462 2208 1655 177 -1724 -2454 -1424
909 -1424 60 1546 1888 594 -805 -1495 -1898 -1040 223 1664 1563 457 -900 -1848 -1684 -621 839
926 839 1707 931 -168 -1413 -1882 -695 255 1028 1079 462 -258 -1191 -1230 -699 18 908 1210 734 -509 -1370
946 -1370 -792 139 863 948 207 -126 -301 -103 -446 -295 54 680 956 548 -61 -771 -716 -358 630 1073 638
967 638 256 -99 -260 -286 56 456 574 468 140 -559 -1115 -275 357 1336 836 96 -333 -243 -48 292 16
988 16 -94 88 503 659 -287 -863 -576 224 626 472 -197 -714 -226 -61 -72 -5 -456 -32 317 500 -43
1009 -43 -486 -1038 -719 -7 384 623 266 -97 -808 -862 -749 -100 425 712 780 -409 -1255 -1378 -696 556
1029 556 1546 909 -126 -1079 -1159 -550 77 980 457 603 459 -468 -1497 -977 -294 1033 1464 794 -720
1048g20o01J77R27N95P38j03m90q42o58L0K37J128J063K61j245j595k07L88R26
1067IN23P52k54l06j148l79m15P10J382Q45J90j400j792p40P80J748J496l65j083
1086E53j180q48L61O44P91Q52N50q21j663j072m4J715J578N26r44j205j143K02
1104a148J114K72N35jl36l70q37n69L54J485O39K16r75j159o59M06J154N57M2
1123G20m59k78n93R4k66M40M50R96l76o00p26q33O07J040Q07l77n00j07l76j54
1143d91j24J69Q14L23L06q52j200n28J011J025N04k13q65m31j00M23J03O7N53
1162D94k2k7q22n40J25O61J041l65m29n82P0N0O13j25m8j49K28L11m64k79j64
1183d23J68M68N33n30j32k42J34K34r8k57J1L80L31j25n89o01J32N60M89K22l25
$$ plain form
1048 -720 -1321 -1144 -217 378 1116 1013 523 -319 -977 -947 -710 418 1481 1742 497 -1098 -1305 -917 9
1067 9 532 1284 1030 724 -424 -803 -1218 -508 874 1719 1909 509 -1283 -2023 -1243 505 2001 1636 553
1086 553 -627 -1475 -1114 -470 321 1173 1723 902 -761 -1833 -1877 -162 1416 1942 998 -207 -1350 -1148
1104 -1148 -34 238 773 772 436 66 -771 -1340 -986 499 1138 1354 379 -780 -1439 -1033 121 678 720
1123 720 261 -17 -610 -516 -782 -342 108 1104 728 128 -598 -1431 -824 216 1023 646 146 39 -337 -491
1143 -491 -615 -446 368 691 997 145 -1055 -1583 -572 453 957 744 -121 -552 -652 -229 -126 -59 494
1162 494 472 445 -377 -917 -792 -131 910 545 116 -466 -396 -346 267 142 94 -55 173 484 20 -259 -423
1183 -423 -255 213 746 216 84 -158 -24 210 112 -145 -134 246 577 452 -137 -738 -606 -46 443 665 340
1204C40p83J43m2K69J20M94jk61m93l07l60L87J067N90l88p21r22P4N20K62N82
1225E70k04q0J82q97k84J85L7R44M77m89o35n05k39M01N65L75l0R0m87n80m4k35
1247h83J018O62L37o21j102m65m6R81Q62q7l8m32m90k59k00N15O76K87L39q38
1267B16j233l81P69R49Q61O4r95p29m05j10P69P78L02j54l15q17n09p4J222O36
1287H44N00n38r06o48j82P47P87k45L50o09k80l44n07K66P27O51N48o57p75n89
1307h60m8J120J88M19k82p22nk72k34M43L98N45r8o54n68k52M91O06M58K27p14
1328A86o51J01O9M2K72L70L60j72p51l25p17Q36R49Nk84r7p25Ml8N73L87n1J23
1351D66k49m81k19k13M66M50j7J09q00J09j07M89m5L6n2J71J19j88m61l6Q2N19
$$ plain form
1204 340 -443 -300 -342 -73 47 541 540 279 -214 -521 -881 -494 573 1163 775 54 -868 -794 -274 -12 570
1225 570 366 286 468 -429 -713 -528 -491 453 930 441 -194 -699 -938 -537 28 403 373 463 -24 -604 -648 -883
1247 -883 135 797 1134 513 -589 -1054 -1100 -119 743 656 618 186 -304 -563 -763 -248 428 715 1054 216
1267 216 -1017 -1398 -629 320 1181 1245 250 -479 -884 -994 -225 553 855 701 386 -431 -940 -1014 208 844
1287 844 1344 806 -100 -748 -930 -183 604 359 709 100 -180 -524 -1031 -765 -38 613 1161 504 -271 -860
1307 -860 -908 212 400 819 537 -185 -190 -462 -696 -253 145 690 592 -62 -630 -882 -391 215 673 900 186
1328 186 -465 -364 -295 -253 19 389 749 577 -174 -499 -1216 -380 569 574 290 193 -532 -528 -566 7 394 343 466
1351 466 217 -264 -483 -696 -230 220 203 312 -488 -379 -486 3 -42 -6 -58 113 232 44 -417 -453 -371 148
1373A48M19l49j25k71N7J51q8K29o8J83l6j68n21k7J07L75M42o6m01j41k04J5
1395c39J84N23n8m8q1m44kj25M08K16O29o46o25m6o2K85L32L00k84J22l00j91
1417b52j27J07L82k0N84l64l95k02l66M52L90jK24J5o79p9Q7l8L35KM42r5p25
1440c23k11J42K57P67N9l78m91m36M86l35J61O26K75m61r7n91l80M35N96K45J43
1461D89l72j12q72M09M12M16p3J89j17p86j03k20M62P76K1l3l70o61K9J74N05
1482A63K85j3R9k96p11j39L13J11P50P9l75n38o3q4J36N27K59K93n98l87n48L17
1504d20oP16J58J46k80n31m08N7K84O90L69l96j57l92n93L58K86O49J16k12k75
1525A59n87j62L05L95L38K90m18m71l03jM40M09J46j69k40j55l38k59M12L25L70
$$ plain form
1373 148 567 218 93 -178 -121 30 -58 171 103 286 250 82 -439 -466 -359 16 458 392 -9 -150 -354 -339
1395 -339 -155 368 310 262 181 -263 -265 -390 18 234 863 217 -408 -454 -516 -231 101 401 117 239 -61 -252
1417 -252 -379 -272 110 90 674 310 -85 -287 -653 -201 189 188 412 427 -252 -331 -244 -282 53 55 497 402 -323
1440 -323 -534 -392 -135 632 691 313 -178 -614 -128 -463 -302 324 599 138 41 -550 -930 -495 101 346 489
1461 489 117 5 -867 -458 -46 370 297 486 369 -417 -520 -740 -278 498 519 486 116 -545 -516 -342 163
1482 163 448 435 534 238 -473 -612 -299 -188 562 641 266 -272 -335 -419 -283 244 503 796 198 -189 -737 -420
1504 -420 -426 290 448 594 314 -217 -625 -568 -284 406 775 379 222 -170 -763 -405 -119 530 646 434 159
1525 159 -428 -590 -285 110 448 738 320 -151 -454 -455 -15 394 540 371 131 -24 -362 -621 -209 116 486
1546D86j28j59m72k02K09J04P3K90J68o6k79k60N2k6M83J37P1n17j96k01L11m1
1568a63L79L86k09m40k37k06p2P74j7J50j45j3n93J70j73P18M03l38m20J89o65
1589e22K09J89K66O86k41k55n86k85M3L67R3K34k39K3j76j49J38K26P2N04n87
1610A0K76n38k01O7K45K20K94k70J57k53l27J09K05K36PL1k29j67k58K58J39J88
1632A99J85l8k53m34j48N7L81L73n7J0k73k35k4J91QL76K13l08m53p9J76P7K93
1655B37J01k7j47l07m31J98j27N40K07K87m13j66k09L2K45J73K51l80l0n25J90
1676c01j36J83L41J1K80j59o53K7k67M66L80J65j1k45l92R0j74L21O54k49k61
1697G0k20k31j07P3N09L10j49j83l62k24n4M88L49L61k72l02k97O6m18N72L83
$$ plain form
1546 486 358 199 -273 -475 -266 -162 -89 201 369 303 24 -236 -184 -210 273 410 481 -36 -232 -433 -122 -163
1568 -163 216 602 393 -47 -284 -490 -562 212 195 345 200 187 -406 -236 -409 309 712 374 -46 143 -522
1589 -522 -313 -124 142 828 587 332 -254 -539 -496 -129 -36 198 -41 -18 -194 -343 -205 21 93 597 10
1610 10 286 -252 -453 -386 -141 79 373 103 260 7 -320 -211 -6 230 237 268 39 -128 -386 -128 11 199
1632 199 384 346 93 -341 -489 -432 -51 322 265 275 2 -233 -257 -66 -58 318 531 223 -230 -309 -133 -56 237
1655 237 338 311 164 -143 -574 -376 -503 37 244 531 118 -48 -257 -225 20 193 444 64 34 -491 -301
1676 -301 -437 -254 87 98 378 219 -434 -407 -674 -208 172 337 326 81 -311 -221 -395 -74 580 331 70
1697 70 -150 -381 -488 -415 94 404 255 72 -290 -514 -568 -80 269 630 358 56 -241 -175 -593 -21 362
1718C62L97k68l12n81j82L07K39M46K7k93k68k83k6K11L71J77Q3k45q4n11l16
1739g49N46M77J87j1k39n77m7j17L39M48J23k27j97j20n49M62J15M04K93k58m73
1760a70j3l94J02Q58l17K87P5p72J02l16J21M88J14R2m0l21j30k85O07R8J18j96
1782A08l56K36l02k35M68N74l90J94k06m01j12J34M11K86k39o4m98R9O3m6K20
1803e6K19K1J66j04p43L44l4M98J09j8Ln67R8k01O9L22J14LN0j98l85o7p1L82
1827d6J62P3n6j75k74RJ7M73m0q5rk6l32J9M15N8j62J97j77k50J9J2P3L22j0k01
1853Fo2o7l59LN65K21K63k20j53k13p1J1K25p0L04p0J07n80j53J77J61L46j65
1876B06J9m72N2K4j0N41Q4L6l49l61K61n07O24J45k02L40m57n7k1j94L86Q7J42
$$ plain form
1718 362 759 491 179 -402 -584 -277 -38 408 435 142 -126 -409 -435 -224 147 324 407 162 78 -433 -749
1739 -749 -203 274 461 450 211 -366 -413 -530 -191 257 380 153 -44 -164 -713 -251 -136 268 561 303 -170
1760 -170 -183 -577 -475 383 66 353 428 -344 -242 -558 -437 51 165 257 217 -104 -234 -519 88 186 304 108
1782 108 -248 -12 -314 -549 -81 493 103 297 91 -310 -422 -288 123 409 170 106 -392 -293 -230 -276 -56
1803 -56 163 184 350 246 -497 -153 -187 311 420 402 405 -162 -64 -265 -196 126 240 243 293 95 -290 -357 -428 -46
1827 -46 116 189 133 -42 -316 -307 -290 183 143 58 49 23 -309 -290 125 183 21 218 41 -209 -190 -178 -105 217 207 6
1853 6 -56 -123 -482 -479 86 307 570 350 197 -16 -87 -76 149 79 383 313 420 -160 -313 -136 25 371 206
1876 206 225 -247 -195 -171 -181 360 444 480 131 -230 31 -476 148 293 91 431 -26 -83 -104 -298 88 175 317
1899C17j33J8J9m85LoM43k8N6R1m37l3j17m9O68o7J37n09l93O3J34K65M27q0j68
1924A36k51J6k09J97L81K00j21k48p9l56l6N94k09K23K32o92o6l19O79j25L43
1945B90o0K44q18m7m0R3K61L1O73m18m64j15P2j79P76j36j6J07n23n1j08J07L48
1968B7J28J12l38J48k80o3K31J98K32q0k07o3m19m0N61j07K16k07k65m6j47M34
1990B5K63P2n8j45M0m91j45N28J93l5P8l56J91k85o2K71J18J70m3k97k67p3M67
2013A59k96K58L0N3k61K61n37O9M71j5o5k02J25Ml16K19P7L28k10l09L71k97n6
2036a39j83L05J19J5m6k80J84k17L40j6r6N07l43k50j63j9NK55o6J43r6j4l04
2059c59L28k23L56J70J43k44j27r4m08m1M48K91j17j43j03o6K43k07K61J16j22
$$ plain form
1899 317 184 202 221 -264 -261 -267 176 148 204 295 -142 -175 -292 -341 327 260 397 -112 -505 -442 -308 -43 384 304 136
1924 136 -115 -99 -308 -111 270 470 349 101 22 -334 -370 224 15 238 470 -222 -288 -607 72 -53 290
1945 290 230 474 -344 -391 -431 -338 -77 -46 627 209 -255 -370 -298 -477 299 163 147 254 -269 -320 -428 -321 27
1968 27 155 267 -71 77 -203 -266 -35 163 395 315 108 45 -374 -414 147 40 256 49 -216 -262 -409 25
1990 25 288 360 302 157 197 -294 -439 89 282 247 325 -31 160 -125 -187 84 202 372 329 32 -235 -308 159
2013 159 -137 121 151 204 -57 204 -333 -264 207 192 127 -75 50 54 -262 -43 34 362 152 -157 214 -83 -139
2036 -139 -322 -17 102 117 71 -209 -25 -242 98 82 -14 493 150 -100 -263 -282 -277 -22 -88 55 -41 -55 -359
2059 -359 -31 -254 102 272 415 171 44 -50 -458 -499 -51 240 123 -20 -123 -189 54 -153 108 224 102
2080A02n0M2m10J27L39l11M36k49J56k49O2j35P6M05k54M09l35l20p5nk5L20l1
2103B5K29o5k54l15K54j95P99j45r6k46o1j57o3M15K92K1j09k54j37l7o1K15J38
2126A93O2m9k28m56M01r0L31KN6k24j76j78L19j57L19K12k13j76l73J5J0P48n1
2149B97k7n8l90K53l02J56M3M43l9j30j40m97J84J9M30k1J00l0m27k13j26L34
2171a41L78R7N0j58m62J11o8j44L51L26m0m60j79k81N70J8l4N03k20j79m26M43
2193E5Ok08K05J76k07k68K0k09M60L3P7j79j51K62k53l2Q0M50p0L0j38m9l85K81
2217a4M9J61n8R4j80k16RJ0k67O09N0j41j16j90m6n0J84M73n6l39J11j97j36J07
2241a49J12K03J01j93O7k36q0J21J00jK42j58Jj75m21L03J58j1K89Pm22K24k88
$$ plain form
2080 102 52 94 -316 -189 150 -161 275 26 182 -67 -5 -140 -64 341 87 496 161 -159 -234 -239 -264 56 25
2103 25 254 189 -65 -380 -126 -321 478 333 237 -9 -70 -227 -290 125 417 438 329 75 -62 -99 -160 55 193
2126 193 255 206 -22 -478 -77 -167 164 166 222 -2 -178 -356 -37 -194 125 337 124 -52 -425 -410 -400 348 297
2149 297 270 212 -178 75 -227 -71 -28 415 376 246 106 -391 -207 -188 242 221 321 291 -136 -349 -475 -141
2171 -141 237 334 384 226 -236 -125 -193 -337 14 340 300 -160 -339 -620 -50 -32 -66 437 217 38 -388 55
2193 55 61 -147 58 234 27 -241 -221 -430 30 63 140 -39 -190 72 -181 -213 -133 317 247 277 139 90 -295 -14
2217 -14 35 196 138 232 52 -164 -155 -145 -412 197 247 106 -10 -200 -246 -296 -112 361 305 -34 77 -120 -256 -149
2241 -149 -37 166 267 74 141 -95 -175 -54 46 45 287 129 130 -45 -466 -163 -5 -16 273 280 -142 82 -206
2264b06M1K87j39K90m87N3K88q3k09J09L42k72j59j26K41j87K05J77r1J13j55
2285C2j2k09J72O1K61j66K83m47l49K77o4J56K43J4m7k63j46K96k91L54P1L0p4
2308A82m19r1J81k7J61L49l24k22L5J54k5P2K1L5J69l11P7l50P5R5J78L23l57
2331a9J3L1q6j15K01J45L08l45j30j67J17j41K87M5K61k90k37m4Rk0K32J04J5
2354A74K03m84j11J70R5O1l1K12l23K4k63J38J95j71J06J54p8j99nK07o7J9K59
2377B85j80j19J17o05J89K95J88J86q7k09k36j80M4L20K76j36kl85L5K2K25Q7
2399A30l6J79j08l99r3L37J48J40q6Jj76k39J52j64P6M24lJ5j88k93J45j66J71
2422c3J15O9M4k69j69j50K50L04P5jk52j71k11oN15P6N7K25l75r3l62J09K09J84
$$ plain form
2264 -206 -165 122 -17 273 -214 -161 127 44 -165 -56 286 14 -145 -271 -30 -217 -12 165 74 187 32
2285 32 20 -189 -17 44 305 139 422 -25 -374 -97 -161 -5 238 252 205 -58 -204 92 -199 155 226 256 182
2308 182 -237 -328 -147 -174 -13 336 12 -210 -175 -21 -46 26 47 82 251 -60 17 -333 -258 -163 15 338 -19
2331 -19 -6 25 -61 -176 25 170 478 133 3 -164 -47 -188 99 144 405 115 -122 -166 -157 -177 55 159 174
2354 174 377 -107 -218 -48 47 108 77 289 -34 -10 -273 -135 60 -111 -5 149 71 -128 -133 74 7 26 285
2377 285 105 -14 103 -502 -313 -18 170 356 269 60 -176 -356 -312 8 284 148 146 -239 -204 -182 43 130
2399 130 94 273 165 -234 -327 10 158 298 212 213 37 -202 -50 -214 -138 286 283 298 110 -183 -38 -204 -33
2422 -33 82 151 195 -74 -243 -393 -143 161 236 235 -17 -188 -399 -405 110 186 243 468 93 0 -362 -253 -44 140
2446A40K14l60K21j27k28r5Q0J79K22k9m09j04M7K21n1L45jj98l2K6n18M77J27
2469A47M4r8L70l43l67M00j65J5J31k1j3q9l04jr9M47J24k6p6k75k63K72Q2L71
2493B63P8n1j9m99j9J38M5J53J49k47J98m54J47J28MJ42L8J45n81k19K84J56K0
2516aL04k34J13n86L32m7M6K31J78K6j32l43N2j6n7K33P0k09L22k36k03K37l25
2539b45L76l73K36N3K1j31j15L25l7L71j03m13j36r1J17rL86P2l95L75l60k77
2561c53M46l01O75j22l5j36k27j2J04j41J97K02m22R5k87J1K27J51l1Q1j09j32
2583a19J36j12o0K99n7L42j97k06p7j71L46j45O6J85k01k36n9J19M7K2L98j16
2605B04l16N1J82l54L25J72J02m40m0j3k25P0J61K73j82K39k94j59J95k24K40
$$ plain form
2446 140 354 -6 215 88 -140 -235 -155 24 246 217 -192 -296 -249 -28 -79 266 265 67 35 61 -457 20 147
2469 147 191 93 463 120 -247 153 -12 3 134 113 100 11 -293 -294 -393 54 178 152 76 -199 -462 -190 -108 263
2493 263 341 290 271 -228 -247 -109 -64 89 238 -9 189 -265 -118 10 14 156 194 339 -242 -461 -177 -21 -1
2516 -1 303 69 182 -404 -72 -119 -73 158 336 362 230 -113 -61 -77 -134 99 169 -40 282 46 -157 80 -245
2539 -245 131 -242 -6 47 68 -63 -178 147 110 481 378 -35 -171 -262 -145 -154 232 304 -91 284 -76 -353
2561 -353 93 -208 467 345 310 174 -53 -65 39 -102 95 297 -125 -30 -317 -306 -79 72 41 122 13 -119
2583 -119 17 -95 -155 144 87 429 232 26 -51 -222 124 -21 45 230 29 -207 -266 -147 -100 -78 320 204
2605 204 -112 -61 121 -233 92 264 366 -74 -114 -127 -352 -282 -121 152 -30 209 -85 -244 -49 -273 -33
2626c3K3L33k62n20L38J33J04J05J43p7l71M0j88N3J72P4J33l41%l0M6J65j1o2
2650c3J64M4l74M3J20P0j88L79l65L5L08J52n51K5L71j25K57n62K14k48P7J67
2672b0J54n4J44k56m2m6K1n7J52L49j78O8k13n7j7J60q9J62L9m16L32k65J33L3
2696C7J56r9k64Q6J7M6l18K08J61J83l57Q2l28J91J76j10M1J29K80k34j3k79K62
2719E3J72k89K53Q2j0o77K34L39l6r8Q1K09m31n0J1K55K09j49j06k7j13N9k25
2742b54J19L99k12J65k71Q3j34j03L68M9p4l16K77p9Pj19j05J49J87O2q4j18j61
2765a65M3rJ94r9K39k66j98L34k14L72j48J38k81j43J40rr2L25j95J82P1l22K20
2788A17m10L38O2Q5j9R5l22j06J49J8J23j68K26j36k88J29L6J65N0J92j17j78
$$ plain form
2626 -33 -10 323 61 -459 -121 12 116 221 364 287 -84 -44 -232 -179 -7 67 200 -141 -141 -171 -125 40 29 -33
2650 -33 131 175 -199 -156 -36 34 -154 225 -140 -105 203 355 -196 -171 200 75 332 -230 -16 -264 -187 -20
2672 -20 134 80 224 -32 -74 -120 -99 -156 -4 345 167 235 22 -35 -52 108 19 181 220 -196 136 -129 4 37
2696 37 193 94 -170 -84 -67 -21 -339 -131 30 213 -144 -62 -390 -199 -23 -133 -92 37 317 83 70 -209 53
2719 53 225 -64 189 271 261 -416 -182 157 121 23 104 313 -118 -168 -157 98 307 158 52 25 -88 -29 -254
2742 -254 -135 264 52 217 -54 29 -105 -208 160 209 135 -181 96 17 24 -95 -200 -51 136 198 114 -4 -165
2765 -165 -122 -131 63 -36 203 -63 -261 73 -141 231 83 221 -60 -203 -63 -72 -164 161 -34 148 219 -103 117
2788 117 -293 45 107 192 173 268 -54 -160 -11 7 130 -38 188 52 -236 -107 -71 94 144 336 219 41
2810D1o7j90nJ10K64L1l34q3K42l07rM06K52j79l21P2j20J54J59Q5j05j34Nl36
2834c69L06j24L62l17M30m40J20j96L71o51O20r6k57N27j87Kj29j49J14J34J19
2855A90J1k04l13PKJ24L44K43l18k61L8M8P3Q1j47L38k12k30K47l27m4L29J47
2878A66L7j62J12n82M22L3q9J67J55m10K31j31r1J74N07j71o8l91l15J74P7K25
2900G0K34l78J66l29J32J42N2J50j54O5m4p9k96oK00J76J29m79J73J71l72J66
2922a11J79J43l86K55R1l18k26J38K95p3p5K89m44m9J95j43K91j85J89j21j87
2943b53L16j79qJ21J04j8MMl77N60m74L60j13q1j31K06k83J20qJ97j01P4J65l52
2967a47J59l65J00J52L89j86p6k07p0J21m3K30j15Q8Rj09j8J47j50o5J42o4K8
$$ plain form
2810 41 -26 -216 -221 -111 153 184 -150 -233 9 -298 -307 99 351 172 -149 -77 -197 -43 116 201 96 -38 -33 -369
2834 -369 -63 -187 175 -142 288 -152 -32 -228 143 -508 112 16 -241 286 99 101 -28 -177 -63 71 190
2855 190 201 -3 -316 -309 -307 -183 161 404 86 -175 -137 -89 -16 65 -82 256 44 -186 61 -266 -310 19 166
2878 166 203 41 153 -429 -7 26 -63 104 259 -151 80 -51 -142 32 539 368 300 -91 -406 -232 -155 70
2900 70 304 -74 92 -237 -105 37 89 239 85 150 106 27 -269 -275 -75 101 230 -249 -76 95 -277 -111
2922 -111 68 211 -175 80 171 -147 -373 -235 60 -13 -88 201 -243 -292 -97 -240 51 -134 55 -66 -253
2943 -253 63 -116 -124 -3 101 83 87 91 -286 274 -200 160 47 -34 -165 41 -242 -122 -130 67 -34 40 205 -147
2967 -147 12 -353 -253 -101 288 102 26 -181 -251 -130 -173 57 -58 30 39 -70 -88 59 -91 -156 -14 -78 -50
2990e0J08l79K88l1m8K90%k63K11l83k17L31J04J65j28o5k17J89p5k9O7N65l27
3013A06l42L3K69k08J93J09n8J07p5l27K76O5l14L06O1k27m0j31L11J3P8j67J15
3036A53n27J70N7J49M9k36M56n7j26k75J2j31M41p8r3J57k24o6K41j37r2K27N6
3059A26j24j04J1j24J6K07k53L87o8m47K14J18l5L04O1m12K16j13j48K4R2J61
3081A09J28j31j29k26J92J3j2L01k81l6J47L14o01K95o1K49m43J40J28k91J96
3102Aj00K48j11J80k56Ql7QQ3R8j42P0oj50n9J19j68J50J5L83l38k68K87q2j09
3127a76J23J10J31n2l19Q4k27M10J8k45J39K23m17J19R6p2J02l2J66l40P2L4k20
3150b73N47k85N0r4j44r2M9N21j84J54k41n5j51K01j89J55J53j22N0j08o7L8m48
$$ plain form
2990 -50 58 -321 -33 -64 -112 178 178 -85 126 -257 -474 -143 -39 126 -2 -67 -284 -95 -170 -199 -132 433 106
3013 106 -236 -203 66 -142 51 160 102 209 134 -193 83 148 -166 140 201 -26 -66 -197 114 127 205 38 153
3036 153 -374 -204 -147 2 51 -185 271 214 88 -187 -175 -306 135 57 -36 121 -103 -169 72 -65 -157 70 126
3059 126 2 -102 -91 -215 -199 8 -245 142 74 -373 -159 -41 -76 228 289 -123 93 -20 -168 -144 -52 109
3081 109 237 106 -23 -249 -57 -44 -56 245 -36 -72 75 389 -212 83 22 271 -172 -32 96 -195 1
3102 1 -99 149 38 218 -38 -30 -67 -59 24 122 -20 50 44 -106 -165 -46 -214 -64 -49 334 -4 -272 15 -67 -176
3127 -176 -53 57 188 136 -183 -99 -326 84 102 -143 -4 219 -198 -79 17 -55 47 15 181 -159 -87 -53 -273
3150 -273 274 -11 39 -55 -199 -291 -242 279 95 249 8 -47 -198 3 -186 -31 122 0 50 -58 -125 -87 -535
3173e35O15K19r1j00j51L9j92Q2K12J74n7l73M6o2J78r3j96L93K68l01j49k33
3195c07M4K99K41j35j41L7j52n3j2L36j11K07M9n01K16n5r2K6K81Q5l08J0l7j51
3219b24J05J09J42p9l03J79r5jJ37L9L08K0j53k12O1q6M6L0K07J30l43J62m91
3242c12J75q5K96m3m8k09k46Q7L57R7m1kn6l5j47O4%K11K20k15k2k91K21j02J57
3267C1M4J42k48K7r5r8K92j17K16m8o9j01J26j37J02k60J61J35j34O3J35l76R9
3290a10K9L7K49m5J0k6m25N6L11K42k18o2m5n2J17k63K26L35m41o6P8K53j22l45
3314b77K37K35J35l67m1k72M62O8k65m0J85j56qk3J05k24M42j04j03N4k67P5%
3337a49K53l7L07j28o4m32K1p3N33r2k79Q0j6j54K47o7j8L31k81J65J3k82L20
$$ plain form
3173 -535 80 299 208 108 -43 -4 -196 -114 98 272 215 -158 -112 -174 4 -89 -285 108 376 75 -74 -307
3195 -307 -263 36 277 142 1 38 -114 -167 -179 157 46 253 302 -199 17 -38 -130 -104 177 262 -46 -36 -73 -224
3219 -224 -119 -10 132 53 -250 -71 -166 -167 -30 9 317 337 184 -28 33 -53 -7 23 230 360 17 179 -312
3242 -312 -137 -222 74 31 -17 -226 -472 -385 -28 69 28 26 -30 -65 -212 -148 -148 63 283 68 46 -245 -24 -126 31
3267 31 75 217 -31 -4 -99 -197 95 -22 194 146 77 -24 102 -35 67 -193 -32 103 -31 32 167 -209 -110
3290 -110 -81 -44 205 160 170 144 -281 -225 86 328 110 48 3 -49 68 -195 31 366 -75 -141 -63 190 68 -277
3314 -277 -40 195 330 -37 -78 -350 112 180 -85 -125 60 -96 -104 -127 -22 -246 196 92 -11 43 -224 -149 -149
3337 -149 104 67 374 246 182 -250 -229 -302 231 139 -140 -60 -76 -230 17 -50 -68 263 -18 147 160 -122 198
3360A98l06K65j30M93o97O8n5J11k8Q3kLJ36r5j00J35k9O6j95J64q2k64J20J62
3384B1k22J83L65l05J02J6m07J58Q0j14M10p6j46k5j11j0q8J39L79o20M11p8k89
3407b27K14M15m12Q2K5o8k21J67J42j76J08k77L60m53L32L6j99O0P5K22L4l52
3429a13O6l34K06J68L6K45j81j45J42j49j11M41k87m5J14j5j76O8J9N9J17O9j61
3452C3N8l03J52L04j22J42l6l94O1j89P8Q4J90o7j06J23n2q4K15P7p6J93k72k71
3476b62j05J40K94J6Q3k23N0J03k61O6r2J42PK20m07J21M1l12N44n6J25oo1k05
3500c8j36P8K44j38J47l53K93o8l47J28j14K31J08oj61M3P6JQ0M17m53M2k0p7
3524b3J45J10j48j13k45M74k60k2J15r2K60j8k09N2j27L2n0J38j42J43J04M2l
$$ plain form
3360 198 -108 157 27 520 -177 -109 -164 -53 -81 2 0 3 139 44 -56 79 50 116 -79 85 3 -261 -141 21
3384 21 -201 -18 347 42 144 160 -247 -89 -9 -123 287 211 65 40 -71 -81 -169 -30 349 -271 140 62 -227
3407 -227 -13 402 -10 72 97 29 -192 -25 117 -59 49 -228 132 -321 11 47 -152 -92 -17 205 239 -113
3429 -113 -47 -381 -175 -7 29 274 93 -52 90 -59 -170 271 -16 -61 53 38 -138 -70 -51 8 125 194 33
3452 33 91 -212 -60 244 122 264 228 -166 -105 -294 -216 -132 58 -9 -115 8 -44 -128 87 164 88 281 9 -262
3476 -262 -367 -227 67 83 166 -57 -7 96 -165 -99 -191 -49 -42 178 -229 -108 -67 -379 165 109 234 228 167 -38
3500 -38 -174 -96 148 10 157 -196 97 29 -318 -190 -304 -73 35 29 -132 -89 -13 -12 68 485 32 74 54 -23
3524 -23 122 232 84 -29 -274 200 -60 -82 33 -59 201 183 -26 26 -101 -69 -119 19 -123 20 124 166 163
3547A63p7O2k12J61R1J8l16k21K03J68j39k9N6K22k69j11K50O7r8P0J9j40P3o3
3571e2K8k6K93l23J63j98K93l8m22J05J70Q4l3qK6j70o7L75m72J88K14j85J31
3594G6k93Q6J2m1J69P4m5m0J94j40m8m6N8J24l13j09L94n4j6K20k13j16K79k30
3618a8j61L03k10K52j24J25l85J56J21l59Q1J43K3l8k6J22J4P1O9P1j09k19P3
3641b5q1L53k70j52K33j23j07J93O6j10L3M3j08R3q7p6J19J36J3k61K51l2j37
3664c6j62O7J57k9J98j70L3k2k0k07K28Q2k64Q5J86J12l72L7K00j46L09l64P0
3687b8k05o8L41n2j87K73k37LJ9J11K13j38J22j15P3j51k12L02j15K41l25K71
$$ plain form
3547 163 86 148 -64 97 188 206 -110 -331 -128 40 -99 -128 -72 150 -119 -230 20 87 -11 59 78 -62 11 -52
3571 -52 -24 -50 243 -80 83 -115 178 140 -282 -177 -7 77 44 36 62 -108 -175 200 -272 -84 130 -55 76
3594 76 -217 -131 -119 -160 9 83 38 -2 192 52 4 -42 16 140 -173 -282 112 58 42 262 49 -67 212 -18
3618 -18 -179 124 -86 166 42 167 -218 -62 59 -300 -219 -76 -53 -91 -117 5 19 90 159 230 121 -98 -25
3641 -25 -106 247 -23 -175 58 -65 -172 21 87 -23 10 53 -55 38 -49 -125 -6 130 143 -118 133 101 -36
3664 -36 -198 -131 26 -3 195 25 58 36 16 -191 37 119 -145 -60 126 238 -134 -97 103 -43 266 -98 -28
3687 -28 -233 -301 40 -12 -199 74 -163 -160 -141 -30 183 45 167 52 125 -26 -238 64 -51 190 -135 136
$$ [...]
8191B01
##END NTUPLES=NMR FID
##END=
