##TITLE=1H_LR-785-R2-C2
 200.13MHz, CDCl3,
 8 sc
 
 14.2.2025
##JCAMPDX= 6.0         $$ Bruker NMR JCAMP-DX V2.0
##DATA TYPE= NMR FID
##DATA CLASS= NTUPLES
##ORIGIN= UXNMR, Bruker Analytische Messtechnik GmbH
##OWNER= pz
$$ XWIN-NMR		Version 3.5
$$ Fri Feb 14 14:06:23 2025 Russian Standard Time (UT+4h)  she@DPX200
##.OBSERVE FREQUENCY= 200.1313
##.OBSERVE NUCLEUS= ^1H
##.DELAY= (6, 6)
##.ACQUISITION MODE= SIMULTANEOUS
##.ACQUISITION SCHEME= undefined
##.AVERAGES= 8
##.DIGITISER RES= 18
##SPECTROMETER/DATA SYSTEM= spect
##.PULSE SEQUENCE= zg30
##.SOLVENT NAME= D2O
##.SHIFT REFERENCE= (INTERNAL, D2O, 0, 14.3821)
##AUDIT TRAIL= $$ (NUMBER, WHEN, WHO, WHERE, WHAT)
$$ ##TITLE= Audit trail, XWIN-NMR		Version 3.5
$$ ##JCAMPDX= 5.01
$$ ##ORIGIN= Bruker BioSpin GmbH
$$ ##OWNER= she
$$ F:/spectra/data/she/nmr/H-C/1/audita.txt
$$ ##AUDIT TRAIL=  $$ (NUMBER, WHEN, WHO, WHERE, WHAT)
(   1,<2025-02-14 14:04:59.98 +0400>,<she>,<DPX200>,
      <created by zg, POWCHK disabled, PULCHK disabled
       configuration hash MD5:
       00 E9 B6 7A A2 85 ED C7 34 08 36 98 17 FE 4E 26
       data hash MD5: 16K
       3E 9D 09 DC A3 8B 12 21 0C E6 B5 91 FD 5B 0A DD>)
$$ ##END=
$$ 
$$ hash MD5
$$ 95 34 5F 3F 67 E2 3F 5A D0 E2 C6 CC 1D 5D 87 33
##$RELAX= 
##$RELAX= 
##$RELAX= 
##$RELAX= 
##$RELAX= 
##$RELAX= 
$$ Bruker specific parameters
$$ --------------------------
##$DU= <F:/spectra>
##$EXPNO= 1
##$NAME= <H-C>
##$PROCNO= 1
##$TYPE= <nmr>
##$USER= <she>
##$AMP= (0..31)
100 100 100 100 100 100 100 100 100 100 100 100 100 100 100 100 100 100 
100 100 100 100 100 100 100 100 100 100 100 100 100 100 
##$AQSEQ= 0
##$AQ_mod= 1
##$AUNM= <au_zg>
##$AUTOPOS= <>
##$BF1= 200.13
##$BF2= 200.13
##$BF3= 200.13
##$BF4= 200.13
##$BF5= 200.13
##$BF6= 200.13
##$BF7= 200.13
##$BF8= 200.13
##$BYTORDA= 1
##$CFDGTYP= 0
##$CFRGTYP= 5
##$CHEMSTR= <none>
##$CNST= (0..31)
1 1 145 1 1 1 1 1 1 1 1 1 1 1 1 1 1 1 1 1 1 1 1 1 1 1 1 1 1 1 1 1 
##$CPDPRG= <>
##$CPDPRG1= <>
##$CPDPRG2= <>
##$CPDPRG3= <>
##$CPDPRG4= <mlev>
##$CPDPRG5= <mlev>
##$CPDPRG6= <mlev>
##$CPDPRG7= <mlev>
##$CPDPRG8= <mlev>
##$CPDPRGB= <>
##$CPDPRGT= <>
##$D= (0..31)
0 0.7 0 0 0 0 0 0 0 0 0 0.03 0 0 0 0 0 0 0 0 0 0 0 0 0 0 0 0 0 0 0 0 
##$DATE= 1739527499
##$DBL= (0..7)
120 120 120 120 120 120 120 120 
##$DBP= (0..7)
150 150 150 150 150 150 150 150 
##$DBP07= 0
##$DBPNAM0= <>
##$DBPNAM1= <>
##$DBPNAM2= <>
##$DBPNAM3= <>
##$DBPNAM4= <>
##$DBPNAM5= <>
##$DBPNAM6= <>
##$DBPNAM7= <>
##$DBPOAL= (0..7)
0.5 0.5 0.5 0.5 0.5 0.5 0.5 0.5 
##$DBPOFFS= (0..7)
0 0 0 0 0 0 0 0 
##$DE= 6
##$DECBNUC= <off>
##$DECIM= 32
##$DECNUC= <off>
##$DECSTAT= 4
##$DIGMOD= 1
##$DIGTYP= 9
##$DL= (0..7)
0 120 120 120 120 120 120 120 
##$DP= (0..7)
150 150 150 150 150 150 150 150 
##$DP07= 0
##$DPNAME0= <>
##$DPNAME1= <>
##$DPNAME2= <>
##$DPNAME3= <>
##$DPNAME4= <>
##$DPNAME5= <>
##$DPNAME6= <>
##$DPNAME7= <>
##$DPOAL= (0..7)
0.5 0.5 0.5 0.5 0.5 0.5 0.5 0.5 
##$DPOFFS= (0..7)
0 0 0 0 0 0 0 0 
##$DQDMODE= 0
##$DR= 18
##$DS= 0
##$DSLIST= <SSSSSSSSSSSSSSS>
$$ [...]
##$SUBNAM0= <"">
##$SUBNAM1= <"">
##$SUBNAM2= <"">
##$SUBNAM3= <"">
##$SUBNAM4= <"">
##$SUBNAM5= <"">
##$SUBNAM6= <"">
##$SUBNAM7= <"">
##$SUBNAM8= <"">
##$SUBNAM9= <"">
##$SW= 18.0517328524113
##$SWIBOX= (0..15)
0 0 2 0 0 0 0 0 0 0 0 0 0 0 0 0 
##$SW_h= 3612.71676300578
##$TD= 16384
##$TD0= 1
##$TE= 0
##$TE2= 300
##$TE3= 300
##$TEG= 300
##$TL= (0..7)
0 120 120 120 120 120 120 120 
##$TP= (0..7)
150 150 150 150 150 150 150 150 
##$TP07= 0
##$TPNAME0= <>
##$TPNAME1= <>
##$TPNAME2= <>
##$TPNAME3= <>
##$TPNAME4= <>
##$TPNAME5= <>
##$TPNAME6= <>
##$TPNAME7= <>
##$TPOAL= (0..7)
0.5 0.5 0.5 0.5 0.5 0.5 0.5 0.5 
##$TPOFFS= (0..7)
0 0 0 0 0 0 0 0 
##$TUNHIN= 0
##$TUNHOUT= 0
##$TUNXOUT= 0
##$USERA1= <user>
##$USERA2= <user>
##$USERA3= <user>
##$USERA4= <user>
##$USERA5= <user>
##$V9= 5
##$VALIST= <valist>
##$VCLIST= <CCCCCCCCCCCCCCC>
##$VD= 0
##$VDLIST= <DDDDDDDDDDDDDDD>
##$VPLIST= <PPPPPPPPPPPPPPP>
##$VTLIST= <TTTTTTTTTTTTTTT>
##$WBST= 1024
##$WBSW= 4
##$XGAIN= (0..3)
0 0 0 0 
##$XL= 0
##$YL= 0
##$YMAX_a= 111194
##$YMIN_a= -116524
##$ZGOPTNS= <>
##$ZL1= 120
##$ZL2= 120
##$ZL3= 120
##$ZL4= 120
##$ABSF1= 10
##$ABSF2= 0
##$ABSG= 5
##$ABSL= 3
##$ALPHA= 0
##$AQORDER= 0
##$ASSFAC= 0
##$ASSFACI= 0
##$ASSFACX= 0
##$ASSWID= 0
##$AUNMP= <proc_1d>
##$AZFE= 0.1
##$AZFW= 0.1
##$BCFW= 1
##$BC_mod= 2
##$BYTORDP= 1
##$COROFFS= 0
##$CY= -3
##$DATMOD= 1
##$DC= 2
##$DFILT= <>
##$DTYPP= 0
##$F1P= 0
##$F2P= 0
##$FCOR= 0.5
##$FTSIZE= 0
##$FT_mod= 4
##$GAMMA= 1
##$GB= 0.15
##$INTBC= 1
##$INTSCL= 1
##$ISEN= 128
##$LB= 0.25
##$LEV0= 0
##$LPBIN= 0
##$MAXI= 10000
##$MC2= 0
##$MEAN= 0
##$ME_mod= 0
##$MI= 1.114404
##$NCOEF= 0
##$NC_proc= 0
##$NLEV= 6
##$NOISF1= 3.799351
##$NOISF2= 2.8
##$NSP= 1
##$NTH_PI= 0
##$NZP= 0
##$OFFSET= 14.38212
##$PC= 1
##$PHC0= -466.0585
##$PHC1= 12.39221
##$PH_mod= 1
##$PKNL= yes
##$PPARMOD= 0
##$PSCAL= 0
##$PSIGN= 0
##$REVERSE= no
##$SF= 200.129724274929
##$SI= 16384
##$SIGF1= 3
##$SIGF2= 2
##$SINO= 400
##$SIOLD= 16384
##$SREGLST= <1H.CDCl3>
##$SSB= 0
##$STSI= 0
##$STSR= 0
##$SW_p= 3205.1282051282
##$SYMM= 0
##$S_DEV= 0
##$TDeff= 0
##$TDoff= 0
##$TI= <>
##$TILT= no
##$TM1= 0
##$TM2= 0
##$TOPLEV= 0
##$USERP1= <user>
##$USERP2= <user>
##$USERP3= <user>
##$USERP4= <user>
##$USERP5= <user>
##$WDW= 1
##$XDIM= 8192
##$YMAX_p= 0
##$YMIN_p= 0
$$ End of Bruker specific parameters
$$ ---------------------------------
##NTUPLES= NMR FID
##VAR_NAME=  TIME,          FID/REAL,        FID/IMAG
##SYMBOL=    X,             R,               I
##VAR_TYPE=  INDEPENDENT,   DEPENDENT,       DEPENDENT
##VAR_FORM=  AFFN,          ASDF,            ASDF
##VAR_DIM=   8192,          8192,            8192
##UNITS=     SECONDS,       ARBITRARY UNITS, ARBITRARY UNITS
##FACTOR=    0.0002768,     1,               1
##FIRST=     0,             0,               0
##LAST=      2.2672688,     0,               0
##MIN=       0,             -116524,         0
##MAX=       2.2672688,     111194,          0
$$ Real data points
##PAGE= N=1
##DATA TABLE= (X++(R..R)), XYDATA
0 0 0 0 0 0 0 0 0 0 0 0 0 0 0 0 0 0 0 0 0 0 0 0 0 -3 5 -7 8 -8 8 -8 8 -9 12 -14 15 -16 20 -20 21 -25 28 -30 35 -35 41
45 41 -44 49 -54 61 -65 73 -79 88 -98 109 -120 134 -154 175 -201 233 -277 336 -417 539 -739
66 -739 1105 -1907 4353 -25863 -116524 16513 106528 -21925 -77679 44962 77753 -32020
78 -32020 -48064 43616 40453 -38936 -29332 27268 3034 -40583 -9086 21327 -15824 -29473 18836
91 18836 23304 -23813 -6312 43473 11227 -36166 9240 52617 -5313 -50181 12689 48784
103 48784 -25912 -57325 24000 46867 -38853 -52039 36519 39255 -46168 -33761 47715 25090
115 25090 -41527 -6496 46399 7897 -28276 7886 26773 -8255 -18301 8375 4339 -18598
127 -18598 -7454 8937 -6351 -15034 6742 13082 -9155 -10551 16519 15759 -13171 -8988 20183
140 20183 11843 -18345 -10683 16911 9031 -18386 -10989 16764 9047 -16907 -9337 13784 6690
153 6690 -13244 -7188 10180 5239 -6838 -2558 5752 5306 1263 -4323 -2792 6874 3529 -11404
167 -11404 -5259 10983 2880 -11890 -626 13093 -525 -10392 4506 8467 -5677 -3972 6173
180 6173 -1708 -9136 2495 5693 -9206 -7902 12745 7110 -14667 -1917 21655 3850 -19408
193 -19408 1614 22577 -2959 -23570 3293 21443 -8258 -23851 7441 19364 -12238 -21519
205 -21519 10852 17733 -15213 -15634 18528 14806 -17062 -5319 24076 5911 -18531 4115 20240
218 20240 -8982 -19695 11891 11403 -22944 -13910 20005 2459 -27604 -547 27932 -3237 -25178
231 -25178 13495 30837 -11147 -22178 20727 23233 -21002 -18825 22021 13482 -26316 -13508 22459
244 22459 4194 -27832 -5321 22328 -2674 -22952 5789 22865 -5993 -15490 16335 19361
256 19361 -13388 -8911 20864 6811 -21603 -3163 19633 -6567 -25585 5144 17757 -16246
268 -16246 -20435 16342 15805 -18462 -9429 23467 11256 -19017 -2202 23615 2205 -19798 3172
281 3172 18750 -5836 -17664 5353 12249 -10990 -14634 7688 7601 -12805 -7454 11369 5143 -10064
295 -10064 941 14150 1421 -9286 5850 12279 -5754 -9632 8266 6776 -11983 -7838 9331
308 9331 2245 -13638 -3329 11362 -176 -10942 2865 10805 -2304 -6921 4991 7471 -3161
321 -3161 -4596 4746 5053 -3283 -3020 2888 1840 -3199 -3750 490 1358 -3063 -3485 1373 2036 -2134 -753
338 -753 2800 1651 -1669 378 3920 174 -2631 2076 2972 -1884 -2743 2449 2213 -3301 -2699 2923
354 2923 2034 -3745 -2415 3038 1040 -4465 -2848 3565 2513 -4440 -1708 6676 3104 -4986 42
369 42 7646 895 -7049 549 7562 -2409 -8078 3117 5673 -5663 -5932 4795 2972 -7235 -3284
384 -3284 6646 847 -6548 1734 7588 -1318 -4779 4587 6421 -3296 -3139 5617 3883 -6031 -3768
399 -3768 5257 -80 -8190 -2372 5256 -1062 -7932 1135 8283 -1128 -6208 5175 8388 -3748 -5036
414 -5036 7062 6248 -6621 -3864 7603 2082 -9320 -1738 6202 -3283 -9090 1265 5226 -4353
428 -4353 -5651 5087 5079 -4157 -1560 7570 3667 -3859 870 6290 832 -5150 163 4106 -3098 -6654
444 -6654 673 2665 -4453 -5410 2894 3977 -3987 -2642 5862 3624 -4485 109 7411 1474 -4456
459 -4456 1837 6040 -1920 -5545 1977 3166 -5629 -5026 2898 707 -5531 -2125 3738 802 -3542
474 -3542 591 5137 1293 -1681 2577 4185 -147 -1986 1017 1922 -2474 -3669 1010 786 -3388 -2690
490 -2690 1624 1235 -3513 -1345 3333 753 -2950 838 4544 383 -1718 2855 3648 -1393 -1891 2401
506 2401 956 -3558 -2164 1866 -884 -3428 -905 1333 -470 -2306 316 2291 385 -937 1268
521 1268 2365 -21 -983 804 2123 -776 -2262 1296 1891 -2163 -1810 1858 402 -2970 -1392 1774
537 1774 -260 -3000 386 2385 -543 -1313 2242 2415 -882 -630 2290 1306 -1376 -445 1776 163
553 163 -1843 -278 721 -402 -1687 -931 574 -26 -1580 -328 1520 -419 -1637 1076 2017 -800
569 -800 -811 2153 2235 -1347 -76 2573 -68 -2392 -551 642 -1415 -2852 -219 948 -1784 -1190 1526
586 1526 1000 -929 399 1895 1197 179 1114 2099 875 -356 320 854 -485 -1269 -977 -198 -919 -1846
604 -1846 -878 419 -1247 -1658 1163 1453 -492 269 2818 1491 -69 971 2008 212 -1518 110
620 110 347 -1765 -1435 -145 -344 -1737 -1203 200 -610 -1093 2 1154 493 604 966 1396 1418 419 671
639 671 1019 393 -768 -598 -203 -552 -1865 -970 -252 -1375 -1353 488 563 -794 428 1989 1217 343 1128
658 1128 1438 463 -181 745 295 -649 -78 -259 -1009 -900 -900 -570 -780 -842 -422 -196 219 424 840 733 1358
679 1358 871 167 1113 647 29 152 349 -454 -1046 -570 -390 -1218 -1104 -33 -282 -605 -33 526 -119 289
699 289 440 443 380 770 332 273 543 804 21 -178 410 -493 -961 -592 -264 -1047 -605 175 -377 -485 -33 622
721 622 625 -332 620 927 559 331 782 611 214 -234 75 -187 -533 -545 -391 -601 -435 -597 -772 -205 -594
742 -594 -566 485 385 -302 234 1276 1045 348 634 1148 -95 -725 300 443 -1336 -1109 -105 -591 -916
761 -916 -650 71 -200 -338 63 831 321 206 883 925 367 360 531 691 -11 -402 149 32 -762 -1056 -358
782 -358 -410 -1509 -1410 179 319 -845 272 1552 641 -284 1280 1645 162 -498 1005 745 -1046 -626
800 -626 352 -338 -1623 -531 -229 -690 -1102 -485 464 19 -307 716 1155 390 430 1135 1722 300 -187
819 -187 718 457 -1215 -1064 60 -546 -1897 -1288 114 -435 -1654 288 1328 -25 -107 1091 1366 -569
837 -569 291 1595 903 -711 127 1165 -495 -1354 -426 209 -1083 -1224 -496 264 -839 -915 632 607 -211
856 -211 -11 1162 1365 -272 213 1172 773 -1028 -209 889 -673 -1795 -201 518 -917 -1217 629
873 629 627 -1314 -721 1134 341 -748 410 1305 267 -307 660 1404 -253 -759 225 443 -753 -927 -240
892 -240 -49 -880 -930 279 195 -806 -719 866 474 -638 525 1515 509 -408 423 1138 -278 -945 620
911 620 666 -781 -884 775 -141 -1507 -850 633 -301 -1370 59 883 220 -149 605 1260 588 -253 691
930 691 994 -199 -608 344 538 -915 -928 -83 386 -1282 -1226 945 100 -1044 -38 1221 357 -839
948 -839 499 1616 -211 -706 1358 1187 -672 -579 736 83 -1536 -1055 189 -320 -1675 -202 871
965 871 -189 -1095 522 1242 53 -133 1184 1391 -349 -456 1531 798 -720 -459 981 -285 -1908
982 -1908 -650 725 -591 -1783 -5 1224 -641 -939 1235 1168 -489 231 1546 1088 -642 284 1349
999 1349 -97 -1688 -190 718 -882 -1484 -43 278 -1031 -1057 602 602 -584 -318 1230 941 -297 391
1017 391 1766 577 -912 238 1119 -461 -1107 19 626 -1021 -1252 504 421 -1351 -726 855 315
1034 315 -882 380 1381 624 -560 535 1176 129 -409 472 457 -483 -696 134 275 -1168 -1195 225
1052 225 -90 -1265 -625 880 198 -412 178 1170 334 -343 614 1215 -138 -508 326 631 -681 -720 79
1071 79 15 -1223 -700 298 24 -945 172 605 40 -395 385 868 159 -368 283 787 6 -148 332 536
1091 536 -766 -760 586 6 -1221 -485 448 -7 -601 -66 1058 298 -516 980 1210 -126 -227 1023
1109 1023 700 -626 -526 487 441 -903 -825 179 -349 -1224 -195 579 -120 -831 234 874 -173 -549
1127 -549 829 1014 -130 -56 1034 694 -685 -426 849 34 -1343 -306 322 -726 -1209 97 946
1144 946 -522 -946 440 704 -423 -161 1013 868 -353 133 945 60 -892 79 557 -456 -931 -138
1162 -138 334 -668 -1147 305 270 -597 -344 816 850 -304 322 1147 414 -600 474 1129 -123 -1206
1180 -1206 44 915 -905 -1249 116 126 -969 -919 467 319 -792 418 1056 537 -422 414 1147 266
1198 266 -311 455 923 -583 -523 83 -30 -1036 -713 325 -162 -934 -607 833 316 -652 364 885 146
1217 146 -372 820 957 12 -17 482 467 -472 -747 295 -109 -860 -298 79 -259 -620 31 350 -166 -190
1237 -190 519 470 -271 2 393 703 111 -324 420 279 -520 -497 14 -260 -549 -372 289 -210 -543 -129 493
1258 493 -63 -456 433 785 236 -123 855 748 -215 -287 241 -14 -639 -337 10 -156 -701 -141 36 -123
1278 -123 -562 -185 214 97 -146 397 681 20 -74 621 422 -403 -223 424 66 -712 -300 385 -468 -585
1298 -585 -70 212 -223 -411 498 448 -283 19 891 491 -136 150 739 58 -744 225 226 -336 -670 -262 142
1319 142 -414 -507 -298 -67 -40 -225 461 199 -192 108 430 441 -114 -179 541 243 -298 261 50 -787 -729 -27
1341 -27 -98 -417 -410 -4 -97 -329 18 389 376 37 412 547 123 -161 100 435 -36 -345 69 -124 -349 -544
1363 -544 36 90 -422 -308 257 -9 -254 67 420 -86 -77 279 452 37 75 393 287 -31 -456 377 -87
1384 -87 -603 -361 52 -369 -374 -100 30 -132 9 263 399 2 82 438 556 105 -20 263 134 -586 -325
1405 -325 -16 -7 -440 -493 103 -261 -409 39 476 -206 -45 353 479 157 155 657 353 -267 -141 350 40 -197
1427 -197 -218 -12 -357 -254 -148 -277 -304 -457 97 -41 164 218 169 466 114 77 15 497 -214 -155 62 -50
1449 -50 -246 -213 -319 -218 -179 -267 76 -225 -247 75 18 69 99 755 69 76 288 434 10 -201 119 -137 -133 -448
1473 -448 132 -269 -233 -632 -313 72 -332 -491 257 371 -113 173 304 383 50 123 509 193 130 29 -2 -102
1495 -102 -327 186 -443 -81 -543 -307 -121 -294 -177 124 -53 278 -122 343 89 359 129 376 227 39
1515 39 -65 -99 -274 -325 5 -188 -131 -210 181 -87 -212 -30 321 379 79 -7 404 7 -162 252 142 85 -288
1538 -288 -83 -127 -214 111 -285 -224 -332 -325 -84 -268 14 382 -61 481 295 135 299 367 219 143 364 -184
1560 -184 -381 -76 45 -170 -117 -121 -121 -564 -326 52 63 -80 -29 218 52 148 66 241 223 204 442 25 53 -189
1584 -189 -90 -53 -247 -298 -181 -173 -328 -275 -162 -20 24 53 163 340 -10 251 400 -4 126 272 219 -201 -156
1607 -156 -137 -361 -149 -189 11 -223 -185 49 85 226 -74 42 364 166 208 305 155 332 88 -108 159 -9
1629 -9 -387 -117 -173 -99 -127 -84 -257 -27 118 6 171 90 247 618 359 133 225 325 85 188 -88 97 -39
1652 -39 -152 -254 -150 -316 -197 -330 -362 123 -142 -284 239 -72 26 315 81 137 16 197 -98 -115 -134 81
1674 81 -11 -173 -225 -361 -319 -302 115 -94 -172 122 127 -143 105 129 -79 164 56 -143 96 165 -230 -64 -176
1697 -176 -334 -276 -241 -260 -68 -284 128 2 239 -269 39 362 21 150 130 -62 107 10 63 -270 66 193
1719 193 -197 -218 66 -175 -198 -233 120 -60 -87 159 41 152 44 32 301 195 -83 66 91 118 -278 -184 -151
1742 -151 -35 -317 -435 -193 -107 -255 -283 77 6 -95 52 196 285 -40 223 194 422 -93 139 -58 -317 -186
1764 -186 96 -65 -169 -237 -253 -276 -132 47 155 -148 230 216 135 290 402 394 -76 -144 353 38 131 -27 -273
1787 -273 -75 -102 -41 -272 -185 -100 -33 27 -74 -4 83 84 198 310 53 -6 157 99 4 -4 -81 -83 -232 -185 -173 -69 -164
1814 -164 -1 -68 -6 14 101 -66 -92 -26 184 74 131 164 361 48 82 36 -59 -310 -51 6 -291 -364 -152 -312
1838 -312 66 -79 90 258 260 161 210 395 82 -73 66 -28 22 -195 -11 -76 -149 -146 -55 -10 -175 93 -124 59
1862 59 -88 43 293 44 252 117 56 -119 148 237 144 31 -18 -142 -297 -270 -76 -158 -105 -7 75 193 -141
1885 -141 186 279 281 209 160 432 222 116 17 212 -57 -52 -149 58 -109 -266 73 140 -104 -268 -302 -109 -4 180
1909 180 172 -119 195 233 183 116 -82 62 368 26 190 188 34 -106 -193 -138 -171 5 64 -165 -64 265 -15 -37
1933 -37 47 330 -35 134 12 197 -8 -89 -111 -121 131 168 -14 -1 -18 -156 -428 -289 -131 65 28 45 112 -121
1957 -121 83 296 184 180 24 -20 129 -89 -338 -205 139 -293 -206 60 88 -284 -184 -59 38 127 68 224 36
1980 36 147 29 -97 271 -156 60 -314 -336 224 -164 -187 -135 -56 -128 0 243 -25 233 31 33 189 118 305
2003 305 -52 209 222 -94 -71 170 4 -154 -6 64 -144 -190 189 -3 27 -224 137 38 108 260 228 -172 -146
2026 -146 166 220 121 -101 171 -195 48 -186 -212 74 -60 -41 -153 11 34 54 231 309 -64 -26 202 319 348
2049 348 165 -25 -58 272 -168 44 -103 -13 -89 46 -150 -12 -28 -35 3 37 -134 -166 204 140 37 273 -56
2072 -56 -140 -94 172 -319 32 -307 -242 -174 -99 -266 -252 -89 -73 -77 -116 -146 72 183 94 210 104 -16 -118 80
2096 80 34 -74 63 126 23 -191 163 -271 55 -35 256 13 -118 -6 205 322 151 119 317 68 132 234
2118 234 435 279 -110 -172 -177 -58 -329 -175 -23 -1 -80 -419 388 45 263 -57 88 346 -47 159 240 267
2140 267 57 -35 296 -317 -79 36 -254 -38 -231 -127 -107 199 -11 105 88 -44 -50 -2 20 123 82 224 48
2163 48 244 231 105 -83 -39 79 -119 -286 35 -120 66 258 97 61 -38 240 342 43 35 27 338 100 -92
2186 -92 41 153 -60 -262 -336 123 -59 -141 -10 -149 -5 70 -295 -120 44 23 231 -50 37 132 291 122
2208 122 117 15 80 -298 -75 -312 -101 101 -258 -232 -154 -37 -58 138 -58 35 42 158 203 159 318 162 7 43
2232 43 126 -94 -85 60 -187 -109 -145 -293 53 -156 -35 33 290 250 -33 -137 220 113 61 -73 33 302 136
2255 136 -91 -68 -197 -169 -161 -458 -274 -45 -103 -83 -94 -16 9 -31 122 166 -147 -73 -133 -101 202 -142 21 -24 -228
2280 -228 89 -187 -190 -84 -111 -209 88 61 161 116 26 -136 -78 -20 116 -9 240 206 -37 38 191 -300 0 111
2304 111 -49 -117 -58 -285 -15 145 -2 -86 -23 -34 51 167 14 -98 149 227 147 12 -81 -49 -123 -445 -36 -106
2328 -106 -127 -72 -181 115 58 77 -77 0 92 -38 186 45 230 382 10 84 -407 -93 -206 -83 -239 33
2350 33 24 -169 -7 -127 -60 236 38 81 389 -89 309 209 128 -70 -184 -86 -168 -135 -120 -99 -15 10 -58 -298 -61
2375 -61 -152 -178 -130 -131 172 227 -156 -68 2 331 -24 34 153 126 138 -195 35 69 -287 220 -115 -286 -55 -20 -67
2400 -67 -23 -78 155 96 105 24 166 -138 97 -71 -16 191 -111 -110 -151 -106 -206 -26 -129 -99 100 -204 -249 141 215
2425 215 -224 188 -218 297 78 -29 89 -42 141 -55 -24 -15 -354 253 -260 -89 99 208 135 231 -24 -70
2447 -70 -3 104 301 253 -13 -169 129 71 211 215 -37 -90 -126 129 -8 -26 -53 -187 -160 -91 42 48 -19 278 -189
2472 -189 267 113 80 -183 208 -110 -29 -235 -131 17 -52 97 -337 -207 -127 99 -240 18 135 -100 -157 -19
2494 -19 -312 124 264 200 -147 215 134 125 297 -86 -393 -132 113 -151 -149 -312 -158 -25 45 61 250 346 299 380
2518 380 149 172 214 334 311 171 62 71 51 145 -57 -93 140 -107 -161 -45 -210 79 -23 -154 76 -3 183
2541 183 -114 134 19 101 -89 -110 0 7 203 -238 -106 119 -198 36 23 -210 71 81 201 237 183 72 75
2564 75 -27 -101 -263 -46 236 -40 -62 111 124 -183 -136 -119 -124 -126 75 -335 226 -147 87 143 78 -79 -2 247
2588 247 -19 -32 82 -157 -3 111 -51 -121 95 46 -290 87 75 76 -71 140 -260 14 215 197 93 98 84
2611 84 -207 -137 -147 98 232 114 -306 -136 -99 66 -277 40 -97 -17 124 57 -5 -93 166 82 -90 -56 184
2634 184 -149 129 -194 -15 24 -17 155 94 -280 46 -311 -277 -277 -14 109 74 195 235 76 -6 39 -11 9 91
2658 91 201 -145 -131 -337 29 -76 -227 205 -11 -98 -124 54 -127 37 -7 -32 281 199 -102 103 99 77 68 -24
2682 -24 -110 -78 -7 228 63 -82 -82 -170 267 -268 178 -304 29 106 263 65 -32 164 -224 156 -255 -114 -58
2705 -58 -82 -44 -102 49 -265 -288 127 50 -299 90 -169 -169 159 -197 -153 78 321 -32 228 1 153 -15 83
2728 83 -143 96 -386 19 -41 214 -178 92 208 55 227 -7 416 74 288 -83 54 87 184 94 277 23
2750 23 -208 -395 -89 -93 218 -51 -26 12 -410 -87 67 -12 -131 -94 306 29 280 -57 -99 26 -149 102 44
2773 44 42 20 113 -201 66 7 40 -33 64 -95 314 -53 -66 9 -36 121 10 106 -296 -3 47 -12 -90 -288 -265 333
2799 333 -255 -17 -180 -25 -76 7 148 40 -18 147 -162 -172 90 82 36 -5 146 -83 -66 23 92 -208 -43 -95
2823 -95 136 -304 -83 -269 -122 -52 107 -54 -146 -81 -25 151 4 118 -187 -31 -19 136 -67 -11 -153 -120 173
2846 173 67 16 -48 39 -253 146 -267 -73 256 104 154 200 334 -53 -28 168 -91 -150 183 76 -73 -111 154
2869 154 44 -217 225 26 69 -407 175 50 104 119 -53 -72 165 -59 0 80 -1 -92 -63 3 -10 37 -9 63 -60
2894 -60 -320 158 -35 -358 191 190 -135 18 112 -72 247 -18 -238 165 -165 -209 -17 83 -108 -61 202 -202
2916 -202 -274 209 -83 -275 14 142 -96 135 190 32 254 106 -62 -145 -42 14 -266 178 25 -137 -94 -153
2938 -153 -68 4 -137 -85 155 -256 133 -155 -17 -62 -282 204 38 122 -30 57 -71 -87 -29 -72 66 -166 129
2961 129 86 395 116 -239 -32 -228 -19 81 -89 62 37 -136 77 15 130 81 251 -122 103 -100 -315
2982 -315 49 4 -156 48 91 11 -226 88 110 -74 77 170 -157 171 186 81 -95 -146 -158 -166 291 -132 95
3005 95 -128 -86 -28 -74 70 -29 151 -58 -1 -122 -60 -221 85 -7 -8 -29 42 265 -111 -92 139 30 161 325
3029 325 -181 155 -13 172 65 -186 172 -159 188 155 -155 -214 36 -64 -48 -226 -144 -89 -274 -88 256 -243
3051 -243 76 134 60 232 -175 48 129 315 7 55 49 -199 184 -194 -8 -75 -239 51 -140 -14 49 188 -78
3074 -78 26 -44 -176 -5 229 173 10 164 -185 191 273 -133 185 105 -115 -92 71 -118 -65 34 -56 83 -170
3097 -170 13 -22 -158 182 35 136 -111 266 16 -122 13 -124 21 -161 -214 175 -111 -33 -269 -55 -54 -149
3119 -149 180 82 36 291 133 110 31 -18 -6 -144 -2 243 280 -79 23 84 169 38 116 -55 53 -277 -48
3142 -48 64 245 2 151 -4 110 116 269 241 95 48 -181 -576 -169 -167 87 100 -87 199 -133 -47 -32 30 -94
3166 -94 47 284 102 -14 107 -88 -29 295 -92 131 -257 58 55 25 39 -114 227 -139 332 -7 28 61 -138
3189 -138 76 265 23 225 -51 157 79 -25 -284 -110 -83 -187 73 -48 58 -108 -40 -35 5 95 -2 60 152
3212 152 -238 129 73 -65 10 -178 211 154 143 -476 -180 -161 -2 183 -92 -45 30 134 251 -96 60 -89
3234 -89 -28 189 202 122 161 173 -117 -225 -41 -85 -13 44 6 -268 -42 -65 -122 166 -263 237 -257 188 183 56 27
3259 27 375 -30 198 37 5 -108 -113 58 -139 138 259 -247 -30 41 233 -395 -187 -161 -170 62 179 -28 -73
3282 -73 101 171 36 -214 16 -69 161 133 -50 58 7 125 -137 67 61 -105 41 66 187 110 -63 -79 132
3305 132 88 -42 139 56 145 11 57 -160 -65 204 -26 71 184 172 -80 128 127 28 12 62 -30 83 -60 33 -11
3330 -11 -243 63 -13 -172 -198 69 -133 -52 -311 -124 -250 -182 -17 8 109 60 221 48 222 6 120 -16
3352 -16 -15 -188 -213 -25 -10 -3 5 229 218 86 155 298 120 -192 232 260 218 44 -283 158 -39 -46 -125 -388 200
3377 200 -113 175 199 304 -28 -22 86 -288 -142 -234 125 109 219 204 59 -237 -100 -160 56 81 61 80 92 -441
3401 -441 165 139 -107 -214 63 66 42 -187 -88 259 145 -29 157 54 130 242 101 105 88 11 -293 -281 34 -75
3425 -75 -12 -6 -101 -254 48 -117 207 177 -145 88 -108 34 60 160 193 190 -42 138 102 9 -17 -107 67 154 -19
3450 -19 -35 -49 -149 82 24 214 -35 104 226 240 64 -119 -230 1 -300 -99 -48 121 -24 124 228 -275
3472 -275 105 73 -56 179 17 175 -191 357 38 97 -108 84 -99 401 -41 9 39 -80 -37 -148 -17 -157
3494 -157 258 -210 110 83 -32 -136 295 148 -231 268 -170 -215 -300 71 42 -35 -136 -22 157 -29 -212 21
3516 21 -26 -307 111 -191 -32 55 -20 -16 87 76 67 23 -55 145 40 -200 -12 67 -359 15 -162 32 37 -105 -161
3541 -161 -15 -141 -141 -212 113 68 -68 -309 -108 2 -143 -5 -46 -17 -30 -107 -74 -306 -253 -62 274 397 25
3564 25 90 115 200 -30 63 -95 77 -128 107 230 233 -60 -120 -40 -134 316 128 80 -59 105 173 117 -93 -84 182
3589 182 83 77 -5 -248 77 73 21 85 -137 95 -37 -67 -149 -257 -278 129 -111 -183 -267 131 -47 313 -11 -146
3613 -146 -91 58 315 31 84 -75 80 -234 -124 178 162 221 124 57 -1 8 -72 309 257 -30 15 97 60 122 -219
3638 -219 -124 16 -9 162 16 -52 -126 -56 -31 -268 43 259 142 -38 -50 253 149 -86 165 155 -36 -45 43 -91
3662 -91 23 329 176 -82 -35 -63 255 -233 73 -217 -17 -155 121 -60 -261 -69 -21 -25 50 16 171 6 -187
3685 -187 -31 -136 185 158 43 -116 0 92 135 -72 -88 53 30 -219 -318 -267 49 -109 148 136 -38 -119 -58
3708 -58 15 -114 -118 -161 329 106 165 54 -205 -204 102 262 128 -138 -7 179 -187 118 128 109 -164 -122 68 135
3732 135 73 -49 158 -369 -202 -160 -72 66 -177 -138 -262 -121 111 148 283 280 176 136 -56 86 -47 -30 -105
3755 -105 -20 64 -289 44 -105 59 -20 -20 191 -183 15 -202 152 207 73 -47 -59 109 329 154 57 149 77
3778 77 -219 -89 12 -80 -16 103 -11 -56 -14 109 -94 -194 -99 -178 264 11 -11 143 -112 -93 254 -162 343
3801 343 27 -272 24 8 -35 -206 -112 50 -123 -314 -165 130 61 -136 130 134 236 -43 227 -98 164 140
3823 140 -4 -58 -325 6 -96 -47 205 200 -197 -27 181 158 49 -26 26 -199 86 -83 -34 -40 -39 167 -14 177
3847 177 60 53 51 24 -182 66 -67 79 49 192 -51 84 140 -18 47 -12 -32 309 32 141 153 80 39 -88
3871 -88 -262 5 -54 -78 4 5 -55 -82 178 -15 9 209 97 -97 130 139 58 -24 -165 -217 -9 -282 -18 -12 189
3896 189 -67 -215 103 -74 83 36 -77 -170 26 -52 29 11 -148 -65 -22 -17 29 -5 -110 -21 28 187 106 156 -168
3921 -168 -215 -4 146 -154 -34 -76 -246 -285 -58 -60 209 113 99 89 117 -143 2 -86 -215 59 71 29 69 11 317
3946 317 121 -264 142 -6 -61 243 112 -29 -50 -197 -379 -13 69 85 -177 49 11 61 23 193 -59 35 -108
3969 -108 -302 -9 -46 178 -95 -28 51 -120 227 33 169 -143 -113 56 67 49 -152 158 96 109 -19 -64 28
3992 28 -103 -106 -89 46 -168 -23 -39 133 81 -75 -87 -164 75 -187 15 24 -368 89 -82 67 -122 55 45 -7
4016 -7 59 -46 115 272 102 114 235 247 -38 63 258 152 -220 -159 50 -68 -265 -273 306 6 -104 90 -326
4039 -326 202 295 176 -113 48 -199 123 -40 -385 85 -223 -103 -140 9 -182 17 133 19 -132 81 -244
4060 -244 -5 171 194 25 66 -45 -145 -35 -218 -49 -67 126 -148 -315 103 -156 -454 -106 -157 27 -78
4081 -78 -135 -31 -32 -189 -118 127 161 113 -142 168 -153 -121 -107 29 121 110 121 304 -276 -20 -114 -286 7 24 -57
4106 -57 -88 15 105 -21 -273 -54 188 -104 -195 -256 -70 110 -150 -181 -125 79 -30 23 -1 -129 132 319 -48
4129 -48 -194 132 43 -135 -43 108 -116 134 -155 -82 9 -137 -186 -192 184 198 -15 102 -102 -48 87 -39 -35 -145
4153 -145 -10 -57 62 118 -113 -129 207 -174 -175 208 45 106 -60 -2 -1 235 86 -60 237 59 -69 230 224 -17
4177 -17 45 -159 163 95 -276 -98 -232 -314 67 278 144 29 -175 185 17 -248 239 289 246 -149 120 -74
4199 -74 -217 86 -1 96 -141 91 -152 -245 -270 125 -14 -266 66 30 -45 -357 -257 172 310 -58 -45 54 -13
4222 -13 172 -17 -128 -90 -102 -67 231 11 60 -121 -5 -19 -134 155 -114 213 -39 -114 39 -137 -78 -98 -101 -273
4246 -273 -19 -26 211 -33 174 -156 -167 -86 -187 -184 -89 -100 89 -192 -26 -1 -63 75 101 -252 13 -74 11 1 -178
4271 -178 -81 51 -158 -19 239 -36 60 102 -127 -58 -38 -100 117 36 -91 147 21 -141 -208 -186 -74 -208 66
4294 66 102 -11 42 177 -136 55 -43 272 -213 -144 27 -83 -5 109 44 116 142 -64 179 -72 22 55 -158 29
4318 29 254 6 -100 84 -113 22 95 168 -54 5 -19 -142 -42 144 128 121 -125 -35 -344 131 66 -83 23
4341 23 357 70 -214 125 -238 170 155 82 -33 110 6 21 92 263 -115 -104 -71 15 -182 -119 20 -90 85
4364 85 19 39 277 133 -27 43 -62 62 -15 -57 66 143 -99 -272 -58 300 -12 -97 -259 -209 185 40 -392
4387 -392 86 -95 -20 3 2 -77 92 -156 197 239 -93 -160 67 -283 -202 58 157 45 -80 -30 296 -180 -107 27
4411 27 -192 -110 -199 167 -8 -86 173 -158 -354 99 216 -33 19 182 -436 123 -140 117 -145 194 -137 -151
4433 -151 86 80 164 69 158 242 -56 135 192 319 22 -197 45 -37 -60 -124 -384 -5 217 -257 126 181 -218 -103
4457 -103 -72 -13 184 25 39 -105 -8 68 179 -209 -14 179 145 -243 169 111 -322 136 -221 112 59 105 -100
4480 -100 -75 251 -37 154 180 -116 32 221 -51 103 -175 -70 -88 -171 74 -208 52 -4 -70 386 -27 -224
4502 -224 -183 -23 142 194 -381 58 2 117 156 -15 -79 -130 238 58 -56 143 -200 189 32 -263 32 -40
4524 -40 245 91 -13 22 -74 13 -10 -150 -27 -83 58 -26 226 -80 -18 67 -66 129 177 -38 52 38 -70 -54
4548 -54 -165 -8 -119 54 -126 -14 -207 -387 115 72 60 -153 110 -10 -37 -159 121 -163 149 343 0
4569 0 25 128 -50 168 210 106 39 -161 94 -3 -113 -133 49 277 -88 203 279 -53 -73 -223 70 190 -117
4592 -117 96 -135 -163 55 290 -84 151 -368 -94 91 -72 107 -131 59 -174 160 77 -5 32 -259 13
4613 13 165 -87 -51 425 -274 94 98 -92 143 342 30 176 -351 88 209 -32 -39 -292 32 -95 21 46
4635 46 -341 78 -88 -190 70 -158 -42 121 41 5 231 -52 -57 24 -121 -18 -21 29 -92 184 -67 -34 -12 -346
4659 -346 224 7 -223 126 73 225 -24 279 -109 -58 237 164 -77 -190 -65 -155 -152 -127 -79 108 66 153 46
4682 46 -188 -316 -378 -55 72 -80 -29 -86 77 -376 -124 -197 96 -320 -155 -53 -244 66 111 -120 -213 -128 -143
4705 -143 93 137 26 -42 162 -47 27 32 214 35 -131 38 -217 175 101 53 106 38 87 -145 -70 10 -219 -198
4729 -198 97 40 56 -208 -83 -144 5 116 116 -225 46 1 399 52 -72 67 -76 66 482 8 -18 -107 162
4752 162 200 366 -29 -188 -213 130 -2 52 102 -91 107 -136 7 -66 -65 174 -1 -71 50 69 173 332 52
4775 52 -146 -214 -47 93 -4 -350 -84 37 -135 255 -172 49 -319 -215 33 77 -2 -52 128 176 161 -44 -71
4798 -71 121 -5 -161 -176 111 -68 -108 -67 29 151 -127 5 51 62 -206 30 -13 21 -85 -122 57 295 -39
4821 -39 -27 64 217 -41 -205 -97 -133 82 237 -111 -20 -186 -9 -184 -93 -228 285 18 55 250 -58 -92 -133
4844 -133 231 -43 147 78 6 -105 -85 75 33 -194 -24 -123 -114 302 -29 -73 45 149 -2 92 188 34 -229
4867 -229 5 -64 147 23 -189 110 -96 -151 92 94 -349 -86 66 -68 152 209 -159 18 -99 -55 21 -69 173
4890 173 200 -130 -57 -2 65 -36 -83 -44 32 266 -225 216 173 -29 -9 221 89 -8 169 -61 -70 7 -97 415
4914 415 -210 -230 49 -267 -200 -229 -112 -184 194 -150 161 68 -197 240 -2 -78 244 -113 -159 -122 -258 52 -64
4937 -64 -25 204 36 126 142 -11 55 163 48 -195 155 -24 -144 103 -254 93 55 83 -47 -67 -18 -171 106
4960 106 183 201 -44 -124 -95 2 108 44 186 148 -153 27 -19 101 169 -305 -2 11 123 -22 -125 -307 252
4983 252 -75 -164 19 -68 61 104 82 206 76 -72 -68 -155 196 -52 -102 159 70 -72 118 25 -5 89 57 -176
5007 -176 34 -123 5 -15 -89 133 13 11 157 101 -256 201 -156 -137 -194 112 27 191 127 159 -9 -9 -107 24
5031 24 -37 68 104 -42 -384 59 167 -111 237 -79 1 -184 178 0 -55 100 -113 -89 122 -74 52 117
5053 117 -112 104 80 -105 -66 11 -208 -12 -51 158 -30 35 -20 73 156 -60 29 98 -128 0 92 -80 55 446
5077 446 11 -13 124 -248 -60 75 19 -123 138 113 -198 0 85 151 16 142 -29 39 -17 88 130 181 81
5100 81 -126 -34 143 184 -93 121 81 -133 -72 -219 269 42 49 138 -27 -3 19 122 21 -115 -154 -29 28 -116
5124 -116 -235 -102 -100 122 -47 15 -83 -269 -175 -177 75 139 171 -74 -126 -237 -279 185 -20 -96 -236 202 29 130
5148 130 75 -235 104 64 -128 -265 57 -187 19 36 -200 100 -145 -71 170 110 -77 -347 62 -24 135 163
5170 163 103 72 79 -128 179 175 -4 -63 149 -19 -141 177 89 -310 -66 -114 11 108 -7 -229 -366 245 -85
5193 -85 -223 -32 128 77 -36 39 53 401 137 24 -47 -140 40 138 220 -57 160 -260 116 -39 -119 -52 45 -125
5217 -125 -76 -198 29 -190 -116 119 -77 77 -24 -153 12 319 46 -163 50 -30 240 92 -142 -145 -185 -242
5239 -242 330 -96 -51 -76 24 31 -189 193 56 -124 162 183 -292 51 65 -226 -21 -94 57 -90 249 10
5261 10 -18 -20 75 79 -87 -178 21 -85 292 -36 13 121 -37 90 209 -45 2 -132 23 -46 -102 -42 -339 342
5285 342 289 34 112 -71 56 72 -114 0 -331 -205 333 -44 18 322 167 330 -12 -35 -190 6 -359 8
5307 8 -119 79 84 -114 91 74 63 -303 -105 -22 -198 112 -25 -62 157 -24 48 -157 -1 -46 -77 241 4 -60
5331 -60 75 -54 -27 40 69 -93 -146 66 170 321 229 -165 -44 20 145 50 -140 7 -175 428 171 13 38
5354 38 -153 -54 145 -2 248 -114 -201 -3 -131 76 -101 -28 172 312 -175 192 107 57 227 27 220 50
5376 50 -173 -45 -146 150 -232 -44 -130 -165 137 15 -7 -204 88 -10 -236 114 105 -120 14 -186 255 -106
5398 -106 -41 -124 -61 145 21 108 1 -234 -188 125 53 -307 115 -69 218 189 -101 50 5 -12 -50 1 -64 55
5422 55 -82 -98 -42 -86 42 -277 -84 17 -140 102 67 -73 364 -64 -14 96 -95 -81 -119 -69 16 27 -51 -59 -143
5447 -143 -73 61 -3 -115 10 70 378 -204 -103 -196 419 -172 99 37 -116 92 -256 313 47 43 -10 38 -151
5470 -151 119 -183 -246 192 235 181 -10 164 60 7 -40 -23 -247 -94 52 -165 -128 -105 -164 -28 114 67 -84
5493 -84 -159 -50 305 -8 -70 212 244 -27 19 235 -162 51 -85 80 12 230 -27 45 223 48 -58 -63 119
5516 119 -174 -16 37 221 -185 -115 108 6 -11 130 -91 126 5 -106 169 103 -51 -181 144 -123 80
5537 80 44 -85 89 10 -151 -127 -6 53 316 -129 -360 62 127 -9 -120 14 30 167 146 -51 -329 -35 -177
5560 -177 28 -5 -39 166 117 56 -244 48 253 206 130 75 -243 -81 132 91 -104 -4 -69 -47 46 -15 69 59 355
5585 355 256 -164 -5 -150 19 48 -160 56 -41 104 110 -107 323 7 109 22 124 103 176 65 233 179 -50
5608 -50 202 68 -124 261 261 27 -168 -3 -36 -301 58 -17 -8 71 72 36 -345 -176 268 156 49 -67 -40 -47 -294
5633 -294 -89 87 -90 -91 172 -23 -118 40 19 -192 -276 280 14 -179 -205 -455 62 -54 22 -100 26 63 -160
5656 -160 -72 -209 -27 -32 47 -28 -121 -241 171 180 -147 51 -360 -161 22 84 -283 -15 -17 46 -131 -40 -6 26 -195
5681 -195 -128 10 -127 145 23 151 -109 201 76 -268 -64 97 27 -104 -4 84 108 -256 121 0 -71 56
5703 56 -139 22 -167 116 -269 -41 51 299 34 84 -169 69 118 -182 165 161 -73 -264 -2 178 62 -194
5725 -194 -228 40 177 -156 114 14 19 303 251 161 -71 163 -72 41 -96 14 -206 124 -131 -212 90 39
5747 39 -85 143 115 -89 11 10 187 -39 -85 -34 -48 127 124 237 21 -100 217 -42 -1 -61 97 143 -1 172
5771 172 9 21 -16 -61 -235 -8 -351 55 96 -138 78 185 352 164 -38 -121 -29 -378 43 -207 18 -2
5793 -2 9 -165 -89 -10 202 217 -216 48 -19 -92 7 -77 121 -15 12 -140 -132 -49 65 -59 -176 -33 61 30 -19 -173
5819 -173 188 19 16 -223 4 -274 179 28 -273 146 74 -110 -96 153 -255 -49 20 -121 289 19 142 -303
5841 -303 -120 -77 110 -122 68 172 -167 -9 180 255 -36 -204 105 115 109 291 113 127 -190 17 109 -223
5863 -223 -348 -6 235 -28 -187 -115 64 -180 -82 -92 -26 -81 -114 -13 -46 195 251 -137 -112 -197 357 -123 201
5886 201 128 -213 17 169 173 20 -36 -279 21 -172 128 49 101 -307 -126 169 -256 -299 -92 89 -134 122
5908 122 352 226 -64 159 -56 82 22 -109 -15 103 49 200 129 -97 -310 174 94 -26 63 -335 -185 -77
5930 -77 13 -168 -100 87 -115 -18 11 -20 -284 0 -380 -3 -213 302 -323 -19 181 -68 -166 119 204 55 -168
5953 -168 -336 49 300 -170 -77 -69 -55 124 -76 28 80 -81 -27 122 39 3 -190 -162 154 -19 -74 -187 227
5976 227 -20 287 -4 175 -43 -11 -28 -48 236 -24 -8 15 94 267 -247 101 -230 3 13 -230 -46 160
5998 160 -254 -267 -74 -22 133 -204 14 -160 245 -171 26 -205 33 -31 290 105 213 -80 96 4 -240
6019 -240 128 -59 282 -93 35 -49 100 -160 174 -63 -125 -138 -100 166 -6 15 46 -282 20 168 -66 -127
6041 -127 -37 185 -14 26 -94 43 -136 -289 -123 252 19 -199 38 53 131 152 6 -119 25 -39 -110 144
6063 144 -266 -249 -47 -174 -67 52 13 31 -43 98 81 322 -11 177 424 -107 33 -118 149 -245 20 78
6085 78 230 115 -35 -329 105 -86 -50 -147 -64 -65 108 -32 203 164 -112 7 -71 -32 68 162 -174 -49 -70 -156
6109 -156 -67 269 276 -18 -29 -100 -246 -195 98 -35 109 151 4 60 -11 263 209 127 98 -120 33 -54 -204 184
6133 184 250 288 199 -12 -234 -80 162 141 -38 173 -112 -58 -68 91 -32 -123 -5 60 -111 -14 187 -49 63
6156 63 -80 2 -60 -65 101 137 -189 66 -19 -94 -18 102 72 -91 56 -159 -116 -96 -130 -39 18 24 -41 -80 -37 113 318
6183 318 134 102 227 -21 -108 96 -145 293 321 -62 -162 103 -8 -44 198 87 -107 -65 329 -88 117 108
6205 108 -18 45 -89 -161 165 -260 -363 29 111 -132 -32 56 320 -1 154 -57 117 26 -118 99 -272 -294
6227 -294 248 51 -7 -83 158 197 43 -99 222 127 163 -218 -56 102 50 50 -47 -72 153 175 221 -50 -113 -103 -118
6252 -118 -39 -79 -29 155 461 -127 -164 157 -44 81 28 -192 129 -60 -35 -220 -125 -185 26 24 -182 -203 172 163
6276 163 -227 116 -61 144 -384 230 98 -231 -99 135 105 321 -301 21 98 167 -17 -38 -104 -69 44 -21
6298 -21 124 190 107 -121 216 -194 5 -214 -196 -64 -63 71 -171 -29 -213 -137 -116 135 -36 70 -224 -243 -90
6321 -90 17 163 -106 219 -278 267 -79 137 -111 184 86 345 -33 15 22 65 77 89 77 -26 -134 121 83
6344 83 115 -22 93 6 126 -112 39 -253 106 121 216 33 1 -124 -83 -270 240 40 -18 139 -283 80 -51
6367 -51 193 -44 -54 95 216 41 -21 -280 11 -349 -123 18 51 98 -116 -206 -6 80 40 151 9 -29 -169
6390 -169 -128 -173 -65 -80 33 22 -277 -25 -117 -14 -137 -132 -135 177 83 -314 -110 -76 129 -6 24 221 -226 105
6414 105 -169 15 53 217 -112 -27 -91 -158 195 54 -60 -74 -196 -152 384 -62 -13 39 29 -44 101 -129 115
6437 115 1 14 -142 145 270 153 -241 -260 62 -154 81 -42 126 -238 34 136 116 56 134 -242 -94 -157
6459 -157 112 44 -114 11 155 115 68 -66 -147 165 -65 -163 -170 -159 118 -12 -83 -1 -52 -513 252 146 -61 56
6483 56 27 -52 -102 -176 -47 -151 -18 -6 -231 132 -163 99 175 -129 80 -287 -117 72 74 62 -31 154 -142 -240
6507 -240 -294 -197 -12 78 -126 -126 56 -149 -37 -148 -54 -78 -217 201 -172 -180 -70 353 71 -140 -183 112 155 128
6531 128 -127 -89 162 32 71 -153 -121 211 84 94 41 110 164 335 -202 -31 -262 51 96 -1 -20 -187 81
6554 81 -232 -71 197 48 -274 -99 84 -87 -77 87 -108 -201 -71 -84 181 184 83 92 10 160 -199 -69 -17
6577 -17 169 -72 47 61 -213 -461 -23 177 141 80 -73 -337 -299 -22 -50 -83 116 -119 -236 -238 148 -35 -96
6600 -96 208 -7 141 82 -191 -143 192 -46 -212 -17 126 -90 -149 -196 22 -99 84 78 12 55 -255 71 153
6623 153 62 -247 20 -91 -15 -36 -10 163 43 -48 -26 -17 145 -143 22 260 106 -268 -155 -25 -34 -224 -34
6646 -34 -200 -114 -125 -68 206 -55 -121 51 -27 -63 0 -131 -226 -140 7 127 174 64 105 -14 -416 -5 4 -32 -3
6671 -3 67 38 -1 -233 0 15 63 4 41 185 55 64 -135 -39 57 -270 30 -156 -53 22 506 -187 39 -8 8
6696 8 -190 17 -222 100 128 -165 -210 -142 252 -157 -199 24 63 48 -123 -252 -201 42 279 68 50 65 -159 -128
6720 -128 -397 154 93 91 -265 -199 157 -265 -33 151 146 -118 295 -5 -43 -73 111 128 35 -154 323 -100 -65 -40
6744 -40 176 28 7 188 -7 229 33 98 180 194 -106 55 147 -71 52 185 260 -101 -2 138 -72 44 4
6767 4 105 336 54 54 -106 -27 64 51 -85 -221 189 110 367 -265 77 -157 280 -87 -119 88 -97 -74 216
6790 216 71 7 66 118 189 111 136 312 186 27 170 -141 325 -118 396 1 -199 -103 166 -21 -14 -34 135
6813 135 79 -208 -359 -277 127 -10 -450 73 -103 214 -3 -295 -11 97 150 2 -59 248 -64 270 166
6834 166 3 -57 -86 -187 87 257 63 117 5 40 189 62 -73 140 81 66 -240 2 -117 -87 -126 -84 163
6857 163 303 -92 -257 -110 72 220 148 -292 221 138 -327 -151 -134 -3 28 -220 -21 -212 -212 -186 206 133 155
6880 155 -178 -16 -139 33 154 194 71 22 -98 85 109 -199 176 157 168 141 -225 155 -72 -178 -35 36
6902 36 -125 51 69 8 149 -169 26 36 -17 -130 150 -36 161 93 -284 -18 -35 -83 18 -278 -25 -88 -137
6925 -137 -261 5 74 -127 -30 -193 68 74 -81 -23 -12 -161 6 -338 -47 -198 -76 150 -222 9 0 -54 465
6948 465 97 159 62 22 -18 147 141 -241 -204 -63 51 -203 32 114 252 -101 60 74 -197 -113 -110 -25 -68 118 -88
6973 -88 187 -164 53 59 -104 253 75 -153 -171 -275 100 -45 107 29 -229 -163 -63 235 253 88 -209 -208 -17
6996 -17 -10 75 -246 51 113 -95 -73 -90 -237 -378 -202 64 -68 29 -130 -32 129 27 151 -93 -326 -74 287
7019 287 -62 -268 -23 -64 -129 -51 61 -136 -96 -20 -245 -146 168 257 219 -17 9 69 -49 60 -155 -82 -127 -106
7043 -106 -21 241 58 -139 160 70 120 -56 51 -106 1 31 -52 -208 -138 106 145 176 237 -34 71 -50 307
7066 307 192 178 -208 -11 29 -294 -64 -197 -26 -274 5 149 17 -141 151 -33 -8 -1 258 56 -159 -85
7088 -85 115 191 -58 -78 -10 153 -67 91 -140 -11 218 -126 131 149 17 110 53 -166 -156 161 39 3 196
7111 196 368 -201 328 77 45 47 311 -320 104 128 -133 156 332 -15 5 -124 98 110 35 -30 33 -101 -181
7134 -181 -111 -56 14 -105 -38 -50 20 108 289 -101 59 69 -2 29 217 137 335 -109 -64 139 90 104 -87 -13 127
7159 127 -220 -161 138 -98 -45 222 -77 78 -20 -180 -132 71 -201 196 -86 -139 -67 -66 -110 337 -56 313 -14
7182 -14 -15 -93 97 163 -273 -35 -36 -166 -241 188 43 148 64 -13 -82 136 -189 45 -31 -199 -190 -160 -207 -196 132 -189
7208 -189 -28 72 -69 133 -163 -170 304 348 0 150 60 194 69 -47 31 30 -243 179 60 0 69 -112 -84
7231 -84 -21 148 32 -189 -91 -51 -187 -5 -36 -174 4 -47 72 -99 -307 219 -71 244 17 -104 -54 79
7253 79 37 -28 -86 -24 148 -27 -33 -272 74 -76 217 -136 -185 198 65 87 19 -20 -162 122 -56 195 26 -32
7277 -32 201 -51 -17 365 9 -256 -4 123 -275 -154 -77 58 -34 -118 5 -7 375 229 -137 -34 -264 -64
7299 -64 112 -10 -7 142 117 -19 14 -328 42 -15 13 -193 -23 -136 13 277 38 189 23 92 87 15 -4 -117
7323 -117 -25 47 90 -282 -287 -29 -95 -17 -89 68 -115 159 44 311 144 105 -27 0 -139 162 209 -112 -117 26
7347 26 -124 -164 143 3 -14 230 212 -182 162 29 327 -334 -49 -114 -100 53 -60 -118 319 116 -110 -3
7369 -3 142 -172 -292 45 -161 103 -108 -78 9 53 22 -291 120 124 -61 92 -123 -93 -142 -28 -7 -149 68 107
7393 107 83 -21 126 368 160 144 170 -41 -20 -72 -85 261 326 98 -124 -19 229 21 -175 -6 251 -41
7415 -41 -27 83 83 14 -90 259 -287 -41 182 -56 149 162 59 -266 -171 -103 77 225 -55 405 -34 -4 -450
7438 -450 -62 113 22 273 -90 213 315 -361 -114 66 345 13 -25 -7 -282 69 -111 158 -58 -163 -240
7459 -240 155 -193 143 51 -99 -114 -240 160 -25 239 -95 286 56 -111 219 -14 -153 45 35 -14 113
7480 113 74 119 -2 -215 -145 75 6 -1 116 46 177 198 248 -199 199 60 106 -115 -19 -171 -194 109 -50 218
7504 218 63 -101 74 131 77 -103 -7 -47 78 64 -200 -23 -71 -54 -44 -74 280 -92 -1 -39 25 -37 -13 29 43
7529 43 -102 166 24 392 93 -67 399 24 130 -252 232 233 -69 -138 -174 63 -283 -53 -70 51 -134 52
7551 52 16 185 -181 -123 -267 -67 45 -54 -275 128 -45 48 179 -269 -72 129 322 323 111 196 -87 131 -3
7574 -3 33 145 4 -188 325 -330 124 -79 -71 19 -307 -325 14 35 103 -144 -5 47 -1 317 150 -148 -13 -206
7598 -206 -55 38 119 28 69 145 -37 -52 -226 -128 57 1 -48 -18 -156 -199 65 -35 -214 -32 219 249 138 63
7622 63 -366 -78 -24 -157 93 -224 257 -99 140 -58 113 474 -54 7 -65 2 -188 -201 -32 -35 222 -124 43
7645 43 -21 118 -133 176 95 -262 -214 -55 134 26 130 34 -84 -131 -385 69 411 -91 161 102 -60 -133 -58
7668 -58 -231 -183 -38 -21 136 278 177 97 -201 -44 -76 84 147 -54 4 -122 -210 -183 72 -12 -124 64 -101
7691 -101 47 -155 57 130 59 -142 -264 -99 -93 -186 -53 -62 184 -371 34 -106 -168 -167 56 69 -126 -139 2 138
7715 138 -52 31 158 39 70 100 -88 -98 -5 123 -20 12 117 167 -65 -35 -3 -415 -237 291 -104 -102 -104 -137 -128
7740 -128 319 -80 159 -248 131 198 91 -2 -232 94 83 142 -132 6 31 6 -238 86 -133 -15 84 -22
7762 -22 46 -80 -119 -202 -457 -162 -108 -13 26 50 -2 7 8 -186 -127 -33 27 264 69 73 272 -125 3 69 -4 110 62
7789 62 103 -215 49 228 69 -4 89 -325 74 128 6 150 -102 106 7 92 28 -166 -260 -201 -56 136 64 -31
7813 -31 88 83 -220 103 -291 -106 -29 13 29 -209 -120 170 -29 16 83 -423 -76 153 -87 97 -36 153 264
7836 264 172 -48 119 142 66 75 81 100 323 67 100 -113 36 152 71 79 44 -170 78 -76 -183 -112 -41 -247 -150
7861 -150 85 -108 2 1 -142 263 -101 -28 60 -23 249 81 18 -59 -24 115 -39 37 -68 240 106 -216 160
7884 160 155 -106 -19 6 -165 127 84 -182 -46 179 -116 -87 -97 403 62 65 29 -116 88 95 -208 -184 -3 -26 241
7909 241 81 221 121 -252 55 101 -201 -191 -170 95 270 6 -15 -207 267 -63 -175 27 92 116 382 45
7931 45 263 308 76 106 -211 45 110 42 -228 -78 -48 101 -221 161 -1 76 153 40 -143 194 160 -128 -129 271
7955 271 0 -297 -102 60 -99 2 231 4 42 -139 -104 61 -115 -54 20 20 54 -228 214 -130 9 -230
7977 -230 -228 201 128 75 268 -49 -160 132 252 187 -160 -79 -98 -30 -46 10 114 -7 -250 174 -73 -17 -7 -95
8001 -95 -368 16 120 32 -210 256 -133 100 -205 -37 19 -120 -180 -111 226 -22 6 -330 -290 -66 -31 -89 -123
8024 -123 12 -335 -260 -80 39 -71 -212 -125 -119 -225 78 100 -104 -125 -182 23 50 -27 140 13 48 -301 223
8047 223 58 -136 3 177 -62 -267 97 17 29 19 61 -78 32 289 -143 -75 18 26 61 -25 -293 120 57 -86
8071 -86 77 -94 139 29 123 176 101 126 -216 -54 -180 -28 28 -9 -43 -43 97 20 -226 -146 -22 -150 -84 -47 274
8096 274 292 166 46 86 26 69 -203 15 -26 -194 117 -204 -88 217 231 -32 -424 89 113 -5 71 -38 -226
8119 -226 -6 -176 198 -122 43 -136 50 -29 22 -210 -50 -78 -157 -178 66 125 63 132 -50 38 44 114 -181 88
8143 88 86 16 3 88 -87 -253 -99 19 145 -2 -170 -4 -141 54 281 -217 37 -215 2 232 272 36
8165 36 -8 -138 4 242 -58 -137 185 -182 -62 -61 -27 -67 71 -62 -190 27 -93 29 148 122 -38 267 69
8188 69 -90 -25 -108
8191a08
$$ Imaginary data points
##PAGE= N=2
##DATA TABLE= (X++(I..I)), XYDATA
0 0 0 0 0 0 0 0 0 0 0 0 0 0 0 0 8 -8 8 -8 8 -16 16 -18 24 -26 32 -40 43 -50 58 -66 78 -89 98 -113 129 -144
36 -144 162 -180 203 -225 251 -280 310 -342 379 -419 461 -509 561 -618 680 -751 828 -912 1009
55 1009 -1116 1241 -1380 1545 -1738 1970 -2254 2611 -3078 3712 -4632 6093 -8770 15296 -69766
70 -69766 -17599 111194 -34117 -92064 28901 83247 -36694 -52577 45960 56222 -32792
81 -32792 -24220 39241 22348 -32255 -4754 27989 -7108 -32905 9947 17471 -29794 -23777 27439
94 27439 3449 -42070 -703 47819 -2533 -44077 16806 58648 -10858 -45270 30528 55603
106 55603 -31129 -51639 32993 39066 -49276 -44779 39590 23655 -49547 -17950 44236 8564
118 8564 -34439 4893 32864 -2465 -17357 12854 14639 -10960 -4583 14089 -588 -14299 3461
131 3461 10087 -12230 -16169 8976 10342 -17048 -13680 17159 11483 -17315 -8004 21127 13069 -14692
145 -14692 -7269 19309 10645 -17239 -10953 13576 5430 -16333 -9076 10383 5377 -8804 -3477
158 -3477 7237 4766 -1113 -3918 -2036 5615 3060 -9486 -5063 10518 3926 -11958 -1935 12695
172 12695 494 -10718 3404 10140 -4472 -5587 6850 1572 -7656 1962 6789 -6980 -8162
185 -8162 9565 6082 -15483 -6236 17121 2235 -21254 -787 22101 -817 -20889 6028 25837
198 25837 -2762 -20535 9511 22561 -10824 -22491 8925 16312 -16635 -20693 13441 12824 -19702
211 -19702 -10861 20999 7010 -18848 2331 22939 -2595 -16461 13568 18114 -16352 -12456 20709
224 20709 6155 -26738 -4529 23982 -5058 -30369 5092 25814 -13804 -27300 16979 25363
236 25363 -17350 -16777 26293 20669 -20072 -10352 26392 9683 -26497 -6636 22060 -2875 -27015
249 -27015 -320 19037 -9189 -21731 10261 17904 -13532 -11873 20415 11607 -17401 -1132 24267
262 24267 1150 -20604 6313 21448 -12230 -21433 13349 14455 -21438 -16441 17544 7610 -23400
275 -23400 -7099 22045 3717 -19186 3766 23392 -820 -14803 8652 16680 -7176 -13516
287 -13516 8140 9207 -12693 -10476 9348 3433 -13522 -4156 10757 -107 -11749 2937 12274
300 12274 -3667 -8690 9668 10505 -7846 -5580 12098 5604 -11564 -3233 11153 -150 -13395
313 -13395 -550 8860 -4609 -10430 2313 6945 -3727 -5292 5489 6545 -2137 -2185 4578 3539
327 3539 -2242 -2355 1669 2509 -2281 -2914 1504 1617 -2688 -2448 1183 519 -2888 -1565 2442 -316 -2974
344 -2974 1030 3485 -1170 -2049 3429 3274 -1561 -1460 3620 2888 -3115 -2442 3126 1202 -4072 -3000
360 -3000 2811 2017 -4522 -2788 4735 1442 -6243 -2021 6364 750 -7102 607 8285 -149 -6546
375 -6546 4162 8087 -3601 -5496 5340 3969 -6823 -4375 5491 130 -8458 -1210 5900 -2796
389 -2796 -6494 3082 6096 -3115 -3541 5823 5550 -4313 -2126 7220 2617 -6050 -979 6313 -443 -7946
405 -7946 -515 6142 -3415 -9234 1700 6009 -5388 -6722 6402 6983 -5172 -2955 9534 5316
419 5316 -6406 -180 8821 -328 -7737 1371 5868 -5071 -7516 2528 3436 -6721 -4722 4956
433 4956 2276 -5321 -421 6779 1463 -3926 1673 6484 -242 -3949 2939 5196 -2632 -4739 2342
448 2342 2723 -5730 -5715 2658 1231 -6499 -2764 5733 1148 -5081 1606 7379 137 -3804 3696 6041
464 6041 -2793 -3706 4337 2513 -5175 -3011 3015 -237 -5608 -1804 2935 -1097 -3890 736 3511
479 3511 -502 -1922 2151 3726 -174 -1399 3019 3158 -1500 -1615 2452 771 -3915 -2790 1448 -430
495 -430 -4590 -1086 3291 -528 -3134 1936 3511 -1241 -1420 3418 2818 -2017 -916 3343 1171 -2741
511 -2741 -430 1846 -852 -2851 -758 1309 -816 -2563 142 1481 -838 -1815 800 2147 -241
526 -241 -1256 2107 2987 -639 -1325 2315 1649 -2476 -1311 1729 36 -2789 -659 2019 -895 -2475
542 -2475 829 1406 -1931 -1906 1571 1077 -1147 -234 2311 1022 -1123 582 2084 434 -656 -195 1204
559 1204 -300 -1599 -782 515 -1231 -2562 -297 1034 -1264 -1812 1627 2120 -894 -545 2495 1111
575 1111 -1352 744 2703 52 -991 801 1569 -1202 -1920 202 16 -2841 -1626 449 -453 -1684
591 -1684 -20 1240 433 -105 963 1917 1230 318 680 1444 529 -1021 -651 385 -1306 -2321 -256
608 -256 -69 -1904 -1474 867 392 -1482 -349 1612 347 -578 1649 2402 619 390 1549 1021 -969
625 -969 -789 -98 -791 -2039 -1498 -402 -1218 -1074 -518 190 187 194 662 1457 1089 578 1246 1784 726 -82 108
646 108 678 -706 -1569 -420 -254 -1723 -1318 -126 -708 -1064 -474 661 -32 162 1358 1392 906 1272 1349
665 1349 729 233 307 -251 -653 -816 -1097 -915 -854 -979 -740 -862 -181 -61 -261 587 762 309 689 1341 1082
686 1082 307 533 601 100 -349 146 51 -1126 -506 -152 -898 -901 -492 -382 -597 27 212 134 728 1113 537
707 537 545 949 493 -203 192 472 -524 -445 325 61 -899 -573 -290 -281 -975 -235 178 -94 -482 444 391 35
729 35 470 694 586 175 634 861 499 87 -155 -692 -405 -528 -1064 -539 -162 -864 -591 403 184 -347 269
750 269 875 351 -446 898 1461 122 124 1140 711 -843 -462 158 -455 -1170 -486 -320 -599 -893 -368 -129
770 -129 -241 -109 497 1133 541 460 949 1295 336 -192 742 410 -827 -1045 202 40 -1359 -1012 295
789 295 -644 -1481 30 726 -301 -713 836 1279 50 400 1662 792 -499 70 975 -317 -1018 -710
807 -710 -285 -716 -1480 -772 -118 -827 -772 334 910 178 0 970 1345 -5 175 1368 928 -898 -79
826 -79 1277 -183 -1500 -563 261 -1302 -1975 114 291 -1162 -413 1102 824 -411 362 1611 690 -555
844 -555 784 1037 43 -627 -23 370 -718 -1282 -149 -95 -1287 -1106 540 117 -801 -76 895 945 -394
863 -394 272 1782 583 -266 806 1316 -198 -897 299 506 -1283 -1407 569 -160 -1634 -683 741
880 741 -154 -1093 323 1193 67 -352 765 1158 20 34 823 636 -216 -298 299 96 -748 -1271 382
899 382 -66 -1172 -354 887 -68 -951 66 1046 -79 -225 1060 1269 -72 -216 900 545 -564 -669
917 -669 454 -175 -1301 -572 618 -481 -1188 -161 690 -250 -709 306 835 0 -479 936 759 82
935 82 -493 713 741 -897 -884 767 239 -1431 -539 585 -375 -1671 -26 976 -436 -741 972 1363
953 1363 -234 10 1378 903 -690 43 1063 120 -933 -26 1014 -235 -1594 -657 406 -940 -1269
970 -1269 157 880 -496 -421 1356 1259 -685 -45 1733 901 -949 -133 1522 -212 -1563 -45 1117
987 1117 -1558 -1669 226 503 -1134 -1023 990 678 -1207 -76 1713 563 -576 579 1570 288
1003 288 -481 765 1046 -677 -1187 151 -1 -1122 -1125 360 92 -1362 -643 1126 572 -819 56 1505
1021 1505 202 -502 1250 1280 -285 -735 499 603 -1301 -1056 676 289 -1651 -386 331 -339 -1364
1038 -1364 43 868 -148 -314 693 1060 81 11 924 1028 -299 -511 727 1 -1112 -631 311 -19
1056 -19 -1142 -661 532 -66 -1128 214 1081 103 -208 886 1207 -215 -124 835 897 -663 -215 599 45
1075 45 -1164 -441 99 -472 -1134 -284 326 -356 -492 273 839 -171 -123 1102 661 -184 -200 792 466 -805
1095 -805 -594 809 -14 -1168 -478 413 -638 -1385 33 437 -594 -745 734 732 -261 -186 957 986 -195
1114 -195 -146 830 119 -653 -151 589 -402 -921 -346 461 -162 -894 210 572 -285 -467 852 548 -518
1133 -518 -187 1115 420 -478 303 1499 106 -1136 -9 581 -805 -1051 262 487 -855 -908 797
1150 797 434 -645 31 981 445 -494 175 1151 823 -499 549 900 -353 -737 -88 407 -767 -962
1168 -962 315 91 -826 -459 609 194 -938 108 1003 267 -647 637 980 -58 -556 625 667 -817
1186 -817 -465 188 14 -1193 -357 524 -167 -826 -126 538 -322 -301 672 957 -48 -360 588 531 -278 -206
1206 -206 629 152 -783 -378 363 -270 -1094 -329 303 -359 -793 56 707 -229 -258 827 971 -100 20 881
1226 881 705 -242 -234 659 -66 -945 -607 -147 -556 -813 -245 -140 -522 -400 282 483 110 260 582 703 -52
1247 -52 15 845 170 -509 -117 305 -300 -879 -201 232 -539 -703 68 549 -567 -429 610 478 -34 -43 899
1268 899 656 -60 292 726 368 -494 13 199 -352 -704 -195 55 -508 -675 31 479 -514 -53 375 470
1288 470 22 -58 653 421 -216 117 651 -134 -555 -266 268 -535 -509 -166 15 -592 -405 316 -20 -551 -175
1309 -175 542 -62 -127 256 584 177 -40 547 537 -44 -382 102 -13 -293 -627 78 73 -856 -371 303 32
1330 32 -519 14 597 229 -29 453 851 -83 -44 362 359 -352 -310 224 81 -531 -518 142 -428 -653 -438 138
1352 138 -112 -128 204 164 203 100 451 680 249 -325 276 235 -304 -96 -117 -328 -656 -346 50 -258 -555 -121
1374 -121 243 0 -218 365 648 -28 60 383 227 -133 5 567 -21 -456 -294 5 -84 -464 -336 -136 -323
1395 -323 -498 158 186 203 -95 366 740 81 59 572 461 224 -73 329 81 -589 -154 -4 -495 -637 101
1416 101 -233 -448 -239 189 191 62 -1 549 364 -117 440 458 50 -215 119 31 -111 -267 -228 37 -583 -422
1438 -422 137 -149 -334 57 316 335 128 -211 637 52 183 313 325 210 -40 -87 316 -18 -260 185 -121
1459 -121 -454 -259 -223 -291 -399 185 177 19 -156 361 84 362 125 199 269 -107 -266 111 -192 -289 40 -216
1481 -216 -54 -450 -136 -88 -1 -377 -57 81 220 168 295 563 -10 399 70 324 -61 29 197 -197 -251 -306
1503 -306 -149 -280 -89 -187 112 3 -75 -244 48 230 318 192 475 98 204 139 167 -27 -157 28 -135 -358
1525 -358 -210 -202 -459 -280 -15 33 -52 -57 205 344 83 239 320 321 179 -110 -144 105 -110 -262 -365 -281 -82 97
1549 97 -203 -264 -314 -307 33 -155 -362 -130 353 133 174 150 122 -187 58 3 429 -207 -134 210 -9 -213 -178 107
1573 107 -319 -262 -50 -132 104 -141 198 168 65 243 340 266 140 -12 -64 -255 -78 -76 -27 -154 -408 -290 -227
1596 -227 -399 -204 -61 -117 -45 206 284 116 178 94 98 -43 241 162 -10 -176 -79 131 158 -130 -238 -288 -241 -104
1620 -104 97 12 69 126 336 -43 369 235 80 257 261 155 128 -16 -199 -186 -122 -216 -187 -281 -189 -282 5 -119
1644 -119 145 290 -389 103 66 336 191 303 333 63 18 268 -176 -73 -343 -320 -352 -99 -224 54 -130 -106
1666 -106 -290 9 87 268 213 283 213 314 111 -74 -58 133 77 -248 -176 20 -170 -185 -250 -102 -297 18 101
1689 101 54 265 164 24 -134 246 59 165 -55 -48 -291 -11 -148 -305 111 -125 -217 -157 26 45 -216 -32
1711 -32 9 -154 -96 226 308 47 187 -4 125 269 65 68 -109 -61 145 -148 -164 -249 -284 -46 -43 -6 381 -121
1735 -121 137 261 345 315 -24 198 190 216 186 181 78 -100 -267 -154 -199 -181 -349 -9 -37 -511 -179 -15 -8 -28 301
1760 301 536 183 -104 -84 135 -427 -3 -31 107 -198 -531 -36 -153 -297 -151 -31 -227 -115 241 -138 51
1781 51 256 275 260 53 407 533 240 -50 32 144 44 -87 -39 44 -139 -408 -70 -140 12 -76 -162 26 7
1804 7 -15 246 22 -50 189 87 -113 -130 -126 92 -55 -415 -160 -153 -131 -199 -170 192 -48 -212 380 246 167 -10
1828 -10 195 142 48 241 191 165 32 113 -219 -93 19 -69 -496 -130 -279 60 -196 148 -123 180 23 149
1850 149 -48 263 444 272 120 -44 75 -92 265 209 -125 -435 -43 -430 -531 -236 -4 -34 -190 -142 385
1871 385 -33 -84 340 175 48 -158 314 -31 35 -309 -15 -23 -274 -28 117 -238 -52 -71 34 256 -23 136
1893 136 -1 -14 126 72 267 209 75 18 118 -156 -206 20 -253 -361 -236 -264 62 -131 34 476 193 -91
1915 -91 6 31 77 248 29 134 182 135 144 26 -186 -75 -114 -399 -72 -202 -209 105 62 62 218 -115 298 -42 -78
1940 -78 123 32 385 304 -315 -77 104 -7 -185 -172 -80 99 -300 -68 6 -292 124 -218 45 55 102 121 306
1963 306 509 189 26 78 49 117 -166 -2 -230 -506 164 -100 12 29 -246 -118 -63 232 -99 143 149 242 -124
1986 -124 176 267 126 167 -367 20 -14 -269 -98 -229 -161 -238 -188 -324 37 -279 -144 -70 310 -173 96 401
2008 401 -3 50 -78 175 -266 -13 -158 -207 -283 29 -44 -163 -233 160 -18 62 -249 65 -257 194 246 148 -300
2031 -300 53 -244 240 360 -273 112 -243 -329 -138 -164 -134 90 -27 -152 -109 126 20 -7 196 185 -91 -97 352
2054 352 72 -29 90 -194 -204 28 -49 -290 -308 -58 142 -117 -419 -130 111 53 347 149 110 -12 -243 389
2076 389 60 72 185 175 -121 10 -8 -20 -201 -98 136 -96 -149 -245 -150 104 -369 232 218 138 210 -18 160
2099 160 47 -150 -302 175 120 -103 -82 19 93 -270 -246 -279 142 -21 14 138 268 163 327 471 121 182
2121 182 130 -14 -233 270 -4 -157 -218 -3 25 -82 -72 -210 250 84 63 153 98 -268 39 -37 90 -88 -67
2144 -67 -23 -307 61 -1 -105 199 1 128 -96 -307 -159 -43 -217 25 -206 31 -84 -40 272 -30 -47 4
2166 4 44 65 95 -20 -220 -203 -76 -185 -53 -296 -222 -55 106 -16 -225 -7 23 -135 -36 -1 341 180 46
2189 46 149 -78 -156 173 96 215 -91 3 -163 2 -297 113 14 -333 -291 94 74 72 140 64 347 345 119 143 149
2214 149 282 16 -136 -19 -98 -80 -51 -205 -114 -187 -129 -296 -37 -238 88 -112 5 -75 167 -153 121 57 85
2237 85 195 11 -66 -32 -141 12 27 -374 -147 -111 -332 -66 75 -187 86 -78 94 -3 301 86 -66 55
2259 55 104 -213 151 -95 129 4 -47 -217 -308 149 76 -70 103 60 247 172 -10 -71 328 -44 46 169 49
2282 49 -90 -232 145 -168 -197 -267 68 -188 68 -495 -112 -36 -96 -265 -65 -25 8 301 262 -89 -70 -4 157
2305 157 -5 -17 -143 -138 -296 -34 -91 -245 124 -141 17 62 -167 240 109 -116 -123 106 295 374 -43 162 98
2328 98 84 -43 108 114 -125 -256 -249 4 10 -92 123 178 11 84 103 126 -21 138 -120 11 -127 44 363 20
2352 20 9 -73 -416 -350 -162 -28 -124 -146 -135 61 -1 181 314 250 110 -206 -57 52 -2 -75 108 58 -244 7
2376 7 84 -385 -309 -213 -113 131 72 61 26 32 -152 479 61 266 -110 -165 169 134 160 50 95 -280 -204 -230 -5
2401 -5 -131 -143 95 -105 -190 81 124 159 49 41 131 128 102 3 -189 325 -11 4 -175 -10 79 -281 -111 -126 -256
2426 -256 53 5 54 -67 121 103 -12 -24 87 464 -102 141 -34 -117 2 116 -169 -313 32 148 -116 -55
2448 -55 -101 -193 239 -15 109 49 -24 -1 -48 -73 283 282 181 -47 58 98 -49 291 -109 -1 -338 -49 101 -43
2472 -43 69 -152 15 185 197 49 -90 -284 170 110 -207 87 -192 26 51 -53 210 47 -316 26 -122
2493 -122 -127 -93 -26 -164 368 -13 82 32 -55 21 -211 126 -25 -47 -249 -189 197 -225 31 79 -44 -94 -118 -180 -134
2518 -134 -134 -211 -17 -96 -1 8 -42 35 -60 -229 3 159 38 -173 158 -158 -23 -66 79 -20 -252 -12 90 340
2542 340 -66 -204 -84 39 -69 16 -21 268 11 16 -230 -12 -16 -502 137 -5 -6 -223 -45 111 69 215 -129
2565 -129 -79 20 201 286 -193 -221 65 -255 -132 255 -67 -81 -98 35 9 -119 123 -107 -9 60 53 -1 -37 225
2589 225 291 58 141 -78 -418 188 220 -121 -28 -194 -115 49 -48 -76 -131 -375 -287 -114 -50 1 255 19 51 248
2613 248 183 52 213 142 153 -272 45 -251 35 137 -139 -217 140 -407 156 -86 -16 -157 -258 70 116 -202
2635 -202 171 -168 -44 135 -7 -146 -115 323 80 -298 51 58 73 -117 -362 -192 -66 218 -200 -129 -77 311
2657 311 72 34 -6 172 143 137 0 99 147 -150 -77 -231 -570 -33 37 -119 -54 -75 -398 -207 -299 181 174 234 153
2682 153 35 15 184 -104 98 95 51 -30 86 -252 -199 -202 -123 68 -104 -98 -279 -10 241 20 5 143 72 -147
2706 -147 49 152 166 -32 -213 154 17 146 -66 -190 -53 116 -298 95 -8 105 -99 -21 59 -87 109
2727 109 264 -67 -275 74 66 -231 -302 -63 126 -56 -57 -118 -59 23 -146 -97 129 -254 -9 164 -48 124 54
2750 54 223 245 204 -181 -48 -95 1 -23 82 -224 -241 72 -199 -9 -141 -81 76 -96 139 344 -148 26 368
2773 368 178 151 143 -26 180 137 57 -152 -8 -18 70 175 32 -56 26 -43 63 -22 254 -15 63 171 -20 145
2797 145 85 -16 83 -1 256 133 -7 -223 -83 -84 -62 103 164 234 -113 -73 -77 -98 -165 41 269 34 0 -183 69
2822 69 70 -61 -154 -53 11 107 -128 -379 -28 -242 -31 -85 -183 -38 224 438 125 134 -98 -52 224 -79 -96 -108
2846 -108 -206 -86 -143 189 -68 -11 -326 -142 103 125 24 66 151 19 11 60 -23 -22 187 -108 -109 51 -24 -36 -16 -62
2872 -62 11 160 -15 -17 91 -27 209 75 61 -11 18 -9 89 152 287 325 34 -71 -255 59 -254 -194 -29 2
2896 2 -103 -130 -108 -106 -12 -100 81 382 -9 49 10 208 163 -36 72 -125 92 65 39 52 -3 -214 -126 -111 -36 -18
2922 -18 153 -147 -109 207 75 -18 -106 171 -106 353 303 -1 2 -155 -111 108 -102 -90 -21 25 29 104 -318 24 89
2947 89 15 338 347 57 6 96 -27 -68 -84 -161 34 51 57 -271 -3 314 -7 -7 -88 -266 -115 45 157 -327 340
2972 340 195 225 41 -120 -37 -194 74 49 41 62 -129 299 -67 -16 78 -74 35 83 -155 -90 -71 31 277 391
2996 391 94 226 190 128 97 220 -150 -52 -193 -103 -133 -56 148 82 -79 -279 -206 -72 -79 176 -35 160 75 39
3020 39 -31 -78 110 -208 -177 -161 34 -79 176 -88 -33 -125 -380 88 73 -134 146 159 130 -16 -4 111 -15 -84
3044 -84 101 6 -272 -105 67 -71 -96 -233 31 7 -167 53 -165 -254 72 65 -27 196 158 -10 -247 -1 -23
3067 -23 -17 -135 -114 -179 -190 -162 -2 -121 191 141 56 71 134 232 69 106 -21 105 259 -101 258 48 -41 -161 -181
3092 -181 -55 -137 -281 281 28 -489 -43 -99 164 267 39 72 -80 97 111 56 -173 222 298 189 38 -193
3114 -193 -105 275 106 -300 142 -326 156 378 -78 11 48 266 30 -194 102 59 252 186 34 70 -169 -15
3136 -15 33 2 -53 226 11 -24 -237 7 40 107 144 22 -155 63 118 115 136 100 20 1 67 -72 274 76 127 -12
3162 -12 -267 33 66 -66 -56 187 173 -237 -18 -101 138 43 -85 80 -11 115 45 57 -3 -230 -130 153 -42
3185 -42 -29 -413 -7 -6 -97 107 103 -260 76 -7 -142 103 54 154 128 -90 -46 105 232 144 -162 182 106 -10
3209 -10 -149 264 -147 105 227 -6 114 189 -101 151 -155 45 -184 173 -410 68 333 122 -23 128 35
3230 35 -304 -29 76 91 86 29 346 66 -26 -90 -82 107 -74 -39 71 72 185 41 -50 -336 -57 -144 -573 153 -230
3255 -230 -67 43 -153 202 95 60 186 -67 86 18 535 89 94 31 26 -25 55 -99 -108 -32 118 74 -140 35
3279 35 355 -72 41 -228 -5 199 -59 130 22 140 -131 273 9 17 10 -154 -140 -48 -13 29 129 -152 60
3302 60 48 -74 207 34 5 166 74 231 -101 -69 -144 -73 0 -113 43 -103 -100 -314 10 -140 106 214 -193
3325 -193 -298 212 -53 -10 46 -37 99 16 95 157 158 46 70 153 7 76 -183 -34 -249 -60 -47 31 -222 -126 -118
3350 -118 181 -205 -254 -23 106 8 13 25 26 110 -140 10 -204 4 -19 -93 -139 -39 -23 141 -5 -133 130 -315
3374 -315 52 132 100 60 499 99 43 49 96 49 -100 -151 -15 -163 -14 79 82 -61 103 121 -36 -56 -288 163 117
3399 117 87 7 83 -291 -179 -90 78 93 -51 428 -153 -59 38 -124 10 -395 -256 -133 -63 201 225 -192 82
3422 82 -25 105 -208 -129 92 186 55 -224 172 -190 26 -31 -277 5 185 86 42 -57 104 -227 17 -29 7
3445 7 7 136 19 -126 6 4 53 79 -233 11 -72 -154 -7 -48 77 123 2 168 -92 -52 26 87 3 17 175 15
3471 15 43 157 70 57 253 328 -241 110 -208 -67 -3 -267 46 -48 -271 -250 44 188 184 180 -170 243 94 -120
3495 -120 -169 -98 -51 -41 -105 113 -59 16 -120 3 24 25 90 -164 22 -117 225 12 -208 13 28 -46 139 -126
3519 -126 50 138 146 7 -205 -8 -8 57 -53 198 7 -36 -286 200 0 -268 239 9 39 87 16 -82 74 207
3543 207 -60 211 -98 243 -222 -36 124 76 44 -65 -81 123 -135 -76 358 34 -95 -48 74 159 -178 -213
3565 -213 -254 57 17 -94 -18 161 -22 120 140 224 147 -60 531 -120 99 -24 -107 23 -192 -127 6 76 -176
3588 -176 -332 69 226 99 37 -148 -214 43 42 110 222 79 -151 -292 15 228 43 -155 161 -152 -215 360
3610 360 79 -31 50 -31 -259 -18 -124 -47 -367 -199 -72 -96 -148 -103 112 -68 22 -482 173 132 205 80 -124
3633 -124 23 -291 151 -3 -294 -152 -22 -111 29 479 111 83 129 110 -34 -3 86 -2 -187 247 -136 -26
3655 -26 -88 69 80 9 198 -282 35 60 90 68 303 -12 -128 135 141 22 -66 122 -18 -14 -180 87 106 -251
3679 -251 -107 202 131 88 60 46 8 48 382 104 -57 -141 -260 -88 -238 -39 9 117 -141 -219 -65 -10 -93 141
3703 141 128 -4 140 167 134 171 26 183 -97 74 -123 159 -336 143 -136 -92 -66 -73 116 64 -190 -13 -31
3726 -31 33 -153 -83 110 -52 132 -84 -45 235 219 -374 -120 20 116 106 -93 -169 -247 -125 -86 273 -138 99
3749 99 75 90 106 -391 316 -161 -249 75 87 166 321 195 20 148 -13 55 -65 111 39 -69 -121 -215 107 -451
3773 -451 5 78 69 14 -205 161 -57 -46 -82 -183 -53 18 303 -41 -231 42 -120 -74 -87 -313 124 -171 -132
3796 -132 -36 59 -151 -32 58 -177 161 157 42 -75 -206 -17 67 -92 -137 -67 91 119 -92 11 -33 112 -83
3819 -83 133 -181 -29 -103 192 -48 -2 154 -87 -37 29 -19 -283 -107 -22 -47 -72 28 -192 -83 281 267 -200
3842 -200 -191 -42 -111 67 94 39 -54 7 -204 107 24 14 -92 -81 99 -126 64 -123 39 205 -226 132 222 -32
3866 -32 -98 28 42 185 44 -311 -12 101 69 -253 84 -4 -61 10 -71 64 27 162 -173 27 95 -238 25
3889 25 94 11 278 -31 -116 -202 -12 149 211 79 51 132 -37 50 -10 127 161 -143 -70 47 32 -208 -68 -144 -213
3914 -213 167 -56 37 297 53 37 -100 187 -85 134 67 -113 22 180 111 25 -45 176 133 -109 -74 -183 60
3937 60 13 -54 239 82 -154 -157 23 -158 -111 -64 271 -113 -68 -168 118 25 30 104 166 219 -102 -72 -88 9 49 -96
3963 -96 0 134 -29 -265 74 194 -214 -190 125 -30 -78 73 -9 -120 79 -180 -19 -306 -69 3 -185 121
3985 121 26 33 -69 -144 -192 27 5 -183 0 281 -118 108 -45 62 -123 160 9 -395 -90 486 -169 -13
4007 -13 -157 36 54 70 172 -47 -2 -33 88 -43 18 -191 68 239 269 64 201 -145 -156 -84 -114 96 -113
4030 -113 -9 18 -18 132 -74 -73 -39 -41 141 48 355 25 -62 7 -180 69 38 -202 30 183 -11 194 -88 105
4054 105 77 -309 -43 170 126 3 174 -142 15 -75 -74 -29 6 -60 72 -216 -34 -99 154 -149 -62 81 -93
4077 -93 -4 -135 -169 360 -8 58 36 137 -65 -171 -280 -107 357 -12 -68 -44 37 51 74 -129 -217 187 276 80
4101 80 228 -173 -132 -246 -11 -162 -133 -247 118 -118 134 73 -7 -29 245 -89 10 165 34 -158 -235 -87 -150
4124 -150 36 -53 13 -102 -27 191 -264 -87 -474 -131 238 -112 -98 -45 246 -133 81 -119 81 -175 -137 16
4146 16 221 -94 -264 -257 -239 18 105 -94 79 -112 -75 -163 -68 20 -129 52 -88 110 -6 18 317 -63 -141 427
4170 427 119 -82 -116 41 -68 -2 197 -71 76 107 -31 -198 -198 -24 -168 -95 -169 108 199 57 338 218 -124
4193 -124 83 223 -75 4 -96 125 89 -4 17 -83 112 -96 62 -96 132 -91 191 80 53 -87 165 -125
4215 -125 50 268 -167 -51 256 -74 -67 47 -99 -108 -24 44 266 43 -33 34 152 68 34 8 -155 -111 -69 -119 -59
4240 -59 21 52 -52 -63 -290 -190 227 -13 -65 -125 282 -152 48 -277 -187 25 -75 98 -115 171 -205 71
4262 71 76 8 107 -181 13 44 3 46 105 321 -20 66 -26 -85 -189 100 87 -122 518 -50 -41 198 -173 237 143
4287 143 -63 -76 190 45 56 -73 -158 -108 137 12 6 -235 40 194 -174 -7 -45 50 134 122 125 -174 16 19 -179
4312 -179 -253 -22 6 -89 211 -113 -120 -421 -226 42 181 31 -101 -60 232 176 -33 18 -49 -107 111 -169 -183 78
4336 78 158 243 118 -28 9 58 0 9 -85 -143 -130 -110 -135 -152 -192 -111 93 117 2 -27 -121 89 -54 103 152 -33 -95
4363 -95 -101 105 -338 42 97 -248 507 59 -62 -62 20 115 -130 -66 -175 -31 243 28 37 227 -7 20 -225 -82
4387 -82 -134 -35 42 -14 -75 -461 -339 204 -448 9 160 -203 -112 -10 -36 305 354 -482 193 60 56 123 129 -2 -68
4412 -68 7 -373 96 -116 -154 117 -94 13 -100 167 62 -153 135 -13 -55 173 60 -97 195 209 -4 -151
4434 -151 22 -150 -166 -111 -120 138 -73 198 103 -66 -44 -43 -29 75 261 -204 -114 19 -28 58 231 37 -88 222
4458 222 -272 -35 -17 35 -191 153 -247 -7 214 291 42 -120 108 91 -110 -14 84 -264 -90 -165 133 -11
4480 -11 -214 -15 54 -42 278 -65 -63 194 -309 -125 -80 26 -22 0 -313 193 -53 82 -124 9 8 294 -76
4503 -76 -204 -52 -356 -152 -46 78 -150 -90 238 18 19 -199 -144 68 -190 -202 -118 -29 -40 -198 -132 -49 -79 82
4527 82 402 -19 185 170 233 -153 -16 -299 107 3 -40 -2 -83 -106 123 -225 -98 42 373 -11 47 -89 22
4550 22 110 -94 -164 -107 -169 -39 -152 137 87 -116 133 -18 285 -93 -90 -210 142 165 -131 -171 17 118 -11
4573 -11 -52 -117 -76 28 13 62 -1 -241 245 -32 -81 -186 9 15 72 1 -259 -7 -42 -156 -214 13 14 -1 -35 173
4599 173 -11 84 167 -39 210 41 86 126 -213 -111 -149 -7 -177 35 -84 -21 -121 -96 -16 50 66 123 -72 -287
4623 -287 -80 7 -5 50 -67 -115 73 252 15 123 -38 61 -133 -121 -34 18 60 -169 32 -108 -71 -118 36 -109
4647 -109 395 -43 -80 55 -69 64 89 127 -99 -179 -237 -128 -104 110 144 -98 -33 112 31 167 -28 -170 213
4670 213 68 62 282 -135 132 248 75 221 -191 216 126 -140 17 -61 -294 -11 -129 10 -65 -45 -98 131
4692 131 29 -40 -30 36 296 0 211 35 -3 -47 312 -83 -219 -63 59 -410 -118 -19 -112 15 -63 109 -263
4715 -263 180 -140 -113 2 20 -25 44 -19 -29 189 -24 126 -186 53 -73 -21 197 7 -120 29 -148 -252
4737 -252 -40 -84 -4 93 -32 -50 -5 39 -167 41 34 -54 -172 -65 -134 161 -4 6 -204 -34 -20 -163 -54 6
4761 6 -6 -139 3 126 -190 254 92 -40 102 235 112 -297 -4 180 -127 -123 159 172 -103 -66 16 -329 64
4784 64 120 280 258 64 -171 -136 192 18 142 4 -56 65 -3 81 -47 -76 136 -47 -322 109 12 -66 116
4807 116 -225 -143 -189 29 328 136 -186 -182 -81 137 91 17 50 -102 84 -37 101 101 90 -235 -49 4 -33 -91
4831 -91 -45 -54 -158 -213 191 -112 193 -332 -2 -101 133 -34 -48 -27 -91 60 -87 78 351 -17 -24 146 320 -70
4855 -70 119 -117 -58 9 287 209 113 116 -168 -90 175 -32 -2 -98 124 111 -283 200 67 -56 -25 -224 -52 53
4879 53 42 -113 -102 -283 -185 40 290 -71 132 -56 -45 -34 183 62 -124 40 -25 -230 -60 -73 25 26 44 -8
4903 -8 -243 61 2 91 -190 491 -52 -50 -150 -65 121 -223 43 -69 114 27 168 11 17 -44 -260 -77 -261 -16
4927 -16 -108 -370 -201 -96 -238 -128 -113 -254 137 258 -287 -172 32 -168 -89 -231 177 -150 69 -254 -128
4948 -128 133 273 18 63 -33 124 62 124 262 -134 13 -79 86 -199 52 51 -253 11 82 -245 -14 -19 30 4
4972 4 -53 -97 -15 -120 204 -178 -138 -346 -59 13 -146 -14 -20 267 161 -118 -15 -124 25 -27 -20 -23 -293 -108 -67
4997 -67 -176 283 1 -163 182 -37 16 72 84 -94 106 249 57 152 29 106 175 -2 -130 -68 -97 -58 -215
5020 -215 159 -27 -31 -23 -92 -146 118 177 80 75 -136 44 329 -65 -24 99 199 106 -31 -1 -109 202 74 -64
5044 -64 -63 -211 1 -137 -71 105 188 -25 -280 -129 -87 165 -62 -104 114 118 -42 -48 228 204 -298 -113 -157 -151 71
5069 71 -2 83 55 -211 -58 3 -118 140 77 112 215 -112 -101 -190 274 -100 59 487 183 -97 1 -28 163 -2
5093 -2 187 154 83 -7 -42 -40 -69 -29 -174 -26 110 20 -90 -236 -259 76 81 -64 -9 166 -61 147 -373 62 -149
5118 -149 91 41 -94 23 -33 15 -123 340 -119 -84 -68 76 130 91 -183 -97 94 -28 41 -128 100 80 53 24
5142 24 91 157 -103 267 10 -33 3 -202 96 250 -132 -102 -59 -233 330 68 27 51 42 130 -149 -61 62 -87
5166 -87 165 53 -1 110 147 -46 -37 141 -124 207 -227 238 266 -115 82 -174 -156 -15 49 -115 -232 -6 151
5189 151 -151 -50 141 -203 -285 -170 -152 -19 -188 147 146 128 -36 -163 169 190 74 178 -41 -25 -47 74 -282
5212 -282 348 219 -241 -464 -370 -116 57 48 135 -157 134 -63 -146 -64 -132 -120 -297 137 58 -14 294 -269 210
5235 210 -23 162 245 21 104 -37 -102 -212 4 15 80 -374 146 175 195 173 -139 -90 88 -238 -206 22 -174
5258 -174 1 225 43 -13 220 268 73 79 -38 184 -17 -205 184 263 118 191 74 87 -176 -50 -234 -95
5280 -95 103 7 -135 -128 -148 103 -1 -105 -113 -48 52 201 156 -42 292 -30 60 -106 -110 -84 -68 2 149 28 -33
5305 -33 91 87 246 -16 -31 145 -125 27 193 3 228 130 61 -39 166 -68 151 -244 -79 -164 -210 -164 -23
5328 -23 -84 -247 177 -264 -8 -70 -284 -15 -60 -83 50 104 -32 240 201 23 46 -114 165 192 -58 -124 -44 92
5352 92 115 -4 213 -265 -164 -96 -69 35 -106 -65 116 44 -171 -107 -264 -91 -273 -51 -300 -182 -2 9 55
5375 55 88 -31 -41 203 -12 42 -32 -29 -40 -88 22 205 -27 -72 -271 -80 26 -167 -43 -411 135 69 -107 -90
5399 -90 -102 -164 104 -240 -115 -22 15 42 27 86 229 104 253 97 -153 76 91 164 -156 30 -172 -2 144
5422 144 -129 224 -184 -113 -129 28 -110 309 -83 245 283 28 149 159 -197 -63 -36 -172 -147 -38 183 -19
5444 -19 -185 286 -326 224 26 -125 -212 255 -278 1 -61 -271 -96 -53 -161 18 282 162 -241 -240 -217 -137 22
5467 22 75 -212 43 -120 19 256 104 206 -31 87 168 203 -365 149 18 -49 8 -89 -177 -96 108 -39 -43 -48
5491 -48 -116 22 135 12 -71 65 -182 189 119 -43 217 -127 80 351 -133 71 190 109 -36 40 188 -92
5513 -92 -50 272 -66 39 56 167 -223 -304 118 233 -45 -27 -6 2 -204 74 70 -145 181 -40 398 -114 172
5536 172 -31 -19 -60 -20 238 -94 229 140 -130 -185 239 51 -132 107 -70 -215 -51 313 23 -243 20 30
5558 30 90 -114 111 -303 298 -163 160 227 193 27 -244 114 -174 140 -256 -171 -206 187 87 -276 -57 4
5580 4 -10 -48 -167 143 8 -90 -227 245 104 -134 205 -59 -35 2 86 24 13 66 98 -37 -99 109 -119 44
5604 44 148 3 2 -34 121 100 38 36 -60 -45 22 -158 33 66 111 -67 -25 -18 -63 146 -299 105 349 -37 123 73
5630 73 181 -92 -34 165 -103 100 296 -170 -76 217 -65 79 205 220 393 -5 1 24 -77 25 173 -257
5652 -257 -86 122 -48 17 -28 139 -24 -107 36 115 137 -155 -201 17 62 -163 60 -46 66 89 -64 44 21
5675 21 121 281 98 205 -3 264 -248 325 14 158 36 -2 -152 -181 -36 -87 61 5 -38 159 -172 -131
5697 -131 127 11 7 -35 210 -58 -66 -298 -28 -72 62 263 -294 -148 -132 73 -201 -379 -309 -21 -75 -280 76
5720 76 -33 303 -155 -95 -34 367 38 127 109 212 90 -80 -75 80 111 -218 227 -244 -166 156 -237 -115 -217
5743 -217 11 213 46 155 76 86 -140 -24 38 170 -42 -79 108 125 55 -11 -163 54 -33 -114 -122 -169 119 52
5767 52 -84 120 166 -107 -248 -135 51 -148 51 -40 -67 -12 -88 -112 11 82 34 174 -72 -133 -51 -19 64 -152
5791 -152 208 -161 -142 -265 -26 -147 -343 -127 -102 -331 -50 191 -280 -369 -63 -9 -84 -116 -186 -84 106 0
5813 0 -69 2 86 269 -84 14 -106 52 20 164 27 -46 82 -182 -151 46 59 -25 -62 -250 181 -132 142 -39
5837 -39 -280 -98 110 319 103 166 226 -180 -109 -122 -203 107 326 36 -78 201 62 143 124 68 -22 44 -193 214
5861 214 -141 304 181 37 -160 131 -296 -159 105 -13 -384 -85 -34 90 122 103 58 -120 -109 44 191 -66
5883 -66 -48 197 -3 199 -80 14 6 -78 191 18 -95 79 119 1 -136 135 -130 -150 113 -113 -50 7 12 155
5907 155 -42 -292 -18 -292 174 -187 -318 -124 68 101 -124 -132 -68 24 -39 -198 220 171 -159 216 -156 -451
5929 -451 131 -75 -119 -69 -65 114 -267 91 36 -256 309 -25 -28 85 156 -76 -107 -23 90 -105 169 98 25 103
5953 103 -132 -140 -30 -85 -145 131 199 231 20 329 -156 157 -149 -109 -66 86 462 108 -165 149 -83 127 159
5976 159 24 26 -9 -93 -40 134 104 57 166 10 -138 11 31 152 8 30 -9 -41 -321 -207 -296 -176 -325 60
6000 60 -27 69 97 65 -26 -23 86 262 96 9 130 217 183 55 -99 114 234 103 -222 27 -84 -65 -26 46 -252
6025 -252 7 -207 -248 -73 -263 -221 -332 -105 -20 81 206 -1 -79 -296 -137 53 32 22 -87 76 -4 -87 -268
6048 -268 64 -195 273 62 20 88 -170 232 -165 -99 -109 -12 -205 130 220 -16 -18 -100 -201 165 119 80 15 -3
6072 -3 177 327 -27 23 118 -106 365 -79 141 103 316 34 -30 231 -160 -4 276 -90 51 -23 197 164 63
6095 63 -79 -188 -94 -48 69 -70 19 189 -20 221 271 24 -183 79 147 33 -8 131 196 -124 -36 -381 27
6118 27 109 219 -13 -203 -228 -78 105 -109 -75 -113 98 5 170 45 303 124 12 149 139 1 -352 -45
6140 -45 -63 -123 -49 65 -103 16 -17 -97 57 -2 128 177 80 -297 238 128 80 -163 128 -285 77 -33 115
6163 115 -126 -111 -108 199 -54 -22 -88 76 340 138 243 91 101 -40 88 -154 -43 140 96 18 63 -118 14
6186 14 82 -84 120 -285 -130 -122 178 -172 -131 -146 -21 -18 46 -49 -36 116 27 146 -113 -37 -185 -120 24 44 79
6211 79 26 241 19 103 -255 -67 42 28 -69 45 -134 65 -80 -62 -97 -322 47 -56 -167 184 -190 -199 -76
6234 -76 29 -241 75 31 57 182 -349 66 28 -25 -125 -135 35 140 135 -41 -126 -154 303 241 189 102 -123 145
6258 145 -43 -255 -23 65 -19 101 204 -106 -77 -112 -34 -31 151 -88 -44 -40 -29 11 -295 -110 68 176 270 175 -54
6283 -54 21 22 33 -8 -319 -141 -272 216 177 11 321 90 90 206 61 -228 22 -214 90 -71 -146 27 53 -248
6307 -248 -199 -117 24 -90 213 -1 -218 -261 -146 -232 -111 -206 -107 284 44 -78 -9 56 -30 -198 27 -13 -175
6330 -175 -73 -207 31 -356 -70 -2 -207 -169 113 82 -113 -19 -322 -141 239 62 -84 -150 36 129 199 221 4
6353 4 35 -7 -205 -126 281 -53 225 -218 113 -105 -315 33 -60 142 -341 -214 -91 -325 -220 131 108 -110
6375 -110 -124 403 -7 342 -81 137 154 62 40 -193 331 -74 287 1 63 192 -45 195 234 11 145 115
6397 115 -84 -45 -2 327 33 128 47 -50 -25 -228 51 -36 -8 -98 196 -97 -3 39 -192 -67 41 -67 79 -130
6421 -130 -89 132 43 71 -287 -72 -99 75 -34 -9 215 182 126 42 223 -58 -78 118 91 -53 -135 4 157 108
6445 108 155 -14 -51 261 161 -117 -140 -145 4 -62 129 116 75 54 13 87 14 -96 -116 -203 43 250 -131 205 -104
6470 -104 -103 291 101 -61 -27 167 229 20 167 -20 201 147 77 -19 182 297 -30 514 88 -59 -159 56
6492 56 11 -127 302 37 110 24 160 162 -2 -12 -55 118 -137 -38 8 35 -36 -72 -137 10 25 -148 -159 241 102
6517 102 -35 69 -124 -5 -25 82 -33 -82 -10 -388 5 38 45 -238 257 -81 -86 36 45 76 365 -136 -27 -206
6541 -206 207 132 104 122 24 113 97 84 -15 -159 -65 -48 -286 -220 18 -347 104 121 -78 -136 -144 124 -206 183 133
6566 133 256 -71 158 169 -155 50 123 -227 201 -10 257 -109 -2 -44 122 -157 -44 25 169 -142 -223 173
6588 173 20 600 121 -112 -94 -168 -250 -79 -282 436 -133 -277 -179 -130 -65 -266 46 180 -173 -22 381 -89
6610 -89 117 -193 -64 -193 -30 184 111 192 45 -163 -72 247 62 99 59 -81 25 74 1 52 -65 -366 -185
6633 -185 181 -168 -49 -150 -170 48 66 50 42 -53 -123 -41 27 251 108 173 253 40 -135 -88 -43 121 -117 -111 -66
6658 -66 -152 -16 125 -39 -73 183 -57 40 73 -169 -3 -34 -11 -233 199 -152 -185 140 22 224 244 -145 66
6681 66 155 111 341 -247 208 54 -102 56 168 70 93 -63 44 52 250 135 269 -204 -102 -13 163 -43 0
6704 0 -149 -120 147 89 182 -71 -75 203 -218 -29 303 -3 -225 -169 -97 101 0 155 -68 -84 69 18 -34 -100
6728 -100 -19 8 -275 2 -160 186 10 -64 -41 -58 -261 -151 255 115 151 62 2 31 212 -129 43 55 -89
6751 -89 -261 -42 -43 -157 1 93 191 -23 -117 66 435 -7 109 28 23 -23 27 7 144 48 -91 289 128 -92
6775 -92 -80 3 77 107 43 -15 0 -134 335 12 -197 76 -143 -215 -73 -165 -136 179 -356 -239 91 39 155 -153
6799 -153 231 -358 123 159 81 52 285 62 81 34 4 107 -46 69 -10 -65 -153 83 130 114 -102 234 -147 56
6823 56 -255 -204 -33 -102 -139 -21 -162 -304 -81 100 -231 -98 196 -14 60 151 77 -149 229 192 183 -132 -34 -60
6847 -60 -153 134 -233 57 36 -92 69 301 23 -186 45 129 -42 -87 -143 -63 198 209 28 76 -100 54 195
6870 195 -87 -264 60 -49 -243 70 -95 -6 26 -401 -99 -37 -19 -208 -167 -44 -128 171 64 56 -30 -11 -79 -183
6894 -183 144 -6 29 361 142 101 251 -68 -285 -16 -233 -14 108 56 -98 -247 -200 147 -183 239 -57
6915 -57 -88 101 -163 -76 -256 79 -101 173 71 103 267 -98 102 305 22 20 191 -205 221 -17 148 90
6937 90 -180 -110 164 -168 195 123 -4 127 -257 -91 -68 5 119 -43 -41 167 2 135 92 79 129 -142 280
6960 280 105 21 183 -80 185 164 -201 40 -164 93 -83 180 -147 -82 -212 -56 -100 -131 56 -305 -10 -324
6982 -324 68 127 -20 -127 15 134 47 -196 -35 -156 -199 48 113 -13 -76 10 -17 -237 265 190 103 262 -287
7005 -287 132 -39 84 247 -186 -11 280 -93 -109 -36 50 -113 -81 39 128 37 -75 -109 -66 81 92 -279 -184
7028 -184 228 130 -107 -107 -68 -42 23 -98 11 171 281 -70 -173 10 1 -38 56 85 218 59 -53 -162 143 -63
7052 -63 -124 -44 7 86 283 -40 314 218 12 -48 -183 143 243 39 -64 176 67 130 -220 -137 -52 200 204 -43
7076 -43 -45 -61 148 -242 146 89 141 -70 -110 84 71 22 23 165 -122 -163 -49 248 99 16 32 -103 -81 -145 -207 -104
7102 -104 -67 -177 209 -2 151 -45 -346 113 -19 31 -64 -172 -7 -66 -39 143 3 -33 65 -30 232 -229 -178
7125 -178 -8 -88 145 -191 -40 -116 -234 -143 15 -233 86 -97 -13 312 -338 13 213 -157 195 -182 90
7146 90 -135 12 -5 109 -176 -7 113 249 146 83 127 -205 258 -75 281 -252 135 -51 93 112 215 -41
7168 -41 -271 24 -175 -59 -116 -86 113 126 198 178 164 29 -93 55 124 13 -76 -169 10 18 -191 92 -193 161
7192 161 188 -145 12 -8 -237 60 133 20 -146 -158 -39 51 114 -42 -134 62 46 3 313 107 307 88 -11
7215 -11 125 70 -81 191 106 -19 -22 90 -24 -154 -189 -109 -96 89 218 -2 -51 118 -87 -340 -176 67 28
7238 28 -84 120 1 -124 -120 -27 170 181 39 -74 -57 154 -47 216 -109 -94 -30 -89 29 -54 195 40 -31 132
7262 132 -76 -387 -214 107 25 -78 244 -277 -144 399 -14 20 -143 -137 30 -14 291 -236 -35 237 -37 -152
7284 -152 -133 148 -55 -25 -87 74 23 -280 -19 138 -172 -179 -139 36 -54 1 -224 -124 81 -198 -266 -59 -118 -93
7308 -93 -23 364 14 -12 -102 34 59 156 -49 291 -343 -1 -61 86 -61 56 -103 -86 -92 -8 -231 138 73 22
7332 22 -182 90 166 143 23 -106 -13 -55 -236 -115 119 -119 10 41 10 -2 56 -116 8 -146 -118 -80 177 107
7356 107 18 -255 -104 -40 292 -155 327 -19 -62 37 -213 -226 -66 149 1 32 -4 -33 24 114 -87 -130 -201 -216
7380 -216 291 19 -48 -1 28 -363 84 82 34 125 125 -138 -16 24 -17 -35 142 25 203 147 356 130 25 -104
7404 -104 -79 -117 190 -126 -169 -340 -204 14 -87 -52 -238 -84 -29 -45 88 -29 -103 132 -26 62 145 -4 -152
7427 -152 15 -255 188 91 -146 14 327 -162 -117 -47 -127 106 6 -10 145 -134 -18 100 -350 121 282 -57
7449 -57 -98 203 -122 112 9 -191 -228 1 -152 -226 -82 -37 -104 -37 -45 -76 78 200 -172 -158 -295 279 31 -15
7473 -15 152 -34 -31 -50 -597 5 -48 -78 30 -20 -224 -73 315 107 -175 15 231 -169 -298 254 126 -190
7495 -190 240 89 66 23 -136 -470 19 -13 102 79 110 188 152 140 -215 -344 -72 -97 18 -320 -6 393 297
7518 297 57 214 245 -142 -127 23 -235 -196 25 20 -74 71 -142 -52 180 -34 89 -216 -299 13 -185 128 -112
7541 -112 86 -213 -129 -25 271 -86 161 60 -194 -119 -95 -160 -33 96 -35 -61 185 204 345 272 -19 -21 -66
7564 -66 85 12 86 -174 -119 -184 -28 -339 -79 -161 -173 246 175 -110 -144 25 72 -174 -311 132 -252 -3 62 -28
7588 -28 -131 185 138 -112 -46 114 -56 102 16 46 -110 46 -19 346 -16 -285 48 222 -228 37 -29 -23 178
7611 178 -220 -15 -169 -97 145 -17 -48 -43 76 -323 117 -92 34 -93 19 6 89 -50 -66 77 -149 -56 76
7634 76 136 -111 -138 -23 -87 -35 -135 -83 27 165 215 -188 325 91 6 -4 357 97 52 -39 49 -6 -17 -68 -132
7659 -132 34 -127 -293 3 113 39 19 -83 -112 26 -100 312 -97 -125 143 -77 57 -78 27 -29 -164 -271
7681 -271 -42 59 -225 -87 -19 114 100 242 262 125 -136 14 -245 -4 142 7 205 -33 215 -87 -86 -185
7703 -185 -61 -6 24 130 -225 124 16 50 -245 10 266 121 35 104 29 60 -151 -70 228 199 -9 -56 -21 -224
7727 -224 31 27 187 148 110 -32 134 124 -289 5 303 106 -103 53 -109 -66 -35 -17 -22 138 -96 26 -58 -165
7751 -165 67 6 -110 354 -199 107 79 32 33 -7 35 -74 37 105 48 -217 144 27 84 -93 -90 -243 -28 47
7775 47 -136 -130 -140 93 231 -21 51 226 127 162 47 -156 -105 113 -460 -142 23 -230 -79 76 141 -111 -170
7798 -170 65 258 -147 -117 297 -13 52 125 -92 47 410 -124 -31 161 -21 193 21 41 182 139 197 20
7820 20 -66 -53 46 101 -5 49 218 186 106 -5 260 -4 77 -110 74 -165 -48 -252 -186 112 -174 -69 -63 10
7844 10 -18 172 -150 -113 100 61 -199 -29 -77 65 112 132 168 189 97 154 -64 87 87 -115 41 -337 -92 41
7868 41 33 139 -68 103 26 -179 -122 46 -19 -226 221 226 20 26 -139 -26 114 -187 -80 -321 -80 12 218 -152
7892 -152 -14 -153 -39 57 -246 44 315 9 -4 -133 -172 85 -202 -55 79 -145 -77 44 -97 45 163
7913 163 -50 -20 148 -84 40 -165 3 50 -30 38 81 74 -232 44 99 37 231 -85 119 -164 34 -34 125
7936 125 53 -59 42 59 -45 119 132 20 -152 -182 329 168 58 -160 35 -191 -59 -2 -207 50 242 -32
7958 -32 5 -121 147 116 339 -55 -83 76 -44 -70 70 -53 23 155 172 64 -135 52 88 -243 -43 63 129
7981 129 111 45 98 -85 18 347 -83 310 -184 -115 -5 198 224 58 -17 -86 47 -118 192 256 135 -110 -150
8004 -150 131 41 16 181 -111 -69 13 -99 -68 -83 -218 40 46 196 -126 96 -169 63 105 31 137 157 -59 -92
8028 -92 -218 117 49 94 -424 71 84 62 59 -29 -112 -28 2 -117 -16 -109 -5 -19 240 -130 -208 4 296 -203 -218
8053 -218 -47 -62 -113 -124 -21 -48 -73 79 66 -265 363 34 235 -135 180 -9 0 -17 61 -73 -56 -24 -155 -22
8077 -22 -310 -439 -95 -27 -61 -65 59 -179 70 -13 -165 -16 -300 -36 143 -160 -229 -43 -36 9 -218 162 19
8100 19 119 7 15 -23 -108 -107 -16 -283 90 -11 67 7 14 90 -117 157 127 60 64 77 -36 117 194 -34 -172 -13
8126 -13 141 -77 -25 -252 -123 72 193 -52 236 123 242 -137 180 -53 -58 77 -195 15 66 -38 38 153
8148 153 -5 4 -84 44 -77 -22 -115 -184 21 73 -193 20 -20 49 249 161 81 -87 104 -25 146 -48 -271 -178
8172 -178 -182 -175 -37 -309 -9 -37 238 337 82 -97 -10 -23 77 53 56 -128 72 -138 -95
8191i5
##END NTUPLES=NMR FID
##END=
