##TITLE=1H_LR-784-R3-CR9
 200.13MHz, CDCl3,
 8 sc
 
 3.2.2025
##JCAMPDX= 6.0         $$ Bruker NMR JCAMP-DX V2.0
##DATA TYPE= NMR FID
##DATA CLASS= NTUPLES
##ORIGIN= UXNMR, Bruker Analytische Messtechnik GmbH
##OWNER= pz
$$ XWIN-NMR		Version 3.5
$$ Mon Feb  3 18:03:06 2025 Russian Standard Time (UT+4h)  she@DPX200
##.OBSERVE FREQUENCY= 200.1313
##.OBSERVE NUCLEUS= ^1H
##.DELAY= (6, 6)
##.ACQUISITION MODE= SIMULTANEOUS
##.ACQUISITION SCHEME= undefined
##.AVERAGES= 8
##.DIGITISER RES= 18
##SPECTROMETER/DATA SYSTEM= spect
##.PULSE SEQUENCE= zg30
##.SOLVENT NAME= CDCl3
##.SHIFT REFERENCE= (INTERNAL, CDCl3, 0, 14.3821)
##AUDIT TRAIL= $$ (NUMBER, WHEN, WHO, WHERE, WHAT)
$$ ##TITLE= Audit trail, XWIN-NMR		Version 3.5
$$ ##JCAMPDX= 5.01
$$ ##ORIGIN= Bruker BioSpin GmbH
$$ ##OWNER= she
$$ F:/spectra/data/she/nmr/H-C/1/audita.txt
$$ ##AUDIT TRAIL=  $$ (NUMBER, WHEN, WHO, WHERE, WHAT)
(   1,<2025-02-03 18:01:42.96 +0400>,<she>,<DPX200>,
      <created by zg, POWCHK disabled, PULCHK disabled
       configuration hash MD5:
       00 E9 B6 7A A2 85 ED C7 34 08 36 98 17 FE 4E 26
       data hash MD5: 16K
       5F 40 7A BE 81 25 21 D9 DE 78 E9 08 71 2D 25 8E>)
$$ ##END=
$$ 
$$ hash MD5
$$ 66 53 F1 DE 92 A6 37 29 AF B8 9C 23 DE C6 BC EE
##$RELAX= 
##$RELAX= 
##$RELAX= 
##$RELAX= 
##$RELAX= 
##$RELAX= 
$$ Bruker specific parameters
$$ --------------------------
##$DU= <F:/spectra>
##$EXPNO= 1
##$NAME= <H-C>
##$PROCNO= 1
##$TYPE= <nmr>
##$USER= <she>
##$AMP= (0..31)
100 100 100 100 100 100 100 100 100 100 100 100 100 100 100 100 100 100 
100 100 100 100 100 100 100 100 100 100 100 100 100 100 
##$AQSEQ= 0
##$AQ_mod= 1
##$AUNM= <au_zg>
##$AUTOPOS= <>
##$BF1= 200.13
##$BF2= 200.13
##$BF3= 200.13
##$BF4= 200.13
##$BF5= 200.13
##$BF6= 200.13
##$BF7= 200.13
##$BF8= 200.13
##$BYTORDA= 1
##$CFDGTYP= 0
##$CFRGTYP= 5
##$CHEMSTR= <none>
##$CNST= (0..31)
1 1 145 1 1 1 1 1 1 1 1 1 1 1 1 1 1 1 1 1 1 1 1 1 1 1 1 1 1 1 1 1 
##$CPDPRG= <>
##$CPDPRG1= <>
##$CPDPRG2= <>
##$CPDPRG3= <>
##$CPDPRG4= <mlev>
##$CPDPRG5= <mlev>
##$CPDPRG6= <mlev>
##$CPDPRG7= <mlev>
##$CPDPRG8= <mlev>
##$CPDPRGB= <>
##$CPDPRGT= <>
##$D= (0..31)
0 0.7 0 0 0 0 0 0 0 0 0 0.03 0 0 0 0 0 0 0 0 0 0 0 0 0 0 0 0 0 0 0 0 
##$DATE= 1738591302
##$DBL= (0..7)
120 120 120 120 120 120 120 120 
##$DBP= (0..7)
150 150 150 150 150 150 150 150 
##$DBP07= 0
##$DBPNAM0= <>
##$DBPNAM1= <>
##$DBPNAM2= <>
##$DBPNAM3= <>
##$DBPNAM4= <>
##$DBPNAM5= <>
##$DBPNAM6= <>
##$DBPNAM7= <>
##$DBPOAL= (0..7)
0.5 0.5 0.5 0.5 0.5 0.5 0.5 0.5 
##$DBPOFFS= (0..7)
0 0 0 0 0 0 0 0 
##$DE= 6
##$DECBNUC= <off>
##$DECIM= 32
##$DECNUC= <off>
##$DECSTAT= 4
##$DIGMOD= 1
##$DIGTYP= 9
##$DL= (0..7)
0 120 120 120 120 120 120 120 
##$DP= (0..7)
150 150 150 150 150 150 150 150 
##$DP07= 0
##$DPNAME0= <>
##$DPNAME1= <>
##$DPNAME2= <>
##$DPNAME3= <>
##$DPNAME4= <>
##$DPNAME5= <>
##$DPNAME6= <>
##$DPNAME7= <>
##$DPOAL= (0..7)
0.5 0.5 0.5 0.5 0.5 0.5 0.5 0.5 
##$DPOFFS= (0..7)
0 0 0 0 0 0 0 0 
##$DQDMODE= 0
##$DR= 18
##$DS= 0
##$DSLIST= <SSSSSSSSSSSSSSS>
$$ [...]
##$SUBNAM0= <"">
##$SUBNAM1= <"">
##$SUBNAM2= <"">
##$SUBNAM3= <"">
##$SUBNAM4= <"">
##$SUBNAM5= <"">
##$SUBNAM6= <"">
##$SUBNAM7= <"">
##$SUBNAM8= <"">
##$SUBNAM9= <"">
##$SW= 18.0517328524113
##$SWIBOX= (0..15)
0 0 2 0 0 0 0 0 0 0 0 0 0 0 0 0 
##$SW_h= 3612.71676300578
##$TD= 16384
##$TD0= 1
##$TE= 0
##$TE2= 300
##$TE3= 300
##$TEG= 300
##$TL= (0..7)
0 120 120 120 120 120 120 120 
##$TP= (0..7)
150 150 150 150 150 150 150 150 
##$TP07= 0
##$TPNAME0= <>
##$TPNAME1= <>
##$TPNAME2= <>
##$TPNAME3= <>
##$TPNAME4= <>
##$TPNAME5= <>
##$TPNAME6= <>
##$TPNAME7= <>
##$TPOAL= (0..7)
0.5 0.5 0.5 0.5 0.5 0.5 0.5 0.5 
##$TPOFFS= (0..7)
0 0 0 0 0 0 0 0 
##$TUNHIN= 0
##$TUNHOUT= 0
##$TUNXOUT= 0
##$USERA1= <user>
##$USERA2= <user>
##$USERA3= <user>
##$USERA4= <user>
##$USERA5= <user>
##$V9= 5
##$VALIST= <valist>
##$VCLIST= <CCCCCCCCCCCCCCC>
##$VD= 0
##$VDLIST= <DDDDDDDDDDDDDDD>
##$VPLIST= <PPPPPPPPPPPPPPP>
##$VTLIST= <TTTTTTTTTTTTTTT>
##$WBST= 1024
##$WBSW= 4
##$XGAIN= (0..3)
0 0 0 0 
##$XL= 0
##$YL= 0
##$YMAX_a= 541295
##$YMIN_a= -615723
##$ZGOPTNS= <>
##$ZL1= 120
##$ZL2= 120
##$ZL3= 120
##$ZL4= 120
##$ABSF1= 10
##$ABSF2= 0
##$ABSG= 5
##$ABSL= 3
##$ALPHA= 0
##$AQORDER= 0
##$ASSFAC= 0
##$ASSFACI= 0
##$ASSFACX= 0
##$ASSWID= 0
##$AUNMP= <proc_1d>
##$AZFE= 0.1
##$AZFW= 0.1
##$BCFW= 1
##$BC_mod= 2
##$BYTORDP= 1
##$COROFFS= 0
##$CY= -3
##$DATMOD= 1
##$DC= 2
##$DFILT= <>
##$DTYPP= 0
##$F1P= 0
##$F2P= 0
##$FCOR= 0.5
##$FTSIZE= 0
##$FT_mod= 4
##$GAMMA= 1
##$GB= 0.15
##$INTBC= 1
##$INTSCL= 1
##$ISEN= 128
##$LB= 0.25
##$LEV0= 0
##$LPBIN= 0
##$MAXI= 10000
##$MC2= 0
##$MEAN= 0
##$ME_mod= 0
##$MI= 1.114404
##$NCOEF= 0
##$NC_proc= 0
##$NLEV= 6
##$NOISF1= 3.799351
##$NOISF2= 2.8
##$NSP= 1
##$NTH_PI= 0
##$NZP= 0
##$OFFSET= 14.38212
##$PC= 1
##$PHC0= -107.0787
##$PHC1= 11.79222
##$PH_mod= 1
##$PKNL= yes
##$PPARMOD= 0
##$PSCAL= 0
##$PSIGN= 0
##$REVERSE= no
##$SF= 200.129724274929
##$SI= 16384
##$SIGF1= 3
##$SIGF2= 2
##$SINO= 400
##$SIOLD= 16384
##$SREGLST= <1H.CDCl3>
##$SSB= 0
##$STSI= 0
##$STSR= 0
##$SW_p= 3205.1282051282
##$SYMM= 0
##$S_DEV= 0
##$TDeff= 0
##$TDoff= 0
##$TI= <>
##$TILT= no
##$TM1= 0
##$TM2= 0
##$TOPLEV= 0
##$USERP1= <user>
##$USERP2= <user>
##$USERP3= <user>
##$USERP4= <user>
##$USERP5= <user>
##$WDW= 1
##$XDIM= 8192
##$YMAX_p= 0
##$YMIN_p= 0
$$ End of Bruker specific parameters
$$ ---------------------------------
##NTUPLES= NMR FID
##VAR_NAME=  TIME,          FID/REAL,        FID/IMAG
##SYMBOL=    X,             R,               I
##VAR_TYPE=  INDEPENDENT,   DEPENDENT,       DEPENDENT
##VAR_FORM=  AFFN,          ASDF,            ASDF
##VAR_DIM=   8192,          8192,            8192
##UNITS=     SECONDS,       ARBITRARY UNITS, ARBITRARY UNITS
##FACTOR=    0.0002768,     1,               1
##FIRST=     0,             0,               0
##LAST=      2.2672688,     0,               0
##MIN=       0,             -615723,         0
##MAX=       2.2672688,     541295,          0
$$ Real data points
##PAGE= N=1
##DATA TABLE= (X++(R..R)), XYDATA
$$ [...]
$$ plain form
1901 -95 -79 -127 -45 508 694 705 598 377 473 310 330 216 -20 46 -458 -657 -581 -519 -595 -677 -153 -176 -11 50 168
1926 168 527 373 412 259 340 451 559 564 217 -112 -48 -592 -463 -583 -681 -858 -692 -367 -356 -277 35 157 201
1949 201 608 697 376 476 513 600 62 204 203 -346 -393 -185 -592 -737 -811 -706 -581 -66 -357 -256 203 379
1971 379 472 454 459 884 197 103 267 265 -261 -314 -169 -487 -700 -712 -355 -515 -434 -116 -358 -149 474 395 607 502
1995 502 672 427 683 576 153 289 -27 104 -279 -548 -94 -687 -578 -559 -321 -417 -277 -21 273 119 236
2016 236 270 162 381 520 500 249 107 -121 -149 -216 -102 -178 -525 -534 -342 -382 -499 -60 45 135 402 463 334
2039 334 198 811 395 646 484 558 118 -232 -86 -502 -392 -446 -452 -676 -566 -353 -277 25 77 421 258 237
2061 237 314 452 325 616 588 -176 243 399 216 -304 -350 -250 -375 -409 -292 -220 -12 154 -67 -132 189 287
$$ packed form
1901i5J6m8Q2N53J86J1j07k21R6j63K0j14k36O6n04j99P6O2p6q2N24k3J65O1J18
1926A68L59j54L9j53Q1J11J08Nl47l29O4n44J29j20r8j77J66L25J1P9L12J22M4
1949B01M07Q9l21J00L7Q7n38J42jn49m7K08m07j45p4J05J25N15k91J01M59J76
1971C79R3j8NM25o87r4J64kn26n3J45l18k13j2L57j60Q1L18k42K09O23p9K12j05
1995E02J70k45K56j07m23J36l16J31l83k69M54n93J09J9K38r6J40K56K94j54J17
2016B36L4j08K19J39k0k51j42k28k8o7J14p6l47rJ92m0j17M39J05R0K67O1j29
2039C34j36O13m16K51j62P4m40l50J46m16J10n4ok24J10K13P6L02N2L44j63k1
2061B37P7J38j27K91k8p64M19J56j83n20m6J00j25l4J17P2K08J66k21o5L21R8
$$ plain form
2083 287 173 282 259 440 321 210 31 -163 -82 -175 -27 -452 28 -162 -674 -263 107 -426 -88 393 328
2104 328 -54 -56 593 344 142 357 304 166 138 38 -48 -258 -303 -283 -658 -459 -213 -199 -274 -167 -72 -120 96 482
2128 482 372 283 436 602 118 188 175 148 -238 122 -443 -487 -324 -411 -412 -567 -166 64 -237 -103 368 196 273
2151 273 488 381 154 506 222 138 41 108 -91 -384 -276 -203 -411 -582 -181 -389 -348 -29 113 -65 40 189
2173 189 272 189 582 561 494 148 81 -15 63 -293 -278 -233 -226 -187 -432 -377 -241 -108 -59 -40 5 300 232 400 611 105
2199 105 262 601 157 13 308 -169 -404 -656 -182 -342 -330 -540 -346 -265 -167 248 383 329 392 605 380 615
2221 615 582 268 -107 198 88 -104 -114 -275 -387 -514 -209 -291 -361 -210 -47 98 -104 241 231 202 356 313
2243 313 250 276 220 -15 -88 92 -57 -93 -378 -453 -119 -291 -54 -321 -214 17 -262 163 357 295 374 159 285
$$ packed form
2083B87j14J09k3J81j19j11j79j94Q1r3J48m25M80j90n12M11L70n33L38M81o5
2104C28l82kO49k49k02K15n3j38k8j00q6k10m5K0l75J99K46J4p5J07R5m8K16L86
2128D82j10q9J53J66m84P0j3k7l86L60n65m4J63q7jj55M01K30l01J34M71j72P7
2151B73K15j07k27L52k84q4r7O7j99k93J08P3k08j71M01k08M1L19J42j78J05J49
2173A89Q3q3L93k1o7l46o7r6P8l56J5M5PL9k45N5J36J33M9J9M5K95o8J68K11n06
2199A05J57L39m44j44K95m77k35k52M74j60J2k10J94Q1R8M15J35n4O3K13k25K35
2221F15l3l14l75L05j10j92j0j61j12j27L05q2p0J51J63J45k02L45j0k9J54m3
2243C13o3K6n6k35p3J80j49l6k85p5L34j72K37k67J07K31k79M25J94o2P9k15J26
$$ plain form
2266 285 469 135 143 60 -178 -111 -217 -12 -384 -315 -102 -259 -241 -270 116 -219 554 373 301 370 256 483 175
2289 175 200 105 -257 141 -154 -175 -297 -284 -164 -454 -210 -281 -200 -179 246 298 348 22 310 512 452 163 93 167
2313 167 251 -246 -61 -268 -6 -244 -300 -395 -241 -106 -222 -377 117 30 46 139 349 403 451 198 360 202 62
2336 62 -10 94 62 127 -17 -296 -150 6 -280 -321 -25 -96 -70 -52 22 20 362 437 284 533 369 294 110 156 -209
2361 -209 -143 -7 -381 -290 -163 -286 -403 -200 132 121 163 110 -13 309 351 332 171 104 234 -31 25 55 -113
2384 -113 -81 -424 -335 -143 -160 -314 -166 103 -277 322 -107 233 365 386 178 125 162 115 -119 67 37 -332 -324
2407 -324 100 -212 -288 -334 -241 -119 -507 -51 48 -128 130 157 325 67 1 250 183 474 207 -80 -14 13 -128
2430 -128 -261 -304 -142 -472 -327 -281 4 335 160 -140 204 142 146 346 360 361 195 185 -29 -132 -220 -257 9 -528
$$ packed form
2266B85J84l34Qq3k38O7j06K05l72O9K13j57J8k9L86l35P73j81p2O9j14K27l08
2289A75K5r5l62L98k95k1j22J3J20k90K44p1Q1K1M25N2N0l26K88K02o0k89p0P4
2313A67Q4m97J85k07K62k38n6r5J54J35j16j55M94q7J6R3K10N4M8k53J62j58j40
2336F2p2J04l2O5j44k79J46J56k86m1K96p1K6J8P4kL42P5j53K49j64p5j84M6l65
2361b09O6J36l74R1J27j23j17K03L32j1M2n3j23L22M2j9j61o7J30k65N6L0j68
2384a13L2l43Q9J92j7j54J48K69l80N99m29L40J32K1k08n3L7m7k34J86l0l69Q
2407c24M24l12p6m6R3J22l88M56R9j76K58K7J68k58o6K49o7K91k67k87O6K7j41
2430a28j33m3J62l30J45M6K85L31j75l00L44o2MK00J4Jj66j0k14j03q8l7K66n37
$$ plain form
2454 -528 -437 -219 -61 -169 -224 -61 135 131 224 305 429 290 160 144 360 367 122 -168 -122 -26 -329 -169 -174 -207 -265
2479 -265 -322 89 -6 -70 -130 263 282 14 245 340 -29 325 358 68 -9 9 -275 -405 -442 -219 -178 -213 -113 -182
2503 -182 -85 14 57 -47 -203 130 307 157 254 247 154 -248 -190 18 -3 -272 63 -284 -336 75 -307 -193 -200 -123
2527 -123 -162 214 444 114 374 108 203 192 199 92 -210 -377 153 148 -395 -320 95 -60 -157 -260 -66 -102 -123 88
2551 88 214 184 189 282 17 260 120 283 233 -9 -99 -169 -102 -276 -73 -515 11 -319 -419 31 -214 -138 281
2574 281 200 163 111 401 235 340 210 89 70 -110 -253 -285 -282 -262 -194 -10 -377 -89 -75 69 -163 278 83
2597 83 29 207 297 -31 201 180 -61 -161 116 -127 -337 -148 -150 -76 27 -187 -115 36 -254 -100 66 -43 300
2620 300 256 274 253 15 238 81 133 -69 -30 -7 -393 -276 -241 -284 -251 -208 -164 -110 -186 -166 149 5 -126 332 123
$$ packed form
2454e28R1K18J58j08n5J63J96mR3Q1J24j39j30j6K16Pk45k90M6R6l03J60nl3n8
2479b65n7M11r5o4o0L93J9k68K31R5l69L54L3k90p7J8k84j30l7K23M1l5J00o9
2503a82R7R9M3j04j56L33J77j50R7pr3m02N8K08k1k69L35l47n2M11l82J14pP7
2527a23l9L76K30l30K60k66R5j1Pj07l02j67N30nn43P5M15j55r7j03J94l6k1K11
2551H8J26l0NR3k65K43j40J63n0k42r0p0O7j74K03m42N26l30j00M50k45P6M19
2574B81q1l7n2K90j66J05j30j21j9j80j43l2LK0O8J84l67K88J4J44k32M41j95
2597H3n4J78R0l28K32k1k41j00K77k43k10J89kP4J03k14P2J51k90J54J66j09L43
2620C00m4J8k1k38K23j57N2k02L9K3l86J17L5m3L3M3M4N4p6K0L15j44j31M58k09
$$ plain form
2645 123 253 34 163 -105 94 3 -147 123 -276 -179 -138 -41 -429 -132 -250 -307 -160 274 83 295 209 195
2667 195 161 267 13 -61 -116 -147 -301 -218 -291 -516 -82 -536 -323 -450 69 -24 -132 -53 -188 64 139 186 265 401
2691 401 -30 -35 88 -81 -52 -153 -41 -297 -40 -204 67 -452 -46 83 -3 -144 20 324 267 -65 179 387
2713 387 531 234 -114 -45 133 84 23 -165 -9 -272 -22 -86 -205 -53 -166 -379 -70 118 -104 -3 358
2734 358 253 -65 275 -78 -65 -73 -87 28 -20 -324 -228 -273 25 -105 -204 -279 16 -9 -165 -48 322 -86 141
2757 141 163 -9 -180 -25 0 -143 -95 -197 46 -87 -105 -170 -290 -85 89 54 215 85 121 70 45 47 239 103
2781 103 19 -86 106 -10 -317 -290 -95 -244 -99 -223 -140 -468 -310 85 7 -45 207 444 -110 161 193 180
2803 180 14 -43 -122 -97 39 -56 33 -263 83 -178 -385 -96 20 102 201 118 -203 249 258 398 215 164 160 -66
$$ packed form
2645A23J30k19J29k68J99r1j50K70l99R7M1R7l88K97j18n7J47M34j91K12q6j4
2667A95l4J06k54p4n5l1j54Q3p3k25M34m54K13j27N19r3j08P9j35K52P5M7P9J36
2691D01m31nJ23j69K9j01J12k56K57j64K71n19M06J29q6j41J64L04n7l32K44K08
2713C87J44k97l48O9J78m9o1j88J56k63K50o4j19J52j13k13L09J88k22J01L61
2734C58j05l18L40l53J3qj4J15m8l04R6m5K98j30r9p5K95k5j56J17L70m08K27
2757A41K2j72j71J55K5j43M8j02K43j33j8o5j20K05J74l5J61j30L6n1k5KJ92j36
2781A03q4j05J92j16l07K7J95j49J45j24Q3l28J58L95p8n2K52K37n54K71L2j3
2803A80j66n7p9K5J36r5Q9k96L46k61k07K89J16Q2R9q3l21M52RJ40j83n1mk26
$$ plain form
2827 -66 151 -213 -118 -229 -340 -220 30 -378 -158 341 -202 -8 124 64 202 -176 110 110 349 589 69 123
2849 123 158 -88 -75 38 56 -214 -143 -48 -442 -39 -426 -363 -168 -269 -80 92 333 180 312 -39 248 -135
2871 -135 69 -20 95 -61 -201 -203 -198 -178 35 -167 -66 -44 -187 -46 85 209 -90 311 82 221 -24 158
2893 158 -39 -44 58 -277 -68 -141 -484 10 -170 -275 34 -290 -34 282 150 -12 92 413 48 135 152 -88
2915 -88 95 30 95 79 -67 -299 -103 -410 -203 -251 -126 -109 -75 -127 235 -2 66 336 156 244 244 196 -158 -296
2939 -296 19 -50 -95 60 -302 -24 40 -245 -156 -97 -265 12 -234 52 203 -80 -180 86 31 64 208 102
2961 102 225 22 52 -54 -125 -254 -114 -338 -120 99 108 -8 -164 254 -78 288 -41 300 329 -44 419 252
2983 252 26 93 22 -322 105 228 -157 -380 77 -147 -71 -247 116 418 -183 553 -8 228 211 166 322 214
$$ packed form
2827f6K17l64R5j11j11J20K50m08K20M99n43J94J32o0J38l78K86%K39K40n20N4
2849A23L5k46J3J13J8k70P1R5l94M03l87O3J95j01J89J72K41j53J32l51K87l83
2871a35K04q9J15j56j40kNK0K13k02J01K2j43J41J31J24k99M01k29J39k45J82
2893A58j97nJ02l35K09p3l43M94j80j05L09l24K56L16j32j62J04L21l65Q7J7k40
2915h8J83o5O5j6j46k32J96l07K07m8J25J7L4n2L62k37O8K70j80Q8%m8l54j38
2939b96L15o9m5J55l62K78O4k85Q9N9j68K77k46K86J51k83j00K66n5L3J44j06
2961A02J23k03L0j06p1j29J40k24K18K19Rj16j56M18l32L66l29L41K9l73M63j67
2983B52k26O7p1l44M27J23l85k23M57k24P6j76L63L02o01P36n61K36j7m5J56j08
$$ plain form
3005 214 -68 -122 -78 -116 120 -148 211 -274 -55 -156 14 148 -4 -56 -216 286 117 83 -25 470 -27 15
3027 15 130 -222 -3 -46 -113 -30 -92 -1 -9 -48 156 -2 -58 78 274 244 295 -44 127 92 77 -105 -128 42 -79
3052 -79 -168 -237 101 -265 31 -292 -121 -96 -248 -95 71 72 -246 -172 153 241 269 97 77 -64 63 8 153 -91
3076 -91 -73 -87 92 -109 -105 -197 -175 -43 59 140 190 134 -4 264 -16 -28 28 269 -38 52 -172 49 -178 -95 -267
3101 -267 13 -413 -103 -213 -210 -215 126 -44 -3 -121 -178 107 103 258 94 291 106 -139 -163 -196 -27 16 -80 3
3125 3 -106 16 -179 -366 -109 -65 146 225 92 152 76 11 292 200 227 -21 29 289 158 -6 10 -188 -135 -298
3149 -298 51 133 -72 -170 -186 -149 85 38 176 -125 102 6 136 144 442 150 -62 -156 -119 -181 -29 -276 -261 -111
3173 -111 15 -317 -31 -24 143 368 335 243 296 108 6 6 -24 201 116 -65 -134 -116 -82 -219 18 -36 -105 258 64
$$ packed form
3005B14k82n4M4l8K36k68L59m85K19j01J70J34j52n2j60N02j69l4j08M95m97M2
3027A5J15l52K19m3o7Q3o2R1ql9K04j58n6J36J96l0N1l39J71l5j5j82k3J70j21
3052g9q9o9L38l66K96l23J71K5j52J53J66Jl18P4L25Q8K8j72k0j41J27n5J45k44
3076i1J8j4J79k01Mr2K2J32J02Q1N0n6j38K68k80j2N6K41l07R0k24K21k27Q3j72
3101b67K80m26L10j10LnL41j70M1j18n7K85mJ55j64J97j85k45k4l3J69M3r6Q3
3125Cj09J22j95j87K57M4K11P9j33O0p6o5K81r2K7k48N0K60j31j64J6j98N3j63
3149b98L49Q2k05r8j6L7K34m7J38l01K27r6J30QK98k92k12r4L7o2J52k47J5J50
3173a11J26l32K86PJ67K25l3r2N3j88j02%l0K25q5j81o9J8L4j37K37n4o9L63j94
$$ plain form
3198 64 -212 26 -152 -136 204 106 23 133 -122 -204 216 247 14 150 79 -42 -90 -238 125 0 -43 -149 29
3221 29 79 -40 -18 104 131 14 -153 97 -50 -35 -97 -295 -163 -290 71 -117 -123 -33 -230 53 30 -53 103 71
3245 71 65 187 131 15 85 308 -49 -116 -64 -91 -360 -50 -266 -153 50 -175 -302 -101 -101 -18 -5 -160 27 -92
3269 -92 20 202 214 -8 -144 48 108 -82 81 -361 -222 160 -23 -262 66 -278 63 -70 125 50 1 -148
3291 -148 129 325 62 127 44 112 -56 73 -91 -42 -53 17 -157 137 128 -108 -54 -126 49 223 176 22 131 372
3315 372 -80 171 -140 47 -82 -38 7 -295 292 -208 54 -73 148 -88 98 211 -88 112 235 132 29
3336 29 81 136 148 107 -43 -278 69 -57 -56 -151 -216 80 94 -245 -8 -118 -166 -45 126 7 -47 241 135 325
3360 325 -65 142 85 -156 210 36 -194 39 -178 -153 133 17 -76 87 -125 -101 207 100 4 98 6 50 160
$$ packed form
3198F4k76K38j78J6L40r8q3J10k55q2M20L1k33J36p1j21m8j48L63j25m3j06J78
3221B9N0j19K2J22K7j17j67K50j47J5o2j98J32j27L61j88oR0j97K83k3q3J56l2
3245G1oJ22n6j16P0K23l57o7N2k7k69L10k16J13K03k25j27K01%Q3J3j55J87j19
3269i2J12J82J2k22j36J92O0j90J63m42J39L82j83k39L28l44L41j33J95p5m9j49
3291a48K77J96k63O5q3O8j68J29j64M9j1P0j74K94rk36N4p2J75J74m7j54J09K41
3315C72m52K51l11J87j29M4M5l02N87n00K62j27K21k36J86J13k99K00J23j03j03
3336B9N2N5J2m1j50k35L47j26Jr5o5K96J4l39K37j10m8J21J71j19n4K88j06J90
3360C25l90K07n7k41L66j74k30K33k17K5K86j16r3J63k12K4L08j07r6R4r2M4J10
$$ plain form
3383 160 20 76 -62 -123 155 -84 -211 52 102 6 -29 19 151 96 -100 19 -44 87 125 -122 205 209 5 17
3407 17 0 203 40 364 -182 84 -408 -301 -66 -90 -287 -123 133 136 171 -198 315 25 153 -288 117 153
3429 153 98 93 -330 -140 -101 -172 -32 -348 -89 -174 -23 -13 113 -168 33 -203 70 131 113 297 3 133 209
3452 209 260 -1 59 -54 15 -129 -241 113 -8 87 140 -87 -100 205 137 264 131 -196 -3 -187 141 103 -79
3475 -79 -239 190 -72 -3 -34 32 101 90 69 -351 -129 36 48 -106 -21 466 -46 58 171 -29 -63 56 -38 -167
3499 -167 230 -231 -106 -67 -170 -15 -223 151 8 -57 133 130 0 -127 -179 -23 53 64 41 193 -126 -187 101
3522 101 156 82 -26 -320 17 -236 160 -7 -155 -117 -193 70 -39 269 40 -23 141 -93 206 -151 -227 -211
3544 -211 -199 -213 105 60 41 -163 -270 96 -88 -17 338 -55 107 253 232 -105 -82 93 83 -1 6 -225 168 -108
$$ packed form
3383A60j40N6j38o1K78k39j27K63N0r6l5M8J32n5j96J19o3J31L8k47L27Mk04J2
3407A7j7K03j63L24n46K66m92J07K35k4j97J64K56LL5l69N13k90J28m41M05L6
3429A53n5nm23J90L9p1J40l16K59q5J51J0J26k81K01k36K73O1j8J84k94J30P6
3452B09N1k61O0j13O9j44j12L54j21R5N3k27j3L05o8J27j33l27J93j84L28l8j82
3475g9j60M29k62O9l1O6O9j1k1m20K22J65J2j54Q5M87n12J04J13k00l4J19r4j29
3499a67L97m61J25L9j03J55k08L74j43o5J90lj30j27n2J56P6J1k3J52l19o1K88
3522A01N5p4j08k94L37k53L96j67j48L8p6K63j09L08k29o3J64k34K99l57p6J6
3544b11J2j4L18m5j9k04j07L66j84P1L55l93J62J46k1l37K3J75j0q4Pk31L93k76
$$ plain form
3568 -108 -32 24 -112 -15 79 118 3 332 -15 -69 101 -122 40 -55 188 -189 -10 85 -196 52 186 -202 -10
3591 -10 -342 2 -60 -147 123 139 78 -283 -172 -24 21 80 46 76 137 -59 -34 311 -45 215 -59 -375 112 -228
3615 -228 63 -48 85 -427 -249 363 276 382 21 -49 -71 235 20 25 -147 55 30 307 -181 -23 103 -16
3637 -16 -44 99 -180 -342 204 253 107 -75 131 211 76 -20 58 59 -89 -47 63 -131 2 10 51 56 -140 -16 106
3662 106 -203 -88 -60 84 203 100 192 -182 -380 -85 -75 47 73 282 -115 -136 -21 -188 -14 -153 29 150
3684 150 20 -190 218 -10 -218 50 -101 46 65 206 109 33 -89 215 124 32 27 127 -42 -77 -92 -58 104
3707 104 -27 -18 124 -84 73 -193 151 -80 -217 -30 407 4 -364 -39 -52 265 -67 -233 26 -207 -51
3728 -51 98 -4 -279 -19 -40 57 -13 6 173 41 -79 19 5 -106 -1 56 -150 184 -163 127 -118 43 17
$$ packed form
3568a08P6N6j36R7R4L9j15L29l47n4J70k23J62r5K43l77J79R5k81K48J34l88J92
3591a0l32L44o2q7K70J6o1l61J11J48M5N9l4L0O1j96K5L45l56K60k74l16M87l40
3615b28K91j11J33n12J78O12q7J06l61p0k2L06k15Nj72K02k5K77m88J58J26j19
3637a6k8J43k79j62N46M9j46j82K06Q0j35r6P8Jj48M2J10j94J33QM1Nj96J24J22
3662A06l09J15K8J44J19j03R2l74j98K95J0J22K6K09l97k1J15j67J74j39J82J21
3684A50j30k10M08k28k08K68j51J47J9J41r7p6j22L04r1r2nJ00j69l5j5L4J62
3707A04j31RJ42k08J57k66L44k31j37J87M37m03l68L25j3L17l32j66K59k33J56
3728e1J49j02k75K60k1R7p0J9J67j32j20R8j4j11J05N7k06L34l47K90k45J61k6
$$ plain form
3751 17 68 -47 61 66 -89 -61 18 112 -316 75 46 75 127 71 33 -34 -86 -43 -36 -431 -81 -66 -90 131 -95 55
3777 55 140 -22 204 -61 -165 -412 111 193 62 -241 27 -39 -75 -212 -306 144 247 -46 73 14 135 -120
3799 -120 123 164 -56 104 3 -86 118 -35 62 24 30 -22 179 -69 -42 -1 -144 137 -183 52 86 -252 -228 -32
3823 -32 154 50 88 34 -129 155 75 128 7 89 47 18 35 253 -305 398 60 -21 272 -72 323 1 -189
3846 -189 51 87 92 30 6 51 -142 -134 -252 99 -197 -148 -23 86 226 35 181 -122 100 35 -303 6 223
3869 223 95 51 -26 143 -247 41 198 207 129 128 241 -263 -111 -81 -214 -7 -106 -242 290 -182 89 194 -112
3892 -112 -146 -28 248 368 -107 -70 20 -111 92 -70 28 27 -58 -219 -338 -143 -98 -17 -26 -252 232 99 -160 216
3916 216 -104 35 22 19 93 94 79 9 99 -36 298 43 89 -52 -90 -35 151 -123 12 -4 150 61 -142 2 76
$$ packed form
3751A7N1j15J08Nj55K8P9R4m28L91k9K9N2n6l8o7n2M3Pl95L50J5k4K21k26J50
3777E5Q5j62K26k65j04k47N23Q2j31l03K68o6l6j37r4M50J03k93J19n9J21k55
3799a20K43M1k20J60j01q9K04j53R7l8On2K01k48K7M1j43K81l20K35L4l38K4J96
3823c2J86j04L8n4j63K84q0N3j21Q2m2k9J7K18n58P03l38q1K93l44L95l22j90
3846a89K40L6No2k4M5j93Qj18L51k96M9J25J09J40j91J46l03K22o5l38L09K17
3869B23j28m4p7J69l90K88J57Rp8jJ13n04J52L0j33K07r9j36N32m72K71J05l06
3892a12l4J18K76J20m75L7R0j31K03j62R8jq5j61j19J95M5Q1rk26M84j33k59L76
3916B16l20J39j3lP4Jj5p0R0j35L34k55M6j41l8N5J86k74J35j6J54q9k03J44P4
$$ plain form
3941 76 46 -58 209 -38 12 81 -254 -170 -7 -146 72 -90 88 -54 8 43 188 -91 119 196 -98 207 -33
3964 -33 -136 67 161 -57 31 12 156 242 112 -160 15 168 137 243 -9 212 -93 -140 -67 -273 -130 162 -12
3987 -12 -65 337 169 -78 -129 222 114 195 -32 69 -61 -244 -155 -41 -80 40 -42 94 304 58 183 217 140
4010 140 97 92 184 1 179 -91 272 85 94 46 -223 375 -321 24 123 -283 9 39 67 -72 -120 352 -119 -107
4034 -107 -55 192 136 -357 104 -126 -225 -25 17 -82 -122 -214 -69 -167 129 -21 96 -57 -147 45 121 -219 -107
4057 -107 -24 -99 -212 -17 264 -290 -63 111 -111 -139 -140 25 95 -11 -8 -85 326 137 255 -176 166 -142 45
4080 45 20 30 -186 -56 173 -42 -3 -234 -23 -180 16 38 -83 70 103 -106 -48 -45 95 34 -190 -273 -130 17
4104 17 180 -4 -277 -24 7 335 2 270 47 161 -358 -14 178 -17 14 -297 137 31 -25 -323 61
$$ packed form
3941G6l0j04K67k47N0O9l35Q4J63j39K18j62J78j42O2L5J45k79K10P7k94L05k40
3964c3j03K03R4k18Q8j9J44Q6j30k72J75J53l1J06k52K21l05m7P3k06J43K92j74
3987a2n3M02j68k47n1L51j08Q1k27J01j30j83Q9J14l9J20q2J36K10k46J25L4p7
4010A40m3nR2j83J78k70L63j87Rm8k69N98o96L45R9m06K92L0K8j39m8M72m71J2
4034a07N2K47n6m93M61k30r9K00M2r9m0r2J45r8K96j50J17j53r0J92P6l40J12
4057a07Q3p5j13J95K81n54K27J74k22k8jJ65P0j06Lp7M11j89J18m31L42l08J87
4080D5k5J0k16J30K29k15L9k31K11j57J96K2j21J53L3k09N8LJ40o1k24q3J43J47
4104A7J63j84k73K53L1L28l33K68k23J14n19L44J92j95L1l11M34j06n6k98L84
$$ plain form
4125 61 228 184 -90 40 143 -141 -273 -68 131 78 111 -29 -95 16 -79 -3 226 115 86 112 -171 -18 -166
4148 -166 37 -161 -86 14 -247 -349 -40 231 -156 54 -310 -227 -57 11 61 36 123 373 85 27 343 73
4170 73 -217 133 -56 88 -35 -11 -235 -10 57 66 211 -244 91 290 334 13 95 -244 -107 85 108 17 24 -16
4194 -16 -51 38 303 119 -2 -26 -79 9 31 -46 -59 139 219 -42 103 261 28 -79 141 -33 -193 -16 205
4217 205 177 184 -187 39 135 70 -119 -198 -27 171 227 159 -21 21 -79 -4 -182 -139 146 16 142 -11 126 4
4241 4 -167 170 -292 103 -134 -170 -158 -202 96 -48 236 67 -61 -45 117 -93 -41 39 -82 -163 150 -48 -68
4264 -68 226 -35 138 73 143 222 -21 325 -93 39 -234 53 201 -33 -140 -105 3 -113 -9 -163 98 20
4286 20 177 62 -79 78 -217 293 -344 -185 33 176 -41 -102 -73 -66 -297 -103 -84 44 173 -5 104 -183
$$ packed form
4125F1J67m4k74J30J03k84j32K05J99n3L3j40o6J11r5P6K29j11k9K6k83J53j48
4148a66K03j98P5J00k61j02L09K71l87K10l64Q3J70O8N0k5Q7K50k88n8L16k70
4170G3k90L50j89J44j23K4k24K25O7RJ45m55L35J99M4l21Q2l39J37J92K3r1Pm0
4194a6l5Q9K65j84j21k4n3Q8K2p7j3J98Q0k61J45J58k33j07K20j74j60J77K21
4217B05k8Pl71K26R6o5j89p9J71J98N6o8j80M2j00P5j78M3K85j30J26j53J37j22
4241Dj71L37m62L95k37l6J2m4K98j44K84j69j28J6J62k10N2Q0j21q1L13j98k0
4264f8K94k61J73o5P0P9k43L46m18J32k73K87J48k34j07L5J08j16J04j54K61p8
4286B0J57j15j41J57k95N10o37J59K18J43k17o1K9Pk31J94J9J28J29j78J09k87
$$ plain form
4308 -183 -162 -231 -18 -47 94 16 45 -78 43 -171 -41 -231 -225 -193 -129 -77 18 -72 -114 -101 31 61 118 6 -42 -191
4334 -191 -32 101 14 137 69 -254 -198 268 90 92 -32 -45 116 -119 -16 86 -160 -283 -2 53 -156 32
4356 32 35 55 -8 360 122 -13 -300 66 -145 -70 163 -63 53 -38 -2 228 126 -144 -207 -2 124 147 127 -204
4380 -204 -4 -144 253 -105 -78 107 -179 -97 -313 168 91 219 -12 -271 -62 -1 -62 -172 71 -244 14 -104
4402 -104 190 52 -13 -189 -139 -134 13 88 -187 -52 -168 -111 -185 201 -233 -130 -150 -70 -134 21 -204 186 157 -13
4426 -13 75 77 -149 123 26 -53 -113 27 30 -94 124 -355 69 9 -244 204 -105 119 189 161 195 -135 43 -154
4450 -154 173 138 195 -189 138 -42 47 166 93 -154 -56 154 -242 36 252 75 242 59 24 79 -44 156
4472 156 28 345 97 130 -47 39 -42 120 -108 32 -135 -117 128 180 107 55 54 -202 113 39 122 -96 -16 144
$$ packed form
4308a83K1o9K13k9J41p8K9j23J21k14J30j90OL2O4N2R5r0m2J3J32L0N7j12m8j49
4334a91J59J33q7J23o8l23N6M66j78Kj24j3J61k35J03J02k46j23K81N5k09J88
4356C2LK0o3L68k38j35k87L66k11P5K33k26J16r1L6K30j02k70o3K05J26K3k0l31
4380b04K00j40L97l58K7J85k86Q2k16M81p7J28k31k59K09O1o1j10K43l15K58j18
4402a04K94j38o5j76N0NJ47P5k75J35j16N7p4L86m34J03k0Q0o4J55k25L90k9j70
4426a3Q8Kk26K72r7p9o0J40Lj24K18m79M24o0k53M48l09K24P0k8L4l30J78j97
4450a54L27l5N7l84L27j80Q9J19p3k47R8K10l96K78K16j77J67j83l5N5j23K00
4472A56j28L17k48L3j77Q6q1J62k28J40j67J8K45N2p3n2jk56L15p4Q3k18Q0J60
$$ plain form
4496 144 160 -206 -54 95 -332 -9 94 -241 14 32 -185 184 -355 191 73 64 108 -49 284 -65 98 -24
4518 -24 -24 113 -230 -179 14 -12 -1 130 -123 -28 -83 -71 32 -72 354 -138 -112 136 73 164 167 260 -142 26 166
4543 166 -103 -230 -81 -48 69 -51 94 -6 140 135 -106 -159 83 -192 -324 -270 68 151 120 167 118 -43 -197
4566 -197 -200 -189 122 -86 -209 -368 -35 -336 200 70 116 180 201 186 -20 84 -188 -110 -163 32 11 192 -60
4589 -60 -101 -123 -228 -132 -42 -83 -104 67 120 -105 157 265 235 157 82 480 26 -111 122 265 -37 53 241 -84
4613 -84 -166 209 164 115 1 -135 76 -117 46 -139 -17 216 -110 -341 32 -46 -214 29 -64 57 296 -43
4635 -43 -177 -285 -254 -89 57 166 -163 125 -280 164 -29 24 -28 148 -74 -200 99 110 51 90 128 227 -92
4658 -92 -53 -200 -100 171 74 2 41 92 -439 -83 100 78 226 187 197 -43 124 -140 -89 126 -48 -197 -30
$$ packed form
4496A44J6l66J52J49m27L23J03l35K55J8k17L69n39N46j18rM4j57L33l49J63j22
4518b4%J37l43N1J93k6J1J31k53R5n5J2J03j04M26m92K6K48o3R1LR3m02J68J40
4543A66k69j27J49L3J17j20J45j00J46nk41n3K42k75j32N4L38Q3l1M7m9j61j54
4566a97lJ1L11k08j23j59L33l01N36j30M6O4K1j5k06J04k72P8n3J95k1J81k52
4589f0m1k2j05R6R0m1k1J71N3k25K62J08l0p8p5L98m54j37K33J43l02R0J88l25
4613h4q2L75m5m9j14j36K11j93J63j85J22K33l26k31L73p8j68K43r3J21K39l39
4635d3j34j08L1J65J46J09l29K88m05M44j93N3n2J76k22j26K99J1n9L9L8R9l19
4658i2L9j47J00K71r7p2L9N1n31L56J83k2J48l9J0k40J67k64N1K15j74j49J67
$$ plain form
4681 -30 -22 -57 10 45 -52 -200 188 -131 -52 157 45 493 -7 -51 208 -108 187 -94 177 355 -244 -5 -123
4704 -123 -82 -111 103 -113 136 87 162 -22 59 -172 80 126 -25 -42 -76 117 169 230 -166 89 53 73 173 -83
4728 -83 -23 217 137 -2 119 -46 8 18 275 166 -202 227 122 152 -187 -68 -115 -83 -203 -190 -126 -20 226
4751 226 -81 161 26 -70 -59 -164 5 39 2 -40 250 325 91 26 -374 -60 72 -129 -144 169 -236 -52 -83
4774 -83 86 22 -85 -157 -159 103 -110 -150 130 263 161 -59 -79 112 91 -70 -74 -165 113 146 147 -9 -24 150 225
4799 225 -178 4 164 75 -40 134 -135 165 163 -205 87 82 -5 11 117 -38 -202 -207 115 44 -3 345 68 178
4823 178 -65 385 314 -12 -251 121 -73 -15 -28 47 -157 -13 -307 145 243 -221 10 -95 137 -226 -68 -31
4845 -31 -49 -242 91 114 114 85 6 -91 187 -82 -203 307 68 -178 207 -57 136 -54 -100 107 202 139 -230 -36
$$ packed form
4681c0Ql5O7L5r7j48L88l19P9K09j12M48n00m4K59l16K95k81K71J78n99K39j18
4704a23M1k9K14k16K49m9P5j84Q1k31K52M6j51j7l4J93N2O1l96K55l6K0J00k56
4728h3O0K40q0j39J21j65N4J0K57j09l68M29j05L0l39J19m7L2j20J3O4J06K46
4751B26l07K42j35r6J1j05J69L4l7m2K90P5k34o5m00L14J32k01j5L13m05J84l1
4774h3J69o4j07p2kK62k13m0K80J33j02k20k0J91k1j61mr1K78L3Jj56j5J74P5
4799B25m03J82J60q9j15J74k69L00kl68K92nq7J6J06j55j64nL22p1m7L48k77J10
4823A78k43M50p1l26k39L72j94N8j3P5k04J44k94M52R8m64K31j05K32l63J58L7
4845c1j8j93L33K3%k9p9r7K78k69j21N10k39k46L85k64J93j90m6K07R5o3l69J94
$$ plain form
4869 -36 171 113 140 29 -292 -148 63 87 86 -87 -123 -225 169 -18 -91 7 134 -123 -227 -206 -16 -135 -105 314
4893 314 59 -121 223 323 338 -217 -142 16 14 184 -296 -197 121 -31 -150 10 -119 -27 -127 -169 -169 309 199
4916 199 38 276 -55 244 -26 -24 125 41 -111 -40 -177 -204 -154 31 -19 -102 -183 -128 149 -52 111 -161 -308
4939 -308 -12 -120 -227 264 -147 278 86 28 -58 -327 0 -61 -17 8 -77 -45 -2 135 76 63 81 -105 -21 40
4963 40 -70 61 35 -174 205 -250 57 -21 -157 -91 92 80 60 18 104 -121 -155 222 -124 -116 45 211 165 190
4987 190 39 137 115 23 -4 -338 -36 -268 -171 -100 -58 97 -122 -54 19 -238 -66 339 152 202 -92 33 -59 153
5011 153 119 245 -31 -149 223 -34 -6 7 -57 -69 97 63 145 16 56 86 -50 -109 119 282 -66 -8 -112 -268
5035 -268 -126 43 -32 34 157 304 -290 64 -109 -62 4 -206 -212 378 -120 318 66 121 11 330 -49 8 14
$$ packed form
4869c6K07n8K7j11l21J44K11K4jj73l6j02L94j87p3R8J27k57j04K1J90j19L0M19
4893C14k55j80L44J00J5n55P5J58kJ70m80R9L18j52j19J60j29R2j00m2%M78j10
4916A99j61K38l31K99k70KJ49q4j52P1j37k7N0J85n0q3q1N5K77k01J63k72j47
4939c08K96j08j07M91m11M25j92n8q6k69L27o1M4K5q5L2M3J37n9j3J8j86Q4O1
4963D0j10J31k6k09L79m55L07p8j36O6J83j2k0m2Q6k25l4L77l46QJ61J66m6K5
4987A90j51R8k2r2k7l34L02k32R7P1M2J55k19O8P3k57J72M05j87N0k94J25r2K12
5011A53l4J26k76j18L72k57K8J3o4j2J66l4Q2j29M0L0j36n9K28J63l48N8j04j56
5035b68J42J69p5O6J23J47n94L54j73M7O6k10oN90m98M38k52N5j10L19l79N7O
$$ plain form
5058 14 123 175 -81 56 -187 165 -12 116 157 33 -86 -291 39 -38 -129 -39 -73 47 11 36 -72 -62 338
5081 338 87 -4 -59 185 -304 -41 11 -336 156 51 -145 64 108 5 111 196 -1 192 98 211 244 244 -4
5104 -4 -14 107 -73 -85 -71 -264 7 415 132 -80 -163 393 -46 -25 224 -36 72 -73 -108 -92 107 -111 -147
5127 -147 69 -30 -80 -128 53 40 -134 66 -186 -178 -62 -97 -47 73 166 269 -69 308 53 -313 107 44 177
5150 177 -188 157 -153 -259 232 51 161 -61 -154 75 -30 -54 9 -66 181 277 101 -66 -100 11 -5 158
5172 158 -27 207 135 -34 159 148 6 -116 9 -272 -107 55 -52 -214 -28 184 -7 74 -168 -188 -48
5193 -48 106 -119 -68 24 56 -270 -222 -73 299 -64 -69 18 112 -103 -6 29 28 334 74 206 -94 485 64 49 -129
5218 -129 25 88 -6 13 21 57 8 -86 84 -85 -62 317 -5 -66 -273 -77 -159 -108 -48 -23 70 13 -5 53 -20 230
$$ packed form
5058A4J09N2k56J37k43L52j77J28M1j24j19k05L30p7r1R0l4J20l6K5j08J0M00
5081C38k51r1n5K44m89K63N2l47M92j05j96K09M4j03J06Q5j97J93r4J13L3%k48
5104dj0J21j80j2J4j93K71M08k83k12q3N56m39K1K49k60J08j45l5J6J99k18l6
5127a47K16r9n0m8J81j3j74K00k52QJ16l5N0J20R3J03l38L77k55l66M20o3J33
5150A77l65L45l10j06M91j81J10k22r3K29j05k4O3p5K47R6j76j67l4J11j6J63
5172A58j85K34p2j69J93j1j42j22J25k81J65J62j07j62J86K12j91Q1k42k0J40
5193d8J54k25N1R2L2l26M8J49L72l63nQ7R4k15R7L5jL06k60J32l00N79m21j5j78
5218a29J54O3r4J9QL6m9r4J70j69K3L79l22o1k07J96q2N1O0K5R3n7j8N8p3K50
$$ plain form
5244 230 -204 61 37 -166 -378 -70 114 -87 118 -61 59 157 25 120 20 112 -47 117 161 -149 -60 -137
5266 -137 -70 -24 -94 -180 -19 -66 -229 -4 153 -19 -70 106 -6 -62 -73 110 239 263 -104 -296 -99 -40 -129 77
5290 77 -99 -94 -24 -227 84 -23 69 139 -226 205 163 -244 -108 -23 335 77 -120 -55 -10 -177 171 -97 -52 -21
5314 -21 -174 45 46 -159 -152 -19 45 74 95 -47 -63 -165 238 107 90 91 -74 -3 -300 -108 -133 69 35 -75 105
5339 105 241 118 -46 -37 80 152 235 79 101 -19 -154 -118 101 -5 -4 272 -90 -162 -90 -151 -25 -40 2 107
5363 107 52 219 -28 -88 -132 25 -69 -32 -36 46 -104 180 168 143 -78 -74 236 -161 215 70 138 -115 60 -380
5387 -380 -29 -47 24 19 123 -73 -115 -38 57 -41 -70 73 153 308 44 -340 215 -17 -31 -146 -27 53 316 -71
5411 -71 -85 -115 120 -60 -457 191 -200 2 -113 45 -36 -58 -52 187 43 -35 144 -169 -89 -187 -244 174 -162 -44
$$ packed form
5244B30m34K65k4k03k12L08J84k01K05j79J20R8j32R5j00R2j59J64M4l10Q9p7
5266a37O7M6p0q6J61m7j63K25J57j72n1J76j12n6j1J83J29K4l67j92J97N9q9K06
5290G7j76NP0k03L11j07R2P0l65M31m2m07J36Q5L58k58j97O5M5j67L48k68M5L1
5314b1j53K19Jk05PJ33O4K9K1j42j6j02M03j31j7Jj65P1k97J92k5K02l4j10J80
5339A05J36j23j64RJ17P2Q3j56K2j20j35L6K19j06JK76l62p2P2o1J26j5M2J05
5363A07n5J67k47o0m4J57r4L7mQ2j50K84j2k5k21ML10l97L76j45O8k53J75m40
5387c80L51j8P1nJ04j96m2P7R5r8k9J43Q0J55k64l84N55k32j4j15J19Q0K63l87
5411g1j4l0K35j80l97O48l91K02j15J58q1k2OK39j44p8J79l13Q0r8n7M18l36J18
$$ plain form
5435 -44 -47 -66 -226 46 -144 -20 165 -187 -4 -227 -71 0 -146 -81 -197 -167 -48 -28 9 64 -275 59 73 175
5459 175 -144 -89 -25 51 185 -134 -20 -145 -27 175 166 -3 -1 -190 29 -53 -238 -55 69 -75 -110 35 133
5482 133 199 -45 -202 94 -137 273 244 -219 -52 -132 -19 50 -126 39 -70 26 -107 50 -35 41 -100 100
5504 100 21 30 22 -71 203 153 76 -132 88 140 10 98 -114 -531 -106 55 124 22 166 189 55 50 103 -49 -12
5529 -12 411 175 -173 -1 -73 143 -207 -245 -71 -54 43 -115 201 227 -235 -13 259 114 56 -26 -76 76 -241
5552 -241 -130 -117 269 -35 -116 -34 -90 -9 -74 40 44 109 -4 44 111 -10 -157 -229 -70 -77 265 -320 -113 -59 91
5577 91 55 -169 -110 -221 118 -43 227 80 57 119 163 -105 -147 104 -153 -153 56 35 -270 -3 -43 143 29 -195
5601 -195 -130 204 -172 -167 -78 -184 21 -100 -171 24 99 145 -2 -24 -214 54 -105 -13 -341 81 -114 -66 -172
$$ packed form
5435d4lj9j60K72j90J24J85l52J83k23J56P1j46O5j16L0J19K0L7N5l39L34J4J02
5459A75l19N5O4P6J34l19J14j25J18K02rj69Kj89K19q2j85J83J24j44l5J45R8
5482A33O6k44j57K96k31M10k9m63J67q0J13O9j76J65j09R6j33J57q5P6j41K00
5504A00p9Rqr3K74n0p7k08K20N2j30Q8k12m17M25J61O9j02J44K3j34nN3j52L7
5529a2M23k36l48J72p2K16l50l8J74J7R7j58L16K6m62K22K72j45n8q2n0J52l17
5552b41J11J3L86l04q1Q2n6Q1o5J14MO5j13M8O7j21j47p2J59pL42n85K07N4J50
5577I1l6k24N9j11L39j61K70j47k3O2M4k68m2K51k57%K09k1l05K67m0J86j14k24
5601a95O5L34l76NQ9j06K05j21p1J95P5M6j47k2j90K68j59R2l28M22j95M8j06
$$ plain form
5624 -172 -124 270 298 -269 -127 1 -117 170 135 125 398 -24 99 37 123 -133 35 -99 -92 240 -111 -151 174
5647 174 303 9 52 -198 222 -142 -82 82 -56 -103 114 111 65 104 -31 3 -105 -97 118 -119 -144 -33 -143 -7
5671 -7 5 -223 278 -79 -158 -173 14 -126 -152 -7 16 -224 77 46 42 335 134 181 -182 -18 95 212 21 101
5695 101 -48 -200 -33 226 123 -154 -124 -73 -34 116 139 90 -31 23 -248 -50 -71 -164 87 -52 41 -106 -112 -328
5719 -328 254 -4 -83 33 -123 10 -39 -15 8 -8 103 -137 -4 -37 30 -279 -168 -430 -40 -113 287 99 -156
5742 -156 1 -22 86 144 -150 15 158 52 -194 -195 -205 71 208 84 155 -97 -86 -3 8 205 -33 105 52
5765 52 11 236 -270 -37 95 222 -121 -109 29 134 -85 203 111 -19 -106 17 79 -183 -103 271 127 234
5787 234 -116 195 135 -46 189 -49 48 -19 -126 -33 194 -124 -24 -188 -117 -55 -32 124 -162 -201 -58 144 -152
$$ packed form
5624a72M8L94K8n67J42J28j18K87l5j0K73m22J23o2Q6k56J68j34PL32l51m0L25
5647A74J29k94M3k50M20l64O0J64j38m7K17lm6L9j35L4j08QK15k37k5J11j10J36
5671gJ2k28N01l57p9j5J87j40k6J45K3k40L01l1mK93k01M7l63J64J13J17j91Q0
5695A01j49j52J67K59j03k77L0N1L9J50K3m9j21N4k71J98k1r3K51j39R3j47ok16
5719c28N82k58p9J16j56J33m9K4K3j6J11k40J33l3O7l09J11k62L90p3M00j88k55
5742a56J57k3J08N8k94J65J43j06k46jj0K76J37j24P1k52J1Q3J1J97k38J38n3
5765E2m1K25n06K33J32J27l43J2J38J05k19K88r2j30q7J23O2k62Q0L74j44J07
5787B34l50L11o0j81K35k38R7o7j07R3K27l18J00j64P1O2K3J56k86l9J43K02k96
$$ plain form
5810 -152 -169 202 -190 -175 85 -25 -129 -60 47 -159 1 -108 -239 53 -211 -52 29 -87 30 -8 -39 -127
5832 -127 -139 -342 -113 -9 76 -79 116 -74 60 -56 197 -6 134 -193 -214 -135 158 -154 -139 123 -89 50
5854 50 33 -22 235 91 62 8 161 283 354 370 148 -160 -245 287 -132 -107 88 -113 57 -427 2 -27 -88 26
5878 26 72 241 -91 21 273 13 240 130 -34 -91 134 98 226 95 15 171 -81 -6 -38 -56 -200 -126 200
5901 200 -42 197 148 -133 -188 -132 -48 237 293 99 -23 -21 193 -280 96 142 -202 -290 258 406 178 110 74 -148
5925 -148 13 -32 -232 -100 97 170 17 -172 6 5 -173 -1 -38 -328 67 -30 -84 -20 -5 219 260 -90 86
5948 86 201 1 397 -178 -106 28 -120 17 -113 -79 84 -31 358 -192 19 -39 3 -49 143 -20 12 -29 119
5971 119 6 6 132 57 55 -213 98 -151 220 0 291 70 -48 17 68 128 -38 -84 246 -9 86 171 62 169
$$ packed form
5810a52j7L71l92J5K60j10j04O9J07k06J60j09j31K92k64J59Q1j16J17l8l1q8
5832a27j2k03K29J04Q5j55J95j90J34j16K53k03J40l27k1P9K93l12J5K62k12J39
5854E0j7n5K57j44k9n4J53J22P1J6k22l08q5N32m19K5J95k01J70m84M29k9o1J14
5878B6M6J69l32J12K52k60K27j10j64n7K25l6J28j31q0J56k52P5l2j8j44P4L26
5901B00k42K39m9k81n5N6Q4K85N6j94j22KK14m73L76M6l44q8N48J48k28o8l6k22
5925a48J61m5k00J32J97P3j53j89J78jj78J72l7k90L95r7n4O4J5K24M1l50J76
5948H6J15k00L96n75P2J34j48J37j30L4J63j15L89n50K11n8M2n2J92j63L2m1J48
5971A19j13%J26p5kk68L11k49L71k20K91k21j18O5N1O0j66m6L30k55R5Q5j09J07
$$ plain form
5995 169 129 187 101 -17 -128 -211 7 241 -163 -98 -82 -109 221 197 20 65 -54 103 321 87 280 -55 -356
6018 -356 -153 83 -22 75 -161 62 109 -274 70 56 250 52 311 -262 -43 15 212 -48 -27 -81 -29 -2 115
6041 115 205 157 -157 -53 -15 -28 9 124 -240 106 -307 -203 127 68 -166 89 -195 204 -225 -48 -9 96
6063 96 115 -57 189 -1 -14 10 -8 -80 -5 -256 -149 -255 29 -82 -99 291 48 -75 16 -157 76 -29 99
6086 99 196 -45 29 154 -33 -108 224 52 -300 -61 -113 -18 81 159 116 148 85 203 -213 29 142 -45 240 -48
6110 -48 -168 -52 -146 361 -170 -88 -40 185 -219 -274 -194 -150 7 -167 -242 -184 -19 -11 119 214 128 -141 -86 -103 -240
6135 -240 -84 172 -76 132 134 73 -256 -136 49 -110 -99 326 -114 -22 7 53 -48 -135 -190 108 -101 217 -75
6158 -75 -76 -241 -405 126 -274 273 -9 186 249 -439 -252 133 66 -20 163 -57 -159 120 224 139 -97 -194 -41
$$ packed form
5995A69m0N8q6j18j11q3K18K34m04O5J6k7L30k4j77M5j19J57K18k34J93l35l01
6018c56K03K36j05R7k36K23M7l83L44j4J94j98K59n73K19N8J97k60K1n4N2K7J17
6041A15R0m8l14J04L8j3L7J15l64L46m13J04L30n9k34K55k84L99m29J77L9J05
6063I6J9j72K46j90j3K4j8p2P5k51J07j06K84j11j7L90k43j23R1j73K33j05J28
6086I9R7k41P4J25j87p5L32j72l52K39n2R5R9P8m3L2o3J18m16K42J13j87K85k88
6110d8j20J16r4N07n31Q2M8K25m04n5Q0M4J57j74p5N8J65QJ30R5q6k69N5j7j37
6135b40J56K56k48K08Ko1l29J20J85j59J1M25m40R2K9M6j01q7n5K98k09L18k92
6158g5jj65j64N31m00N47k82J95O3o88J87L85o7q6J83k20j02K79J04q5k36r7J53
$$ plain form
6181 -41 -265 -84 137 -34 -109 -238 -65 276 -353 163 101 191 164 220 -161 372 -163 -103 144 -149 -124 85 34
6204 34 85 -269 -252 -184 177 27 -88 51 -262 208 62 68 -83 -47 141 29 -105 33 106 133 -59 -170 -82
6227 -82 71 -24 -119 -128 -108 206 -42 -48 73 69 122 125 -159 24 -42 60 47 -118 -51 177 -94 -300 -48 -341 -121
6252 -121 267 101 151 124 38 162 -207 305 32 119 15 -290 150 425 -22 -156 -21 -25 76 94 6 -119 -44
6275 -44 104 34 -245 -258 12 62 -73 26 65 -373 29 56 133 114 16 -226 -263 -178 -282 -316 -81 -133 160 149 -65
6300 -65 -85 276 83 1 -56 161 73 -11 -19 -85 1 -153 113 8 -19 101 -163 -225 186 -49 -67 -2 12 134 -127
6325 -127 -82 252 106 -208 86 133 -196 -36 194 -254 262 -94 287 128 156 -67 25 130 -228 44 143 188
6347 188 82 -10 -76 12 152 227 69 -81 94 -78 -207 3 -227 16 98 30 -145 117 -196 -31 -42 368
$$ packed form
6181d1k24J81K21j71p5j29J73L41o29N16o2R0k7N6l81N33n35O0K47k93K5K09n1
6204C4N1l54J7O8L61j50j15J39l13M70j46Oj51L6J88j12j34J38P3K7j92j11Q8
6227h2J53r5r5rK0L14k48oJ21mN3Lk84J83o6J02j3j65O7K28k71k06K52k93K20
6252a21L88j66N0k7q6J24l69N12k73Q7j04l05M40K75m47j34J35mJ01J8q8j25P5
6275d4J48p0k79j3K70N0j35R9L9m38M02K7P7j9r8k42l7Q5j04l4K35n2K93j1k14
6300f5k0L61j93q2n7K17q8q4qo6Q6j54K66j05k7J20k64o2M11k35j8O5J4J22k61
6325a27M5L34j46l14K94M7l29J60K30m48N16l56L81j59K8k23R2J05l58K72R9M5
6347A88j06r2o6Q8J40P5j58j50J75j72j29K10k30K43Q2o8j75K62l13J65j1M10
$$ plain form
6369 368 14 -11 -20 -11 197 -366 23 179 -218 160 41 -14 -75 26 97 103 -19 110 -190 -199 150 -91 -137 189
6393 189 64 189 178 -120 63 -37 135 -79 -66 -105 -58 135 -251 244 -70 150 -72 -105 15 105 -105 244
6415 244 -295 -214 -112 140 6 6 -140 -409 78 -129 46 -231 -132 153 -15 45 -56 -48 -42 248 99 -136 -198
6438 -198 134 20 -9 205 128 84 -14 40 -134 186 -132 110 -39 227 75 -59 113 102 191 127 -83 134 -183
6461 -183 -22 -221 203 118 -109 64 -151 217 -236 -153 -64 -150 85 163 -17 -33 73 -77 39 -187 85 -70
6483 -70 107 199 118 43 -112 224 37 -85 85 -224 -277 -237 -223 -7 249 -14 139 111 -256 -74 250 -193 -101
6506 -101 233 193 -47 -465 112 -43 -251 -139 -82 -143 -286 -12 -111 -213 75 14 292 60 56 -113 31 -52 117
6529 117 49 1 -92 212 26 -70 -201 24 101 -248 37 98 -91 264 -129 245 -120 83 72 -148 116 118 73
$$ packed form
6369C68l54k5rRK08n63L89J56l97L78j19n5o1J01P1Oj22J29l00rL49k41m6L26
6393A89j25J25j1k98J83j00J72k14J3l9M7J93l86M95l14K20k22l3J20R0k10L49
6415B44n39Q1J02K52j34%j46k69M87k07J75k77R9K85j68O0j01QOK90j49k35o2
6438a98L32j14k9K14p7m4r8N4j74L20l18K42j49K66j52j34J72j1Q9o4k10K17l17
6461a83J61j99M24q5k27J73k15L68m53Q3Q9q6K35P8j80j6J06j50J16k26K72j55
6483g0J77R2q1p5j55L36j87j22J70l09n3M0J4K16K56k63J53k8l67J82L24m43R2
6506a01L34m0k40m18N77j55k08J12N7o1j43K74r9j02K88o1K78k32mj69J44q3J69
6529A17o8m8r3L04j86r6j31K25P7l49K85O1j89L55l93L74l65K03j1k20K64Km5
$$ plain form
6552 73 -1 201 -26 -41 -339 255 -164 20 -23 146 124 -153 -241 248 74 36 116 -68 64 129 -216 -28 191
6575 191 -122 -114 190 258 -194 69 58 113 107 -71 -166 161 -45 100 -52 17 94 131 113 115 5 -6 -170 31 40 -104
6601 -104 182 -118 -183 -194 2 -149 -136 78 -21 41 74 25 -323 21 -146 -322 90 127 116 61 289 34 86 90
6625 90 -110 106 -181 259 -121 -330 13 -138 168 190 -133 23 -64 356 37 106 256 11 -94 157 -135
6646 -135 45 15 244 8 -88 88 -94 -96 -73 198 -400 30 97 43 -72 43 -362 -101 -149 15 165 -62 253
6669 253 299 -47 73 84 -269 10 177 92 -167 1 -144 136 -25 -155 -183 -222 358 302 49 65 -3 -101 -83
6692 -83 -60 193 5 -406 -205 74 -57 -243 -68 357 -209 207 -179 -219 121 -156 52 -69 -191 -83 87
6713 87 357 34 -138 -37 133 -26 -143 -4 122 -212 108 7 170 31 14 79 -134 164 -41 253 171
$$ packed form
6552G3p4K02k27j5k98N94m19J84m3J69k2k77q8M89j74l8Q0j84J32O5l45J88K19
6575A91l13QL04O8m52K63j1N5oj78r5L27k06J45j52O9P7L7j8Kj10j1j64K01Rj44
6601a04K86l00o5j1J96j51J3K14r9O2L3m9l48L44j67j76M12L7j1n5K28k55N2M
6625I0k00K16k87M40l80k09L43j51L06K2l23J56q7M20l19O9J50k45j05K51k92
6646a35J80l0K29k36r6J76j82kK3K71n98M30O7n4j15J15m05K61m8J64J50k27L15
6669B53M6l46J20J1l53K79J67q5k59J68j45K80j61j30k8l9N80n6k53J6o8r8J8
6692h3K3K53j88m11K01K79j31j86J75M25n66M16l86m0L40k77K08j21j22J08J70
6713H7K70l23j72J01J70j59j17J39J26l34L20j01J63j39j7O5k13K98k05K94q2
$$ plain form
6734 171 -63 -110 31 6 -39 223 -156 10 59 -265 61 -123 -27 -121 173 -63 29 98 53 -150 105 -169 102
6757 102 -82 90 -62 -52 -17 -48 142 228 269 62 86 92 42 59 -232 128 105 123 -5 163 -196 -40 127 185
6781 185 -185 -101 111 -166 -21 -48 165 45 110 42 87 -171 139 236 -58 148 78 153 281 78 156 -106 -110 189
6805 189 20 210 150 48 -26 22 172 20 38 304 16 -106 -200 -62 -153 274 -254 171 117 6 -176 -281
6827 -281 59 148 -88 -120 104 75 65 208 191 -453 -74 159 -167 163 -110 -42 -290 73 42 149 146 -63 -59 -57
6851 -57 -147 215 -51 121 207 115 218 3 59 218 19 24 -40 21 28 -406 53 -149 -20 90 -98 -169 -115 88
6875 88 -107 -46 -165 -248 175 -287 -139 -44 20 85 -178 -99 88 -6 -71 25 161 37 26 -289 214 189 30 10
6899 10 31 290 -100 70 -105 2 112 20 -15 201 -129 63 18 -282 -59 44 -280 -33 155 -97 181 45
$$ packed form
6734A71k34m7J41k5m5K62l79J66M9l24L26j84R6r4K94k36R2O9m5k03K55k74K71
6757A02j84J72j52J0L5l1J90Q6M1k07K4On0J7k91L60k3J8j28J68l59J56J67N8
6781A85l70Q4K12k77J45k7K13j20O5o8M5k58L10R7k94K06p0P5J28k03P8k62mK99
6805A89j69J90o0j02p4M8J50j52J8K66k88j22r4J38r1M27n28M25n4j11j82j05
6827b81L40Q9k36l2K24k9j0J43j7o44L79K33l26L30k73O8k48L63l1J07lk09MK
6851e7r0L62k66J72Q6r2J03k15N6J59j99No4O1Pm34M59k02J29J10j88p1N4K03
6875H8j95O1j19q3M23m62J48R5O4O5k63P9J87r4o5R6J36j24j1l15N03k5j59k0
6899A0K1K59l90J70j75J07J10r2l5K16l30J92m5l00K23J03l24K47J88k52K78j36
$$ plain form
6921 45 236 73 26 55 -268 -132 52 -68 129 73 156 -87 56 -84 89 89 -95 -265 -71 -6 -55 153 169
6944 169 -125 135 160 54 13 -171 174 -297 -99 -232 -9 -11 -131 12 -69 -263 -336 -29 95 27 -78 198
6966 198 147 136 85 -94 -152 -115 -15 -131 112 96 90 -192 -39 129 -150 -84 -14 -1 -219 344 -185 91 172 75
6990 75 -67 -141 -155 -54 -160 -201 -189 -244 71 -120 -54 80 38 -387 -189 -288 56 -74 21 3 96 32 210 186 -75
7015 -75 41 28 230 -178 -57 190 -138 107 204 -51 -29 -297 -46 28 307 -80 -233 -186 -189 28 -229 -133 -23
7038 -23 -275 197 60 92 -42 -57 -170 -71 168 -365 -65 -12 59 -120 -139 0 -71 -30 -98 -157 -308 57 1 -130
7062 -130 30 123 50 226 -85 437 -44 -35 180 -156 -68 91 -228 -63 180 -13 -27 125 -102 32 38 106 -177
7085 -177 -136 62 -44 104 -152 27 205 144 327 166 -119 241 -145 21 81 -121 -36 -171 -72 -337 -252 225
$$ packed form
6921D5J91j63m7K9l23J36J84j20J97n6Q3k43J43j40J73%j84j70J94O5m9K08J6
6944A69k94K60K5j06m1j84L45m71J98j33K23kj20J43q1j94p3L07J24o8j05K76
6966A98n1j1n1j79n8L7J00j16K43j6ok82J53J68k79O6P0J3k18N63n29K76Q1r7
6990G5j42p4j4J01j06m1J2n5L15j91O6J34m2m25J98r9L44j30R5j8R3o4J78k4k61
7015g5J16j3K02m08J21K47l28K45R7k55K2k68K51P4K79l87j53M7lK17k57R6J10
7038b3k52M72j37L2j34j5j13R9K39n33L00N3P1j79j9J39p1M1o8n9j51L65n6j31
7062a30J60R3p3J76l11N22m81RK15l36Q8J59l19J65K43j93j4J52k27J34OO8k83
7085a77M1J98j06J48k56J79J78o1J83j61k85L60l86J66O0k02Q5j35R9k65Q5M77
$$ plain form
7107 225 42 146 96 131 -47 92 90 -158 -36 -194 115 -55 161 -278 178 -290 20 27 175 37 -395 -15
7129 -15 26 38 91 33 72 -184 -251 -290 -13 28 -314 119 -17 -14 -40 59 24 -96 -175 -9 202 -129 88 31 256
7154 256 64 87 -100 266 -37 73 -4 65 72 -138 -40 -173 -6 158 -85 -7 -185 -61 81 -100 294 108
7176 108 -96 -48 -138 -221 -234 -245 -108 171 -170 55 33 55 -61 -185 80 -55 -3 165 -94 -157 -23 -193 -63
7199 -63 19 6 84 214 -1 109 98 85 107 -43 269 -101 -282 28 -121 152 153 -55 153 -176 -29 83 -25
7222 -25 -67 145 263 141 22 -137 162 -24 -17 158 152 -121 -55 -228 124 -256 95 25 -55 110 164 -139 44
7245 44 -200 84 -144 -286 -207 73 229 -34 235 -2 -3 10 142 -111 14 60 252 87 -118 170 -67 23
7267 23 -173 -305 112 -119 -65 318 109 125 -33 -35 256 5 77 90 -58 204 -63 152 116 94 43 -200 -130 -141
$$ packed form
7107B25j83J04n0L5j78J39kk48J22j58L09j70K16m39M56m68L10PJ48j38m32L80
7129a5M1J2N3n8L9k56o7l9K77M1l42M33j36Lk6R9l5j20p9J66K11l31K17n7K25
7154B56j92K3j87L66l03J10p7O9Pk10R8j33J67J64k43P8j78J24J42j81L94j86
7176A08k04M8r0q3j3j1J37K79l41K25k2K2j16j24K65j35N2J68k59o3J34j70J30
7199f3Q2j3P8J30k15J10j1j3K2j50L12l70j81L10j49K73Jk08K08l29J47J12j08
7222b5m2K12J18j22j19j59K99j86PJ75ok73O6j73L52l80L51p0q0J65N4l03J83
7245D4k44K84k28j42P9K80J56k63K69k37jJ3J32k53J25M6J92j65k05K88k37R0
7267B3j96j32M17k31N4L83k09J6j58kK91k51P2J3j48K62k67K15l6k2n1k43P0j1
$$ plain form
7291 -141 22 -20 -33 -11 -252 -34 43 -180 19 65 -25 -133 -85 -242 -30 -44 -156 101 191 -76 -41 -38 -100 -55 248
7316 248 -87 -8 -16 256 -305 451 150 -15 52 -3 -120 39 165 150 -173 12 -79 242 87 -278 -77 -15 182
7339 182 -27 134 69 174 15 28 118 97 194 205 78 -287 -51 116 -144 -130 -11 106 90 -329 -34 -130 98
7362 98 88 -266 -8 196 -93 -99 32 -170 26 62 -155 -103 -28 359 -107 -107 75 -31 -83 -193 -156 104 15 69
7386 69 0 86 -76 -121 -116 -96 48 25 -3 -319 3 163 -123 69 -263 -111 239 -195 -205 -429 -111 -70 255 37
7410 37 -133 62 214 -33 -70 -20 188 -84 -44 354 162 -292 213 -223 -163 25 117 -233 -119 -157 80 154 125
7433 125 99 -156 65 -76 -4 150 25 37 -25 -36 148 -49 -42 -170 -93 -316 164 304 -30 -229 -59 122 171
7456 171 81 -28 36 142 170 -142 -22 -200 -254 -105 73 -65 124 38 173 224 42 6 99 51 252 -36 4
$$ packed form
7291a41J63m2j3K2k41K18P7k23J99M6r0j08M8j57K12j4j12K57R0k67L5Lo2M5L03
7316B48l35P9qK72n61P56l01j65O7n5j17J59J26j5l23J85r1L21j55l65K01O2J97
7339A82k09J61o5J05j59J3R0k1R7J1j27l65K36J67k60J4J19J17j6m19K95r6K28
7362I8j0l54K58K04k89oJ31k02J96L6k17N2P5L87m66%J82j06n2j10L7K60q9N4
7386F9o9Q6j62m5NK0J44k3k8l16L22J60k86J92l32J52L50m34j0k24L18M1L25k18
7410C7j70J95J52k47l7N0K08k72M0L98j92m54N05m36O0J88R2l50J14l8K37P4k9
7433A25k6k55K21j41P2J54j25J2o2j1J84j97Pj28P7k23M80J40l34j99J70J81M9
7456A71r0j09O4J06K8l12J20j78n4J49J78j38J89q6J35N1j82l6R3m8K01k88M0
$$ plain form
7479 4 -133 23 -176 7 -165 -94 286 214 -89 -200 224 35 -163 -153 -88 -171 31 -141 22 187 -265 264
7501 264 169 110 41 -6 31 -85 24 -252 -32 143 -278 -219 189 -108 -127 254 -165 99 96 281 103 11 -51 -18
7525 -18 -78 121 -231 -259 100 -124 -252 -117 -96 -422 -2 -209 12 -166 183 134 122 -149 -14 -97 251 72
7547 72 -119 14 102 69 133 -30 -316 310 243 63 125 137 73 -103 -8 20 137 52 -94 35 -96 32 42 -79
7571 -79 113 -108 3 -206 -51 -222 -61 86 66 -80 -60 -40 39 -142 -7 149 -567 6 -85 -68 30 -75 -49
7594 -49 -384 10 363 170 19 -41 -53 5 -1 192 206 87 56 177 -48 -63 94 -106 -208 135 156 193 0 10
7618 10 -113 -3 38 -1 -9 43 -290 -411 -68 23 187 77 149 -355 -163 -173 -38 114 -274 -124 38 57 151 -146
7642 -146 -33 -185 151 71 -22 147 -124 -70 -101 124 -114 282 -58 279 -9 -83 -131 -66 -199 109 258 -138
$$ packed form
7479Dj37J56j99J83j72P1L80p2l03j11M24j89j98J0O5q3K02j72J63J65m52N29
7501B64r5n9o9m7L7j16J09k76K20J75m21N9M08k97j9L81m19K64lJ85j78r2o2L3
7525a8o0J99l52k8L59k24j28J35K1l26M20k07K21j78L49m9j2k71J35q3L48j79
7547G2j91J33Q8l3O4j63k86O26o7j80O2J2o4j76R5K8J17q5j46J29j31J28J0j21
7571g9J92k21J11k09J55j71J61J47k0j46K0K0P9j81J35J56p16N73r1J7R8j05K6
7594d9l35L94L53j93j51o0j2N8oJ93J4j19l1J21k25j5J57k00j02L43K1L7j93J0
7618A0j23J10M1l9qN2l33j21L43R1J64j10P2n04J92j0J35J52l88J50J62J9R4k97
7642a46J13j52L36q0r3J69k71N4l1K25k38L96l40L37k88p4m8O5j33L08J49l96
$$ plain form
7664 -138 -48 98 -81 -242 -191 -45 26 -87 -119 367 -8 167 -144 21 -44 179 43 -252 13 -91 154 -176
7686 -176 96 -331 198 2 3 81 -54 66 26 -18 -4 -354 67 82 58 -205 58 213 61 152 -142 -77 -125 249
7710 249 -21 98 36 -61 -184 -358 165 -178 -13 52 -87 -47 -31 0 51 151 -180 -44 73 213 49 74 -146
7733 -146 -109 77 -118 326 159 263 -66 -74 -181 301 -180 -15 103 103 -131 32 -47 34 -176 -132 -36 -40 -67 108
7757 108 137 -139 -12 91 -158 106 -60 -346 -2 -257 232 13 106 109 -391 -272 -242 -191 105 151 -31 -41 50
7780 50 -17 229 -12 286 -135 139 -169 -32 -103 -6 16 151 75 -2 2 49 87 -116 -38 -1 32 -13 11 139 -159
7805 -159 -49 -306 -17 114 299 45 -37 -53 85 184 74 62 -113 66 23 42 -131 -155 -171 -35 -22 130 189
7828 189 25 19 74 -84 111 -2 161 -28 194 207 -6 204 -187 184 -176 29 -10 -42 -60 21 74 139 30
$$ packed form
7664a38R0J46j79j61N1J46P1j13l2M86l75J75l11J65o5K23j36k95K65j04K45l30
7686a76K72m27N29j96JP8j35J20m0m4J4l50M21J5k4k63K63J55j52R1k94O5m8L74
7710B49k70J19o2r7j23j74N23l43J65O5j39M0J6L1N1J00l31J36J17J40j64K5k20
7733a46L7J86j95M44j67J04l29qj07M82m81J65J18%k34J63p9Q1k10M4R6mk7J75
7757A08K9k76J27J03k49K64j66k86L44k55M89k19R3Ln00J19L0N1K96M6j82j0R1
7780E0o7K46k41K98m21K74l08J37p1R7K2J35p6p7MM7L8k03P8L7L3m5K4J28k98
7805a59J10k57K89J31J85k54q2j6J38R9j10j2j75J79m3J9j73k4j6J36J3J52N9
7828A89j64oN5j58J95j13J63j89K22J3k13K10l91L71l60K05l9l2j8Q1N3O5j09
$$ plain form
7851 30 12 13 163 23 71 56 273 -162 70 20 -113 -103 80 55 7 -76 -270 -148 17 -56 188 -212 -29 280
7875 280 -25 10 -101 90 92 -196 119 176 57 174 190 19 -2 66 60 -270 2 207 105 -196 -217 -98 78
7898 78 219 -103 -105 0 -175 230 -29 159 -134 -117 245 134 72 271 -492 -137 -56 100 -126 -96 138 -50
7920 -50 -41 -186 122 -7 -3 290 -40 -98 -62 -43 -3 -244 235 271 -240 70 27 39 164 -192 -133 187 -65 132
7944 132 -146 299 152 -268 17 70 145 76 154 187 68 -4 118 -288 -73 91 -98 33 -42 3 -111 -33 201
7967 201 -231 -50 104 -5 121 170 102 -88 -24 7 -80 138 -62 75 -170 86 -216 157 116 -97 -136 -64 -198
7990 -198 -115 -4 -11 44 9 -123 20 43 82 -150 -81 13 107 -185 -18 -163 42 -122 1 115 -66 211 -145
8013 -145 77 154 87 236 -85 -8 -63 218 48 -64 2 -117 11 -78 -120 210 -117 -127 7 87 107 -5 177
$$ packed form
7851C0j8JJ50j40M8j5K17m35K32n0j33J0J83k5m8q3j94J22J65p3K44m00J83L09
7875B80l05L5j11J91Kk88L15N7j19J17J6j71k1O8ol30K72K05j02l01k1J19J76
7898G8J41l22kJ05j75M05k59J88k93J7L62j11o2J99p63L55Q1J56k26L0K34j88
7920e0Rj45L08j29MK93l30n8L6J9M0k41M79L6n11L10m3J2J25l56N9L20k52J97
7944A32k78M45j47m20K85N3P5o9P8L3j19p2J22m06K15J64j89J31p5M5j14P8K34
7967B01m32J81J54j09J26M9o8j90O4L1q7K18k00J37k45K56l02L73m1k13l9P2j34
7990a98Q3J11pN5l5j32J43K3L9k32O9R4R4k92J67j45K05j64J23J14j81K77l56
8013a45K22P7o7J49l21P7n5K81j70j12O6j19J28q9m2L30l27j0J34Q0K0j12J82
$$ plain form
8036 177 -178 -78 -150 197 38 -14 -113 -98 -67 -75 -94 -207 -203 49 74 -54 -111 -248 -151 147 24 -77 -68 64 264
8061 264 -39 13 -9 104 -41 80 54 168 -134 158 -46 198 -202 106 87 341 -148 -73 55 -192 -97 -36
8083 -36 13 -192 -128 190 -14 3 83 -18 165 93 -23 -109 49 -104 49 77 72 40 -51 -126 -241 -312 19 -155 -236
8108 -236 -224 168 181 199 267 -19 168 116 -33 -167 62 1 324 170 28 -10 110 -179 -87 -342 -91 -48 -191
8131 -191 184 21 24 -15 20 -34 -165 226 89 -9 64 -249 184 56 97 121 -99 -93 -38 -55 -205 149 228 -57 -149
8156 -149 35 120 -117 -361 -380 164 5 265 78 -151 -44 -152 -80 -46 -42 -104 10 -105 80 -38 198 -247
8178 -247 -7 -109 -67 -104 -208 30 -16 -38 121 -80 -91 -21 160
$$ packed form
8036A77l55J00p2L47j59n2r9J5L1qj9j13MK52K5j28n7j37R7K98j23j01RJ32K00
8061B64l03N2k2J13j45J21k6J14l02K92k04K44m00L08j9K54m89P5J28k47R5O1
8083c6M9k05O4L18k04J7Q0j01J83p2j16q6J58j53J53K8nl2r1p5j15p1L31j74q1
8108b36J2L92J3J8O8k86J87n2j49j34K29o1L23j54j42l8J20k89R2k55K51M3j43
8131a91L75j63Ll9L5n4j31L91j37r8P3l13M33j28M1K4k20ON5j7j50L54P9k85r2
8156a49J84Q5k37k44j9N44j59K60j87k29J07j08P2L4Mo2J14j15J85j18K36m45
8178b47K40j02M2l7j04K38m6k2J59k01j1P0J81
8191A60
$$ Imaginary data points
##PAGE= N=2
##DATA TABLE= (X++(I..I)), XYDATA
$$ plain form
0 0 0 0 0 0 0 0 0 -8 8 -8 8 -16 16 -16 24 -32 40 -48 56 -72 81 -97 120 -138 162 -192 222 -257 297 -338
30 -338 389 -442 501 -569 642 -723 812 -911 1018 -1135 1262 -1406 1558 -1722 1907 -2107
46 -2107 2325 -2563 2825 -3112 3429 -3777 4164 -4596 5078 -5622 6240 -6952 7776 -8749
60 -8749 9918 -11352 13159 -15514 18729 -23400 30829 -44527 78125 -341334 -205984 503780
72 503780 -93617 -460990 36515 449649 -37099 -276255 145507 421121 67802 -146705
82 -146705 35462 180447 15739 -110043 -65995 34736 19543 -67264 -131789 -59965 8699
93 8699 -82111 -205116 -58420 179394 110229 -133991 -41931 248605 183309 -103373 10412
104 10412 316133 133787 -274134 -154520 181810 -4697 -342184 -122221 198010 -24844
$$ packed form
0@%%%%%%%qJ6j6J6k4L2l2M0n6P2q8J04j28J53j78K17k58L00l54M14m79N54o35
30c38P27q31R43j070J211j365J535j723J929k153K397k668K964l280L629m014
46b107M432m888N388n937O541p206P941q760R674j0700J1862j3192J4728j6525
60h749J8667k1270K4511k8673L4243m2129N4229p5356J22652m19459J35350P09764
72E03780n97397l67373M97505M13134m86748k39156M21762K75614l53319k14507
82a46705J82167J44985j64708j25782M4048J00731j5193q6807o4525P1824O8664
93H699r0810j23005J46696K37814o9165k44220R2060K90536o5296k86682J13785
104A0412L05721j82346m07921J19614L36330j86507l37487K19963L20231k22854
$$ plain form
114 -24844 -284100 -29261 210785 15723 -106971 107229 189476 13882 -37139 57660 42428
125 42428 -3413 42111 21759 -66173 -31818 22821 -82773 -147220 -8706 59924 -78095
136 -78095 -112629 58867 99933 -56398 -54434 142466 166767 -11370 -34306 106884 71849
147 71849 -108722 -91177 67544 24734 -135955 -94232 37096 -17634 -102756 2810 97079
158 97079 9528 -36164 59057 65664 -27938 -286 79540 20294 -43624 26140 44375 -58724
170 -58724 -63250 33707 7716 -80674 -28786 42980 -26949 -73974 18420 63269 -5056 -4575 72943
183 72943 55122 -22057 -2265 47075 -574 -52251 -10923 13996 -48670 -72319 -4237 23581
195 23581 -27338 -21002 53806 50306 -22426 -7388 64511 36597 -35799 -3895 50808 -6215
$$ packed form
114b4844k59256K54839K40046j95062j22694K14200Q2247j75594n1021R4799j5232
125D2428m5841M5524k0352q7932L4355N4639j05594o4447J38514O8630j38019
136g8095l4534J71496M1066j56331J964J96900K4301j78137k2936J41190l5035
147G1849j80571J7545J58721m2810j60689M1723J31328n4730q5122J05566R4269
158I7079q7551m5692R5221O607r3602K7652P9826n9246o3918O9764J8235j03099
170e8724m526R6957k5991q8390N1888P1766o9929m7025R2394M4849o8325M81P7518
183G2943j7821p7179J9792M9340m7649n1677M1328K4919o2666k3649O8082K7818
195B3581n0919O336P4808l500p2732J5038P1899k7914p2396L1904N4703n7023
$$ plain form
207 -6215 -63149 -5383 32025 -32540 -52375 11777 12691 -43776 -22277 29168 -78 -24116 32007
220 32007 50833 -2966 5098 61190 27598 -36225 2531 45167 -22564 -74228 -14145 14326
232 14326 -53711 -64989 16790 34914 -25124 -18147 51157 48502 -4885 8820 53014 26305
244 26305 -21887 -3417 22081 -11079 -35913 -7352 -614 -35717 -32937 5276 -6058 -37702
256 -37702 -5967 31076 -651 -19325 35956 58759 3580 -8095 49582 46561 -21915 -23573
268 -23573 24255 -491 -59995 -42847 1382 -19580 -48524 -16538 15462 734 -3623 24785
280 24785 32431 18165 21621 29143 13063 4255 17821 10230 -19873 -19038 5302 -8667 -41858
293 -41858 -26418 7033 -12325 -44382 -16019 26659 8062 -21329 11510 50118 24525 -5739
$$ packed form
207f215n6934N7766L7408o4565j9835O4152R14n6467K1499N1445k9246k4038N6123
220C2007J8826n3799Q064N6092l3592o3823L8756M2636o7731n1664O0083K8471
232A4326o8037j1278Q1779J8124o0038O977O9304k655n3387J3705M4194k6709
244B6305m8192J8470K5498l3160k4834K8561O738l5103K780L8213j1334l1644
256c7702L1735L7043l1727j8674N5281K2803n5179j1675N7677l021o8476j658
268b3573M7828k4746n9504J7148M4229k0962k8944L1986L2000j4728m357K8408
280B4785P646j4266L456P522j6080q808J3566p591l0103Q35K4340j3969l3191
293d1858J5440L3451j9358l2057K8363M2678j8597k9391L2839L8608k5593l0264
$$ plain form
305 -5739 22503 47268 13786 -19453 -3541 11025 -15896 -36889 -22074 -8365 -17804 -25687 -14171
318 -14171 3510 9008 2247 1382 15432 25177 13388 1536 13552 24365 5754 -12364 1155
331 1155 13844 -5997 -26548 -14537 602 -13229 -27808 -13152 7178 610 -12802 -735
343 -735 23099 22169 3625 5461 23998 20232 -5318 -10340 8013 6739 -18648 -24762 -2193 4257
357 4257 -16932 -21747 3521 15795 -5620 -14865 9606 23522 745 -12522 11165 24636 229
370 229 -13551 8563 19139 -6259 -18191 1126 7504 -10427 -15723 -2446 177 -7458 -6214
383 -6214 1689 5440 6858 4617 -1106 2651 12334 5309 -8919 -1677 10385 -2626 -16521 -1168
397 -1168 14227 -1950 -15955 1655 16149 -318 -13697 1299 12843 -3399 -15768 146
$$ packed form
305e739K8242K4765l3482l3239J5912J4566k6921k0993J4815J3709r439p883J1516
318a4171J7681N498o761q65J4050R745j1789j1852J2016J0813j8611j8118J3519
331A155J2689j9841k0551J2011J5139j3831j4579J4656K0330o568j3412J2067
343g35K3834r30j8544J836J8537l766k5550n022J8353j274k5387o114K2569O450
357D257k1189m815K5268J2274k1415r245K4471J3916k2777j3267K3687J3471k4407
370B29j3780K2114J0576k5398j1932J9317O378j7931n296J3277K623p635J244
383f214P903L751J418k241n723L757R683p025j4228P242J2062j3011j3895J5353
397a168J5395j6177j4005J7610J4494j6467j3379J4996J1544j6242j2369J5914
$$ plain form
409 146 13050 -2845 -15328 1287 13473 -2052 -11237 6007 12882 -4918 -8534 8779 9927
422 9927 -5181 -2551 8688 2767 -5196 1277 2199 -6731 -5188 833 -6879 -11649 -138 3252 -7843
437 -7843 -4546 10812 7599 -2895 5238 15238 6146 -2807 3994 6936 -2803 -7376 -2020 -535
451 -535 -6468 -11180 -6606 -343 -3404 -9001 -2060 7871 2391 -4986 5635 15614 5040 -987 10935
466 10935 12697 -1319 -3582 3656 -1840 -10514 -6734 -5278 -11815 -9425 -2549 -6665 -7693 4502
480 4502 9038 901 4743 15091 10028 1358 6975 11320 2641 -1661 881 -3052 -9169 -7187 -7047
495 -7047 -9755 -7051 -4971 -8841 -6753 2447 2243 -679 7961 13760 6888 5584 12984 9554 980
510 980 3259 4191 -4761 -7157 -3603 -9587 -15873 -8248 -3720 -9076 -6563 2967 1631 -1853 5234 10205
$$ packed form
409A46J2904j5895j2483J6615J2186j5525r185J7244O875j7800l616J7313J148
422I927j5108K630J1239n921p963O473R22q930J543O021p712m770J1511L390j1095
437g843L297J5358l213j0494Q133J0000r092q953O801K942r739m573N356J485
451e35n933m712M574O263l061n597O941R931n480p377J0621R979j0574o027J1922
466A0935J762j4016k263P238n496q674L780J456o537K390O876m116j028J2195
480D502M536q137L842J0348n063q670N617M345q679m302K542l933o117J982J40
495g047k708K704K080l870K088R200k04k922Q640N799o872j304P400l430q574
510I80K279R32q952k396L554n984o286P625M528n356K513R530j336l484P087M971
$$ plain form
526 10205 7137 8971 11785 5289 1997 6297 3014 -5512 -2099 1842 -8685 -14118 -5316 -3831 -12244
541 -12244 -8060 2827 -260 -3231 5366 8454 3041 6249 12117 6725 3569 7957 3615 -6064 -3581
556 -3581 -44 -6335 -8735 -2769 -4533 -10161 -5420 -302 -2292 -84 6281 3706 831 6401 7601
571 7601 2349 4425 8741 2190 -2539 2034 -5 -8763 -5859 127 -5712 -9147 -902 -93 -7586
586 -7586 -2666 6324 2474 -921 6728 8281 335 527 6380 3002 -989 2167 1446 -4201 -3087 -869
602 -869 -5318 -4634 1139 -780 -5519 -1152 2459 -2364 -2192 5062 4208 -26 2722 3994 -846 234
618 234 4575 820 -2437 2392 1605 -5138 -3291 3199 -1001 -6150 310 3180 -3264 -4081 2033 377
634 377 -3266 1062 3276 17 363 2727 -227 -606 4193 4093 -1275 715 3003 -1772 -3351 1027
$$ packed form
526A0205l068J834K814o496l292M300l283q526L413L941j0527n433Q802J485q413
541a2244M184J0887l087k971Q597L088n413L208N868n392l156M388m342r679K483
556c581L537o291k400N966j764n628M741N118j990K208O365k575k875N570J200
571G601n252K076M316o551m729M573k039q758K904N986n839l435Q245Q09p493
586g586M920Q990l850l395P649J553p946J92N853l378l991L156p21n647J114K218
602h69m449O84N773j919m739M367L611m823J72P254q54m234K748J272m840J080
618B34M341l755l257M829p87o743J847O490m200n149O460K870o444q17O114j656
634C77l643M328K214l259L46K364k954l79M799j00n368J990K288m775j579M378
$$ plain form
650 1027 354 -3972 -2518 -450 -3512 -3708 939 -28 -3207 796 4038 400 169 4776 3402 287
666 287 3458 4695 505 -610 1339 -1397 -4280 -1667 -1226 -5107 -5095 -1107 -2753 -4015 471 2687
682 2687 353 1927 5236 3879 2536 4249 3888 1501 1796 2048 -2151 -3684 -1216 -2785 -6571 -4562
698 -4562 -1585 -3874 -4929 -945 1256 555 1841 4146 4493 4651 5854 3790 2255 3715 2151 -1914
714 -1914 -2311 -975 -3570 -6940 -5486 -3508 -4665 -4520 -1507 -753 -253 2383 3409 3714 5523 6408 3974
731 3974 3230 5033 3437 -671 -1087 -448 -2777 -6045 -4970 -4191 -5247 -4993 -3543 -1862 -178 1763
747 1763 1896 3436 5362 5487 4184 4380 5526 3117 837 645 -488 -2970 -4031 -3855 -4866 -5474 -4262
764 -4262 -3329 -3197 -1564 1255 1197 1458 3816 4780 4055 4049 4761 3681 1982 780 -11 -1402 -2653 -3561
$$ packed form
650A027o73m326J454K068l062j96M647r67l179M003L242l638k31M607j374l115
666B87L171J237m190j115J949k736k883K613M41l881J2L988j646j262M486K216
682B687k334J574L309j357j343J713l61k387K95K52m199j533K468j569l786K009
698d562K977k289j055L984K201p01J286K305L47J58J203k064j535J460j564m065
714a914l97J336k595l370J454J978j157J45L013P54N00K636J026L05J809Q85k434
731C974p44J803j596m108m16O39k329l268J075P79j056K54J450J681J684J941
747A763J33J540J926J25j303J96J146k409k280j92j133k482j061J76j011o08J212
764d262R33J32J633K819n8K61K358R64p25oP12j080j699j202p91j391j251r08
$$ plain form
782 -3561 -4615 -4006 -3772 -3653 -3201 -1465 -472 40 849 2669 2986 3524 4308 3145 2452 3040 2646 63
800 63 -935 -459 -1505 -4083 -3573 -2154 -2941 -4212 -2890 -610 -274 -797 1393 2687 1974 2103 3184 3683
818 3683 2872 1618 1436 1013 -223 -1193 -1495 -1655 -2727 -2747 -1859 -2164 -2353 -1267 -46 -532 -403 1736
836 1736 2395 766 1078 3239 3028 566 581 1852 827 -1207 -636 -387 -1917 -2290 -1664 -1657 -2483 -1492 -345
855 -345 -739 -979 1092 1909 507 700 2251 2773 1402 1171 1817 1752 -190 -1218 267 324 -1663 -2618
873 -2618 -1170 -1073 -2520 -2025 -408 -243 -1228 -406 1265 1355 927 1593 2113 1147 1469 2238 1094 141 634
892 634 657 -1605 -2131 -614 -919 -3277 -2336 -865 -1326 -1905 -657 448 436 1282 2005 1778 2484 2716 2078
911 2078 1340 1524 1071 -546 -1268 -973 -1775 -2671 -2415 -2059 -2340 -1996 -996 -880 -180 1235 1268 1324 2627
$$ packed form
782c561j054O09K34J19M52J736R93N12Q09J820L17N38P84j163o93N88l94k583
800F3r98M76j046k578N10J419p87j271J322K280L36n23K190J294p13J29J081M99
818C683q11j254j82m23j236r70l02j60j072k0Q88l05j89J086J221m86J29K139
836A736O59j629L12K161k11k462J5J271j025k034N71K49j530l73O26Pq26R91J147
855c45l94k40K071Q17j402J93J551N22j371k31O46o5j942j028J485N7j987r55
873b618J448R7j447M95J617J65r85Q22J671R0m28O66N20r66L22P69j144r53M93
892F34K3k262n26J517l05k358R41J471m61n79J248J105j2Q46P23k27P06K32o38
911B078p38J84m53j617p22K95q02q96K56L56k81L44J000J16P00J415L3N6J303
$$ plain form
930 2627 3395 2685 1517 2565 2067 303 -166 -308 -1355 -2434 -2039 -2956 -2904 -1859 -1638 -2765 -1306 1323
948 1323 1369 263 2544 4258 2318 1474 3719 2930 424 1114 442 -1413 -2214 -866 -2190 -4168 -2566
965 -2566 -1592 -3268 -2632 356 586 -916 584 3535 3198 1916 2980 3522 1971 964 1049 501 -315
982 -315 -1579 -2909 -2764 -1856 -2742 -3612 -1668 -919 -1343 -430 1945 1373 787 2966 4314 1752 1506 3922
1000 3922 1853 -1642 37 1626 -2000 -3966 -1060 -1558 -4516 -3249 -35 -1259 -2061 591 1850
1015 1850 673 1546 3279 2694 1779 2611 2355 959 354 313 -901 -1239 -1571 -2214 -2580 -1807 -2477 -2669 -357
1034 -357 432 -1079 -241 3108 2090 119 2461 4440 1570 -154 2381 1990 -1628 -1364 298 -1968
1050 -1968 -3224 -1074 -978 -3415 -2068 195 -855 -1099 1448 1857 358 994 2707 1901 772 1871
$$ packed form
930B627P68p10j168J048m98j764m69j42j047j079L95r17N2J045K21j127J459K629
948A323M6j106K281J714j940q44K245p89k506O90o72j855q01J348j324j978J602
965b566R74j676O36K988K30j502J500K951l37j282J064N42j551j007Q5n48q16
982c15j264j330J45R08q86q70J944P49m24R13K375n72n86K179J348k562k46K416
1000C922k069l495J679J589l626j966K906m98k958J267L214j224q02K652J259
1015A850j177Q73J733n85r15Q32k56j396o05m1j214l38l32o43l66P73o70j92K312
1034c57P89j511Q38L349j018j971K342J979k870j724K535l91l618K64J662k266
1050a968j256K150R6k437J347K263j050k44K547M09j499O36J713q06j129J099
$$ plain form
1066 1871 1828 332 381 211 -1577 -1187 -511 -1878 -2750 -1213 -535 -2428 -1182 769 40 -339 1701 2012
1084 2012 536 1244 2681 774 11 1863 1381 -1478 -1027 366 -1332 -2779 -1280 -497 -1791 -2079
1100 -2079 -443 -332 -758 645 1037 389 1468 1970 460 971 2821 1262 -759 743 945 -1352 -1777
1117 -1777 -59 -833 -2484 -1296 -422 -2027 -1604 533 38 -846 1234 2007 550 390 2463 2377 35
1134 35 897 1380 377 -490 -718 -958 -1216 -1556 -1794 -1464 -976 -770 -1692 -494 740 325 380 1685 1997
1153 1997 677 1374 2332 1329 119 1350 1344 -1070 -1601 144 -1075 -3278 -1756 -158 -2034 -2597 26
1170 26 937 -498 -47 2196 2074 1172 1689 2057 1160 1219 833 163 -317 -695 -1045 -1587 -2082 -1932 -1652 -1217
1190 -1217 -1154 -1315 213 760 309 946 2466 2368 1040 1468 2973 1063 -323 475 841 -1185 -2144 -1103
$$ packed form
1066A871m3j496M9j70j788L90O76j367q72J537O78j893J246J951p29l79K040L11
1084B012j476P08J437j907p63J852m82k859M51J393j698j447J499P83j294k88
1100b079J636J11m26J403L92o48J079N02j510N11J850j559k021J502K02k297m25
1117a777J718p74j651J188Q74j605M23K137m95q84K080P73j457j60K073q6k342
1134C5Q62M83j003q67k28k40k58l40k38L30M88K06r22J198J234m15N5J305L12
1153A997j320O97R58j003j210J231ok414n31J745j219k203J522J598j876n63K623
1170B6R11j435M51K243j22r02N17L68q97N9l86o70m80l78l50n42m95J50K80M35
1190a217O3j61J528N47m51O37J520r8j328M28J505j910j386P98L66k026r59J041
$$ plain form
1208 -1103 -1209 -2768 -2020 -900 -1026 -1158 251 712 374 1058 1967 1586 1149 1639 2113 728 -66 808
1226 808 73 -1028 -1392 -1797 -1500 -1626 -2222 -1759 -729 -531 -696 124 1490 1290 1006 1836 1917 1672 1248
1245 1248 1606 689 233 85 -353 -1819 -1399 -1130 -1771 -1950 -1372 -504 -1007 -519 275 951 622 1160 1474
1264 1474 1572 1495 1323 1007 464 203 -103 -643 -829 -936 -1408 -1589 -1313 -1017 -783 -764 -503 64 839 804 946
1285 946 969 1825 1463 915 822 986 396 -100 -514 -731 -914 -1118 -1366 -1365 -1023 -812 -877 -342 275 486 58 692
1307 692 1474 1064 853 805 1422 978 287 -205 -48 -366 -677 -300 -782 -854 -1025 -850 -620 -599 -40 120 -238
1328 -238 689 1267 1209 868 1081 856 964 595 232 218 197 -451 -1180 -453 -970 -1457 -1236 -559 -671 -720 -3
1349 -3 377 202 581 1231 778 946 1352 1294 567 113 591 302 -322 -678 -333 -802 -1412 -961 -758 -863 -834
$$ packed form
1208a103j06j559P48J120j26j32J409M61l38O84R09l81m37M90M74j385p94Q74
1226H08p35j101l64m05K97j26n96M63J030J98j65Q20J366k00k84Q30Q1k45m24
1245A248L58r17m56j48m38j466M20K69o41j79N78Q68n03M88P94O76l29N38L14
1264A474R8p7j72l16n43k61l06n40j86j07m72j81K76K96K34J9K61N67P75l5J42
1285I46K3Q56l62n48r3J64n90m96m14k17j83k04k48JL42K11o5N35O17K11m28O34
1307F92P82m10k11m8O17m44o91m92J57l18l11L77m82p2j71J75K30K1N59J60l58
1328b38R27N78n8l41K13k25J08l69l63j4k1o48p29P27n17m87K21O77j12m9P17
1349cL80j75L79O50m53J68M06n8p27m54M78k89o24l56L45m69o10M51K03j05K9
$$ plain form
1370 -834 -339 59 365 33 835 933 1136 1046 1070 949 679 436 124 -150 -582 -860 -483 -925 -1217 -1036 -756
1391 -756 -946 -945 115 391 193 274 1223 1350 877 880 1255 779 303 232 42 -296 -771 -726 -917 -1174 -1240 -969
1413 -969 -808 -847 -213 69 223 433 1109 991 1118 914 1123 645 561 222 -55 -39 -571 -1162 -1219 -751 -1239
1434 -1239 -1481 -752 -277 -557 -353 16 865 639 902 1121 834 764 1167 803 288 318 -132 -645 -1059 -681
1454 -681 -1146 -1318 -968 -723 -442 -413 -103 109 596 779 644 903 1260 925 814 312 722 278 -615 -769
1474 -769 -585 -934 -1273 -851 -746 -987 -1004 -221 -138 88 534 936 498 927 1541 1084 395 769 835 128 -305
1495 -305 -153 -458 -1363 -969 -768 -929 -1018 -672 -752 -367 205 353 332 877 1228 1096 714 1047 829 217 -41
1516 -41 337 -520 -341 -217 -975 -1258 -659 -448 -898 -626 22 107 -259 637 1100 679 739 1415 960 487 606
$$ packed form
1370h34M95L98L06l32Q02R8K03r0K4j21k70k43l12k74m32k78L77m42k92J81K80
1391g56j90JJ060K76j98Q1R49J27m73LL75m76m76p1j90l38m75M5j91k57o6K71
1413i69J61l9O34K82J54K10O76j18J27k04K09m78q4l39k77J6n32n91n7M68m88
1434a239k42P29M75k80K04L69Q49k26K63K19k87p0M03l64n15L0m50n13m14L78
1454f81m65j72L50K45K81K9L10K12M87J83j35K59L57l35j11n02M10m44q93j54
1474g69J84l49l39M22J05k41j7P83Q3K26M46M02m38M29O14m57o89L74O6p07m33
1495c05J52l05r05L94K01j61q9L46q0L85N72J48k1N45L51j32l82L33k18o12k58
1516d1L78q57J79J24p58k83N99K11m50K72O48Q5l66Q96M63m21O0O76m55m73J19
$$ plain form
1537 606 327 -602 -216 -268 -968 -1259 -862 -742 -1026 -1078 -176 -450 -439 244 403 465 672 1026 628 390 735
1558 735 493 93 299 116 -845 -1253 -581 -358 -825 -766 -309 -520 -460 274 38 370 1019 937 522 1100 996
1579 996 846 196 128 751 -285 -750 -263 -757 -1000 -731 -707 -1111 -655 -229 -395 -211 233 612 391 930
1599 930 1236 784 340 813 542 -45 67 -88 -380 -607 -357 -597 -826 -778 -314 -641 -634 348 369 -33 429
1620 429 828 477 647 723 531 310 521 296 -236 -405 -137 -674 -1028 -563 -288 -936 -909 78 236 -84 -104
1641 -104 290 90 424 1108 629 235 787 690 -189 -57 466 -322 -487 -661 -131 -817 -830 -317 -137 -260 216
1662 216 132 376 614 848 696 639 1078 539 -75 270 619 -216 -361 -318 -335 -718 -790 -656 -934 -596 -87 -218
1684 -218 -137 445 463 329 474 1208 625 394 573 556 151 -163 -3 -640 -494 -762 -505 -901 -826 -387 -659
$$ packed form
1537F06k79r29L86n2p00k91L97J20k84n2R02k74J1O83J59O2K07L54l98k38L45
1558G35k42m00K06j83r61m08O72K23m67N9M57k11O0P34k36L32O49q2m15N78j04
1579I96j50o50o8O23j036m65M87m94k43K69K4m04M56M26j66J84M44L79k21N39
1599I30L06m52m44M73k71n87J12j55k92k27K50k40k29M8M64l27PR82K1m02M62
1620D29L99l51J70P6j92k21K11k25n32j69K68n37l54M65K75o48K7R87J58l20k0
1641a04L94k00L34O84m79l94N52r7q79J32N23p88j65j74N30o86j3N13J80j23M76
1662B16q4K44K38K34j52n7M39n39o14L45L49q35j45M3j7l83p2J34k78L38N09j31
1684b18Q1N82J8j34J45P34n83k31J79j7m05l14J60o37J46k68K57l96P5M39k72
$$ plain form
1705 -659 -473 419 569 6 402 948 987 636 753 605 506 412 46 -135 -600 -486 -624 -934 -624 -580 -727
1726 -727 -814 -197 15 70 399 641 739 1013 578 503 571 576 128 -144 -239 -401 -275 -1161 -793 -525 -613 -754 -569
1749 -569 -337 -53 229 228 549 677 640 606 588 673 601 78 -98 -171 -316 -638 -657 -602 -763 -480 -445 -429 -97 213
1773 213 231 252 733 529 540 640 863 643 396 50 195 -350 -549 -806 -787 -591 -760 -751 -436 -150 -16 -195
1795 -195 -147 122 862 320 551 517 749 529 538 158 392 -250 -411 -417 -505 -470 -810 -948 -556 -375 -225 -116 53
1818 53 254 445 298 347 444 623 490 169 532 193 -35 -203 -166 -440 -240 -812 -764 -449 -296 -275 -581 -151
1840 -151 125 116 276 530 517 505 246 437 217 245 220 99 -99 -111 -351 -276 -839 -479 -435 -265 -121 115 107 94
1864 94 212 410 669 351 459 480 615 226 237 369 -327 -378 -642 -542 -518 -277 -458 -439 -279 -164 -378 18
$$ packed form
1705f59J86Q92J50n63L96N46L9l51J17j48r9r4l66j81m65J14j38l10L10M4j47
1726g27q7O17K12N5L29K42R8K74m35p5O8Nm48k72r5j62J26q86L68K68q8j41J85
1749e69K32K84K82jL21J28l7l4j8Q5p2n23j76p3j45l22j9N5j61K83L5J6L32L10
1773B13J8K1M81k04J1J00K23k20k47l46J45n45j99k57J9J96j69RL15K86J34j79
1795a95M8K69P40n42K31l4K32k20Rl80K34o42j61oq8L5l40j38L92J81J50J09J69
1818E3K01J91j47M9R7J79j33l21L63l39k28j68L7k74K00n72M8L15J53K1l06M30
1840a51K76rJ60K54j3j2k59J91k20K8k5j21j98j2k40P5n63L60M4J70J44K36qj3
1864I4J18J98K59l18J08K1J35l89J1J32o96n1k64J00K4K41j81J9J60J15k14L96
$$ plain form
1886 18 126 246 424 376 717 379 411 193 102 301 -41 -301 -298 -297 -380 -492 -683 -512 -300 -255 -359 45 80 487
1910 487 572 537 608 598 463 632 118 424 234 -214 -329 -578 -350 -529 -550 -570 -240 -279 -379 82 175 491 373
1933 373 313 738 797 645 298 553 292 253 25 -155 -286 -855 -624 -431 -519 -574 -288 -283 -179 131 209 326 457
1956 457 710 415 390 -69 536 97 -201 -33 -167 -529 -505 -372 -580 -618 -511 -493 -241 -203 185 17 477 629
1978 629 489 608 497 496 178 406 64 151 -134 -298 -418 -618 -377 -744 -412 -601 -371 -275 -11 168 559
1999 559 716 300 596 474 479 380 217 -177 -250 -71 -515 -481 -533 -141 -619 -704 -245 -123 -107 555 320 432 498
2022 498 596 310 185 443 327 139 46 15 -414 -323 -89 -352 -377 -343 -327 -166 -359 -23 135 222 341 641 301
2045 301 336 849 388 332 531 206 -273 -74 -143 1 -513 -227 -269 -478 -245 -434 -387 -173 -129 295 370 428 306
$$ packed form
1886A8J08J20J78m8L41l38L2k18r1J99l42k60LJq3j12j91J71K12M5j04M04L5M07
1910D87Q5l5P1j0j35J69n14L06j90m48j15k49K28j79k1k0L30l9j00M61R3L16j18
1933C73o0M25N9j52l47K55k61l9k28j80j31n69K31J93q8n5K86NJ04L10P8J17J31
1956D57K53k95k5m59O05m39k98J68j34l62K4J33k08l8J07J8K52L8L88j68M60J52
1978F29j40J19j11jl18K28l42Q7k85j64j20k00K41l67L32j89K30R6K64J79L91
1999E59J57m16K96j22Nr9j63l94p3J79m44L4n2L92m78q5M59J22J6O62k35J12O6
2022D98R8k86j25K58j16j88r3l1m29R1K34k63k5L4J6J61j93L36J58Q7J19L00l40
2045C01L5N13m61n6J99l25m79J99o9J44n14K86m2k09K33j89M7K14M4M24P5N8j22
$$ plain form
2068 306 581 420 521 505 245 -229 55 318 -339 -18 -450 -346 -347 -62 -328 -352 -79 96 -53 139 316
2089 316 268 294 295 305 73 202 98 -174 -114 -44 -168 -299 -285 -343 -627 -532 21 -264 -352 -176 161 187 184 417 17
2114 17 410 311 354 -35 2 316 -164 -414 -277 -169 -124 -711 -162 -364 -125 -197 -203 -15 242 344 298 335 315 237
2138 237 111 486 171 247 10 102 -119 -527 -616 -137 -471 -174 93 -286 -492 105 403 428 272 385 764
2159 764 390 504 431 285 -38 97 -276 -196 -244 -424 -286 -190 -128 -509 -209 -217 -146 -64 312 178 510 390 194
2182 194 506 339 302 236 249 -121 -325 -497 -725 -263 -298 -238 -496 -200 -129 -13 -175 163 303 456 597 161
2204 161 534 327 -47 188 -401 14 -331 -433 -350 -393 -253 -632 -22 -48 -193 -19 -155 189 397 315 289 526
2226 526 515 486 158 -155 -63 191 -213 -474 -168 -272 -514 -392 -379 -482 45 -200 420 91 157 368 310 513
$$ packed form
2068C06K75j61J01j6k60m74K84K63o57L21m32J04jK85k66k4K73J75j49J92J77
2089C16m8K6JJ0k32J29j04k72O0P0j24j31J4n8k84R5N53k85q8J76L37K6lK33m00
2114A7L93r9M3l89L7L14m80k50J37J08M5n87N49k02K39p2oJ88K57J02m6L7k0p8
2138B37j26L75l15P6k37R2k21m08q9M79l34K97K67l79k06N97K98K5j56J13L79
2159G64l74J14p3j46l23J35l73Q0m8j80J38R6O2l81L00qP1Q2L76j34L32j20j96
2182A94L12j67l7o6J3l70k04j72k28M62l5O0k58K96P1J16j62L38J40J53J41m36
2204A61L73k07l74K35n89M15l45j02Q3m3J40l79O10k6j45J74j36L44K08q2k6K37
2226E26j1k9l28l13R2K54m04k61L06j04k42J22J3j03N27k45O20l29O6K11n8K03
$$ plain form
2248 513 317 -41 302 17 -16 -80 -222 -637 -474 -411 -339 -267 -460 -450 -263 -136 192 570 115 265 92 167
2270 167 632 211 254 130 360 4 -504 -81 -263 -311 -438 -393 -453 -174 -125 -89 -24 437 186 292 234 398 210
2293 210 107 32 402 317 67 64 -83 -149 -306 -81 -103 -299 36 -114 -296 91 -77 125 341 335 145 175 367
2316 367 245 203 77 70 236 -87 -306 -307 -267 -427 -219 -288 -382 251 -176 80 55 286 245 52 86 165 163 247 -84
2341 -84 -174 -75 -348 -178 -318 -291 -466 -221 -391 -68 -150 -101 -18 143 261 68 288 251 295 303 54 90 -64 -11
2365 -11 -49 -20 -151 -447 -518 -563 -519 -190 -335 23 -11 -299 197 165 105 515 144 315 313 461 3 32 -27 59 -109
2390 -109 -382 -438 -414 -229 -111 -267 -134 1 18 176 111 279 446 263 498 610 553 266 4 135 -84 -81
2412 -81 81 -117 -353 -156 -396 -359 -96 -339 -98 -136 81 -131 218 227 340 355 241 229 266 331 26 -30 -309
$$ packed form
2248E13j96l58L43k85l3o4j42m15J63O3P2P2j93J0J87J27L28L78m55J50j73P5
2270A67M65m21M3j24K30l56n08M23j82m8j27M5o0K79M9L6O5M61k51J06n8J64j88
2293B10j03p5L70q5k50lj47o6j57K25k2j96L35j50j82L87j68K02K16oj90L0J92
2316C67j22m2j26pJ66l23k19jM0j60K08o9r4O33m27K56k5K31m1j93L4P9kQ4l31
2341h4r0R9k73J70j40K7j75K45j70L23q2M9Q3J61J18j93K20l7M4Qk49L6j54N3
2365a1l8K9j31k96p1m5M4L29j45L58l4k88M96l2o0M10l71J71kJ48m58K9n9Q6j68
2390a09k73n6K4J85J18j56J33J35J7J58o5J68J67j83K35J12n7k87k62J31k19L
2412h1J62j98k36J97k40L7K63k43K41l8K17k12L49RJ13J5j14j2L7O5l05n6k79
$$ plain form
2435 -309 -193 -391 -203 -346 -129 -166 -289 122 211 180 383 600 278 431 311 245 224 28 -87 12 -76 -284
2457 -284 -261 -208 -90 -416 -124 -184 -85 -234 -66 180 -117 -91 395 194 312 318 388 55 90 24 4 -401 102 -214
2481 -214 -408 -243 -168 -174 -249 -185 66 81 -158 314 357 37 259 259 320 163 106 -137 -100 60 -144 -386 -219 -23
2505 -23 -172 -214 -252 -37 -105 230 176 -55 223 274 362 356 196 223 46 24 93 154 -147 -106 -345 -166 -171 -119 -263 -23
2531 -23 -143 -93 226 201 156 281 274 421 506 121 266 -119 48 -74 196 -81 -150 -376 -327 -181 39 -137 -85
2554 -85 -90 109 194 331 99 193 11 437 265 14 274 -28 170 129 -243 -168 33 -446 -432 -71 -148 -340 -128
2577 -128 150 8 -120 114 107 223 343 283 222 199 72 -126 -233 -14 -29 -240 -300 22 -177 -234 -126 -111 171
2600 171 67 205 -54 45 178 112 321 304 187 -21 -39 -70 27 -167 -74 -122 103 -215 29 -136 145 -74 -320
$$ packed form
2435c09J16j98J88j43K17l7j23M11Q9l1K03K17l22J53j20o6k1j96j15R9q8k08
2457b84K3N3J18l26K92o0R9j49J68K46k97K6M86k01J18OP0l33L5o6k0m05N03l16
2481b14j94J65P5op5O4K51J5k39M72M3l20K22%O1j57n7k43L7J60k04k42J67J96
2505b3j49m2l8K15o8L35n4k31K78N1Q8oj60K7j77k2O9O1l01M1k39J79nN2j44K40
2531b3j20N0L19k5m5J25pJ47Q5l85J45l85J67j22K70k77o9k26M9J46K20j76N2
2554h5nJ99Q5J37k32R4j82M26j72k51K60l02J98m1l72P5K01m79J4L61p7j92K12
2577a28K78j42j28K34pJ16J20o0o1k3j27j98j07K19j5k11o0L22j99n7J08J5K82
2600A71j04J38k59R9J33o6K09j7j17k08j8l1R7j94R3m8K25l18K44j65K81k19k46
$$ plain form
2623 -320 67 14 -19 239 163 130 184 -4 251 143 -90 -64 -256 31 -221 -62 -275 -218 -17 100 287 217 219
2646 219 219 43 166 542 160 327 70 391 111 -99 85 -284 9 -343 -120 58 -362 48 -297 108 30
2667 30 263 58 163 219 20 -8 246 378 177 148 -268 -133 -230 -180 -89 -64 -184 -166 -413 -338 -305 56 -244 140
2691 140 -81 377 106 327 485 246 127 168 27 30 62 -336 -83 25 -93 -177 -297 -100 -159 -67 -39 150 270
2714 270 31 119 120 67 107 53 417 214 -41 -301 -91 -291 -138 -214 -151 -335 -173 -322 -167 -102 172 111 305
2737 305 27 177 -135 63 104 3 -42 20 2 -275 70 -276 -161 -484 -417 69 -406 31 33 -383 81 -126
2759 -126 -291 207 328 37 25 201 329 69 95 -5 -70 -321 34 -243 7 -70 -245 -69 112 18 -55 141
2781 141 53 238 210 361 155 -55 -23 -31 -50 -313 19 -104 -167 -366 -164 155 -303 -88 -145 -104 -72 -24 1 -13
$$ packed form
2623c20L87n3l3K58p6l3N4j88K55j08k33K6j92K87k52J59k13N7K01J17J87p0K
2646B19%j76J23L76l82J67k57L21k80k10J84l69K93l52K23J78m20M10l45M05p8
2667C0K33k05J05N6j99k8K54J32k01k9m16J35r7N0R1K5j20J8k47P5L3L61l00L84
2691A40k21M58k71K21J58k39j19M1j41LL2l98K53J08j18q4j20J97n9R2K8J89J20
2714B70k39Q8Jn3M0n4L64k03k55k60K10k00J53p6O3j84J62j49J55O5K74o1J94
2737C05k78J50l12J98M1j01m5O2j8k77L45l46J15l23O7M86m75M37Km16M64k07
2759a26j65M98J21k91j2J76J28k60K6j00o5k51L55k77K50p7j75J76J81r4p3J96
2781A41q8J85k8J51k06k10L2qj9k63L32j23o3j99K02L19m58K15n7M1L2M8K5j4
$$ plain form
2805 -13 160 234 -17 157 15 41 -179 -137 -83 -432 -216 -79 -20 -129 -62 -61 -217 188 198 372 101 -153 224
2828 224 473 268 363 24 -141 36 -65 -105 -178 -258 -26 -12 -393 -90 -180 -305 -125 -317 2 -265 220 44
2850 44 -42 99 140 421 234 78 -20 40 -191 -69 -149 -61 -344 -273 88 -207 -43 -147 102 247 61 295 -75
2873 -75 90 180 30 158 -141 15 -117 217 -112 162 -308 -257 -142 24 -154 -197 -100 -46 120 127 173 343 112
2896 112 148 191 204 131 -90 218 107 -58 -95 -135 -125 -189 -189 -201 -24 -16 144 -75 294 44 -33 2 255 223 140 136
2922 136 -335 -96 -79 -440 -167 -61 -304 -281 -255 -153 -190 -397 -211 55 147 158 164 -56 12 94 230 297 50 6
2946 6 28 157 -146 -349 -260 -285 -192 45 -244 -23 -66 14 125 -89 236 205 -134 75 28 136 -123 79 -138
2969 -138 -7 -154 -294 60 -114 -262 46 61 -121 193 -230 30 56 132 121 87 -45 12 131 -64 67 24
$$ packed form
2805a3J73P4k51J74j42K6k20M2N4l49K16J37N9j09O7Jj56M05J0J74k71k54L77
2828B24K49k05R5l39j65J77j01m0p3q0K32J4l81L03r0j25J80j92L19k67M85j76
2850D4q6J41M1K81j87j56r8O0k31J22q0Q8k83P1L61k95J64j04K49J45j86K34l70
2873g5J65R0j50J28k99J56j32L34l29K74m70N1J15J66j78m3R7N4J66PM6J70k31
2896A12L6M3J3p3k21L08j11j65l7m0J0o4%j2J77QJ60k19L69k50p7L5K53l2q3m
2922A36m71K39J7l61K73J06k43K3K6J02l7k07J86K66R2J1Ok20O8Q2J36O7k47m4
2946FK2J29l03k03Q9k5R3K37k89K21m3Q0J11k14L25l1l39K09m7J08k59K02k17
2969a38J31j47j40L54j74j48L08J5j82L14m23K60K6P6j1l4j32N7J19j95J31m3
$$ plain form
2991 24 -15 119 -70 62 -42 18 -6 -110 -84 -122 -55 278 251 -12 94 227 401 37 -88 37 -70 145 -148
3014 -148 -228 -455 60 34 -38 -131 -271 109 261 27 -169 282 75 227 215 65 -84 103 -16 136 164 147
3036 147 38 -159 -168 -145 -57 -128 -309 -16 -68 108 -132 72 -38 -47 -18 391 -108 -184 -15 -39 11 123 106 -94
3060 -94 -25 -65 -428 -69 256 95 -202 -174 46 -14 -24 -5 102 173 172 220 70 482 -322 44 17 -380 -177 153
3084 153 -107 -96 86 -232 148 -206 -100 50 -30 22 161 95 486 -78 -25 -28 204 16 -126 -49 -80 -252 -323
3107 -323 -73 -244 -385 191 -156 56 268 -44 24 132 140 86 32 141 -102 -117 280 -38 -30 -238 -38 41 -212
3130 -212 -459 -172 -376 108 36 -48 320 64 68 99 -182 375 -120 -12 10 344 -73 -163 -261 54 -305 -45 -174
3153 -174 -46 -26 12 -39 77 242 -27 35 1 9 -48 313 179 331 121 312 39 -197 -209 -196 6 -116 -220
$$ packed form
2991B4l9J34j89J32j04O0k4j04K6l8O7L33k7k63J06J33J74l64j25J25j07K15k93
3014a48q0k27N15k6p2r3j40L80J52k34j96M51k07J52j2j50j49J87j19J52K8j7
3036A47j09j97rK3Q8p1j81K93n2J76k40K04j10rK9M09m99p6J69k4N0J12j7k00
3060i4O9m0l63L59L25j61k97K8K20o0j0J9J07P1jM8j50M12q04L66k7l97K03L30
3084A53k60J1J82l18L80l54J06J50q0N2J39o6L91n64N3lK32j88j42P7l1j72p1
3107c23K50j71j41N76l47K12K12l12O8J08Qn4n4J09k43j5L97l18Qk08K00P9k53
3130b12k47K87k04M84p2q4L68k56ML1k81N57m95J08K2L34m17r0r8L15l59K60j29
3153a74J28K0L8n1J16J65k69O2l4Qn7L61j34J52k10J91k73k36j2J3K02j22j04
$$ plain form
3176 -220 -228 -131 -92 -70 -45 88 -185 111 93 213 240 125 219 -127 -65 138 61 -282 117 -201 44 -105 -178 -136
3200 -136 86 41 -129 318 109 339 -16 257 81 252 125 101 321 188 -170 -35 -374 59 -80 -70 -29
3221 -29 -83 -54 181 -216 96 79 64 132 156 265 217 -2 -279 129 157 -64 -214 207 -26 56 -8 -323 -386 -211
3245 -211 -448 -28 174 -11 254 -98 14 227 149 49 -26 -171 -195 127 -59 51 -86 -78 104 -120 -60 -189
3267 -189 77 -86 -69 47 310 79 -44 84 57 58 45 58 8 -250 -198 -238 -48 -149 -130 -171 -105 -118 -123 39 -79
3292 -79 298 -96 -5 -15 110 -166 147 2 143 -170 156 100 -306 -187 -265 -31 138 -70 -242 71 -76 -218
3314 -218 112 74 21 87 -151 121 -212 -96 152 251 181 -148 44 -82 -318 -396 15 -68 -208 -120 -88 -73 27
3337 27 -56 24 30 -58 185 109 139 62 -55 -166 247 156 74 -150 -207 186 -322 15 133 -21 -147 -11 -36 -40 -25
$$ packed form
3176b20qR7L9K2K5J33k73K96j8J20K7j15R4l46O2K03p7l43L99l18K45j49p3M2
3200a36K22m5j70M47k09K30l55K73j76J71j27k4K20j33l58J35l39M33j39J0M1
3221b9n4K9K35l97L12j7j5O8K4J09m8k19k77M08K8k21j50M21k33Q2o4l15o3J75
3245b11k37M20K02j85K65l52J12K13p8j00p5j45k4L22j86J10j37QJ82k24O0j29
3267a89K66j63J7J16K63k31j23J28k7Jj3J3n0k58N2m0J90j01J9m1O6j3nJ62j18
3292g9L77l94R1j0J25k76L13j45J41l13L26n6m06J19p8K34J69k08j72L13j47j42
3314b18L30l8n3O6k38K72l33J16K48R9p0l29J92j26k36p8M11q3j40Q8L2J5J00
3337B7q3Q0Oq8K43p6L0p7j17j11M13r1q2k24n7L93n08L37J18j54j26J36k5mJ5
$$ plain form
3362 -25 57 240 118 200 12 137 -12 -93 -8 -37 111 -85 61 -68 -154 78 -148 114 -5 -243 127 -52
3384 -52 165 128 -2 -61 -58 0 13 -50 110 62 136 52 -164 -274 76 43 39 -195 116 148 164 107 -62 -283 194 -111
3410 -111 236 14 26 207 -252 23 -121 -47 -336 -200 -373 -102 -142 -61 -32 255 -94 29 17 54 -44 -56 84
3433 84 127 -10 -35 -77 186 -318 -35 -92 -277 56 -4 -76 68 -11 -194 6 116 199 84 34 237 22 143
3456 143 66 257 -76 -34 -173 -35 180 -306 42 -276 30 -316 204 156 10 -109 -159 140 118 198 -106 24
3478 24 124 -222 88 218 -39 321 1 232 -119 -243 -117 257 -129 -192 131 220 51 78 -34 223 -120
3499 -120 -104 -13 29 12 62 -60 -66 -190 9 87 -260 33 256 -12 5 -88 -23 71 -147 198 -292 -34 34 95 193
3524 193 142 220 -83 -114 -82 46 -260 357 -166 -218 -380 -38 186 -144 173 9 242 29 134 -283 69 -2
$$ packed form
3362b5Q2J83j22Q2j88J25j49q1Q5k9J48j96J46j29q6K32k26K62j19k38L70j79
3384e2K17l7j30n9LN8J3o3J60m8P4q4k16j10L50l3mk34L11L2J6n7j69k21M77l05
3410a11L47k22J2J81m59K75j44P4k89J36j73K71m0Q1K9K87l49J23j2L7r8j2J40
3433H4M3j37k5m2K63n04K83n7j85L33o0p2J44p9j83K00J10Q3j15n0K03k15J21
3456A43p7J91l33M2j39J38K15m86L48l18L06l46N20m8j46j19n0K99k2Q0l04J30
3478B4J00l46L10J30k57L60l20K31l51j24J26L74l86o3L23Q9j69K7j12K57l43
3499a20J6R1M2j7N0j22oj24J99P8l47K93K23k68J7r3O5R4k18L45m90K58O8O1R8
3524A93n1P8l03l1L2J28l06O17n23n2j62L42K24l30L17j64K33k13J05m17L52p1
$$ plain form
3546 -2 -64 92 59 -37 150 -166 -83 -173 -140 9 90 -77 -77 -101 14 127 133 -28 -35 -12 14 10 84 -29 16 182 -218
3573 -218 102 -341 -178 86 125 154 -41 -15 109 -5 72 199 -255 -295 270 -10 -105 41 -116 -78 56 69 -49
3596 -49 -116 76 -244 -299 -36 -84 105 -185 -238 -39 -167 362 176 237 93 223 67 -217 115 122 27 -245 -1
3619 -1 164 -6 -57 -369 -9 85 -4 -109 74 348 -225 -9 -53 -177 -124 -120 -51 -25 -184 -112 62 162 -58 -65 -3
3644 -3 -15 -61 -119 -149 121 15 70 -141 -85 25 90 -58 -23 -58 207 -53 110 145 85 78 -207 -313 -100 99 -90
3669 -90 -84 218 -74 45 112 -76 -135 -26 85 -203 -8 -44 189 -24 11 110 17 -199 16 86 -251 179 -97
3692 -97 65 82 9 37 -58 146 32 162 247 207 -65 -6 -135 -438 -180 -316 -126 262 -139 -127 131 -16 -59
3715 -59 -66 -90 208 64 51 90 158 -162 125 171 113 -81 42 -122 -53 -38 125 46 429 56 128 320 -107 -120 90
$$ packed form
3546bo2J56l3r6J87l16Q3r0L3J49Q1j67%k4J15J13Oj61pK3K6mP4j13M5J66m00
3573b18L20m43J63K64L9K9j95K6J24j14P7J27m54m0N65k80r5J46j57L8J34J3j18
3596d9o7J92l20n5K63m8J89k90n3J99j28N29j86O1j44J30j56k84L32Pr5k72K44
3619aJ65j70n1l12L60R4q9j05J83K74n73K16m4j24N3MO9K6j59P2J74J00k20pO2
3644cj2m6n8l0K70j06N5k11N6J10O5j48L5l5K65k60J63L5o0pk85j06K13J99j89
3669i0OL02k92J19O7j88n9J09J11k88J95l6K33k13L5R9r3k16K15P0l37M30k76
3692i7J62J7p3K8r5K04j14J30Q5m0k72N9j29l03K58j36J90L88m01J2K58j47m3
3715e9pk4K98j44j3L9O8l20K87M6n8j94J23j64O9J5J63p9L83l73P2J92m27j3K10
$$ plain form
3740 90 188 201 -319 -42 147 72 211 -67 239 -197 -96 -202 -188 236 -113 -226 146 -150 -459 39 26 39
3762 39 -332 122 42 -51 -33 -119 -155 -183 -165 -85 -159 103 -166 127 243 38 -127 168 69 -61 -132 -55 -138 28 -2
3787 -2 128 144 114 204 -55 -17 -44 -170 -211 7 -112 -136 -12 101 -149 110 448 -74 30 103 116 -45 -231 257
3811 257 120 -69 -194 159 128 -98 -12 11 60 23 202 109 -20 -80 -33 -217 -29 370 130 165 25 28 110 58
3835 58 -45 1 3 292 26 -158 9 -108 -64 61 73 37 -113 -111 -289 205 107 8 112 -86 -173 211 -188 -51
3859 -51 92 283 23 -84 32 50 190 18 -87 248 22 -50 -50 -56 30 -291 -139 107 140 -55 -182 196 -84
3882 -84 144 -123 8 -8 -47 88 -67 -186 231 14 172 -19 144 310 -31 207 27 4 -323 -24 69 99
3904 99 -256 32 98 182 147 -65 -18 183 -6 215 -64 113 181 -143 260 -192 268 77 79 140 87 -82 242
$$ packed form
3740I0R8J3n20K77J89p5J39k78L06m36J01j06J4M24l49j13L72k96l09M98j3J3
3762C9l71M54q0r3J8q6l6k8J8Q0p4K62k69K93J16k05j65K95r9j30p1P7q3J66l0
3787bJ30J6l0R0k59L8k7j26m1K18j19k4J24J13k50K59L38n22J04P3J3j61j86M88
3811B57j37j89j25L53l1k26Q6K3M9l7J79r3j29o0M7j84J88L99k40L5j40LQ2n2
3835E8j03M6KK89k66j84J67j17M4J25J2l6j50Kj78M94r8r9J04j98q7L84l99J37
3859e1J43J91k60j07J16J8J40j72j05L35k26p2%oQ6l21J52K46L3j95j27L78k80
3882h4K28k67J31j6l9J35j55j19M17k17J58j91J63J66l41K38j80k3l27K99R3L0
3904I9l55K88O6Q4l5k12M7K01j89K21k79J77O8l24M03m52M60j91KO1n3j69L24
$$ plain form
3927 242 9 -78 -161 41 -265 51 50 98 -349 -92 -215 51 -406 236 -57 272 113 116 222 118 94 6 68
3950 68 158 0 -60 -167 -39 23 -14 44 107 129 -26 -50 134 17 219 77 55 -128 -102 -22 -105 -115 -45 -112 48
3975 48 202 -63 6 154 159 -122 11 -61 -204 113 277 140 307 159 -43 172 -8 -159 -206 -54 -112 -29 299
3998 299 -99 131 98 -91 3 -97 228 -19 -76 10 -30 29 367 -62 57 -110 -86 -97 -83 164 -287 -40 199
4021 199 113 -1 35 -263 270 -104 -168 -41 -299 102 57 330 10 277 -159 -82 -11 -102 -116 -72 -88 -76 163 -356
4045 -356 124 269 -39 -8 105 86 -339 -108 -55 -45 -83 156 68 -36 -196 -290 51 -157 -13 -57 -99 91 -251
4068 -251 397 67 107 42 -229 207 252 13 106 196 -2 70 166 -68 -80 -98 169 -9 -54 102 135 -59 16 -73
4092 -73 242 47 -334 -32 292 -89 -2 71 -123 -61 -79 -187 -177 40 -9 -306 -64 -42 -61 -51 -110 -66 32 -73
$$ packed form
3927B42k33q7q3K02l06L16jM8m47K57j23K66m57O42k93L29j59LJ06j04k4q8O2
3950F8R0j58o0j07J28O2l7N8O3K2j55k4J84j17K02j42k2j83K6Q0q3j0P0o7J60
3975D8J54k65O9J48Nk81J33p2j43L17J64j37J67j48k02K15j80j51m7J52n8Q3L28
3998B99l98K30l3j89R4j00L25k47n7Q6m0N9L38m29J19j67K4j1J4K47m51K47K39
4021A99q6j14L6k98N33l74o4J27k58M01m5K73l20K67m36P7P1r1j4M4j6J2K39n19
4045c56M80J45l08L1J13j9m25K31N3J0l8K39q8j04j60r4L41k08J44m4m2J90l42
4068b51O48l30M0o5k71M36M5k39R3R0j98P2R6k34j2j8K67j78m5J56L3j94P5q9
4092g3L15j95l81L02L24l81Q7P3j94O2j8j08J0K17m9k97K42K2j9J0n9M4R8j05
$$ plain form
4116 -73 22 -142 -180 35 63 7 -60 -177 -181 -40 -88 -164 236 -30 86 28 -56 -22 -127 -152 -55 42 -54 -111 -78 298
4142 298 -409 -77 27 463 -90 -69 185 10 224 -268 -183 -71 -298 158 -205 56 -38 141 379 70 199
4163 199 212 -79 -284 -108 4 95 34 107 -394 -203 -274 -73 68 59 -41 -219 -196 50 -52 -121 145 141 120 -261
4187 -261 -121 -148 -22 107 -63 -188 -328 128 -187 -337 -26 -207 33 -115 -125 80 -259 18 252 83 102
4208 102 45 -269 -40 35 7 -180 -83 -306 26 -43 30 46 -193 157 -102 -97 64 111 147 403 182 96 205 -85
4232 -85 127 -159 26 71 -161 6 119 94 -27 176 189 -102 -259 -15 -236 40 -20 -34 -90 -52 -101 65 3
4255 3 -182 -121 -14 -12 381 110 -3 131 16 131 99 195 -163 -163 -290 37 -77 142 -158 203 -195 -75 -14
4278 -14 204 -3 186 50 91 -145 -218 -222 -21 63 108 185 -190 90 -10 239 92 -102 -139 -27 -150 20 105
$$ packed form
4116g3R5j64l8K15K8n6o7j17mJ41m8p6M00k66J16n8q4L4j05k5R7R7r6n7L3L76
4142B98p07L32J04M36n53K1K54j75K14m92Q5J12k27M56l63K61r4J79K38l09J29
4163A99J3k91k05J76J12R1o1P3n01J91p1K01J41rj00j78K3K46j02o9K66mk1l81
4187b61J40k7J26J29j70j25j40M56l15j50L11j81K40j48j0K05l39K77K34j69J9
4208A02n7l14K29P5k8j87R7k23L32o9P3J6k39L50k59NJ61M7L6K56k21q6J09k90
4232h5K12k86J85M5k32J67J13k5j21K03J3k91j57K44k21K76o0j4n6L8m9J66o2
4255Cj85O1J07KL93k71j13J34j15J15l2R6l58%j27L27j14K19l00L61l98J20O1
4278a4K18k07J89j36M1k36p3mK01Q4M5P7l75K80j00K49j47j94l7J12j23J70Q5
$$ plain form
4301 105 71 -176 93 53 -26 114 -45 -151 -158 34 -107 -169 17 120 224 -243 138 262 150 221 -199 -85
4323 -85 80 -139 5 -36 -69 -74 9 258 -9 0 -92 231 -190 6 161 -36 307 -11 -236 49 -250 109 -284
4346 -284 -88 215 -254 45 -88 10 -101 -26 -30 -66 180 -40 215 375 307 -85 186 34 128 -76 -22 -65 128
4369 128 87 150 16 102 86 -50 216 4 59 -76 -125 -161 -38 228 149 -284 -173 91 66 -119 -103 -29 -238 178
4393 178 190 -44 201 -227 -97 -59 -45 -70 264 -230 -178 -17 -96 -81 -20 -126 99 50 -235 -176 61 -127 -93 -45
4417 -45 -92 -88 294 93 33 -123 153 32 200 75 -214 343 63 69 -220 -269 -153 -557 -122 -46 133 -1 187
4440 187 -101 -98 -50 -126 -87 -198 159 -410 -52 180 76 61 -149 169 -74 193 88 -153 -55 -42 43 117 -191
4463 -191 166 -5 -294 -276 -275 -72 28 -192 -302 -144 -361 -21 -126 -160 -73 28 -31 18 257 -141 -242 97
$$ packed form
4301A05l4k47K69m0p9J40j59j06pJ92j41o2J86J03J04m67L81J24j12P1m20J14
4323h5J65k19J44m1l3nQ3K49k67Rr2L23m21J96J55j97L43l18k25K85k99L59l93
4346b84J96L03m69K99j33R8j11P5ml6K46k20K55J60o8l92K71j52R4k04N4m3J93
4369A28m1O3j34Q6j6j36K66k12N5j35m9l6J23K66p9m33J11K64k5j85J6P4k09M16
4393A78J2k34K45m28J30L8J4k5L34m94N2J61p9J5O1j06K25m9k85N9K37j88L4M8
4417d5m7ML82k01o0j56K76j21J68j25k89N57k80Ok89m9J16m04M35P6J79j34J88
4440A87k88LM8p6L9j11L57n69L58K32j04j5k10L18k43K67j05k41R8J3Q5P4l08
4463a91L57j71k89J8JK03J00k20j10J58k17L40j05l4Q7J01n9M9K39l98j01L39
$$ plain form
4485 97 -71 258 -144 -72 173 -45 65 -81 -132 -48 -260 140 49 -139 -126 199 -38 -67 -36 -3 -28 87 -145
4508 -145 -81 -62 -46 -192 8 20 -5 88 222 45 237 14 31 201 49 -188 119 162 175 -100 -158 74 -156
4531 -156 -3 129 -310 77 -70 47 -85 22 -297 -106 111 -31 -59 -69 175 177 211 -120 -58 59 14 139
4553 139 -222 -332 -414 -138 -190 -250 -127 -182 10 178 -22 -25 -103 -108 -147 188 -66 24 -65 -141 -89 -65 23 5 -85 -174
4579 -174 88 -61 317 -192 -187 -63 4 -223 55 -93 63 -62 -155 -210 105 -166 -212 46 -78 -23 -74 -144 -41
4602 -41 185 205 -251 -138 39 -17 60 237 151 -19 194 106 19 -89 -78 49 -105 -353 8 28 -46 -153 336
4625 336 -115 55 -188 -33 188 112 -212 176 106 92 0 80 -165 -166 83 -56 147 -307 -157 174 94 88 -214
4648 -214 -10 228 463 46 8 93 -34 223 200 169 -124 -137 26 -99 -53 -108 151 88 29 -285 -185 -103 10
$$ packed form
4485I7j68L29m02P2K45k18J10j46n1Q4k12M00r1j88J3L25k37k9L1L3k5J15k32
4508a45O4J9J6j46K00J2k5R3J34j77J92k23J7J70j52k37L07M3J3k75n8K32k30
4531a56J53J32m39L87j47J17j32J07l19J91K17j42k8j0K44KL4l31O2J17m5J25
4553A39l61j10q2K76n2o0J23n5J92J68k00lp8nl9L35k54R0q9p6N2K4Q8j8r0q9
4579a74K62j49L78n09NJ24O7k27K78j48J56j25r3n5L15k71m6K58j24N5n1p0J03
4602d1K26K0m56J13J77n6P7J77q6j70K13q8q7j08J1J27j54k48L61K0p4j07M89
4625C36m51J70k43J55K21p6l24L88p0j4r2Q0k45jK49j39K03m54J50L31q0ol02
4648b14K04K38K35m17l8Q5j27K57k3l1k93j3J63j25M6n5K59o3n9l14J00Q2J13
$$ plain form
4671 10 -130 54 -43 -30 23 29 171 214 187 -13 41 -64 -54 -76 44 -173 -53 -282 -104 -12 -240 32 -44 141
4695 141 -184 -28 -68 102 146 83 -212 176 -15 -95 -164 146 -336 -89 -178 -213 -151 -143 -71 -9 83 -36 50 -87 -187
4720 -187 -46 124 -45 236 -39 -100 -198 172 13 -3 245 -119 -66 31 120 -114 109 206 7 -10 171 -44 -124
4743 -124 22 -118 74 12 -162 -190 -170 28 -15 -410 111 -91 222 10 -28 -159 99 -174 -67 175 124 117 50
4766 50 238 -218 77 -42 308 -45 45 -70 -32 182 -219 98 -107 2 -105 -19 -363 -206 15 -153 -252 113
4788 113 101 -17 -174 80 78 327 92 -229 -194 -18 8 -158 -80 -68 122 9 -69 208 -244 34 81 -47 -71
4811 -71 12 275 34 6 -69 -108 -191 -104 -225 -169 41 242 -131 171 -53 -38 107 -268 80 88 29 -162 236 260
4835 260 29 140 8 2 -91 -33 -163 91 46 37 -119 -21 -15 39 109 68 -111 76 116 28 108 -42 73 164 44 152
$$ packed form
4671A0j40J84r7J3N3OJ42M3k7k00N4j05J0k2J20k17J20k29J78R2k28K72p6J85
4695A41l25J56m0J70M4o3k95L88j91q0o9L10m82K47q9l5O2QP2O2R2j19Q6j37j00
4720a87J41J70j69K81k75o1r8L70j59j6K48l64N3R7Q9k34K23R7j99j7J81k15q0
4743a24J46j40J92o2j74k8K0J98m3l95N21k02L13k12l8j31K58k73J07K42n1po7
4766E0J88m56K95j19L50l53R0j15L8K14m01L17k05J09j07Q6l44J57K21j68r9L65
4788A13j2j18j57K54kK49k35l21L5J76K6j66P8J2J90j13p8K77m52K78M7j28k4
4811g1Q3K63k41k8p5l9q3Q7j21N6K10K01l73L02k24J5J45l75L48Qn9j91L98K4
4835B60k31J11j32or3N8j30K54m5rj56R8ON4P0m1j79J87M0q8Q0j50J15R1j20J08
$$ plain form
4861 152 -127 -55 15 31 -199 -133 -14 -67 -69 36 -99 -176 -441 -48 243 60 -19 59 64 20 144 -68 56 -60
4885 -60 1 246 95 -35 -32 178 149 -68 -110 10 -220 265 -193 -15 169 64 183 -20 25 -58 199 -133 -112
4908 -112 -183 -195 -6 22 -109 36 129 -313 325 -379 77 143 99 -169 57 -101 81 -39 21 -137 -12 -63 -56
4931 -56 -112 -80 -162 -21 -207 -40 -195 144 -135 -111 73 -60 168 214 205 -14 112 228 326 143 53 -165 102
4954 102 -206 111 -75 -81 -149 1 300 87 -44 -92 -158 -77 -76 -92 40 122 71 -40 -6 -98 -117 63 202 -119 -151
4979 -151 85 174 -225 236 34 256 -77 208 -258 -199 49 -115 -32 107 297 88 96 141 90 -303 22 -332
5001 -332 169 -146 124 -206 -127 -10 -181 -214 27 -38 -56 79 -112 110 115 -152 176 149 40 -195 -134 57 -177
5024 -177 29 -19 -128 274 2 -214 101 86 19 16 182 38 185 -65 145 80 133 61 -52 -134 3 -78 -50 -240
$$ packed form
4861A52k79P2P0J6k30O6J19n3kJ05j35p7k65L93K91j83p9P8Nm4J24k12J24j16
4885f0O1K45j51j30LK10k9k17m2J20k30M85m58J78J84j05J19k03M5q3K57l32K1
4908a12p1j2J89K8j31J45R3m42O38p04M56O6m4k68K26j58J82j20O0j58J25n1P
4931e6n6L2q2J41j86J67j55L39k79K4J84j33K28M6rk19J26J16R8j83r0k18K67
4954A02l08L17j86oo8J50K99k13j31m8o6Q1Jj6J32Q2n1j11L4r2j9J80J39l21l2
4979a51K36Q9l99M61k02K22l33K85m66N9K48j64Q3J39J90k09QM5n1l93L25l54
5001c32N01l15K70l30P9J17j71l3K41o5j8J35j91K22Nk67L28k7j09k35O1J91k34
5024a77K06m8j09M02k72k16L15j5o7lJ66j44J47k50K10o5N3p2j13q2J37q1K8j90
$$ plain form
5048 -240 -98 83 73 -71 395 134 215 -24 -46 95 181 106 81 196 44 30 -24 69 44 -21 -32 -185 108 -235
5072 -235 -60 158 62 -69 40 10 86 62 -68 140 45 178 -32 -38 -147 251 193 28 -105 0 60 79 -60
5095 -60 114 -88 187 225 -12 124 -320 260 223 -123 122 -103 -74 108 -268 -236 -103 -174 151 -87 178 175 36
5118 36 -24 24 -89 20 269 101 -147 94 77 -59 -69 -37 -144 -140 -35 72 -23 -152 64 -410 125 18 -151
5141 -151 157 -135 118 -13 83 38 -164 -60 -174 230 -202 -103 -68 -2 -47 -340 -33 57 35 -246 3 -82 44
5164 44 -56 230 -134 -119 159 -72 16 24 157 152 -101 -75 -79 -62 22 -72 -13 37 -95 64 42 122 63 31 -123 -147 5
5191 5 27 323 -123 -39 24 146 73 4 -67 -94 -8 279 -223 -333 22 -98 -211 -17 -60 119 243 -203 219 -7
5215 -7 1 247 -105 -22 88 -10 -112 -197 -15 -175 16 238 92 -45 -129 12 -54 9 217 95 -167 -103 32 148
$$ packed form
5048b40J42J81j0j44M66k61Q1k39k2J41Q6p5k5J15j52j4n4R3k5o5j1j53K93l43
5072b35J75K18r6j31J09l0P6k4j30K08r5J33k10oj09L98n8j65j33J05O0J9j39
5095f0J74k02K75L8k37J36m44N80l7l46K45k25K9J82l76L2J33p1L25k38K65lj39
5118C6o0M8j13J09K49j68k48K41j7j36j0L2j07MJ05J07r5j29K16m74N35j07j69
5141a51L08k92K53j31R6m5k02J04j14M04m32R9L5O6m5k93L07R0k2k81K49q5J26
5164D4j00K86l64J5K78k31Q8QJ33nk53K6mJ7Q4r4N9N0j32J59k2Q0n9l2j54k4J52
5191EK2K96m46Q4O3J22p3o9p1k7Q6K87n02j10L55j20j13J94m3J79J24m46M22k26
5215gQK46l52Q3J10r8j02q5J82j60J91K22j46j37q4J41o6O3K08j22k62O4J35J16
$$ plain form
5239 148 -178 -46 -30 -166 -19 -37 279 -251 124 -56 -183 92 -121 -171 -61 -150 99 -2 19 259 -395 27
5261 27 -40 163 179 350 71 71 75 183 271 -69 161 -113 -149 101 66 -136 -86 154 -33 -219 103 182 76 89
5285 89 196 22 128 99 141 -42 247 33 -123 -181 -160 -153 -137 91 47 199 -210 -86 -6 102 181 54 -27 -110
5309 -110 -194 -12 23 317 -145 34 47 -60 -205 31 11 -61 75 194 -112 53 -14 -3 116 -57 -112 62 -172
5332 -172 -244 187 -178 301 -194 -96 41 107 124 -106 -236 -150 73 63 -44 42 34 -49 112 32 84 199 -62 -293
5356 -293 -4 18 -7 -153 161 160 -424 52 209 -49 0 -335 -304 192 -38 -135 -3 17 30 -115 -132 29 -188
5379 -188 68 50 70 133 -108 -75 256 -274 136 194 -141 -214 -177 229 6 115 28 -154 44 -74 -213 77 118
5402 118 366 -1 49 68 -114 70 51 -22 9 83 -160 -59 28 -200 167 169 163 232 -196 -145 -95 55 -57 178 -115
$$ packed form
5239A48l26J32J6j36J47j8L16n30L75j80j27K75k13n0J10q9K49j01K1K40o54M22
5261B7o7K03J6J71k79%MJ08Q8l40K30k74l6K50l5k02N0K40j87j86L22P9j06J3
5285H9J07j74J06k9M2j83K89k14j56n8K1PJ6K28m4J52m09J24Q0J08P9j27q1q3
5309a10q4J82L5K94m62J79J3j07j45K36k0p2J36J19l06J65o7J1J19j73n5J74k34
5332a72p2M31l65M79m95R8J37O6J7k30j30Q6K23j0j07Q6qq3J61q0N2J15k61k31
5356b93K89K2k5j46L14jn84M76J57k58M9l35L1M96k30r7J32K0J3j45j7J61k17
5379a88K56j8K0O3k41L3L31n30M10N8l35p3L7M06k23J09q7j82J98j18j39K90M1
5402A18K48l67N0J9j82J84j9p3L1P4k43J01Q7k28L67KoO9m28N1N0J50j12K35k93
$$ plain form
5427 -115 -68 87 57 -13 -260 71 -36 40 40 -63 -39 156 26 194 103 -98 -182 36 115 119 302 32 207 -8
5451 -8 -118 -130 -69 113 -56 -50 72 161 240 -144 64 4 147 -121 74 143 296 -140 -303 2 14 149 -197 52
5475 52 179 174 -298 -170 -78 138 29 53 -342 281 272 26 75 156 -221 24 111 384 202 41 58 -112 -15 14
5499 14 266 201 -48 -198 416 242 -14 -17 -153 -107 9 -131 -211 -392 270 77 -30 -176 93 -202 57 -31
5521 -31 -313 -152 -154 134 -125 1 -100 -87 8 77 -168 66 17 -92 -229 31 -263 -29 -206 101 49 -52 88
5544 88 161 -151 -55 -183 -39 247 158 54 -59 116 -120 36 -116 -184 8 84 1 -231 246 -57 236 -68
5566 -68 64 -61 53 -88 -134 -305 80 -91 168 52 -46 215 144 -79 -124 -41 -102 -119 3 44 -287 69 179
5589 179 283 -26 -328 -85 194 -95 54 173 83 122 -74 -198 7 293 -162 -182 185 -34 -95 50 92 -21
$$ packed form
5427a15M7J55l0p0k47L31j07P6%j03K4J95j30J68r1k01q4K18P9MJ83k70J75k15
5451hj10j2O1J82j69OJ22Q9P9l84K08o0J43k68J95O9J53m36j63L05J2J35l46K49
5475E2J27nm72J28R2K16j09K4l95O23rk46M9Q1l77K45Q7K73j82j61J7j70R7K9
5499A4K52o5k49j50O14j74k56lj36M6J16j40q0j81O62j93j07j46K69k95K59q8
5521c1k82J61kK88k59J26j01J3R5O9k45K34m9j09j37K60k94K34j77L07n2j01J40
5544H8P3l12R6j28J44K86q9j04j13J75k36J56j52o8J92P6q3k32M77l03K93l04
5566f8J32j25J14j41m6j71L85j71K59j16r8K61p1k23m5Q3o1j7J22M1l31L56J10
5589A79J04l09l02K43K79k89J49J19r0L9j96j24K05K86m55k0L67k19o1J45M2j13
$$ plain form
5611 -21 -87 -191 -91 30 138 -184 52 -57 -49 268 -15 -110 92 -225 -5 -111 74 -13 -112 -161 -165 -29 125
5634 125 -153 -217 41 125 -116 39 23 329 28 203 -238 -126 -79 301 -131 -315 368 250 9 -54 -89 180
5656 180 274 62 37 -58 -32 -340 378 -397 192 179 -170 -188 -74 -306 -87 174 -15 -40 142 139 112 -8 39 1
5680 1 -68 245 191 -11 -50 21 11 52 -71 82 79 -174 -56 -37 36 -74 -71 221 86 243 -132 -232 -85 -234 -94
5705 -94 78 124 6 132 -194 6 -8 125 -169 206 27 -153 -37 -152 -199 301 -101 -253 -109 209 113 -60
5727 -60 -42 -165 365 161 128 -6 -12 27 -147 -69 -124 151 -31 -37 92 -2 136 -154 -46 159 -101 -136 -130 235 15
5752 15 -86 -57 -230 -261 142 148 -14 -18 174 -92 196 8 -67 -19 349 -139 -205 -104 39 46 12 -32 67 148 252
5777 252 137 3 18 -116 72 -311 -78 -195 180 23 -99 -55 62 -86 209 17 -136 40 150 51 10
$$ packed form
5611b1o6j04J00J21J08l22K36j09QL17k83r5K02l17K20j06J85q7r9m9mJ36J54
5634A25k78o4K58Q4k41J55j6L06l01J75m41J12M7L80m32j84O83j18k41o3l5K69
5656A80R4k12k5r5K6l08P18p75N89j3l49j8J14k32K19K61j89k5J82lk7j20M7l8
5680Ao9L13n4k02l9P1j0M1j23J53lk53J18J9P3j10LK92j35J57l75j00J47j49J40
5705i4J72M6j18J26l26K00j4J33k94L75j79j80J16j15m7N00m02j52J44L18r6j73
5727f0J8j23N30k04l3j34oL9j74P8n5K75j82oJ29r4J38k90J08K05k60l5OL65k20
5752A5j01K9j73l1M03Oj62mJ92k66K88j88p5M8L68m88o6J01J43Pl4m4R9Q1J04
5777B52j15j34J5j34J88l83K33j17L75j57j22M4J17j48K95j92j53J76J10r9m1
$$ plain form
5798 10 61 -34 -52 364 153 148 -19 -36 -46 42 -31 203 -165 -54 66 -49 44 12 343 18 -95 -52 -86 -51 165
5823 165 120 -161 120 183 207 13 -34 18 -178 -81 -10 113 -233 -206 -13 -14 262 -171 -263 11 206 37 -11 183
5847 183 25 -57 -180 4 115 63 -39 -178 59 -264 139 210 41 -98 -55 326 -34 64 -369 -31 -180 -88
5869 -88 -60 12 -49 -13 171 23 -131 -136 72 -186 13 37 74 -60 17 -103 -100 -229 -82 26 -61 95 11 -190 308
$$ packed form
5798A0N1r5j8M16k11nj67j7j0Q8p3K34l68J11J20j15R3l2L31l25j13M3l4L5K16
5823A65m5k81K81O3K4j94m7N2j96R7P1J23l46K7J93jK76m33r2K74J95j69m8J94
5847A83j58q2j23J84J11n2j02j39K37l23M03P1j69j39M3L81l60R8m33L38j49R2
5869h8K8P2o1L6J84j48j54nK08k58J99K4L7j34P7j20Lj29J47J08q7J56q4k01M98
$$ [...]
8191b98
##END NTUPLES=NMR FID
##END=
