##TITLE=1H_LR-784-R3-CR8
 200.13MHz, CDCl3,
 8 sc
 
 3.2.2025
##JCAMPDX= 6.0         $$ Bruker NMR JCAMP-DX V2.0
##DATA TYPE= NMR FID
##DATA CLASS= NTUPLES
##ORIGIN= UXNMR, Bruker Analytische Messtechnik GmbH
##OWNER= pz
$$ XWIN-NMR		Version 3.5
$$ Mon Feb  3 18:19:58 2025 Russian Standard Time (UT+4h)  she@DPX200
##.OBSERVE FREQUENCY= 200.1313
##.OBSERVE NUCLEUS= ^1H
##.DELAY= (6, 6)
##.ACQUISITION MODE= SIMULTANEOUS
##.ACQUISITION SCHEME= undefined
##.AVERAGES= 8
##.DIGITISER RES= 18
##SPECTROMETER/DATA SYSTEM= spect
##.PULSE SEQUENCE= zg30
##.SOLVENT NAME= CDCl3
##.SHIFT REFERENCE= (INTERNAL, CDCl3, 0, 14.3821)
##AUDIT TRAIL= $$ (NUMBER, WHEN, WHO, WHERE, WHAT)
$$ ##TITLE= Audit trail, XWIN-NMR		Version 3.5
$$ ##JCAMPDX= 5.01
$$ ##ORIGIN= Bruker BioSpin GmbH
$$ ##OWNER= she
$$ F:/spectra/data/she/nmr/H-C/1/audita.txt
$$ ##AUDIT TRAIL=  $$ (NUMBER, WHEN, WHO, WHERE, WHAT)
(   1,<2025-02-03 18:18:35.42 +0400>,<she>,<DPX200>,
      <created by zg, POWCHK disabled, PULCHK disabled
       configuration hash MD5:
       00 E9 B6 7A A2 85 ED C7 34 08 36 98 17 FE 4E 26
       data hash MD5: 16K
       FA C4 F8 DD CD 9E D1 BD DB 69 DB 3F 41 01 95 09>)
$$ ##END=
$$ 
$$ hash MD5
$$ F6 8A C0 6C 94 64 2C 7A 4E 7B F5 86 52 30 1D 75
##$RELAX= 
##$RELAX= 
##$RELAX= 
##$RELAX= 
##$RELAX= 
##$RELAX= 
$$ Bruker specific parameters
$$ --------------------------
##$DU= <F:/spectra>
##$EXPNO= 1
##$NAME= <H-C>
##$PROCNO= 1
##$TYPE= <nmr>
##$USER= <she>
##$AMP= (0..31)
100 100 100 100 100 100 100 100 100 100 100 100 100 100 100 100 100 100 
100 100 100 100 100 100 100 100 100 100 100 100 100 100 
##$AQSEQ= 0
##$AQ_mod= 1
##$AUNM= <au_zg>
##$AUTOPOS= <>
##$BF1= 200.13
##$BF2= 200.13
##$BF3= 200.13
##$BF4= 200.13
##$BF5= 200.13
##$BF6= 200.13
##$BF7= 200.13
##$BF8= 200.13
##$BYTORDA= 1
##$CFDGTYP= 0
##$CFRGTYP= 5
##$CHEMSTR= <none>
##$CNST= (0..31)
1 1 145 1 1 1 1 1 1 1 1 1 1 1 1 1 1 1 1 1 1 1 1 1 1 1 1 1 1 1 1 1 
##$CPDPRG= <>
##$CPDPRG1= <>
##$CPDPRG2= <>
##$CPDPRG3= <>
##$CPDPRG4= <mlev>
##$CPDPRG5= <mlev>
##$CPDPRG6= <mlev>
##$CPDPRG7= <mlev>
##$CPDPRG8= <mlev>
##$CPDPRGB= <>
##$CPDPRGT= <>
##$D= (0..31)
0 0.7 0 0 0 0 0 0 0 0 0 0.03 0 0 0 0 0 0 0 0 0 0 0 0 0 0 0 0 0 0 0 0 
##$DATE= 1738592314
##$DBL= (0..7)
120 120 120 120 120 120 120 120 
##$DBP= (0..7)
150 150 150 150 150 150 150 150 
##$DBP07= 0
##$DBPNAM0= <>
##$DBPNAM1= <>
##$DBPNAM2= <>
##$DBPNAM3= <>
##$DBPNAM4= <>
##$DBPNAM5= <>
##$DBPNAM6= <>
##$DBPNAM7= <>
##$DBPOAL= (0..7)
0.5 0.5 0.5 0.5 0.5 0.5 0.5 0.5 
##$DBPOFFS= (0..7)
0 0 0 0 0 0 0 0 
##$DE= 6
##$DECBNUC= <off>
##$DECIM= 32
##$DECNUC= <off>
##$DECSTAT= 4
##$DIGMOD= 1
##$DIGTYP= 9
##$DL= (0..7)
0 120 120 120 120 120 120 120 
##$DP= (0..7)
150 150 150 150 150 150 150 150 
##$DP07= 0
##$DPNAME0= <>
##$DPNAME1= <>
##$DPNAME2= <>
##$DPNAME3= <>
##$DPNAME4= <>
##$DPNAME5= <>
##$DPNAME6= <>
##$DPNAME7= <>
##$DPOAL= (0..7)
0.5 0.5 0.5 0.5 0.5 0.5 0.5 0.5 
##$DPOFFS= (0..7)
0 0 0 0 0 0 0 0 
##$DQDMODE= 0
##$DR= 18
##$DS= 0
##$DSLIST= <SSSSSSSSSSSSSSS>
$$ [...]
##$SUBNAM0= <"">
##$SUBNAM1= <"">
##$SUBNAM2= <"">
##$SUBNAM3= <"">
##$SUBNAM4= <"">
##$SUBNAM5= <"">
##$SUBNAM6= <"">
##$SUBNAM7= <"">
##$SUBNAM8= <"">
##$SUBNAM9= <"">
##$SW= 18.0517328524113
##$SWIBOX= (0..15)
0 0 2 0 0 0 0 0 0 0 0 0 0 0 0 0 
##$SW_h= 3612.71676300578
##$TD= 16384
##$TD0= 1
##$TE= 0
##$TE2= 300
##$TE3= 300
##$TEG= 300
##$TL= (0..7)
0 120 120 120 120 120 120 120 
##$TP= (0..7)
150 150 150 150 150 150 150 150 
##$TP07= 0
##$TPNAME0= <>
##$TPNAME1= <>
##$TPNAME2= <>
##$TPNAME3= <>
##$TPNAME4= <>
##$TPNAME5= <>
##$TPNAME6= <>
##$TPNAME7= <>
##$TPOAL= (0..7)
0.5 0.5 0.5 0.5 0.5 0.5 0.5 0.5 
##$TPOFFS= (0..7)
0 0 0 0 0 0 0 0 
##$TUNHIN= 0
##$TUNHOUT= 0
##$TUNXOUT= 0
##$USERA1= <user>
##$USERA2= <user>
##$USERA3= <user>
##$USERA4= <user>
##$USERA5= <user>
##$V9= 5
##$VALIST= <valist>
##$VCLIST= <CCCCCCCCCCCCCCC>
##$VD= 0
##$VDLIST= <DDDDDDDDDDDDDDD>
##$VPLIST= <PPPPPPPPPPPPPPP>
##$VTLIST= <TTTTTTTTTTTTTTT>
##$WBST= 1024
##$WBSW= 4
##$XGAIN= (0..3)
0 0 0 0 
##$XL= 0
##$YL= 0
##$YMAX_a= 425302
##$YMIN_a= -463639
##$ZGOPTNS= <>
##$ZL1= 120
##$ZL2= 120
##$ZL3= 120
##$ZL4= 120
##$ABSF1= 10
##$ABSF2= 0
##$ABSG= 5
##$ABSL= 3
##$ALPHA= 0
##$AQORDER= 0
##$ASSFAC= 0
##$ASSFACI= 0
##$ASSFACX= 0
##$ASSWID= 0
##$AUNMP= <proc_1d>
##$AZFE= 0.1
##$AZFW= 0.1
##$BCFW= 1
##$BC_mod= 2
##$BYTORDP= 1
##$COROFFS= 0
##$CY= -3
##$DATMOD= 1
##$DC= 2
##$DFILT= <>
##$DTYPP= 0
##$F1P= 0
##$F2P= 0
##$FCOR= 0.5
##$FTSIZE= 0
##$FT_mod= 4
##$GAMMA= 1
##$GB= 0.15
##$INTBC= 1
##$INTSCL= 1
##$ISEN= 128
##$LB= 0.25
##$LEV0= 0
##$LPBIN= 0
##$MAXI= 10000
##$MC2= 0
##$MEAN= 0
##$ME_mod= 0
##$MI= 1.114404
##$NCOEF= 0
##$NC_proc= 0
##$NLEV= 6
##$NOISF1= 3.799351
##$NOISF2= 2.8
##$NSP= 1
##$NTH_PI= 0
##$NZP= 0
##$OFFSET= 14.38212
##$PC= 1
##$PHC0= -107.5623
##$PHC1= 11.79222
##$PH_mod= 1
##$PKNL= yes
##$PPARMOD= 0
##$PSCAL= 0
##$PSIGN= 0
##$REVERSE= no
##$SF= 200.129724274929
##$SI= 16384
##$SIGF1= 3
##$SIGF2= 2
##$SINO= 400
##$SIOLD= 16384
##$SREGLST= <1H.CDCl3>
##$SSB= 0
##$STSI= 0
##$STSR= 0
##$SW_p= 3205.1282051282
##$SYMM= 0
##$S_DEV= 0
##$TDeff= 0
##$TDoff= 0
##$TI= <>
##$TILT= no
##$TM1= 0
##$TM2= 0
##$TOPLEV= 0
##$USERP1= <user>
##$USERP2= <user>
##$USERP3= <user>
##$USERP4= <user>
##$USERP5= <user>
##$WDW= 1
##$XDIM= 8192
##$YMAX_p= 0
##$YMIN_p= 0
$$ End of Bruker specific parameters
$$ ---------------------------------
##NTUPLES= NMR FID
##VAR_NAME=  TIME,          FID/REAL,        FID/IMAG
##SYMBOL=    X,             R,               I
##VAR_TYPE=  INDEPENDENT,   DEPENDENT,       DEPENDENT
##VAR_FORM=  AFFN,          ASDF,            ASDF
##VAR_DIM=   8192,          8192,            8192
##UNITS=     SECONDS,       ARBITRARY UNITS, ARBITRARY UNITS
##FACTOR=    0.0002768,     1,               1
##FIRST=     0,             0,               0
##LAST=      2.2672688,     0,               0
##MIN=       0,             -463639,         0
##MAX=       2.2672688,     425302,          0
$$ Real data points
##PAGE= N=1
##DATA TABLE= (X++(R..R)), XYDATA
0 0 0 0 0 0 0 0 0 0 0 0 0 0 0 0 5 -5 8 -8 8 -8 8 -13 16 -16 20 -24 24 -29 32 -37 44 -49 53 -61 69 -77 89
37 89 -97 105 -120 134 -148 160 -177 197 -217 238 -264 290 -318 350 -385 427 -472 524 -585 654
57 654 -735 832 -951 1099 -1289 1544 -1897 2420 -3257 4765 -8018 17820 -106663 -463639
71 -463639 10905 425302 19032 -301772 99504 371747 6804 -236612 59421 241048
81 241048 -13118 -194056 -55180 42877 -56896 -130972 -84731 -19137 21529 14520 -27962 18243
93 18243 141216 101865 -74475 -34579 185384 132099 -146265 -118808 148359 75292 -228833
104 -228833 -138562 186162 80874 -251533 -132874 196579 74376 -217776 -58367 231628
114 231628 86079 -152962 1520 199988 51525 -108857 10042 108396 -5927 -90093
124 -90093 -40006 -19494 -44264 -28488 -27504 -50426 5013 66645 -4386 -61883 54410 131858
136 131858 -191 -78723 64535 124512 -54711 -127878 45825 101220 -79064 -124069 51166
147 51166 75676 -97831 -102702 73503 79068 -67858 -50306 82268 55988 -48039 -4376
158 -4376 78599 28062 -33950 7773 26364 -29441 -34687 2796 -22462 -49272 787 21095
170 21095 -34885 -29227 48672 40943 -25732 5818 73559 23928 -50099 -2785 51090 -13085
182 -13085 -63851 -1549 33580 -32554 -54196 16377 32264 -27069 -22893 38639 27840 -24606
194 -24606 -2681 42195 11225 -22839 14816 36042 -12703 -29311 12558 9044 -38721 -27448
206 -27448 14658 -8403 -41801 -3425 29269 -4741 -12618 36606 39615 -6457 2786 41816 12361
219 12361 -31543 -2648 22263 -25121 -48707 -144 12624 -36077 -33824 23707 22768 -23821 -8253
232 -8253 40534 23499 -17620 4673 40009 13734 -18666 3904 22299 -6300 -24448 -3808
244 -3808 -194 -23965 -22658 -4103 -11303 -19836 2978 15505 -3823 826 34765 28671 -6586
257 -6586 7090 40548 11973 -32286 -6740 25866 -14693 -52531 -11390 21647 -19649 -43348
269 -43348 4909 31924 -7432 -22906 19099 35975 1242 -9987 19333 27012 1870 -7072
281 -7072 5884 8456 -4182 -13037 -13659 -10722 -6810 -11689 -21175 -13151 8489 7395 -11374 -1310
295 -1310 30028 25113 -7556 -1437 32802 22025 -20944 -16533 20981 9584 -34524 -26722 15528
308 15528 8055 -31260 -21735 19572 15378 -20272 -13351 23359 21509 -10134 -8785 21079 22328
321 22328 -5764 -11472 11483 14776 -9374 -19560 -1792 6978 -10162 -21165 -5871 8942 1292
334 1292 -11066 -2304 14400 12921 -3638 -4371 13555 16624 -5489 -14724 6305 15987 -8783 -22326
348 -22326 2630 18455 -7670 -24037 3014 21736 -4363 -23232 4059 24268 -2286 -22562
360 -22562 3987 24982 12 -20316 3250 22301 -1812 -20670 709 17345 -3033 -17968
372 -17968 -190 13024 -793 -10647 659 8748 2539 -3252 -1285 1715 2422 -1021 -7683 -4546
386 -4546 6064 4300 -10023 -6507 13009 9761 -9653 -4234 17241 9971 -14419 -7312 15208
399 15208 5413 -18918 -9853 13791 3637 -18223 -7300 14234 3412 -15220 -2906 15565
411 15565 3943 -11087 1153 15042 4363 -5605 4402 9988 -616 -5769 142 -163 -5908
424 -5908 -5654 -4441 -6934 -4660 978 -2036 -5478 4306 11180 2766 -2080 9742 13523 -631 -5635
439 -5635 7193 8848 -6957 -10834 1836 2649 -10664 -11329 1276 1570 -9699 -8115 4584 5445
453 5445 -2852 40 10671 9155 1268 3398 9208 5287 -1432 -788 55 -4520 -6295 -4874 -6399
468 -6399 -7635 -3996 -2489 -4815 -1739 5326 4257 -507 4230 10552 5872 525 4671 7475 391
483 391 -4205 -262 1858 -3903 -8590 -5316 -3051 -5246 -6909 -3080 606 172 -231 2263 6293 6602
499 6602 4401 4235 6104 4659 1123 -398 -287 -1326 -4279 -6017 -5160 -3345 -3819 -5861 -3974 846
515 846 1772 -501 880 5645 5146 1543 2207 5869 5227 1364 207 601 397 -1661 -3713 -3475 -2614
532 -2614 -3378 -5099 -4385 -691 575 -1408 -366 3537 4332 1227 1421 5144 4261 -487 -687 2814 1594
549 1594 -3434 -3275 273 -277 -4132 -3275 434 -1 -2795 -2021 1093 1062 -723 597 2335 2325 607
566 607 750 1915 1524 1189 123 -517 -71 111 -1759 -2368 -28 785 -1791 -2653 88 954 -1295 -1577
584 -1577 1057 2302 -453 -2277 1149 3048 -28 -1450 2199 3973 -5 -1896 1377 3016 -1458
599 -1458 -3020 165 1137 -2392 -3806 -994 -389 -1950 -1532 704 1351 443 629 1285 1862 2933 2561
616 2561 1178 1550 2878 945 -1584 -708 636 -1880 -4308 -2796 -1095 -2328 -4267 -1942 831 1073
632 1073 -127 1030 3937 3699 1543 1724 4027 3747 320 -377 707 -509 -3468 -3387 -1821 -2504 -4148
649 -4148 -3770 -1812 -1092 -1303 170 1824 2366 3227 3216 3630 3816 3278 2430 1445 616 -3 -2667 -3436 -2891
668 -2891 -2795 -4220 -4057 -2269 -1415 -1856 -568 1669 2389 2261 3104 4257 4319 3045 2294 1828 1139 -86
686 -86 -1420 -1963 -2080 -3366 -4536 -3646 -2015 -1852 -2694 -913 1124 1112 986 2244 4197 3655 2169 2496
704 2496 3150 1735 -508 -952 -1076 -1830 -2966 -3482 -3204 -2703 -2544 -2617 -1160 497 1043 889 2181 3497
722 3497 3063 2366 2474 2444 1333 603 -95 -326 -1210 -2057 -2587 -2676 -2223 -2231 -2692 -1848 -169 84 -346 1110
742 1110 2811 2319 1014 2272 3218 1663 -36 575 854 -471 -1387 -1367 -1173 -1748 -1895 -1734 -1368 -929
760 -929 -656 -495 227 731 846 987 1177 2110 1316 1146 1013 1012 414 25 -364 -1030 -1125 -1013 -1523 -1617 -598
781 -598 -522 -1525 -1110 447 346 -825 183 1564 687 59 1350 2179 601 54 1464 1079 -807 -849
799 -849 -94 -604 -1566 -1226 -469 -1343 -1442 -654 -537 -652 166 851 726 809 1405 1571 1544 1124 1158 1517 459
820 459 -424 -178 178 -999 -2253 -1093 -919 -2225 -2437 -327 326 -892 -941 1776 1691 -171 891 3287
838 3287 2330 316 1124 2197 807 -1039 -461 -409 -1881 -2633 -1556 -1854 -2127 -1346 -419 -733 -178 1439
856 1439 2054 828 1596 3209 2079 972 1440 2180 722 -1141 -528 -25 -1916 -3226 -1787 -1176 -2331
873 -2331 -2946 -668 752 -233 -161 1708 2561 1465 1693 2468 2397 968 619 606 -233 -904 -1366 -1337 -1929 -2650
893 -2650 -2031 -1620 -1373 -1079 -311 43 445 1411 1852 2023 1866 2278 2319 890 501 772 -148 -1617 -1603 -940
913 -940 -2120 -2398 -1617 -821 -1645 -1493 -260 362 665 928 1430 1829 1870 1731 1330 1224 1161 341 -797 -494
933 -494 -394 -1480 -2406 -1533 -611 -1895 -1982 -82 142 -608 -106 1821 1894 869 961 2311 1938 330 364
952 364 695 79 -814 -937 -801 -967 -1944 -1579 -1013 -967 -805 -177 -81 -85 735 1276 812 1052 2094 1585 170
973 170 131 1681 790 -1137 -638 406 -803 -2652 -1083 -199 -1432 -2165 -377 1033 -451 -605 906
990 906 1410 359 814 1933 1543 -111 444 1484 446 -869 44 5 -1214 -1965 -635 -635 -1864 -1462
1008 -1462 -84 187 -651 357 1677 681 -132 1770 2365 830 541 1439 1043 -974 -620 394 -342
1025 -342 -2258 -1689 -439 -1338 -2161 -1077 343 -34 -581 674 1745 693 511 1431 2313 1226 350
1042 350 981 830 -980 -948 68 -689 -1839 -1875 -1044 -1255 -1705 -391 109 -632 158 1487 1894 567 1040
1061 1040 1944 1352 356 1165 1268 55 -1203 -1183 -383 -1256 -2120 -1674 -779 -1299 -1397 -383 723 708 91
1080 91 1499 2237 1426 1032 1564 1697 346 11 405 -646 -1345 -922 -785 -1844 -2038 -667 -626 -1379 -530
1099 -530 774 995 433 1086 2013 1637 550 1067 1838 815 -396 -36 333 -978 -1873 -953 -438 -1826
1117 -1826 -2441 -736 24 -1252 -1047 1086 1418 180 721 1951 1481 362 1175 1771 125 -667 65
1134 65 133 -1812 -1478 -428 -919 -2091 -1276 175 -405 -762 193 1169 465 419 1730 1838 495 381 1776
1153 1776 761 -782 -288 678 -364 -1853 -1122 171 -957 -2150 -373 602 -652 -1009 887 1340
1169 1340 69 346 1822 1695 296 561 1351 387 -617 184 218 -1017 -1498 -444 -494 -1780 -941 -66
1187 -66 -616 -766 202 941 230 -75 1200 1539 221 542 1179 850 -428 -594 299 -209 -1157 -1082 -348 -1027
1207 -1027 -1767 -467 -175 -524 -307 351 522 369 572 1170 1312 668 843 1308 553 6 61 -113 -653 -1060
1227 -1060 -736 -1041 -1144 -1024 -613 -522 -406 213 688 219 437 888 1372 888 777 1071 708 -40 -120 163
1247 163 -706 -939 -589 -783 -1429 -1435 -600 -524 -670 -260 289 558 754 1314 1091 982 1083 966 604 216 585
1268 585 133 -969 -1107 -444 -822 -1504 -844 -422 -776 -854 -118 482 357 417 1106 1396 1207 928 1294 745
1288 745 166 159 0 -309 -800 -766 -1124 -1203 -1319 -994 -574 -816 -564 463 817 635 995 1233 1455 449 771
1309 771 1347 563 95 31 -61 -1006 -1116 -764 -595 -1237 -1162 -191 -445 -839 83 855 433 328 1559 1281 377
1330 377 493 1355 707 -195 -110 279 -443 -1105 -1069 -398 -843 -1318 -503 -310 -467 -15 616 539 423 605 1051
1351 1051 681 476 825 893 300 4 -174 -81 -944 -949 -808 -672 -1030 -1094 -511 -172 -317 -196 957 776 262
1372 262 651 1179 770 490 547 1145 109 -533 144 -217 -830 -1247 -328 -537 -1247 -497 121 -392 -369 200
1392 200 858 147 456 1166 861 705 400 842 543 93 -317 63 -689 -765 -805 -748 -849 -693 -668 -219 -190 -157
1414 -157 172 429 619 475 714 852 956 540 449 390 -141 -142 81 -384 -1143 -571 -549 -817 -963 -169 222 -268
1436 -268 -108 811 794 335 998 1098 806 378 679 533 -8 23 220 -248 -731 -1133 -482 -776 -728 -498 -406
1457 -406 -90 27 -75 281 565 698 605 772 641 354 321 645 317 -480 -447 -389 -871 -958 -701 -784 -946 -693
1479 -693 -244 103 214 595 556 578 876 1100 818 529 584 749 -4 -475 -170 -470 -858 -846 -911 -801 -669 -606
1501 -606 -410 -20 60 526 721 601 1141 892 988 508 583 563 17 -54 -249 -700 -771 -795 -812 -770 -593 -515 -433 62
1525 62 -60 494 476 921 794 646 937 845 560 501 -297 -497 -256 -616 -855 -499 -410 -901 -974 -306 -524 -80
1547 -80 -58 402 368 517 734 630 760 609 746 249 79 460 31 -375 -615 -417 -861 -829 -500 -371 -683
1568 -683 -248 300 -165 434 653 870 342 437 1099 585 -194 404 378 -371 -108 -378 -852 -754 -423 -590 -659
1589 -659 -283 -46 -289 -43 376 482 377 596 900 624 257 651 463 52 334 -134 -797 -476 -454 -498 -716
1610 -716 -393 -437 -511 -143 18 310 -49 568 693 399 1113 568 384 270 363 -6 -178 -247 -178 -767 -693 -601
1632 -601 -627 -492 -413 -226 6 -86 134 454 603 683 829 656 366 793 207 68 -33 -49 -450 -545 -661 -663 -781
1655 -781 -707 -257 -365 -68 39 241 287 441 760 623 561 594 542 347 119 225 -54 -158 -539 -595 -624 -990
1677 -990 -783 -623 -211 -27 -105 418 439 328 480 776 589 552 497 431 168 -170 -35 73 -762 -659 -366 -616
1699 -616 -722 -548 -575 -598 -87 259 322 391 414 350 548 848 406 486 277 -148 -64 -411 -564 -754 -603 -204 -634
1722 -634 -349 -234 -248 -81 121 39 260 522 101 497 658 616 456 504 237 -121 -437 -285 -192 -638 -492 -668
1744 -668 -658 -480 -261 -528 -13 75 324 450 418 612 671 534 457 613 423 163 -38 -203 -193 -531 -490 -511 -556
1767 -556 -479 -338 -178 -163 -83 113 332 596 833 513 783 330 588 197 135 150 -196 -263 -645 -616 -553 -577 -601
1790 -601 -607 -482 -100 17 96 182 341 478 390 641 398 550 335 205 271 -324 -382 -538 -424 -620 -469 -501 -605
1813 -605 -693 -193 4 -42 222 476 295 538 642 658 664 651 418 352 -32 -100 -156 -932 -675 -690 -713 -368 -664 -474
1837 -474 -475 152 87 193 438 615 478 508 561 329 407 189 94 11 -299 -580 -560 -642 -596 -270 -384 -621 -418 -37
1861 -37 61 226 292 439 576 498 707 708 508 268 55 -68 25 -433 -626 -528 -934 -333 -675 -542 -465 -39 47
1884 47 181 641 705 498 614 869 376 451 422 243 -303 -376 -245 -574 -627 -327 -628 -805 -541 -152 -259 -166
1906 -166 111 172 444 452 599 327 404 454 331 225 -206 45 -471 -361 -431 -513 -686 -572 -354 -365 106 -54 183
1929 183 136 433 330 571 636 431 589 323 539 342 -56 -169 -153 -429 -378 -364 -515 -451 -515 -509 114 120 69 314
1953 314 276 265 642 625 288 11 351 339 -450 -210 108 -540 -568 -367 -389 -549 -481 -187 -118 -4 54 368 410
1976 410 127 817 492 533 179 147 44 136 -401 -235 -280 -92 -484 -559 -287 -376 -192 -79 0 -99 1 158 421
1999 421 433 249 636 627 -221 336 330 -98 -381 -122 -48 -385 -660 -328 -341 -439 -179 188 -31 -13 313 290 478
2022 478 483 247 644 420 124 19 36 90 -371 -385 -94 -445 -473 -144 -123 -330 -217 -170 178 36 280 119 273
2045 273 751 531 251 159 210 -26 -88 3 -220 -227 -519 -540 -399 -285 -350 -338 -71 263 71 60 279 771 492
2068 492 373 502 598 321 28 248 37 -230 -268 -521 -741 -118 -189 -453 45 30 -30 137 307 274 307 171
2090 171 490 499 312 270 141 59 51 95 -330 -611 -332 -395 -654 -543 -503 -249 -302 82 155 206 193 396 638 153
2114 153 338 286 94 -132 -132 -351 -400 -313 -253 -431 -346 -452 -321 -159 99 231 285 306 387 497 432 444 460 249
2138 249 217 108 -96 -250 -39 -193 -252 -734 -416 -265 -309 -173 50 -210 109 213 360 207 453 452 368 594
2160 594 271 109 -25 -157 -147 -246 -467 -349 -576 -396 -278 -443 -385 -130 24 291 57 755 372 318 254 281
2182 281 183 335 86 -185 -328 -121 -478 -182 -307 -290 -314 -228 -284 1 153 4 545 132 204 309 358 352 248
2205 248 120 183 160 1 -293 -357 -150 -537 -246 -511 -120 -250 -145 2 -116 104 434 254 423 230 577
2226 577 273 121 127 76 94 -205 -201 -351 -213 -304 -295 -117 -306 -218 -110 83 261 19 -32 197 326 -30 338 232
2250 232 566 -19 -170 51 84 -345 -238 -122 -331 -258 -225 -250 -162 75 -30 121 49 227 312 293 318 186 206
2273 206 80 30 186 -108 -53 -335 -483 -489 -264 -352 -219 -388 -211 2 425 299 244 642 438 243 368 552
2295 552 237 -233 -114 191 -155 -150 -192 -455 -447 -411 -464 -212 -286 105 -79 115 355 496 251 493 564 223 -74
2318 -74 387 -142 123 -141 -143 -272 -380 -282 -325 -182 -180 -38 -84 101 47 406 415 90 461 508 265 135 124 278
2342 278 101 -134 -271 -162 -269 -262 -297 -321 -81 -300 136 143 250 173 403 466 357 19 216 299 346 58 144 -153
2366 -153 -248 -197 -665 -550 -255 -386 -515 -131 -73 206 -60 -9 300 404 404 396 456 144 87 116 216 -165 -317 -50
2390 -50 -371 -237 -331 -333 -240 -357 -362 -130 149 139 307 234 481 197 282 635 251 -256 -52 -34 -368 -381 -380 -92 -385
2415 -385 -61 -172 -108 -279 -218 146 169 89 352 248 308 246 390 453 295 291 -199 171 -175 19 -126 -351 -418
2438 -418 -23 -255 -599 50 3 203 333 136 330 463 134 289 81 173 -218 77 82 -9 -180 -226 -112 89
2460 89 -531 -246 -150 -262 2 65 -52 42 154 181 387 420 293 135 262 47 -153 -120 -331 -221 -132 -112 -301
2483 -301 -146 -204 48 -167 167 152 166 316 50 507 53 105 215 52 104 310 -111 -263 -243 -352 -84 -564
2505 -564 -440 -175 -336 -245 76 -266 -51 165 397 220 115 373 245 106 -35 -136 -317 -172 -237 -111 -189
2526 -189 -254 -400 -417 -319 3 -138 -21 -186 -35 424 416 330 528 206 403 542 70 -245 -41 -58 -364 -366 -325
2549 -325 -74 -222 -269 -128 -84 100 -34 180 -38 -41 480 235 214 312 90 147 -114 60 -106 -202 -213 -361 -101
2572 -101 -374 -113 -103 -32 -8 -46 -184 -59 165 337 149 113 277 425 73 -173 80 -56 137 -408 -166 -357
2594 -357 -244 -122 -365 -231 200 134 -93 -15 234 38 139 148 332 346 283 203 108 180 -200 -383 -169 -90 -372
2617 -372 -448 48 -115 -80 -123 66 -30 403 141 61 289 188 72 293 -87 -129 93 -123 -293 -288 -233 -138 -241
2640 -241 -126 -120 -625 -57 66 -21 82 88 171 494 308 132 119 133 310 182 157 -79 -258 -372 -301 -320 -83 -42
2664 -42 -78 -124 135 46 211 -12 211 302 382 51 177 489 129 19 -100 -250 -271 -244 -276 -323 -73 -168 -257 -119
2688 -119 -177 -61 207 100 556 320 147 0 288 30 74 43 32 -323 -309 -338 -238 -134 -413 -40 -363 -251
2710 -251 73 48 -215 -33 253 290 293 362 288 307 151 181 280 82 -161 -53 -387 -279 -45 -561 -114 -85 -203
2733 -203 140 -71 -24 401 75 88 155 296 124 -222 136 61 102 -83 -138 60 -233 -150 -167 -630 -202 -150 -386
2756 -386 175 -90 -216 324 176 342 243 85 259 172 -86 174 69 -273 -171 -115 -213 -388 -185 107 -206
2777 -206 -224 4 9 -129 391 276 91 349 414 153 87 130 256 -230 -209 -66 -167 -107 -144 -120 -358 -114 120
2800 120 -68 111 -63 135 96 252 -92 91 270 -155 236 226 -5 6 -16 162 -196 -50 -46 82 -232 -36
2822 -36 -145 -76 -82 193 -83 200 140 -92 139 240 352 24 180 -277 -107 -173 125 -191 -30 -370 -313 -179
2844 -179 -224 -65 -131 40 122 286 639 92 248 233 -20 169 308 -287 4 -53 2 85 -318 76 -370 28
2866 28 -186 229 -78 189 1 348 137 17 284 216 92 -60 20 -125 99 -24 -231 -267 -185 -181 20 -229
2888 -229 115 -48 -141 -9 273 -26 198 440 193 342 425 63 -7 59 -47 -17 -458 -240 -20 -174 -42 -126
2910 -126 215 77 -323 215 -20 304 320 51 110 205 238 259 182 -11 145 -115 -35 -451 -175 -153 -207 -131 -266
2933 -266 31 -77 -178 201 323 440 274 205 116 353 -16 177 -49 -236 -79 -98 67 -194 -66 -278 -244
2954 -244 -243 56 -307 31 39 -34 -193 108 42 69 425 114 -19 181 415 251 -247 280 -31 -73 -47 -117 -357
2977 -357 -196 -198 -125 306 94 403 180 375 -26 85 39 -80 160 12 -168 -31 -185 11 -200 -65 -210
2998 -210 -181 -407 -30 -52 -169 -89 -3 144 -124 212 229 60 14 54 74 -228 -24 178 -41 -145 -137 -7 -412
3021 -412 -16 -309 -170 -473 50 39 182 -146 162 -15 137 238 -44 66 44 -52 20 -25 -375 -183 -198 -73
3043 -73 -432 -212 -130 47 247 35 9 -48 5 118 265 187 250 181 1 92 145 -24 -145 115 -290 -195 7 -87
3067 -87 -381 -16 -147 -5 -82 -25 40 14 -48 135 165 301 204 51 -94 -106 -110 -49 -157 -201 -149 -161 -1 229 -62
3092 -62 47 -62 60 135 179 159 72 191 -83 237 36 -51 65 -179 -358 -109 -52 -345 -243 -241 -396 -108 66
3115 66 112 -11 8 402 137 362 263 258 -60 254 157 -176 -11 -125 -86 -264 -227 -82 -180 -101 187 -90 -88 258
3139 258 180 -39 -23 276 158 408 250 44 26 -17 182 -137 -203 -195 -308 -464 -162 -577 -80 19 44 68 204
3162 204 147 22 370 333 388 33 -131 92 158 230 -68 -174 -174 -189 -56 96 78 -150 -185 -209 147 222 -3 -66
3186 -66 303 197 17 193 35 -111 -272 -176 -135 -299 -135 233 -35 -121 -244 79 -39 -176 -229 21 248 22
3208 22 244 199 273 356 162 155 115 -33 84 47 108 -128 -396 -43 -72 -92 -263 121 90 -186 11 24 275 75
3232 75 251 239 283 259 -27 160 50 -6 -241 -307 -201 -206 -46 -257 73 -4 80 -5 108 240 133 175 61 -41
3256 -41 80 -79 -136 253 204 -247 17 -67 65 -144 -222 -10 -152 -75 -154 -212 -52 154 -42 340 244 60 428
3279 428 314 108 257 3 -84 17 -50 -262 -246 -129 -169 -163 -166 -247 -281 -22 26 249 397 244 -77 266 121 -5
3303 -5 265 102 42 294 86 -226 -163 -102 213 -122 -212 -116 93 -494 67 43 71 57 241 263 1 176 124 51
3327 51 52 139 -192 -62 46 -296 -17 -244 23 -5 -139 18 187 139 265 -30 72 -179 -9 319 207 120
3349 120 -206 113 205 -376 -407 -39 -14 52 -130 -260 -53 368 63 42 202 37 92 138 299 162 -6 144
3371 144 46 -196 20 -10 -124 -209 -248 -169 -487 32 -106 -155 -182 116 -62 -46 58 83 -33 -47 53 184 -117
3394 -117 119 171 -106 -38 -188 -344 -218 -108 218 -131 -133 76 224 -327 268 -13 153 -66 154 56 97 115
3416 115 2 60 -8 -163 -398 -211 -60 -210 134 -108 154 174 148 422 -126 170 133 322 276 149 -55 -185
3438 -185 171 38 139 57 -232 -420 -56 -237 -35 -220 11 -98 123 110 140 136 44 312 192 7 74 12 24
3461 24 -27 -210 146 77 -460 -294 -156 -137 -116 -274 205 339 133 -48 -87 40 248 -26 40 149 202 29 139
3484 139 -229 -55 64 -228 -111 -386 -39 -126 -66 -168 -50 -57 117 250 93 289 273 126 68 5 0 32 317
3507 317 56 -359 10 -393 -197 -348 -116 80 -71 -17 -290 -276 135 -193 133 334 150 105 -24 17 400
3528 400 199 -119 12 136 13 -216 -36 -325 -176 -157 -244 -56 -187 116 -25 -77 -5 188 26 122 -154 333
3550 333 110 5 294 -132 133 5 -76 -135 -175 -172 132 253 115 -128 98 -74 140 -51 154 286 -24 205
3572 205 303 -49 102 89 -262 -94 -181 -70 60 -126 -160 25 -68 14 103 -65 257 329 -57 45 -109 -27 169
3595 169 -30 -289 85 98 -66 -251 -85 74 174 176 19 193 167 194 49 92 -218 91 186 -38 -38 -53 202
3618 202 65 257 161 -149 -82 -28 -225 -67 -22 -74 21 219 -135 154 49 -108 147 216 -93 220 319 170 -24
3641 -24 17 -32 96 -202 131 -27 -184 55 -257 -37 -231 -99 188 276 -184 296 -1 103 86 211 426 -8
3663 -8 -354 51 82 -374 -10 111 -100 -90 -131 -16 69 -38 -127 229 67 -35 9 241 112 187 -133 -59 158
3686 158 -33 49 -149 87 63 -106 -69 -16 -25 44 -49 -38 -109 171 168 73 193 104 102 58 68 -52 62 25 -166 -388
3712 -388 108 -109 -253 -23 -321 -207 26 -84 229 30 -186 -232 100 297 266 34 -82 -342 139 -38 243
3733 243 43 -191 -79 -111 211 -65 52 40 66 186 204 79 87 15 309 239 241 415 221 -193 191 -87 32
3756 32 23 -13 -325 108 -99 -111 -88 20 83 -74 -16 -129 214 139 77 120 83 128 -77 -108 -102 -156 1 -63 98 -108
3782 -108 -270 36 17 -136 -165 72 161 297 -94 92 -83 192 268 117 65 -98 -24 19 234 -135 -364 65
3804 65 181 -153 239 -143 40 -125 -32 60 93 9 -121 97 133 144 124 -147 -17 189 -96 74 -87 -234 144
3827 144 -203 138 115 32 248 -301 -17 548 47 95 184 -36 165 312 273 173 365 -79 30 -11 -6 -104 41
3850 41 -178 -155 -154 -38 123 27 60 80 -22 90 40 -61 245 51 68 -78 21 46 -154 57 -37 8 -150 -26
3874 -26 52 -23 34 98 236 -110 141 306 201 192 7 231 193 -8 365 62 -287 -27 -71 -210 43 140 -126
3897 -126 -162 -104 116 76 193 -5 291 -168 -77 100 -94 53 30 -94 -357 -114 -106 -148 -379 12 -122 23 152
3920 152 0 155 -46 -112 -8 82 -195 105 237 -165 121 10 59 -218 -276 -335 -59 -251 -199 61 -47 -130
3942 -130 -22 -406 -152 174 -30 54 99 175 -96 -99 -5 106 -36 -72 -227 -68 -121 -171 169 -104 -47 99 -13
3965 -13 -43 -8 -111 -32 238 -33 70 178 200 221 70 104 151 61 -253 -119 58 -128 -232 -267 118 289 -275
3988 -275 149 0 -14 -29 -146 -56 218 461 50 -112 -422 107 101 45 -134 -89 6 -184 178 -175 -204 -120 164
4011 164 -13 42 114 132 199 11 121 256 34 26 -59 179 -120 187 221 -126 -78 -123 -256 -171 -213 -66 -9 -70 -18
4036 -18 194 98 188 119 32 -1 -22 -11 -311 145 -79 70 -115 -132 -274 -205 -3 -10 60 50 102 206 51 141 -54
4061 -54 184 -124 271 95 -58 -138 -85 73 -253 -231 -238 148 -269 1 -20 -60 54 -120 47 30 -7 53 309 -1
4085 -1 125 101 33 -98 -302 -288 -108 205 -11 196 -324 -12 -131 106 169 117 233 -52 21 -144 74 104 75
4108 75 44 76 232 -294 162 -78 -268 -26 11 -133 21 -159 -77 -206 -34 172 423 57 192 -79 290 222
4130 222 90 -35 64 7 -174 27 -323 151 -123 -85 28 252 -23 -259 115 44 -100 -206 -328 42 394
4151 394 212 109 -45 -258 4 -94 86 -158 -20 -50 63 -62 -398 -125 27 89 75 1 10 -119 4 -46 303
4174 303 -76 -71 -71 188 228 -61 234 -281 -247 -133 -30 -528 -89 -8 -28 57 26 104 272 30 216 47 139 -31
4198 -31 213 49 -181 96 -211 -77 128 -8 23 -216 -105 -322 95 -146 49 -187 -37 -84 -145 291 257 105
4220 105 160 -110 -29 71 48 -53 44 -1 235 -64 -60 -26 -115 177 -94 -47 68 61 89 170 176 -94 68 308 58
4245 58 -113 19 -106 174 113 51 148 -22 -33 -34 -69 -130 -9 -45 -223 165 -95 217 -100 48 330 22 236
4268 236 253 -60 -117 51 133 14 121 -11 -5 -87 -50 69 117 -45 370 241 244 276 -294 283 23 36 -80 -58
4292 -58 -308 -125 18 -201 -127 -41 -149 -176 35 157 88 -27 135 151 252 -9 48 -49 199 107 58 250 -73
4315 -73 99 -123 -143 -166 -115 -103 86 -221 -140 79 -242 -105 185 -164 104 168 58 -186 252 -9 -67 -89 -152
4338 -152 144 4 156 6 -41 176 71 -54 -36 100 152 21 -79 160 -89 206 -53 56 -36 -145 -6
4359 -6 -71 -40 -51 -179 -180 -80 -213 45 -186 -61 114 128 53 122 -170 -38 138 119 -279 -143 -34 85 -306 346
4383 346 21 11 -192 49 -10 -129 -136 -111 22 -154 253 219 -20 86 226 -26 -21 216 -27 245 3 -40 51
4406 51 -26 25 -130 -26 23 144 81 32 -72 54 69 -177 -42 -58 21 91 -38 61 146 58 84 84 84 19 -264 -145
4432 -145 135 -35 -262 -107 -187 -65 -17 62 -39 217 72 -75 -292 -58 -75 34 -162 -41 -145 56 14 -240
4454 -240 -213 42 -45 68 -178 173 -166 -85 -165 -170 -79 184 -128 -220 71 -52 -49 -249 -110 136 154 165 297 -23
4478 -23 -8 108 130 95 118 -157 132 -104 126 57 241 -10 153 -100 75 163 40 92 -137 -36 80 132 -15
4501 -15 -108 -35 -96 20 80 111 -89 -292 281 78 107 153 -145 117 -247 -81 -40 -267 -93 178 143 -107 -9 -48
4525 -48 11 -168 136 134 9 -28 103 224 -5 -46 -33 -10 -127 -5 215 -60 -5 -139 17 -80 -507 -60 -86 25
4549 25 40 136 -13 32 -107 178 -124 35 -64 91 -13 77 222 -16 -309 -28 -8 -114 341 -54 -52 8 -64 6
4573 6 -226 157 132 231 -299 147 -102 127 132 35 233 35 -118 -6 -304 -83 -131 83 64 -122 118 -68 75
4596 75 266 -90 -30 -112 222 22 113 -65 -12 -127 318 -96 -197 -108 -90 288 -131 -130 218 174 174 -17 -124 82
4620 82 -54 40 184 244 130 -88 -95 -97 102 -128 -36 -92 -58 -136 77 39 -30 -5 -5 -130 -85 59 175 43 17 -12
4646 -12 -24 298 -365 52 164 -156 23 -168 -93 -225 -125 75 49 -77 -252 31 221 -85 -1 29 267 100
4668 100 31 -64 -41 61 -171 84 -32 -138 -236 -132 98 -16 305 -39 -49 140 -68 -114 -137 459 5 -116
4690 -116 84 -110 113 -21 -49 206 26 80 91 -222 5 52 -100 46 100 107 -46 -119 -77 170 -111 -183 -126 -65
4714 -65 -31 -67 -114 -325 -297 12 -52 48 -38 70 -173 -41 -170 68 -68 -423 164 -64 30 -109 -263 145 -168
4737 -168 89 170 50 -166 129 73 -159 -58 -99 71 12 89 -120 129 348 100 -112 47 3 37 -14 -51 207
4760 207 12 -67 96 160 9 -185 -163 59 -40 -29 -68 -132 -150 145 -15 85 173 -88 -130 181 -176 -34 84
4783 84 -244 90 -48 -13 -99 338 288 -26 52 -112 -217 -83 103 64 -207 109 -53 77 62 3 247 -28 190
4806 190 -54 182 -97 2 127 84 -270 164 -34 160 -67 90 87 238 259 249 -47 76 -183 -225 -25 -235
4828 -235 121 -125 351 -94 -232 -5 -244 51 248 92 223 -181 54 97 -233 -146 152 154 75 -93 141 132
4850 132 82 -13 -15 72 55 -42 -171 126 -149 -6 -52 122 -271 -96 184 71 70 144 -104 83 18 -146 -184 -177 -13
4875 -13 194 92 209 -84 12 15 -93 -28 -241 -105 -157 -58 139 -63 97 -359 37 -63 -75 -2 -237 213 -88
4898 -88 125 -139 -224 -218 38 41 61 319 48 -147 24 20 -69 -309 30 -397 -232 137 247 -135 -125 57 28 -128
4922 -128 -128 130 181 -3 -94 -117 333 97 213 -46 -124 -277 114 203 74 146 90 -85 -184 -162 -24 -78 -105 -27 -60
4947 -60 249 -15 12 -191 253 1 58 -114 -160 -66 -6 -196 23 18 -42 141 151 -18 -89 302 132 140 0 -44 182
4972 182 201 45 -304 -1 -177 -88 48 -92 326 -2 236 -5 -173 -207 -111 -10 -13 -201 -289 -323 66 -92 -92
4995 -92 -259 -37 109 178 4 -136 -79 -36 -256 -71 177 165 13 -54 -98 79 -99 73 89 -301 18 -58 72
5018 72 -5 -30 -94 -70 62 -38 161 107 13 -95 231 -136 107 146 -279 61 66 266 -136 -21 30 -110 -5 -151
5042 -151 297 35 93 -219 -250 115 -30 90 68 -132 166 126 83 -107 89 -31 -44 -3 -97 160 170 137 96 -170
5066 -170 118 31 -102 -64 -116 -161 -127 26 -82 253 -42 -5 237 -86 -175 45 -45 131 191 98 329 161 60
5089 60 -33 153 139 9 240 217 -347 -38 230 75 -77 -15 -117 3 60 -36 13 42 -168 28 -141 180 -10
5112 -10 13 53 50 108 -102 -192 12 -135 94 -35 -54 -26 -9 114 -51 -80 30 -90 -180 -3 -70 349 -130 116
5136 116 85 -68 -128 -142 82 16 -235 -71 -71 65 110 11 -41 -24 -99 25 56 -98 -361 -11 165 -128 16 -48
5160 -48 -51 -80 -21 25 147 -176 -62 -121 95 -116 144 121 -111 -10 41 -60 195 -92 141 69 -157 -47 230
5183 230 -111 -176 -149 210 -44 -141 -310 -322 75 87 -154 33 -114 -276 -64 -443 -90 -50 -106 -41 253 -12 81
5206 81 86 3 -16 -1 -167 -341 -35 74 -77 -90 91 10 130 -198 85 -136 35 308 -301 117 -4 183 231
5229 231 -103 -299 -39 9 -65 8 -106 -303 -55 94 -40 -79 -68 151 14 -203 3 -30 -267 27 -92 -283
5251 -283 -48 98 35 418 -118 -209 230 19 -37 -117 -22 -49 77 -100 49 42 -301 -117 -149 -68 128 175 39 90
5275 90 35 180 -14 315 -70 -100 -77 178 32 26 80 228 -158 -75 71 -59 -1 124 120 -162 135 -76 -51 -161
5299 -161 -20 165 -94 14 -253 -291 -56 -168 -120 151 -72 249 -213 -22 192 37 212 -80 -81 74 175
5320 175 78 -27 23 205 -124 -18 11 10 -135 -153 113 164 -53 -70 6 33 57 207 -3 -4 195 -263 156 190 -99
5345 -99 189 48 -285 -182 58 82 252 -75 -44 130 -69 51 -237 -88 -87 179 83 -145 3 -209 366 164
5367 164 -57 20 153 164 117 -164 -27 -100 -228 -220 161 208 -45 36 -118 63 -35 15 -199 -50 0 -308 34 214
5391 214 205 206 114 -66 -119 268 55 -168 187 -228 162 150 -18 -86 -126 -208 57 -69 -72 43 -155 128 122 74 67 74
5417 74 -144 158 309 -254 222 14 -13 80 -157 -82 -105 -258 248 119 -65 148 -234 154 64 -159 169 28
5439 28 -100 -65 -108 -51 239 -59 223 -14 46 -141 80 167 -156 167 -114 -132 -145 147 166 -205 -272 98 -252
5462 -252 -9 224 -179 -201 -146 102 -317 242 -136 -44 -219 72 0 -89 166 26 -158 31 -85 151 93 -56
5484 -56 18 0 -80 78 31 -136 214 -21 -5 -210 -289 -128 196 -125 103 -39 122 137 -244 -53 314 45 -61
5507 -61 37 -79 -35 191 61 13 -21 119 -1 114 89 -6 121 213 66 -129 41 256 37 -255 -119 223 -21
5530 -21 -261 -11 41 81 -352 84 28 -76 -16 -118 -29 32 -76 -26 123 -166 -47 -64 68 190 -218 51 -98
5553 -98 103 -177 -205 -65 20 -106 75 -120 179 -163 209 173 -148 393 115 7 111 -214 225 270 -110 206
5575 206 14 -205 89 25 -71 104 192 55 32 235 219 36 91 92 30 -89 337 59 83 21 82 -165 -73 82
5599 82 43 240 31 -168 9 -155 -211 -181 -126 86 51 30 22 257 128 86 -341 3 139 -76 171 -18 92
5622 92 -135 52 12 99 -205 -127 -15 -1 -32 -188 -81 168 -153 -221 -156 56 19 -114 -254 -11 -118 -21 -58 -158
5646 -158 102 37 -85 102 -21 -37 -164 19 -229 -61 -106 156 -18 -247 16 -116 -95 -103 -68 -171 62 155 164
5669 164 -272 6 -90 -37 -123 -174 170 7 -404 96 -41 226 89 -180 -165 -40 78 -34 98 -122 40 -82
5691 -82 -69 102 110 90 -47 -155 -117 68 -23 -187 11 46 -279 212 -180 -219 -71 23 207 -164 158 122 20 0
5715 0 84 -71 62 -91 0 346 -56 -161 154 -9 230 116 113 87 238 -37 -200 -222 -104 25 161 -80 257
5738 257 -229 69 -57 45 65 -201 144 -3 -185 70 26 185 -167 -169 -67 -70 -273 166 78 192 111 -25 72
5761 72 28 -34 271 171 -89 -67 47 -19 -63 13 -343 -364 -81 23 3 -93 111 19 161 267 190 -58 -123 188
5785 188 -158 124 140 -237 30 -60 64 -79 -140 174 -65 138 81 38 -196 -218 -81 158 48 52 -148 30 167
5808 167 -171 -26 -50 40 -90 173 -65 -98 -62 4 124 34 80 -205 -121 15 -29 81 -247 25 72 108 -77 -268
5832 -268 9 -133 89 91 81 157 140 -36 48 52 473 -73 16 12 -81 110 132 -103 181 -50 246 -7 38 -39 -71
5857 -71 -50 173 -49 -316 148 367 -137 -87 -96 -50 -511 80 169 -109 -6 -238 -65 87 -16 -51 -101 -161 -223 -115
5881 -115 -167 15 50 -214 27 24 220 -205 78 94 -256 111 203 50 -73 23 54 -13 231 -76 214 43 98
5904 98 228 239 -346 144 -9 -208 84 -79 -123 168 90 198 -112 -60 102 -207 103 -139 -34 10 -167 149
5926 149 11 0 -148 369 96 114 -7 -59 50 -1 4 90 21 46 88 -256 -120 206 81 140 -82 -137 203 10
5950 10 66 14 51 -6 51 54 -118 16 -62 -16 231 -140 147 240 -30 238 183 -310 -182 75 -333 246 -95 158
5974 158 183 8 88 23 71 56 120 71 -312 128 -280 -341 -130 39 66 -306 61 -179 33 188 -60 66 39
5997 39 28 -184 159 -261 -58 70 -65 217 -298 -201 -59 90 -120 5 32 267 327 -26 162 -26 -365 -188
6019 -188 92 -283 14 -15 247 -13 83 -162 -199 -23 -92 23 150 227 -46 -148 -87 -266 118 174 -288 -83
6041 -83 34 6 -63 -58 -165 97 197 9 -12 5 166 -131 -91 38 106 -76 -12 -133 -22 -19 -90 282 -76 -71 -105
6066 -105 85 -113 -54 -198 -108 140 -15 -310 12 -125 -105 129 -244 158 124 36 79 120 153 -2 50 93 16 33
6090 33 -59 -7 -121 50 -197 83 -142 225 23 0 95 13 -73 -130 363 34 -174 -32 50 65 -49 -48 39 14 262
6115 262 38 67 -209 23 184 -223 -60 60 73 -53 130 -131 -63 -79 153 369 258 -263 72 -79 -92 -165
6137 -165 -188 36 -13 -52 -49 210 133 228 99 -73 -69 32 79 -8 -184 19 78 -166 -37 206 -57 -28 80 -153
6161 -153 -79 148 185 22 47 -49 37 -244 -132 -101 243 -206 -16 105 -74 142 -62 -235 320 -242 153 124
6183 124 88 82 2 -44 224 -122 227 158 -154 -158 -84 -110 344 -60 -117 102 -171 82 -245 12 233 100 17 -147
6207 -147 184 -117 17 102 -91 99 -179 320 60 -24 -173 -44 -16 -153 -98 150 219 75 129 220 98 -227
6229 -227 -67 155 -7 25 36 -199 -91 138 58 -2 484 182 -93 -278 -146 -156 -209 -45 29 45 -79 9 -352
6252 -352 92 -185 -112 -195 154 229 22 90 8 -4 -28 69 -32 178 2 -23 152 22 27 236 -45 -207 -201 203
6276 203 86 197 -298 -68 -100 -136 132 76 202 241 -16 23 -46 117 -108 54 -25 -332 -156 101 -194 -34
6298 -34 329 -141 108 67 28 2 -109 -93 -41 126 10 -154 -43 349 -20 28 170 -51 234 -35 -62 240 -23
6321 -23 89 157 -205 27 46 -30 -158 -101 134 -80 256 161 -25 -117 156 -1 -99 19 -32 -1 39 18 18 22 9 137
6347 137 -5 460 -49 -111 -90 88 -232 -49 -149 3 279 191 335 50 77 29 277 -78 234 222 129 112 153
6370 153 87 -86 -233 44 116 12 358 203 -185 79 -95 -100 -5 113 121 -2 -282 41 -72 -166 207 54 159
6393 159 -60 49 -215 71 -150 -234 -33 46 109 -199 8 215 138 -7 -25 266 198 -42 -22 -11 6 -23 -253
6416 -253 -13 -120 -97 75 -63 -31 -130 -224 6 -252 -38 -318 -321 5 118 4 99 -106 53 -84 -114 286 -16
6439 -16 -8 -97 29 -99 81 362 -96 19 -218 110 169 -35 26 46 -28 115 -202 202 -211 -108 -23 435 146
6462 146 199 -63 -22 -42 -47 -35 -192 -28 -313 -229 -186 33 140 161 88 -192 -79 -119 -86 -55 -209 64 -103 -61 15
6487 15 -245 51 139 -201 -30 195 172 -133 -47 125 85 -198 -343 102 -186 -173 -27 209 22 116 312 60
6509 60 -119 -43 -90 -244 -100 118 -27 142 21 167 173 -335 27 62 126 -212 -44 -109 -115 86 -79 77 -240
6532 -240 -167 60 137 62 167 56 113 192 60 -161 76 174 -117 94 98 113 -248 -13 -57 -187 -121 82 204 66
6556 66 55 -298 -296 -3 -116 -267 151 -205 -158 -48 -272 -44 -157 -161 171 -45 96 94 -92 52 -97 -268 110
6579 110 -231 43 -90 -22 -86 9 -116 -263 -59 33 54 -107 -39 127 -220 -328 -141 -13 171 71 27 42 -361
6602 -361 -65 -2 -52 102 95 -221 -105 -22 252 10 -6 220 -17 172 219 186 -159 175 -249 -15 -130 18 11
6625 11 -123 28 102 73 107 -154 0 -63 92 -49 -110 168 113 21 46 -17 -12 -333 -176 -173 -9 1 26 171 6
6650 6 163 -19 -168 8 143 53 117 -110 96 -280 -139 89 -53 5 239 144 52 -157 106 -40 42 4 104
6673 104 -76 -82 -93 30 29 37 -206 -44 -9 -9 -65 -65 66 91 60 77 26 -11 35 169 74 7 101 -164 -8 201 122 18
6701 18 -338 -37 -99 37 3 -258 7 301 190 112 -86 32 77 226 -36 294 -115 -53 136 -185 120 -115
6723 -115 10 237 -31 -24 231 -60 42 -64 18 -269 282 -95 4 -118 5 111 -45 120 -171 98 0 -125
6745 -125 -23 -158 14 -73 -33 -194 -228 0 1 20 -155 13 99 -310 -209 -93 -19 -151 -16 -28 227 115 203
6768 203 -214 125 70 51 82 39 181 -214 35 -29 -12 145 101 7 216 -297 -280 -233 -68 130 30 -102 -19 230
6792 230 313 -286 215 -227 -59 -27 103 -114 16 90 221 46 56 6 -238 83 -28 30 32 -8 -191 -48 27
6815 27 -386 20 -267 -59 69 -148 -215 -66 -345 -120 103 -54 263 153 -170 -154 50 25 -17 -57 -156 -99 -27
6838 -27 112 4 -210 8 -251 41 123 134 40 27 21 148 99 90 119 -159 108 128 107 -37 -18 -216 -39 224 -172
6863 -172 69 -17 -84 -39 237 -29 -363 -27 -26 321 115 -169 -168 132 -82 9 -100 83 169 160 -68 85 119 -47
6887 -47 -128 32 11 -185 -14 -195 -25 -216 103 145 -29 34 -22 -5 -40 54 -102 -55 -123 -12 -84 -75 -76 31 287
6912 287 394 31 -147 221 -321 245 -169 82 232 -208 146 -158 200 -155 -161 -194 63 126 -156 -5 37 -41
6934 -41 -92 -112 110 86 178 -131 -158 92 115 269 37 -10 -72 -11 128 -185 15 -108 -37 121 208 106 -44 17
6958 17 180 168 56 194 -281 129 163 67 59 -404 225 260 13 137 -203 52 -239 371 -121 -37 336 8 236
6981 236 62 46 -60 7 284 71 52 -332 -81 311 124 148 19 146 -55 9 -13 243 -168 -68 297 270
7003 270 171 -156 101 109 -128 -61 -72 -85 271 -168 24 -318 211 47 -383 -118 305 195 -113 -188 -5 117
7025 117 48 122 45 -94 58 -336 -235 136 -88 4 139 -101 -329 128 -75 -162 113 136 163 -134 131 -49
7047 -49 -89 26 -29 -57 -59 -187 -197 -240 49 13 -99 97 -192 139 49 53 95 -84 -50 106 -96 81 -156 156 112
7072 112 64 45 -26 58 107 -194 125 102 -153 -116 -17 100 159 -62 -99 42 -50 138 -84 -134 -149 -342 111 -98
7096 -98 412 -34 -216 288 -57 -4 119 -107 205 14 9 -125 -12 39 109 -82 -59 54 -8 -143 -356 -176 -128
7119 -128 99 -70 49 155 -252 141 149 -292 -56 -98 -166 -94 60 75 -274 16 32 -23 225 98 -132 14 43
7142 43 -37 -91 -95 169 -351 103 -31 -175 236 138 -92 -34 115 53 103 -40 -286 31 70 141 -99 -71 92 216
7166 216 -128 75 115 -31 250 184 -14 175 -107 44 119 -26 4 275 -20 302 268 -84 -66 4 -223 163
7188 163 250 162 -171 -45 170 -100 -225 27 95 -484 4 22 -14 -157 71 -93 -85 -180 31 47 54 -226 -52 73
7212 73 202 15 143 150 -39 14 -22 229 130 -101 191 -179 63 -30 177 -110 180 296 34 -293 -70 173
7234 173 89 102 -20 38 168 20 -60 71 66 -81 -12 -185 -50 89 207 59 -7 -203 52 40 -180 66 -77
7257 -77 -7 46 183 -22 -8 102 -122 -217 34 -119 94 59 -7 147 68 179 -349 -11 -61 225 244 -56 200
7280 200 68 49 -21 -25 51 -188 155 26 142 -166 -70 19 272 250 13 -151 -46 53 111 110 153 -31 122 132 -198
7305 -198 -55 97 88 -213 219 -124 57 -165 -36 -16 143 17 -244 -150 -57 -258 -177 124 261 0 250 -166
7327 -166 1 -228 -247 -32 -21 207 75 -139 16 103 -3 101 -106 85 182 207 43 16 -218 21 -98 46
7349 46 76 71 81 -69 -396 27 -80 -230 185 -134 -155 -78 11 115 -37 90 -88 -130 -75 -378 207 141 92 305
7373 305 -76 -109 -105 -58 159 162 104 -175 43 162 26 59 202 235 42 -66 -184 45 -292 -163 315 -184 170
7396 170 137 2 -82 153 193 -105 165 74 -27 122 -199 -128 -236 -42 323 161 -110 -116 11 157 -45 -236
7418 -236 220 111 313 -185 -348 -154 -123 230 -106 92 77 150 -51 -12 73 66 -211 48 -178 -17 70 -11 -4 -116
7442 -116 238 -28 -42 -6 -54 -52 -55 124 50 -107 -49 4 -59 -34 74 -61 290 -4 161 30 -27 441 103 306
7466 306 182 -78 -101 -136 117 -368 -131 -34 -10 -111 -25 -32 -225 202 -387 41 62 -51 -205 167 47 -43 -62
7489 -62 -136 199 73 92 167 -127 -125 122 -20 100 -77 -34 -17 -30 56 -26 34 -9 -8 -35 -145 295 -154 -197 11 -50
7515 -50 -78 -31 438 89 68 53 -15 -80 -65 163 50 146 -108 10 -103 212 81 148 -33 39 -244 36 -329 137
7539 137 44 168 159 -282 -29 -176 -124 172 253 217 -136 76 -161 60 222 -129 317 161 147 15 29 176 -279
7562 -279 13 130 74 169 43 -280 151 37 -137 -124 -224 -192 -22 -316 -293 259 -21 275 153 -172 42 -174
7584 -174 -137 -12 13 322 178 20 89 -45 212 26 107 -211 56 134 -223 -52 -110 -322 -104 237 178 42
7606 42 29 -30 -164 -27 -152 110 250 -86 17 55 37 82 -190 -26 71 -330 31 135 -159 -73 -88 190 54
7629 54 -80 378 29 -104 82 181 18 179 61 99 -117 206 -79 -96 -50 23 -57 18 12 112 -82 -34 28 87
7653 87 260 64 -122 -14 -40 178 65 -84 48 188 146 71 49 -132 9 -212 135 14 5 172 46 -117
7675 -117 -221 -133 52 -102 126 84 -248 72 -114 -317 -184 -112 203 -166 219 -8 123 -53 -44 145 -149 -22
7697 -22 22 -163 -39 112 133 -91 300 18 -30 196 113 -10 -331 -4 -40 22 145 115 221 -8 65 107 -60
7720 -60 -310 123 144 -59 -88 68 -83 -166 -165 94 -50 -42 331 -179 26 -129 -51 181 84 95 101 -81 -162 -184 -97
7745 -97 75 -68 -22 294 259 183 -219 95 -198 -98 173 -43 -95 157 61 192 -21 -24 0 -117 411 57 -30
7768 -30 -175 192 33 -43 -187 128 12 80 -69 -52 -241 -112 -64 -120 -216 -218 -84 -23 98 109 21 -14 48 -52 -193
7793 -193 366 -134 -60 -44 -143 -43 71 -230 -13 91 -116 -62 115 19 17 77 -61 24 57 -71 9 -354 -272 150
7817 150 -82 10 161 -161 115 -200 -258 159 163 -95 64 -87 -12 44 57 47 -83 128 153 -358 5 42 -100
7840 -100 -24 -33 -98 -277 122 -106 -166 -50 -194 162 -45 -46 -51 49 39 91 230 -170 -54 70 177 -49 3 58
7864 58 305 202 -6 -166 0 -330 119 -30 -42 -174 -95 -173 94 -117 0 111 43 -194 -79 51 203 226
7886 226 190 -142 174 1 -113 -35 -83 94 -111 -97 24 -44 15 -377 -109 -71 -93 174 -27 -186 -2 -176 -26
7909 -26 35 -293 -142 96 38 -326 81 25 121 -9 276 68 -161 -160 -168 191 -25 -249 207 -214 44 -83 -94
7932 -94 -45 -82 -7 -233 -450 -269 -40 -63 -97 -121 110 -120 -41 -150 -91 292 56 -39 100 23 -82 111 -113 -16
7956 -16 174 -92 -21 37 12 24 -156 8 125 -35 105 -104 202 138 102 243 -71 -55 31 -33 182 -130 251
7979 251 68 29 -154 -72 143 50 29 121 227 129 -193 -63 251 -86 136 8 458 -104 74 -20 170 94 129
8002 129 -35 -148 -217 119 -159 -90 -90 78 -155 17 -148 -249 72 -141 -119 -79 -153 -18 -50 53 102 130 -69
8025 -69 13 324 -189 115 -312 -175 -159 -23 -196 179 149 87 28 170 -122 -67 -211 27 -36 -12 -2 -268 -69
8048 -69 27 11 162 -4 24 -38 82 53 120 193 -6 187 37 -92 337 -251 7 170 -171 50 20 -78 234
8071 234 81 104 -89 -115 28 -181 102 128 -6 -161 -56 -156 59 236 -196 49 -91 -21 200 -293 121
8092 121 342 -58 13 60 2 109 135 27 340 -223 -67 -204 -62 -43 33 -141 73 -146 -56 -83 -255 -250 314
8115 314 22 -31 22 2 22 -57 21 -12 159 91 -12 121 145 -149 -236 -37 -162 -1 50 37 79 -179 41 17 107
8140 107 -22 141 -161 119 45 76 119 -151 104 -79 -16 -395 -184 -96 199 -136 -168 -117 128 -147 212 43
8162 43 126 221 -14 -25 179 -102 46 -15 -227 -211 -40 -179 -116 -113 -71 190 45 279 -37 101 82 -11 -144 -159
8186 -159 11 106 -25 151 98
8191I8
$$ Imaginary data points
##PAGE= N=2
##DATA TABLE= (X++(I..I)), XYDATA
0 0 0 0 0 0 0 0 0 0 0 0 8 -8 8 -16 16 -24 24 -32 40 -48 64 -72 88 -104 120 -138 161 -186 216 -248 284 -323
32 -323 367 -417 470 -529 594 -667 744 -830 924 -1028 1141 -1261 1396 -1541 1701 -1876 2067
49 2067 -2277 2511 -2763 3045 -3361 3715 -4113 4564 -5083 5688 -6401 7255 -8303 9622
63 9622 -11342 13690 -17097 22512 -32474 56831 -248027 -117981 408320 -71323 -375329
74 -375329 20518 364839 -19583 -240142 89030 319736 28637 -152419 19906 151111
84 151111 7240 -88159 -38460 21859 3571 -33909 -84344 -55801 27412 -1647 -138856 -76978
96 -76978 140475 114373 -124044 -71719 207456 161648 -129188 -56914 240092 121644 -231763
107 -231763 -138825 178002 48771 -267137 -123248 175438 34112 -216871 -48778 187558
117 187558 50712 -116773 26003 157640 37164 -60488 13688 54895 6336 -6757 -5675
128 -5675 -36986 -18312 19227 -45652 -102568 -1543 75267 -38475 -106376 42670 122667 -30654
140 -30654 -91208 88831 152523 -31138 -90885 75368 97751 -88193 -111157 57348 59081
151 59081 -104091 -95776 50658 37153 -71301 -24934 78636 37201 -31569 16178 54746
162 54746 1948 -14800 26840 9489 -30213 1567 20250 -36885 -45917 22585 18979 -50141
174 -50141 -26032 46911 10492 -54936 -446 67572 14333 -38203 23071 62363 -7663 -42047
186 -42047 19872 32331 -38012 -47355 11556 4674 -49106 -26903 29674 10379 -22433 17973
198 17973 49245 7320 -12721 29985 32190 -19173 -18066 21052 -1972 -44243 -15530 16972
210 16972 -18454 -36277 9518 20141 -23108 -14986 33006 17839 -20902 11067 45625 5492
222 5492 -21196 22756 35550 -19677 -30681 16864 10630 -44519 -37335 11979 -956 -40996 -14452
235 -14452 31014 13591 -14731 14346 42534 16992 -3463 17357 22677 -6071 -13753 1542
247 1542 -7872 -25421 -12218 -1904 -21499 -22458 8124 7904 -21056 -5952 33099 15877 -19983
260 -19983 8499 47511 12674 -25926 11371 41606 -5271 -39531 429 22097 -25041 -47287
272 -47287 -5358 13303 -20867 -29222 8634 24167 2554 -1912 20107 26581 12340 4138 6262
285 6262 7524 4264 -4488 -15260 -12209 1005 -4686 -24717 -17833 9702 5543 -22759 -13281 23893
299 23893 19291 -16555 -6936 34473 26301 -15602 -8292 31524 20454 -25023 -20023 17054 7370
312 7370 -32555 -27150 10119 7718 -23177 -18040 16174 19708 -6742 -8176 18584 23036 -1277
325 -1277 -10056 9492 16597 -3925 -15699 -1172 9811 -2978 -17109 -8816 6586 2633 -12949
338 -12949 -10837 8371 11706 -6527 -11575 10693 20994 -1873 -13957 9333 22889 -4341 -21978
351 -21978 3180 19921 -7567 -27005 552 20612 -6029 -24949 3240 25090 34 -20669
363 -20669 3716 23499 -947 -20371 1558 18764 -2602 -18199 616 15071 -727 -11924
375 -11924 821 10284 1419 -5272 -965 3193 1950 -1284 -5397 -2429 6099 3173 -9668 -7098
389 -7098 10237 7053 -12432 -7772 13386 7656 -14640 -6852 17419 9645 -13701 -3630 19705
402 19705 9291 -15308 -6075 14246 2043 -18676 -8144 10243 -1897 -17879 -4384 11939
414 11939 2306 -8189 3601 12568 2801 -1770 6026 7834 665 -757 1382 -1915 -2776 -185 -3859
429 -3859 -9389 -3335 2181 -5924 -11076 730 7108 -4060 -6280 9281 13877 -165 -2268 11617
443 11617 12559 -2022 -5053 5677 3463 -10519 -11204 -447 -1078 -11624 -9491 2180 1473 -5580
457 -5580 -1309 7781 6239 869 4194 8170 5037 2658 4236 2562 -1080 -414 -926 -6159 -6287 -2646
473 -2646 -4738 -9974 -5689 1384 -1555 -4691 2247 8167 3984 1742 7489 10769 4702 -435 1985
488 1985 3667 -1266 -5372 -4159 -2649 -5457 -7596 -5661 -1781 -1594 -3233 -1535 2581 3700 2438
503 2438 3191 5794 6236 3787 2717 3258 3098 369 -3618 -3806 -1526 -2879 -7061 -6825 -2683 -2311 -4607
520 -4607 -2535 3199 3925 1629 2312 4920 5514 3819 2336 2224 2259 194 -2154 -2420 -867 -1128 -4209
537 -4209 -4481 -1628 -865 -4001 -2923 1559 2122 -986 -5 4690 4541 362 550 4649 3521 -980 -968
554 -968 1909 546 -3537 -3328 -449 -1007 -3266 -2413 301 372 -1256 -271 1398 1657 1331 748 311 1251
572 1251 1316 -329 -388 1589 2252 -444 -1340 413 1003 -1211 -2338 -39 942 -1916 -3222 -248 1365
589 1365 -1157 -2448 674 3065 -57 -1825 1843 3599 214 -1352 1917 3237 -816 -1924 896
604 896 1574 -1723 -2062 -468 -789 -2676 -2742 -1815 -1094 -474 -36 -415 593 2671 2363 814 2398 4024
622 4024 1997 -252 970 2321 -511 -2911 -2249 -836 -2302 -4286 -3314 -1305 -1321 -2531 -1053 2076
638 2076 2713 917 1565 4489 4288 1885 2034 3277 1972 -1432 -1798 -1059 -2499 -4095 -3719 -2893 -3340
655 -3340 -3050 -2022 -677 413 1191 2068 2724 3779 4030 2995 2445 3295 2666 474 -1094 -849 -1895
672 -1895 -3755 -4213 -3186 -3262 -3854 -3254 -872 238 -75 855 2742 3301 3513 3335 3637 3494 1980 458
690 458 383 229 -1246 -3745 -3550 -2622 -3350 -4180 -2767 -987 -750 -832 559 2878 2454 2291 2994 3786 3338
709 3338 2010 1115 908 372 -959 -2048 -2291 -2155 -2886 -3674 -2936 -1549 -1540 -1423 -19 1403 1531 1714 2691
728 2691 2976 2823 2282 1749 1079 605 -360 -1641 -1767 -1370 -1748 -3337 -2327 -865 -1396 -2529 -606 1271
746 1271 753 -59 1372 2894 1940 1374 2169 2055 858 238 -76 -443 -818 -1286 -1941 -1857 -1434 -1382 -1364 -837
766 -837 -289 -303 132 597 1173 1065 1071 779 1264 1024 1339 801 -154 581 250 -1071 -1370 -235 -779 -2075
786 -2075 -1831 -257 -683 -1639 -9 980 -109 -366 1520 1690 358 590 1953 1367 217 421 1094 -297
804 -297 -866 -249 -335 -1155 -1549 -848 -1393 -1805 -917 -365 -460 -306 488 1252 934 813 1750 1978 1282 459 1158
825 1158 1344 -591 -1358 -243 -395 -2343 -2913 -646 -750 -2504 -1843 717 475 -1080 521 2633 2075
842 2075 574 1892 2522 1065 385 1113 505 -667 -878 -878 -1365 -2101 -1507 -1296 -2689 -1883 59 89 -614
861 -614 845 2842 1938 1064 2321 3106 1276 -174 1140 1479 -685 -2345 -1278 -1047 -2145 -3138 -1499
878 -1499 -749 -1545 -1667 52 1208 742 997 1850 2271 1919 1825 1790 1588 430 272 -393 -1183 -1721 -1776 -2157
898 -2157 -2602 -2069 -1299 -1205 -795 10 855 755 1262 2298 2074 1228 1607 2026 1089 79 196 -53 -1307
917 -1307 -1836 -1391 -1863 -2155 -2174 -1459 -975 -572 113 271 884 1507 1727 1543 1958 2307 941 80 1025 654
937 654 -820 -1717 -715 -879 -2472 -2354 -580 -563 -1836 -1153 311 977 385 569 1609 1602 974 1331 1774
956 1774 1268 159 0 109 -327 -910 -1087 -1330 -1631 -1295 -862 -1055 -1028 -174 413 -372 312 2045 1675 209
976 209 954 2266 1044 -675 550 1168 -853 -1504 -423 504 -1541 -2601 -842 -179 -1495 -1045 556
993 556 769 -667 -10 2035 1364 705 1518 1805 803 99 866 858 -961 -1380 -577 -646 -2065 -1484 -377
1012 -377 -1405 -1793 -161 876 -195 -646 1223 1748 642 638 2237 1688 -13 490 1187 148 -1491
1029 -1491 -832 -250 -1422 -2550 -1283 -263 -1436 -1863 -386 1125 121 -92 1246 1746 990 830 1801
1046 1801 1727 400 471 377 -483 -1516 -971 -578 -1752 -2285 -663 -698 -1546 -1223 626 579 181 1052 1844 1443
1066 1443 735 1297 2198 1208 -3 201 72 -562 -1699 -998 -574 -1507 -2314 -1481 -399 -841 -489 605
1084 605 767 609 891 2038 1458 623 1267 1557 353 -478 251 -353 -1465 -1738 -1142 -1240 -1952 -1370 -163
1103 -163 -461 -614 204 1387 1022 484 1652 2343 1352 295 1159 1574 -86 -1181 -252 240 -1648 -2217
1121 -2217 -830 -499 -1925 -1414 547 -25 -689 507 1594 846 232 1670 1895 459 246 841 508
1138 508 -518 -278 101 -947 -1801 -938 -333 -1283 -1390 -276 429 -721 -160 1289 1143 17 862 2084
1156 2084 1405 -450 356 1929 289 -1375 -284 487 -1028 -1914 -746 -72 -1513 -1488 374 286 -709
1173 -709 -130 1648 829 -58 1098 1748 575 73 916 873 -334 -506 44 -633 -1582 -817 -65 -1113 -1704
1192 -1704 -201 320 -688 -214 1286 923 4 223 1947 1464 220 579 1024 341 -827 -303 113 -604
1210 -604 -1489 -897 -715 -1483 -1237 -135 -258 -621 162 728 675 419 837 1047 980 423 902 462 137 -276
1230 -276 -492 -516 -1051 -1108 -956 -1166 -1382 -934 -431 -377 160 614 747 526 780 1583 1281 643 940 1008 -390
1251 -390 -613 195 -396 -1235 -1251 -816 -1100 -1136 -553 -158 -467 -152 654 670 722 1144 1345 691 804 1434 1121
1272 1121 -303 -188 60 -603 -1015 -1052 -611 -1067 -1478 -632 -418 -366 -238 327 817 370 976 1380 972 652
1292 652 1061 1000 244 -401 -51 -700 -798 -1228 -1201 -1029 -1460 -847 -235 -504 -300 -83 697 781 538 1032 1708
1313 1708 818 187 794 720 -263 -695 -229 -571 -1416 -1188 -300 -1344 -1345 -195 75 -413 -164 1171 1094 494
1333 494 842 1521 803 293 726 1075 37 -786 -141 72 -1246 -1213 -730 -1056 -1129 -740 180 -90 -350 290
1353 290 775 874 488 891 1098 718 5 481 558 -62 -445 -185 -479 -1199 -956 -729 -501 -1137 -1078 23 271
1374 271 -163 397 1032 650 464 716 931 435 306 473 149 -499 -538 -36 -953 -1078 -603 -262 -824 -993
1394 -993 22 163 -439 -67 781 491 208 602 1362 542 -45 331 422 -30 -148 -264 -408 -754 -1038 -662
1414 -662 -615 -438 -729 -295 -270 -166 197 535 777 418 599 1046 702 -14 188 731 -149 -821 -60 -51 -1071
1435 -1071 -973 -495 -621 -1195 -623 136 50 27 581 802 486 684 1050 885 239 490 397 143 -366 -92 -604
1456 -604 -640 -1037 -989 -586 -666 -906 -648 32 168 163 613 811 896 780 952 642 582 -91 168 -124 -319 -593
1478 -593 -458 -974 -1099 -681 -626 -704 -784 -86 73 -255 600 1117 987 555 798 1243 764 256 193 313 -400
1499 -400 -914 -720 -707 -558 -863 -803 -614 -509 38 35 423 625 571 744 840 431 660 627 321 19 196 -230
1521 -230 -499 -939 -666 -857 -1027 -858 -735 -339 -368 273 255 225 708 587 616 702 777 454 636 722 -207 -435
1543 -435 -95 -260 -921 -617 -555 -907 -1011 -160 -252 -833 181 319 320 497 1134 860 629 491 557 214 -251
1564 -251 37 -81 -490 -722 -566 -755 -641 -254 -441 -579 -125 263 -186 389 903 718 473 805 750 451
1584 451 36 194 -78 -641 -105 -340 -542 -933 -431 -383 -678 -489 -55 -178 130 51 237 430 665 741 364
1605 364 564 525 85 -31 -83 -7 -680 -604 -835 -771 -795 -332 -200 -460 -105 322 298 476 498 793 477 744 823
1628 823 342 97 167 124 -404 -342 -270 -781 -919 -380 -643 -41 -378 29 118 -36 374 505 261 438 784 941
1650 941 427 398 502 -55 -301 -438 -436 -714 -588 -679 -1015 -188 -178 -474 -205 228 295 101 589 687 622 663 762
1673 762 607 308 67 -154 -474 -397 -466 -576 -606 -178 -550 -544 -130 -167 145 205 475 429 475 398 1041 658 552
1696 552 488 378 -1 -253 -156 -562 -528 -519 -472 -678 -498 -317 -58 190 51 109 111 572 477 474 559 216 207 276 209 -242
1722 -242 -409 -488 -541 -332 -471 -599 -803 -348 -395 -38 -449 63 464 496 539 693 546 373 274 174 274 -48
1744 -48 -441 -409 -429 -593 -543 -810 -555 -644 -306 -104 -53 230 453 5 605 246 366 725 431 175 450 -7
1766 -7 101 -111 -128 -680 -481 -775 -570 -379 -411 -54 83 212 463 371 92 649 520 698 523 383 213 -298
1788 -298 94 -333 -255 -457 -406 -513 -536 -415 -419 -253 -18 116 2 408 742 708 656 729 566 269 206 271 133
1811 133 -71 -533 -444 -427 -613 -674 -601 -432 -430 27 -157 68 206 545 645 352 756 533 526 498 -132 136 -114
1834 -114 -115 -356 -611 -574 -488 -533 -513 -620 -153 45 248 396 458 460 402 578 691 708 565 100 42 -167 -243 -350
1858 -350 -686 -393 -461 -751 -603 -280 -357 -162 -15 345 173 464 309 691 631 533 400 369 -82 46 -107 -317
1880 -317 -433 -256 -626 -720 -263 -315 -431 -245 73 132 -2 618 345 483 574 403 410 281 379 -56 -129 -124 -257
1903 -257 -236 -621 -373 -680 -619 -245 -363 153 -56 166 284 332 376 350 590 490 237 566 -29 -333 -100 -578
1925 -578 -658 -436 -593 -467 -441 -190 -270 -142 -55 103 402 587 681 253 404 558 432 -59 -38 10 -139 -263
1947 -263 -313 -138 -419 -706 -225 -111 -475 -349 190 335 277 497 414 383 281 490 585 264 107 252 12 -282
1969 -282 -181 -334 -477 -580 -147 -264 -387 -141 43 -155 150 232 181 592 537 506 340 487 251 113 211 -92
1991 -92 -219 -447 -474 -177 -648 -434 -386 -251 -263 -189 64 182 368 435 335 515 651 386 78 -13 -28 42 -144
2014 -144 -437 -305 -310 -478 -569 -442 -329 -17 -163 -93 -117 149 497 547 421 393 514 462 85 40 127 -114 -197 -284
2038 -284 -565 -347 -489 -627 -254 -193 -227 -222 57 137 135 450 612 345 343 236 314 194 -13 93 -182 -125 -249 -363
2062 -363 -532 -544 -289 -202 -137 -195 -15 244 258 178 484 683 296 503 324 -168 115 58 -221 -206 -346 -480 -659
2085 -659 -374 -92 -137 -259 -50 75 -56 289 556 0 607 780 617 113 236 193 21 -169 50 -216 -572
2106 -572 -702 -179 -533 -253 -4 47 -117 -179 512 440 346 609 588 96 545 447 398 -429 -53 -91 -313 -206 -142
2129 -142 -672 -566 -425 -138 -128 26 252 -124 137 247 168 294 521 615 13 123 209 5 -142 -288 -376 -516
2151 -516 -365 -405 -229 -334 -282 120 -8 28 494 437 184 310 569 374 18 91 60 22 -56 -250 -299 -367 -250
2174 -250 -480 -543 -65 -165 -283 353 387 225 429 423 263 525 279 4 314 185 -41 150 -483 -345 -223
2195 -223 -335 -239 -394 -331 -186 -187 121 -28 50 123 232 413 384 239 231 334 472 176 -169 -329 -489 49 -191
2218 -191 -419 -534 -332 -150 -168 104 81 130 286 259 272 159 486 283 231 81 427 -69 -153 -263 -115 -498
2240 -498 -314 -124 -307 -410 -319 -140 -19 -73 153 283 204 208 372 558 533 403 171 96 33 -58 -139 -533 -228
2263 -228 -99 -330 -611 -149 -133 -335 -164 128 60 292 74 645 134 242 232 450 179 332 108 -250 -235
2284 -235 -553 -170 -161 -147 -339 -294 -176 180 -53 201 232 262 327 312 271 256 306 -16 249 -43 -203 43 -124 -216
2308 -216 -246 -84 -268 -231 -316 28 1 -83 185 87 181 561 389 531 84 -64 180 -66 -13 -342 -300 -283 -418
2331 -418 -369 -249 -256 -19 -47 156 168 217 151 255 512 288 380 109 246 59 -93 154 -168 -393 -233 -9 -203
2354 -203 -372 -408 -128 -288 150 116 307 165 351 565 213 328 353 136 278 -33 -100 56 -398 -193 -328
2375 -328 -201 -141 -146 -145 -168 -154 135 261 -79 310 98 135 267 459 335 169 -163 173 -1 -38 -175 -485 -192
2398 -192 -313 -126 -180 -16 -307 109 102 62 188 165 452 435 367 316 352 -19 126 93 107 -195 -224 -496 -190 -361
2422 -361 -308 -325 -192 -135 31 268 78 394 254 261 145 157 178 30 -5 -166 -89 -60 -482 -147 86 -519 -443 -298
2446 -298 -203 -155 -20 93 391 231 366 610 204 215 448 -10 -65 27 344 -250 -303 -227 -384 -410 -427 6 -155
2469 -155 -208 -36 434 -10 231 840 429 184 331 230 229 82 -65 -58 -188 -239 -171 -97 -142 -327 -353 7 -151
2492 -151 -88 -4 149 329 105 179 451 145 165 290 30 102 -67 26 -160 -86 -178 -136 -133 -397 -451 -141 -84 164
2516 164 242 -192 340 324 210 208 151 167 194 127 64 158 -135 -35 -247 -356 -397 -380 -155 -368 46 67 -26 81 136
2541 136 189 423 568 351 211 307 91 110 -87 -189 -36 -302 -250 -327 -504 -233 -710 -276 -229 -73 94 87 -9
2564 -9 401 233 318 421 235 224 -111 31 -86 -53 -133 -234 -201 -207 -194 -104 -97 -135 -15 106 -54 410 184 353 263
2589 263 219 270 376 280 74 -68 -235 -299 -121 -105 -197 -330 -259 -296 -247 -57 208 110 49 364 81 500 265 329
2613 329 202 387 365 -138 83 37 -190 -461 -174 -229 -248 -90 -258 -3 61 17 59 121 172 156 437 147 274
2636 274 84 17 -99 -325 -330 -366 -30 3 -251 -309 -169 -153 -62 -59 213 73 224 175 209 226 218 204 198 37 -165 99
2662 99 109 -43 -119 -208 -483 -167 -454 -210 -226 -230 39 98 8 236 142 212 426 275 123 269 179 -37 143 -358
2686 -358 -361 -205 -371 -252 -513 -113 -244 -121 75 349 51 184 124 309 332 375 312 -67 28 170 -252 -25
2708 -25 -59 -428 97 -283 316 -203 -215 -96 109 95 -162 15 36 64 123 480 176 216 140 -58 -52 67 22 -26
2732 -26 6 -105 -270 -228 -439 -273 105 -87 81 240 -131 86 368 490 293 18 344 84 31 -129 -222 -79
2754 -79 -288 -167 -63 -569 -404 -195 -232 161 -44 182 101 84 248 44 12 368 199 30 -69 -185 -70 -18
2776 -18 -281 -87 -90 -503 -301 -51 -342 -87 114 -3 -36 56 487 375 348 55 149 152 -51 172 173 -114 -224 -72
2800 -72 -172 -401 -177 -110 59 -30 22 -163 132 249 251 422 468 209 246 98 93 -55 140 -84 -37 23 -388 30
2824 30 -106 -17 -17 -38 -290 107 124 231 338 18 357 246 35 234 116 -3 224 -16 -156 -54 -313 -96
2846 -96 -166 29 -53 -217 55 -34 120 5 39 291 161 119 238 332 -112 -169 245 -38 -257 46 -308 -157 -66
2869 -66 -428 -182 -150 -157 100 -192 22 103 19 438 258 91 -46 34 74 -202 -54 12 -228 -284 -255 -288 -293 -64 -11
2894 -11 -77 -336 -249 125 8 -117 194 227 160 -35 162 226 196 -25 -186 -132 12 -174 -103 -21 -235 -36 105
2917 105 -111 115 72 127 304 23 64 120 31 119 82 18 -164 -60 113 -164 -57 -190 -273 -229 -195 -37 89 -119
2941 -119 147 199 -1 261 191 73 315 286 250 20 -90 114 -116 10 0 -316 -215 -267 50 4 -244 162
2963 162 -3 -297 135 126 316 109 119 8 207 76 162 -101 5 30 -448 -178 -331 -113 -113 -275 -307 123 167
2986 167 -89 -17 77 -13 148 315 271 307 -12 72 219 117 -44 5 -107 51 -208 -124 184 -221 -133 -97 -157 319
3010 319 -131 125 200 313 82 8 69 152 36 -93 102 104 -130 24 -113 -215 -221 -258 7 32 80 -118 102 65
3034 65 87 134 217 262 206 257 144 45 107 -37 56 -244 -184 -223 112 116 -309 12 18 -137 4 125 -101 614 459
3059 459 58 -219 157 14 -106 147 -64 -92 -17 -196 -196 -240 -241 -129 -150 -562 297 65 -23 147 79 78 -162 436
3083 436 436 85 89 -19 -203 2 -114 -260 -85 -125 68 -253 33 -42 -186 -186 7 201 127 -13 109 73 271
3106 271 164 149 68 355 -112 -208 -472 -280 -112 -198 10 -172 38 12 52 -22 89 -116 279 313 24 137 166
3129 166 137 265 -193 -217 145 -238 -110 -98 -139 -45 -7 57 148 13 86 104 12 91 19 147 118 -26 157 174 53
3154 53 -171 -62 -34 -100 -110 -216 -204 233 0 -266 125 97 176 72 122 191 -4 -96 169 82 -114 41 -37 -97
3178 -97 -41 -278 -27 -87 -62 -131 -216 -100 82 -222 26 288 -70 61 62 175 162 395 185 72 -304 217 155
3201 155 -177 -53 -109 -206 -254 -146 -166 -140 -67 -91 76 -104 94 80 298 265 343 -86 -117 -62 50 81 -6 -14 -249
3226 -249 -90 -116 -130 -176 -57 -153 -334 30 -176 44 121 -29 47 113 349 110 102 -86 19 -20 20 -7 -104 -28 -146
3251 -146 -56 -107 -251 72 175 -39 -275 54 -17 -31 277 30 224 -84 437 159 6 -75 296 -234 -113 -387
3273 -387 -143 -223 -102 94 -13 103 -108 15 212 122 223 25 -24 171 67 -26 182 153 32 -113 -144 -59
3295 -59 -174 -62 -127 39 -168 -40 -63 175 -71 -46 -96 264 213 26 67 -122 -216 -202 -91 -1 100 -177 -158 -269
3319 -269 -275 -223 358 -175 77 114 312 543 -12 207 141 284 116 -216 -30 -55 -63 -10 -446 -4 102 -280 16
3342 16 -260 40 107 28 71 -27 -50 227 364 207 349 290 15 -338 103 -197 -198 79 -210 -135 -149 -306 -181 -67
3366 -67 230 -149 -164 219 -84 150 163 179 174 106 135 -108 -10 112 58 -293 -237 40 137 49 -90 -21 -194 24 335
3391 335 53 103 227 -44 310 154 50 204 91 -56 95 192 29 15 -133 -349 106 -32 -6 -58 48 -3
3413 -3 32 236 8 175 12 116 310 46 114 -43 -39 10 -50 5 -306 -233 60 -180 -202 -44 203 291 177 134
3437 134 108 82 332 371 131 124 52 53 164 -3 -42 -164 -384 -120 -302 94 -92 48 53 -107 -31 -120 24 -33 259
3462 259 -65 163 266 52 -43 -3 -77 -62 28 -242 -2 -350 -212 -149 -180 -8 151 -69 105 -2 140 36
3484 36 485 275 41 247 203 -76 -58 -246 -85 -70 -196 -366 -285 122 -182 -116 204 36 -5 99 23 129 291
3507 291 111 188 -39 352 -39 432 -79 -20 303 47 -64 -88 -70 -293 -287 -204 -270 78 14 159 74 -106 363
3530 363 203 -12 193 48 101 71 -237 91 -7 -162 -57 -23 -184 -4 -115 41 -151 -81 94 93 -59 300
3552 300 -100 -24 279 201 35 -99 190 -243 -227 129 148 -41 111 320 -476 247 81 163 97 -87 103 85
3574 85 258 138 253 274 -182 -94 -196 -100 -54 -353 -51 -54 -176 -9 -317 -234 250 -71 -79 205 374 120 288
3597 288 114 143 162 153 -3 -336 -53 78 -76 -264 -271 -171 -29 -287 -124 219 205 -250 77 120 213 -74 -153
3620 -153 109 -94 109 40 -139 -69 134 -217 -21 -263 -87 -72 -106 -123 6 245 45 -71 -230 -75 36 -14
3642 -14 338 75 184 -93 45 -85 -114 -66 -128 61 -147 -195 65 -138 -65 -136 -11 48 141 -79 -211 -20 74
3665 74 12 268 198 81 -131 110 78 -554 -140 -163 145 -147 91 -10 -45 83 -36 130 49 -82 56 98 -77
3688 -77 425 -190 22 -4 -316 28 131 -73 -258 -52 -150 -210 69 125 -18 20 214 152 177 194 340 -88 -250
3711 -250 202 157 -83 -275 -181 -210 -129 -372 116 95 90 -54 320 -433 -74 78 -238 -77 54 26 198 292 94
3734 94 79 105 -44 132 -82 177 -121 -257 -25 91 -116 -195 -94 -36 -1 123 173 -50 170 238 -14 90 24
3757 24 -137 274 133 173 19 72 8 56 -36 -123 -53 117 -95 -140 64 -40 -127 280 127 177 222 48 5 106
3781 106 -17 -18 -59 -80 -158 -98 -86 -277 319 -186 -105 56 -87 3 106 -87 77 89 175 88 7 161 -174 91
3805 91 -118 17 65 -21 -74 -88 34 -314 -192 -69 -292 -187 199 69 -89 -11 -255 -31 94 5 57 141 -2
3828 -2 253 40 34 -79 -145 -328 -453 -28 -210 178 28 184 -15 376 258 31 247 -304 -105 -82 87 100
3850 100 -112 3 131 231 -286 -75 133 -55 -58 119 39 68 -29 80 123 -127 -105 275 441 148 235 173 90
3873 90 49 -80 -97 -180 -86 -105 -94 -280 65 -54 -100 59 167 190 81 -38 271 -21 -126 -70 -57 -13 -136 -132 54
3898 54 -107 -91 -140 -122 32 141 113 -158 183 350 230 -5 252 58 30 7 88 -63 222 -36 -61 -299 -151
3921 -151 -110 -156 -75 96 -30 17 -91 162 -170 210 -30 114 93 59 -5 61 249 -55 136 -266 -70 36 -356
3944 -356 -389 -111 -20 -10 -1 -280 284 170 137 -36 219 218 2 210 -168 -45 -43 167 191 -174 -152 14 73 113 60
3969 60 58 -79 -168 -7 -8 -37 49 -14 58 48 134 155 152 150 -162 -122 -302 230 -154 -77 -31 -116 164 -37 46 228 -85
3996 -85 -21 81 137 98 41 -143 57 149 75 -66 -184 131 -5 -111 -104 -4 -275 35 -130 114 121 72 198 -36
4020 -36 227 206 -96 -41 5 217 -19 -67 93 -204 99 -74 -26 127 -165 -11 71 -161 44 -159 -184 304 -334
4043 -334 54 57 -266 129 142 23 11 38 4 -200 89 -162 -31 227 -226 117 -28 -119 10 -42 82 -66 4
4066 4 45 67 254 90 183 -171 -108 -375 447 -63 145 -54 -365 -91 -6 -14 -195 87 -392 179 79 -7 45 -50
4090 -50 96 -37 197 155 -222 181 16 -106 -237 -50 -119 -108 53 -73 -49 112 -87 -206 1 34 68 -177
4112 -177 267 1 -29 118 -4 273 -64 104 -26 -18 84 63 -136 -64 -48 -273 73 -169 -156 -40 -92 -30 168
4135 168 32 179 304 194 172 119 179 -13 -249 4 247 151 64 -221 -19 152 -92 -266 -8 56 139 13
4157 13 140 209 -150 263 -77 -107 -65 -267 -170 -216 -163 -278 36 66 -27 -67 -123 249 -173 226 93 51 298 112
4181 112 -111 142 -111 -178 135 270 122 -86 133 -210 76 -163 -135 13 -2 53 -158 -131 227 111 49 164
4203 164 300 69 -193 300 -67 -117 37 -85 -208 -146 15 135 108 87 -54 -154 -73 -147 -77 140 86 -91 217
4226 217 -25 204 -99 224 -102 -106 38 -148 -86 99 -304 120 88 -82 -161 -204 -263 -145 162 87 166 46 -31
4249 -31 -284 42 -193 223 -134 15 82 24 -148 253 -223 -39 121 -123 -67 -113 -82 -51 78 -173 -100 115 -13
4272 -13 94 -38 92 -76 3 41 -82 -84 -137 -158 -148 74 290 12 20 -139 -183 -59 62 32 -60 210 -167 -164 -121
4297 -121 45 -126 -235 23 53 -201 16 -53 -237 -90 -171 32 105 -86 198 26 -171 185 53 247 152 244
4319 244 47 -129 -213 24 -107 -44 227 -92 1 -52 -126 43 -65 85 146 133 393 149 -112 3 -175 -4
4341 -4 -159 157 -75 -90 70 -112 23 -101 -31 305 -53 113 6 64 196 44 5 -173 -30 -89 -136 69 137
4364 137 232 -129 96 -86 -218 1 13 -17 -135 9 1 126 7 -88 24 -105 26 -17 106 134 -170 191 216
4387 216 -94 -80 -193 -88 -66 47 159 -54 111 70 476 159 -128 17 124 341 -25 170 26 329 143
4408 143 -88 -67 -146 128 -322 136 -8 119 -239 -181 139 233 150 211 121 73 196 -277 59 -140 155 95 96 147
4432 147 -50 115 46 -127 -4 -134 34 -214 16 164 -281 7 51 145 -159 260 -34 -70 112 99 -190 -198
4454 -198 -55 -78 -426 -301 -133 -172 -68 83 -125 -400 131 53 9 -37 94 122 195 -234 -207 269 7 234 81
4477 81 448 -67 -32 65 67 -91 -72 194 180 64 -53 235 96 9 180 351 189 -84 54 208 -43 108 193
4500 193 -64 -274 56 -157 79 86 -143 -257 -77 132 124 28 113 174 149 256 161 -130 -147 -259 -4 -127 -210 79
4524 79 -73 -194 -41 -269 -160 -299 218 150 -218 70 98 65 104 229 99 127 228 74 129 28 29 49 34 46
4548 46 127 -81 -36 -122 -158 19 -67 -83 -188 62 -133 -117 -9 -36 213 194 82 -25 21 131 17 178 -326 -28
4572 -28 -152 245 24 -231 55 -144 211 -194 -40 -290 182 141 30 46 27 183 -168 -17 27 -75 139 -124
4594 -124 -63 -4 28 -115 -94 -100 100 49 124 -123 65 -10 179 -45 37 -118 49 67 -241 -369 6 -13 -87 161
4618 161 90 93 -66 137 91 263 215 85 68 39 29 243 241 -131 -153 -279 285 89 -20 -6 94 -14 177 -28
4642 -28 -22 -8 23 -16 158 -88 -238 -87 72 -30 210 172 38 9 20 96 -18 -360 -127 -84 -130 59 -28 -137
4666 -137 -91 193 90 86 93 146 181 52 -235 -62 -120 206 -48 30 -29 -33 170 191 6 -47 -29 -58 55 -26 131 -4
4692 -4 -81 -86 117 46 -142 -150 11 184 -79 76 -104 -92 59 -191 29 17 100 25 -198 -77 -258 -1 205 186
4716 186 -5 -100 5 8 16 -85 14 107 -311 70 -21 12 -58 -101 142 293 -81 -13 50 -4 -10 100 23 -96 148 -62
4742 -62 253 -33 127 59 3 -195 -135 -42 -46 28 -2 5 89 66 3 -147 -107 -54 -144 -49 114 -99 6 257 24 163
4768 163 118 0 184 1 -79 -218 27 -105 92 57 -11 185 104 -50 -290 -206 -58 79 272 -21 -172 -203
4790 -203 -2 292 -36 128 -163 -26 -43 -30 -100 -153 -237 -98 30 138 25 42 -48 -304 160 111 62 213 23
4813 23 218 -74 151 -1 68 71 -96 180 -145 -173 -15 64 170 248 169 51 -26 203 61 332 -121 -156 -43
4836 -43 -81 -173 -57 -269 -237 144 120 -20 78 80 -46 -14 -38 -69 -120 -104 -55 31 57 5 -187 -151 116 -67 -35 -273
4862 -273 167 52 -47 149 10 22 94 284 -55 -86 148 157 143 82 51 245 -93 -69 -95 108 -251 -70 -52 -139
4886 -139 190 45 -146 170 -119 166 100 -102 -82 -307 37 60 29 -101 -91 -77 -246 -205 -101 95 -362 -253
4908 -253 -97 -69 116 -73 -41 -43 194 -93 -19 -42 2 30 -76 37 -335 135 231 -19 0 28 225 148 98 156 107
4933 107 35 -65 -26 -94 -33 12 377 144 57 -56 -116 -30 -8 53 -36 260 162 -297 -137 -219 48 -165 60 185
4957 185 116 -272 -12 334 -89 137 -28 -87 -4 -20 33 -174 90 117 -283 -124 181 -66 -70 -332 114 138 156
4980 156 178 34 -2 -103 249 151 -13 9 169 162 76 185 78 -166 25 -74 -2 -569 132 -8 -108 -100 -59 212
5004 212 -178 -113 -126 -77 63 179 -77 -141 -102 276 -127 -330 -9 126 -337 -107 198 121 164 -79 -72 -162 68
5027 68 -39 -58 -135 265 -48 -42 -14 -106 96 -28 63 85 -33 -19 -56 -21 269 -148 24 68 9 -76 31 -203 5
5052 5 31 -55 30 -166 -138 -54 37 86 174 90 66 132 17 247 186 -57 313 31 -68 27 68 231 26 -75 193 55
5078 55 -244 49 -8 55 -82 -185 -55 -166 -91 -7 92 49 -256 83 -237 -5 212 -40 -134 -19 45 -39 26 62
5102 62 160 97 17 -80 253 4 -153 -133 -89 -225 261 -120 94 50 -69 9 -90 -107 -23 73 169 -22 139 28 -84
5127 -84 -269 143 98 -192 275 -70 81 113 -18 -289 -27 -144 32 -113 112 -261 -4 -101 190 -123 82
5148 82 380 21 222 177 199 -302 -21 -129 107 -164 38 191 121 1 -49 -298 -23 10 -19 -63 -80 127 164
5171 164 -342 -195 -204 -22 57 -104 73 -94 -91 -232 -249 -91 159 139 97 -318 25 -99 -104 81 -29 -182 116
5194 116 -69 109 -148 56 -131 -151 -162 58 93 -59 -3 14 152 109 172 -69 90 149 -77 -19 65 -255 107
5217 107 -46 -126 103 -244 -251 -98 -139 -142 -262 192 -3 172 33 200 75 -31 -51 18 199 -60 211 -168 255
5240 255 24 129 179 -268 -56 -245 -86 68 295 148 45 -352 -92 52 -61 37 45 -49 126 144 -28 50
5262 50 -106 135 -111 324 295 -44 -90 -109 -77 74 158 5 -5 -15 -31 -200 36 -12 24 146 43 20 110 140 -172
5287 -172 -102 -177 -80 -64 100 -49 -65 -220 -36 -121 130 115 -42 71 11 -99 73 84 38 37 -30 24 105 -4 25
5312 25 -405 -187 224 -41 518 32 91 -91 36 224 -123 153 -111 57 129 -76 -83 170 140 -90 258 -3
5334 -3 -36 14 240 211 -240 -39 330 81 159 62 -54 155 100 114 -142 49 17 69 -21 -213 -79 -129 73 37 -87
5359 -87 202 91 47 -153 132 25 -191 -92 174 94 227 -26 90 -73 -14 -12 99 -200 -152 173 -129 88 38
5382 38 35 -92 155 -180 -137 -215 -38 142 -252 162 -109 119 -77 -13 -51 -130 16 -260 168 -178 175 -208 -25
5405 -25 -267 106 -41 107 -122 -96 315 -22 58 156 190 230 32 138 -83 -9 -220 107 187 72 110 203 -148
5428 -148 -5 188 -175 -233 -45 6 -11 0 -134 67 119 108 104 63 -98 149 138 -159 26 230 226 186 5 14 26
5453 26 63 -240 99 185 24 61 175 -71 -236 309 234 -93 15 -136 -11 -28 -163 314 -247 98 80 -26
5475 -26 -148 -26 25 122 83 183 -215 17 198 -133 -75 -143 -22 18 -65 309 332 41 30 -66 -10 104 101 97 9 -15
5501 -15 -48 88 8 -39 -57 3 55 117 -56 58 169 -18 -38 180 -264 132 57 108 -46 -91 167 -166 -37 -109
5525 -109 -214 421 212 -80 132 122 138 -142 -93 -36 -138 -258 24 1 79 -46 34 -141 149 82 -49 -225 -35
5548 -35 -100 366 91 -261 60 90 3 -115 67 261 36 -67 -36 256 312 237 10 -16 193 -172 69 -129 132
5571 132 164 173 -151 -19 -223 -90 42 149 -139 24 -98 -183 113 54 8 94 -246 -109 94 12 165 -25 216
5594 216 -44 41 40 -103 -75 201 -6 167 -21 87 39 -79 168 -22 189 187 -121 182 114 -288 186 142 154
5617 154 -58 -115 104 10 -98 -18 -142 292 -177 -221 23 -260 -409 -371 -30 -147 39 62 -39 -175 184 50
5639 50 208 156 -8 -121 -87 -347 352 34 13 -29 -62 -61 241 -3 74 -167 74 31 82 -110 -51 31 110 -96 -71
5664 -71 -152 -214 -125 63 246 53 -36 -58 72 23 -3 22 -231 255 -244 46 150 162 -106 373 -210 -48 184
5687 184 36 -74 -113 70 -97 -162 38 220 107 -55 -93 25 -79 -92 -260 -213 -196 104 -168 -95 -211 -28
5709 -28 -202 -96 -84 183 -2 -131 -52 -21 -118 -215 20 -164 -199 -126 75 309 0 141 63 207 140 137 17 29
5733 29 91 293 -9 -131 30 -20 116 -75 -174 -277 -29 235 -17 -349 62 37 -136 103 -156 147 -89 -197
5755 -197 -116 158 28 120 -31 -85 133 298 20 139 28 37 24 185 -61 -159 183 -73 -3 -177 128 -161 -122
5778 -122 206 -450 193 -10 9 30 -68 162 -266 137 -29 77 0 189 -11 116 -108 -68 -143 145 -37 183
5800 183 161 89 -12 -101 199 173 116 -135 39 -185 -76 8 -9 -85 117 -179 286 181 -75 110 47 -114 85
5823 85 -176 26 112 -66 -198 12 112 199 -226 -116 -27 84 244 -251 -49 -377 -126 -4 -96 380 -23 -37
5845 -37 298 44 97 54 289 108 24 -37 -240 -33 -122 -62 -199 46 -17 -9 -98 171 -120 -103 -49 -147 15 91 -11
5870 -11 304 241 -80 84 -230 -183 -104 -172 -142 86 -300 241 64 -303 -220 -97 -388 48 -190 118 25 -282 115
5893 115 201 170 41 29 2 -112 203 41 -18 29 -410 161 -162 72 -22 -118 298 -24 -11 -344 -107 -229 -206
5916 -206 -125 -198 -283 57 23 -107 21 -196 -23 -112 -125 115 213 132 -97 -12 17 -173 68 -64 -208 181 37
5939 37 7 4 126 14 85 80 -47 5 -206 -117 -172 82 -168 -156 39 39 -105 -156 -30 -220 -67 -64 -237 198 -284
5964 -284 24 42 158 -63 -29 148 -187 -283 62 190 -11 93 126 -95 1 42 -95 0 70 21 -207 -163 40
5987 40 -114 16 -77 -181 -63 -40 159 -74 -245 -38 -85 168 50 46 265 -108 72 41 57 -177 -125 78 -53
6010 -53 254 101 72 182 55 -184 -59 201 -98 42 -116 211 147 -178 -13 -39 -92 -19 70 180 9 -254
6032 -254 -217 -39 -224 10 -302 136 -75 29 -365 136 -134 -178 89 -116 236 -14 119 -301 -165 -226 34
6053 34 45 77 66 111 -270 117 -9 -32 106 -28 51 37 113 59 -48 -211 -83 -107 132 229 74 92 29 -123 -108
6078 -108 10 -86 -2 -61 97 -22 176 -167 -58 -64 86 -142 -251 12 -43 -177 254 -218 151 174 163 193 90
6101 90 78 88 -41 -272 62 -351 -19 105 -38 115 -56 -280 270 -55 -64 196 161 -113 53 123 228 -44
6123 -44 -40 -469 34 18 -92 -248 102 -250 -45 26 157 232 158 -113 239 -91 -3 -96 -305 109 140 3 414
6146 414 304 71 28 189 -141 -192 -151 -118 71 -1 -181 34 52 143 -47 36 125 75 24 -106 164 -114 246 120
6170 120 -23 4 -233 -386 -156 10 146 -190 -437 133 229 -54 -288 47 -48 -71 -88 -54 -153 -112 22 -62 -190
6193 -190 -157 -44 36 -72 -282 113 73 -3 14 -207 -44 -66 -213 -32 87 17 205 95 27 160 -127 22 82
6216 82 158 208 -6 -149 -201 281 26 -24 -87 -129 -70 76 161 46 -216 184 -156 117 -12 -76 227 86 14 93
6240 93 -122 16 -6 108 127 61 86 -55 186 280 -38 -223 24 -15 -83 -32 -172 -33 74 67 288 -120 -7 -263
6264 -263 196 -7 -55 216 -83 106 124 221 116 243 -53 -207 340 46 240 -93 241 222 1 -151 91
6285 91 100 -102 82 -89 54 -33 -9 -213 -168 181 93 -14 173 -63 143 -133 -12 44 -148 7 -106 23 -10
6308 -10 93 -228 175 81 32 -252 -147 49 187 53 31 -279 -13 30 86 -144 -3 -147 263 209 -274 -123
6330 -123 -114 -248 67 -128 -170 12 83 177 65 48 25 -224 146 224 28 -24 98 287 -34 152 265 186 128 -46
6354 -46 -58 112 36 28 -214 -33 31 -136 144 172 133 -76 93 156 141 -233 93 -48 230 76 -212 149 36
6377 36 155 -140 15 38 -73 71 219 -137 60 20 49 -162 -204 -64 -24 72 147 -174 -17 -7 108 137 -195
6400 -195 28 116 170 277 117 -106 -169 18 -353 -38 29 169 110 -6 -138 -263 -3 -19 -189 -61 -63 327 293
6423 293 252 56 366 -84 -266 122 -172 -112 25 -13 -133 -37 -261 -11 185 -51 122 248 -57 -419 -324 161
6445 161 57 46 -6 152 -161 -132 -68 60 -31 -172 128 44 -34 -129 149 91 -24 95 -129 -89 -313 -76 -3 -13
6469 -13 -89 -131 -141 -146 219 -30 205 -67 325 -140 69 -19 -67 64 -80 -228 200 -68 -12 51 -88 -130 -27 152
6493 152 117 113 -79 163 -163 35 -42 163 -140 -121 -151 91 289 -90 286 57 -382 299 275 -18 -132 209
6515 209 111 -12 227 -8 23 112 -55 -63 -151 26 110 -121 -305 -191 127 -111 -49 -405 -52 -116 40 -39 -4 326
6539 326 -333 -58 149 73 -23 47 343 132 -168 86 12 -2 -186 -48 267 -183 -44 -33 -47 -48 57 1 -119
6562 -119 -43 -262 87 15 -50 152 -154 50 166 -132 -189 -34 -123 215 18 8 -40 60 227 -42 -202 -22
6584 -22 144 212 79 -128 -212 111 18 -27 37 -277 21 12 144 -114 -73 401 23 -127 -21 -246 78 -134 156
6607 156 20 201 13 139 126 -1 -31 25 -8 276 -26 -270 -4 14 1 52 7 26 109 -78 -359 -152 33
6630 33 180 -145 -350 159 -5 -188 -99 45 -57 60 -29 -288 -206 6 94 -252 22 121 19 37 209 -31
6652 -31 -35 234 -151 517 199 188 -68 201 -67 -265 -177 134 31 59 79 -170 -88 109 18 -3 -51 58 159 -47
6676 -47 16 181 -61 62 67 -71 124 -177 -21 -160 282 -121 -105 -185 16 162 -42 105 271 31 118 126 21
6699 21 58 -330 -34 -14 -170 -198 198 24 73 -37 -23 -208 -150 180 -89 65 194 318 -89 24 146 -289
6721 -289 49 -36 -40 218 45 4 143 -167 -105 -32 -19 205 -270 20 -43 -87 230 274 48 -160 -129 197 28 -37
6745 -37 1 -98 72 96 86 45 -221 -52 -3 -43 42 -6 -26 127 -28 100 231 10 383 5 -8 248 234 357
6769 357 365 215 -168 194 148 60 317 -169 95 48 -188 211 -18 9 224 2 107 213 -26 -35 157 122 -322
6792 -322 -350 232 -68 -182 109 183 106 159 30 223 -325 -157 148 31 13 19 151 19 132 46 64 -152 357
6815 357 -222 23 90 240 -76 -186 105 196 67 74 -22 39 -200 130 97 -178 128 34 -121 124 -117 -197 -28
6838 -28 201 -77 27 10 -207 151 -79 -104 -70 46 140 1 39 50 235 79 179 0 126 -86 67 148 -212
6861 -212 -166 -90 67 -44 64 103 -206 214 -229 -94 76 -43 112 -24 211 -233 129 -154 -19 -85 -74 -26
6883 -26 -29 141 -91 9 101 22 -258 -166 23 -175 0 52 -93 -150 3 -130 206 -1 -34 -86 -114 13 112 -21
6907 -21 87 55 -124 193 -406 -117 118 36 -36 96 137 -55 -95 260 -157 153 17 -223 -28 173 129 -328
6929 -328 -249 152 90 -84 16 -36 -74 114 207 80 -252 -98 299 32 43 -73 -233 24 -166 -74 55 -335
6951 -335 199 44 -134 -177 -61 398 -104 214 -65 -235 60 -173 14 -49 161 46 139 -233 174 -221 -190
6972 -190 8 -3 -244 -31 121 -23 56 -314 124 209 40 -59 172 -50 -183 219 166 -62 167 170 265 32 21
6995 21 39 -27 -76 -36 -144 -171 -30 201 13 67 339 -59 -142 44 29 -4 -137 74 -128 99 117 -57 -120 319
7019 319 -3 -20 76 -221 122 -139 -252 -159 24 190 -173 7 -115 124 77 18 31 41 237 42 65 102 -30
7042 -30 44 102 -216 207 129 133 109 -6 114 -2 -279 -91 55 6 -240 53 257 -151 -111 103 -65 -83 26
7065 26 69 -34 -190 99 -16 21 -148 -92 180 121 -104 99 39 -125 -30 -71 -171 1 84 -167 125 135 -217
7088 -217 -224 58 62 -66 187 -401 -110 -138 7 200 195 348 -114 71 -241 -107 -160 -2 -233 -199 9 -84 277
7111 277 9 -61 -189 156 -21 105 -94 -115 -234 -9 -105 -3 91 154 -81 2 79 18 -46 -73 -151 84 177 -160
7135 -160 -56 -74 -125 -160 27 124 -111 -18 96 136 -489 -48 -70 -119 382 -51 -37 189 201 -130 -84 79 -121 55
7159 55 148 -173 88 -206 4 283 -14 -210 -160 97 -145 -17 -24 -137 60 145 -94 -14 -229 131 -57 148
7181 148 -361 -79 -35 153 254 -171 -16 -11 -117 39 105 15 -102 -210 95 -28 -56 102 25 -218 278 198 266
7204 266 -106 -215 232 29 -108 80 -41 110 -96 -27 377 113 0 43 281 15 147 10 -192 75 -142
7225 -142 -46 -45 29 9 -21 188 180 -244 42 74 -66 -61 -74 13 -282 -313 124 -216 -71 -16 -268 15 75 -240 -173 16
7251 16 -136 -212 -109 297 12 -177 264 175 -153 -241 12 -239 -104 24 70 -122 102 30 -3 26 -87 -115 188
7274 188 -179 -30 -55 467 -257 -35 -116 -93 -58 -189 147 8 -309 -14 236 22 225 15 -71 22 -60 -42 92
7297 92 241 -292 -107 -220 -117 -126 -55 4 170 -99 -71 298 406 37 244 153 -49 -115 -84 -19 107 138 -141 251
7321 251 4 -30 -55 302 53 -90 153 36 481 114 43 -4 168 41 23 -199 -139 89 176 83 -225 -33 -151
7344 -151 -307 -234 12 -82 99 -68 235 -217 278 -90 -225 135 -170 4 -58 -31 2 -27 46 114 -19 235 147
7367 147 -71 98 184 13 -172 348 -24 -112 -99 96 -280 -78 -11 11 -135 -10 -181 157 -3 73 -119 83
7389 83 -29 144 -82 75 35 -117 129 13 19 -2 -107 -105 181 -167 62 33 84 -99 44 16 98 -78 -9 30
7413 30 -32 -88 144 7 -122 -36 70 -196 -55 -79 168 176 -113 83 29 -191 20 -57 -126 -127 73 169 70 30 -197
7438 -197 79 39 -130 -198 35 97 -192 -145 -136 247 153 58 242 238 -167 -14 -127 56 48 -152 69 -165 -131 246
7462 246 -79 -156 -379 -112 75 -58 -17 -108 -123 -108 122 -26 207 21 37 61 -88 -70 251 219 -86 180 105
7485 105 -133 -4 31 -95 -71 -104 94 -93 -131 -87 -73 217 68 225 -73 -6 44 105 171 -44 123 -206 -201 262
7509 262 -88 -24 -151 135 -189 -14 -52 -315 -9 109 115 -235 -23 217 157 42 48 253 -69 22 -327 -124 96
7532 96 -103 -125 -69 -100 -27 90 -217 -12 24 233 -70 -146 91 -204 78 -21 -148 360 53 -48 83 391 223
7555 223 -4 -174 203 92 -29 60 -68 67 96 -98 204 -121 91 -32 87 -46 34 130 -60 156 142 31
7577 31 179 -105 -107 8 230 -84 -23 159 -133 178 105 -15 264 -76 30 197 72 162 -92 -106 -9 -20 122
7600 122 -165 -134 89 -194 111 -14 40 158 -159 73 8 7 6 110 152 -46 94 107 -134 88 -367 -99 -103 -188
7624 -188 178 -172 17 -90 87 117 163 40 -210 147 -109 90 -1 -189 221 100 121 41 -68 137 32 22
7646 22 158 19 25 -174 -168 175 -194 201 210 -10 93 133 13 -79 126 -249 221 125 39 -32 -138 49 -33 -255
7670 -255 -21 35 66 12 -208 -200 4 -125 6 -104 44 45 137 90 202 -153 58 83 359 134 -188 160 -278
7693 -278 106 54 -103 -86 -430 -46 213 -46 -31 147 38 -120 -53 88 -15 5 -182 -126 289 -136 -38 -259
7715 -259 -74 -175 36 24 71 11 95 220 84 94 90 70 -275 308 62 52 135 -137 -10 -107 -114 395 -116 -42 -341
7740 -341 -48 17 218 140 -38 242 151 -22 14 -74 9 124 -64 -102 -19 -67 42 -118 16 15 293 -113 -84 3
7764 3 -223 135 227 -63 105 -134 -353 -31 23 191 52 95 -203 11 -65 55 84 112 -32 -125 219 -147 170
7787 170 30 -214 -201 -255 -247 59 75 -21 -119 119 165 -108 118 -303 -140 76 -99 129 124 49 -92 -124 169 50
7811 50 -168 61 94 -134 109 231 158 4 -72 -187 -2 20 85 37 -28 81 -155 44 25 92 72 -16 -98 -455
7835 -455 181 -148 107 -121 -31 28 156 -133 -130 61 53 30 -16 -15 92 151 -369 141 -17 -38 103 148 -144 -70 165
7860 165 -101 148 -113 166 -90 186 -211 0 -213 -1 -109 -128 103 59 104 -128 159 120 159 32 -133 114
7882 114 57 24 -22 -66 -306 38 93 45 -46 43 -274 111 25 188 -260 72 -100 -142 -102 -83 65 -76 277 -17
7906 -17 144 153 -47 -135 81 138 -140 -223 -6 163 24 27 -177 -271 218 24 -32 33 -88 -166 -182 -113 -212 -153 -5
7931 -5 -55 0 169 93 -104 -149 -32 -83 -207 51 -225 45 -78 -67 190 -277 69 -21 62 -70 -51 46 -206 180
7955 180 88 -303 134 -110 -130 -33 128 -5 -194 164 224 -107 11 -68 -11 20 -318 -11 33 -199 70 209 -272
7978 -272 -29 -239 -1 -245 -46 -42 -99 -184 261 -131 129 50 26 129 122 -293 -31 326 -125 254 78 -27 -67
8001 -67 -146 240 89 -177 -16 56 48 172 14 67 -63 -14 -80 112 400 36 205 52 -79 258 -159 -37 101
8024 101 55 75 -197 -67 -115 -244 -76 -109 24 -28 -26 18 5 -27 -14 -170 104 -294 -37 -134 -62 -192 -141 -32 21
8049 21 -12 0 -288 -26 176 -180 -114 -86 -262 74 -123 11 -147 -69 -79 -47 103 39 -180 -118 -42 -236 123 5
8073 5 -79 -113 157 -76 -118 -8 160 54 23 44 -53 -41 -98 -96 11 222 -219 -221 150 76 2 64 217 -196 68 -300
8099 -300 -49 -11 66 -75 176 137 130 -157 -70 284 23 -193 92 -161 -4 311 -65 3 -79 -98 -102 -130 194 -39
8123 -39 -282 1 226 95 -68 259 184 30 -233 78 -4 -168 126 -106 -116 -71 145 187 72 -139 88 -185
8145 -185 -147 -234 219 287 142 95 51 195 159 149 -43 121 -327 -88 -52 74 -131 96 127 55 5 -99 125 48
8169 48 12 114 77 -144 58 105 -132 -20 -79 8 -45 213 78 104 -207 27 145 -25 -41 30 6 -158
8191a58
##END NTUPLES=NMR FID
##END=
