##TITLE=1H_LR-784-R3-CR7
 200.13MHz, CDCl3,
 8 sc
 
 3.2.2025
##JCAMPDX= 6.0         $$ Bruker NMR JCAMP-DX V2.0
##DATA TYPE= NMR FID
##DATA CLASS= NTUPLES
##ORIGIN= UXNMR, Bruker Analytische Messtechnik GmbH
##OWNER= pz
$$ XWIN-NMR		Version 3.5
$$ Mon Feb  3 18:27:04 2025 Russian Standard Time (UT+4h)  she@DPX200
##.OBSERVE FREQUENCY= 200.1313
##.OBSERVE NUCLEUS= ^1H
##.DELAY= (6, 6)
##.ACQUISITION MODE= SIMULTANEOUS
##.ACQUISITION SCHEME= undefined
##.AVERAGES= 8
##.DIGITISER RES= 18
##SPECTROMETER/DATA SYSTEM= spect
##.PULSE SEQUENCE= zg30
##.SOLVENT NAME= CDCl3
##.SHIFT REFERENCE= (INTERNAL, CDCl3, 0, 14.3821)
##AUDIT TRAIL= $$ (NUMBER, WHEN, WHO, WHERE, WHAT)
$$ ##TITLE= Audit trail, XWIN-NMR		Version 3.5
$$ ##JCAMPDX= 5.01
$$ ##ORIGIN= Bruker BioSpin GmbH
$$ ##OWNER= she
$$ F:/spectra/data/she/nmr/H-C/1/audita.txt
$$ ##AUDIT TRAIL=  $$ (NUMBER, WHEN, WHO, WHERE, WHAT)
(   1,<2025-02-03 18:25:42.04 +0400>,<she>,<DPX200>,
      <created by zg, POWCHK disabled, PULCHK disabled
       configuration hash MD5:
       00 E9 B6 7A A2 85 ED C7 34 08 36 98 17 FE 4E 26
       data hash MD5: 16K
       AC 89 19 6E DB 5C 31 27 1C 57 9C A2 CF F7 8A C6>)
$$ ##END=
$$ 
$$ hash MD5
$$ 63 38 13 C5 39 CA 03 7B FE 88 E0 8D 54 BD A5 F3
##$RELAX= 
##$RELAX= 
##$RELAX= 
##$RELAX= 
##$RELAX= 
##$RELAX= 
$$ Bruker specific parameters
$$ --------------------------
##$DU= <F:/spectra>
##$EXPNO= 1
##$NAME= <H-C>
##$PROCNO= 1
##$TYPE= <nmr>
##$USER= <she>
##$AMP= (0..31)
100 100 100 100 100 100 100 100 100 100 100 100 100 100 100 100 100 100 
100 100 100 100 100 100 100 100 100 100 100 100 100 100 
##$AQSEQ= 0
##$AQ_mod= 1
##$AUNM= <au_zg>
##$AUTOPOS= <>
##$BF1= 200.13
##$BF2= 200.13
##$BF3= 200.13
##$BF4= 200.13
##$BF5= 200.13
##$BF6= 200.13
##$BF7= 200.13
##$BF8= 200.13
##$BYTORDA= 1
##$CFDGTYP= 0
##$CFRGTYP= 5
##$CHEMSTR= <none>
##$CNST= (0..31)
1 1 145 1 1 1 1 1 1 1 1 1 1 1 1 1 1 1 1 1 1 1 1 1 1 1 1 1 1 1 1 1 
##$CPDPRG= <>
##$CPDPRG1= <>
##$CPDPRG2= <>
##$CPDPRG3= <>
##$CPDPRG4= <mlev>
##$CPDPRG5= <mlev>
##$CPDPRG6= <mlev>
##$CPDPRG7= <mlev>
##$CPDPRG8= <mlev>
##$CPDPRGB= <>
##$CPDPRGT= <>
##$D= (0..31)
0 0.7 0 0 0 0 0 0 0 0 0 0.03 0 0 0 0 0 0 0 0 0 0 0 0 0 0 0 0 0 0 0 0 
##$DATE= 1738592741
##$DBL= (0..7)
120 120 120 120 120 120 120 120 
##$DBP= (0..7)
150 150 150 150 150 150 150 150 
##$DBP07= 0
##$DBPNAM0= <>
##$DBPNAM1= <>
##$DBPNAM2= <>
##$DBPNAM3= <>
##$DBPNAM4= <>
##$DBPNAM5= <>
##$DBPNAM6= <>
##$DBPNAM7= <>
##$DBPOAL= (0..7)
0.5 0.5 0.5 0.5 0.5 0.5 0.5 0.5 
##$DBPOFFS= (0..7)
0 0 0 0 0 0 0 0 
##$DE= 6
##$DECBNUC= <off>
##$DECIM= 32
##$DECNUC= <off>
##$DECSTAT= 4
##$DIGMOD= 1
##$DIGTYP= 9
##$DL= (0..7)
0 120 120 120 120 120 120 120 
##$DP= (0..7)
150 150 150 150 150 150 150 150 
##$DP07= 0
##$DPNAME0= <>
##$DPNAME1= <>
##$DPNAME2= <>
##$DPNAME3= <>
##$DPNAME4= <>
##$DPNAME5= <>
##$DPNAME6= <>
##$DPNAME7= <>
##$DPOAL= (0..7)
0.5 0.5 0.5 0.5 0.5 0.5 0.5 0.5 
##$DPOFFS= (0..7)
0 0 0 0 0 0 0 0 
##$DQDMODE= 0
##$DR= 18
##$DS= 0
##$DSLIST= <SSSSSSSSSSSSSSS>
$$ [...]
##$SUBNAM0= <"">
##$SUBNAM1= <"">
##$SUBNAM2= <"">
##$SUBNAM3= <"">
##$SUBNAM4= <"">
##$SUBNAM5= <"">
##$SUBNAM6= <"">
##$SUBNAM7= <"">
##$SUBNAM8= <"">
##$SUBNAM9= <"">
##$SW= 18.0517328524113
##$SWIBOX= (0..15)
0 0 2 0 0 0 0 0 0 0 0 0 0 0 0 0 
##$SW_h= 3612.71676300578
##$TD= 16384
##$TD0= 1
##$TE= 0
##$TE2= 300
##$TE3= 300
##$TEG= 300
##$TL= (0..7)
0 120 120 120 120 120 120 120 
##$TP= (0..7)
150 150 150 150 150 150 150 150 
##$TP07= 0
##$TPNAME0= <>
##$TPNAME1= <>
##$TPNAME2= <>
##$TPNAME3= <>
##$TPNAME4= <>
##$TPNAME5= <>
##$TPNAME6= <>
##$TPNAME7= <>
##$TPOAL= (0..7)
0.5 0.5 0.5 0.5 0.5 0.5 0.5 0.5 
##$TPOFFS= (0..7)
0 0 0 0 0 0 0 0 
##$TUNHIN= 0
##$TUNHOUT= 0
##$TUNXOUT= 0
##$USERA1= <user>
##$USERA2= <user>
##$USERA3= <user>
##$USERA4= <user>
##$USERA5= <user>
##$V9= 5
##$VALIST= <valist>
##$VCLIST= <CCCCCCCCCCCCCCC>
##$VD= 0
##$VDLIST= <DDDDDDDDDDDDDDD>
##$VPLIST= <PPPPPPPPPPPPPPP>
##$VTLIST= <TTTTTTTTTTTTTTT>
##$WBST= 1024
##$WBSW= 4
##$XGAIN= (0..3)
0 0 0 0 
##$XL= 0
##$YL= 0
##$YMAX_a= 478393
##$YMIN_a= -516487
##$ZGOPTNS= <>
##$ZL1= 120
##$ZL2= 120
##$ZL3= 120
##$ZL4= 120
##$ABSF1= 10
##$ABSF2= 0
##$ABSG= 5
##$ABSL= 3
##$ALPHA= 0
##$AQORDER= 0
##$ASSFAC= 0
##$ASSFACI= 0
##$ASSFACX= 0
##$ASSWID= 0
##$AUNMP= <proc_1d>
##$AZFE= 0.1
##$AZFW= 0.1
##$BCFW= 1
##$BC_mod= 2
##$BYTORDP= 1
##$COROFFS= 0
##$CY= -3
##$DATMOD= 1
##$DC= 2
##$DFILT= <>
##$DTYPP= 0
##$F1P= 0
##$F2P= 0
##$FCOR= 0.5
##$FTSIZE= 0
##$FT_mod= 4
##$GAMMA= 1
##$GB= 0.15
##$INTBC= 1
##$INTSCL= 1
##$ISEN= 128
##$LB= 0.25
##$LEV0= 0
##$LPBIN= 0
##$MAXI= 10000
##$MC2= 0
##$MEAN= 0
##$ME_mod= 0
##$MI= 1.114404
##$NCOEF= 0
##$NC_proc= 0
##$NLEV= 6
##$NOISF1= 3.799351
##$NOISF2= 2.8
##$NSP= 1
##$NTH_PI= 0
##$NZP= 0
##$OFFSET= 14.38212
##$PC= 1
##$PHC0= -109.5098
##$PHC1= 13.79222
##$PH_mod= 1
##$PKNL= yes
##$PPARMOD= 0
##$PSCAL= 0
##$PSIGN= 0
##$REVERSE= no
##$SF= 200.129724274929
##$SI= 16384
##$SIGF1= 3
##$SIGF2= 2
##$SINO= 400
##$SIOLD= 16384
##$SREGLST= <1H.CDCl3>
##$SSB= 0
##$STSI= 0
##$STSR= 0
##$SW_p= 3205.1282051282
##$SYMM= 0
##$S_DEV= 0
##$TDeff= 0
##$TDoff= 0
##$TI= <>
##$TILT= no
##$TM1= 0
##$TM2= 0
##$TOPLEV= 0
##$USERP1= <user>
##$USERP2= <user>
##$USERP3= <user>
##$USERP4= <user>
##$USERP5= <user>
##$WDW= 1
##$XDIM= 8192
##$YMAX_p= 0
##$YMIN_p= 0
$$ End of Bruker specific parameters
$$ ---------------------------------
##NTUPLES= NMR FID
##VAR_NAME=  TIME,          FID/REAL,        FID/IMAG
##SYMBOL=    X,             R,               I
##VAR_TYPE=  INDEPENDENT,   DEPENDENT,       DEPENDENT
##VAR_FORM=  AFFN,          ASDF,            ASDF
##VAR_DIM=   8192,          8192,            8192
##UNITS=     SECONDS,       ARBITRARY UNITS, ARBITRARY UNITS
##FACTOR=    0.0002768,     1,               1
##FIRST=     0,             0,               0
##LAST=      2.2672688,     0,               0
##MIN=       0,             -516487,         0
##MAX=       2.2672688,     478393,          0
$$ Real data points
##PAGE= N=1
##DATA TABLE= (X++(R..R)), XYDATA
$$ plain form
0 0 0 0 0 0 0 0 0 0 0 0 0 0 0 0 8 -8 8 -8 8 -8 10 -16 16 -16 21 -24 28 -32 37 -44 45 -53 60 -68 76 -85 97
37 97 -105 117 -132 146 -162 177 -196 214 -237 260 -287 318 -349 383 -423 468 -518 574 -639 716
57 716 -807 913 -1045 1208 -1418 1701 -2095 2677 -3612 5295 -8938 19917 -117847 -516487
71 -516487 29134 478393 -9524 -364201 109211 416074 1502 -263716 67848 263594
81 263594 -23352 -222204 -51799 82616 -32707 -152970 -109195 1452 59134 10744 -64729
92 -64729 1283 150234 95568 -99494 -37968 204796 123926 -182478 -113969 211280 114073
103 114073 -259346 -161775 228197 115366 -286432 -164122 228654 90617 -273073 -96853
113 -96853 265856 107823 -194836 -29565 227657 84894 -115034 -11310 108248 18839
$$ packed form
0@%%%%%%%%%%%%%%Qj6J6j6J6j6J8k6L2l2L7m5N2o0O9q1Q9r8J13j28J44j61J82
37I7k02K22k49K78l08L39l73M10m51M97n47O05o67P32q06Q91r86J092j213J355
57G16j523J720j958K253k626L119l796M772o289Q907j4233K8855j37764l98640
71e16487N45621M49259m87917l54677M73412L06863m14572k65218L31564J95746
81B63594k86946j98852J70405J34415j15323j20263M3775J10647N7682m8390p5473
92f4729O6012J48951n4666j95062O1526K42764q0870l06404O8509L25249r7207
103A14073l73419R7571L89972j12831m01798J22310L92776j38037l63690J76220
113i6853L62709j58033l02659J65271K57222j42763j99928J03724J19558q9409
$$ plain form
123 18839 -67107 -43804 -28625 -23859 -4902 -46944 -77506 26748 90469 -43925 -109988 74706
135 74706 164831 -40750 -133275 91772 175317 -76884 -161977 94368 159740 -111324 -167438
146 -167438 104558 138930 -140829 -167893 104025 122425 -121464 -113459 114343 97870 -88899
157 -88899 -44523 117636 67353 -59786 -14882 55836 161 -42130 -11709 -20845 -34442 17469
169 17469 17465 -57289 -26748 77081 28981 -79619 -855 113208 7011 -112691 9676 123130
181 123130 -16992 -124151 26944 122711 -37270 -122375 36351 100098 -61759 -107587 55988
192 55988 90225 -63117 -75416 74895 79905 -49767 -38574 69101 38591 -56490 -26846
203 -26846 35139 -8190 -49417 -6274 12232 -19448 -5662 22145 -8611 -14296 42142 34526
$$ packed form
123A8839q5946K3303J5179M766J8957m2042l0562J04254O3721j34394o6063J84694
135G4706R0125k05581r2525K25047Q3545k52201q5093K56345O5372k71064n6114
146a67438K71996L4372k79759k7064K71918J8400k43889Q005K27802j6473j86769
157h8899M4376J62159n0283j27139M4904P0718n5675m2291L0421r136j3597N1911
169A7469mp4754L0541J03829m8100j08600P8764J14063j06197j19702J22367J13454
181A23130j40122j07159J51095R5767j59981q5105J58726O3747j61857m5828J63575
192E5988L4237j53342j2299J50311N010j29672J1193J07675l0510r5081K9644
203b6846O1985m3329m1227M3143J8506l1680J3786K7807l0756n685N6438p616
$$ plain form
215 34526 -37204 -12133 65920 17063 -69220 -4976 77829 -8701 -92071 5670 80244 -32000
227 -32000 -101900 18005 82507 -37020 -86583 40529 87837 -28131 -58821 58307 82742
238 82742 -27192 -50240 40718 47080 -39936 -52270 9662 12494 -32910 -32437 -2917 4319 2604
251 2604 287 -10649 4683 40492 19836 -30644 1506 66278 21076 -59003 -7381 73790
263 73790 5116 -88367 -18515 68808 -12492 -100738 -14626 73123 -7647 -82274 6999 85859
275 85859 11114 -53120 19543 78443 13545 -43069 3355 44185 207 -44129 -20982 12288
287 12288 -41 -29291 -30584 -2106 18785 -912 -31347 -7251 42989 25393 -32332 -9953
299 -9953 62433 40590 -41569 -20127 62224 30848 -63831 -40054 46830 14560 -74670 -42596
$$ packed form
215C4526p1730K5071P8053m8857q6283O4244Q2805q6530q3370R7741P4574j12244
227c2000o9900J19905O4502j19527m9563J27112M7308j15968l0690J17128K4435
238H2742j09934k3048R0958O362q7016j2334O1932K832m5404M73K9520P236j715
251B604k317j0936J5332L5809k0656n0480L2150O4772m5202q0079N1622Q1171
263G3790o8674r3483O9852Q7323q1300q8246Q6112Q7749q0770p4627Q9273P8860
275H5859p4745o4234P2663N8900o4898n6614M6424M0830m3978m4336K3147L3270
287A2288j2329k9250j293K8478K0891j9697l0435K4096N0240j7596n7725K2379
299i953P2386k1843q2159K1442Q2351l1376r4679K3777Q6884l2270q9230L2074
$$ plain form
311 -42596 44143 17865 -55019 -22808 51399 30694 -28970 -9470 44393 30789 -16328 -13247
323 -13247 21811 22109 -10873 -23842 -2338 14691 -4316 -32051 -19885 15225 8960 -30820 -26002
336 -26002 26003 30003 -21373 -21984 39230 45047 -18644 -27390 35621 40255 -30098 -41109 22116
349 22116 27983 -35596 -42701 16924 26565 -24489 -30873 17908 28364 -9855 -20623 11732 25421
362 25421 1984 -15120 1463 21855 10864 -14608 -11554 15107 13501 -19131 -25222 7804 15890
375 15890 -19038 -28510 10479 26676 -9025 -23264 15485 33193 -5041 -25480 10518 29156
387 29156 -8327 -29404 4410 25408 -6505 -26371 3696 23707 -1856 -21501 -193 17928
399 17928 612 -17651 -5678 13568 6990 -10924 -8917 10997 14574 -6694 -14317 7464 17354
$$ packed form
311d2596Q6739k6278p2884L2211P4207k0705n9664J9500N3863j3604m7117L081
323a3247L5058K98l2982j2969K1504J7029j9007k7735J2166L5110o265l9780M818
336b6002N2005M000n1376o11O1214N817o3691q746O3011M634p0353j1011O3225
349B2116N867o3579p105N9625R641n1054o384M8781J0456l8219j0768L2355J3689
362B5421k3437j7104J6583K0392j0991k5472L054K6661j606l2632o091L3026Q086
375A5890l4928r472L8989J6197l5701j4239L8749J7708l8234k0439L5998J8638
387B9156l7483k1077L3814K0998l1913j9866L0067K0011k5563j9645K1308J8121
399A7928j7316j8263J1973J9246o578j7914K007J9914L577k1268p623K1781R890
$$ plain form
412 17354 -7013 -20076 4235 19203 -4530 -19544 5435 22161 -673 -17839 2933 18558
424 18558 -2175 -20756 -4533 12811 -1916 -17981 -4328 13961 5178 -10202 -861 15602
436 15602 8615 -7456 -3607 10231 7256 -7972 -8404 4829 7440 -5785 -11006 1227 7988 -5719
450 -5719 -15926 -1449 11483 -1992 -15558 1033 19093 5891 -10566 3776 21931 8522
462 8522 -11440 -2961 12673 1990 -17191 -11973 4142 1667 -14174 -12776 4666 8740 -4613
475 -4613 -7980 6292 13955 1717 -6514 5647 14700 3020 -7445 2949 13482 1213 -14116
488 -14116 -6136 6583 -3288 -18865 -9889 5858 -684 -14498 -4319 14449 9980 -4611 2254
501 2254 18564 12944 -4401 -3528 9007 6337 -7325 -9690 -870 249 -8139 -10859 -3741 1320
$$ packed form
412A7354k4367j3063K4311J4968k3733j5014K4979J6726k2834j7166K0772J5625
424A8558k0733j8581J6223J7344j4727j6065J3653J8289q783j5380R341J6463
436A5602o987j6071L849J3838k975j5228m32J3233K611j3225n221J2233O761j3707
450e719j0207J4477J2932j3475j3566J6591J8060j3202j6457J4342J8155j3409
462H522j9962Q479J5634j0683j9181N218J6115k475j5841J398J7442M074j3353
475d613l367J4272P663j2238q231J2161R053j1680j0465J0394J0533j2269j5329
488a4116P980J2719r871j5577Q976J5747o542j3814J0179J8768m469j4591O865
501B254J6310n620j7345Q73J2535k670j3662k365Q820J119q388k720P118N061
$$ plain form
515 1320 -3082 -7329 -2151 5015 3624 -1467 1516 10241 10978 3821 3097 7991 5230 -3718 -4621 1127
531 1127 -2094 -12225 -11473 -1906 -1984 -9716 -6507 4911 6690 -842 207 8578 9155 1128 -261 7665
547 7665 9207 -99 -5677 -90 4698 -1787 -9191 -5668 576 -3190 -10168 -7587 943 851 -3860 73
563 73 9735 9849 1481 213 8486 10041 443 -4094 1022 2125 -6081 -9406 -2592 1279 -4490 -7087
579 -7087 -320 3509 -1893 -5290 -60 5412 4119 483 1111 4997 5648 1315 -49 4180 4682 -2268
595 -2268 -6073 -1153 292 -6435 -8981 -1706 3571 -773 -4447 681 4847 2028 -839 3187 5918
610 5918 1508 -3306 -1147 3626 1554 -3507 -1096 3398 1279 -3727 -3369 29 -878 -3092 -1664 640
626 640 -270 -1901 -1269 583 3216 3110 485 348 3013 2013 -2185 -2394 1189 961 -1691 -455 1913
$$ packed form
515A320m402m247N178P166j391n091K983Q725P37p157p24M894k761q948r03N748
531A127l221j0131P52R567p8p732L209J1418J779p532J049Q371N77q027j389P926
547G665J542r306n578N587M788o485p404L523O244l766o978K581Q530r2m711L933
563G3R662J14q368j268Q273J555r598m537N116J103q206l325O814L871n769k597
579g087O767L829n402l397N230N472j293l636O28L886O51m333j364M229N02o950
595b268l805M920J445o727k546P275N277m344l674N128M166k819k867M026K731
610E918m410m814K159M773k072n061K411M494k119n006L58L398r07k214J428K304
626F40r10j631O32J852K633j06k625j37K665j000m198k09L583k28k652J236K368
$$ plain form
643 1913 414 -2434 -1479 1583 1056 -1764 -2921 -1383 -684 -2062 -2036 1017 3127 1595 251 2878
659 2878 3990 639 -1262 1947 3723 -915 -3447 -833 306 -1796 -2623 -1104 296 -1268 -3369
674 -3369 -2193 385 479 -1946 -837 3629 4343 882 734 4283 4583 1170 382 2185 518 -4198 -5094
691 -5094 -2490 -1523 -3679 -4366 -1713 883 522 -1634 86 3846 4025 768 1087 4839 3706 -36
707 -36 147 3378 1825 -1664 -2846 -1962 -2555 -4195 -4955 -4410 -2413 -1390 -1314 -314 2089 3323 3444 3730
725 3730 5357 4293 2379 1436 1686 514 -1437 -2136 -2220 -2624 -3733 -3787 -3192 -2323 -2425 -2595 -763 1798
743 1798 1679 572 2779 5944 5101 2243 2512 4360 2242 -1090 -2602 -1349 -2336 -4911 -5588 -3550
759 -3550 -2248 -2951 -3283 -382 2147 2124 1140 2910 4324 3183 1686 2884 3436 1988 -227 -46 239
$$ packed form
643A913j499k848R55L062n27k820j157J538O99j378K6L053K110j532j344K627
659B878J112l351j901L209J776m638k532K614J139k102q27J519J400j564k101
674c369J176K578R4k425J109M466P14l461j48L549L00l413p88J803j667m716q96
691e094K604R67k156o87K653K596l61k156J720L760J79l257L19L752j133l742
707c6J83L231j553l489j182Q84n93j640p60N45J997J023P6J000K403J234J21K86
725C730J627j064j914r43K50j172j951o99q4m04j109n4N95Q69j02j70J832K561
743A798j19j107K207L165q43k858K69J848k118l332j512J253r87k575o77K038
759c550J302p03l32K901K529k3r84J770J414j141j497J198N52j448k215J81K85
$$ plain form
776 239 -1694 -3601 -3390 -2763 -3353 -4253 -3670 -779 -29 -295 503 3260 4693 2866 2098 3892 4075 1033
794 1033 -926 913 814 -2358 -3862 -2278 -965 -2825 -3675 -2118 -379 -926 -1462 147 2026 2092 1000
811 1000 1786 3613 3539 1644 827 1817 1394 -866 -2512 -1936 -1286 -2679 -3866 -2376 -401 -853 -1783 -57
829 -57 2521 1799 -479 678 3397 1933 -275 896 2620 1231 -1128 -47 1181 -140 -1847 -1847 -839
846 -839 -1352 -2677 -2140 -583 306 -534 -408 1534 2310 1250 205 1328 2591 994 -1216 -170 1603
863 1603 628 -2186 -1455 1429 1252 -2424 -2250 825 440 -2763 -2800 921 967 -1740 -780 2250 2075 -177
881 -177 599 2513 1477 -29 361 799 -149 -748 -906 -493 -936 -1000 -1356 -1072 -538 -1126 -1377 -868 548
900 548 355 -835 255 2206 2621 645 871 2800 3074 -178 -1640 377 1079 -2554 -4289 -1202 364
$$ packed form
776B39j933j907K11O27n90r00N83K891P50k66P98K757J433j827p68J794J83l042
794A033j959J839r9l172j504J584J313j860q50J557J739n47n36J609J879O6j092
811A000P86J827p4j895q17R90m23k260j646N76O50j393j187J490J975m52r30J726
829e7K578p22k278J157K719j464k208J171J724j389k359J081J228j321j707%J008
846h39n13j325N37J557Q89q40J26J942P76j060j045J123J263j597k210J046J773
863A603r75k814P31K884j77l676J74L075l85l203l7L721M6k707R60L030j75k252
881a77P76J914j036j506L90M38r48n99j58M13m43o4l56K84N34n88k51N09J416
900E48j93j190J090J951M15j976K26J929K74l252j462K017P02l633j735L087J566
$$ plain form
917 364 -2405 -3419 -288 1126 -204 -887 1255 1923 1526 1513 1295 1547 2451 2068 308 278 1551 -557
935 -557 -2984 -2160 -616 -2554 -4056 -2016 225 -1768 -2161 935 2957 2004 753 2794 3978 2066
951 2066 -200 1158 2465 131 -2594 -1459 298 -2024 -4070 -2109 -92 -1917 -3024 -808 220
966 220 -530 636 1992 2519 2763 3462 2448 1645 2217 1941 -1231 -1662 125 -1714 -4642 -3380 -734
983 -734 -2151 -3364 -598 1906 86 -745 1402 2862 1895 1137 2346 2989 1785 -311 33 1169 105
1000 105 -2128 -2301 -778 -2295 -4341 -3002 -941 -1031 -1214 386 1199 1942 2259 2117 1524 2786 3381 469
1018 469 -779 1357 1015 -2813 -3134 463 -52 -3847 -2820 554 -709 -2434 -490 2037 782 124
1034 124 1439 2240 2164 1567 1450 1911 1749 461 -1221 -1755 -909 -1909 -2597 -1602 -1072 -1089 -1725 -571 287
$$ packed form
917C64k769j014L131J414j330o83K142O68l97j3k18K52R04l83j760l0J273k108
935e57k427Q24J544j938j502K040K241j993l93L096K022r53j251K041J184j912
951B066k266J358J307k334k725J135J757k322k046J961K017j825j107K216J028
966B20p50J166J356N27K44O99j014q03N72k76l172m31J787j839k928J262K646
983g34j417j213K766K504j820q31K147J460r67p58J209O43j204k096L44J136j064
1000A05k233j73J523j517k046J339K061r0j83J600Q13P43L17j42n93J262N95k912
1018D69j248K136l42l828l21L597n15l795J027L374j263j725J944K527j255o58
1034A24J315Q01p6n97j17M61j62j288j682n34Q46j000o88R95N30j7o36J154Q58
$$ plain form
1053 287 1023 898 665 1391 2415 843 -994 761 2722 655 -1589 631 1520 -2133 -2636 207 159
1070 159 -2631 -1849 552 -373 -2153 -42 1819 565 828 2037 1457 348 681 1097 27 -118 374
1087 374 -419 -765 -298 -187 -671 -906 -230 -219 -591 -1045 -699 147 12 -438 311 1810 791 -693 1093
1106 1093 2481 183 -1326 679 1727 -988 -1945 649 788 -2049 -1576 704 244 -1101 -897 -15
1122 -15 -594 -269 431 -135 -14 1703 1201 80 1154 2164 684 -950 305 1042 -1355 -2519 -875
1139 -875 -136 -1623 -2079 -787 475 -416 -1153 47 2126 1095 -168 645 2551 1649 -8 697 1359
1156 1359 443 -415 -120 -915 -1760 -1438 -1174 -2183 -1702 -173 -766 -1598 484 2123 392 246 2488 2558
1174 2558 761 359 2074 816 -1547 -633 1267 -949 -3007 -1432 14 -1737 -2293 -991 408 -213
$$ packed form
1053B87P36j25k33P26J024j572j837J755J961k067k244K220Q89l653n03K843m8
1070A59k790P82K401r25j780K111J861j254K63J209n80j109L33M16j070j45M92
1087C74p93l46M67J11m84k35O76J1l72m54L46Q46j35m50P49J499j019j484J786
1106A093J388k298j509K005J048k715r57K594J39k837M73K280m60j345K04Q82
1122a5n79L25P00n66J21J717n02j121J074J010j480j634J255P37k397j164J644
1139h75P39j487m56J292J262q91p37J200K079j031j263Q13J906r02j657P05O62
1156A359r16q58K95p95q45L22K64j009M81J529n93q32K082J639j731j46K242P0
1174B558j797m02J715j258k363R14J900k216k058J575J446j751n56J302J399o21
$$ plain form
1190 -213 -638 717 2091 1770 743 1925 2552 1758 225 386 168 -512 -881 -1561 -1968 -2163 -1038 -1700
1208 -1700 -1816 -487 290 -412 -774 1603 2555 658 261 2579 2469 73 -108 1873 355 -1825 -1347
1225 -1347 259 -1320 -2858 -1904 -531 -1128 -1826 -178 430 692 879 1523 2113 1468 1561 1295 650 216
1243 216 370 -193 -1063 -812 -434 -1361 -2317 -1203 24 -1077 -1647 -1 1160 113 -119 1600 2708
1260 2708 819 315 1912 2005 55 -629 719 -135 -1831 -1518 -410 -1102 -1691 -697 44 -115 -274 475
1278 475 474 226 800 1232 864 438 1303 881 365 -223 603 -88 -1210 -577 -218 -908 -1730 -670 174 -841
1298 -841 -1033 591 1477 216 -118 1056 1514 -85 -246 1155 821 -304 -385 425 -238 -715 -285 10
1316 10 -505 -918 -249 -391 -1132 -492 327 -278 -358 535 921 642 316 815 900 -158 106 640 150 -524 -225
$$ packed form
1190b13m25J355J374l21j027J182O27p94j533J61k18o80l69o80m07j95J125o62
1208a700j16J329P77p02l62K377R52j897l97K318j10k396j81J981j518k180M78
1225a347J606j579j538R54J373n97o98J648O08K62J87O44N90o45R3k66o45m34
1243B16J54n63q70K51L78r27r56J114J227j101n70J646J161j047k32J719J108
1260B708j889n04J597R3j950o84J348q54j696L13J108o92n89R94P41j59j59P49
1278D75jk48N74M32l68m26Q65m22n16n88Q26o91j122O33L59o90q22J060Q44j015
1298h41j92J624Q86j261l34J174M58j599j61J401l34j125q1Q10o63m77M30K95
1316A0n15m13O69j42p41O40Q19o05q0Q93L86k79l26M99Q5j058K64N34m90o74K99
$$ plain form
1337 -225 219 -323 -1142 -827 71 -367 -1172 -124 464 -304 -701 134 691 736 156 977 1099 438 357 438 29
1358 29 -149 97 -687 -1075 -726 -473 -981 -1352 -70 255 -448 -258 906 1030 -33 512 1545 1107 128
1377 128 478 1518 620 -634 -87 218 -754 -1374 -1533 -704 -1008 -1736 -648 184 -168 114 951 1395 576
1396 576 820 1077 1128 871 640 279 -69 -354 -486 -899 -1277 -1170 -455 -1580 -1485 -428 207 -264 -112 1093
1416 1093 1421 661 985 1988 1551 513 159 821 293 -712 -777 -407 -1234 -1708 -1115 -1070 -533 -719 35
1435 35 396 611 818 957 1074 1322 1447 1175 698 618 588 152 -604 -591 -800 -1192 -1591 -1021 -969 -1209 -854 99
1457 99 270 452 538 1150 1459 1006 478 1248 1085 80 -311 -39 -409 -971 -854 -474 -599 -1123 -832 -616
1477 -616 -677 -66 225 219 505 821 909 788 615 1045 719 376 288 -286 -811 -1060 -686 -796 -618 -715 -438 -681
$$ packed form
1337b25M44n42q19L15Q98m38q05J048N88p68l97Q35N57M5n80Q21J22o61q1Q1m09
1358B9j78K46p84l88L49K53n08l71J282L25p03J90J164J24j063N45J033m38r79
1377A28L50J040q98j254N47L05r72o20j59Q29l04p28J088Q32l52K82Q37M44q19
1396E76K44K57N1k57k31l61l48k85j32m13l78J07P15j125R5J057O35m71J52J205
1416A093L28p60L24J003m37j038l54O62n28j005o5L70q27m74N93M5N37j86P54
1435C5L61K15K07J39J17K48J25k72m77q0l0m36p56J3k09l92l99N70N2k40L55R53
1457I9J71J82Q6O12L09m53n28P70j63j005l91K72l70n62J17L80j25n24K91K16
1477f16o1O11K91oK86L16Q8j21j73M30l26l43q8n74n25k49L74j10J78r7K77k43
$$ plain form
1499 -681 -403 -64 230 392 458 664 365 887 530 192 614 760 244 -346 97 -339 -1120 -1077 -318 -1051 -744
1520 -744 -435 -196 -510 132 536 147 258 1026 898 -351 47 724 216 -126 128 538 -482 -798 -435
1539 -435 -584 -639 -439 -235 -586 -281 -304 -687 -6 577 559 81 1139 721 263 577 439 349 51 183 -63
1560 -63 -252 -575 -229 -655 -635 -247 -275 -373 -309 -4 -110 41 898 919 562 615 582 357 77 554 260 125 -85
1583 -85 -247 -1005 -1056 -674 -711 -941 -357 -310 -586 -216 393 148 181 843 1180 411 280 497 473 85 278 314
1605 314 -281 -880 -691 -982 -1346 -719 -529 -648 -281 64 -107 265 382 946 892 700 760 833 349 444 244
1626 244 -374 -376 -427 -906 -1074 -772 -540 -899 -359 233 -189 -350 321 590 380 1077 1332 1165 496 600 481
1647 481 -166 -402 -645 -804 -916 -505 -897 -1002 -737 -298 -75 -171 428 445 68 757 706 612 334 553 600 137
$$ packed form
1499f81K78L39K94J62O6K06k99N22l57l38M22J46n16n90M43m36p81M3P59p33L07
1520g44L09K39l14O42M04l89J11P68j28j249L98O77n08l42K54M10j020l16L63
1539d35j49n5K00K04l51L05k3l83O81N83j8m78J058m18m58L14j38r0k98J32k46
1560f3j89l23L46m26K0L88k8r8O4L05j06J51Q57K1l57N3l3k25k80M77k94j35k10
1583h5j62p58n1L82l7k30N84M7k76L70O09k45L3O62L37p69j31K17k4l88J93L6
1605C14n95n99J89k91l64O27J90j19L67L45j71L72J17N64n4j92O0P3m84R5k00
1626B44o18kn1m79j68L02K32l59N40N92m22j61O71K69k10O97K55j67o69J04j19
1647D81o47k36k43j59j12M11l92j05K65M39K23r6N99J7l77O89n1r4k78K19M7m63
$$ plain form
1669 137 -168 -146 -537 -614 -414 -723 -820 -707 -346 -900 -448 421 282 378 671 779 699 656 818 581 226 250
1691 250 184 -524 -479 -442 -938 -778 -366 -466 -784 -554 -258 -91 155 319 584 553 734 941 794 450 806
1712 806 85 -253 -138 -440 -475 -514 -314 -644 -591 -469 -266 -136 96 438 279 339 485 720 498 407 385 380 100
1735 100 -45 312 -235 -336 -366 -618 -465 -516 -319 -265 -570 69 -13 -120 135 559 567 597 181 274 427 433 18
1758 18 240 240 12 -415 -48 -531 -634 -345 -745 -466 -341 -149 -85 242 -31 137 441 585 329 584 111
1779 111 456 378 124 42 154 -122 -636 -455 -397 -289 -682 -443 29 -133 -107 -126 194 431 450 160 347 464
1801 464 435 555 327 -79 59 -87 -471 -338 -479 -674 -427 -256 -245 -400 -4 102 98 133 440 753 591 230
1823 230 410 582 148 265 -129 -37 -131 -706 -694 -560 -539 -676 -650 -432 -95 46 233 186 643 560 605 839 755
$$ packed form
1669A37l05K2l91p7K00l09r7J13L61n54M52Q69j39R6K93J08q0m3J62k37l55K4
1691B50o6p08M5L7m96J60M12j00l18K30K96J67K46J64K65l1J81K07j47l44L56
1712H06p21l38J15l02l5l9K00l30N3J22K03J30K32L42j59O0J46K35k22r1k2nk80
1735A00j45L57n47j01l0k52J53n1J97N4l05O39q2j07K55M24QL0m16R3J53Om15
1758A8K22%k28m27L67m83j03K89m00K79J25J92O4L27k73J68L04J44k56K55m73
1779A11L45p8k54q2J12k76n14J81N8J08l93K39M72j62K6j9L20K37J9k90J87J17
1801D64k9J20k28m06J38j46l84J33j41j95K47J71J1j55L96J06mL5L07L13j62l61
1823B30J80J72m34J17l94R2r4n75J2J34K1j37K6K18L37J41J87m7M57q3M5K34q4
$$ plain form
1846 755 439 323 385 129 -183 -399 -509 -379 -430 -605 -555 -407 -421 48 -120 78 511 598 626 607 819 966
1868 966 458 458 201 47 312 -680 -500 -545 -819 -790 -644 -453 -263 -126 -145 13 295 551 668 561 675 540
1890 540 402 364 -89 -131 -108 -424 -307 -826 -718 -235 -757 -751 -621 37 -47 -205 249 580 592 801 456 702
1912 702 595 314 39 -201 -125 -275 -635 -397 -775 -696 -639 -351 -127 -342 -3 110 230 378 480 576 750
1933 750 591 481 111 -51 160 -433 -503 -385 -239 -488 -415 -262 -267 -209 -158 159 -100 778 292 372 661 697 499
1956 499 251 393 255 152 -260 -229 -393 -516 -512 -461 -316 -114 -403 -32 -54 230 283 300 693 313 345 156 237
1979 237 257 208 32 276 25 -567 -252 -62 -375 -462 -418 -333 -35 -65 -68 14 298 345 432 310 401 857 106 -128
2003 -128 261 -148 159 -221 -246 -377 -124 -254 -314 -319 -335 -167 -71 110 15 285 152 331 355 142 359 52 85
$$ packed form
1846G55l16j16O2k56l12k16j10J30n1j75N0J48j4M69j68J98M33Q7K8j9K12J47
1868I66n08%k57j54K65r92J80m5k74K9J46J91J90J37j9J58K82K56J17j07J14j35
1890E40j38l8m53m2K3l16J17n19J08M83n22OJ30O58q4j58M54L31J2K09l45K46
1912G02j07k81k75k40P6j50l60K38l78P9N7K88K24k15L39J13J20J48J02R6J74
1933G50j59j10l70j62K11n93p0J18J46k49P3J53nN8N1L17k59Q78m86Q0K89L6j98
1956D99k48J42j38j03m12L1j64j23MN1J45K02k89L71k2K84N3J7L93l80L2j89Q1
1979B37K0m9j76K44k51n92L15J90l13q7M4Q5K98l0lQ2K84M7Q7j22R1M56p51k34
2003a28L89m09L07l80k5j31K53j30o0nj6J68R6J81r5K70j33J79K4k13K17l07L3
$$ plain form
2026 85 60 323 -88 -36 -175 -51 -379 -603 -273 -428 -247 -123 -117 -204 -96 130 351 295 325 606 -149 291 239
2049 239 110 310 -69 -89 -294 -181 -491 -123 -479 -218 -297 -146 -83 -31 38 -16 32 448 226 556 738 82
2071 82 -61 109 -11 -205 -231 -150 -253 -523 -308 -618 -374 -472 -5 -77 221 250 339 444 630 571 349 650 398
2094 398 232 101 -245 -352 -614 -420 -474 -280 -515 -228 -464 -376 113 212 145 351 116 460 304 609 499
2115 499 437 268 271 7 -317 -348 -271 -392 -510 -173 -522 -146 -488 -145 179 145 481 290 220 362 307 454 128
2138 128 489 289 45 -285 -109 -562 -439 -333 -98 -573 -254 -223 104 48 50 156 433 807 692 263 298 341
2160 341 251 354 48 -148 -368 -567 -612 -294 -487 -381 -327 -21 78 132 219 126 563 482 362 111 245 136 98
2183 98 -38 -234 -119 -256 -168 -627 -316 -536 -12 -177 -187 -131 151 96 389 422 165 580 502 256 530 81
$$ packed form
2026H5k5K63m11N2j39J24l28k24L30j55J81J24Oq7J08K26K21n6L0K81p55M40n2
2049B39j29K00l79k0k05J13l10L68l56K61p9J51O3N2O9n4M8M16k22L30J82o56
2071H2j43J70j20j94k6Q1j03k70K15l10K44r8M67p2K98K9Q9J05J86n9k22L01k52
2094C98j66j31l46j07k62J94n4J94k35K87k36Q8M89R9o7K06k35L44j56L05j10
2115D99o2j69Lk64l24l1P7j21j18L37l49L76l42L43L24l4L36j91p0J42n5J47l26
2138A28L61k00k44l30J76m53J23J06K35m75L19L1L27n6KJ06K77L74j15m29L5M3
2160C41r0J03l06j96k20j99m5L18j93J06N4L06R9N4Q7r3M37q1j20k51J34j09l8
2183I8j36j96J15j37Q8m59L11k20N24j65j0N6K82n5K93L3k57M15p8k46K74m49
$$ plain form
2205 81 -63 -161 -504 -133 -307 -545 -188 -223 -268 -137 -381 -193 -149 149 47 341 128 319 317 354 281 76 35
2228 35 -302 -124 -1 -306 -36 -242 -341 -297 -330 -122 -208 -228 247 138 -27 325 46 399 345 227 -57 197
2250 197 208 124 -86 10 113 -255 -85 -347 -179 -475 -175 -273 -25 225 254 62 133 707 209 -63 412 386
2272 386 8 130 -103 20 -171 -360 -252 -357 -274 -250 -297 -284 -195 101 130 257 78 171 273 25 49 278 533
2295 533 131 333 34 -16 -250 -238 -499 -275 -378 -270 -189 -155 -106 -71 58 168 504 420 741 287 87 430
2317 430 312 272 -268 -137 -185 -131 -246 -455 -174 -495 -124 1 -324 5 90 122 299 89 641 387 337 281
2339 281 45 355 -11 -229 -327 -444 -539 -387 -580 -549 -330 -229 -361 40 39 183 186 313 237 307 606 266 275 184
2363 184 51 -392 -263 -410 -366 -437 -461 -53 -459 -141 -111 38 510 95 380 323 346 258 225 238 365 -129 -58
$$ packed form
2205H1j44r8l43L71j74k38L57l5m5J31k44J88M4K98j02K94k13J91kL7p3k05m1
2228C5l37J78J23l05K70k06r9M4l3K08q6k0M75j09j65L52k79L53n4j18k84K54
2250A97J1q4k10R6J03l68J70k62J68k96L00r8K48K50K9j92P1N74m98k72M75k6
2272C86l78J22k33J23j91j89J08j05Q3K4m7J3Q9K96K9J27j79R3J02k48K4K29K55
2295E33m02K02k99n0k34J2k61K24j03J08Q1L4M9L5J29J10L36q4L21m54k00L43
2317D30j18m0n40J31m8N4j15k09K81l21L71J25l25L29Q5L2J77k10N52k54n0n6
2339B81k36L10l66k18r8j17r5J52j93L1K19J01j32M01jJ44LJ27p6P0K99l40Rr1
2363A84j33m43J29j47M4p1k4M08m06L18L0J49M72m15K85n7K3q8l3J3J27m94P1
$$ plain form
2386 -58 -227 -318 -52 -631 -161 -338 -76 -289 14 -268 74 84 187 423 464 261 348 460 223 -106 -216 -32
2408 -32 243 -6 -294 -388 -377 -384 -164 -362 -66 -50 168 118 140 289 30 148 108 152 123 31 220 79 2 -134
2432 -134 -289 -231 -249 -187 -401 -308 -109 -75 105 -19 160 118 235 263 166 386 77 160 93 -146 -21 -149 -258
2455 -258 1 -255 -314 -142 -121 -275 -206 165 203 -34 6 425 2 166 321 470 385 147 471 -62 14 241
2477 241 100 -682 -439 -310 -480 -138 -20 76 -98 70 -103 290 73 184 423 218 245 216 381 -102 95
2498 95 -275 -23 -96 -197 -250 -387 -380 -288 -73 -103 36 -232 8 239 458 333 510 198 228 247 159 134 82 323
2522 323 -65 -112 -131 -181 -91 -249 -217 -314 -49 186 122 -18 -7 441 211 399 445 326 150 160 -9 -155 -110 -19
2546 -19 -226 -644 -317 -309 -168 -283 -57 -39 33 397 83 156 451 430 251 268 415 143 111 -325 -97 -466 -611
$$ packed form
2386e8j69r1K66n79M70j77K62k13L03k82L42J0J03K36M1k03Q7J12k37l29j10J84
2408c2K75k49k88r4J1pK20j98K96J6K18n0K2J49k59J18m0M4k9r2J89j41p7j36
2432a34j55N8j8O2k14R3J99L4J80j24J79m2J17K8r7K20l09Q3o7k39J25j28j09
2455b58K59k56n9J72K1j54O9L71L8k37M0M19m23J64J55J49q5k38L24n33P6K27
2477B41j41p82K43J29j70L42J18R6j74J68j73L93k17J11K39k05K7k9J65m83J97
2498I5l70K52p3j01n3j37PR2K15l0J39k68K40K31K19j25J77l12L0J9q8k5n2K41
2522C23l88m7j9n0R0j58L2r7K65K35o4j40J1M48k30J88M6j19j76J0j69j46M5R1
2546a9k07m18L27QJ41j15K26J8P2L64l14P3K95k1j79J7J47k72l2m36K28l69j45
$$ plain form
2569 -611 -201 -394 -258 -390 -134 -183 -252 -176 138 43 251 -48 142 232 332 309 101 291 169 -350 -346 -186 -272
2592 -272 -299 -324 -133 -339 -102 -29 24 -26 151 538 371 403 341 290 152 304 258 -224 -60 -43 -405 -412 -197 -303
2616 -303 -284 -331 72 2 115 223 394 262 218 320 -108 329 264 -35 8 -279 -172 -270 -228 -385 -501 -274 -148
2639 -148 246 -167 53 182 38 -41 226 354 189 218 476 254 -20 421 432 -42 -52 -112 -263 -487 -56 -171
2661 -171 -99 -275 -139 -130 -105 -185 -19 -41 49 190 181 173 484 144 -270 100 -117 -131 -183 -170 -175 -402 -49 -236 -296 -44
2687 -44 -39 -67 22 -19 249 110 283 128 -58 150 33 74 249 143 -83 -356 -54 -196 -140 82 -299 54 -154
2710 -154 -19 -118 -14 71 32 253 178 263 270 348 -157 -82 150 -165 -121 -284 -12 -1 -273 -87 -306 -104 17 128
2734 128 116 -51 336 387 74 310 374 16 109 220 180 -118 -68 -102 -410 -260 -275 -201 -317 -46 -354 -71 -38
$$ packed form
2569f11M10j93J36j32K56m9o9P6L14r5K08k99J90R0J00k3k08J90j22n19MJ60q6
2592b72k7k5J91k06K37P3N3n0J77L87j67L2o2n1j38J52m6m82J64J7l62pK15j06
2616c03J9m7M03p0J13J08J71j32m4J02m28M37o5k99M3k87J07r8M2j57j16K27J26
2639a48L94m13K20J29j44p9K67J28j65K9K58k22k74M41J1m74j0o0j51k24M31j15
2661a71P2j76J36RK5q0J66k2R0J41rqL11l40m14L70k17j4n2J3nk27L53j87o0K52
2687d4Nk8Q9m1K68j39J73j55j86K08j17M1J75j06k26k73L02j42N6K22l81L53k08
2710a54J35r9J04Q5l9K21p5Q5PP8n05P5K32l15M4j63K72J1k72J86k19K02J21J11
2734A28j2j67L87N1l13K36O4l58R3J11m0k98N0l4l08J50j5P4j16K71l08K83L3
$$ plain form
2757 -38 232 -133 291 543 305 164 358 49 -73 -47 179 -246 46 -286 -14 -307 -197 -33 -407 -220 -185
2778 -185 -109 334 236 504 436 245 244 194 228 24 174 -310 -236 -81 -26 -357 -406 -305 -61 -109 -88 160 14 73
2802 73 186 119 201 361 150 16 347 -5 -13 -65 -182 -97 -253 -376 -354 -39 -269 118 -430 -180 77 89 32
2825 32 203 228 279 264 241 366 359 -79 216 -183 -45 -178 -368 -216 -313 -45 -153 -56 -96 -35 85 268 273 317 196
2850 196 371 233 337 173 194 21 -164 -158 -282 -119 -428 -313 -340 -126 -214 -241 -155 -168 -32 107 420 133 368
2873 368 146 -89 316 196 25 -160 -105 -77 105 -115 -388 -384 -159 -196 -99 -259 -103 147 273 194 417 58
2895 58 59 189 35 -44 -61 158 -219 -293 -154 -147 -116 -43 -179 -120 -28 -234 147 256 121 64 150 208 134 454 113
2920 113 150 -91 273 -97 47 -343 -300 -267 -71 -389 -527 2 -177 -5 347 -30 -64 216 64 246 317 114
$$ packed form
2757c8K70l65M24K52k38j41J94l09j22K6K26m25K92l32K72k93J10J64l74J87L5
2778a85P6M43r8K68o8j91jn0L4k04J50m84P4J55N5l31m9J01K44m8K1K48j46N9
2802G3J13o7Q2J60k11j34L31l52qn2j17Q5j56j23K2L15k30L87n48K50K57J2n7
2825C2J71K5N1j5k3J25pm38K95l99J38j33j90J52r7K68j08R7m0O1J20J83NM4j21
2850A96J75j38J04j64K1j73j85Oj24J63l09J15k7K14q8k7Q6j3J36J39L13k87K35
2873C68k22k35M05j20j71j85N5K8J82k20k73MK25l7R7j60J56K50J26p9K23l59
2895E8JJ30j54p9j7K19l77p4J39PL1P3j36N9R2k06L81J09j35n7Q6N8p4L20l41
2920A13L7k41L64l70J44l90M3L3J96l18j38N29j79J72L52l77l4K80j52J82P1k03
$$ plain form
2942 114 306 141 181 -62 -42 -126 -467 -300 -354 -80 -257 -101 -104 -389 8 -226 -71 249 20 89 239 84
2964 84 12 160 -253 57 47 -99 -150 -103 -253 -88 -242 61 -239 184 -123 154 302 271 82 142 217 289 337
2987 337 79 317 -100 150 127 -163 -299 -264 -98 -276 -211 70 -195 39 145 -55 78 21 317 281 146 349
3009 349 460 187 81 317 63 -298 -365 -82 -286 -290 -378 -176 -31 -47 -71 -11 271 209 -165 332 225 320 190
3032 190 176 -28 156 60 -147 -173 148 -71 -100 -325 -257 1 110 -37 23 -1 256 254 399 -251 203 201 252 143
3056 143 -73 -19 9 -95 -433 -254 -263 -357 -262 -265 -82 -490 -125 97 46 -64 212 368 -22 111 -26 -68 0 -124
3080 -124 244 -200 -123 -112 -238 -309 -146 -250 6 19 -58 -30 -235 -59 270 210 -183 157 47 21 -41 37 59 -131
3104 -131 -253 -351 -102 -328 48 -105 -185 197 39 276 -79 190 -89 -23 298 87 152 -83 50 -56 -80 84
$$ packed form
2942A14J92j65M0k43K0q4l41J67n4K74j77J56lk85L97k34J55L20k29O9J50j55
2964H4p2J48m13L10j0j46n1M7j50J65j54L03l00M23l07K77J48l1j89O0P5P2M8
2987C37k58K38m17K50k3k90j36L5J66j78O5K81k65K34J06k00J33n7K96l6j35K03
3009C49J11k73j06K36k54l61o7K83k04mq8K02J45j6k4O0K82o2l74M97j07R5j30
3032A90j4k04J84r6k07k6L21k19k9k25O8K58J09j47O0k4K57kJ45o50M54kN1j09
3056A43k16N4K8j04l38J79rr4R5lJ83m08L65K22n1j10K76J56l90J33j37m2O8j24
3080a24L68m44P7J1j26p1J63j04K56J3p7K8k05J76L29o0l93L40j10k6o2P8K2j90
3104a31j22r8K49k26L76j53q0L82j58K37l55K69k79O6L21k11O5k35J33j06k4J64
$$ plain form
3126 84 32 -144 -98 -169 -182 -22 29 176 107 194 136 5 -1 159 462 202 181 260 374 -184 232 -46 -5 25 -222
3151 -222 -204 -296 -2 -315 -354 -46 -114 92 310 34 29 125 353 322 156 6 -29 -211 -194 100 -280 -25 18 63
3175 63 -55 -90 -255 118 -153 -90 -205 -91 147 260 586 276 361 -65 174 -148 271 -130 27 -32 -49 -143
3197 -143 -424 71 -99 -120 -220 -158 186 232 158 240 171 287 86 313 75 96 44 -55 307 -22 -122 -275 -249
3220 -249 21 -432 -144 -174 -253 -293 -42 -104 85 393 115 -62 331 360 78 -34 -209 92 -10 -61 -55 -163 -42
3243 -42 -107 6 -54 -100 42 -333 57 -169 90 63 20 41 345 103 74 13 90 -52 -283 -445 -277 -139 -260
3266 -260 -121 -34 -81 111 35 264 57 -199 299 181 187 78 38 150 -153 -9 -102 -338 -230 -81 -230 112
3288 112 -45 -328 -271 59 150 -37 224 -71 231 254 258 129 386 146 68 198 -130 -328 -412 -167 -53 -45 -205
$$ packed form
3126H4n2j76M6p1j3J60N1J47o9Q7n8j31oJ60L03k60k1P9J14n58M16k78M1L0k47
3151b22J8r2K94l13l9L08o8K06K18k76nR6K28l1j66j50l5j82J7K94l80K55M3M5
3175F3j18l5j65L73k71O3j15J14K38J13L26l10Q5m26K39l22M19m01J57n9j7r4
3197a43k81M95j70k1j00O2L44M6p4Q2o9J16k01K27k38K1n2r9L62l29j00j53K6
3220b49K70m53K88l0p9m0K51o2J89L08k78j77L93K9k82j12j75L01j02n1Oj08J21
3243d2o5J13o0m6J42l75L90k26K59k7m3K1L04k42k9o1P7j42k31j62J68J38j21
3266b60J39Q7m7J92p6K29k07k56M98j18Oj09m0J12l03J44r3k36J08J49j49L42
3288A12j57k83N7L30R1j87K61k95L02K3Mj29K57k40p8J30l28j98q4K45J14Qj60
$$ plain form
3311 -205 201 18 -70 183 15 -24 15 117 349 246 277 190 -67 147 147 59 -91 -239 -409 15 -531 -238 -282
3334 -282 52 -253 -85 199 64 597 13 185 103 -307 55 -72 -272 5 -145 -111 -197 -25 -9 -82 -259 -197
3356 -197 -98 25 -49 66 49 173 112 79 136 41 258 322 221 276 -65 -196 62 20 -84 60 -133 -129 79 -417
3380 -417 -50 150 -17 -59 -66 137 -61 99 377 70 106 30 -104 -98 -42 -56 -89 -82 -266 -72 -124 -187 -254 -81 -73 80
3406 80 -7 149 163 79 -69 188 183 12 -205 -148 146 64 56 -345 -214 -106 -236 26 -101 147 -148 292 -52
3429 -52 125 77 -227 246 9 128 196 -110 -38 -86 -200 275 -326 -162 -284 -175 79 85 56 -81 -1 114 201
3452 201 108 135 112 218 -31 339 -79 207 10 63 72 -133 -264 -22 -106 -59 -152 -177 -8 -102 275 -114 62 10
3476 10 -5 192 19 87 333 57 33 -110 -289 -300 -171 -30 -272 -115 134 -290 119 110 53 -170 350 520 248
$$ packed form
3311b05M06j83q8K53j68l9L9J02K32j03L1q7k57K14%q8j50j48j70M24n46K93m4
3334b82L34l05J68K84j35N33n84J72q2m10L62j27k00K77j50L4q6J72J6p3j77O2
3356a97R9J23p4J15j7J24o1l3N7r5K17O4j01N5l41j31K58m2j04J44j93MK08m96
3380d17L67K00j67m2pK03j98J60K78l07L6p6j34ON6j4l3Pj84J94n2o3o7J73QJ53
3406H0q7J56J4q4j48K57nj71k17N7K94q2qm01J31J08j30K62j27K48k95M40l44
3429e2J77m8l04M73k37J19O8l06P2m8j14M75o01J64j22J09K54Ok9j37Q0J15Q7
3452B01r3K7k3J06k49L70m18K86j97N3Rk05j31K42q4M7r3k5J69r4L77l89J76n2
3476A0j5J97j73O8K46k76k4j43j79j1J29J41k42J57K49m24M09rn7k23N20J70k72
$$ plain form
3499 248 -118 242 301 49 202 -313 7 55 -367 -300 -62 -283 -94 -116 -251 -33 86 -188 -103 243 119 234
3521 234 227 205 -214 -7 94 -47 -171 5 -392 -116 -225 19 -130 -75 -89 2 190 215 143 -5 -145 45 378
3544 378 104 139 202 39 43 13 213 172 -298 -207 -203 -142 5 -215 33 55 77 10 168 181 -32 78 129 307 216
3569 216 126 204 -220 -343 -64 -210 -97 -337 -3 -278 -72 181 43 -14 10 41 35 575 50 137 224 -14 62
3592 62 -20 18 198 76 -361 -402 -170 6 -199 29 107 91 -19 185 215 275 44 215 34 -67 216 194 43
3615 43 -40 -134 -282 45 169 -204 65 -256 -129 -12 -61 -13 123 -1 235 166 -13 163 58 -116 -94 219
3637 219 270 168 219 -223 -65 -139 -170 -88 160 -225 12 -287 -117 -61 -36 -29 44 -45 232 -30 236 -61 -66 144
3661 144 84 -193 -120 13 -390 -151 -30 115 -163 -47 -95 -182 6 333 25 258 254 -155 198 125 23 -69 84
$$ packed form
3499B48l66L60N9k52J53n15L20M8m22O7K38k21J89k2j35K18J19k74Q5L46j24J15
3521B34pk2m19K07J01j41j24J76l97K76j09K44j49N5j4R1J88K5p2j48j40J90L33
3544C78k74L5O3j63Ml0K00m1m70R1MO1J47k20K48K2K2o7J58J3k13J10N1J78r1
3569B16r0P8m24j23K79j46J13k40L34k75K06K53j38n7K4L1oN40n25Q7Q7k38P6
3592F2q2L8J80j22m37m1K32J76k05K28P8j6j10K04L0O0k31J71j81j01K83k2j51
3615D3q3r4j48L27J24l73K69l21J27J17m9M8J36j24K36o9j79J76j05j74K2L13
3637B19N1j02N1m42J58p4l1Q2K48l85K37k99J70N6K5PP3q9K77k62K66k97nK10
3661A44o0k77P3J33m03K39J21J45k78J16m8q7J88L27l08K33mm09L53p3j02r2J53
$$ plain form
3684 84 405 -18 -122 -56 109 -95 -101 -188 75 193 89 525 143 21 313 280 179 79 325 -39 -10 190
3706 190 73 98 -518 -144 39 210 62 -181 146 -94 -10 -71 213 68 227 258 10 106 342 142 56 55 -3
3729 -3 74 -144 -80 19 -23 46 82 46 -44 -160 -33 145 173 45 238 207 46 -170 175 328 -12 83 -36 120
3753 120 -97 -361 -121 -254 -280 -225 -15 173 58 -107 -105 34 -3 43 418 -137 193 -224 45 40 -148 -130 -14
3776 -14 -96 -208 -199 154 -54 187 -212 -62 -212 -100 47 -128 -109 207 -151 47 -63 -60 74 -124 143 -203
3798 -203 117 -215 -282 -351 -188 156 81 126 -125 146 58 -51 -4 17 19 -22 189 192 40 -30 -101 -87 -162 -14 128
3823 128 100 -112 -99 25 166 -167 329 138 228 160 251 -18 6 40 58 95 -261 245 -305 -75 -253 -188 26
3846 26 149 -90 -64 -107 140 130 17 -235 173 257 -83 117 -6 339 79 -16 142 -140 23 -40 -182 -354
$$ packed form
3684H4L21m23j04O6J65k04oq7K63J18j04M36l82j22K92l3j01j00K46l64K9K00
3706A90j17K5o16L74J83J71j48k43L27k40Q4o1K84j45J59L1k48R6K36k00q6jn8
3729cP7k18O4R9m2O9L6l6r0j16J27J78K8j28J93l1j61k16L45J53l40R5j19J56
3753A20k17k64K40j33k6N5K10J88j15j65KJ39l7M6L75n55L30m17K69nj88J8J16
3776a4q2j12RL53k08K41l99J50j50J12J47j75J9L16l58J98j10LJ34j98K67l46
3798b03L20l32o7o9J63L44p5M5k51K71q8j09M7K1Km1K11Lj52p0p1J4p5J48J42
3823A28k8k12J3J24J41l33M96j91R0o8R1k69K4L4J8L7l56N06n50K30j78O5K14
3846B6J23k39K6m3K47j0j13k52M08Q4l40K00j23L45k60r5J58k82J63o3j42j72
$$ plain form
3868 -354 -128 138 46 -2 -20 199 -227 -154 68 -164 155 -218 -174 190 -155 56 -244 -23 -90 -155 -38 -63 -82
3891 -82 -244 -208 -59 -21 -108 -4 171 77 7 32 -48 64 -84 100 -40 -123 98 111 -235 -433 -146 23 -6 -137
3915 -137 108 -106 108 379 127 20 493 120 112 128 46 -63 -3 -91 48 25 -182 117 -151 12 -133 47
3937 47 -196 -15 135 3 -45 285 311 119 113 133 136 -142 19 23 101 -2 81 -84 28 -115 189 -90 -61 239
3961 239 -249 -42 -97 130 11 -51 7 429 80 54 32 -222 276 70 -114 85 51 129 154 111 -270 -189 223
3984 223 -236 139 90 -253 125 -104 -46 61 -11 313 63 16 133 -164 21 -230 119 58 191 -225 -300 137
4006 137 99 -88 -103 321 61 120 211 187 182 139 168 136 129 -101 -146 -44 -207 -7 -309 -96 -226 11 117 87 32
4031 32 12 213 124 349 195 133 148 -61 41 203 -41 -213 -296 251 213 74 -213 -114 -87 143 -151 -167 93
$$ packed form
3868c54K26K66r2m8j8K19m26P3K22k32L19l73M4L64l45K11l00K21o7o5J17k5j9
3891h2j62L6J49L8q7J04J75r4p0K5q0J12j48J84j40q3K21J3l46j98K87J69k9j31
3915a37K45k14K14K71k52j07M73l73qJ6q2j09O0q8J39k3k07K99k68J63j45J80
3937D7k43J81J50j32m8L30K6j92oK0Lk78J61MP8j03Q3j65J12j43L04k79K9L00
3961B39m88K07n5K27j19o2N8M22l49k6k2k54M98k06j84J99l4P8K5m3l81Q1M12
3984B23m59L75m9l43L78k29N8J07p2L24k50m7J17k97J85k51L49o1J33m16p5M37
4006A37l8j87j5M24k60N9R1k4nm3K9l2pk30m5J02j63K00l02K13j30K37J06l0n5
4031C2k0K01q9K25j54o2J5k09J02J62k44j72q3N47l8j39k87R9K7K30k94j6K60
$$ plain form
4054 93 -92 202 188 389 58 -103 53 16 -61 -22 -68 171 30 72 -37 -293 -179 204 -338 26 172 21
4076 21 228 22 138 -227 38 136 120 -24 16 250 5 -186 151 -81 -188 135 -86 -57 -136 234 64 232
4098 232 -182 14 -26 204 53 113 504 -146 -169 139 -12 -158 -338 73 55 -31 96 -127 -78 -20 -76 -174 11
4121 11 -248 -67 281 -137 76 38 308 -115 -273 104 4 -47 -30 -166 -283 -228 -112 -251 -103 -235 -140 -307
4143 -307 -121 252 269 -3 186 -4 -61 33 79 -253 -10 -40 266 115 -135 -52 -56 -40 -121 -157 -88 -283 -29 53
4167 53 147 -37 -199 -40 154 -230 -68 -49 -12 -65 332 -177 -67 115 -173 -85 -147 58 -117 148 68 352 197
4190 197 255 -13 -41 156 11 10 208 -89 -275 140 -323 36 -103 -15 -276 -5 -178 -102 11 193 112 75 472
4213 472 235 6 333 213 39 -10 -222 -211 -102 99 -143 145 -212 38 268 -10 -44 131 -93 168 184
$$ packed form
4054I3j85K94j4K01l31j61J56l7p7L9m6K39j41M2j09k56J14L83n42L64J46j51
4076B1K07k06J16l65K65R8j6j44M0K34k45j91L37k32j07L23k21K9p9L70j70J68
4098B32m14J96m0K30j51O0L91o50k3L08j51j46j80M11j8q6J27k23M9N8n6r8J85
4121A1k59J81L48m18K13l8K70m23j58L77j00n1J7j36j17N5J16j39J48j32R5j67
4143c07J86L73J7k72J89j90n7R4M6l32K43l0L06j51k50Q3mJ6q1l6O9j95K54Q2
4167E3R4j84j62J59J94l84J62J9L7n3L97n09J10J82k88Q8o2K05j75K65q0K84j55
4190A97N8k68k8J97j45jJ98k97j86M15m63L59j39Q8k61K71j73P6J13J82q1l7L97
4213D72k37k29L27j20j74m9k12J1J09K01k42K88l57K50K30k78l4J75k24K61J6
$$ plain form
4234 184 90 134 283 81 -74 -137 267 42 -112 -4 -62 -36 -105 69 -4 5 102 -127 286 125 234 -128 -32 200
4258 200 282 -68 39 52 -172 169 65 -191 60 61 95 -94 -305 -45 123 164 158 -117 -81 -2 51 -255 26 -75
4282 -75 -120 26 -54 80 -79 77 10 39 -72 111 8 97 -65 40 -247 -3 -191 -179 -81 26 -199 202 -156
4305 -156 225 149 -340 -251 220 -45 -122 -169 31 40 -62 53 -211 23 186 -151 78 -9 189 104 209 -17 -142
4328 -142 26 158 -276 10 -183 -9 81 -278 -179 6 60 -23 -42 -107 28 94 -16 -68 161 -198 -36 -94 -54
4351 -54 257 -75 -121 -118 74 -244 74 -128 188 308 64 -146 306 242 -21 35 -175 188 -10 176 -20 280
4373 280 -119 -128 159 102 -101 -289 -61 -39 148 52 60 -73 -254 223 131 -80 -41 231 94 -99 -83 63 149 -104
4397 -104 -13 102 64 -119 125 -65 47 -13 -218 297 0 -184 228 314 -35 -6 162 169 227 132 142 -10 -154
$$ packed form
4234A84r4M4J49k02j55o3M04k25j54J08n8K6o9J74p3RR7k29M13j61J09l62R6K32
4258B00Q2l50J07J3k24L41j04k56K51JL4j89k11K60J68M1ok75L6P9N3l06K81j01
4282g5m5J46q0J34j59J56o7K9j11J83j03Q9j62J05k87K44j88J2R8J07k25M01l58
4305a56L81p6m89Q9M71k65p7m7K00Rj02J15k64K34J63l37K29q7J98q5J05k26j25
4328a42J68J32m34K86j93J74R0l59R9J85N4q3j9o5J35O6j10n2K29l59J62n8M0
4351e4L11l32m6LJ92l18L18k02L16J20k44k10M52o4k63N6k10L63j98J86j96L00
4373B80l99rK87n7k03j88K28K2J87r6Qj33j81M77r2k11L9K72j37j93J6J46Q6k53
4397a04R1J15l8j83K44j90J12o0k05N15k97j84M12Q6l49K9J68PN8r5J0j52j44
$$ plain form
4420 -154 -41 -22 -170 -137 -56 -20 -85 -228 52 -295 92 -117 -159 -153 -227 19 115 -207 -172 21 181 68 -368 107
4444 107 -196 28 -22 257 -54 32 -185 233 -276 -35 -80 276 17 -437 -121 -66 -120 200 -60 -19 177 181 -45
4467 -45 182 -272 23 -148 164 230 208 189 3 124 45 391 283 161 -43 7 87 -249 18 240 -56 -19 -72
4490 -72 -114 -23 276 -234 149 -97 105 48 -161 80 0 109 127 -7 1 101 181 -70 -43 180 54 -84 -199
4513 -199 -244 -186 -31 -258 -221 28 -65 -77 -273 113 127 146 22 -135 -335 -9 313 89 -405 -25 8 8 -304
4536 -304 -348 -140 49 134 -215 -155 59 37 156 -158 104 98 -43 121 -91 66 -134 83 -94 38 124 -122
4558 -122 11 -3 -202 97 315 4 197 85 -36 162 27 1 -111 -209 53 240 30 74 -225 -172 115 83
4580 83 -209 -235 -352 -381 -117 69 -204 85 -81 286 -204 80 -74 262 129 132 -54 38 110 -51 28 36 -134
$$ packed form
4420a54J13J9j48L3Q1L6o5j43K80l47L87k09m2Op4K46R6l22L5J93J60j13m36M75
4444A07l03K24n0K79l11Q6k17M18n09K41m5L56k59m54L16N5n4L20k60M1J96Mk26
4467d5K27m54K95j71L12O6k2j9j86J21p9L46j08j22k04N0Q0l36K67K22k96L7n3
4490g2m2R1K99n10L83k46K02n7k09K41q0J09J8j34QJ00Q0k51K7K23j26j38j15
4513a99m5N8J55k27L7K49r3j2j96L86J4J9j24j57k00L26L22k24m94L80L3%l12
4536c04m4K08J89Q5l49O0K14k2J19l14K62oj41J64k12J57k00K17j77J32Q6k46
4558a22J33j4j99K99K18l11J93j12j21J98j35k6j12r8K62J87k10M4k99N3K87l2
4580H3k92k6j17k9K64J86k73K89j66L67m90K84j54L36j33Lj86R2P2j61P9Qj70
$$ plain form
4603 -134 -102 180 145 -48 260 -10 -183 -211 -205 226 -97 -85 -142 -27 -317 -154 -235 35 -213 -258 -180 -222 -168 -163 23
4628 23 -28 -41 -130 9 -6 -237 -28 -116 74 42 54 177 29 -112 -181 -125 -75 -85 -24 58 -46 9 -30 -90 108 -49
4654 -49 142 -63 336 -46 -65 36 -225 -217 -348 474 211 191 47 -19 -22 128 -46 -134 -64 134 -93 -44 -28 -29 -78
4679 -78 -129 114 -65 -98 96 133 -201 241 32 -76 -29 76 19 129 58 -245 19 -212 -104 -29 56 -85 43
4702 43 113 173 208 53 145 -21 100 -81 218 -8 295 129 -102 -125 402 -35 55 30 -100 -17 -61 286 -212
4725 -212 75 71 -150 88 -120 -41 -37 289 81 32 -34 -401 -342 -122 -200 12 15 -89 88 -19 -214 177 27 46
4749 46 -118 -82 216 24 243 -105 -91 201 -291 18 -193 -212 157 75 -62 28 117 -186 -50 129 77 12 135
4772 135 -157 -104 -25 138 -73 -341 105 -16 21 37 -13 -28 93 188 -158 -75 339 25 -118 -281 64 29 85
$$ packed form
4603a34L2K82l5j93L08k70j73k8OM31l23J2n7J15k90J63q1K70k48m5P8m2N4NJ86
4628B3n1j3q9J39j5k31K09q8J90l2J2J23j48j41o9N6N0j0O1Q2j04N5l9o0J98j57
4654d9J91k05L99l82j9J01k61Qj31Q22k63k0j44o6lJ50j74q8P0J98k27M9J6jm9
4679g8n1K43j79l3J94L7l34M42k09j08M7J05n7J10p1l03K64k31J08P5Q5j41J28
4702D3P0O0L5j55R2j66J21j81K99k26L03j66k31k3N27m37R0k5j30Q3m4L47m98
4725b12K87mk21K38k08P9ML26k08m9o6l67N9K20p8K12Lj04J77j07j95L91j50J9
4749D6j64L6K98j92K19l48J4K92m92L09k11j9L69q2j37R0Q9l03J36J79n2o5J23
4772A35k92N3P9J63k11k68M46j21L7J6n0j5J21R5l46Q3M14l14j43j63L45l5N6
$$ plain form
4795 85 322 143 75 239 185 62 0 14 -132 -94 -13 -98 46 61 -164 -6 -207 59 199 -90 -171 137 57 -61
4819 -61 65 127 136 35 -118 -31 -352 54 -237 80 -108 -489 138 46 190 -168 -127 34 -66 55 -303 36
4841 36 354 191 36 337 -31 31 -179 228 55 -224 191 -258 -133 -30 64 -235 81 -130 284 -185 10
4862 10 21 418 -72 -125 -131 -198 -205 -202 -70 192 16 9 439 -50 -55 -173 105 65 151 30 -46 -300 71 118 192 41
4888 41 -228 -260 46 -42 -92 -85 72 -72 -48 -149 90 2 -294 99 203 -11 -76 22 -299 -129 -12 -140 138
4911 138 139 -133 -134 227 -195 -186 -80 -9 60 -196 38 45 132 -184 74 46 -241 104 -91 -66 -50 -5 -171 -159 -100 -184
4937 -184 85 -16 449 85 -43 70 26 -136 127 -60 255 -7 176 255 265 -82 -152 -103 59 -90 -146 153
4959 153 5 -77 -147 29 164 -17 185 204 -470 176 76 18 60 120 175 -44 168 -101 -99 59 -28 79 86 57
$$ packed form
4795H5K37j79o8J64n4j23o2J4j46L8Q1q5J44J5k25J58k01K66J40k89q1L08q0j18
4819f1J26O2Rj01j53Q7l21M06k91L17j88l81O27r2J44l58M1J61j00J21l58L39
4841C6L18j63j55L01l68O2k10M07j73k79M15m49J25J03R4k99L16k11M14m69J95
4862A0J1L97m90n3oo7pLJ32K62j76pM30m89nj18K78m0Q6j21p6k54L71M7P4j51
4888D1k69l2L06q8n0PJ57j44K4j01K39q8k96L93J04k14o5R8l21J70J17j28K78
4911A38Jk72jL61m22RJ06P1O9k56K34PQ7l16K58k8k87L45j95K5J6M5j66J2N9q4
4937a84K69j01M65l64j28J13m4j62K63j87L15k62J83P9J0l47p0M9J62j49n6K99
4959A53j48q2p0J76J35j81K02J9o74O46j00n8M2O0N5k19K12k69KJ58q7J07Pk9
$$ plain form
4983 57 -269 -281 -143 252 -17 186 10 23 -79 -172 173 -161 -37 -114 -60 100 -151 -88 -168 -71 143 -174 -100
5006 -100 -3 -235 -143 111 -216 131 32 251 77 14 74 45 -207 27 171 73 -74 -25 187 -275 23 -108 2
5029 2 54 2 61 139 284 86 144 123 -85 -128 -112 26 195 -38 149 155 153 58 -183 30 -87 -35 26 -287 -69 -54
5055 -54 119 71 -174 -239 289 139 -49 -113 196 -115 -36 -129 -23 -46 104 -175 138 41 -53 -27 -325 39 -184
5078 -184 198 318 -57 3 237 -101 -50 51 124 150 180 30 -20 12 -14 112 -4 -85 -327 159 99 -19 -36 -23
5102 -23 -188 -40 123 -82 -132 145 310 103 -30 91 -124 -69 81 -86 -40 75 26 -236 -156 -394 233 -45
5124 -45 55 296 -67 -89 33 22 152 -122 -177 -31 3 19 14 298 -228 248 57 114 -27 61 44 95 -266 29
5148 29 -131 39 13 51 57 -173 -277 -70 -308 121 211 78 -5 154 80 -113 280 201 161 -26 -104 -101 -215 93
$$ packed form
4983E7l26j2J38L95k69K03j76J3j02r3L45l34J24p7N4J60k51O3q0R7K14l17P4
5006a00R7k32R2K54l27L47r9K19j74o3O0k9k52K34J44r8j47M9K12m62K98j31J10
5029BN2n2N9P8J45j98N8k1k08m3J6J38J69k33J87Okr5k41K13j17N2O1l13K18J5
5055e4J73m8k45o5N28j50j88o4L09l11P9r3J06k3J50k79L13r7r4K6k98L64k23
5078a84L82J20l75O0K34l38N1J01P3K6L0j50n0L2k6J26j16q1k42M86o0j18j7J3
5102b3j65J48J63k05n0K77J65k07j33J21k15N5J50j67M6J15m9k62Q0k38O27k78
5124d5J00K41l63k2J22j1J30k74n5J46L4J6nK84n26M76j91N7j41Q8j7N1l61K95
5148B9j60J70k6L8Ok30j04K07k38M29R0j33q3J59p4j93L93p9m0j87p8Lj14L08
$$ plain form
5172 93 90 -28 -60 156 -82 -28 -221 -180 76 -61 20 355 17 -134 -98 -129 441 141 1 206 161 63 -4 -189
5196 -189 67 -2 -42 -141 71 63 -63 352 129 -163 -35 92 -95 182 -145 -25 10 27 91 -299 -223 -64 -190
5219 -190 49 -193 10 -235 -167 -182 -50 -23 -191 -175 -376 149 231 58 -297 -35 -233 50 52 180 45 37 200
5242 200 17 173 -84 -153 -62 227 18 -74 29 -128 -246 53 -260 43 88 -121 -168 3 100 31 54 -74 145
5265 145 134 3 55 -351 -57 154 -214 -61 -67 33 194 -160 17 58 118 117 -121 66 -62 30 43 -125 195
5288 195 241 -200 -83 159 -149 -14 -85 164 -188 -68 -186 -97 -198 93 84 62 80 -138 46 -122 207 -97
5310 -97 -186 186 103 8 -55 -63 242 49 71 -51 106 -202 88 15 -35 -81 107 -188 125 -39 -132 -71 -267 175
5334 175 303 -108 -268 -58 -38 -363 -57 -223 -41 14 0 80 35 47 80 239 -16 -116 194 35 218 209 146
$$ packed form
5172I3lj18l2K16k38N4j93M1K56j37Q1L35l38j51L6l1N70l00j40K05m5r8o7j85
5196a89K56o9m0r9K12qj26M15k23k92J28J27j87K77l27J20L5J7O4l90P6J59j26
5219a90K39k42K03k45O8j5J32K7j68J6k01N25Q2j73l55K62j98K83KJ28j35qJ63
5242B00j83J56k57o9R1K89k09r2J03j57j18K99l13L03M5k09m7J71R7o9K3j28K19
5265A45j1j31N2m06K94K11l68J53oJ00J61l54J77M1O0jk38J87j28R2J3j68L20
5288A95M6m41J17K42l08J35p1K49l52J20j18Q9j01K91rk2J8k18J84j68L29l04
5310i7q9L72q3r5o3qL05j93K2j22J57l08K90p3n0m6J88k95L13j64r3O1j96M42
5334A75J28m11j60K10K0l25L06j66J82N5j4Q0m5J2L3J59k55j00L10j59J83ro3
$$ plain form
5357 146 -178 187 126 334 114 103 237 172 31 100 69 -12 -47 -103 63 130 42 109 132 63 -60 -201 482 -230
5381 -230 -186 -105 115 42 -99 0 141 -35 43 7 -277 28 -132 16 -112 -63 78 -233 4 40 124 -3 -143
5404 -143 -37 -131 138 75 103 57 -47 161 152 4 -99 116 21 -134 105 84 -112 -165 8 103 43 189 -168 92
5428 92 -58 -125 -131 186 -145 -106 156 75 33 -26 257 -140 122 -39 -25 87 116 75 87 58 -82 -209 -320 -122
5452 -122 -350 -23 -23 -72 -273 89 -430 -162 84 -101 -115 -34 221 -37 -129 -26 99 69 151 -360 -157 -123 -178
5475 -178 111 -216 -216 133 -97 175 -74 42 44 223 507 202 155 7 282 -69 -241 -7 69 -242 -93 -34
5497 -34 177 193 86 -129 -145 262 93 107 195 138 -28 -5 83 170 -116 140 -162 1 -285 6 1 -256 -2 -231
5521 -231 16 266 -13 247 -79 -106 78 280 154 36 209 67 -18 -16 229 33 -157 -54 -245 225 136 -156
$$ packed form
5357A46l24L65o1K08k20j1J34o5j41O9l1q1l5n6J66O7q8O7K3o9j23j41O83p12
5381b30M4Q1K20p3j41R9J41j76P8l6k84L05j60J48j28M9J41l11K37L6Q4j27j40
5404a43J06r4K69o3K8m6j04K08rj48j03K15r5j55K39k1j96n3J73R5o0J46l57K60
5428I2j50o7oL17l31L9K62q1m2n9K83l97K62j61J4J12K9m1J2k9j40j27j11J98
5452a22k28L27%m9k01L62n19K68K46j85j4Q1K55k58r2J03J25l0Q2n11K03L4n5
5475a78K89l27%L49k30K72k49J16KJ79K84l05m7j48K75l51j72K34P6l11J49N9
5497c4K11J6j07k15j6M07j69J4Q8n7j66K3Q8Q7k86K56l02J63k86K91nk57K54k29
5521b31K47K50k79K60l26k7J84K02j26j18J73j42q5KK45j96j90J03j91M70q9k92
$$ plain form
5543 -156 -83 58 59 196 -65 -89 61 -139 74 136 -149 -71 76 -157 182 78 -256 -70 82 329 -137 97
5565 97 362 338 43 -88 83 -40 85 104 -115 -90 97 52 79 -119 -165 18 -35 -197 171 -168 101 220 116
5588 116 138 -24 -175 -83 -34 27 202 -8 289 -165 -53 -119 -38 87 138 222 -177 -191 131 -64 -56 -249 -195 184
5612 184 60 90 -190 -32 114 224 4 -131 106 211 116 248 -52 -54 93 62 77 48 331 -77 30 47 33
5635 33 -327 254 70 -25 -241 130 -27 79 126 23 -124 25 128 91 23 -85 78 -50 34 75 -289 -21
5657 -21 174 110 31 127 -91 214 35 12 113 -169 -226 -274 195 -56 144 -131 15 -33 -129 80 -3 16 -48 -109
5681 -109 40 277 70 100 106 192 186 -211 131 148 -33 -27 81 159 227 68 15 319 -28 -190 48 -228 175 69
5705 69 -123 232 -63 -69 103 -47 -54 -104 17 110 2 86 -114 -99 135 26 -130 -208 86 -294 -222 -245 -1 -24
$$ packed form
5543a56P3J41JJ37k61k4J50k00K13O2k85P8J47k33L39j04l34J86J52K47m66K34
5565I7K65k4k95j31J71j23J25J9k19K5J87m5K7j98m6J83n3j62L68l39K69J19j04
5588A16K2j62j51R2M9O1J75k10K97m54J12o6Q1J25N1Q4l99j4L22j95Qj93N4L79
5612A84j24L0k80J58J46J10k20j35K37J05r5J32l00kJ47l1J5k9K83m08J07J7j4
5635C3l60N81j84r5k16L71j57J06M7j03j47J49J03l7o8j08J63j28Q4M1l64K68
5657b1J95o4p9R6k18L05j79k3J01k82n7m8M69k51K00k75J46m8r6K09q3J9o4o1
5681a09J49K37k07L0OQ6ol97L42J7j81OJ08P8O8j59n3L04l47j62K38k76M03j06
5705F9j92L55k95oJ72j50pn0J21R3j08Q4k00J5K34j09j56p8K94l80P2k3K44k3
$$ plain form
5729 -24 105 277 -43 255 287 102 -8 121 48 15 63 17 7 162 31 205 12 71 -141 195 -192 -165 76
5752 76 -3 -94 -105 -64 -239 -47 -232 162 41 -12 -67 83 -125 -140 -179 109 135 -99 -148 196 96 72 -1 -165
5776 -165 -223 216 -103 57 323 -215 10 -65 -50 -101 256 -82 153 113 331 34 -191 16 -36 391 463 186
5798 186 18 31 -163 77 -153 86 -29 143 -118 -131 -91 151 -135 -297 -228 -70 25 -315 -77 7 -57 36 -190
5821 -190 -62 39 -188 -71 -6 234 322 171 -40 81 126 -260 -99 -50 201 -124 -172 -64 46 -388 78 -103
5843 -103 160 132 -179 53 75 -216 6 36 7 -42 32 -12 -233 -181 -224 -12 -178 -40 63 -174 92 -91 -100 -35
5867 -35 -70 176 393 1 145 -282 149 -19 133 253 -57 133 17 91 21 -191 -98 136 -131 324 162 17
5889 17 -39 61 -122 -404 -174 -59 -164 225 -116 -90 43 -26 405 184 219 -7 61 5 -268 119 -107 166
$$ packed form
5729b4J29J72l20K98L2j85j10J29p3l3M8m6j0J55j31J74j93N9k12L36l87K7K41
5752G6p9r1j1M1j75J92j85L94j21n3n5J50k08j5l9K88K6k34m9L44j00k4p3j64
5776a65n8M39l19J60K66n38K25p5J5n1L57l38K35m0K18k97k25K07n2M27P2k77
5798A86j68J3j94K40k30K39j15J72k61j3M0K42k86j62O9J58R5l40K38Q4o4R3k26
5821a90J28J01k27J17O5K40Q8j51k11J21M5l86J61M9K51l25m8J08J10m34M66j81
5843a03K63k8l11K32K2k91K22L0k9m9P4m4k21N2m3K12j66J38J03k37K66j83rO5
5867c5l5K46K17l92J44m27M31j68J52J20l10J90j16P4p0k12R3K34k67M55j62j45
5889A7n6J00j83k82K30J15j05L89l41K6J33o9M31k21L5k26O8n6k73L87k26K73
$$ plain form
5911 166 173 -32 -23 14 168 -56 -385 273 -43 -154 -72 101 -151 -99 -84 5 -24 -46 -8 309 -265 -113 451 -75
5935 -75 155 -27 -129 45 212 43 -423 -94 231 -151 -118 -79 -184 109 137 68 -105 -238 -70 297 71 -79
5957 -79 107 105 24 -194 74 93 175 -168 -1 -33 201 -26 -76 -167 192 33 170 -129 197 148 -82 173 -28
5980 -28 -265 -88 369 -33 -78 111 -168 -81 -77 67 -17 6 -108 275 -218 108 -77 -394 55 63 19 -104 96
6003 96 -78 -111 -32 -205 271 -86 -106 -16 -64 31 -180 132 185 112 -5 40 -191 227 128 -127 -7 41 94 98 52
6028 52 -52 -8 -101 11 -220 -41 217 -63 -167 -246 -133 -66 171 259 -32 242 331 -19 28 4 38 -41 226 154
6052 154 64 -23 -46 42 89 -299 -32 -299 -149 153 0 67 237 -15 80 0 431 -6 115 165 -18 400 -67
6075 -67 -164 50 116 -136 -9 132 -147 -108 35 -92 29 78 105 63 -141 99 260 -185 59 236 -25 -124 -119
$$ packed form
5911A66Pk05RL7J54k24l29O58l16j11Q2J73k52N2J5Q9k9k2L8L17n74J52N64n26
5935g5K30j82j02J74J67j69m66L29L25l82L3L9j05K93K8o9j73j33J68L67k26j50
5957g9J86kq1k18K68J9Q2l43J67l2K34k27n0r1L59j59J37k99L26m9k30K55k01
5980b8k37J77M57m02m5J89k79Q7MJ44q4K3j14L83m93L26j85l17M49Qm4j23K00
6003I6j74l3P9j73M76l57k0R0m8R5k11L12N3p3j17M5k31M18r9k55J20M8N3Mm6
6028E2j04M4r3J12k31J79K58k80j04p9J13O7K37Q8k91K74Q9l50M7k4L4p9K67p2
6052A54r0q7k3Q8M7l88K67k67J50L02j53O7J70k52R5q0M31m37J21N0j83M18m67
6075f7r7K14O6k52J27J41k79L9J43j27J21M9K7m2k04K40J61m45K44J77k61r9N
$$ plain form
6098 -119 -102 -93 87 94 -207 -74 56 257 -45 69 82 -205 21 -145 74 -57 108 -65 165 -197 57 -80
6120 -80 -367 57 -48 -7 158 -282 -53 1 214 239 -227 200 -46 12 -4 -174 186 -124 -35 25 -114 -80 -71 -71
6144 -71 34 42 380 -152 106 35 -23 -134 -16 80 -5 -124 17 -57 -89 -289 265 -94 -16 -21 53 -61 15 180 -66
6169 -66 88 106 -312 160 135 63 202 28 -29 -171 -68 -258 278 167 -76 -227 -29 -61 -104 -24 18 4 -183
6192 -183 -102 31 68 22 138 115 -298 -47 -383 -129 26 -33 16 -116 162 -111 -16 -15 -172 -9 191 -121 10
6215 10 246 -136 -189 -221 125 -40 -92 27 -87 -53 72 15 -12 169 47 -118 82 143 72 159 -134 -101 -120 176
6239 176 -197 206 -321 35 -5 118 209 172 9 15 -45 80 114 -156 122 107 -88 -32 -94 93 -178 167 182 -10
6263 -10 -67 111 182 -85 188 215 14 148 334 40 -46 -6 -7 -262 -166 -129 119 563 75 54 60 -57 100 38 -125
$$ packed form
6098a19J7RJ80Pl01J33J30K01l02J14J3k87K26j66K19j31J65j73K30l62K54j37
6120h0k87M24j05M1J65m40K29N4K13K5m66M27k46N8j6j70L60l10Q9O0j39L4R%
6144g1J05QL38n32K58p1n8j11J18R6q5j19J41p4l2k00N54l59P8nP4j14P6J65k46
6169f6J54J8m18M72k5p2J39j74n7j42J03j90N36j11k43j51J98l2m3Q0M2j4j87
6192a83Q1J33L7m6J16k3m13K51l36K54J55n9M9j32K78k73R5Jj57J63K00l12J31
6215A0K36l82n3l2L46j65n2J19j14L4J25n7k7J81j22j65K00O1p1Q7k93L3j9K96
6239A76l73M03n27L56m0J23R1l7j63Oo0J25L4k70K78j5j95N6o2J87k71L45J5j92
6263a0n7J78P1k67K73K7k01J34J86k94q6M0jk55R6L7K48M44m88k1Oj17J57o2j63
$$ plain form
6288 -125 -71 -162 32 -56 -233 61 71 -87 -61 152 230 69 -50 -201 -19 -67 21 -136 -255 -190 39 191 -46
6311 -46 -122 -71 124 -112 104 63 52 -74 56 -103 -379 -10 56 -391 -83 146 -18 -35 -19 -313 308 99 92
6334 92 177 -168 -122 89 50 -117 117 22 373 128 -399 -82 -55 -180 -145 -148 -52 -238 -88 -49 -68 -405 345 108
6358 108 335 5 28 -101 75 -45 113 -95 -46 -295 48 -22 -219 115 -145 -304 -34 223 12 -76 -80 -34
6380 -34 70 -8 -177 136 -22 7 225 -100 58 -213 -229 10 -120 192 42 103 2 -100 -86 87 -205 52
6402 52 160 40 -183 57 217 -22 -213 -140 -167 -9 -199 -20 -111 45 48 -127 30 287 120 -40 8 -44 -85
6425 -85 90 173 86 -14 118 64 454 -189 -153 172 204 -25 102 80 -61 -1 91 151 224 279 25 128 108 -7
6449 -7 -111 18 48 -86 -174 -147 -73 288 -145 96 167 -245 100 -20 -151 -190 -52 114 -85 -93 11 -44 69 -22
$$ packed form
6288a25N4r1J94q8j77K94J0j58K6K13P8j61j19j51J82m8Q8j57j19O5K29J52k37
6311d6p6N1J95k36K16m1j1j26J30j59k76L69O6m47L08K29j64j7J6k94O21k09p
6334I2Q5l45M6K11l9j67K34r5L51k45n27L17K7j25L5lR6j86J50L9j9l37P50k37
6358A08K27l30K3j29J76j20J58k08M9k49L43p0j97L34k60j59K70K57k11q8mM6
6380c4J04p8j69L13j58K9K18l25J58k71j6K39j30L12j50O1j01j02J4J73k92K57
6402E2J08j20k23K40J60k39j91P3k7J58j90J79r1J56Lj75J57K57j67j60M8n2m1
6425h5J75Q3q7j00J32n4L90o43L6L25L2k29J27k2j41O0R2O0P3N5k54J03k0j15
6449gj04J29L0j34q8K7P4L61m33K41P1m12L45j20j31l9J38J66j99qJ04n5J13r1
$$ plain form
6473 -22 102 -70 31 55 180 -200 -268 16 148 -2 -156 219 -27 -140 -24 122 263 77 195 -135 123
6494 123 366 117 37 -153 196 203 -1 35 122 -59 36 344 193 -48 -18 52 -107 16 95 -228 31 272 76
6517 76 -120 36 130 65 18 63 16 -191 -138 -99 251 21 191 211 -97 -223 247 -147 43 79 193 175 51 139
6541 139 24 240 19 -206 25 -6 -198 48 -52 -85 -30 34 98 326 50 47 -43 -74 -125 -19 95 -102 63
6564 63 -54 -252 227 106 -117 22 6 278 144 190 -69 -77 -20 288 -71 -63 -192 -209 223 109 -11 -101 204
6587 204 141 -187 101 92 -88 188 -139 58 -52 18 299 -46 75 -130 209 29 -8 45 -90 3 -25 -17 -30 -141
6611 -141 100 303 175 1 -54 -133 35 43 -122 111 -42 123 231 331 163 64 -201 135 251 62 -165 11
6633 11 270 54 179 -353 238 -126 -325 -81 177 287 53 238 -222 47 9 94 8 122 -121 -135 40 -123
$$ packed form
6473b2J24j72J01K4J25l80o8K84J32j50j54L75k46j13J16J46J41j86J18l30K58
6494A23K43k49q0j90L49Pk04L6Q7j81R5L08j51k41L0P0j59J23P9l23K59K41j96
6517G6j96J56R4o5m7M5m7k07N3L9L50k30J70K0l08j26M70l94J90L6J14j8j24Q8
6541A39j15K16k21k25K31l1j92K46j00l3N5O4O4K28k76lr0l1n1J06J14j97J65
6564F3j17j98M79j21k23J39j6K72j34M6k59qN7L08l59Qj29j7M32j14j20r0L05
6587B04o3l28K88rj80K76l27J97j10P0K81l45J21k05L39j80l7N3j35R3k8Qj3j11
6611a41K41K03j28j74n5p9J68Qj65K33j53J65J08J00j68r9k65L36J16j89k27J76
6633A1K59k16J25n32N91l64j99K44K58J10k34J85m60K69l8Q5q6J14k43j4J75j63
$$ plain form
6655 -123 -135 -204 150 -170 180 -13 -90 160 175 87 -277 36 -219 -9 73 178 54 -177 -59 45 14 -85 -131
6678 -131 38 -31 -70 187 10 196 -234 132 121 -326 -115 49 132 97 65 -182 -61 90 -105 -36 84 -8 0
6701 0 -7 -217 -60 -177 -213 13 155 -70 -11 226 56 54 -318 -29 164 -142 110 188 -32 229 200 -33 114
6724 114 -90 100 -88 64 -255 -129 130 153 113 -213 -111 -295 151 -4 74 185 29 189 28 105 31 -108
6746 -108 -3 24 -335 88 150 -240 -213 -94 -435 130 56 237 -186 48 -111 -258 5 207 233 -335 -166 125
6768 125 330 85 116 -230 -229 55 89 97 -37 -40 379 14 -126 366 256 -132 -12 230 125 -24 119 -61 103
6791 103 -132 176 51 -308 -222 157 -91 -60 99 -96 93 -184 113 87 -98 -18 -35 -61 -43 -104 257 -154 -253
6814 -253 62 -187 -85 -132 94 165 50 160 -95 -340 60 55 51 214 93 71 16 82 -108 -291 134 -157 -142
$$ packed form
6655a23j2o9L54l20L50j93p7K50J5q8l64L13k55K10Q2J05j24k31J18J04l1r9m6
6678a31J69o9l9K57j77J86m30L66j1m47K11J64Q3l5l2k47J21J51j95O9J20r2Q
6701@pk10J57j17l6K26J42k25N9K37j70kl72K89J93l06K52P8k20K61k9k33J47
6724A14k04J90j88J52l19J26K59K3m0l26J02j84M46j55P8J11j56J60j61P7p4j39
6746a08J05K7l59M23O2l90K7J19l41N65p4J81m23K34j59j47K63K02K6n68J69K91
6768A25K05k45L1l46JK84L4Qj34lM19l65j40M92j10l88J20K42j05j49J43j80J64
6791A03k35L08j25l59Q6L79k48L1J59j95J89k77K97k6j85Q0j7k6J8o1L61m11r9
6814b53L15k49J02m7K26P1j15J10k55k45M00nmJ63j21k2n5O6j90j83M25k91J5
$$ plain form
6837 -142 -135 -121 -116 -55 35 411 -31 -69 -309 119 257 27 -234 140 -144 -24 85 123 -92 -164 -124 -146 31 151
6861 151 79 -228 -98 -75 71 -119 294 145 23 318 86 219 2 99 23 -57 -4 -105 -221 147 99 33 11
6884 11 131 30 183 20 -127 -41 105 -311 96 -185 -248 -157 140 202 -281 -192 -24 247 -63 266 -89 57
6906 57 54 -124 -115 -94 59 128 -26 -273 -151 57 47 0 29 -114 -66 133 98 27 6 -53 -8 110 58 24 24 132 67
6933 67 59 -15 -101 287 102 -53 205 -51 -158 -124 30 -127 250 -17 -158 201 144 -266 59 42 107 -168 15
6956 15 27 133 -170 216 192 -16 96 83 -234 95 -41 -118 -40 -70 160 -158 116 13 85 2 18 35 170 -184
6980 -184 54 -16 238 -239 -216 -23 32 -86 -62 291 115 106 144 53 -169 -97 299 -15 5 -109 175 95 -28 70
7004 70 334 231 -196 180 172 -82 -59 5 183 202 -280 69 144 238 86 172 -133 -31 351 246 143 85 107 -29
$$ packed form
6837a42PJ4NO1R0L76m42l8k40M28J38k30k61L74k84J20J09L8k15p2M0k2J77J20
6861A51p2l07J30K3J46j90M13j49j22K95k32J33k17R7p6q0N3j01j16L68m8o6k2
6884A1J20j01J53j63j47Q6J46m16M07k81o3R1K97O2m83Q9J68K71l10L29l55J46
6906E7lj78RK1J53O9j54k47J22K08j0m7K9j43M8J99l5p1k1n9M5J18n2l4%J08o5
6933F7qp4q6L88j85j55K58k56j07L4J54j57L77k67j41L59n7m10L25j7O5k75J83
6956A5J2J06l03L86k4k08J12j3l17L29j36p7P8l0K30l18K74j03P2q3J6J7J35l54
6980a84K38p0K54m77K3J93N5j18K4L53j76rL8r1k22P2L96l14K0j14K84q0j23R8
7004G0K64j03m27L76qk54K3O4J78J9m82L49P5R4j52Q6l05J02L82j05j03n8K2j36
$$ plain form
7028 -29 161 76 -186 -164 149 379 70 1 -129 -197 -12 115 14 -222 8 78 61 31 -125 -277 -52 371 238
7051 238 -40 -36 -24 26 -70 -77 85 -260 -145 -52 -296 137 2 93 15 109 39 144 -35 -182 -25 58 185 -280
7075 -280 265 -84 -210 94 190 67 -261 232 -62 178 -1 122 -31 61 -183 -114 -258 59 176 -116 -22
7096 -22 -20 -258 19 -376 301 -139 -159 58 -29 29 159 76 -154 -19 -145 -32 -212 358 142 160 33 94 281
7119 281 -62 -80 -137 -162 -281 208 -27 -67 -9 -119 242 69 232 23 -409 -217 120 -126 -113 196 -9 0 186
7142 186 54 -84 -93 -45 -6 94 62 -114 -307 -95 -93 -48 155 49 -143 190 -11 -103 240 -13 314 166 -33
7165 -33 -41 -75 -131 -183 112 62 101 -278 215 110 -9 217 -23 109 -45 18 345 65 114 -106 -135 186 27 4
7189 4 9 21 208 -4 -26 13 369 86 -259 101 97 -89 72 -44 126 132 -30 -42 -156 -21 -183 270 -44 38
$$ packed form
7028b9J90q5k62K2L13K30l09o9j30o8J85J27j01k36K30P0j7l0j56j52K25M23j33
7051B38k78MJ2N0r6pJ62l45J15R3k44M33j35R1p8R4p0J05j79j47J57Q3J27m65
7075b80N45l49j26L04R6j23l28M93k94K40j79J23j53R2k44O9j44L17J17k92R4
7096b2Kk38K77l95O77m40k0K17q7N8J30q3k30J35j26J13j80N70k16J8j27O1J87
7119B81l43j8n7k5j19M89k35m0N8j10L61j73J63k09m32J92L37k46J3L09k05RJ86
7142A86j32j38rM8L9J00l2j76j93K12KM5K03j06j92L33k01r2L43k53L27j48j99
7165c3ql4n6n2K95n0L9l79M93j05j19K26k40J32j54O3L27k80M9k20k9L21j59k3
7189DNJ2J87k12k2L9L56k83l45L60mj86J61j16J70Oj62j2j14J35j62M53l14Q2
$$ plain form
7213 38 220 9 -2 -149 71 41 -117 175 -72 -143 -71 97 -62 -28 -34 337 35 -30 -91 86 279 -81 -192
7236 -192 -266 -94 176 -49 -193 121 -14 101 116 53 177 -13 17 45 320 72 80 -140 153 221 -144 167 113
7259 113 -7 -273 7 -56 -245 39 47 -126 24 -169 -217 265 -28 48 166 -110 115 71 -186 344 -243 -267
7281 -267 -112 6 35 52 13 78 -32 18 -154 -40 95 -43 179 -191 -155 61 211 20 -18 -13 39 -51 78 -135
7305 -135 -34 5 -8 -192 63 137 6 -26 -111 -6 -62 -128 -13 70 166 175 70 -95 44 28 76 144 10 -142 84
7330 84 -36 137 48 7 -113 -11 320 145 142 9 163 16 -55 459 159 168 3 -2 -308 12 -151 -90 -88 171
7354 171 101 -168 -219 87 113 -50 65 -132 24 192 158 146 86 -419 -204 183 -33 1 62 -218 -56 -14 -60
7377 -60 139 78 -251 6 90 7 -80 -75 -204 34 -123 37 -70 40 119 -78 -143 -163 66 -74 93 119 150 -120
$$ packed form
7213C8J82k11j1j47K20l0j58K92k47p1P2J68j59L4oL71l02o5o1J77J93l60j11
7236a92p4J72K70k25j44L14j35J15J5o3J24j90L0K8K75k48Qk20K93O8l65L11n4
7259A13j20k66K80o3j89K84Qj73J50j93m8M82k93P6J18k76K25m4k57N30n87k4
7281b67J55J18K9J7l9O5j10N0j72J14J35j38K22l70L6K16J50j91l8NN2r0J29k13
7305a35J01L9j3j84K55P4j31l2q5J05n6o6J15Q3R6Rj05j65J39j6M8O8j34j52K26
7330H4j20J73q9m1j20J02L31j75lj33J54j47p1N14l00Rj65nl06L20j63O1KK59
7354A71p0k69n1L06K6j63J15j97J56J68l4j2o0n05K15L87k16L4O1k80J62M2m6
7377f0J99o1l29K57Q4q3q7Nj29K38j57J60j07J10P9j97o5k0K29j40J67K6L1k70
$$ plain form
7401 -120 -46 -110 227 -87 -255 261 31 138 176 -60 190 60 -44 -105 28 44 -22 56 -369 -96 15 -170
7423 -170 115 -72 -237 -169 -100 356 -152 -49 -133 4 122 148 -3 162 -6 132 225 16 83 139 40 -41 -97
7446 -97 255 96 -24 -1 108 64 -14 -401 84 -77 -57 73 -66 113 -29 -83 -7 -12 9 44 -186 91 234 10
7470 10 78 -9 -83 -100 213 5 125 -158 189 -281 114 83 -148 128 -142 124 -18 143 163 -144 133 180 37
7493 37 230 -185 -65 136 -15 -141 305 51 101 -164 -25 -97 101 187 -138 98 -97 291 -6 -157 -48
7514 -48 -294 10 184 107 -149 41 63 -462 -270 38 64 135 -118 -82 -292 149 56 228 141 -259 -19 5 -73
7537 -73 365 22 83 48 191 -66 -206 246 200 212 154 -41 8 -9 -158 -79 19 -290 -72 -19 134 -319 67 221
7561 221 54 21 197 4 271 108 30 -10 -120 -18 63 -155 -22 -200 -79 -149 -100 111 -217 7 80 -48
$$ packed form
7401a20P4o4L37l14j68N16k30J07L8k36K50j30j04o1J33J6o6P8m25K73J11j85
7423a70K85j87j65O8O9M56n08J03q4J37J18K6j51J65j68J38R3k09O7N6r9q1n6
7446i7L52j59j20K3J09m4p8l87M85j61K0J30j39J79j42n4P6nK1L5k30K77J43k24
7470A0O8q7p4j7L13k08J20k83L47m70L95l1k31K76k70K66j42J61K0l07K77M7j43
7493C7J93m15J20K01j51j26M46k54N0k65J39p2J98Q6l25K36j95L88k97j51J09
7514d8k46L04J74p7k56J90K2n25J92L08K6P1k53L6k10M41r3J72q7m00K40K4p8
7537g3M38l43O1l5J43k57j40M52m6J2n8j95M9j7j49P9R8l09K18N3J53m53L86J54
7561B21j67l3J76j93K67j63p8m0j10J02Q1k18J33j78J21p0M9K11l28K24P3j28
$$ plain form
7583 -48 108 -30 -81 66 2 123 -117 46 -2 12 -91 59 7 -2 30 136 -14 106 221 -50 -5 -124 477
7606 477 149 -143 -96 -139 -66 -109 68 -34 118 217 -191 249 33 -148 -45 -38 13 -68 -42 -147 -78 3 15 -3 -151
7631 -151 15 171 115 -20 156 164 57 -178 -145 -102 -58 -120 -487 -189 -26 -10 212 -78 71 393 86 -48 -351
7654 -351 30 100 -22 142 219 54 -33 -13 -248 135 283 172 174 2 -34 -79 -49 254 -78 190 -85 -104 91
7677 91 -230 -64 -28 -61 95 -37 -163 188 -25 84 -47 346 -179 135 94 -88 -101 148 -59 -38 182 -58
7699 -58 92 -122 -28 -130 22 93 121 -83 57 -203 -235 -383 -77 -87 129 -43 3 -115 -93 -15 13 167 91 268
7723 268 -56 -38 20 65 -51 111 -99 38 59 218 141 243 106 -71 -3 104 57 -107 -206 -105 -309 93 -14
7746 -14 -164 -193 366 -100 130 111 29 364 -125 -104 186 40 -155 62 201 0 260 -66 -90 -112 72 -62
$$ packed form
7583d8J56j38n1J47o4J21k40J63m8J4j03J50n2rL2J06j50J20J15k71M5j19O01
7606D77l28k92M7m3P3m3J77j02J52R9m08M40k16j81J03PN1q1K6j05O9Q1J2j8j48
7631a51J66J56n6j35J76Qj07k35L3M3M4o2l67K98J63J6K22k90J49L22l07j34l03
7654c51L81P0j22J64P7j65q7K0k35L83J48j11Kj72l6m5L0L03l32K68k75j9J95
7677I1l21J66L6l3J56j32j26L51k13J09j31L93n25L14m1j82j3K49k07K1K20k40
7699e8J50k14R4j02J52P1K8k04J40k60l2j48L06j0K16j72M6j18K2P8K8J54p6J77
7723B68l24J8N8M5j16J62k10J37K1J59p7J02j37j77O8J07m7j64r9J01k04M02j07
7746a4j50k9N59m66K30j9q2L35m89K1K90j46j95K17J39k01K60l26k4k2J84j34
$$ plain form
7768 -62 35 63 -144 -95 -54 -3 -96 84 173 -188 48 -133 -37 26 276 53 -76 -71 179 96 -38 241 74 -154
7792 -154 71 -26 128 -125 98 70 133 -59 -43 104 7 87 212 -49 31 52 14 -132 51 21 -44 -307 -166 -39
7816 -39 242 265 -55 19 230 -8 -16 101 55 -178 -73 -65 -17 -52 -258 -87 169 -175 -55 -52 -67 10 25 -5 126
7841 126 -77 -64 -89 -28 19 33 221 -37 224 -210 94 72 126 203 16 92 211 6 113 -59 59 -98 25
7864 25 -41 -26 -103 148 20 -62 -272 159 169 -100 170 1 60 -192 214 -32 295 27 118 308 -229 -59 119
7887 119 191 141 -336 198 -20 287 15 136 -115 -69 119 201 78 -52 16 -131 290 140 245 -109 -79 -61
7909 -61 180 -120 -230 -37 100 -105 129 -192 95 85 -4 152 28 -69 -7 -114 177 77 -3 -41 -72 -72 151
7932 151 -63 2 159 -83 -41 -136 -166 191 296 293 84 -37 239 -135 -213 14 28 -151 65 65 -88 186 192 -3
$$ packed form
7768f2R7K8k07M9M1N1r3J80Q9l61K36j81R6O3K50k23j29NK50q3j34K79j67k28
7792a54K25r7J54k53K23k8O3j92J6J47r7Q0J25k61Q0K1l8j46J83l0o5k63J41J27
7816c9K81K3l20P4K11k38qJ17m6k33J05QM8l5k06J71K56l44J20Lj5P7J5l0J31
7841A26k03J3k5O1M7J4J88k58K61m34L04k2N4P7j87P6J19k05J07j72J18j57J23
7864B5o6J5p7K51j28q2k10M31J0k69K70j69N9k52M06k46L27k68R1J90n37J70J78
7887A19P2n0m77N34k18L07k72J21k51M6J88Q2j23j30O8j47M21j50J05l54L0J8
7909f1K41l00j10J93J37k05K34l21K87j0q9J56j24r7O2j07K91j00q0l8l1%K23
7932A51k14O5J57k42M2r5l0L57J05lk09j21K76l74p8K27J4j79K16%j53K74Oj95
$$ plain form
7956 -3 -176 -195 2 431 3 -81 316 140 255 -221 166 -115 -51 143 -303 187 -81 33 -23 -317 69 203
7978 203 35 -17 -306 92 12 -69 185 140 69 34 -185 25 -222 114 -281 6 -115 108 -40 20 -105 -366
8000 -366 -58 144 3 -129 142 9 99 -7 210 127 93 -4 24 60 36 -73 70 -246 10 -38 112 204 140
8023 140 -209 -4 -2 -51 77 91 108 178 116 41 -223 104 -70 30 -243 -3 109 -84 15 -100 19 -26 106
8046 106 70 -127 -130 -125 -199 -57 42 35 -90 53 219 364 -86 -151 221 -41 325 2 92 -285 30 33 132 -81 25
8071 25 -18 167 -76 -133 -9 337 -107 -49 -239 -9 -164 35 -4 -124 -222 390 473 -213 -154 -128 -219 60 36 160
8095 160 -174 -14 -61 19 142 60 -92 -46 30 -70 -19 -30 -78 55 -76 191 -226 -80 56 22 -77 44 15 -97
8119 -97 -26 93 123 85 37 -111 -105 -19 16 7 96 -88 74 206 -16 -171 -128 381 251 -241 228 -9 111 148 -49
$$ packed form
7956cj73j9J97M29m28q4L97j76J15m76L87k81O4J94m46M90k68J14n6k94L86J34
7978B03j68n2k89L98q0q1K54m5p1l5k19K10k47L36l95K87j21K23j48O0j25k61
8000c66L08K02j41j32K71j33R0j06K17q3l4r7K8L6k4j09J43l16K56m8J50R2o4
8023A40l49K05Km9J28J4J7P0o2p5k64L27j74J00k73K40J12j93R9j15J19m5J32
8046A06l6j97lNp4J42R9pj25J43J66J45m50o5L72k62L66l23R0l77L15LR9k13J06
8071B5m3J85k43n7J24L46m44N8j90K30j55J99l9j20r8O12Q3o86N9K6r1K79k4J24
8095A60l34J60m7Q0J23q2j52M6P6j00N1j1m8J33j31K67m17J46J36l4r9J21k9j12
8119i7P1J19L0l8m8j48OQ6L5rQ9j84J62J32k22j55M3N09j30m92M69k37J20L7j97
$$ plain form
8144 -49 -39 -241 331 -124 261 228 -141 123 24 -98 350 79 -25 61 -28 122 -105 106 60 266 215 169 -128
8167 -128 115 214 254 -23 -100 -101 -48 -165 71 -164 -15 -249 141 -209 182 75 165 136 66 49 181 -79 -75 -134
$$ packed form
8144d9J0k02N72m55L85l3l69K64r9j22M48k71j04Q6q9J50k27K11m6K06n1m6k97
8167a28K43R9M0k77p7jN3j17K36k35J49k34L90l50L91j07R0k9p0j7J32k60Mn9
8191a34
$$ Imaginary data points
##PAGE= N=2
##DATA TABLE= (X++(I..I)), XYDATA
$$ plain form
0 0 0 0 0 0 0 0 0 0 0 0 8 -8 8 -16 16 -24 32 -40 48 -56 64 -80 96 -112 129 -152 177 -207 237 -273 313 -354
32 -354 402 -457 515 -579 651 -731 817 -910 1014 -1127 1250 -1383 1530 -1690 1866 -2057
48 -2057 2266 -2499 2752 -3031 3341 -3686 4075 -4511 5007 -5577 6239 -7018 7956 -9103
62 -9103 10549 -12431 15002 -18731 24646 -35507 61960 -267007 -105827 469733 -94777 -430682
74 -430682 38745 417981 -32083 -282420 84750 333565 8438 -182778 25237 187952
84 187952 22670 -110975 -53542 55405 45311 -37923 -117603 -61340 49239 2213 -160161
95 -160161 -82506 152513 101592 -159961 -70939 251995 173735 -180379 -90288 278161 157519
106 157519 -260364 -160258 223621 84166 -300189 -141964 225985 64827 -259762 -83825
$$ packed form
0@%%%%%%%%%%Qj6J6k4L2m0N6p2Q8j04J20j44J76k08K41k81L29l84M44n10N86o67
32c54P56q59R72j094J230j382J548j727J924k141K377k633K913l220L556l923
48b057M323m765N251n783O372p027P761q586R518j0584J1816j3257J4974j7059
62i103J9652k2980K7433l3733M3377o0153R7467l28967J61180N75560n64510l35905
74d30682M69427L79236m50064k50337L67170K48815l25127j91216K08015J62715
84A87952j65282j33645N7433J08947j0094q3234p9680N6263J10579m7026j62374
95a60161P7655K35019n0921k61553Q9022L22934p8260l54114R0091L68449j20642
106A57519m17883J00106L83879j39455l84355J58225L67949j61158l24589J75937
$$ plain form
116 -83825 210481 68513 -149380 -16662 147403 51981 -51418 1518 44775 28085 23075
127 23075 -9918 -46143 17039 56324 -69026 -136714 25769 109034 -79568 -162786 63293
138 63293 162549 -66904 -143093 117169 195050 -71096 -137671 126152 161482 -125278 -164424
149 -164424 105840 124079 -137098 -142841 95671 87844 -113811 -76766 105214 62294 -79119
160 -79119 -27198 73818 22780 -33780 8621 22356 -3168 23310 25563 -44692 -33816 53530
172 53530 12870 -94372 -29252 85317 -3777 -115175 5546 127827 -9 -108480 37970
183 37970 138152 -22128 -117729 36755 106727 -58221 -115673 46344 85974 -71493 -91068
194 -91068 65553 78017 -59235 -53205 67669 48156 -53285 -22946 55010 16622 -37010
$$ packed form
116h3825K94306j41968k17893J32718J64065r5422j03399N2936M3257j6690n010
127B3075l2993l6225O3182L9285j25350o7688J62483Q3265j88602q3218K26079
138F3293R9256k29453p6189K60262P7881k66146o6575K63823L5330k86760l9146
149a64424K70264J8239k61177n743K38512p827k01655L7045J81980m2920j41413
160g9119N1921J01016n1038n6560M2401J3735k5524K6478K253p0255J0876Q7346
172E3530m0660j07242O5120J14569q9094j11398J20721J22281j27836j08471J46450
183C7970J00182j60280r5601J54484O9972j64948n7452J62017L9630j57467j9575
194i1068J56621J2464j37252O030J20874j9513j01441L0339P7956l8388n3632
$$ plain form
205 -37010 4455 30668 -11443 -17346 9879 -14502 -32460 12430 13336 -47716 -26778 54140 22864
218 22864 -55077 4457 91587 15425 -70273 17925 92269 -18375 -96462 15150 78792 -43679
230 -43679 -101919 22460 72728 -45411 -79455 41664 74259 -34872 -54768 49294 65531
241 65531 -23605 -33314 39089 42543 -16061 -21975 9786 8046 -12043 -19765 -26044 -17714 7826
254 7826 -6006 -43883 -11858 53245 20705 -46834 5204 87990 26991 -63437 1868 87594
266 87594 5725 -88334 -10024 73897 -13411 -96448 -11295 66513 -13048 -81044 -2162 64209
278 64209 544 -52441 8296 60581 17007 -24968 7820 43695 21439 -14881 -15820 6464
290 6464 12193 -16066 -44382 -23316 18223 357 -49117 -24134 47028 30316 -42631 -16920
$$ packed form
205c7010M1465K6213m2111n903K7225k4381j7958M4890R06o1052K0938Q0918l1276
218B2864p7941N9534Q7130p6162q5698Q8198P4344j10644p8087J11612O3642j22471
230d3679n8240J24379N0268j18139l4044J21119L2595j09131j9896J04062J6237
241F5531q9136r709P2403L454n8604n914L1761j740k0089p722o279Q330K5540
254G826j3832l7877L2025O5103l2540o7539N2038Q2786o0999r0428O5305Q5726
266H7594q1869r4059P8310Q3921q7308q3037Q5153P7808p9561o7996P8882O6371
278F4209o3665n2985O0737N2285m3574m1975L2788L5875k2256l6320r39K2284
290F464N729k8259k8316K1066M1539j7866m9474K4983P1162j6712p2947K5711
$$ plain form
302 -16920 68314 42991 -46489 -20284 67813 35644 -56864 -29466 54465 21441 -62095 -34932
314 -34932 37673 11408 -54184 -31303 29109 16422 -29431 -16001 29049 30896 -1039 -6789
326 -6789 18937 31682 7734 -18913 -8157 18979 6182 -34181 -30534 15235 16000 -34018 -34091
339 -34091 25556 32443 -27260 -32505 33930 41935 -23367 -30491 35892 43598 -21977 -30442 28405
352 28405 33975 -24875 -35158 12461 19519 -23912 -33432 3200 17985 -6892 -19720 3239 24130
365 24130 11764 -10525 -3918 21494 17500 -13405 -17254 13799 19085 -16127 -25604 10626 23203
378 23203 -14320 -28941 9094 25604 -12004 -30310 8092 28574 -7257 -26244 9743 31247
390 31247 -2117 -22853 6923 25835 -3129 -23950 -1201 16915 -2228 -20140 -4581 14793
$$ packed form
302a6920Q5234k5323q9480K6205Q8097l2169r2508K7398Q3931l3024q3536K7163
314c4932P2605k6265o5592K2881O0412j2687m5853J3430M5050J847l1935n750
326f789K5726J2745k3948k6647J0756K7136j2797m0363L647M5769P65n0018p3
339c4091N9647O887n9703n245O6435Q005o5302p124O6383P706o5575q465N8847
352B8405N570n8850j0283M7619P058m3431r520L6632J4785k4877j2828K2959K0891
365B4130j2366k2289O607K5412l994l0905l849L1053N286l5212r477L6230J2577
378B3203l7523j4621L8035J6510l7608j8306L8402K0482l5831j8987L5987K1504
390C1247l3364k0736K9776J8912k8964k0821K2749J8116j9143j7912J5559J9374
$$ plain form
402 14793 6407 -11128 -6941 12415 12969 -8402 -14954 6133 14503 -9003 -20308 4309 19467
415 19467 -4477 -18682 6212 22881 -1331 -18123 3820 19765 -1519 -19286 -648 16902
427 16902 1410 -16350 -2457 14177 2314 -15167 -6318 9529 1935 -13767 -6969 9621 7220
440 7220 -5646 -3231 11591 13458 39 -5208 6325 10696 -4307 -14338 -2316 8735 -6050
453 -6050 -19929 -4336 12716 -442 -16217 -970 18091 5295 -12892 -860 17388 8049
465 8049 -9209 -1973 14927 9813 -7974 -8094 6447 5877 -11082 -16087 -2764 3432 -8775 -14974
479 -14974 -421 11297 2307 -5412 7125 18996 7434 -6556 2663 14939 3749 -12249 -4921
492 -4921 8480 -592 -16558 -9044 7111 -130 -15754 -8770 8465 4543 -10484 -4852 12362
$$ packed form
402A4793q386j7535M187J9356N54k1371o552K1087Q370k3506j1305K4617J5158
415A9467k3944j4205K4894J6669k4212j6792K1943J5945k1284j7767J8638J7550
427A6902j5492j7760J3893J6634j1863j7481Q849J5847p594j5702O798J6590k401
440G220j2866K415J4822J867j3419n247J1533M371j5003j0031J2022J1051j4785
453f050j3879J5593J7052j3158j5775J5247J9061j2796j8187J2032J8248r339
465H049j7258P236J6900n114j7787j20J4541n70j6959n005J3323O196j2207o199
479a4974J4553J1718q990p719J2537J1871j1562j3990R219J2276j1190j5998P328
492d921J3401r072j5966P514J6155p241j5624O984J7235l922j5027N632J7214
$$ plain form
505 12362 12503 202 898 11672 11655 1299 -2717 1946 3455 -4995 -11454 -8255 -3325 -5966 -11213
520 -11213 -6593 2869 4091 -1247 -175 7567 7946 1896 2686 9435 7335 -2071 -1684 6059 3613 -7011
536 -7011 -6695 1275 -827 -10713 -11032 -2369 -776 -6809 -5150 5141 8621 2361 116 7816 12749
551 12749 6084 -1173 1512 6132 -104 -8470 -7010 -205 -1707 -8446 -6169 1916 845 -6817 -6029
566 -6029 4199 7039 -189 -2322 5499 8851 2186 -962 5743 8108 449 -4649 -153 1242 -6086
581 -6086 -10144 -4859 73 -1925 -5404 -3072 2293 3548 893 1202 5957 6961 778 -2175 2832
596 2832 4807 -1652 -4860 1802 5135 -1551 -6450 -2558 1216 -2503 -5683 -1598 1665 -1440 -4577
611 -4577 -237 5621 4417 -433 1791 6119 3271 -2425 -2073 1650 418 -2594 -1457 667 -686
$$ packed form
505A2362J41j2301O96J0774j7j0356m016M663J509q450o459L199M930k641n247
520a1213M620R462J222n338J072P742L79o050P90O749k100r406L87P743k446j0624
536g011L16P970k102r886l19Q663J593o033J659J0291L480o260k245P700M933
551A2749o665p257K685M620o236q366J460O805j502o739K277Q085j071p662P88
566f029J0228K840p228k133P821L352o665l148O705K365p659n098M496J395p328
581f086m058N285M932j998l479K332N365J255k655L09M755J004o183k953N007
596B832J975o459l208O662L333o686m899L892L774l719l180M085L263l105l137
611d577M340N858j204m850K224M328k848n696L52L723j232l012J137K124j353
$$ plain form
626 -686 -2744 -1750 374 1802 331 -2210 -1661 985 249 -2341 -1756 2350 2911 -50 649 3226 1826
643 1826 -1304 519 2681 1356 -2174 -2935 -1126 -269 -1339 -1811 192 1300 -691 -2303 -455 1150
659 1150 -1656 -3079 1440 3826 119 -1468 2329 4528 2160 591 2076 2161 -761 -3196 -2529 -1430
675 -1430 -2021 -4397 -3510 328 548 -2734 -2388 2282 3583 464 696 3715 3197 -12 516 3519 3892
692 3892 514 -1247 -198 243 -2244 -4923 -4611 -1492 -1731 -4602 -3493 1483 1996 -104 1510 5578
708 5578 5696 2563 1578 3663 3177 123 -1529 -1490 -1003 -1975 -3709 -4089 -2676 -2281 -3268 -2457 -530 328
726 328 -412 475 3353 3778 3694 3631 4724 4116 2541 936 7 -921 -2713 -4509 -4571 -3096 -3948 -4951 -3096
745 -3096 607 939 -1016 644 4398 3976 2135 2284 4425 4114 1274 733 1551 1098 -1797 -3603 -3018
$$ packed form
626f86k058R94K124J428j471k541N49K646p36k590N85M106N61k961O99K577j400
643A826l130J823K162j325l530p61J809Q57j070m72K003J108j991j612J848J605
659A150k806j423M519K386l707j587L797K199k368j569J485Q5k922k435O67J099
675a430n91k376Q87L838K20l282L46M670J301l119K32L019n18l209N28L003L73
692C892l378j761J049M41k487k679L12L119k39k871J109M976N13k100J614M068
708E578J18l133r85K085m86l054j652L9M87r72j734l80J413L95r87Q11J927Q58
726C28p40Q87K878M25q4o3J093o08j575j605r29r28j792j796o2J475q52j003J855
745c096L703L32j955J660L754m22j841J49K141l11k840n41Q18m53k895j806N85
$$ plain form
762 -3018 -1993 -3759 -5473 -4033 -1816 -1899 -1411 787 3177 3287 2294 4137 5398 3531 1484 1552 1667
779 1667 -95 -2316 -2576 -1760 -2152 -3940 -3917 -2145 -868 -2385 -2150 605 2456 551 450 3484 4734
796 4734 2442 1543 3172 3404 705 -1169 -808 -778 -2551 -4295 -3374 -2043 -2021 -2925 -1556 1019 1760 621
814 621 623 2854 3281 1296 537 1610 2601 885 -401 255 1131 -570 -2832 -1932 -497 -1613 -3742 -2498
832 -2498 226 -291 -1597 81 3130 2283 312 1404 3206 1602 -230 68 985 97 -1593 -1194 -299
849 -299 -92 -1334 -1962 -399 225 -1203 -1804 -293 1223 125 -1294 221 2667 1740 -517 551 2824
866 2824 2247 -975 -1194 1683 981 -2594 -2562 873 658 -2199 -2027 922 864 -1905 -1201 602 201 -1137
884 -1137 -246 1505 945 848 1236 1893 1383 1040 720 -86 -77 -808 -1747 -1598 -919 -1619 -2355 -1740 157 79 -1478
$$ packed form
762c018J025j766j714J440K217q3M88K198K390J10r93J843J261j867k047O8J15
779A667j762k221k60Q16l92j788K3J772J277j517K35K755J851j905j01L034J250
796D734k292q99J629K32k699j874L61L0j773j744R21J331K2r04J369K575P41j139
814F21KK231M27j985p59J073R91j716j286O56Q76j701k262R00J435j116k129J244
832b498K724n17j306J678L049q47j971J092J802j604j832K98R17q88j690L99Q95
849b99K07j242o28J563O24j428o01J511J516j098j419J515K446r27k257J068K273
866B824n77l222k19K877p02l575L2L435k15k857J72K949n8k769P04J803m01j338
884a137Q91J751n60r7L88O57n10l43l20q06Rp31r39J49O79p00p36O15J897p8j557
$$ plain form
905 -1478 -503 1845 2363 50 -394 2203 3610 428 -1238 1878 3081 -105 -2643 -71 526 -2108
921 -2108 -3483 -2092 -1532 -2176 -1759 -791 90 1358 2240 838 1672 3447 2401 203 1223 2670 165
938 165 -2219 -652 357 -2091 -3615 -1606 -427 -2318 -3458 -1013 869 -443 -1365 1295 4064 2648
954 2648 777 2596 4588 2237 -807 877 1644 -1708 -3561 -2481 -1996 -3181 -2826 -1515 -1013 -1101 -74
971 -74 208 148 2194 2762 1381 1465 3571 2686 -112 570 2319 423 -2799 -1198 -230 -2603 -4582 -2588
989 -2588 -985 -1994 -2228 -278 1659 1262 805 2116 4201 3470 1390 1285 2702 1036 -1811 -1156 26
1006 26 -913 -2681 -2145 -1838 -2054 -1625 -1476 -1435 389 1632 460 -397 2746 3787 581 696 3691 2941
1024 2941 -1561 -1410 1066 -414 -3798 -2348 -301 -1555 -3396 -1238 -149 -340 -54 888 1466 2069
$$ packed form
905a478R75K348N18k313m44K597J407l182j666L116J203l186k538K572N97k634
921b108j375J391N60o44M17R68Q81J268Q82j402Q34J775j046k198J020J447k505
938A65k384J567J009k448j524K009J179j891j140K445J882j312r22K660K769j416
954B648j871J819J992k351l044J684P67l352j853J080M85j185L55J311N02q8J027
971g4K82o0K046N68j381Q4K106q85k798O82J749j896l222J601R68k373j979J994
989b588J603j009k34J950J937l97m57J311K085p31k080j05J417j666k847O55J182
1006B6r39j768N36L07k16M29J49M1J824J243j172q57L143J041l206J15K995p50
1024B941m502J51K476j480l384J450K047j254j841K158J089j91K86R42N78O03
$$ plain form
1040 2069 1559 579 543 2386 1371 202 658 959 -330 -1664 -1241 -1013 -788 -1263 -2004 -1431 -148 -455
1058 -455 -1710 481 2830 1279 -524 1906 3241 -86 -1104 1842 1734 -1586 -1750 811 -77 -2559
1074 -2559 -976 481 -697 -1290 -221 -221 -1279 -372 477 523 391 1558 1447 407 810 1067 221 45
1092 45 298 9 -896 -1202 -917 -784 -775 -689 -540 647 -488 -1556 -78 1497 -83 -1435 1172 2209
1110 2209 -72 -1165 1506 2210 -467 -524 1812 829 -1331 -1175 -386 -873 -1216 -597 -1070 -1253 12 75
1128 75 -1030 339 1877 690 -534 1018 2319 246 -730 1348 2095 234 -867 -27 507 -1236
1144 -1236 -2309 -1491 -269 -1287 -2485 -955 929 626 -493 902 2184 1898 998 1646 1227 525 694
1161 694 483 -418 -555 -67 -857 -2072 -1167 -283 -1645 -2340 -82 465 -1113 -143 2049 1664 176 1559
$$ packed form
1040B069n10r80l6J843j015j169M56L01j289j334M23K28K25m75p41N73J283l07
1058d55j255K191K349j551j803K430J335l327j018K946j08l320j64K561q88k482
1074b559J583J457j178n93J069%j058R07Q49M6j32J167j11j040M03K57q46j76
1092D5K53k89r05l06K85J33RQ6J49J187j135j068J478J575j580j352K607J037
1110B209k281j093K671P04k677n7K336r83k160J56P89m87l43O19m73j83J265O3
1128G5j105J369J538j187j224J552J301k073r76K078P47j861j101Q40N34j743
1144a236j073Q18J222j018j198J530J884l03j119J395J282k86r00O48m19p02J69
1161F94k11r01j37M88p90j215R05Q84j362o95K258N47j578R70K192l85j488J383
$$ plain form
1179 1559 3352 1866 -320 1064 2164 -247 -2362 -1195 -489 -1936 -2761 -1803 -739 -1249 -1208 149
1195 149 1077 896 36 1074 1685 1931 1767 1470 930 797 864 208 -1357 -1134 -448 -1917 -2916 -1547 -641
1214 -641 -1838 -2042 852 1632 -281 274 3051 2550 637 986 2708 1225 -894 -250 597 -711 -2449
1231 -2449 -1452 -1147 -1506 -1965 -1133 -696 -798 -325 303 927 1091 1806 1731 1441 1614 1876 694 -403 83
1250 83 754 -1219 -2198 -1209 -338 -1873 -2409 -362 577 -757 -936 1023 1941 17 150 1676 1751 314
1268 314 528 1498 823 -545 -79 -19 -909 -1338 -688 -813 -1514 -917 -250 -514 -263 996 1426 650 830 1617
1288 1617 956 90 654 1112 147 -906 -134 668 -874 -1717 -551 305 -1075 -1576 284 414 -859 -691
1306 -691 826 960 49 491 1439 1260 321 571 920 -15 -638 200 -53 -1068 -899 326 -404 -1023 -461
$$ packed form
1179A559J793j486k186J384J100k411k115J167P06j447q25R58J064n10M1J357
1195A49R28j81q60J038O11K46j64k97n40j33O7o56j565K23O86j469r99J369R06
1214f41j197k04K894P80j913N55K777n01j913L49J722j483k119O44Q47j308j738
1231b449R97L05l59m59Q32M37j02M73O28O24J64P15p5k90J73K62j182j097M86
1250H3O71j973r79R89Q71j535n36K047R39j334j79J959R18j924J33J526P5j437
1268C14K14R70o75j368M66O0q90m29O50j25p01N97O67k64K51J259M30p76J80P87
1288A617o61q66N64M58r65j053P72Q02j542q43J166Q56j380n01J860J30j273J68
1306f91J517J34r11M42R48j79r39K50L49r35o23Q38k53j015J69J225p30o19N62
$$ plain form
1325 -461 385 -639 -819 246 530 -191 -209 1034 682 -220 425 1420 797 -361 68 1144 -145 -1119
1343 -1119 -419 142 -984 -1343 -699 -21 -362 -837 158 379 -90 73 736 177 307 953 742 629 910
1362 910 939 137 -417 -404 69 -1061 -1266 -471 -624 -1690 -1056 165 256 -460 183 1327 1177 117 918
1381 918 1639 680 -124 637 1012 -47 -921 -909 -411 -1106 -1268 -1087 -573 -1170 -941 -90 234 256 375 1164
1401 1164 1062 1376 1729 1287 620 370 787 -287 -1204 -759 -822 -1607 -1761 -761 -383 -1151 -998 405 979
1420 979 -144 493 1505 1690 700 1136 1486 1097 504 157 255 -589 -1230 -1063 -986 -1390 -1351 -1017 -792 -500
1440 -500 201 705 538 977 1173 1121 1101 1009 1041 306 -114 -33 -76 -554 -1334 -715 -216 -1205 -1527 -667 -176 -732
1462 -732 -433 637 812 72 731 1370 1495 1056 619 959 174 -323 -325 -709 -990 -855 -546 -1098 -1039 -730 -341
$$ packed form
1325d61Q46j024j80J065K84p21j8J243l52r02O45R95o23j158M29J076j289r74
1343a119P00N61j126l59O44O78l41m75R95K21m69J63O63n59J30O46k11j13K81
1362I10K9q02n54J3M73j130k05P95j53j066O34J221R1p16O43J144j50j060Q01
1381I18P21r59q04P61L75j059q74J2M98o95j62J81N14n97K29Q51L24K2J19P89
1401A164j02L14L53m42o67k50M17j074r17M45o3p85j54J000L78p68J53J403N74
1420I79j123O37J012J85r90M36L50l89n93l47R8q44o41J67P7m04L9L34K25K92
1440e00P01N04j67M39J96n2k0r2L2p35m20Q1m3m78p80O19M99r89l22Q60M91n56
1462g32K99J070J75p40O59O39J25m39m37L40p85m97kl84k81J35L09n52N9L09L89
$$ plain form
1483 -341 -283 30 372 521 383 643 952 508 641 800 714 449 15 -132 -720 -1057 -551 -807 -425 -596 -916
1504 -916 -763 -167 -225 122 804 1076 892 381 817 574 23 122 564 9 -432 -160 -24 -630 -396 -304 -511
1525 -511 -597 -71 -136 -930 -254 275 528 426 474 937 596 241 548 632 137 264 -77 -350 -324 -574 -792 -364
1547 -364 358 -15 -854 -572 7 -625 -707 165 644 265 98 913 565 323 748 423 152 -14 165 -551
1567 -551 -768 -237 -565 -821 -276 -83 -304 -388 171 -109 94 716 806 381 209 612 256 226 489 633 188
1588 188 -382 -73 -863 -1179 -495 -487 -691 -820 -280 -465 -435 469 833 489 861 1208 925 363 564 387 -204
1609 -204 -168 -253 -414 -325 -550 -769 -1168 -430 -185 -460 -226 353 100 6 532 842 1019 710 944 716 157
1630 157 423 -205 -316 -580 -440 -723 -1525 -650 -713 -542 -517 159 326 105 441 741 568 879 1058 572 538
$$ packed form
1483c41N8L13L42J49j38K60L09m44J33J59q6k65m34j47n88l37N06k56L82j71l20
1504i16J53N96n8L47O82K72j84n11M36k43n51R9M42n55m41K72J36o06K34R2k07
1525e11q6N26o5p94O76N29K53j02M8M63l41l55L07Q4m95J27l41k73K6k50k18M28
1547c64P22l73q39K82N79o32q2Q72M79l79j67Q15l48k42M25l25k71j66J79p16
1567e51k17N31l28k56N45J93k21q4N59k80K03O22R0m25j72M03l56l0K63J44m45
1588A88n70L09p90l16O84Qk04j29N40j85L0R04L64l44L72L47k83n62K01j77n91
1609b04L6q5j61Q9k25k19l99P38K45k75K34N79k53r4N26L10J77l09K34k28n59
1630A57K66o28j11k64J40k83q02Q75o3J71K5O76J67k21L36L00j73L11J79m86l4
$$ plain form
1651 538 706 158 -559 -491 -294 -614 -1131 -589 -608 -1244 -896 -141 -177 23 476 778 585 811 693 524 900
1672 900 789 194 39 128 -397 -650 -899 -500 -528 -1045 -660 -237 -792 -246 423 529 540 436 904 824 570
1693 570 784 517 161 269 -162 -432 -841 -115 -794 -1066 -576 -361 -524 -208 -53 28 -32 490 652 660 694 479
1715 479 395 395 263 299 98 -177 -374 -535 -459 -684 -569 -668 -313 -243 -226 7 262 387 274 402 495 664 501
1738 501 509 2 -61 69 -109 -398 -203 -321 -324 -490 -335 -196 -173 -31 -70 -100 -156 546 418 376 324 458 178 227
1762 227 62 136 -168 -228 -126 -156 -273 -417 -179 -380 -76 -156 -32 -206 -185 28 148 528 161 368 349 556
1784 556 -15 396 432 -27 -112 -270 -231 -388 -743 -449 -594 -330 -483 -65 25 41 -149 242 559 280 194 305
1806 305 513 503 449 332 -187 294 -409 -295 -458 -314 -628 -645 -417 -388 -207 183 -64 313 645 384 176
$$ packed form
1651E38J68n48p17O8J97l20n17N42j9o36L48P55l6K00M53L02j93K26j18j69L76
1672I00j11n95j55Q9n25k53k49L99k8n17L85M23n55N46O69J06J1j04M68q0k54
1693E70K14k67l56J08m31k70m09P26o79k72M90K15j63L16J55Q1o0N22J62QL4k15
1715D79q4%j32L6k01k75j97j61P6k25J15r9L55P0J7K33K55J25j13J28R3J69j63
1738E01Qn07o3J30j78k89J95j18lj66J55J39K3J42l9l0n6P02j28m2n2J34k80M9
1762B27j65P4l04o0J02l0j17j44K38k01L04q0J24j74K1K13J20L80l67K07j9K07
1784E56n71M11L6m59q5j58L9j57l55K94j45K64j53M18R0J6j90L91L17k79q6J11
1806C05K08j0n4j17n19M81p03J14j63J44l14j7K28K9J81L90k47L77L32k61k08
$$ plain form
1827 176 681 422 440 360 2 288 74 -81 -230 -391 -689 -301 -495 -555 -618 -330 -240 -58 16 223 478 660
1849 660 561 515 143 495 627 160 -198 -465 -478 -453 -704 -771 -899 -607 -385 -459 -37 190 392 309 639 712 341
1872 341 563 383 622 317 158 -12 -117 -649 -578 -764 -634 -496 -841 -475 -125 -97 -144 150 542 513 595 535
1894 535 716 647 298 215 237 -370 -398 -276 -464 -734 -800 -598 -394 -305 -265 -242 80 12 328 647 507 676 605
1917 605 470 292 107 5 -454 87 -467 -692 -506 -324 -584 -407 -300 -247 162 81 263 186 557 315 540
1938 540 485 413 506 460 -3 -10 204 -234 -445 -571 -486 -611 -554 -592 -142 229 -125 -170 164 422 444 471 547 380
1962 380 58 199 150 -21 -290 -93 -214 -397 -289 -575 -574 -450 -219 -313 59 150 284 79 144 515 393 -71
1984 -71 505 404 109 -23 -16 -27 -465 -152 -633 -697 -375 -198 -500 -240 -46 -47 -83 203 30 231 107 387 155
$$ packed form
1827A76N05k59J8q0l58K86k14j55j49j61k98L88j94o0o3K88R0J82P4K07K55J82
1849F60r9m6l72L52J32m67l58k67j3K5k51o7j28K92K22p4M22K27K02q3L30P3l71
1872C41K22j80K39l05j59j70j05n32P1j86J30J38l45L66L50K8m7K94L92k9Q2o0
1894E35J81o9l49q3K2o07k8J22j88k70o6K02K04Q9M0K3L22o8L16L19j40J69p1
1917F05j35j78j85j02m59N41n54k25J86J82k60J77J07N3M09q1J82p7L71k42K25
1938E40n5p2R3m6m63pK14m38k11j26Q5j25N7l8M50L71l54m5L34K58K2K7P6j67
1962C80l22J41m9j71k69J97j21j83J08k86JJ24K31r4L72R1J34k05O5L71j22m64
1984g1N76j01k95j32Pj1m38L13m81o4L22J77l02K60J94jl6K86j73K01j24K80k32
$$ plain form
2007 155 204 107 229 -27 -202 -80 -153 -383 -300 -383 -273 -114 -284 -26 -229 286 -30 -225 -147 555 360 96
2029 96 23 488 8 -165 -141 27 64 111 -160 -482 -240 -238 -278 -647 -108 12 -165 0 355 298 346 393 476 464
2053 464 3 -160 216 17 -193 -246 -503 -481 -583 -600 -480 -66 -357 -260 -53 191 7 -125 409 342 316 639
2075 639 553 425 -10 -106 -3 -109 -175 -552 -387 -684 -570 -414 -584 -141 195 341 9 333 267 481 184
2096 184 455 430 660 78 168 78 -311 -24 -551 -581 -548 -405 -411 -297 -330 -48 -45 242 381 135 685 827 135
2119 135 548 547 276 99 115 -178 -536 -428 -311 -232 -411 -375 -554 -557 -98 -213 115 74 453 433 339 511 452 282
2143 282 190 284 -283 -28 -228 -530 -629 -377 -327 -368 -280 -161 -279 -118 23 281 439 -40 264 541 442 205
2165 205 167 75 -25 -267 -266 -394 -149 -382 -314 -450 -78 -10 -162 -358 140 207 180 603 313 591 35 347 231
$$ packed form
2007A55M9r7J22k56j75J22p3k30Q3q3J10J59j70K58k03N15l16j95P8P02j95k64
2029I6p3M65m80j73K4J68L7M7k71l22K42Km0l69N39J20j77J65L55n7M8M7Q3j2
2053D64m61j63L76j99k10n3k57K2j02j7J20M14k91R7K07K44j84j32N34o7k6L23
2075F39q6j28m35r6J03j06o6l77J65k97J14J56j70M43L36J46l32L24o6K14k97
2096A84K71k5K30n82R0r0l89K87n27l0L3J43oJ14l3K82LK87J39k46N50J42o92
2119A35M13jk71j77J6k93l58J08J17P9j79L6j79lM59j15L28m1L79k0r4J72n9j70
2143B82r2R4n67K55k00l02r9K52N0m1Q8J19j18J61J41K58J58m79L04K77r9k37
2165B05l8r2j00k42Jj28K45k33O8j36L72O8j52j96M98O7k7M23k90K78n56L12j16
$$ plain form
2188 231 137 -162 -42 -91 -422 -604 -483 -646 -78 -172 -101 -228 57 274 197 340 319 308 527 381 254 129
2210 129 -88 190 -1 -62 -496 -136 -182 -443 -114 -355 -121 73 -93 -234 114 25 302 181 553 264 199
2231 199 133 242 -115 -64 -171 -186 132 -183 -269 -586 -207 -196 -105 -230 -124 -204 134 34 291 136 132 316 158
2254 158 1 101 116 -129 -126 -19 -285 115 -366 -673 -202 -280 -114 -148 -75 259 110 166 81 163 328 239 391
2277 391 183 -56 37 -131 -133 -117 -261 -148 -536 130 -447 -446 -111 -243 -31 -41 30 317 414 521 118 286 325
2300 325 93 -33 -189 190 -262 -403 -277 -63 -449 -467 -243 -371 89 284 328 92 303 419 243 310 241
2321 241 271 51 -309 81 -222 -71 -238 -521 -267 -643 -550 -229 -62 -225 263 376 -5 121 28 486 386
2342 386 57 510 269 139 101 217 -86 -88 -565 -267 -243 -366 -593 -98 -143 141 153 116 486 201 448 189
$$ packed form
2188B31r4k99J20m9l31j82J21j63N68r4P1j27K85K17p7J43k1j1K19j46j27j25
2210A29k17K78j91o1m34L60m6k61L29k41K34J94j66j41L48q9K77j21L72k89o5
2231A99o6J09l57N1j07j5L18l15q6l17L79J1R1j25J06q0L38j00K57j55mJ84j58
2254A58j57J00J5k45LJ07k66M00m81l07M71p8J66l4P3L34j49N6q5Q2J65q9J52
2277C91k08k39R3j68kJ6j44J13l88O66n77JL35j32K12j0P1K87R7J07m03J68L9
2300C25k32j26j56L79m52j41J26K14l86j8K24j28M60J95M4k36K11J16j76O7o9
2321B41L0k20l60L90l03J51j67k83K54l76R3L21J67j63M88J13l81J26r3M58j00
2342C86l29M53k41j30l8J16l03km77K98K4j23k27M95m5K84J2l7L70k85K47k59
$$ plain form
2364 189 295 464 509 143 21 -53 -65 -702 -462 -215 -356 -216 -186 -397 -245 5 -71 193 126 165 439 634
2386 634 422 151 286 119 83 -117 -125 -474 -575 -373 -527 -565 -339 -198 -8 159 67 128 260 157 194 305
2408 305 246 151 129 348 134 -76 47 -265 59 -306 121 -386 -286 -220 -331 -294 -37 -39 73 179 64 244
2430 244 175 215 76 184 233 191 -168 -114 57 -269 -354 -167 -180 -178 -89 -135 -88 60 -47 75 261 418 194 191 342
2455 342 186 128 84 89 -68 -239 -316 -347 -326 -376 -276 35 -115 34 182 140 187 -23 565 157 -14 144 332
2478 332 250 -154 -80 -112 43 -313 -130 -171 -174 -362 29 -156 -36 -27 -269 -7 354 209 101 250 110 363 341
2501 341 168 14 -133 61 -326 55 -349 -231 -387 -105 -168 -237 -63 -202 -176 -48 250 371 251 502 57
2522 57 75 6 -36 145 -110 1 -57 -18 -373 -233 -361 -189 -250 -138 -417 -26 129 -236 201 590 111 267
$$ packed form
2364A89J06J69M5l66j22p4j2o37K40K47j41J40L0k11J52K50p6K64o7L9K74J95
2386F34k12k71J35j67l6k00ql49j01K02j54l8K26J41J90J67r2O1J32j03L7J11
2408C05n9r5k2K19k14k10J23l12L24l65M27n07J00O6j11L7K57kJ12J06j15J80
2430B44o9M0j39J08M9m2l59N4J71l26q5J87j3KQ9m6M7J48j07J22J86J57k24lJ51
2455C42j56n8m4Nj57j71p7l1K1n0J00L11j50J49J48m2M7k10N88m08j71J58J88
2478C32q2m04P4l2J55l56J83m1lj88L91j85J20Rk42K62L61j45j08J49j40K53k2
2501C41j73j54j47J94l87L81m04J18j56K82o3o9J74j39K6J28K98J21j20K51m45
2522E7J8o9m2J81k55J11n8L9l55J40j28J72o1J12k79L91J55l65M37L89m79J56
$$ plain form
2544 267 677 284 294 -69 245 -305 -152 -92 -517 -141 -240 -405 -207 -389 209 104 4 211 252 93 464
2565 464 542 393 155 221 572 -110 14 -98 -479 -330 -274 -241 -335 -410 -114 -277 12 -86 178 87 373 264 160
2588 160 448 389 182 -113 -77 165 -56 -326 -373 -387 -200 -160 -483 2 -378 167 40 -35 101 124 334 143
2610 143 351 497 252 268 241 -12 -115 -36 -494 -292 -145 -260 -202 -389 -158 -60 10 429 340 311 39 410 223
2633 223 107 69 376 70 59 -180 -390 -419 -276 -410 -514 -338 -59 -101 238 283 49 26 93 247 -49 344
2655 344 343 76 42 -36 -234 35 -149 89 -278 -192 -530 -227 -135 -279 71 79 210 413 164 -63 371 27 306
2678 306 49 441 146 -246 58 -336 60 -135 -434 -307 -136 -154 -140 -93 -193 402 174 -11 31 382 289 -34
2700 -34 143 269 65 22 -180 -62 -39 -89 -326 -242 -128 -289 -313 -57 -165 185 -31 -81 229 314 204 202 271 134
$$ packed form
2544B67M10l93J0l63L14n50J53O0m25L76r9j65J98j82N98j05j00K07M1j59L71
2565D64P8j49k38O6L51o82J24j12l81J49N6L3r4p5K96j63K89r8K64r1K86j09j04
2588A60K88n9k07k95L6K42k21k70m7j4J87M0l23M85l80N45j27p5J36K3K10j91
2610A43K08J46k45J6k7k53j03P9m58K02J47j15N8j87K31R8P0M19q9k9k72L71j87
2633B23j16l8L07l06j1k39k10k9J43j34j04J76K79m2L39M5k34k3O7J54k96L93
2655C44jk67l4p8j98K69j84K38l67Q6l38L03R2j44L50QJ31K03k49k27M34l44K79
2678C06k57L92k95l92L04l94L96j95k99J27J71j8J4M7j00N95k28j85M2L51r3l23
2700c4J77J26k04m3k02J18K3n0k37Q4J14j61k4K56j08L50k16n0L10Q5j10kO9j37
$$ plain form
2724 134 125 -66 -71 -354 11 -26 -4 -225 -387 -205 -176 -193 -205 -407 -37 188 -148 147 70 219 143 362 476 193
2748 193 87 89 -239 -71 -95 -242 -49 -306 -93 -290 50 -11 -199 -250 334 93 422 269 154 412 184 201
2770 201 212 -175 -101 -53 -294 -272 -322 -414 -438 -271 -230 67 -243 59 74 184 209 306 251 236 362 280 279 123 68 -300
2796 -300 -168 -224 -65 -256 -315 -339 -281 34 -175 -234 -79 126 128 257 317 171 154 256 247 126 188 -157 -441 -273
2820 -273 -241 68 -271 -587 -158 -68 7 127 58 199 174 287 121 248 411 260 154 130 199 52 127 -205 -167
2843 -167 -132 -122 -330 -226 -327 -236 112 109 218 224 244 211 209 -143 446 52 25 -221 -185 -176 -194 -15 -273 -236 -422 -139
2869 -139 -208 -301 -100 -202 -42 73 200 210 574 229 124 144 101 119 -334 -61 -27 -354 -239 -109 -97 -299 -450
2892 -450 -291 -64 148 -27 59 154 110 481 189 449 81 70 184 -211 156 -82 -255 -91 -25 -315 -419 -489
$$ packed form
2724A34rj91nk83L65l7K2k21j62J82K9j7j2k02L70K25l36K95p7J49p6K19J14k83
2748A93j06Kl28J68k4j47J93k57K13j97L40o1j88n1N84k41L29j53j15K58k28J7
2770B01J1l87P4M8k41K2n0r2k4J67M1K97l10L02J5J10K5R7n5j5J26q2jj56n5l68
2796c00J32n6J59j91n9k4N8L15k09n9J55K05KJ29O0j46j7J02rj21O2l45k84J68
2820b73L2L09l39l16M29R0P5J20o9J41k5J13j66J27J63j51j06k4O9j47P5l32L8
2843a67L5J0k08J04j01R1L48lJ09OK0l3kl52N89l94k7k46L6Rj8J79k58L7j86K83
2869a39o9r3K01j02J60J15J27J0L64l45j05K0m3J8m53K73L4l27J15J30J2k02j51
2892d50J59K27K12j75Q6R5m4L71k92K60l68j1J14l95L67k38j73J64O6k90j04p0
$$ plain form
2914 -489 -274 -68 231 38 -47 439 197 153 271 24 301 275 221 8 124 -132 -36 -151 -93 40 -68 70
2936 70 -294 -91 -229 165 17 48 -84 317 30 112 438 414 201 -52 72 -96 -119 -167 -248 -295 -171 -427 -357
2959 -357 -16 228 -397 -266 4 27 -45 279 -63 270 246 238 -10 -83 -169 -253 37 86 4 -13 40 -322 -162 -186
2983 -186 115 -82 -82 18 71 153 545 126 89 -14 127 92 -101 332 2 -254 -13 -40 -428 -98 90 -258
3005 -258 -298 -280 266 29 61 87 18 142 206 515 190 110 57 171 -33 206 -293 -229 75 -229 -72 17 -240
3028 -240 -141 224 -148 327 7 284 264 35 348 298 214 119 -57 -57 -42 -252 -301 -311 -189 -179 -470 -203 -240 -126
3052 -126 -189 113 195 281 43 199 249 143 163 -90 237 -316 -10 -114 -178 -233 -376 -379 81 40 -5 -187 17 325
3076 325 145 -91 288 393 129 37 199 1 -61 39 -24 -206 -220 -196 -224 -413 -148 49 -253 -239 69 78 101
$$ packed form
2914d89K15K06K99j93q5M86k42m4J18k47K77k6n4k13J16k56R6j15N8J33j08J38
2936G0l64K03j38L94j48L1j32M01k87Q2L26k4k13k53J24j68k3m8q1m7J24k56P0
2959c57L41K44o25J31K70K3p2L24l42L33k4qk48p3q6q4K90M9q2j7N3l62J60k4
2983a86L01j97%J00N3Q2L92m19l7j03J41l5j93M33l30k56K41k7l88L30J88l48
3005b58m0J8N46k37L2K6o9J24O4L09l25q0n3J14k04K39m99O4L04l04J57Q9k57
3028b40R9L65l72M75l20K77k0k29L13n0q4r5j76%J5k10m9j0J22J0k91K67l7J14
3052a26o3L02Q2Q6k38J56N0j06K0k53L27n53L06j04o4n5j43lM60m1m5j82K04L08
3076C25j80k36L79J05k64r2J62j98o2J00o3j82j4K4k8j89K65J97l02J4L08RK3
$$ plain form
3099 101 87 222 608 45 309 364 98 -271 343 143 -125 -126 -146 -8 -224 -177 -182 -138 -11 121 371 76 150
3122 150 -24 -3 184 370 154 58 -15 98 -345 15 79 -26 -165 -385 -287 -90 111 -250 -10 -37 69 158
3144 158 17 484 363 360 73 -67 97 -377 -133 -259 -90 137 -125 94 -302 -337 -254 -224 13 77 -35 124
3166 124 250 -90 178 206 65 15 137 83 -339 -27 -139 -186 -150 -248 36 -261 -101 -12 -138 -210 -110 -224 24
3189 24 135 282 176 60 332 100 -147 177 88 348 -28 -215 100 181 -248 -204 -316 37 78 172 452 17
3211 17 143 129 227 70 346 144 140 40 135 181 -22 -134 18 50 -203 -99 -373 5 -141 -41 -37 -152 28
3234 28 411 82 533 70 69 45 26 118 36 -91 -94 -223 -105 -180 -456 -134 -208 151 160 -6 114 263 389 85
3258 85 284 434 143 22 121 -120 -204 20 71 -349 -224 -110 -344 -283 -67 102 365 -3 -231 253 -53 363
$$ packed form
3099A01j4J35L86n63K64N5k66l69O14k00k68jk0J38k16M7nM4J27J32K50k95P4
3122A50j74K1J87J86k16r6p3J13m43L60O4j05j39k20R8J97K01l61K40k7J06Q9
3144A58j41M67j21lk87j40J64m74K44j26J69K27k62K19l96l5Q3L0K37O4j12J59
3166A24J26l40K68K8j41n0J22n4m22L12j12m7L6r8K84k97J60Q9j26p2J00j14K48
3189B4J11J47j06j16K72k32k47L24q9K60l76j87L15Q1m29M4j12L53M1R4K80m35
3211A7J26j4R8j57K76k02mj00R5M6k03j12J52L2k53J04k74L78j46J00Mj15J80
3234B8L83l29M51m63jk4j9R2q2j27lj29J18p5k76L22p4L59Rj66J20J49J26l04
3258H5J99J50k91j21R9k41q4K24N1m20J25J14k34O1K16J69K63l68k28M84l06M16
$$ [...]
8191I3
##END NTUPLES=NMR FID
##END=
