##TITLE=1H_LR-784-R3-CR11
 200.13MHz, CDCl3,
 8 sc
 
 10.2.2025
##JCAMPDX= 6.0         $$ Bruker NMR JCAMP-DX V2.0
##DATA TYPE= NMR FID
##DATA CLASS= NTUPLES
##ORIGIN= UXNMR, Bruker Analytische Messtechnik GmbH
##OWNER= pz
$$ XWIN-NMR		Version 3.5
$$ Mon Feb 10 13:52:10 2025 Russian Standard Time (UT+4h)  she@DPX200
##.OBSERVE FREQUENCY= 200.1313
##.OBSERVE NUCLEUS= ^1H
##.DELAY= (6, 6)
##.ACQUISITION MODE= SIMULTANEOUS
##.ACQUISITION SCHEME= undefined
##.AVERAGES= 8
##.DIGITISER RES= 18
##SPECTROMETER/DATA SYSTEM= spect
##.PULSE SEQUENCE= zg30
##.SOLVENT NAME= CDCl3
##.SHIFT REFERENCE= (INTERNAL, CDCl3, 0, 14.3821)
##AUDIT TRAIL= $$ (NUMBER, WHEN, WHO, WHERE, WHAT)
$$ ##TITLE= Audit trail, XWIN-NMR		Version 3.5
$$ ##JCAMPDX= 5.01
$$ ##ORIGIN= Bruker BioSpin GmbH
$$ ##OWNER= she
$$ F:/spectra/data/she/nmr/H-C/1/audita.txt
$$ ##AUDIT TRAIL=  $$ (NUMBER, WHEN, WHO, WHERE, WHAT)
(   1,<2025-02-10 13:50:54.26 +0400>,<she>,<DPX200>,
      <created by zg, POWCHK disabled, PULCHK disabled
       configuration hash MD5:
       00 E9 B6 7A A2 85 ED C7 34 08 36 98 17 FE 4E 26
       data hash MD5: 16K
       35 97 00 9C D9 47 16 02 5F 1A 30 2C 1F 3C 11 06>)
$$ ##END=
$$ 
$$ hash MD5
$$ 15 87 70 C0 96 80 0F 8C F6 FA 5F F3 E3 A1 43 AB
##$RELAX= 
##$RELAX= 
##$RELAX= 
##$RELAX= 
##$RELAX= 
##$RELAX= 
$$ Bruker specific parameters
$$ --------------------------
##$DU= <F:/spectra>
##$EXPNO= 1
##$NAME= <H-C>
##$PROCNO= 1
##$TYPE= <nmr>
##$USER= <she>
##$AMP= (0..31)
100 100 100 100 100 100 100 100 100 100 100 100 100 100 100 100 100 100 
100 100 100 100 100 100 100 100 100 100 100 100 100 100 
##$AQSEQ= 0
##$AQ_mod= 1
##$AUNM= <au_zg>
##$AUTOPOS= <>
##$BF1= 200.13
##$BF2= 200.13
##$BF3= 200.13
##$BF4= 200.13
##$BF5= 200.13
##$BF6= 200.13
##$BF7= 200.13
##$BF8= 200.13
##$BYTORDA= 1
##$CFDGTYP= 0
##$CFRGTYP= 5
##$CHEMSTR= <none>
##$CNST= (0..31)
1 1 145 1 1 1 1 1 1 1 1 1 1 1 1 1 1 1 1 1 1 1 1 1 1 1 1 1 1 1 1 1 
##$CPDPRG= <>
##$CPDPRG1= <>
##$CPDPRG2= <>
##$CPDPRG3= <>
##$CPDPRG4= <mlev>
##$CPDPRG5= <mlev>
##$CPDPRG6= <mlev>
##$CPDPRG7= <mlev>
##$CPDPRG8= <mlev>
##$CPDPRGB= <>
##$CPDPRGT= <>
##$D= (0..31)
0 0.7 0 0 0 0 0 0 0 0 0 0.03 0 0 0 0 0 0 0 0 0 0 0 0 0 0 0 0 0 0 0 0 
##$DATE= 1739181053
##$DBL= (0..7)
120 120 120 120 120 120 120 120 
##$DBP= (0..7)
150 150 150 150 150 150 150 150 
##$DBP07= 0
##$DBPNAM0= <>
##$DBPNAM1= <>
##$DBPNAM2= <>
##$DBPNAM3= <>
##$DBPNAM4= <>
##$DBPNAM5= <>
##$DBPNAM6= <>
##$DBPNAM7= <>
##$DBPOAL= (0..7)
0.5 0.5 0.5 0.5 0.5 0.5 0.5 0.5 
##$DBPOFFS= (0..7)
0 0 0 0 0 0 0 0 
##$DE= 6
##$DECBNUC= <off>
##$DECIM= 32
##$DECNUC= <off>
##$DECSTAT= 4
##$DIGMOD= 1
##$DIGTYP= 9
##$DL= (0..7)
0 120 120 120 120 120 120 120 
##$DP= (0..7)
150 150 150 150 150 150 150 150 
##$DP07= 0
##$DPNAME0= <>
##$DPNAME1= <>
##$DPNAME2= <>
##$DPNAME3= <>
##$DPNAME4= <>
##$DPNAME5= <>
##$DPNAME6= <>
##$DPNAME7= <>
##$DPOAL= (0..7)
0.5 0.5 0.5 0.5 0.5 0.5 0.5 0.5 
##$DPOFFS= (0..7)
0 0 0 0 0 0 0 0 
##$DQDMODE= 0
##$DR= 18
##$DS= 0
##$DSLIST= <SSSSSSSSSSSSSSS>
$$ [...]
##$SUBNAM0= <"">
##$SUBNAM1= <"">
##$SUBNAM2= <"">
##$SUBNAM3= <"">
##$SUBNAM4= <"">
##$SUBNAM5= <"">
##$SUBNAM6= <"">
##$SUBNAM7= <"">
##$SUBNAM8= <"">
##$SUBNAM9= <"">
##$SW= 18.0517328524113
##$SWIBOX= (0..15)
0 0 2 0 0 0 0 0 0 0 0 0 0 0 0 0 
##$SW_h= 3612.71676300578
##$TD= 16384
##$TD0= 1
##$TE= 0
##$TE2= 300
##$TE3= 300
##$TEG= 300
##$TL= (0..7)
0 120 120 120 120 120 120 120 
##$TP= (0..7)
150 150 150 150 150 150 150 150 
##$TP07= 0
##$TPNAME0= <>
##$TPNAME1= <>
##$TPNAME2= <>
##$TPNAME3= <>
##$TPNAME4= <>
##$TPNAME5= <>
##$TPNAME6= <>
##$TPNAME7= <>
##$TPOAL= (0..7)
0.5 0.5 0.5 0.5 0.5 0.5 0.5 0.5 
##$TPOFFS= (0..7)
0 0 0 0 0 0 0 0 
##$TUNHIN= 0
##$TUNHOUT= 0
##$TUNXOUT= 0
##$USERA1= <user>
##$USERA2= <user>
##$USERA3= <user>
##$USERA4= <user>
##$USERA5= <user>
##$V9= 5
##$VALIST= <valist>
##$VCLIST= <CCCCCCCCCCCCCCC>
##$VD= 0
##$VDLIST= <DDDDDDDDDDDDDDD>
##$VPLIST= <PPPPPPPPPPPPPPP>
##$VTLIST= <TTTTTTTTTTTTTTT>
##$WBST= 1024
##$WBSW= 4
##$XGAIN= (0..3)
0 0 0 0 
##$XL= 0
##$YL= 0
##$YMAX_a= 522943
##$YMIN_a= -654390
##$ZGOPTNS= <>
##$ZL1= 120
##$ZL2= 120
##$ZL3= 120
##$ZL4= 120
##$ABSF1= 10
##$ABSF2= 0
##$ABSG= 5
##$ABSL= 3
##$ALPHA= 0
##$AQORDER= 0
##$ASSFAC= 0
##$ASSFACI= 0
##$ASSFACX= 0
##$ASSWID= 0
##$AUNMP= <proc_1d>
##$AZFE= 0.1
##$AZFW= 0.1
##$BCFW= 1
##$BC_mod= 2
##$BYTORDP= 1
##$COROFFS= 0
##$CY= -3
##$DATMOD= 1
##$DC= 2
##$DFILT= <>
##$DTYPP= 0
##$F1P= 0
##$F2P= 0
##$FCOR= 0.5
##$FTSIZE= 0
##$FT_mod= 4
##$GAMMA= 1
##$GB= 0.15
##$INTBC= 1
##$INTSCL= 1
##$ISEN= 128
##$LB= 0.25
##$LEV0= 0
##$LPBIN= 0
##$MAXI= 10000
##$MC2= 0
##$MEAN= 0
##$ME_mod= 0
##$MI= 1.114404
##$NCOEF= 0
##$NC_proc= 0
##$NLEV= 6
##$NOISF1= 3.799351
##$NOISF2= 2.8
##$NSP= 1
##$NTH_PI= 0
##$NZP= 0
##$OFFSET= 14.38212
##$PC= 1
##$PHC0= -464.7891
##$PHC1= 9.592205
##$PH_mod= 1
##$PKNL= yes
##$PPARMOD= 0
##$PSCAL= 0
##$PSIGN= 0
##$REVERSE= no
##$SF= 200.129724274929
##$SI= 16384
##$SIGF1= 3
##$SIGF2= 2
##$SINO= 400
##$SIOLD= 16384
##$SREGLST= <1H.CDCl3>
##$SSB= 0
##$STSI= 0
##$STSR= 0
##$SW_p= 3205.1282051282
##$SYMM= 0
##$S_DEV= 0
##$TDeff= 0
##$TDoff= 0
##$TI= <>
##$TILT= no
##$TM1= 0
##$TM2= 0
##$TOPLEV= 0
##$USERP1= <user>
##$USERP2= <user>
##$USERP3= <user>
##$USERP4= <user>
##$USERP5= <user>
##$WDW= 1
##$XDIM= 8192
##$YMAX_p= 0
##$YMIN_p= 0
$$ End of Bruker specific parameters
$$ ---------------------------------
##NTUPLES= NMR FID
##VAR_NAME=  TIME,          FID/REAL,        FID/IMAG
##SYMBOL=    X,             R,               I
##VAR_TYPE=  INDEPENDENT,   DEPENDENT,       DEPENDENT
##VAR_FORM=  AFFN,          ASDF,            ASDF
##VAR_DIM=   8192,          8192,            8192
##UNITS=     SECONDS,       ARBITRARY UNITS, ARBITRARY UNITS
##FACTOR=    0.0002768,     1,               1
##FIRST=     0,             0,               0
##LAST=      2.2672688,     0,               0
##MIN=       0,             -654390,         0
##MAX=       2.2672688,     522943,          0
$$ Real data points
##PAGE= N=1
##DATA TABLE= (X++(R..R)), XYDATA
$$ [...]
1857b09J77j47K35k57j00K36L53r6l72K38K21m9q5J28k83k61M97m54J14J89J57
$$ -209 -32 -179 56 -201 -301 -65 288 192 -180 58 279 230 145 273 -10 -271 226 -228 -114 75 232
1878B32k97J3J65k19n15K55M46R7k65l1K06k32p1N86j50m1K99l02j96Q6P8j51
$$ 232 -65 -52 113 -106 -621 -366 80 177 -88 -119 87 -145 -216 370 220 179 478 176 -20 66 144 -7
1900gl9J95k56m1M5j64j00K38K23l95N6N01k57KL76r2m57J29K64j42k22J53J59
$$ -7 -46 149 -107 -148 -103 -267 -367 -129 94 -301 -245 256 -1 1 377 285 -172 -43 221 79 -143 10 169
1923A69k74j25m2Q5l61J52J29K46K26j08O5j76K88L33n23l1K60J0p3j62j49J85
$$ 169 -105 -230 -272 -187 -548 -396 -267 -21 205 97 162 -14 274 607 84 53 313 323 250 88 -61 124
1945A24k42m3j71K07L8k85O2J05J92Q1q2N49m7k19J0K53k02m56M59j88j48O0k40
$$ 124 -118 -161 -332 -125 -87 -372 -310 -205 -13 68 -14 535 488 269 279 532 330 -126 333 145 -3 57 -183
1968a83J91m19J62O7j80J74j57J48n1L35J27l06L61R7Qm8N5q0n24L75L1l50L7
$$ -183 8 -411 -249 -182 -362 -188 -345 -197 -248 87 214 -92 269 366 374 326 381 301 -223 152 183 -167 -130
1991a30Qrk98K5o0J27J61K29q8j25O10J35m12K12j37p4P3K7%l91JK7m15L11O7
$$ -130 -122 -131 -429 -404 -464 -337 -176 53 -35 -160 450 585 173 385 248 174 247 274 274 -117 -116 -89 -504 -193 -126
2016a26n41N53l23M64n5j08L84j67Q0K78Q2j66j27j38J64k29k35j03K72j33J13
$$ -126 -667 -114 -437 27 -28 -136 248 81 161 439 521 355 228 90 254 25 -210 -313 -41 -174 -61
2037f1l51J25J00J61k28p9M31K85j29J49l4J0k54K52m9k58K22l22n80M18K38m32
$$ -61 -412 -287 -187 -26 -254 -333 98 383 254 403 369 379 125 377 328 70 292 -30 -610 -192 46 -386
2059c86j17P28k6n99K83K50k0J25J77j37Q4j13k06K30k38j3Q1l87K9Q7k98K11
$$ -386 -503 225 199 -400 -117 133 113 238 415 278 362 249 43 273 35 22 103 -284 -255 -168 -466 -255
2081b55o9J50j74M46o3J49m08M46k00K0L93j37l72J51K73n79K43K10k31l14Q3
$$ -255 -324 -174 -348 98 35 184 -224 222 22 42 435 298 -74 77 350 -229 14 224 -7 -321 -238
2102b38J91k20J4M74j57n4K74q7k25K20J70j08k04K23J65l16l72K51Q1m43Q7J97
$$ -238 -47 -267 -253 221 64 10 284 197 -28 192 362 254 50 273 438 122 -250 1 82 -361 -274 -77
2124g7J93p2n5j54R9K03m27J01J19K07J56l81J59o4N8p9oJ24j32L08n18l5M76
$$ -77 116 44 -11 -165 -66 137 -290 -189 -70 137 293 -88 71 7 65 -14 -20 104 -28 280 -238 -273 203
2147B03j93l62N6K88J79l53K47J24l20J65k01Q7K4J0M1j44j30L43l60M82q5J34
$$ 203 10 -352 -296 -8 171 -182 65 189 -131 34 -167 -80 -56 -46 -5 -149 -279 64 -296 186 101 235
2169B35q3k59L7K45l94N43m71pm9L81l27J30K4n8J45j93L15l05K27J01j47q4J96
$$ 235 152 -107 -70 175 -219 324 -147 -154 -203 178 -149 -19 5 -53 92 -101 214 -91 136 237 90 6 202
2192B02k02j76K37J26l67j41J63n2QO7p1M8P8J68J12k54M50K3m2k72P1k15J18
$$ 202 0 -176 61 187 -180 -321 -158 -210 -202 -135 -206 -158 -80 88 200 -54 396 419 377 105 176 -39 79
2215G9p5J90m78j40J67J45l1l59M83j59M22j87L77j84q5j08K84J86n49J44j44
$$ 79 4 194 -284 -424 -257 -112 -143 -502 -19 -178 244 57 434 250 165 57 341 527 -22 122 -22
2236b2m6K7m00J00K64P6k17L2o2P7L59J76m08J57L99l75R1L98n18o7j35P6M3l14
$$ -22 -68 -41 -441 -341 -77 -1 -218 -186 -248 -171 188 364 -44 113 512 137 228 626 108 41 -94 -18 25 -289
2260b89K27P6l9l51J70J93j97K69j1L17l46J83P6O8J65k30J63n47L93j20j91k10
$$ -289 -62 14 -25 -376 -206 -13 -210 59 48 365 19 202 278 346 511 281 444 -103 290 170 -21 -231
2282b31j21mK04j94N6J28j7J04n3K81l0K18k41J55L18l76J47q4m86J95K54l70
$$ -231 -352 -356 -152 -346 -290 -162 -179 -75 -128 153 123 341 100 255 573 197 344 260 -226 -31 223 -147
2304a47l54L32J63k53k34M41Q3m30N66J71l81M70J10m19L43j40O1k92j96L07n02
$$ -147 -501 -169 -6 -259 -493 -52 31 -399 167 338 -43 427 537 118 461 321 382 90 -106 201 -301
2325c01L26j29j28K21Q9k02K37r7K25r2k53K24J39j28j9M4k88K42j67j52j14J54
$$ -301 25 -104 -232 -11 78 -124 113 16 241 149 -104 120 259 131 112 156 -132 110 -57 -209 -323 -169
2347a69J31l24K08m5j01J84M0J20k63lL59k01J5J69R2l76J12J33p8m25K53K85
$$ -169 -38 -362 -154 -199 -300 -116 -76 44 -219 -222 137 -64 -49 120 212 -164 -52 81 3 -422 -169 116
2369A16l4k18J26P9k26l5L25j28n6L78m15qM71l76J33k24L91r3m1l2k37M7L5N4
$$ 116 82 -136 -10 69 -157 -192 133 5 -51 327 -88 -96 375 -1 132 -92 299 206 165 133 -104 -57 -22 32
2393C2j81O4K02k88L88k97j34L02l51L23j29k02L92j55k27J13R6J87n6j3K44j4
$$ 32 -149 -85 117 -171 217 -80 -214 88 -263 60 -69 -271 121 -34 -261 -148 -52 135 79 66 310 296
2415B96k02m1R8j40k88K17K1r9L4Q9l3K2J99j20k62M86j04j2j25J7p8O7N3j96
$$ 296 94 53 151 11 -277 -60 -39 -138 -104 -15 -48 -26 173 53 -209 277 173 161 36 53 -25 42 95 -101
2439a01Q3j77L09o9l09J79j00K66o4pl6O4O1k83m3K16L36k35J88k85K7n9j97J22
$$ -101 -18 -195 114 45 -264 -85 -185 81 17 10 -26 38 99 -184 -227 -11 325 90 278 -7 20 -39 -236 -114
2463a14o9K52o5m32L07L57l70L2N1J53o4j0J13j7N7j11N7r2J04j00R5j91j30k02
$$ -114 -183 69 4 -428 -121 236 -134 -102 -51 102 38 28 141 124 181 70 127 35 139 39 134 -57 -187 -389
2487c89K51j87M59k37j30L22j34J89j9q5L5K11O1q6m3l56j7j61L50k03O5l11K23
$$ -389 -138 -325 134 -103 -233 89 -45 144 125 40 75 286 347 261 218 -138 -155 -316 34 -169 -104 -415 -192
2510a92J43j21L57Qj07r8j32J17J68J0K13k98j96L2R3k74j05M96k10j89L09o0
$$ -192 -49 -170 187 195 88 -10 -142 -25 143 153 366 68 -128 -96 -3 -277 -382 114 -96 -285 24 -36
2532c6o3k8k07M29j44K31Pj46L72m74n2K84K0p5Q2j85k66J43K0kk56R7J01K09
$$ -36 -99 -127 -334 95 -49 182 189 43 415 -59 -111 173 193 118 200 15 -251 -108 -88 -90 -346 -249 -148 61
2556F1l34K96J51P8k53J30o1m3j4M0J60j35l2J2k12P9J36l51J36q5j6P8J89R7
$$ 61 -273 23 174 252 -1 129 68 25 11 51 211 76 44 56 -156 -77 59 -292 -156 -241 -257 -179 10 107
2580A07j24k19K83K2J39J33j53j66k00J15q5J81j26J35m8k32m8L24j93M36j48
$$ 107 -17 -236 47 69 208 341 188 22 -178 -63 -148 33 -93 42 -6 -238 -286 38 -155 281 133
2601A33o9o8J66n5l84J55k3j28K48J19K92m67J25ol22L94J44l36j68J49Q8J80
$$ 133 64 -4 162 107 -277 -122 -145 -273 -25 94 386 -81 44 38 -284 110 254 -82 -250 -101 -13 167
2623A67k56J39Jj36J30n5j4O6Q0Rr7K8J59j04n8J51k42j65J98j76L02k69J46k63
$$ 167 -89 50 51 -85 45 -10 -24 42 122 131 34 62 221 117 59 210 -32 -197 1 -175 127 -142 4 -259
2647b59K16J72r5j21L29k25k05J39K38P4j26j08lk1j22L2P2k51J70K1R0m1j03
$$ -259 -43 129 34 -87 242 17 -188 -49 189 263 137 29 26 5 -117 -85 -13 -264 -94 -73 17 -24 -127
2670a27lk26L83L0J57j94nj24k1M25j42k8J74r8l52L4J95l37J76l6q2mK06M3n
$$ -127 -130 -356 27 57 214 20 15 -109 -130 295 153 125 299 201 -151 -117 78 -259 -83 -119 -201 -205 1 44 39
2695C9O4J63k25J26j31J78K1o4j1J6j97Lk2Q3l80K01J03l38J41P4L2J23j13O8
$$ 39 103 266 41 167 36 214 235 171 160 176 -21 -18 -40 43 -337 -136 -33 -371 -230 -156 -124 -1 -114 -46
2719d6J94r7R7j09j00K12n0k50J85rr1k8j1l1R0m5J85k17N09l24n2L40j92J15
$$ -46 148 51 148 39 -61 151 101 -149 36 27 -64 -92 -103 -134 -44 -89 96 -121 388 64 12 352 160 275
2743B75kk14J80j01L2k25R7n8l54L19m1k12K17j15Q4J74M9J21j50K90m9l49j48
$$ 275 273 59 239 138 170 -55 42 -16 -370 -51 -92 -304 -87 -202 -118 56 105 226 76 366 317 -32 -180
2766a80M46l91l0K28j66O1J4j28k1N8L2p3K04o1LqJ20j50K04Q8r3n0p2K01l00
$$ -180 266 -125 -155 73 -93 -32 -18 -146 -167 -109 -77 -150 54 -7 -4 -12 108 -42 162 250 157 107 35 236 -64
2791f4M41k55m45J96l8Q9j16R8K13l09J35j20L26j8j74j51J69J03Q0k12n4M2j2
$$ -64 377 122 -323 -127 -165 -76 -192 -94 119 -190 -55 -175 151 133 -41 -192 -23 80 160 -52 -106 -64 -76
2814g6K02Jo1m20N87m92J34j32J32K29o3j90K59k15M02m51N0M25mn80K97q6K4
$$ -76 126 127 66 -354 233 -259 -125 -257 -125 104 41 -149 110 -105 297 -154 -104 321 317 -263 34 -52 -28
2837b8j04pK48k35O4K02l23L56m62K06j49K12K75j93p7L28l25k7n6J87J37j03
$$ -28 -132 -139 109 -126 -62 140 -183 173 -289 -83 -232 -20 255 62 -15 313 -12 -39 -95 92 229 126
2859A26j13l60L32k6j31L11j23j36M4J7rj72Q6q3K73k9n4J01j27KM5L76q14M74
$$ 126 13 -347 -15 -41 -172 139 16 -120 -76 -59 -68 -240 -154 -237 36 7 -47 54 -73 -71 -26 350 -464 10
2883A0J07j51jJ17J10l47j3K5J40l50O04j53j85K20K69r9j94J39ql63L30j68J38
$$ 10 117 -34 -35 82 192 -155 -168 -143 -3 -353 251 98 -87 133 402 303 109 248 240 -123 207 39 177
2906A77l77K65k54RJ33k1l1JJ16R3m54K04L69N0m95K24K33m26K32J04nj87j4J80
$$ 177 -200 65 -189 -180 -47 -68 -99 -98 18 111 -343 -139 230 280 -215 9 242 -184 48 152 147 -40 -54 126
2930A26q1M6j03j31p0J52k56O3K63L2r3m1N6O4m8J28O3k7O2j51K7L7R4l92j21
$$ 126 45 91 -12 -143 -213 -61 -317 -254 9 41 -52 -93 -37 27 -21 107 170 143 205 54 81 118 212 -180 -301
2955c01lL05k75K21m1K50j74k16J92P8j5Rj92J63NQ1k0k22O2L34k41j26L72l91
$$ -301 -304 1 -274 -53 -94 156 -18 -234 -42 36 21 30 -162 1 6 87 67 -155 -93 241 0 -126 246 -145
2979a45J35p%K65k16K57l59K69l17J49j98L02K57k02j97k22M83m26L37R9k18k69
$$ -145 -10 -17 -17 248 32 289 -70 199 -118 31 -167 135 392 190 -7 -229 254 -172 165 264 46 -223
3001b23J27J03j1j37k09L44J65j5j72J62j57J41k62L48lr2J16r4J48o9j61j24
$$ -223 -96 7 -4 -141 -350 -6 159 144 -28 134 -23 118 -144 204 201 109 225 131 279 210 49 -75
3023g5L6q8N1J23k41K13m9M2l08J49p8P0J48k1L20k53L16l45K23m68M30j64K2
$$ -75 -39 -127 -76 47 -194 19 -30 12 -296 -147 -225 -155 -7 -28 292 39 355 10 233 -235 195 31 53
3046E3j67J38J7l75N68j76l6p5p8J32J46O3p0j01Q2j01j1j50L3m9K80j66l01K13
$$ 53 -114 24 41 -334 234 58 22 -53 -131 1 147 210 140 39 121 20 9 -141 -108 -157 123 -43 -344 -131
3070a31J75k4m2k6o5n1J19j36K01j55J28K63n03M31j0k05m0J11k93J05L12j14
$$ -131 44 20 -22 -48 -113 -164 -45 -181 20 -135 -7 256 -247 184 174 -31 -71 40 -253 -148 164 50
3092E0k17K32j08J57q7o2L3J30K9K38l12o9J91j22j88L31k02j73J79J78q4l48
$$ 50 -167 65 -43 114 27 -35 -2 128 157 395 83 14 205 83 -105 226 24 -149 30 208 124 -224
3114b24R3k56L28j62J83J57Jm54K64K00K9K14mm76K41j63J69k16K3K02j15k22
$$ -224 -131 -387 -59 -221 -38 119 120 -334 -70 130 159 373 369 -107 134 -29 140 -76 -53 149 34 -188
3136a88j67J85J9RO9J11N0J11l12N7M0J78l51K14L55k44M4N5J13l41j11O8k86
$$ -188 -355 -170 -151 -142 -73 38 88 199 -113 -56 -16 162 -189 25 380 136 180 235 348 7 -104 -36 -322
3159c22K82n9N2Q5j77L0o8J68Q2j15Q4K33L4n37J74K31l06J39J23k92J16j20J04
$$ -322 -40 -99 -47 38 -139 -109 -177 -9 73 -42 42 275 309 -228 -54 177 -129 10 133 -159 -43 -163 -59
3182e9O8j02j97J6L3L60k27o7L91j73q5p1J24J01m0m35L81R1m20K18j56j51N24
$$ -59 9 -93 -290 -274 -241 119 -108 -175 216 43 -42 -113 11 112 72 -363 18 109 -311 -93 -249 -400 124
3205A24j17O5jq6J10j20L61m32K99K9p4m6J28j91J21k14J18J21l75m0K71k36r1
$$ 124 7 72 71 -15 95 -25 336 -96 203 232 158 112 240 49 170 -44 74 195 -180 -220 51 -185 -276
3228b76J82K18j60r3O0K55j21l3J77k41j3j3J18K7N9j6m42J1L31p2jP0k10L2K86
$$ -276 -94 124 -36 -129 -69 186 65 32 209 -32 -45 -58 60 87 146 130 -312 -301 30 -42 -43 27 -183 -151 135
3253A35l0Q1k11L93l17k64J76O03m56k35N18o07J01O4K41l90J94L2J7j02J15q1
$$ 135 105 186 -25 368 51 -213 -37 566 110 -125 393 -214 -113 -49 192 -198 -4 28 45 -57 58 -23
3275b3q8k7J10K7L2m9l1R4Q8Q9k34l5J51j6jj03J78Ok24M24l30j50K9Q5k40K31
$$ -23 -111 -138 -28 -1 31 -18 -49 45 133 222 -12 -47 104 88 87 -16 162 168 -56 368 38 -112 -83 2 -238 -7
3301gq7L07p0p2J42n6k27j11J74J74q2k7K77m76K47j53K8J38k11P4j27J61n3L16
$$ -7 -94 213 143 71 213 157 -70 -181 -7 167 85 58 335 -141 106 -47 -19 119 -92 -18 -145 16 -37 279
3325B79r9K8q0j82m3P2J53O8P5m35N1J11k15K04j88K94k92R6M3k1L18l83J49p9
$$ 279 180 208 128 -54 -97 -25 128 196 271 -164 -113 -2 -217 -13 -201 93 -199 -103 -60 -81 237 -146 3 -76
3349g6L95n4j94j14J09r0O1JN2j79n0m2J40L6k87L99k42J07n1J81O1k07L5J55
$$ -76 319 265 71 -43 66 -24 37 38 90 -89 -139 -181 -41 -5 -292 107 -135 -28 -79 102 163 -44 -9 146
3373A46k70L35l42P8l5O3k8j75L92k44Q4k72P8J27j07J79J57j87J05M7L4n1j93
$$ 146 -124 211 -131 -53 -88 -25 -53 -228 164 -80 4 -268 -190 -63 -170 9 166 -21 84 131 165 114 -79
3396g9J29j14K17L96n93J24k94L6J16J32R9k98J44k17K93k18K85k56j02K54j32
$$ -79 50 -64 153 549 -44 80 -214 -178 -62 70 169 -129 15 -202 91 -127 158 -98 -200 54 -78
3417g8K51j55p3K36q3J78j14l31K7P5J06Kk6N6n6k04L93k95K16k16O9N8k8J65
$$ -78 173 18 -55 181 98 276 162 -169 -142 -67 39 41 15 71 15 -189 204 -91 125 -91 -22 36 8 173
3441A73Q5j12lJ6l44j9J82l47L66J43j66n3L6J73j66J07k35K86k18l9Q2K66r7
$$ 173 258 146 143 159 -185 -204 -22 -369 -3 140 -26 -79 -43 130 -36 71 -164 122 -96 -135 -53 213 116
3464A16n0p4m6J26j73J33p9n5J8j35L42o1k20m8O1k35L83L3j08J88p5k43L54M2
$$ 116 66 -8 -54 72 -101 32 -47 -102 -84 -219 123 62 -158 -206 -145 -380 3 36 -72 116 41 -202 152 194
3488A94J2k21l5J23K41j91l68L13K8m76P7K67J08j02m4J18K61m06R6R0k8L13l73
$$ 194 206 -15 -50 73 314 123 -245 68 96 -380 -303 -36 72 -30 -74 44 305 -101 -5 85 57 370 -3
3511cn7j72K41Q4k62L3m7L2j56J58J78L4o8l1K30j39l3M1N2L3l26R3P3k8K40k82
$$ -3 -60 -232 9 93 -169 -136 -183 -151 -307 -149 29 63 -5 -36 194 55 22 63 115 148 -178 -85 -12 -40 200 -82
3537h2l4M0QK25k95LR6J61k8j82J78J6m95O43n0j89k46N85k76j75m4j31K21J36
$$ -82 -116 -76 -68 157 -138 -135 -39 122 94 -88 90 106 -389 254 204 15 -231 354 78 -97 -141 -272 -51 85
3561H5k42L0K71j85K78n32O09l16J58j58nQ3R4J42j18j26K56k57ok19J4L2L38
$$ 85 -157 -127 144 -41 237 -295 314 -2 156 -2 -7 76 170 312 194 68 324 67 61 -158 -144 -112 226
3584B26k88L06k91j29O7P3o7J50J15J00L7k29K7k55J15k2J79j26K32Rm09J40j8
$$ 226 -62 244 -47 -176 -109 -36 -103 47 162 262 299 70 97 -158 -43 -65 114 -12 220 229 -180 -40 -58
3607e8N8r2J43n9k09J22j29L31j82J93K35j80k46k9L2J05j51J15l7k44L26O7k59
$$ -58 0 -92 51 -8 -217 -95 -224 107 -75 118 353 173 -73 -102 -70 35 -116 -1 -38 -282 44 111 -148
3630a48j25J72o6J04K5q3K46Mj7k8j45K02j8k51J46J81k53J30p7r3m7R9j64J76
$$ -148 -273 -101 -167 -63 -38 -121 125 129 112 84 -61 141 123 -128 18 199 -54 76 -1 -94 -141 -42 -206 -30
3654c0k74J36J56r2K56j90p3K47K18l88J62N2k20q8p7J24m4m6K90k95J09Q1M1
$$ -30 -304 -168 -12 -104 152 -38 -111 136 354 -34 128 180 -40 -128 -205 -81 -125 -171 119 -176 -67 14 55
3677E5n7Nn3J23rk83J84o8K97l37J93N1J06m80K09j00J79m2m6P7po4j5K07k28
$$ 55 -2 3 -50 73 64 -219 -35 -103 194 -143 50 101 207 -273 -64 -164 15 -27 -73 4 -3 -67 -82 125 -103
3702a03M10j60mj72j40K92k14L22k30j12O1N9k25J71O9j4M7j23mJ06j78J96n0
$$ -103 307 147 143 -29 -169 123 -91 231 1 -111 -50 9 -216 -45 24 10 57 -66 -70 36 -142 54 4
3725DJ6J45j49K20k69p1K63j06K7o9L56p86M99J5k47j16P1J42l1Q0N8l2J14k1
$$ 4 20 165 16 236 -33 -104 159 53 80 11 367 -419 80 95 -152 -268 -197 -55 -86 -6 52 20 134 113
3749A13P5k48QK15O5k21k0j81J55M8K18l28p0K97k40Q9j70K43k35K38M2j56K61
$$ 113 188 -60 -52 163 228 7 -13 -194 -39 9 227 -101 -171 126 -114 -25 -195 48 -187 51 93 -63 198
3772A98o6k77J16k81L98K23j60j46P3M4j71k94M12k67L5J47J29k19K3J37K17l58
$$ 198 132 -145 -29 -310 88 311 151 5 78 122 -49 -343 69 -198 -163 -16 113 -106 -83 54 271 -87
3794h7q5K57K81m31J9P5j06K05j38k0k20R8k7j94L10rQ2J59k37J78k58K7L28k53
$$ -87 -172 85 366 -65 -46 29 -77 128 -10 -30 -250 -152 -179 -373 -63 -72 10 169 -68 110 -148 -121 207 -46
3818d6J93l64K31j12P5M61m47J75j57R6k88mJ22O3j88J7J58K34j65k06K80M7k60
$$ -46 147 -217 14 -98 -23 438 -9 166 9 105 -183 -187 -65 -2 -190 -173 -15 219 54 -152 128 175 -85
3841h5m5M12k67J3K5q4K06j95K31l06Q4K6l8J36m6k20J71j50Q0M9K66k35O2J6
$$ -85 -130 282 15 28 53 -31 175 -20 211 -95 -11 15 -23 113 67 -153 18 -132 -52 -3 263 28 90 106
3865A06q3p1K54k05J16k10r3J49J84J05l7k99J94k06J22M3k34L50K4j47j14J50
$$ 106 23 -48 206 1 117 -93 -186 -37 147 252 215 -84 110 -96 26 69 -165 185 209 62 -52 98
3887I8K3j2O4l29J86j9j30K63j98K3K95l82O3M5j54K28m50M20J40k06P2n5J2J70
$$ 98 121 109 173 -156 30 11 -119 144 -54 -31 264 -118 -55 -10 -164 64 -386 34 174 -32 40 -15 -3 167
3911A67j82L36m80m0O5K10j77j33L84k47J97j07j43J07k83M72l42L67k30Lm8j3
$$ 167 -15 321 -159 -199 -134 76 -101 -234 150 -97 100 -7 -150 -43 -326 146 -196 171 -59 -56 -104 -117
3933a17K13K14K05n92J70k1j47L04m39J74K8q3k2m9J59l16L53J26j86R3m6J42
$$ -117 96 310 515 -77 93 72 -75 229 -210 -36 -8 -91 -113 -162 -3 -319 34 160 -26 67 21 163
3955A63j50J56l4k57K08K83m18L1J49k39M2J63m95L11Q0k04K73J54k53m9N29l35
$$ 163 13 169 135 -122 86 369 -49 -18 131 -108 -66 97 -398 -87 -7 -211 62 216 -37 -86 443 108
3977A08Q0r3k7J16pk75K70j58n1k00K89l69J25R3k6n2m5J56j6R9P4j40J29j03
$$ 108 188 95 68 184 177 -98 172 14 -37 -237 52 -317 -192 -99 -125 -177 -222 -66 -82 17 91 -49 80 -23
4001b3QJ45J15m66K48k41J21j77M05k58N8k3r4R6J10k2k56L52j0k79J93K68k19
$$ -23 -15 130 245 -221 27 -214 -93 -270 135 -123 -65 -88 -182 -86 24 2 -254 98 88 -191 2 270 51
4024E1j37Q2k6L6k48P9qj28J40M24l70J07K00k84J61j55N78n36J63k0P8k04l2
$$ 51 -86 -4 -30 6 -242 -163 -171 -299 -159 265 -105 2 202 -82 79 -76 502 -34 129 109 187 -17 -49
4047d9K22l53j57L22J9r2K8O4l1j68M40m24O7P4J63k1l1J3l6J7J71k21j70K83
$$ -49 173 -180 -337 -15 4 -88 -60 4 -27 -195 245 -179 -112 -38 125 104 73 86 50 67 238 17 -153 130
4071A30j69O0n0R1j23JJ87k1j70j00K41j04J34kp6j49K38l85M40N5k63J19j27
$$ 130 -39 21 -29 62 -61 -60 127 106 -64 -164 77 -27 107 105 29 -120 118 -267 173 228 -35 84 -43
4094d3L0o2K17j49J9j36J31k58K43k1j18J82R4k85K27K93n62L40Nj35mJ67n7j01
$$ -43 -13 -75 142 -7 12 -124 7 -251 -8 -29 -147 35 129 -156 71 364 -198 142 147 12 8 175 118 17
4118A7N2j22n8L2j1P7j61J67K1J49j79J4l23K94K95l99J98L5j43k6K13L6k58j52
$$ 17 69 -53 -111 -79 -90 -13 -174 -7 14 163 -16 -2 -325 -31 264 -135 63 98 -45 -71 142 178 -80 -232
4142b32J47J15jJ09l32O0J54J8N1k70J81R1p0K43j20qJ5m0k42Q7J30l95K77r7
$$ -232 -85 30 29 138 -194 -134 20 38 89 -181 0 91 21 264 144 136 151 111 -131 -44 86 -309 -32 -129
4166a29J4K67l63R3J76Q3j15p3K76j50j92L49k21o9J96R0j66l4j65o4j18Q4L42
$$ -129 -115 152 -211 -118 58 141 26 -47 229 79 -113 236 15 -54 142 232 66 32 -133 -197 -315 -231 111
4189A11P2j31J54m51p3J23K07J91k67K09J68m37Q4j85K37J18M3o9M5r8k35K97
$$ 111 183 52 206 -245 -318 -195 12 203 -64 145 313 -124 -40 -225 12 130 173 104 149 51 -184 113
4211A13k18N4J15j51Q4j71K32j03m9J15K46K5l43k71R6K44lk30M88n21L21j54
$$ 113 -105 -51 64 -87 -3 -174 58 -45 -94 21 267 292 -51 -322 -226 18 15 -215 273 -248 73 -81
4233h1q0J63J0j35k24M78l51M79j57j0K36K1l17N4k20R1k10K86J15j39r1j18L65
$$ -81 -161 2 12 -123 -347 131 -220 259 102 92 328 349 32 86 -134 -43 -253 33 148 9 -82 -200 165
4256A65l73J45P1O9j40J6J94m8o2rJ08K0M1l31K01J98l35k11J36j36K19K0m9J54
$$ 165 -208 -63 8 77 -63 -47 147 99 37 28 136 156 197 -134 67 265 -70 -281 -145 -281 -62 -42 -91 63
4280F3%L40k53l78K09K62k69J5R5J04nj26O7k08J32k32J94k82K84j6p8m34P00
$$ 63 63 403 150 -228 -19 243 -26 -11 84 188 183 57 124 -84 48 -184 10 -272 12 -4 -82 -516 184
4303A84Q9k90J45l96J25j04P2J97j10O4M48m52qJ00j69j65L40O6k37L51Kj27j28
$$ 184 273 -17 128 -268 -143 -247 -175 22 -88 -24 424 -28 -36 64 -105 -270 70 136 -101 250 252 125 -3
4326ck26L69j98k71L14j19J60P1j95M83l54l9J67l4k55L0K64m86N16l4k9j90J16
$$ -3 -229 140 -58 -329 -15 -134 26 97 -98 385 31 -8 159 125 -130 -100 164 -322 194 160 131 -59 57
4349E7P3j04j33J77L04o26K95j0O2M6q9M1p4j01J50nK9K46m60Qn6o8J50J07J29
$$ 57 130 26 -107 70 374 -252 43 33 95 141 52 93 19 -82 68 63 92 338 -122 -114 -170 -238 -88 19 148
4374A48l6J99j10m76L45l30K61j6O1j23Q4RM5k21M0J66j38K04j86l7m0K05J19
$$ 148 112 311 201 -275 70 -260 1 -15 46 -77 7 16 61 -160 -120 46 -92 112 -74 -111 -151 54 173
4397A73j7k47K17m86J000q33L28m9j77K25O1p8j49J59k97J43l6l8J98J2J65j73
$$ 173 156 -91 126 -360 640 -193 135 86 -91 134 195 117 -32 127 -170 -27 -63 -101 97 109 274 101
4419A01j98J58J7N8r3k87J97k5K46j60q0J58N8OK1l08K30N4L3k72J42p7M7J4L3
$$ 101 -97 61 78 136 43 -244 -47 -72 174 14 -66 92 150 156 177 -131 99 153 186 -86 56 -21 26 40 73
4444G3R3p1j73K2P1K19j66k6o7N5o2J09q8K9%p8J04l7k4k10J39L54m34K32k42
$$ 73 166 95 -78 -56 15 234 68 42 -25 30 -32 77 -11 18 18 -60 44 7 -17 -227 -88 266 -168 64 -178
4469a78R8p0j42M15k82J05Q9j95J77k01J14j14K92l16L12j25J25J02N2j73j12
$$ -178 -80 -150 -292 123 -159 -54 35 -160 17 -184 -70 -184 108 -208 104 -21 104 206 258 85 -27
4490b7l2m4J78l8n5P2j73J45K31k05l11K59j19j33K3J97K09l72R6n5J26J64k95
$$ -27 -59 -103 75 37 -18 54 -119 26 257 52 -259 0 -119 -252 -229 -32 177 -195 -99 -154 -28 136 -159
4513a59J57k22K44j64L76k93P4j55K16J15k23q9k6Q7J30k13J85M7l91K74J71j44
$$ -159 -2 -224 20 -144 232 -61 13 -142 74 189 -34 -123 -149 -62 68 -145 40 87 -304 -30 141 -3
4535ck06R6j3J11J31Jk81K24j24Q5M5J6N8l8j34R2j37J36j19J07k42J34K91k15
$$ -3 -209 -113 -126 -15 116 117 -164 60 -64 21 66 82 140 102 -32 60 -77 59 -60 47 -195 -61 230 15
4559A5J08r5n1J12p3r8P8L3q2j47M3L60l84J42J70j19k76L41k08K92j6p3j36J08
$$ 15 123 28 -23 89 16 -82 -4 29 -53 -200 -157 203 -181 -39 131 12 -264 77 -131 161 145 72 -64 44
4583D4q6J68j18j78j96M04l61K16k27M14j25R0k0l41M89l80L93l10K17j96L76
$$ 44 -42 126 8 -170 -366 38 -323 -107 -334 80 -45 45 25 -316 173 -207 186 -124 93 -103 273
4604B73k0l41QJ12j31M42j05m86J85l7l5N0pJ24N8j15l7Q9n0J34n3p8K44j11j88
$$ 273 253 -88 -80 32 -99 343 238 -248 -63 -100 -135 -85 -92 32 90 -25 -62 27 -23 111 58 -20 224 113 -75
4629g5J95l6l69L05m3l9O5j21j47J02K76j42j32K14JJ72l34N5m5K20Q8l61L37
$$ -75 120 84 -285 20 -23 -62 3 -118 -265 -163 113 -29 -161 53 54 226 -108 -53 -98 122 210 -151 186
4652A86j94L5j47p4L5Q9j06O8K11j23J78N1j21l63L32nK4q8k44J12L23M9J66k17
$$ 186 -8 27 -120 -194 -159 -70 -176 -108 103 -20 158 209 88 -275 57 52 76 -12 -256 -144 179 228 394 177
4676A77q4k50M1L2K39k83j32J35J61K66l78J21j58K51r1r0J27j67K11j38q7K47
$$ 177 93 -157 -116 -84 155 -128 -260 -125 36 302 -76 45 -113 138 47 -43 84 -83 128 -10 -97 150
4698A50k5k68P7R5Q7n9o4K51j78k29K70k27j8K57l90N57k40J7k43L17j15l3j36
$$ 150 125 -143 -66 29 116 57 -7 244 66 -163 107 -120 -138 119 -271 286 46 63 -180 137 22 -11 -147
4721a47K82j05J77k80j02j30Q0J58K29p6p9k11P0j9Q1J73m4J29k84K00q9r8J80
$$ -147 135 30 207 -73 -175 -305 -225 -67 162 86 7 -204 -134 -153 -72 101 57 186 -98 102 13 -85 95
4744I5k53J67q9j33K52Kj52r7K67j28K76r0m6j18J75j0o6j28j0Q8K69m18J22k12
$$ 95 -158 9 -80 -213 39 41 -111 -208 59 -69 207 117 71 -47 128 118 52 -76 -86 2 271 -147 -25 -237
4768b37K01P5j7K2j54K06k98K64lj69L2K44k31M1n5K04j93O6j0j20J57k41L49
$$ -237 -36 39 22 44 -110 96 -202 62 59 -110 -78 166 -65 -24 -79 125 -68 -2 -12 -132 25 -216 133
4791A33j17m1K18k95J66j75l3J85p4J34k63M71j59k92J71j35n1J21J41m04K29
$$ 133 16 -25 193 -102 64 -111 -144 41 -33 101 -162 309 150 -142 29 -106 -157 -36 105 -299 -70
4812g0j03q1J34J24J02o0M5K0J81l07J50n2l0o6J26R8m36N78m30N3J08M1j37J11
$$ -70 -173 -254 -120 4 106 46 91 111 292 -15 135 83 53 -13 113 211 -225 353 -77 -24 84 125 -12 99
4836I9j89P2J17l73L35k16J43j6k44M84k16j4M7j1j38K0O3L14k72Q7k16K62l52
$$ 99 -90 -18 99 -274 61 -155 -12 -28 -272 212 -4 -18 29 18 -120 -100 -37 277 5 92 -124 138 -214
4859b14Q3j64J40P8L0k38K81J03o1K44j59k01MQ4P4J07l32K66n3m2k77L66k50
$$ -214 -131 -295 -155 -77 -47 -285 -4 99 38 282 123 -78 -74 10 84 191 -141 125 72 30 -247 119 -131
4882a31J92O3r5O2r5O0J9l4Q0m2j48K9O5j51p4L87k56K73l82R9j5L12l51M7J83
$$ -131 61 124 29 91 -4 56 75 41 121 79 -69 -40 25 -126 -200 187 -69 204 -178 -79 -94 218 -133 -86 97
4907I7k74J7L9L57k82J9K51l85J69O8n1L5o5lr3M9K19k69Q3P2K9J1j65M7j10J15
$$ 97 -177 -160 -121 236 -46 -27 224 -161 8 76 25 60 -5 -8 -101 -52 167 -102 -19 53 82 93 -72 -25 -135 -20
4933b0J55j26j00J12l72P00j07l30L58l55J78k97L26k08J22l73K30K17l46J97
$$ -20 135 9 -91 21 -351 349 242 -88 270 -85 93 -204 122 -86 36 -337 -107 110 -236 -39
4953c9R9j82K92n2j41O1L4O7j81J17j97k2o3K33j07R0r1R0J61l57K11n2N6j33
$$ -39 60 -122 170 118 -23 38 72 139 -42 75 -122 -144 -207 26 -81 9 -82 8 169 -188 23 -29 27 -106
4977a06j28J76o9j13L49j03k6N4k37N36j28l65K17K2j4k6r3K05l16J87j23J92
$$ -106 -234 -58 -127 -240 109 6 -20 34 -203 333 205 -160 57 79 65 39 -54 151 -165 22 -101 91
4999I1j13J47k23J41J29q0R9k00K0L7J09k1j65j60lK7QK8K53N4j81J01L0J00n01
$$ 91 -22 125 -98 43 172 92 191 -9 11 48 157 136 -29 -189 -192 -165 -157 -129 124 178 -3 98 128 228 -273
5024b73mJ26J23J52l07L78l57P8J84k61L45k50J51j91J72Oqk68L34k21O7o2R7
$$ -273 -277 -151 -28 124 -183 195 -162 -84 100 -161 184 -66 85 -106 66 72 64 -204 130 -91 -24 -86 11
5047A1J84k13L1j82K16J45j12k90M68j86NJ71l16R2j72K63r2J49k34J56kJ96j75
$$ 11 195 -18 13 -169 47 192 80 -210 258 72 77 248 -68 24 -148 115 23 172 -62 94 92 288 113
5070A13q6k6O4j2j17J36P2lj72J24j2j49q2p3N46k41L63k91k02K36k46K69m73
$$ 113 27 1 65 53 -64 72 144 141 -31 93 81 -68 -150 -223 323 82 445 154 -48 188 -58 211 -262
5093b62J01K69J89k23M5p6j25R8r0j60J12J47j53j46J68Q1R3l2k12J27J55R2k54
$$ -262 -161 108 297 74 119 43 -82 16 -74 -234 -122 25 -128 -274 -106 -25 68 36 -176 -49 106 198 -56
5116e6P2r5P6k0L89o41K98O4m94M85k80J90J0N2k28L57l04j26M61j95j54J68j15
$$ -56 16 -79 -3 -23 366 -275 23 87 -407 78 -202 -12 -2 50 -178 179 -125 -251 210 15 -139 29 -86
5139h6K32k5k86O6j9J13j92K04J61l81K99j9j41J9r8J3K3j43m4M56n0J30k09K58
$$ -86 146 121 -165 -99 -118 -5 -197 7 168 -213 86 67 -74 -55 -153 -140 -117 -260 -304 152 102 232 23 281
5163B81n39K17m5j4K20R6k44P5j22J12M2l0j91J08J01j64J46p3J36j40k60J67
$$ 281 -258 -41 -86 -100 120 216 -28 47 -75 37 79 49 -142 -34 67 -97 49 -24 112 -28 -288 -121
5185a21P0R0K03j07l26L40j39j61J64K63m78R5m4K14j91k2L06k02k27J19K79k46
$$ -121 -51 39 242 135 -191 149 10 -151 13 276 -202 -107 -151 63 -128 -150 156 -46 -273 -154 125 -121
5207a21M9K51l71K86p2J97k11j03J17J27j32j64K65M4j53j39K44r5N6On9J99k92
$$ -121 -72 179 -192 94 22 219 8 -95 22 149 17 -147 118 162 9 -130 114 19 75 81 22 221 -71
5230g1R0m9k00J98j49J65j47M17l02J23N0k44r4K61p5K62k19J66j29q5M5q3j31
$$ -71 19 -30 -230 -32 -181 -16 -163 254 -48 75 125 -119 -213 48 -27 235 16 182 53 -32 13 -70 -201
5253b01J72O7j42n4O6j3Q5K74j06j23j27K73k17J31j40J78%k3q3j02P7j18J30
$$ -201 -29 38 -104 -158 -92 -105 -20 254 148 25 -102 171 -46 85 -55 123 123 100 17 -85 -8 -126 4
5276DP9j76M8k3q3K0J62J03j60Q6q1n8P4j7j03L37p2J50l33p9Q2L2l1p0O2j49
$$ 4 83 -93 -45 -68 -151 -131 31 134 -26 60 -21 -79 -5 -22 -125 212 140 290 -43 -122 -40 -8 -39 -109 -47 -196
5302a96o2K09j30J69j1j81J52J62O3m62J88j9O4L7L37k71m8k39L08J2j37L86n31
$$ -196 -258 -49 -179 -10 -21 -202 -50 112 175 -287 -99 -118 -54 -17 320 49 1 -238 70 82 -55 331 -200
5325b00J61j38k1J52J95l5J29J0j69J1J34M3j03l87K33J40n0k42M8N0K53j86j11
$$ -200 -39 -177 -198 -46 149 114 243 253 84 95 229 272 169 -218 15 155 105 -137 -89 -39 214 28 -83
5348h3J87m4p3J53j51r3J77l19L85k02j14K81j83L33p3k33J05k73J54K1l5o7J23
$$ -83 104 60 -13 140 -11 -104 73 -246 139 -63 -177 104 -79 254 181 -52 53 -220 -66 -45 -80 -147 -24
5371b4l20K92j7N7P3J28l52K73m01M30p5r9J07j1K94n49J19L3%K52r2j06K01o03
$$ -24 -344 -52 -69 -12 61 189 -163 110 -291 139 64 -35 72 61 355 -194 -75 -42 -42 210 118 12 213 -390
5395c90J19M39j04j39L00ok95R1j3k7K43k44J23j38J17l81L54P3j50J29k91L41
$$ -390 -271 168 64 -75 225 219 -76 15 2 -25 218 -26 97 -41 76 -305 49 122 -28 101 -190 151
5417A51l68K97N1pk78J34N3p1k16K23K59p2J07j37n7j29J74J17l50k7K6K00k31
$$ 151 -217 80 131 124 -154 -20 33 -38 -254 -31 228 156 263 126 69 -60 114 231 -119 -146 -120 80 -151
5440a51o9L56j52r2j77J72J69j05J31j57L41j76j1k4j03j16P6Q1K9K03l85K47
$$ -151 -220 136 -16 -108 -285 -113 56 -49 82 -75 266 90 79 55 -48 -164 -88 -7 22 225 -160 87
5462H7l9j37M1N7L50m58K25n1P1k47j45L12J48l91M35k72KQ1J52j07l7n3j50M54
$$ 87 48 -89 -48 9 359 -99 126 75 146 -101 -246 66 214 -177 258 -14 -12 69 221 114 77 24 -126 328
5486C28j59n01K22K55j75P7l9M9k0j04Q8j40J65j71K01J84k35K85m04L09j31k5
$$ 328 169 -332 -110 145 -30 47 8 57 37 -67 21 -119 46 -125 76 260 25 310 -94 215 84 59
5508E9R9n44K01O24l31m7q6P6K6j9J41j24j06N8j54Q3j12Q8J83R2l4j00J28j88
$$ 59 158 -386 -185 439 108 61 -25 51 77 58 199 75 -31 27 -127 -44 -156 -68 115 207 173 73 201 13
5532A3k10j68N87k84P8k18M16k06RJ71m0k39l7K60r0k12M07j25j26J8J67m4P2
$$ 13 -197 -365 222 -62 16 -202 214 8 17 188 148 -91 -128 132 42 -170 237 112 -14 4 171 127 199
5555A99k14J06n3l43N26j18r9j6K60j92J4j30K51j84pj06L9K16r6Q9j45k32N00
$$ 199 -15 91 38 -305 221 103 4 -12 248 56 70 -60 191 7 0 -106 -67 149 53 142 -3 -235 265
5578B65N2l63k6J47p7p3P9J11k89L04J67q4M1m42M40j70j50n3Q6P8P2j39J98q8
$$ 265 317 -46 -72 75 -2 -75 4 115 -174 130 297 213 254 -188 252 82 -68 -121 -35 43 115 -24 174 86
5602H6j13jJ56j0r8L13k36Q0j92j55Om3L88ml93K88j94L0J28nl06L22m9l1L58
$$ 86 -27 -28 128 118 20 333 97 177 -15 -170 -164 -207 181 177 -216 72 -122 -92 36 31 -275 47 -2 -33 325
5627C25j78j09J62k50J39J02R8k68K3m0l08K49k6J2O5n8O6Q7p6K12k32R8m0p6
$$ 325 147 38 200 -50 89 191 289 21 44 4 -304 -55 -81 -69 -4 -62 4 91 15 227 -5 93 53 -23
5651b3J94j88K57k71j89O4L03K4l20K08J4j01o2j56L00J14k59J45o7l3l0J80j69
$$ -23 171 -17 240 -31 -220 -156 147 171 -149 59 73 -28 -90 -246 54 168 -91 54 -13 -46 -76 104 -65
5674f5J08J03Q6j77k63J87R3j70R3OJ5l39J29M2K45m09M40l08J8L30j24l53L28
$$ -65 43 146 232 55 -208 -21 72 -98 -5 1 16 -323 -194 -152 93 -316 124 -184 -166 164 40 -313 15
5697A5j16k4J81K3O7k62p6K30m0l40J62R2P2j85NK42j28m4n3J92J3m79L26p5K52
$$ 15 -101 -125 56 79 146 -116 -192 38 -2 -342 -180 -88 -16 -201 -196 46 -82 -126 -179 13 26 -453 -127 -202 50
5722E0j26LK14L8j15k44K35M1J29j36mr4j51L94k55j14K15j67J21n8j67K25j85
$$ 50 -76 -73 141 179 64 -180 55 96 225 89 85 -9 -160 234 -21 -135 80 -87 34 -24 -191 34 -151
5745a51O2J91k50n7K00K54l49J18j63J98l01K18r6J43J90j45j5lq1p2j50J51J78
$$ -151 -89 102 -148 -205 -5 249 -100 18 -145 53 -248 -30 -126 17 207 62 47 44 -37 -109 -259 -108 70
5768G0j06K08j76k43L38J30k91L82l47J39L7J30k30k08L50k83J12Q0j28k75K43
$$ 70 -36 172 -4 -247 91 221 -70 312 -35 104 141 271 41 -167 183 -100 12 92 -36 -311 -68
5789f8L34l42j19K22k5O2J16j78l47L91j00J32%k01J74Jl01K01J05r6K10m41L89
$$ -68 266 -76 -195 27 2 64 180 2 -345 46 -54 78 78 -123 51 52 -249 -48 57 -39 171 -270 119
5812A19m9o1k4k09J40J17r6K60l24q6K71j92J75j52Q4K51j49k52L73p6l17J38
$$ 119 70 9 -15 -224 -84 33 -63 197 -127 -213 58 -134 41 -111 -27 224 75 -177 196 120 -197 -59
5834e9K3j09J99J63l46J29j20N34k24j70j0j96J10J45j14k6J01M0J95k59j97J59
$$ -59 -36 -145 54 217 -129 0 -120 414 190 20 10 -186 -76 69 -45 -71 30 70 265 6 -191 -32
5856c2j2k49K98n1P0Rj11J4J58k48K93j38r7L06l01O2k03J91l0J62J98j80K07
$$ -32 -44 -293 5 -46 24 33 -78 -64 94 -154 139 1 -96 210 -91 -29 -232 -41 -71 91 289 109 316
5879C16m34k8J82j5O0p0k03J22k48M84k70J08J80j42j93J14m8N9k02K23J79j95
$$ 316 -118 -146 36 21 81 11 -192 -70 -318 166 -104 4 184 42 -151 -37 -85 -26 -228 -5 174 -21
5901b1k11J84J33M7m15J89M7K1k23L4K08J49k15Kq1N4L10k11Jk4K6l98L46j78
$$ -21 -232 -48 85 132 -283 -94 -47 -26 -249 -215 -7 142 -73 -71 -152 -98 212 1 2 -22 4 -394 -48 -226
5925b26J16L42n8o1J31qj69kjo0%k9O0J61l97K05j27M27j81k28P5J98r9p8j03
$$ -226 -110 232 174 113 244 236 67 65 64 4 4 -25 35 196 -201 4 -123 304 123 -105 -30 168 69 -9 -112
5950a12M4k7j3J5J22j22j99N28k67l40M52R8J35k11n7m1m46O18k28J6o5J19p4
$$ -112 -68 -95 -108 -93 29 -93 -292 236 -31 -371 81 179 314 103 46 5 -441 177 -51 -35 -100 19 -55
5973e5PJ6kr7q7J79q2L11J3n3J3k17K22j26k40K63j51J28j84J27J86k06m4k31
$$ -55 -48 -32 -34 -131 -218 -39 -121 190 203 150 163 -54 168 42 -198 65 -86 42 -142 -15 171 -35 -79 -310
5997c10N43l01J74n4l03J54K96k29J97q1r1J66j92J1j68R9J89jo8J41m3l64K71
$$ -310 233 -68 106 52 -251 -97 199 -30 167 86 -5 161 -31 -20 -188 -89 100 99 31 172 129 -235 36
6020C6k30J2K1l1K43j44K07q8K15m8l20M59j58m90J77L47n66O63l17K0j82J86
$$ 36 -194 -182 -161 -192 51 -93 114 26 241 193 -127 332 174 -316 -139 208 -358 305 -12 8 -174 12
6042A2q0l1m5K28k27P8K1J46k23K75l78K46o1j02o9J08N9J55k47L9J38k22l1K51
$$ 12 -68 -99 -144 84 -143 -65 -44 102 -121 154 -224 22 -39 -141 -210 -102 -43 112 -135 -96 42 -180 -211 40
6066D0L21m27J08k03M27m34K2n8K54k88M46k94j97M07J8l07L44l13m1M85k89l9
$$ 40 361 -66 42 -161 266 -168 -146 -204 50 -238 208 -86 -283 124 142 -165 179 -134 -175 310 21 -18
6088a8K50j51q0M2j75K02K3r5J14L1J19k71j06J11L3r9K88lj85J05j63L7r9o8
$$ -18 232 81 1 43 -132 70 93 -2 112 143 262 -9 -115 -4 29 -70 218 215 30 135 -28 9 -90 -158
6112a58M41l37j07N02n41r8J67K67k89o3J18JK58k68rO5m0j52M56j84j77J33K89
$$ -158 283 -54 -161 341 -200 -298 -131 136 -153 -216 -98 -97 161 -107 -116 -51 -91 -243 213 29 -148 -15 274
6135B74l12L54l68k1l2j00N46m66K4M22n17OM97j02j46j60J13P8j77J76K03m71
$$ 274 -38 316 -52 -73 -105 -205 341 -125 -101 321 -196 -190 307 205 59 -101 12 90 -87 89 292 -179
6157a79K7J75k75K78j62M9j15j82M18J28j60J36k20J01R1J46k08l06K76j38J36
$$ -179 -152 23 -252 26 -136 -87 -202 -384 34 162 2 138 -82 19 110 256 48 -258 18 -120 16
6178A6K57k14l14J52J31J34m34L13j26o3oN38n58J52K0k8J12j45J37j90L75l1
$$ 16 273 59 -255 -103 28 162 -272 41 -85 -148 -154 384 -174 -22 -2 -30 82 -63 74 -116 259 228
6200B28l48R7r2J95j74J61k93K76J29j67j43K50k66J25K68p8P9k22p1k24K84k0
$$ 228 -120 -23 -115 80 -94 67 -226 50 179 12 -131 119 -147 -22 246 168 247 25 -46 -270 14 -6
6222fj20J58J5J74l00m9K74j98K55l3k45J38l12M47k87J11Lq1R4j54k03N45j03
$$ -6 -126 32 47 221 -79 -128 146 -52 203 170 -75 63 -249 198 -89 22 25 -56 38 -116 -319 226 123
6245A23O5l47L32n6l19J02K3q9J84j40j21O1J99j32J07k75M03K93k28k54K23m40
$$ 123 188 -159 173 117 -202 -100 -77 -166 18 -122 -243 -182 17 -115 -8 -283 120 413 185 -69 154 -286
6267b86M00j73p0J00j2k8J94j06r1J21k28L87l61J68r0L31l53J22q6K03m71N11
$$ -286 114 -59 -129 -29 -41 -69 125 19 -72 49 -179 208 -153 15 -75 256 -97 25 -61 142 -329 182
6289A82j17MM2k12P8J72j42J22l40N6J61o1J1J37J14K8k26j44K40k52k0K53k01
$$ 182 65 69 111 -101 -23 149 7 129 -211 -155 6 -55 -44 93 207 235 9 -135 105 -147 -167 86 -115
6312a15L41j40l5j69J84n1j13K49j38j50J91j8K30k46k76N01k23R3m48L56J06
$$ -115 226 86 51 -118 66 15 -98 151 13 -137 54 36 266 20 -256 245 22 115 -333 23 129
6333A29n5j02K0r4K46k22R9l3R8N2j05K2k70L78M7m82J28K42r4K06n1j22J35k26
$$ 129 74 -28 -8 -102 144 -78 21 -12 86 138 33 55 -215 163 210 -272 -144 98 4 210 159 37 172 -54
6357e4j26j16N09j85j03L8j6L9k19m6L84j29J80k87j17M41j31j91lR1R1K50l23
$$ -54 -180 -296 213 28 -75 -37 -53 -14 -233 -279 105 -24 156 -131 -248 193 62 -129 -132 -41 50 300 -23
6380b3O2K42j50o8j05J67p9k9k56L09j00j21J59r9j04K10L5N5k07o3J20k27K18
$$ -23 39 281 131 63 -42 125 46 17 -239 70 -30 -151 8 -91 -195 15 50 105 -102 -165 -45 -272 -54
6403e4k6l4K80k88J45m1M3p7n4Q2J35k18j69K32M0j37M4q4J70Q6p6r9J69l0%k72
$$ -54 -80 -114 166 -122 23 -18 25 -52 -106 -24 111 -107 -276 -44 -4 -141 -97 -181 -11 75 -1 -100 69 39 39 -233
6429b33J98k45N55l62k6J67k29M85m37k03K75J91k99L03j31p1K55m75N59k58Q4
$$ -233 -35 -280 275 -87 -113 54 -175 310 -127 -330 -55 136 -163 140 9 -62 193 -282 277 19 103
6450A03k7Kj13Mn4M50n43J30J21N7k63J4K89L1n5k35J8j20k6J38o7J06L6r3K22
$$ 103 76 78 -35 -31 -85 365 -178 -48 73 130 -133 -119 170 201 146 -89 -71 -191 -217 -79 -146 -40 -4 -97 125
6475A25k32O4J44j4l58L28m2J53k34J49j62J24j16M2J05J24j21k71L41k81N0K94
$$ 125 -107 -43 101 87 -271 57 15 168 -66 83 -79 45 -71 -29 76 200 79 -192 149 -132 -82 212
6497B12j75m4J74j82R1j12K10m9j13p4l9L7J62oj02J98j99P9nm3J40l07K17K77
$$ 212 37 -7 167 -15 76 -36 174 125 12 -62 -101 -64 98 92 -10 188 -11 68 63 20 160 -147 70 347
6521C47k73j07K24l7q5k3j33L91j16j10j54j04K01j76L09m7K2j95J3J29J73m51
$$ 347 74 -33 191 154 69 46 -87 304 188 78 -76 -180 21 -155 154 107 129 -66 -53 76 249 -202
6543b02R5KK36j04J92o0J20j18j47l96O95k27j24K2q5O7m1k0J01J94k35j90J13
$$ -202 -107 -105 131 27 219 159 279 161 14 -382 313 86 -38 -16 -101 -34 -75 -95 6 200 -35 -225 -112
6566a12K48o2j8j71L12J52k17l70J85K58k30J3K52k09J90m09K76j79R9P9P3o3
$$ -112 136 74 56 -115 197 349 132 -238 -53 205 -25 -12 240 31 221 -188 88 -91 8 87 160 97
6588I7q3J5Nj04J73j47J83j02o8j18L06j73m8P9rj9J41o7k1j67K92j67l04N23
$$ 97 14 29 34 -70 103 -44 139 37 -31 -149 157 -16 -64 15 6 -13 128 61 40 -127 165 -2 -306 217
6612B17j96j32M1p3J85l03K13j6j29L20k49K47k3j48qK1J40m4M7k61L36j6k99
$$ 217 21 -111 -70 -143 42 -261 -48 -64 -193 127 -122 125 102 -46 -54 -33 107 63 110 -151 185 169 -130
6635a30J49P5J77l43jj1J45r0jL7p8k9J00O9j74QL10j60R7j63J47j16l17L77j71
$$ -130 19 94 271 -72 -73 -84 61 -29 -30 7 -71 -100 0 69 -105 -97 213 53 150 -13 134 18 -299 78 -93
6660i3L04k55O1j32k03N39n0m11K02O8k23N0J85j05k2J22k84L62m55M69k02Q9
$$ -93 211 -44 17 -115 -318 221 171 -240 -38 30 -193 -143 42 -63 -85 37 -247 115 -340 129 -73 16
6682A6j40N6K62l88Q1L02k43J83j24K64n5j43J37j66j2Q9J0j93J10j10J62j67
$$ 16 -124 -68 194 -194 -113 189 -54 129 5 269 214 71 208 42 30 119 129 -64 46 -64 98 -69
6704f9Q6j36K38K12l87k4k49K97j64J57k5N2o8K53k79P0J49m5J3j04J64j2j18
$$ -69 17 -119 119 331 -56 -80 -329 -32 -196 -39 -64 -12 -80 173 -106 -36 113 68 81 -23 141 129 11
6727A1j9j23J02J56k85K70k38J86J18k48k8n7J76K4j5K13l23k7J62r4L8L6p7J02
$$ 11 -8 -131 -29 127 -158 112 -126 60 178 -70 -98 -155 21 45 30 243 -80 -107 55 -39 -1 35 -42 60
6751F0k82K40j93K23j00n9J51m2K19m18J42L13j55k12K64m81K06J96j04J20k24
$$ 60 -222 18 -175 48 -52 -111 40 -2 217 -201 -59 254 99 -113 151 -330 -124 72 -32 88 -136
6772a36q6J88J13M5L2l49K44k83J38KL88l18n4K09j19N2J3j62J78k8l07M27k26
$$ -136 -222 -34 79 124 156 -193 51 -232 -94 -92 296 -22 -76 133 14 66 79 -83 95 67 -240 187 -39
6795c9q4J19R4k16M01j86j43Lj19r2J35K86O1r0oj13j37J52K05j61L21l61j12
$$ -39 -123 -4 90 -126 275 89 -54 -51 -170 -262 -127 159 220 130 124 11 -126 26 231 70 391 30 -82
6818h2J68k19J52l38M89j11l12m8N0o8P1N14l45r9K38m76L85L23l31J44P1K5l52
$$ -82 86 -133 19 -319 170 59 -253 -301 -251 -319 -248 266 -79 -178 60 -416 -31 292 -39 105 176 201 -151
6841a51M98k10j87J75j06Q9k1l8q4q4q7J83M5j41QJ16oPj09J18k61J39J43q1K39
$$ -151 347 137 -50 125 19 108 87 49 -35 -119 -206 -23 22 -119 -111 5 -1 6 -103 15 -246 -107 36 -45 194
6866A94o9kj12p4Kj50J64L01l54J30k15K28J75k76J01k0l9J99m16K16L5j31p4
$$ 194 125 123 11 -63 -61 -211 -47 254 -100 30 -185 43 218 -58 43 23 -16 183 -233 -17 18 -113 -187
6889a87J14J14k9J03n06L92l0L1P5j03j94L57k4j34L60m26j06L40p0M5k28j1r2
$$ -187 -73 41 12 115 -391 1 -29 2 77 -26 -220 137 113 -21 339 -87 -193 147 77 122 -106 -117 -209
6912b09K33NP4m3j59q2L30j93q1K45r1N2l00J45K13Nj17j56M7p3K24r5J04j21
$$ -209 24 29 103 60 -99 -181 149 -44 -125 120 29 81 -219 -74 139 144 27 -129 -82 -155 69 -26 78 -43
6936d3k8J53j75k43J93J76M4j91P3j66K81k12J46j02K02R4j62mo9K58l60L9R5
$$ -43 -71 82 -93 -336 -143 33 77 -114 -41 -207 74 -138 8 -94 108 202 40 36 -33 225 -135 -96 -1
6959aK23l03K96l35L87l63L20j93j16J11J13M5m42L48O3k6r2J87j13k26L59O6
$$ -1 222 -81 215 -120 267 -96 224 31 -85 26 139 184 -258 90 153 127 35 222 109 -117 242 308
6981C08m8j84k41L54L5k51J15j44M6M5J65k82L49j99j71K84k75R2q1R7L54l48
$$ 308 260 76 -165 189 224 -27 88 -56 -10 35 200 -82 267 68 -103 181 -94 -2 -83 14 368 20
7003B0n0k09J87K60j85L7l00J4L20Q2k9K2j87j41K61j99L0k21K16M07k38o2NQ9
$$ 20 -30 -239 -52 208 23 60 -240 -226 94 176 147 169 -18 -159 102 -97 -67 -288 -72 335 97 35 40 129
7027A29k70J90j61R0M9J31j28k48J53K7pL2J31k11Q7j00Q3R7q4J69l57K52o6J61
$$ 129 -141 49 -112 -22 27 158 30 -218 -65 -38 -45 -13 118 -93 -6 -106 -23 74 -10 159 -198 54 -12 149
7051A49j87K93l64J01J38k72J46Q0j57j34L87k94K19J2k69N02j94k97K21%K8j41
$$ 149 -38 255 -109 -8 130 -142 4 84 -73 -207 180 -114 105 117 -152 350 156 -141 80 80 108 -33
7073c3Mq8p1L77l34K28N0l71J86K02j30k20J46J77k47J88j27nK84j26j5Q2l32
$$ -33 -29 -117 -188 189 -145 83 133 -238 -52 150 20 -200 -54 123 -124 64 -63 -68 216 90 75 157 -175
7096a75P7L68m26Q2J94r7M4J75l74j4k7J64qJ11R7k16j88L58P3k75K71%l06L3
$$ -175 -98 270 -156 -74 120 23 67 242 -132 -146 -173 -9 -17 94 191 -25 -213 145 218 -57 214 214 -92 -59
7120e9J70j49j15J32m4J63k93N40j47l30J50m3J07j51k64L76J01Q6m05J0K36k68
$$ -59 111 -38 -153 -21 -65 98 -195 345 198 -132 18 -25 82 -69 -333 43 144 230 -175 -165 71 -197
7142a97K52q8M4O6K44k32j92K16k45K42j26m8J44R9q9j87j69J73J76k5j48L7M31
$$ -197 55 -33 11 77 321 89 -103 113 -132 110 -16 -64 80 179 90 -97 -266 -93 83 58 -90 -53 378
7165C78m52QlJJ52o0k07M14j81j72l0O09l11j63r1N4K83j35j66N9oJ60k28k17
$$ 378 -74 -66 -69 -68 84 24 -183 231 50 -122 -152 457 146 -17 -108 -54 229 94 -72 -13 -19 141 -87 -304
7189c04M24p6l05L08J35J10k99O9j47j25J34j6Mj02j22M28j6k46J38R0%J9k46
$$ -304 120 44 -261 47 182 292 -7 62 -85 -210 -76 -92 -88 -190 -312 116 100 -146 -8 82 82 101 -145
7212a45M7j5N31k96j0j40j51J10O7j56K70o3j16L5p1J28O3l39K66O4P7k41N9j38
$$ -145 -98 -113 418 122 112 -28 -179 -69 -2 -158 112 49 -67 -32 -103 25 88 -251 15 79 156 -85 -26 -164
7236a64K89J6R0m33L66l75K20N9k65K00J92m02L17l73J83J2r8L03k46p3M08o2
$$ -164 125 141 231 -202 164 -211 9 68 -197 3 195 -207 110 -263 -80 -68 -166 137 -109 -182 226 164
7258A64k48kl45O49k23J23j66K02k66K07j54K30j87L01l10J44J52k58r4p5K56
$$ 164 -84 -86 -431 218 -5 118 -48 154 -112 95 -59 171 -16 285 -25 119 271 13 -81 -156 100
7279A00P9j56j11q8L46k50n7J96K1q2K13r3n04K78L5R3r5J30j52J91m56L55j74
$$ 100 179 23 -88 -176 170 -80 -137 59 80 -2 211 118 -386 -108 -73 20 -75 55 -97 94 -362 -7 -181
7302a81L38k54M45k88J91k98J91n24K14k2R4O4l05L72J4O1K49m28J27R1l31P6
$$ -181 157 -97 348 60 251 -47 144 -380 -166 -188 -94 -30 -335 37 51 112 361 -67 60 151 -180 -104
7324a04J39j1l0K50p1Jm8j5n4j61L75N0n4K8j89l86L27R3k00K2k19K43p4K5j7
$$ -104 35 24 -6 244 173 174 126 111 57 -104 271 321 267 295 106 -280 47 140 -60 -38 -257 -14 -88 -63 -80
7349h0J14j91K47l51J42j13J74P7J40j91J23p9NR2j93J12J58m8j96jO0J83j95
$$ -80 34 -157 90 -261 -119 -232 -58 19 159 -32 91 12 17 109 -84 28 186 138 -58 -59 1 184 -11
7372a1j10J86l60L35J13n01L78K5j47Q4Q7J7j16J01O9M1j30l2l78L95P3r2l15
$$ -11 -121 65 -295 40 153 -348 30 55 -92 -8 79 96 -20 81 150 191 61 29 -349 46 119 27 -288
7395b88M71l60K22K6k48L72l04J12K79j48p4N5j23K4n9j57L85j61joJ56l07M76
$$ -288 183 -177 45 71 -177 195 -109 3 282 134 60 115 -8 16 -43 -200 185 24 23 17 173 -134 342
7418C42n14K85o0j74p0k26L82J21L6K7j41p3j49K11R6J37m29N7K03MNk3K7j9l49
$$ 342 -172 113 53 -121 -191 -417 -35 86 122 149 8 -65 -214 -3 93 230 -199 -142 61 65 70 47 74 55 -294
7443b94K15J61k63L7M3K70j86M0J83k01j63j00K60M9l72J48K50l18P9K92l5M8
$$ -294 -79 82 -181 -144 -101 169 -17 23 206 5 -158 -258 2 51 -321 -173 77 -241 -162 130 95 143
7465A43N9qk49J22j23J50k17J29J49r6k38P0j39J65j33J73J26J59o8q0k90K43
$$ 143 202 194 -55 67 -56 94 -123 6 155 59 -179 -109 -248 -83 -216 -43 83 242 174 94 -196 47
7487D7k2k08J50J87n3lm0l11L42K43l60k2J39q3K8j00j43L87l25N5K59l10J56
$$ 47 25 -183 -33 154 101 98 58 -253 89 332 -28 -50 89 6 34 -66 -209 178 -147 -92 167 -143 13
7510A3rK91l50P6r4K63M4o2m62M74n5j76K06j73J85l01Q2K90l17J58l3k3kJ3K
$$ 13 4 295 -55 21 -73 190 234 172 -290 184 129 -47 159 -14 171 -130 -48 242 -75 83 50 27 25 38 40
7535D0kQ2k97O6J28j93K46j25J72J71m51M02j72Q0j22r8K84nj92J51k9k28J95
$$ 40 38 120 -177 -111 17 -176 70 -55 117 288 -163 239 67 147 25 -73 211 206 14 165 136 -92 103
7558A03k84o4J40p8K21j63L58m93N17r9j64p9L1mL89m66j54L08k35M56j3k13j56
$$ 103 -181 -245 -105 -183 38 -125 233 -260 257 158 -6 -85 -54 -58 331 -135 -289 19 -216 240 227 14 -142
7581a42o8M6J38M4M9K1L8k72j49M42k45K83O1m07J37J59m0o1j89K63k25J76k36
$$ -142 -210 -164 -26 18 67 88 126 -146 -295 147 -98 185 246 -161 -24 135 95 34 -155 108 -117 59 -177
7604a77J24L24m63r4N01m51J42o1R0J52j98K0J25M6P5k39J07n7O0m2N9j78J87
$$ -177 -53 271 -192 -286 215 -236 -94 -155 -65 87 -111 -91 34 80 155 -84 23 -34 26 -16 43 -135 52
7627E2j46K40j99J6p3j67L15j38J89j46L14m23K66j24PJ63k93J64J72k47R8m3
$$ 52 -94 146 -53 -37 -110 -277 38 -100 89 -57 257 -166 100 -24 -17 146 -147 17 189 -58 40 -3
7649cl10L03m53O25l11K13l5ql78L82n1l77J47j1L96k95K15J49k10%J75m25L24
$$ -3 -313 -10 -463 162 -149 64 29 21 -357 25 -26 -403 -256 -267 129 -166 49 198 -12 -12 163 -262 62
7672F2k54J7o8N2M25l65J05n7K4J25l19L78k79LL17l01J8o5KJ95kq4R4Kr9J31
$$ 62 -192 -175 -243 -191 234 -131 -26 -83 -59 66 -253 125 -154 -151 166 -135 -117 -182 -180 15 13 -71 23 25 -74 57
7698E7P5j10P7j25M9J6J63l23K43l1m2o5O7K7k74K93j89J32L8k47R0K89m32L30
$$ 57 132 22 99 -26 23 39 202 -121 122 91 49 -16 51 78 -196 97 -92 40 78 -169 -79 210 -222 108
7722A08k06M17m86J14k7J81l89R4O5J13l16L81j11J40k7l75N04j2Rp1N1J33k02
$$ 108 -98 319 -167 -53 -80 101 -288 -194 -129 -16 -332 49 -62 78 51 -324 180 168 177 106 157 290 88
7745H8l73K56m7L84p4k99J32j10K71l02m4N9k83J60J38N9J73k45K30j03m5N9N
$$ 88 -285 -29 -76 308 234 -65 67 -43 228 -74 -118 -59 -342 -182 -44 15 188 -57 173 70 25 84 89
7768H9j05j34K86j21J54j63J88j25J9l8j84J35J60nN6l63R6N9K31k64J7J21k80
$$ 89 -16 -150 136 15 169 6 194 69 88 50 -134 1 161 156 212 -151 -55 4 235 -29 -12 109 -171
7791a71J21K37j33J03P1J02r2l93J77K3j3r5N2j2k3j12J23Rj47N84n54k2M47m91
$$ -171 -50 187 54 157 228 330 238 -155 22 45 32 -63 -11 -23 -46 -158 -35 -26 -173 411 -143 -165 282 -209
7815b09K53J12k45J52J8j81K55q7j82J70r7j55K68j84L37m45K72o2K22m75J89
$$ -209 44 156 -89 63 81 -100 155 68 -114 56 -41 -196 72 -112 225 -220 52 -10 212 -263 -74
7836g4L34l85j4o5Q8K91r2J6k72K65j26R1j76j76L18k3J00J20m0j3l03Q2o9J52
$$ -74 260 -125 -139 -204 -116 175 83 99 -173 92 -34 57 -119 -295 23 0 100 220 180 167 -136 -54 -123 29
7860B9P9J35l86J60K4l03L32p7j01J2J89J07o36N21Kk71P1L24m93p6K50J33l1
$$ 29 108 243 -143 17 41 -262 70 -7 -108 -96 93 200 -436 85 87 -184 -113 211 -282 -358 -108 25 -6
7883fk3j23O2J54J64j31J71k76L0j19R7J50k04P8K25j79k40J79K9P5m0j31J39
$$ -6 -29 -152 -90 64 228 97 268 -8 22 -97 0 150 -54 24 249 70 -170 9 38 113 73 -58 81
7906H1J28k31O8O6k74J0L08rq5j24l15M40j39%J62j2l5j55J12J13j87J2k03J58
$$ 81 209 -22 46 112 -162 -152 156 147 62 -62 -377 63 -76 -76 86 74 39 -116 -4 109 -78 -66 -269 -111
7930a11K20k46Q7l32N50j11mK39j56k86K78K9j9j54j69L45l60J55J79l48J36M4
$$ -111 109 -137 -50 -382 168 57 53 292 136 -150 128 157 138 -16 -185 160 -200 -45 134 -214 -78 -34
7952c4M7O2j19J12j52J19rj2l18K22K53j73j21M1L3J14j67J52N8k87K13M0r0j08
$$ -34 13 75 -44 68 -84 35 26 14 -304 -82 171 -2 -123 -82 -49 65 -102 50 108 -179 34 74 -16 -124
7976a24K5J44q6k92N11k90J14O7J12r2N4m22M98q7J4p2n8J98k52j21K27kK0J99
$$ -124 -99 45 -41 -333 178 -112 2 69 181 89 143 -279 219 132 146 74 16 214 -38 -159 68 66 86 285
8000B85k62j63L14j08J97j51k79M9Q0J3j62J78j6k00N69q0m79J79kP9j95J47j5
$$ 285 23 -140 174 66 263 112 -167 -118 -38 -25 -187 -9 -25 -225 344 264 -215 -36 -38 41 -154 -7 -22
8023b2J5K15Lj57n2j60J15k20L36j11R9j6j65mJ06j33K44Q2l85J89K95n32J63
$$ -22 -7 208 211 54 2 -158 -43 -263 73 -38 61 45 -120 -124 -18 -151 93 175 -210 -21 274 -258 -95
8046i5J69j66P4J12N4J26j38L9j0K5j65J75k84r7L41m50L7K98k57J32M2R6k73
$$ -95 74 -92 -18 94 148 274 136 175 165 190 25 200 -84 -181 160 -290 -253 45 -212 -80 -38 58 -215
8069b15Q18o09m0q1j65J42KJ83J58r2k17J49j01J89r5j14M31j88k4k67k7K90k72
$$ -215 603 -6 -46 -127 -292 -150 -148 35 193 101 -116 33 -68 121 26 -88 343 155 131 -136 -163 127 -145
8092a45J45j07J95j01l6q0K28M6k28K5j06K25j13K04j83j8L84n11r6J45J05o4
$$ -145 0 -107 88 -13 -49 -129 99 145 -83 -58 -164 61 -52 152 -31 -49 335 -176 -272 -127 -22 -86
8114h6R4q3J74n7m0J82l18N2J66R8pJ53m62j42J96L32m94K4j3J72P3J7K9M6k77
$$ -86 8 -75 99 42 2 184 -134 -82 84 182 175 328 -134 -276 -80 252 -242 -218 -231 -59 14 31 60 106 -171
8139a71M38k42K34l1l84K0P9J68j18p2M7K7o9L92k93J61k10k57J75J98k05K84
$$ -171 267 25 259 228 -156 -136 -57 111 -7 -79 -32 -5 -74 318 25 186 -24 -281 -106 92 -113 171
8161A71J5l5j42o1L5P2j86l2K49k93K85K1j24o3P9O6j93M49j83j92K01j22J1Q
$$ 171 186 151 9 -52 -17 55 -131 -163 86 -207 78 99 -25 -88 -9 57 -136 313 130 -62 139 17 28 36
8185C6J33m1m4O8r3M9
$$ 36 169 128 84 152 59 108
8191A08
$$ Imaginary data points
##PAGE= N=2
##DATA TABLE= (X++(I..I)), XYDATA
0@%%%%%%%qJ6j6J6k4L2l8M6n6P2q8J12j37J61j93K33k80L28l82M46n17N96o84
$$ 0 0 0 0 0 0 0 0 -8 8 -8 8 -16 16 -22 24 -32 40 -48 64 -73 88 -105 128 -152 176 -206 240 -277 319 -365
30c65P83q95J019j156J308j475J656j858K079k320K585k874L193l539L916m328
$$ -365 418 -477 542 -614 694 -781 875 -983 1096 -1224 1361 -1513 1680 -1859 2057 -2271
46b271M780n274N811o403P054p771Q564r445J0431j1539J2792j4224J5880j7823
$$ -2271 2509 -2765 3046 -3357 3697 -4074 4490 -4955 5476 -6063 6729 -7495 8385 -9438
60i438K0138k2944K6439l0933L6950m5469N8554q1428J32765m55313J12191P63697
$$ -9438 10700 -12244 14195 -16738 20212 -25257 33297 -48131 84634 -370679 -258488 505209
72E05209n72700l45967M57652L62437m50391j78766L74083K43348k80776k03313
$$ 505209 -67491 -413458 44194 406631 -43760 -222526 151557 394905 114129 -89184
82h9184P7756J39655p8242j50386k1689J60700K7549j63422p3973J60607L6762
$$ -89184 -11428 128227 49985 -100401 -122090 38610 66159 -97263 -171236 -10629 26133
93B6133j95555o7338K58051J76628j49169j56421J52457J85991j13095j82836
$$ 26133 -169422 -236760 21291 197919 48750 -107671 44786 230777 117682 -65154
103f5154J54758K18958k14897l47616J22964K52649k14361k49356K84159K54619
$$ -65154 89604 308562 93665 -253951 -130987 121662 -92699 -342055 -57896 196723
113A96723k92205j96171L17027J66543k28378p630K49785m0891k10965M5432J02699
$$ 196723 -95482 -291653 25374 191917 -36461 -44091 205694 164803 -46162 -730 101969
124A01969q7020k9051Q3552o2887j05210P8840M2690j41270k9812J45361R698
$$ 101969 14949 -14102 69450 6563 -98647 -19807 22883 -118387 -148199 -2838 6860
135F860j08055O2284J32635o2219j06255R7206J36428m2420q2264L1171J3385
$$ 6860 -101195 -38911 93724 31505 -74750 22456 158884 116464 34200 65371 78756
146G8756j04172o4897P9250M9531j02420o5020Q9961L0688j04889K3208J73484
$$ 78756 -25416 -90313 -11063 38468 -63952 -128972 -39011 -8323 -113212 -90004 83480
157H3480j840j48788O2458J65112r6799j51924J28828J20274j59577r0717J48935
$$ 83480 81640 -67148 -4690 160422 63623 -88301 40527 160801 1224 -89493 59442
168E9442J7003j76268n481J38580l2713j01262N6719O1956n6114m998O6490q285
$$ 59442 76445 -99823 -105304 33276 563 -100699 -43980 17976 -38138 -43136 23354 15069
180A5069j3050P5246J3414q8889O914Q4252n8914j15631O2030R9118j01070j24195
$$ 15069 2019 77265 90679 1790 8704 92956 34042 -81589 -19559 79559 -21511 -145706
192a45706Q3971J09428p7839q2005J12419J09786r9175r9594J14685J13477j08238
$$ -145706 -61735 47693 -30146 -112151 268 110054 10879 -88715 25970 139447 31209
203C1209j06475J09040Q5923j31024q6291J21834N3651j31776m5772J07311K0759
$$ 31209 -75266 33774 119697 -11327 -97618 24216 77867 -53909 -99681 7630 28389
214B8389q3204j359N6777l799j0348K8977J020j27M7864q717p7091K1756Q7478
$$ 28389 -54815 -56174 603 -3196 -13544 15433 16453 16326 64190 55473 -21618 138 87616
227H7616n4738j14287N1353R0346r1799r9034J04545R6960j01825p0855J19003
$$ 87616 32878 -81409 -30056 60290 -31509 -130543 -25998 70962 -30863 -101718 17285
238A7285P4617r8073m7611J05304M5441r9565m3893Q5494K8825q6111l4046O4449
$$ 17285 91902 -6171 -53782 51522 96963 -2602 -46495 38999 67824 -18287 -52333 12116
250A2116J4860o6005j4891N2174M590l9278N270K8776n23M762J9982o142n429
$$ 12116 26976 -39029 -53920 -1746 2844 -36434 -31164 -2388 -2911 1851 21833 15691 10262
263A0262L1413L528m6095K605M8690l1947p4723K7373N6564n4267n6114O7279
$$ 10262 41675 45203 -892 1713 50403 18456 -56267 -28894 27670 -26597 -82711 -15432
275a5432N0677o9317k7380R0871L0722p7034m466Q0688p511p4137J4687O1375
$$ -15432 35245 -34072 -61452 29419 60141 -16893 -21359 59329 51818 -22319 -7632 53743
287E3743k8161o1746K1295M1483l2653l8643K8513K4704l1120j9914L0104K0977
$$ 53743 25582 -36164 -14869 26614 -6039 -44682 -16169 8535 -22585 -42499 -12395 8582
299H582j5632k120K4664P886p922P974O215j1614j272L422k4381k1920J9462J0550
$$ 8582 -7050 -9170 15494 23380 15458 23432 29647 18033 16761 20183 -4198 -26118 -6656 3894
313C894l8492j4061M7914J0239m7490J0582O5665q570n8888K3837O0681l0583
$$ 3894 -34598 -48659 -745 9494 -37996 -27414 38251 29681 -29207 -5370 55311 24728
325B4728n4693L8438M4680n0174m1150M6771K7347n0536k5192L8546J0461l8537
$$ 24728 -29965 8473 53153 2979 -38171 8600 35947 -14589 -39781 -1235 9226 -29311
337b9311o522L3854P446j7858K930K0147Q327p02o15n37J9k97j0484j6229O67
$$ -29311 -35833 -1979 5467 -12391 -9461 10686 19013 18311 17696 17159 17178 16881 6397 -9832 -9165
352i165J2289j2224k4028J0522K8288r277k4758K1941L5710k2869l4071L4086
$$ -9165 3124 -9100 -33128 -22606 5682 -3595 -28353 -6412 29298 6429 -27642 6444
364F444L8517l7276l4663M0815K7362m6941k2745M7919J1954n3717j1785M1647
$$ 6444 44961 7685 -26978 13837 41199 -5742 -28487 19432 31386 -22331 -34116 7531
376G531O52l5358N504K6705p578j4021J5220J6803l339j735J916m678J706O227
$$ 7531 8183 -27175 -21671 5034 -2544 -16565 -1345 15458 12119 10384 12300 7622 9328 15555
390A5555j2346j2861Q109M400j9458o190K2020P830k2250n316K6973J0860k1607
$$ 15555 3209 -9652 -1543 2857 -16601 -22791 -771 7059 -15191 -20507 6466 17326 -4281
403d281o773K5661J0108k7522j2319L0452J1903l4417j2462L2139L009l7680j274
$$ -4281 -11054 14607 24715 -2807 -15126 15326 27229 -7188 -19650 12489 15498 -22182 -23456
416b3456L5241n688l2660J1433K7403j2803j3680K2152J1301j6174r61J2719m971
$$ -23456 11785 6097 -26563 -15130 12273 -530 -14210 7942 19243 3069 2108 14827 9856
429I856p403O572o014j6270P291J0131j6634p589K0229K178k0959P192K7349m175
$$ 9856 2453 9025 3011 -13259 -5968 4163 -12471 -20060 169 2347 -18612 -11420 15929 11754
443A1754k0113Q625J7399q429j1968R124R640j0057j4821J181J2324k410j7660
$$ 11754 -8359 266 17665 9236 -2732 6392 16032 5975 -8846 -7665 4659 2249 -15411
456a5411L45J7973l871k0058Q252K4153o182j6816J5840J8176j4139q287J4246
$$ -15411 -15066 2907 -964 -21022 -12770 11383 5201 -11615 4225 22401 8262 -25 14221
469A4221r12j4271L124L640j3463k760J0239r687j2922J6636J1214j6669L69K4696
$$ 14221 13309 -962 2162 5802 -7661 -10421 -182 -9869 -22791 -6155 5059 -11610 -11241 13455
483A3455l688k1036J3397K1468j3068j2957J4307L669j9245l540J2126l368j0042
$$ 13455 9767 -11269 2128 23596 10528 -2429 11878 15547 -3698 -7238 4888 1520 -8522
496h522J89k00k926J977N3J9R007M926n762M045J2783l418j0189R389O812j4375
$$ -8522 -8333 -8533 -11459 -9482 -9429 -9410 -403 4523 -1239 2806 15589 12171 1982 11371 18183 3808
512C808o170R722o738j6126M763O953q073M4J0691m839o186J3025O400j1133P446
$$ 3808 -2362 7360 622 -15504 -10741 -3788 -11861 -11817 -1126 -5965 -12151 874 7274 -3859 3587
527C587J8809j1538j6813J4159R394j7995m776J6762n794k1001L809J1025j0448
$$ 3587 22396 10858 -5955 8204 17598 -397 -5173 11589 5795 -15206 -11397 -372 -10820
540a0820n559J1657K644o162N438O126j250M913M953n068K8R354n980j5096L094
$$ -10820 -16379 -4722 -2078 -8240 -2802 3324 2074 6987 11940 6872 6900 16254 10274 -4822 -1728
555a728O764j1726o369J1837l24j2240K783P615k244K707R284k188m239P637J198
$$ -1728 5036 -6690 -13059 -1222 -1546 -13786 -11003 -3388 -5632 -2925 6359 4171 -68 7569 8767
570H767q875N925J1340j1225j1793J1118J523j8000j193J4243n214j2952Q455
$$ 8767 -108 5817 17157 5932 -5861 5257 6780 -11220 -12413 1830 -3384 -16336 -7881
583g881R348q101j354J1912Q55k781Q226R92q512J484M942q640m529Q101j872
$$ -7881 1467 -6634 -7988 3924 4779 1998 10224 11216 2704 4188 9130 490 -4039 4062 2190
598B190j1569J926O562p415k529J1285J757p603M501O050n088k88Q311p80m414
$$ 2190 -9379 -7453 -891 -8306 -10835 450 2207 -5396 -895 5155 67 -221 8090 7310 2896
613B896M017l64r585P36P524o922p402O979J658r697J496J0150k472m240Q504
$$ 2896 6913 6549 -3036 -2300 5224 -1698 -9100 -2121 -463 -10160 -8664 1486 -986 -5226 3278
628C278M505o533J104O864n199n458N896L01p645J065K324p152k433Q380L47o639
$$ 3278 7783 1250 2354 9218 4019 -1439 4457 4758 -2887 -1822 502 -6650 -9083 -703 -356 -6995
644f995M780N843n460j692R131N88n344L611K733o439j080M198l104n275L133
$$ -6995 -2215 3628 -1832 -3524 5607 6195 851 4462 7195 756 -324 3874 770 -4505 -1372
659a372J178o495K83M600k440j974P360K058m764K668O670l022l569M561J310
$$ -1372 -194 -6689 -6406 -1806 -4246 -6220 1140 3198 -1566 1102 7772 4750 1181 5742 7052
674G052o104j498K720l755l823K270j253l066M278L149m475o1O543P56k742M658
$$ 7052 948 -550 2170 -1585 -5408 -3138 -4391 -7457 -3179 -30 -4505 -4566 1977 2733 -9 4649
690D649L718n090j908M730j307n331J531N91n626j599K416j609j555K916L14k171
$$ 4649 8367 3277 1369 6099 4792 -539 992 1583 -4043 -5642 -3226 -4835 -6390 -3474 -3160 -5331
706e331M548N223k887j144O490Q14m809Q69L578l449n009M12P7l715j058J258
$$ -5331 -783 4440 1553 409 6899 7713 2904 3773 7351 3902 -1107 -695 -618 -4333 -5391 -4133
722d133j774l54K747L4j50M545K418k469J796M813j253l676K362K160m551l882
$$ -4133 -5907 -6261 -3514 -3480 -3630 915 3333 864 2660 7473 6220 2544 4906 7066 2515 -1367
738a367J571o41l652m95p68j020J698J284j181J463M906P70j973K572M488k052
$$ -1367 204 -437 -4089 -4584 -5352 -6372 -4674 -3390 -4571 -3108 1798 2568 595 3167 7655 5603
754E603k186J977m52l723j195N21k831j963L08q30j089J198J731l08J497L090
$$ 5603 3417 5394 4942 1219 24 545 -2286 -4249 -3941 -4771 -5860 -4662 -2931 -3239 -1742 1348
770A348m10j80L820J910k500k22J807k174k473N06p47l471j405J212k009j213
$$ 1348 938 758 4578 6488 3988 3766 5573 3399 926 1432 685 -2786 -4191 -2979 -4988 -6201
786f201L065J254k073J553L635N58M51J713N23j147L49P14j815j923N98j839k878
$$ -6201 -3136 -1882 -3955 -2402 1233 1791 2242 3955 4478 3331 3680 4394 2579 656 1254 -585 -3463
803c463M12J216j742j306J672N69Q74P93J159R95J065P46p3K43J174j493k320
$$ -3463 -3051 -1835 -3577 -4883 -3211 -2642 -1768 -975 184 1179 2244 2990 2917 3160 4334 2841 521
820E21J283L72l952j384K146o84k593N84K787r90j033K618K298j038P98J121j234
$$ 521 1804 2176 -1776 -3160 -1014 -1698 -4291 -3707 -920 -1910 -2943 -325 1973 935 1733 2854 1620
837A620K41J584j192k600L85R28k565j109K421l71l136O42L151j81j060J081J665
$$ 1620 1861 3445 2253 -347 38 966 -1599 -2708 -287 -658 -3794 -3152 -1 -182 -1242 -161 1504
854A504n84r50J617J564q01j926q68J489L89k523j582K372N0l317Q33L620n91
$$ 1504 920 -30 1587 3151 2350 424 -444 1045 1434 -1089 -2671 -299 -249 -3566 -2733 887 296
871B96k233J576K353p90o46J995m79k177J381N03k651p5J185j133k373K406J388
$$ 296 -1937 -361 1992 1202 556 2551 2072 -105 1276 1779 -872 -947 238 -895 -3268 -862 526
888E26k690OL643N6l629K132L590k002j892J916J488k660j502J051K16j665l0
$$ 526 -2164 -2158 1485 1541 -2088 44 3634 1632 -260 1656 3144 484 -1018 33 249 -1416 -1446
905a446J23m70k60P41K69P83O57q15J754R58q92MJ364m86k459K72J404j950k073
$$ -1446 -1323 -1793 -2053 -1312 -1043 -260 397 -418 1336 2294 1402 1406 2770 2284 -175 97 1501 -449 -2522
924b522K023m07l454J668L663k373j722L696J741k841L51M526r78l963K387K027
$$ -2522 -499 -906 -4360 -2692 971 -1402 -3124 572 2313 -528 -177 4349 3371 -592 1795 3822
940C822l721j076L096j728m605R32L265j660k851K613K011j772R3K919Q29n78
$$ 3822 101 -975 2121 393 -4212 -3280 -15 -1675 -4526 -1913 98 -1674 -1581 1338 2167 1589
956A589N14M68N1m6o83j074j82o29j388j00k45j132q28J609M84o63J593J563j311
$$ 1589 2103 2571 2622 2576 1893 819 637 8 -1380 -1480 -1725 -2857 -3685 -2076 -1592 -2255 -662 901 -410
975d10O67L607q04l062K237L242m269l117M463L77o656p26N814j804n686L011
$$ -410 257 3864 3060 -2 2235 5477 1208 -1909 2554 2931 -3725 -4451 1363 -441 -6127 -3116
991c116L700k874j530M960J423l196J516L176j538j079J806n92k614M0J195j450
$$ -3116 584 -2290 -3820 1140 2563 -633 883 4059 2521 1442 3248 2656 42 82 1277 -173
1007a73k053K58l4j102O54R90K3L39O7N58K341Q80j759N08K692j771k623J862
$$ -173 -2226 -1968 -2002 -3104 -2450 -1460 -1437 -1098 -1031 -473 1868 2748 989 1497 4189 2418 -205 1657
1025A657J480m168k106L700n70m290J384L513l448j866N575J227m341J286N430
$$ 1657 3137 -1031 -3137 563 -7 -4297 -2913 600 -2848 -4714 861 2088 -2253 -967 4463
1040D463j975l481L498J765m344j020L671j391l784J278K056l064j339L014Q92
$$ 4463 2488 -993 2505 4270 -74 -1094 2577 1186 -2598 -1320 736 -2328 -3667 -653 239
1055B39k734M36K712M82q07P51Q62k83n64l0O82o8k160o80J674Q9l324O95K782
$$ 239 -2495 -2059 653 1135 328 1079 1941 1658 1094 1064 1746 1678 -482 -1162 512 601 -2723 -2028 754
1074G54j390k926L619K434l297j110L926k4l070J874K646l566j762L612N32m766
$$ 754 -636 -3562 57 2491 -806 -1916 2010 1986 -1084 790 3436 -130 -1892 1720 2252 -2514
1090b514R09L813k992k751L931J389m039K71M067p55k921K312K163k816j416K775
$$ -2514 -1605 2208 -784 -3535 396 1785 -2254 -1983 2084 1329 -1592 720 2883 67 -1349 1426
1106A426R6k699K53J405l36j126j31J219Qj018K88J391Q92k089j4K320l66k699
$$ 1426 1522 -1177 -924 481 145 -981 -1112 107 115 -903 -615 776 1668 -421 -435 1885 1519 -1180
1124a180J185K379k669k512K835J167l175l31L221q00k632K540K615l527m79M738
$$ -1180 5 2384 -285 -2797 38 1205 -1970 -2301 920 120 -2512 28 2643 -884 -1363 3375
1140C375r49l812J737L233l232k825L188J240m258m55L306r14k689J994J770j651
$$ 3375 2426 -1386 351 3584 352 -2473 715 1955 -2303 -2758 548 -366 -3055 -1061 709 -942
1156i42k3J770P32j036q3J475K08j204k13K80l32j250q73J048m08j727K85K100
$$ -942 -965 805 1537 501 418 1893 2101 897 684 964 632 -618 -1491 -443 -851 -2578 -2293 -193
1174a93o38j652K331K008j946o67L372N73l105L77K931k025k885K155O41l125
$$ -193 -831 -2483 -152 1856 -90 -757 2615 3188 83 460 3391 1366 -1519 636 1277 -1848
1190a848p57K800r15l175K151K971k743o79L443R50k269L51K759m85k025O61J126
$$ -1848 -2605 195 -720 -3895 -1744 1227 -1516 -2195 1248 2198 -71 280 3039 2554 529 1190 2316
1207B316j626j828J050R3j763n76Q81M22n69k10J200Q10j62L5J885j3j143N73
$$ 2316 690 -1138 -88 5 -1758 -2334 -1453 -1031 -1600 -1810 -610 200 38 73 1958 1945 802 1375
1225A375J328j510j595J690Lk859o60K503j223k534J598K338j576j357K730J633
$$ 1375 2703 1193 -402 1288 1291 -1568 -2228 275 -948 -3482 -1884 454 -1122 -2479 251 1884
1241A884k285M8L255n33k547J546J536j992j742J179M2j871m89J792j211j142
$$ 1884 -401 -353 2902 2369 -178 1368 2904 912 -830 349 391 -1480 -1969 -177 -1388 -2530
1257b530J920N39j080L26J525N45p66k34J410L48j310n19J144l81j532l63J289
$$ -2530 -610 -71 -1151 -825 700 1245 479 245 1655 2003 693 174 1318 937 -595 -958 331
1274C31n88j845Q21J457j169q90K075P12j570J95K215Lk027J174J516k062j197
$$ 331 -257 -2102 -1281 176 -993 -1883 192 904 -666 -471 1744 1747 -280 894 2410 348 -849
1291h49J804J7k357K66J529m88j955J551J367j741l53K047K37j387L57J086m03
$$ -849 955 972 -1385 -1119 410 -78 -2033 -482 885 -856 -1209 838 1075 -312 45 1131 728
1308G28q14O39M62j155p58P78N75j359j93J001K81q59k63J097M14q24n8J609q41
$$ 728 -86 553 1015 -140 -898 -120 455 -904 -1097 -96 185 -674 -937 160 574 -250 -308 1301 460
1327D60j134R86P51j398r81J600M80k054L82J567k92j702J369J379j323q07J578
$$ 460 -674 312 1063 -335 -1316 284 764 -1290 -908 659 367 -1335 34 1413 90 -717 861
1344H61K78j366M09P12r79r22J248J94j632K14J026k94r42P01J364q80l32R63
$$ 861 1139 -227 182 894 -85 -1007 241 435 -1197 -983 43 -251 -1193 -492 872 -8 -340 623
1362F23P19r28l09R02q7p67n85L56L83r88p79J123O0j004j80J423O30j292O74
$$ 623 1342 414 105 1007 920 153 -432 -76 307 -681 -1460 -337 -277 -1281 -1461 -38 592 -700 -26
1381b6J093m88n08J337j47j199O04M52r98j285J394P1j813k44J534M6j433J094
$$ -26 1067 579 71 1408 1261 62 666 1118 120 -1165 229 300 -1513 -1757 -223 -177 -1610 -516
1399e16J533j144n03J143P93n44o29J250k57m54k65j94l45r7j84l91j59K47N8
$$ -516 1017 -127 -630 513 1306 762 133 1383 1126 672 407 213 -132 -229 -413 -804 -963 -716 -658
1418f58l1j71K71P42M85m31j5J049K29j092o2R61l08j548N04M44q05r48P76K20
$$ -658 -689 -860 -589 153 638 207 192 1241 1470 378 316 1277 969 -579 -75 369 -436 -1384 -608 -388
1438c88p59j50J468l90p00J148J040j281k0J420l36j005K75Q19j190q21J084j84
$$ -388 -1147 -1297 171 -219 -919 229 1269 -12 -32 1388 1052 47 322 1141 -49 -870 214 30
1456C0q24j58P66k70n83N25N90j98K16o6k98O88N19o79O1J80Q1j94p6K38p53j23
$$ 30 -794 -952 -186 -456 -1039 -514 76 -122 94 28 -270 418 937 258 319 499 580 386 310 548 -205 -328
1478c28P9j52m1L71k21m50M77N49k95n34J118n6o65M97P07n27j098P87O63r98
$$ -328 -249 -401 -442 -71 -292 -742 -265 284 -11 -545 573 517 -148 349 1056 529 -569 218 881 -117
1498a17n29P52K36q84L35M70j077J39R21l38m13J74O61m62k25Q79j00o36N49L45
$$ -117 -646 106 342 -542 -207 263 -814 -675 246 -92 -505 -331 330 -132 -357 522 422 -214 335 680
1518F80m90j32L05j96n20L68J02l05l02K98l8k24N85n51m65J029L06o92N25L66
$$ 680 190 58 363 167 -353 15 117 -188 -490 -192 -230 -454 131 -420 -885 144 450 -242 283 649
1538F49l10n92R47Q4j015K97J59l95k72L94O8q53O6Q09k42m03M84M48o27jJ191
$$ 649 339 -253 694 778 -237 60 219 -176 -448 -54 14 -839 -773 36 -206 -609 -125 323 -304 -305 886
1559H86n36j42L43K43n83j35M49o24n0j22J98n09L10L12m56k95R68l1o41M45N85
$$ 886 350 208 551 794 211 76 525 -99 -149 -271 -73 -582 -272 40 -416 -711 257 226 -415 30 615
1580F15l59j07M55m35o5J79O2p31L31J49o30n51R27j55m64L37P60o60J77L88J6
$$ 615 256 149 604 169 104 283 345 -386 -55 94 -536 -1087 -160 -315 -779 -442 318 -342 -165 223 239
1601B39j12J8J54j0P3n3j43k10K88K65n96m41N92j97l44J16O31o68r2N25Nj59
$$ 239 127 145 299 289 362 309 166 -44 244 509 -87 -528 64 -133 -477 -361 270 -398 -490 35 40 -119
1623a19L92J51n87Q1Q96o67l39L11M0k32j54K24n1k83L13K63o29K32J71j44J66
$$ -119 273 424 -163 -82 814 147 -192 119 159 -73 -227 -3 -54 -337 -24 239 -390 -158 13 -131 35
1644C5L00k55j70J12K40j92q9J89j54n7M6K10J35l81k1j56p5L50%k67J52K37k11
$$ 35 335 80 -90 22 262 70 -19 170 16 -41 5 215 350 -31 -52 -208 -283 67 67 -200 -48 189 -22
1667b2l90K01N26q20L78O49l92m5J72L02m50j58L75l43q2J84j2p86L16N60m76
$$ -22 -412 -211 315 -505 -127 522 130 85 257 559 109 -49 326 -17 -99 85 73 -713 -397 163 -313
1688c13l71M88K51m50J66L06O5k51J1J04M78j59J86m49pK67k41n45L61r4m6k43
$$ -313 -684 -196 55 -395 -229 77 142 -109 -98 6 484 325 511 62 55 322 81 -464 -103 -197 -243 -486
1710d86J6Q9l3L48L39l47J63L93r6k53M45l6n54J91N4l49k68K74k79o81L75L16
$$ -486 -470 -381 -414 -66 273 -74 89 482 386 133 578 542 -12 179 233 -116 -384 -110 -389 -1070 -695 -379
1732c79j25K05j6J18k3L24L13p4k46N03j99p7J0j23k16k06j00r9n1l4r1k85L56
$$ -379 -504 -299 -315 -197 -220 104 417 343 97 600 401 324 334 211 -5 -211 -311 -410 -461 -495 -586 -871 -515
1755e15L36M6J1L76j0J94R3L1j72l5L57m84n82O47j95o97o9O06j16o37L34L93
$$ -515 -179 -133 -122 254 244 438 531 562 390 355 712 228 -354 293 98 -599 -668 -62 -178 -815 -481 -88
1777h8l83J48P50l76j28K91L05l0j73L96n26l45J26L9k74k40K26Rj85j66K98K98
$$ -88 -471 -323 427 51 -77 214 519 489 316 712 186 -159 -33 6 -268 -508 -282 -273 -458 -624 -326 -28
1799b8j49J35J37J61n0k72L86j5N46r35L72p8k51k99L66l23j62J41O1p5n0L51
$$ -28 -177 -42 95 256 206 -66 320 305 851 -84 288 210 -41 -340 26 -297 -459 -318 -257 -332 -382 -31
1821c1J26l14J73M51k47l22K73M62q56J80M47k36j91K21l35P6O2m3j56j26K48
$$ -31 95 -219 -46 405 158 -164 109 571 -285 -105 342 106 -85 136 -199 -123 -61 -104 -260 -386 -138
1842a38L75p92N03J95j83J90R0mq4j91M60l7m1M8m59O1L8J09l22J24L7k21l42
$$ -138 237 -555 -52 143 -40 150 240 236 152 -39 421 384 343 391 -68 -7 31 140 -182 -58 -21 -242 -584
1865e84P11j99n0O3J34k23L25J26m19K08%J52j83m26M95Q7k08n7L33k80l09K85
$$ -584 127 -72 -122 -59 75 -148 177 303 -116 92 92 244 61 -365 130 217 9 -48 285 5 -304 -19
1887a9O3l48K8K09j21Q1J59o9k4J91j07p9K21J86m25J05K45k80Q1J00m81M04l13
$$ -19 44 -304 -276 -67 -188 -107 52 -17 -41 150 43 -36 185 371 -54 51 296 16 97 197 -284 120 -193
1910a93J33k35l2L47o3j89J64J12K00k05J21L80l98k57M90j19l83K30j45k16j50
$$ -193 -60 -295 -327 20 -43 -232 -68 44 244 39 160 540 142 -115 375 256 -127 103 -42 -258 -408
1931d08J40KQ1J39N2r1M9j88N97l21P9M22n32K22R7n7l17PK6l28J28J44l79J89
$$ -408 -268 -266 -185 -46 6 -85 -36 -224 373 52 131 553 21 243 340 283 -34 -27 -1 -329 -201 -57 -436 -247
1955b47P6j52J43j95N03m66K23J72L27l87L28J26Ql73J09P9l16R6l06K48m75L44
$$ -247 -171 -323 -180 -375 128 -338 -115 57 384 -3 325 451 459 86 195 274 -42 54 -252 -4 -479 -135
1977a35l15K6K06Q7J43n9N7L62l05K31M46p14J21k9j80K4L74k31k83N4j72M6j85
$$ -135 -450 -424 -218 -131 12 -47 10 372 67 298 744 30 151 122 -58 -34 340 109 -174 -120 -292 -246 -431
2000d31J94J69n4K26Jr7J50J71J14j27j86J44J67N7k60k71k41J57j14j74k65M83
$$ -431 -237 -68 -122 104 105 8 158 329 443 316 130 274 441 498 238 -33 -274 -117 -231 -405 -670 -187
2022a87j2q9J01J26J63J04K26j4j91Q3J77l28o6L0j10J17P3l99l53K45J02j7k10
$$ -187 -199 -288 -187 -61 102 206 432 418 227 310 487 159 93 123 13 130 203 -196 -549 -304 -202 -219 -429
2045d29L80J3l1RJ27j6K39L82n44r8R7J92l96j38J30j3j62j49L64m32j79M92L29
$$ -429 -49 -36 -67 -58 69 53 292 674 130 32 129 321 -75 -213 -83 -96 -258 -407 -43 -475 -654 -162 167
2068A67k49J51J96k14J91N8n2j76K95j39j67l9K93j19l55j24p2J39K09l44M67
$$ 167 -82 69 265 51 242 300 248 72 367 228 61 22 315 196 -159 -283 -355 -216 -7 -351 116
2089A16l03K56o7j70K88L98n16J31J04l5m5l1q2J93j77l26K64m6m70L02J5J26
$$ 116 -187 69 2 -168 120 518 2 133 237 202 157 126 44 237 60 -266 -2 -48 -518 -216 -201 -75
2111g5J35J1P0K16j76l31M01K2l74j44J14M04m46P6J35j93o6L54j05k29K49J56
$$ -75 60 71 141 357 181 -150 251 273 -101 -245 -131 273 -173 -97 38 -155 -221 133 28 -201 48 204
2133B04l20J24J44j73P8R5N1l51O3j19N39m86J63K66m31J95r1l3l8M30n6j13l00
$$ 204 -116 8 152 -21 57 152 203 -148 -85 -204 335 -151 12 278 -153 42 -49 -82 -120 310 254 141 -159
2156a59N29l85o1K71j3j69j14L29k69p6N0L56m06K48J1l14q7P22Jn02N1k5J69
$$ -159 370 -15 -76 195 182 13 -101 228 -41 -117 -67 289 -117 131 142 -172 -259 463 464 -38 13 -12 157
2179A57n87L33k0j9j01O8J63K52l50J66J22n9M2p5K06J83m49J05M1k5l31J26k
$$ 157 -430 -97 -117 -136 -237 -169 -6 246 -104 62 184 125 167 92 298 481 32 137 178 153 -178 -52 -54
2202e4k84k01M10M1j18L08K2k07O2J48J32j01m1K12k46j54J24j0j66j67M73n73
$$ -54 -338 -539 -129 -88 -206 102 124 -83 -21 127 259 158 117 329 83 -71 53 43 -123 -290 183 -390
2224c90K20j69L50m17L74P2K66L7l49K32k18L41J56m90R6J63j23k45n3J47m16
$$ -390 -170 -339 11 -406 -32 40 306 343 -6 226 8 349 505 15 111 274 151 -94 -147 0 -416
2245d16j9J23Q3K13m7O3m01J33N08K8k57M17J57n24J91P0j43m64N08j52n02o1
$$ -416 -435 -312 -229 -16 -63 0 -401 -268 240 268 11 428 585 61 252 322 179 -285 223 71 -431 -492
2267d92M45l18K5Q8J0k07L17N07l35m6QK15K3M6k10k6k3o3k39k09L80j80j08O0
$$ -492 -47 -365 -340 -252 -242 -449 -132 375 40 -6 2 217 240 286 76 50 27 -36 -275 -484 -104 -284 -392 -332
2291c32L54k97J32O1L08m12K78M1J80l17K97k33J37l4J19P4l46K39k29n98M49
$$ -332 22 -275 -143 -82 226 -186 92 133 313 -4 293 60 197 163 282 356 10 249 20 -578 -129
2312a29J7q1m60M41j5p0M01Q2O1j64LM1k3j94M11l34J86k45Q1k58j1r5K06q8k4
$$ -129 -112 -193 -653 -212 -227 -297 104 186 247 83 86 127 104 -90 321 -13 173 -72 9 -249 -260 -355 -149 -237 -261
2337b61K98l8q2J29J65J86k31k14K86J44l23P4p6K7j15j56R2L9j67J17k77K07
$$ -261 37 -1 -83 46 211 397 166 -48 238 382 59 133 57 84 -31 -187 -95 -56 -223 -106 -383 -176
2359a76L00l03L04l45K50K02l15K61L3j31o9%L0j48QP4j0K37k98p6j31L77j78
$$ -176 124 -179 125 -220 30 232 -83 178 211 80 11 11 41 -107 -99 -25 -35 202 -96 -172 -303 74 -104
2382a04n7J92K5k6L9J4k5J38j38j06J90j7j8k17m6J31Qp9k32K73J1l33K55J20
$$ -104 -161 31 56 30 69 83 58 196 58 -48 142 125 107 -110 -156 -25 -17 -96 -328 -55 -44 -377 -122 -2
2406bj21K59J18k20k47kM67k62k3M03k29l42L17q2j94J40o8J3M0o7j15k12L03
$$ -2 -123 136 254 34 -213 -215 252 -10 -33 370 141 -201 116 34 -160 -20 -88 -75 -35 -102 -217 -429 -126
2429a26kL46k63k3L8L6l3L93k65j65K63J32k28j29P0j37j13j12K54J0p0J99k58
$$ -126 -128 218 -45 -68 -30 6 -27 366 101 -64 199 331 103 -26 44 -93 -206 -318 -64 -54 -124 75 -183
2452a83J60J50j6j55j35M23m5l42M16P4l13M4k71n9L87k97P7j67K58P8k44J65
$$ -183 -23 127 111 -44 -179 244 199 -143 273 347 34 78 -193 -252 135 -162 -85 -252 6 84 -160 5
2474EM6k9oj06J95N2K96j43j04j17M6j05l59M06j38O6k59p5K0K26j05K15j24j07
$$ 5 51 22 16 -90 105 157 453 310 206 89 135 30 -329 77 -61 5 -254 -329 -309 -83 -188 27 -97 -204
2498b04M56J30j86qj2K16k29L26l53k26K74Lk66m06L14R9j85JP8j44L52j57Q0
$$ -204 252 382 196 188 176 392 163 489 136 -90 184 187 -79 -485 -171 -72 -257 -256 -178 -322 30 -127 -47
2521d7J9n0L88m02M4N42k42m32J65J38k32j69L21k51j6J81j25L9J08l6Q6n8L04
$$ -47 -28 -78 310 -92 -48 494 252 -180 -15 123 -109 -278 43 -208 -224 -43 -168 -129 -21 -57 29 -29 275
2544B75r5k0qKK52k62o2J55k06k83M00r3j5n4k15L49m2j64j54j45L51L14n8m9
$$ 275 180 160 152 154 406 144 82 237 31 -252 148 55 40 -14 -229 120 78 -86 -240 -385 -34 280 222 173
2568A73L2k21J42J15k04O8j20M3k98K56M4j39k06J04J79O6j06K16m8j23K03J02
$$ 173 205 -16 126 241 37 105 -15 28 -270 -14 30 -109 -315 -211 -32 34 -72 144 96 -27 176 278
2590B78j78Mn6l01M49k62k6j48J25K57j57k47L81Mj33K26l90K08l17M44nl02J41
$$ 278 100 104 48 -253 196 -66 -92 -240 -115 142 -15 -262 119 123 -10 216 -174 34 -283 161 156 -146 -5
2613eK3l0n0O45o25m5r0K73j53j09K43j52J8j62Lj0L53j11j22k1L56j35j33K07
$$ -5 18 -12 -62 583 -42 -87 -177 96 -57 -166 77 -75 -57 -219 -216 -226 127 16 -106 -127 229 94 -39 168
2637A68k69k9K57K47l47N6k07L51qk93P0Ok37J93m31N22L2m3K7l53jJ77J71O8
$$ 168 -101 -130 127 374 27 83 -124 227 219 -74 -4 2 -235 -42 -473 49 81 38 65 -288 -289 -112 59 127
2661A27j8k03K30L5Q4m03L00p2k1m32K67K46k24j06O4Q8j89J70N3J44j4o3j28
$$ 127 109 -94 136 171 255 -148 152 80 59 -373 -106 140 -84 -190 -126 -38 -227 -57 -4 140 126 63 -65
2684f5j08O35k64l73M35k80L0J38k71k01J11Q5J8j19K5L82l70L99L0k16J27r7
$$ -65 -173 462 198 -175 260 -20 10 148 -123 -324 -213 -128 -110 -229 -204 178 -192 207 237 21 148 51
2706E1K13J55l93j55J85l2l03L03J3j50j73J61Q7k39L52j57M0J02q3J36O9J77
$$ 51 264 419 26 -129 56 24 -279 24 37 -113 -286 -125 -38 -277 75 -82 -42 60 -23 113 182 359
2728C59k09P2M8j12p1k24L7K84l07Mj49n2J21P2q9n5L04n9l4K90R7j04l5l02K64
$$ 359 150 222 270 158 87 -137 -100 184 -123 -119 -268 -320 -199 -127 -216 -271 33 -26 -60 230 327 223 188 -114 150
2753A50o4p6L2k38L51j34k02J00k25K60r2r0K43N6k63M08l34M03r7O2j44j24J99
$$ 150 86 10 42 -196 155 21 -181 -81 -306 -46 -138 -228 15 71 -192 216 -118 285 188 250 106 -18 181
2776A81p4q0j81J38q8M8j93O5J14m0Q6l7J88j08J34j52J89p6j42J4J4L3M1J99
$$ 181 107 27 -154 -16 -104 -56 -249 -184 -70 -110 -24 -61 127 19 153 1 190 114 -28 -14 0 33 74 273
2800B73l08q6Q7J08r2m1M9J00j28j60K31O2q5J99r9M8j06k23N15l24k41O60l38
$$ 273 -35 -121 -34 74 -18 -59 -10 90 -38 -198 33 95 10 209 110 158 52 -171 344 20 -221 439 101
2823A01J20l27l8j44l8N10n76M17O3l22J36J74P2r5K89l97p4J08J4K4k57J67K07
$$ 101 221 -106 -144 -288 -326 184 -392 25 88 -234 -98 76 148 53 342 -55 -129 -21 -7 17 -240 -73 134
2846A34k88j2O2m2J45O0j8L4K1r5K5O6o9k06M20l20J19j27J58J30j28J28m4R3
$$ 134 -154 -166 -104 -146 -1 59 41 75 96 1 26 92 23 -183 237 -83 36 -91 67 197 69 197 153 246
2870B46l77q4J88j30j03l1O1L29p5k29J35J57O8j68pJ62j4j63K80m05R5R8k26
$$ 246 -131 -215 -27 -157 -260 -291 -230 99 24 -205 -70 87 155 -13 -20 142 128 -35 245 -160 -65 33 -193
2893a93L23k72j24L27k09J98k8o8p5m4J70K14k55J67n1k53J75J27k60K18k26J56
$$ -193 130 -142 -266 61 -148 50 22 -46 -121 -165 5 219 -36 131 80 -173 2 129 -131 87 -139 17
2915A7j04Q4r3j55J87k4L97k31o4j45R5K5M17l76P1k76K98j62q1j05J52J11k53
$$ 17 -87 -3 -96 -251 -64 -88 309 78 14 -131 -36 -11 406 30 101 -175 123 -39 -120 -225 -73 38 -215
2938b15k33K67M0MJ79R2j66j8K07k73L31j96j9n7L8L50k26l47m4L17o3J36l14
$$ -215 -448 -181 -141 -137 42 134 -32 -50 157 -116 215 19 0 -57 -19 331 105 -242 -286 31 -32 104 -210
2961b10J58J66k56K4Q2j31K40j28n4K87j93J15JK5k95J53KJ10p1p7Q4k01J45%
$$ -210 -52 114 -142 -118 -36 -167 73 -55 -109 178 -15 100 101 126 -169 -16 -14 96 25 -52 32 -169 -24 -24
2985b4K3j23Q1j47l7L29r9j57J08L89k13n0M2k97K51p4j02j30O5K16j09m0J92
$$ -24 -1 -124 -43 -190 -227 102 3 -154 -46 343 130 80 122 -175 76 2 -100 -230 -165 51 -58 -98 94
3008I4j61j24L48l17L32k6k61J35q6Q4K46j92J03Or2j3j69R5p9o2n3ML00j24j
$$ 94 -67 -191 157 -160 172 146 -115 20 -66 18 264 72 175 181 89 76 -93 2 -77 -139 -192 -188 112 -12 -13
3033a3j75K09p2l2Q0n7L14j20o5o8J34j44J5J79m13L39j68J87j86q5j59L11k2
$$ -13 -188 21 -51 -83 -3 -60 254 134 69 1 135 -9 6 185 -228 111 -57 130 -56 -141 -300 11 -11
3056a1N7R4m56M56k31J42K53K06p51L93r7J53N2m58K66m0P2L2k39L09j31k14M0
$$ -11 46 140 -316 140 -91 51 304 510 -241 152 55 208 260 -198 68 28 100 132 -107 202 71 -143 -103
3079a03j64N54j00k2j19r1n3O4K7m7K47o3PMQ9k36j73p4n4K90m2J40M4k04m1J83
$$ -103 -267 287 187 165 46 -45 -98 -34 -7 -54 193 130 137 141 230 -6 -179 -253 -307 -17 -59 81 125 -79 -120 63
3105F3Q6J08k10j15J09N1k50M22l2m7j73n9K53m9r7j12N5l19m2L09j26J01M0j02
$$ 63 149 257 47 -68 41 92 -158 264 232 185 12 -47 206 157 60 -52 3 -316 -358 -49 -175 -74 -34 -136
3129a36M60j24j79l6r0L56k0k17j17J46j53l16M47l68K65J63l2P3k58j19L21J4
$$ -136 324 200 21 -15 -105 251 231 14 -103 43 -110 -426 21 -347 -82 81 49 122 -136 -255 66 80
3151H0j42O0L57j09n51K03O6j46P2o9P0k70N40j16o4N4l30M16L2j45K64n15L44
$$ 80 -62 -2 355 246 -305 -102 -36 -182 -110 -179 -109 -379 161 45 -19 35 -295 121 153 8 272 -243 101
3174A01J3L8k52J81J07k52j1K36k19j77j35M62k34r8L17k29J94j6J02J48J26m03
$$ 101 114 152 -100 81 188 -64 -75 161 -58 -235 -370 92 -142 -240 77 -152 42 26 128 276 402 -1
3196al45N51j90j7K68l41pJ97k68k15N39q9J84l58J06j45L15p4j19P6k6Q3J74
$$ -1 -346 205 15 -2 266 -75 -82 115 -153 -368 171 82 266 -92 14 -131 184 110 -9 67 41 124 298
3219B98j04j80J40j05K6K7K77l95L0j9J65j81l3m9J26k10K49j7L3J52l22N6L27
$$ 298 194 14 154 49 75 102 379 -16 14 -5 160 -21 -54 -103 23 -187 62 45 78 230 -92 -36 291
3242B91j70o0k36J24J41K36m34J49j13K45j53j02j47J74K4k27K29l5l9K22J61
$$ 291 121 61 -175 -51 90 326 -108 41 -72 173 20 -82 -229 -55 -31 -258 -29 -64 -103 119 280
3263B80j07j45j01j6j4K4J56Q8m1k21K16j50Q2L04l88Jj34o2J91l01L66K31l88
$$ 280 173 28 -73 -89 -103 -79 77 165 124 -97 119 -31 51 355 -33 -32 -166 -228 -37 -338 28 259 -129
3286a29J00K97n9k34Q7P7j28l7q6J57K62k68%k8l7K2J00L9j0J84l79J75l05K72
$$ -129 -29 268 209 -25 62 139 11 -26 -112 45 307 39 39 11 -26 -4 96 135 125 309 -70 105 -200 72
3310G2k14L09j58O4l37L78k27K03rJ75k64J14k27J94o3K11k30Q8r7j28J50r1J2
$$ 72 -142 167 9 73 -264 114 -113 90 81 256 -8 106 -121 73 10 221 -9 79 -18 -146 4 -87 -75
3333g5Q7L5k73M29j97M1k54J44L73k03j24j24L8O1J05o6q8J90j90J12J1K38K17
$$ -75 12 47 -226 203 6 47 -207 -63 310 107 -17 -141 -103 -42 63 -3 -91 99 -91 21 32 270 487
3356D87j57j27k62nL10j07j35J58j06l1j30J44k20J27j60Q3K6R3j49L92j49p3
$$ 487 330 203 -59 -64 246 139 4 162 56 25 -105 39 -181 -54 -214 -131 -105 -12 -161 231 82 9
3378Il6j29L33j27k42J78L11n35K47j14q6M1j1J19R1q8M1J49k09o4J47j7k48L09
$$ 9 -27 -156 177 50 -192 -14 297 -238 9 -105 -191 -150 -161 -42 49 -39 2 151 -58 -122 25 8 -240 69
3402F9N5k57L10j19j59j75N08o27K61M30j75j18p7m7M01j49r2O5k39K56O8K1j18
$$ 69 124 -133 177 58 -101 -276 232 -395 -134 296 121 3 -74 -121 280 131 39 104 -135 121 189 210 92
3425I2j06J62M6k30P7j01L45l24k74P7L27k3n2qj59K17L2j42J86%j18J01j62K77
$$ 92 -14 148 194 -36 41 -60 285 -39 -313 -236 91 68 16 8 -151 66 98 -44 142 142 24 125 -37 240
3449B40lj39k22N1J60P2k84K73l74o8K50J89k54m1J70K03j5l80L10j6L7M1k04
$$ 240 237 98 -124 -73 87 159 -125 148 -226 -294 -44 145 -109 -150 20 223 208 -172 138 122 159 200 -4
3472dJ31k31J32j39j7O9r4J32P6j70J28N5k86L5L41O7K06l29R0j6j8m4m1r6k59
$$ -4 127 -104 28 -111 -128 -59 -153 -21 55 -115 13 68 -218 -183 158 225 431 102 192 176 158 114 73 -23 -282
3497b82J32K79j47K7J19q4j05J50l27J65L2K25R5j5k13J34m42K62J22m3j5j10
$$ -282 -150 129 -18 9 128 44 -61 89 -238 -73 -41 184 279 264 51 185 -257 5 127 84 69 -41
3519d1K91l16j66K54L6k07K47l26q1L99k56K38j33j95N10k30j65L4p5J98n4j77
$$ -41 250 -66 -232 22 58 -149 98 -228 -309 90 -166 72 -61 -256 254 24 -141 -107 -182 16 -38 -215
3541b15K59j23M22n12K1j13J64M1j02L71j53j94L06k28J80r8L2%J48k95K94j93
$$ -215 44 -79 343 -169 -148 -261 -97 -56 -158 213 60 -134 172 -56 124 26 58 58 206 -89 205 12
3563A2k05L64j06j87kl0R1K5j75m4J34J12R5q5J38K83l52k16K90m64M4K89O7j76
$$ 12 -193 171 65 -122 -124 -154 -63 -38 -213 -257 -123 -11 84 -1 137 420 68 -148 142 -322 -278 11 78 -98
3587i8J87j29j49K07k49K19N6L5j13N6M9L00l52j20M68r0k95J89p3j50p7J52j61
$$ -98 89 -40 -189 18 -231 -12 44 79 -34 22 71 371 19 -101 367 277 -18 171 98 -52 -129 23 -138
3610a38J81J90Q9k44l23L56p2n6N2L1j23O3K3k8L04k57J34l68L48r2k66L44j38
$$ -138 43 233 322 78 -245 111 39 -17 35 66 -57 6 29 1 305 48 182 -186 162 70 -196 148 10
3633A0k17J66r0M9M12m89n8J64M11m35L03p5j44j0L52n19M33k24J58j78L6K8k1
$$ 10 -207 -41 -131 -82 330 -159 -217 -53 358 -77 226 151 7 -3 349 -170 263 39 197 19 55 83 62
3656F2l61J26J28R1q6m7J59l05n9M17q2J66J19ql91K60j39O8n15K79J07J04J6
$$ 62 -299 -173 -45 46 -40 -87 72 -233 -292 125 43 209 328 320 -71 189 50 118 -397 -118 -11 93 109
3679A09k76J57jm9Q0M3k07J05j9M22j34k93J2J72j5q2r9q8L81k74n0J33o4L60
$$ 109 -167 -10 -11 -60 20 63 -144 -39 -58 364 230 -63 -51 121 106 24 -75 -163 218 -56 -106 27 -37 323
3703C23m90K07P6j29K56k24J20q5J9k76M07j79K11k87M2n7J94J12k27J62j65j25
$$ 323 -167 40 116 -13 243 19 139 54 73 -203 204 25 236 -51 -9 -66 128 240 13 175 10 -115
3725a15J26j1J86l4l48L78j76J02j05qOm8J16k09J40j36j34L3K95J37k84K94j32
$$ -115 11 0 186 152 -196 182 6 108 3 -5 1 -47 69 -140 0 -136 -270 -237 58 195 -89 205 73
3748G3k9k07L17k22j31L35j19O4j31p4j3J22M9J47j44j91J82j4n7jR2k48l1K85
$$ 73 44 -163 154 -68 -199 136 17 81 -50 -124 -137 -15 34 181 37 -154 28 14 -43 -44 48 -200 -231 54
3772E4j40j28L36J0j25J12J68k83K98k35j24k37J19K15r4p0K94k16m4m4r5J47
$$ 54 -86 -214 122 132 7 119 287 4 302 67 -57 -294 -175 40 -54 -124 170 -46 -90 -134 -229 -82
3794h2J34q0j23J50J40l0M0k4J50l14N01m81j3m8k6J8J91k5k06M8J94k3j25O8
$$ -82 52 -28 -151 -1 139 109 149 125 275 -39 462 -19 -32 -80 -106 -88 103 78 -128 -80 114 91 -34 34
3818C4j60K03J13k79m7K62m19J92J85L1j31L7N72o95J21J30j26l8rk78j1J95J31
$$ 34 -126 77 190 -89 -136 126 -293 -101 84 115 -16 21 593 -102 19 149 23 -15 -24 -302 -313 -118 13
3841A3j48Q9J16l8P1L6j09q3J01j77J11N1K1k18R0J40j5j12P4k11j20M36k62L03
$$ 13 -135 -46 70 32 103 139 30 -53 48 -129 -18 33 54 -164 -74 66 51 -61 13 -198 -318 118 -144 159
3865A59j58Q3O4Qj81J73j39k6lJ44L0q8k6j66Q4L3J08j34K11j51k7K68k15J07
$$ 159 1 84 148 156 -25 148 9 -17 -20 124 154 66 40 -126 -42 -9 99 -35 176 25 -2 266 51 158
3889A58o6k8j0n2j41J20K9J87m0l6J24k50J4q1J65j10k85M77k89r0R0j01K30K16
$$ 158 92 64 54 2 -139 -19 10 197 157 121 245 -5 9 -72 93 -17 -302 175 -114 -204 -114 -215 15 231
3913B31l23K4K73q7J08j93L32l65K05k92m6N0J01j10J28j70j8K48J58j68k4k5
$$ 231 -92 -68 205 118 226 33 365 0 205 -87 -133 -83 18 -92 36 -134 -152 96 254 86 62 37
3935C7R7q1JN9j85l0j03J87k55L70j31j48J90K15j84q3J61j39j99L71k22J94N6
$$ 37 134 53 54 113 -72 -102 -205 -18 -273 97 -34 -182 8 223 39 -44 117 -22 -221 150 -72 122 178
3958A78l75o9L51J12m3j99J8j30K17j19j46K50R7l27M0r6K88N3p3k4O6R1k14P
$$ 178 -197 -266 85 197 154 -45 -27 -157 60 -59 -205 45 142 -185 -145 -241 47 100 27 3 69 160 -54 -47
3982d7J24k0n8q4K25j54Q7r0k35J85J31P5j39m2J61l19N0M7L42m94K36L1O6R3
$$ -47 77 57 -1 -85 140 -14 73 -17 -252 -67 64 139 0 -42 119 -200 -150 -103 239 -255 -19 12 78 171
4006A71k45J77J85l28RQ3r0J17k07k0L46l3j82L0l03K07j2K9m1K16J33k92J39
$$ 171 -74 103 288 -40 -31 52 -38 79 -128 -148 198 165 -17 13 -290 -83 -95 -66 -107 109 242 -50 89
4029H9R4l16L67k40N5k27Q3O0J08l40J51mK7K99j76j32J71k3J38L9k88N5m4j6
$$ 89 183 -133 234 -6 49 -178 -95 -35 73 -267 -116 -120 -93 206 30 -102 69 46 184 223 -65 -10 -54 -70
4053g0J09k27k8J36m7N05m20J57l9m0k80K67j05J47j37J14J92k81j33N4L51m90
$$ -70 39 -188 -216 -80 -127 378 -42 115 76 36 -244 23 -82 65 -72 42 234 -47 -180 -126 225 -265
4075b65N84l51P8J02q3L3l06K01Q3J46k91l05L68O5j29O9j68K00K2l0L7j62Jm7
$$ -265 319 -32 46 148 65 98 -208 -7 76 222 -69 -374 -6 59 -70 -1 -169 31 53 23 60 -102 -101 -148
4099a48J15N7P9k70J8P5J47l86M14k58O5K03l47L41j81J05Mj05L07k55R7j68N7
$$ -148 -33 24 103 -167 -149 -74 73 -313 101 -157 -92 111 -236 105 -76 29 33 -72 235 -20 77 -91 -34
4122c4K44j10q1p5J42k0l05K32Kr3K41j93j61J37j00L71k13L3l6p5K22l41N60
$$ -34 210 100 19 -56 86 66 -239 -7 -5 -98 143 -50 -211 -74 -174 197 -16 17 -19 -94 128 -213 347
4145C47l57o6K20n3n7k38Q9J04k12K73J28o6p5k88K61j20K46q5K9J7l71L40J21
$$ 347 -10 -76 144 91 34 -204 -115 -11 -223 50 178 112 37 -251 10 -110 136 51 80 97 -274 66 187
4168A87n5K40n16M1J34j39KL01q4m09J21K47N0lJ80m12J18N5K54l72K4J10j45
$$ 187 132 372 -144 -103 31 -108 -106 195 111 -298 -177 70 120 117 297 -115 3 58 312 -60 -36 74 -71
4191g1J41J26k52L02j50K6o4j45K31q0j33%j5K46m29j5L98J69l12J25k2j39Q3
$$ -71 70 196 -56 246 96 122 58 -87 144 64 -69 -69 -84 162 -267 -282 116 285 -27 98 76 -63 20
4214B0K12m65M37k25r5K03j72J33LJ67j11q6L1o6l8J38k19J23p6L26j78J29k56
$$ 20 232 -233 204 -21 -116 87 -85 48 51 218 107 21 52 -14 -52 86 -133 -10 -86 240 62 191 -65
4237f5n7J96k13m0J39l34J69L09Q7j64R4L2k15J88j61Q9n2j70K24j7N1k60q4L09
$$ -65 -122 74 -139 -179 -40 -374 -205 104 191 27 121 153 -62 126 -35 54 2 -168 56 39 90 -170 -254 55
4261E5J26k23J05l10K43j6j07J57r%K4J24p6Rk17K03M8l47N1J83j21j83J19RJ72
$$ 55 181 -42 63 -247 -4 -20 -127 30 21 21 45 169 93 102 -115 88 136 -211 -160 23 -98 -281 -162 -153 19
4286A9j25K31L6j72n3j47J87K71m07Q3J10J8k12J41j17L12r9P0r7K0j29l7L56
$$ 19 -106 125 161 -11 -64 -211 -24 247 -160 -77 33 51 -161 -20 -137 175 76 146 49 69 -60 -97 259
4309B59k09l4L7k32J52j13K27Q2j14r8j4p5J36Q3k8p5k58P3J54P2L1j67k10L76
$$ 259 50 16 53 -179 -27 -140 87 169 55 -43 -57 -132 4 87 59 -16 -274 -201 -47 25 56 -111 -321 55
4333E5J0pj63jK69q9Q2O7j47K72n03J04O9J31r1K38k69r6n1mp4J5J16J0K15j59
$$ 55 65 58 -105 -106 163 74 156 223 76 348 -155 -51 18 149 58 296 27 -69 -120 -124 -198 -183 -67 -57 158 -1
4359ak08J11J29Q2j2r4j32M51l57J31m0J59q2j81j60K08m8J54J1j92K61r9k28
$$ -1 -209 -98 31 113 101 7 -125 326 -31 100 60 219 137 -44 -204 4 -44 110 121 -71 190 91 -137
4382a37P8K93j35M1j4j41M4J77l80J3P1j94K77p5K66j26k03J68J08l4K9o8M1q0
$$ -137 -59 234 99 140 126 -15 29 206 -174 -161 -90 -284 -7 -82 184 58 -145 23 131 97 126 58 99 19
4406A9%J70n7j45k54P4J56J96k42N8J18j37l50M20J86j12J27m31J28L30j13PN2
$$ 19 19 189 132 -13 -267 -193 -37 159 -83 -25 93 -44 -394 26 212 100 227 -204 -76 254 141 148 200
4429B00j37j43J02L93m22K95m63Q2o2K63j74j7K6j15J47J5Q5k51o9L74k67J70
$$ 200 63 -80 22 415 -7 288 -175 -93 -155 108 -66 -83 -57 -172 -25 -10 75 -176 -245 129 -138 32
4451C2J43j39k00M68m55L1K6N8j3k18N55l91J58K31k17k01Q3q5K20j88J98L0l
$$ 32 175 36 -164 304 -151 -120 -94 -36 -49 -267 288 -103 55 286 69 -132 -49 -134 86 -102 96 126 123
4474A23j40p5l3J75r6k9K02j37Jj60M74o14L81l07J6L76J35l21K77j69m4j27K66
$$ 123 -17 -92 -125 50 -46 -75 127 -10 -9 -169 305 -309 72 -235 -219 157 292 -29 248 79 35 -92 174
4497A74l67J23L2J7k00L06M4J10l91J9l8L79k80p1M2J6M73l43j86K51J04k84J18
$$ 174 -193 -70 -38 -21 -221 85 129 239 -152 -133 -171 208 -72 -143 -101 -85 388 45 -141 110 214 -70 48
4520D8M2o3j02J98j50k28M73k26J45j07j05J77Lj65K8m6J2R2k14J29J45p2p7J67
$$ 48 90 27 -75 123 -27 -255 218 -8 137 30 -75 102 105 -60 -32 -78 -66 26 -188 -59 86 14 -63 104
4544A04Q1k35kM1o6L77k09j88n7J10J81J09k32Q8q2j16J01K90n44L44N6j83K02
$$ 104 185 -50 -52 -11 -77 300 91 -97 -154 -44 137 246 14 102 20 -96 5 295 -249 95 151 -32 170
4567A70m09L37j94j88L71j00K7k05j05J91J37o9J83j55k7K64k19J64l06J93J12
$$ 170 -239 98 -96 -284 87 -13 14 -191 -296 -105 32 -37 146 -9 -36 228 9 173 -133 60 172
4588A72m56J85J55K01l33p3K25j58J32k05N1J68O4r3r7K87j79K93jl48P3m3K31
$$ 172 -284 -99 56 257 -76 -149 76 -82 50 -155 -104 64 128 35 -62 225 46 339 338 -10 63 20 251
4611B51n17L43k58J05M9L8J0j68M23o31L87K5j20j7L41j44k12L0l22L28j23K9
$$ 251 -266 77 -181 -76 -27 11 21 -147 276 -355 32 57 -63 -80 261 117 -95 -65 -387 -59 -182 -153
4633a53K77l16K50q1O5p1n7K4l04K63O1j18K88j14l63M68j86M2L46m39K81J4j99
$$ -153 124 -192 58 -23 42 -29 -86 -62 -366 -103 -42 -160 128 14 -349 119 -67 -25 321 -118 163 177 -22
4656b2K52l48J51j83J71k93O5K07K71J9m17O9J15J11j63J4j76M01m73K56j35J98
$$ -22 230 -118 33 -150 21 -272 -207 0 271 290 -127 -58 57 168 5 19 -157 244 -229 27 -108 90
4678I0m7k93K40n0J68k15m7J85R3j94J5P9K0k3m5J16m7k2J58k52nJ24j58J12m0
$$ 90 43 -250 -10 -60 108 -107 -154 31 124 -70 -55 24 44 21 -24 92 45 23 181 -71 -76 48 -110 2 -38
4703c8O9R9k22L20l60J03j03K35r4J76j68P4k43m6L1K47k9k36j09J09Q6J25k06
$$ -38 31 130 -92 228 -132 -29 -132 103 9 185 17 91 -152 -198 -167 80 51 -185 -294 -185 -99 26 -180
4726a80K3k9J9J68l1l6K89k18k01L2j55M14r7J20K4q3j01P2r5O4P2l5K91l45K57
$$ -180 -157 -186 -167 1 -30 -66 223 5 -196 -164 -319 95 -2 118 142 59 -42 30 -65 -1 71 36 327 -18 239
4751B39p4qk56K19j78J52l33L23Jj5j97K93m01Q0K78j99K37k23J70j27J11m2j3
$$ 239 165 157 -99 120 -58 94 -239 84 85 70 -127 166 -235 -155 123 -76 161 -62 108 -19 92 50 37
4774C7n9M3N5j07l1J30j0k88K87KL0l96L46%r6o3J37K6KK02j39j68J48K7n1k36
$$ 37 -22 21 76 -31 -62 68 58 -230 57 59 89 -307 39 39 -57 -120 17 43 45 247 108 -60 88 115 64 -172
4800a72L05l16L49j34R5j66K44k53K89j54k65p5N3k2j26K67m4J27K68n20K08J38
$$ -172 133 -183 166 32 127 -39 205 -48 241 87 -178 -253 -200 -222 -348 -81 -125 2 270 -250 -42 96
4822I6k57R8oL5j66L44J87j69l84L34k23J67O2k85k6N8K75m31J24K86j09L73l95
$$ 96 -161 -63 -69 -34 -200 144 331 162 -222 112 -111 56 118 -167 -193 -135 140 -291 -167 119 10 383 -12
4845a2N4K40m85L19k78K10J19k93L49l78K49m8lj16L60l04K04k79l9J39K31m56
$$ -12 42 282 -203 116 -162 48 167 -126 223 -155 94 46 43 -73 287 -17 187 -92 -131 8 239 -217
4867b17L18J6j54L08k81kK68k31P4J1j44M1J7%J09K17l65q6JJ12J63l2q6l43K95
$$ -217 101 117 -37 271 -10 -12 256 25 99 110 -34 7 24 24 133 350 -15 -101 -100 12 175 143 57 -286 9
4892Io6q2j8J09J06J37l42J88J4l06L23j02m7L8L38j01j94K17k41M4J40j23k5
$$ 9 -57 -139 -157 -48 58 195 -147 41 55 -251 72 -30 -77 -39 299 198 4 221 -20 24 164 41 16
4915A6j93J54MK31O1m3l11M2M7K4m2k25J67j35L25l20o3K86P9j98o1J44R7l14
$$ 16 -177 -23 -19 212 273 230 -81 -39 8 32 -10 -235 -68 -203 122 -198 -261 25 104 -94 -155 -11 86 -228
4939b28K43lj31j75K89K28k65J68j33J3n0J92k72n0K26j00O5kq6j47L24k99K14
$$ -228 15 12 -119 -294 -5 223 -42 126 -7 6 -44 148 -124 -174 52 -48 17 15 -71 -218 106 -193 21
4962B1K25j11l0j31J87N7j18j24P0j69r6J29l7j75J91K00k38J62J35k75K72k2
$$ 21 246 135 105 -26 161 218 100 -24 46 -123 -219 -90 -127 -302 -111 89 -149 13 148 -127 145 123
4984A23k8J11l76L54j60L7p9J69l27J40J29k37L87p43N80n07M45p6J20l04M29
$$ 123 95 206 -170 184 24 61 -18 151 -176 -36 93 -144 243 -500 80 -427 18 -58 62 -242 187
5005A87P6j31j77j39K15j0M9m7J14m0k7q0J08k71L88j50o1j16J95n5o3J96j1k00
$$ 187 263 132 -45 -184 31 21 70 23 137 97 70 -10 98 -173 215 65 4 -112 83 28 -35 161 150 -50
5029e0j09K2J36RJQj5k3Q9j72P9j29K20o8J51k41P8j76OR8Ln9o1J98J71L3m02
$$ -50 -159 -137 -1 8 9 17 2 -21 68 -104 -25 -154 66 -2 149 -92 -14 -190 -184 -86 -83 -142 -203 -5 166 199 -203
5056b03J11j5O0j87K53pj67P9R4m2N2J40j81n7j48M14p3j21J09n6J84o0j05k02
$$ -203 -92 -107 -47 -234 19 12 -155 -76 18 -24 28 168 -13 -70 -218 196 123 2 111 55 239 179 74 -128
5080a28R8j67K16P3r5j5K21k86L62k18j85K0J40M4j33J35j61J69k61J73o1K00
$$ -128 -30 -197 19 92 -3 -18 203 -83 279 61 -124 -104 36 80 -53 82 -79 90 -171 2 -59 141
5102A41J40k11J99k90j33K07M7m65N28l35N6M9J69n8J25j48N2j25J79p2j71J06
$$ 141 281 70 269 -21 -154 53 100 -365 163 -172 -116 -67 102 44 169 21 73 -52 127 55 -116 -10
5124a0M9J43j53J93k42l35J47K71l37J21J00k55K33J27k35K56J0k02k16L22o6
$$ -10 39 182 29 222 -20 -355 -208 63 -274 -153 -53 -308 -75 52 -183 73 83 -119 -335 -13 -79
5145g9J34J05j01q7O8j72J12k64J94R5Nj02l9J71k00J86J12k49J06n6j31LK88
$$ -79 55 160 59 -28 40 -132 -20 -284 -90 5 10 -92 -131 40 -160 26 138 -111 -5 -61 -192 -189 99
5168I9q3k34l1J49J0o0J32R0Mr8p1K4L9j7r0K88j79J5j39K07j44L2K56m3J6k88
$$ 99 16 -218 -249 -100 -90 -150 -18 72 76 -22 -93 -69 -30 -47 -137 151 -28 -13 -152 55 -89 -57 199 156 172 -116
5194a16K55j50K2m9j4j52L06j55K29q7Q3j68k58J96n1R2L57m30o6L38j20J01J47
$$ -116 139 -11 11 -38 -52 -204 102 -53 176 89 172 4 -254 -58 -109 -17 340 -90 -156 182 62 163 310
5217C10m68J05K0K85l17J12M1k49J9J00Q0R8j39L03k56k07L98j78P6k95L22J6
$$ 310 -158 -53 -33 252 -65 47 88 -161 -142 -42 38 136 -3 300 44 -163 235 57 133 -162 160 176
5239A76K4n5j76K02k08J43j53J48j17j8Q6k38M25k99K30j44J8r7j18P8k2j3J84
$$ 176 200 145 -31 171 -37 106 -47 101 -16 -34 52 -186 239 -60 170 26 44 -53 -171 -93 -115 -128 56
5262E6m20J97K44l3Q4k76J87J24j08p0k2Q0J49k90O3J39n01O51r6n03K97k08K59
$$ 56 -364 -167 77 44 128 -148 39 163 55 -15 -37 43 192 -98 -35 104 -397 254 158 -345 -48 -256 3
5285Cj70M76m93L42r4k01J35K6j30Q4J68l3n7O8r3M3J78j3k25Kk61rR8K80j79
$$ 3 -167 309 -184 158 64 -137 -2 24 -106 -22 146 113 56 124 31 74 252 239 14 16 -245 -254 -156 124 -55
5310e5j88L99M7j88o9k00P9J52J5J53k59j0J24j24m6J46J53l1q3J03r5j53K40
$$ -55 -243 156 203 15 -54 -254 -175 -23 -8 145 -114 -124 0 -124 -170 -24 129 98 15 118 23 -130 110
5333A10k35j7J51L57n34J02r0L86k86J97Q9j67J36j78j52O9j1M3L3M6p4m83N12
$$ 110 -125 -142 9 366 -168 -66 -156 230 -56 141 230 63 199 21 -131 -62 -73 -30 3 49 -25 -508 4
5356Dj95M23m72K63L6j85Q3N2k65N16k72k00K01J68k92K69r3p1k7K04j69p6Q7
$$ 4 -191 232 -240 23 59 -126 -43 9 -256 260 -12 -212 -11 157 -135 134 41 -30 -57 147 -22 -98 -11
5379a1j92J67J52J6j15J72o4J77k87R4l42O7M7J43J69r5m8jj92J87o4j93K18P6
$$ -11 -203 -36 116 132 17 189 125 302 15 109 -233 -166 -119 24 193 98 50 49 -143 44 -20 -213 5 81
5403H1r4O4j50J07o2P2j19l4M16l29J72j26J05k93K79j18k2k05L46J5k85j5K97
$$ 81 -13 51 -99 8 -54 18 -101 -135 281 -48 124 -2 103 -190 89 -29 -51 -256 90 105 -180 -195 102
5426A02q2Q3j25J65k22L13o0k01J59P1p7n6l20L13j67m3J92J5q2J14Ok52M88m11
$$ 102 20 103 -22 143 -79 234 174 -27 132 203 126 70 -250 63 -104 -147 45 60 -22 92 98 -154 334 -77
5450g7J86M2m2Jj7k11L04j86J46k24j5M2j61L08N2k03N7M1k82J01K70m36L76L7
$$ -77 109 151 109 110 93 -118 186 0 146 -78 -93 -51 -212 96 148 -55 2 43 -239 -138 132 -304 72 109
5474A09r2K34l27R5Q9j6l62N06n43M34L2k05P1J37m04M49j27Rj76O7l8lM7j24
$$ 109 17 251 -76 19 108 92 -270 236 -307 127 159 -46 25 162 -242 207 80 89 -87 -20 -58 -61 -14 -138
5498a38J05k7j86J24K22j66j00J99L4K40l23j45j9j36M66l49j17N24m92J3q4M02
$$ -138 -33 -60 -246 -122 100 -66 -166 33 67 307 -16 -161 -180 -316 150 -199 -316 208 -284 -271 -355 47
5520D7J01j83K22k44J95q4k7k75J85K21N5j06j67n0K56Q0m03J38L36l15J3l5J93
$$ 47 148 -35 187 -57 138 54 27 -248 -63 158 213 107 -60 -110 146 226 -177 -39 297 -18 -5 -40 153
5543A53k4J86j93n2j56O9J0k65J17J24K24l09L3L47l87Q9K53l39J55J05k01r9
$$ 153 129 315 122 70 -86 -17 -7 -272 -155 -31 193 -116 -83 264 -123 -34 219 -120 35 140 -61 -160
5565a60L67j02L3m67K26J94k09J75K37k52L0p8q6L11k98J38j00R4M9Qk9k7l2k58
$$ -160 207 105 138 -329 -103 91 -118 57 294 42 72 -6 -92 219 -79 59 -41 53 102 110 81 54 22 -236
5589b36K28j13J75J86j26k50kJ29P8j1j29L23l17J2Q4j58O3J49m0l46M17j40J47
$$ -236 -8 -121 54 240 114 -136 -138 -9 69 58 -71 252 -65 -53 31 -127 -64 85 45 -301 116 -24 123
5612A23j77j59K87k36j86M30l26K35M2R7M4j88K00l32o8R4K73j02K19j50q5j63
$$ 123 -54 -213 74 -162 -348 82 -244 -9 33 130 174 -14 186 -146 -214 -120 153 51 270 120 35 -128
5634a28K39m1p8L5j54J6j63O3l7L89k01k09M21j15J03j52R7l71K71J96k63J76
$$ -128 111 70 -8 27 -127 -111 -274 -211 -248 141 -60 -269 152 37 140 -12 85 -286 -15 181 -82 94
5656I4k7M9rj56q7K39k94K81k9p9o4j0M4K91j84O8PKJ37l57L6J62j46O0l7J3N2
$$ 94 67 116 107 -49 -136 103 -191 90 61 -18 -82 -92 -48 243 59 127 134 136 273 -84 -48 114 -32 28 -9 4 56
5683E6o3L01k99j21jQ8K85q5l33l7J4L84J1l21N1m3j0N5%q3J17J8K32k6q3k66
$$ 56 -7 294 -5 -126 -127 -39 246 161 -172 -209 -195 189 200 -121 -70 -113 -123 -68 -68 -151 -34 -16 216 190 107 -159
5709a59J81R9qP4o8K1k51K21M0m76K44L43j85j31j8k2K6J7j23K76J40j78j46j13
$$ -159 22 121 113 187 119 140 -111 110 150 -326 -82 261 76 -55 -73 -95 -69 -52 -175 101 241 63 -83 -196
5733a96KM24j35J75m10K44j85r8K05j3p5N2K50nj52j50l7K55j07%k77M49j22j29
$$ -196 -194 230 95 270 -140 104 -81 -179 26 13 -62 -10 240 235 83 -67 -104 151 44 44 -233 216 94 -35
5757c5J32j76K31j38J16j08j80r3R8N7q9L30k81J30k5r5R2J83k52J45p7j28K11
$$ -35 97 -79 152 14 130 22 -158 -251 -153 -96 -185 145 -136 -6 -31 -126 -34 149 -103 42 -35 -163 48
5780D8J02QM7k02j81QK92k42J48N8o9M2j91J96j6Q9j68Q0j64J0J62j23J68j93
$$ 48 150 158 205 3 -178 -170 122 -120 28 86 17 59 -132 64 48 137 -31 49 -115 -105 57 -66 102 -91
5804i1J62l8K8J02j01J1j21L1o1L21j77j79j85M1K67j34J96j30J45j40j0k0j15
$$ -91 71 33 61 163 62 73 -48 -17 -78 243 66 -113 -298 -257 10 -124 72 -58 87 -53 -63 -83 -198
5827a98L37j78J97j41J38r8q3J94J34k21J29k12J71j48L4j11NK8j69J9L63k73
$$ -198 139 -39 158 17 155 57 -26 168 302 81 210 -2 169 21 55 -56 -51 -23 -192 -173 190 -83
$$ [...]
8191e1
##END NTUPLES=NMR FID
##END=
