##TITLE=1H_LR-784-R3-CR10
 200.13MHz, CDCl3,
 8 sc
 
 3.2.2025
##JCAMPDX= 6.0         $$ Bruker NMR JCAMP-DX V2.0
##DATA TYPE= NMR FID
##DATA CLASS= NTUPLES
##ORIGIN= UXNMR, Bruker Analytische Messtechnik GmbH
##OWNER= pz
$$ XWIN-NMR		Version 3.5
$$ Mon Feb  3 18:37:47 2025 Russian Standard Time (UT+4h)  she@DPX200
##.OBSERVE FREQUENCY= 200.1313
##.OBSERVE NUCLEUS= ^1H
##.DELAY= (6, 6)
##.ACQUISITION MODE= SIMULTANEOUS
##.ACQUISITION SCHEME= undefined
##.AVERAGES= 8
##.DIGITISER RES= 18
##SPECTROMETER/DATA SYSTEM= spect
##.PULSE SEQUENCE= zg30
##.SOLVENT NAME= CDCl3
##.SHIFT REFERENCE= (INTERNAL, CDCl3, 0, 14.3821)
##AUDIT TRAIL= $$ (NUMBER, WHEN, WHO, WHERE, WHAT)
$$ ##TITLE= Audit trail, XWIN-NMR		Version 3.5
$$ ##JCAMPDX= 5.01
$$ ##ORIGIN= Bruker BioSpin GmbH
$$ ##OWNER= she
$$ F:/spectra/data/she/nmr/H-C/1/audita.txt
$$ ##AUDIT TRAIL=  $$ (NUMBER, WHEN, WHO, WHERE, WHAT)
(   1,<2025-02-03 18:36:35.06 +0400>,<she>,<DPX200>,
      <created by zg, POWCHK disabled, PULCHK disabled
       configuration hash MD5:
       00 E9 B6 7A A2 85 ED C7 34 08 36 98 17 FE 4E 26
       data hash MD5: 16K
       58 0A B6 B8 7A F7 48 4C AE D9 0C 27 AD F7 23 D9>)
$$ ##END=
$$ 
$$ hash MD5
$$ CF 7A BC E8 F3 A7 73 4C 51 FC 9D 9B 25 92 42 81
##$RELAX= 
##$RELAX= 
##$RELAX= 
##$RELAX= 
##$RELAX= 
##$RELAX= 
$$ Bruker specific parameters
$$ --------------------------
##$DU= <F:/spectra>
##$EXPNO= 1
##$NAME= <H-C>
##$PROCNO= 1
##$TYPE= <nmr>
##$USER= <she>
##$AMP= (0..31)
100 100 100 100 100 100 100 100 100 100 100 100 100 100 100 100 100 100 
100 100 100 100 100 100 100 100 100 100 100 100 100 100 
##$AQSEQ= 0
##$AQ_mod= 1
##$AUNM= <au_zg>
##$AUTOPOS= <>
##$BF1= 200.13
##$BF2= 200.13
##$BF3= 200.13
##$BF4= 200.13
##$BF5= 200.13
##$BF6= 200.13
##$BF7= 200.13
##$BF8= 200.13
##$BYTORDA= 1
##$CFDGTYP= 0
##$CFRGTYP= 5
##$CHEMSTR= <none>
##$CNST= (0..31)
1 1 145 1 1 1 1 1 1 1 1 1 1 1 1 1 1 1 1 1 1 1 1 1 1 1 1 1 1 1 1 1 
##$CPDPRG= <>
##$CPDPRG1= <>
##$CPDPRG2= <>
##$CPDPRG3= <>
##$CPDPRG4= <mlev>
##$CPDPRG5= <mlev>
##$CPDPRG6= <mlev>
##$CPDPRG7= <mlev>
##$CPDPRG8= <mlev>
##$CPDPRGB= <>
##$CPDPRGT= <>
##$D= (0..31)
0 0.7 0 0 0 0 0 0 0 0 0 0.03 0 0 0 0 0 0 0 0 0 0 0 0 0 0 0 0 0 0 0 0 
##$DATE= 1738593394
##$DBL= (0..7)
120 120 120 120 120 120 120 120 
##$DBP= (0..7)
150 150 150 150 150 150 150 150 
##$DBP07= 0
##$DBPNAM0= <>
##$DBPNAM1= <>
##$DBPNAM2= <>
##$DBPNAM3= <>
##$DBPNAM4= <>
##$DBPNAM5= <>
##$DBPNAM6= <>
##$DBPNAM7= <>
##$DBPOAL= (0..7)
0.5 0.5 0.5 0.5 0.5 0.5 0.5 0.5 
##$DBPOFFS= (0..7)
0 0 0 0 0 0 0 0 
##$DE= 6
##$DECBNUC= <off>
##$DECIM= 32
##$DECNUC= <off>
##$DECSTAT= 4
##$DIGMOD= 1
##$DIGTYP= 9
##$DL= (0..7)
0 120 120 120 120 120 120 120 
##$DP= (0..7)
150 150 150 150 150 150 150 150 
##$DP07= 0
##$DPNAME0= <>
##$DPNAME1= <>
##$DPNAME2= <>
##$DPNAME3= <>
##$DPNAME4= <>
##$DPNAME5= <>
##$DPNAME6= <>
##$DPNAME7= <>
##$DPOAL= (0..7)
0.5 0.5 0.5 0.5 0.5 0.5 0.5 0.5 
##$DPOFFS= (0..7)
0 0 0 0 0 0 0 0 
##$DQDMODE= 0
##$DR= 18
##$DS= 0
##$DSLIST= <SSSSSSSSSSSSSSS>
$$ [...]
##$SUBNAM0= <"">
##$SUBNAM1= <"">
##$SUBNAM2= <"">
##$SUBNAM3= <"">
##$SUBNAM4= <"">
##$SUBNAM5= <"">
##$SUBNAM6= <"">
##$SUBNAM7= <"">
##$SUBNAM8= <"">
##$SUBNAM9= <"">
##$SW= 18.0517328524113
##$SWIBOX= (0..15)
0 0 2 0 0 0 0 0 0 0 0 0 0 0 0 0 
##$SW_h= 3612.71676300578
##$TD= 16384
##$TD0= 1
##$TE= 0
##$TE2= 300
##$TE3= 300
##$TEG= 300
##$TL= (0..7)
0 120 120 120 120 120 120 120 
##$TP= (0..7)
150 150 150 150 150 150 150 150 
##$TP07= 0
##$TPNAME0= <>
##$TPNAME1= <>
##$TPNAME2= <>
##$TPNAME3= <>
##$TPNAME4= <>
##$TPNAME5= <>
##$TPNAME6= <>
##$TPNAME7= <>
##$TPOAL= (0..7)
0.5 0.5 0.5 0.5 0.5 0.5 0.5 0.5 
##$TPOFFS= (0..7)
0 0 0 0 0 0 0 0 
##$TUNHIN= 0
##$TUNHOUT= 0
##$TUNXOUT= 0
##$USERA1= <user>
##$USERA2= <user>
##$USERA3= <user>
##$USERA4= <user>
##$USERA5= <user>
##$V9= 5
##$VALIST= <valist>
##$VCLIST= <CCCCCCCCCCCCCCC>
##$VD= 0
##$VDLIST= <DDDDDDDDDDDDDDD>
##$VPLIST= <PPPPPPPPPPPPPPP>
##$VTLIST= <TTTTTTTTTTTTTTT>
##$WBST= 1024
##$WBSW= 4
##$XGAIN= (0..3)
0 0 0 0 
##$XL= 0
##$YL= 0
##$YMAX_a= 472798
##$YMIN_a= -588055
##$ZGOPTNS= <>
##$ZL1= 120
##$ZL2= 120
##$ZL3= 120
##$ZL4= 120
##$ABSF1= 10
##$ABSF2= 0
##$ABSG= 5
##$ABSL= 3
##$ALPHA= 0
##$AQORDER= 0
##$ASSFAC= 0
##$ASSFACI= 0
##$ASSFACX= 0
##$ASSWID= 0
##$AUNMP= <proc_1d>
##$AZFE= 0.1
##$AZFW= 0.1
##$BCFW= 1
##$BC_mod= 2
##$BYTORDP= 1
##$COROFFS= 0
##$CY= -3
##$DATMOD= 1
##$DC= 2
##$DFILT= <>
##$DTYPP= 0
##$F1P= 0
##$F2P= 0
##$FCOR= 0.5
##$FTSIZE= 0
##$FT_mod= 4
##$GAMMA= 1
##$GB= 0.15
##$INTBC= 1
##$INTSCL= 1
##$ISEN= 128
##$LB= 0.25
##$LEV0= 0
##$LPBIN= 0
##$MAXI= 10000
##$MC2= 0
##$MEAN= 0
##$ME_mod= 0
##$MI= 1.114404
##$NCOEF= 0
##$NC_proc= 0
##$NLEV= 6
##$NOISF1= 3.799351
##$NOISF2= 2.8
##$NSP= 1
##$NTH_PI= 0
##$NZP= 0
##$OFFSET= 14.38212
##$PC= 1
##$PHC0= -106.7365
##$PHC1= 10.99222
##$PH_mod= 1
##$PKNL= yes
##$PPARMOD= 0
##$PSCAL= 0
##$PSIGN= 0
##$REVERSE= no
##$SF= 200.129724274929
##$SI= 16384
##$SIGF1= 3
##$SIGF2= 2
##$SINO= 400
##$SIOLD= 16384
##$SREGLST= <1H.CDCl3>
##$SSB= 0
##$STSI= 0
##$STSR= 0
##$SW_p= 3205.1282051282
##$SYMM= 0
##$S_DEV= 0
##$TDeff= 0
##$TDoff= 0
##$TI= <>
##$TILT= no
##$TM1= 0
##$TM2= 0
##$TOPLEV= 0
##$USERP1= <user>
##$USERP2= <user>
##$USERP3= <user>
##$USERP4= <user>
##$USERP5= <user>
##$WDW= 1
##$XDIM= 8192
##$YMAX_p= 0
##$YMIN_p= 0
$$ End of Bruker specific parameters
$$ ---------------------------------
##NTUPLES= NMR FID
##VAR_NAME=  TIME,          FID/REAL,        FID/IMAG
##SYMBOL=    X,             R,               I
##VAR_TYPE=  INDEPENDENT,   DEPENDENT,       DEPENDENT
##VAR_FORM=  AFFN,          ASDF,            ASDF
##VAR_DIM=   8192,          8192,            8192
##UNITS=     SECONDS,       ARBITRARY UNITS, ARBITRARY UNITS
##FACTOR=    0.0002768,     1,               1
##FIRST=     0,             0,               0
##LAST=      2.2672688,     0,               0
##MIN=       0,             -588055,         0
##MAX=       2.2672688,     472798,          0
$$ Real data points
##PAGE= N=1
##DATA TABLE= (X++(R..R)), XYDATA
$$ [...]
1905b99J15KK96J89m0M4j00L45j46K60n35o5J61o68J44k7k27j7M27o0j98n5K86
1928a68KL31L41j44m9J67K52k35l69L40p1l93Jj01k73k3k49J40M4k2Q6k31M35
1951a89N53l11O4P25k76M9J06j25n3m28k76q7o9Jl95L9J49J95k92K36K39k2M27
1974B60n1J85J94j76O1kn7l82J67l08j23l1k18n0j91L97k17k11K16N78j21L24
1996B44J68K04j73L34k94r3K7L1j09m56R8k28P8k17J12j78l09K67R6M2L49rJ38
2019A22L51O1j73k6R3q3Rj11l04J87l20m1p3J1O1k41O6r5N13l3J33J54j69K18
2043C10j05K88J66l58p4k1j16k13l32L24l82m9R7K41j2J6K99l02K81L57k10K3
2065B28Q3q9K23k72P4l8k38n6K3k29J03J54k88L1J95l01K88k05L89k67K89J46
$$ plain form
1905 -299 -184 -182 114 303 263 307 207 552 406 666 131 66 227 -441 -297 -324 -551 -568 -141 -201 -399 -454 -168
1928 -168 -166 165 506 362 313 480 732 497 128 468 397 4 5 -96 -369 -392 -641 -501 -457 -479 -393 -624 -189
1951 -189 364 53 117 842 566 615 721 596 543 115 -161 -248 -317 -316 -711 -672 -523 -328 -620 -384 -145 -167 260
1974 260 209 394 588 412 473 471 414 32 199 -109 -232 -263 -481 -531 -722 -325 -542 -753 -537 41 -80 244
1996 244 412 616 443 777 483 390 417 448 339 -117 -19 -247 -169 -386 -274 -452 -761 -494 -398 -356 -7 -16 122
2019 122 473 534 361 335 428 345 354 243 -61 126 -194 -235 -308 -297 -236 -477 -411 -506 7 -26 107 261 92 310
2043 310 205 493 659 301 227 206 90 -123 -455 -131 -513 -562 -465 -224 -236 -220 79 -223 58 415 205 228
2065 228 311 222 445 173 247 209 -29 -85 -62 -291 -188 -34 -322 -291 -96 -397 -109 -314 75 -192 97 243
2087B43J49j20j41K67j96n4J34m51L17r2j43J14j35o4j66J76j10q2k0L12k47J36
2109a73J24K97o3P0K94j68o2l23J69j2l61l11M75k27L6l3J45j95K0Q2j41J98K17
2132E8l6j47O93n3k13Qj0K38k06k69O5k1k17J00n33K53m5j04l8j0L21l5J07L94
2156C00L11l53K29k14J55n61K98j16j66j58M14p00R3jL2j72J45J84L87j47K91
2177B51mJ32K08r3m7J28p6k17k92j47m2O7r1k55j76P2l3K74N9M37j62q2K37O41
2201G89m09N7K65m9l11l83L38m36k53n8J54m79L19J67k12k58P51k52K1K23M81
2222D65J41k10O9M0Jo23J10R7r7m40J68k71L51k41N3m2l3J45K47M20p0K2J98m4
2246D56J39j35R6l99j40k00K02l15p1J16k73m59N76K43j53J01N5L37k91L78J48
$$ plain form
2087 243 392 272 131 398 202 148 282 -169 148 56 -87 27 -108 -172 -338 -162 -272 -354 -374 -62 -309 -173
2109 -173 -49 248 185 255 549 381 319 -4 165 153 -208 -519 -44 -271 -235 -268 -123 -318 -298 -216 -357 -159 58
2132 58 22 -125 568 515 302 310 300 538 332 63 128 107 -110 -10 -543 -290 -335 -439 -477 -487 -166 -201 -94 300
2156 300 611 258 487 273 428 -133 165 49 -117 -275 139 -561 -468 -469 -437 -609 -464 -280 107 -40 251
2177 251 247 379 587 494 447 575 499 282 -10 -157 -199 -132 -223 -478 -654 -582 -615 -341 -282 155 -7 -89 148 789
2201 789 380 437 702 653 342 -41 297 -139 -392 -450 -296 -775 -456 -289 -501 -759 -8 -260 -239 -16 465
2222 465 606 396 465 505 506 -117 -7 90 -7 -447 -279 -550 -199 -440 -387 -429 -462 -317 -70 350 280 302 500 456
2246 456 595 460 556 157 17 -183 19 -296 -367 -251 -524 -983 -407 -164 -317 -216 -161 176 -115 263 411
2267D11R3k4K72r9l60p5rk49m16L77k01k46m5N38m44J56J09M7L45n9k8L08J04
2290E05K35o15o8K10p7j04m03K19L44m76j11J07P3p5J63n49M05M50k63P5M03L4
2312D82k73n7O9K06m23K13K00l80j73j67K25j13N6n4o8J10k29M12J47k4J57j04
2334B12K07J41o06K94l0j28J48J94o55k9N6K05l91j7M2L18l06j34L37J73J44r5
2356H0L9J08p2L91o34J47M10l32o4nk18j01J87k40r1J16R1O5K20n2j76J63r9J53
2380H6L52R1n8k10j39j0j70K37j08k10Jj44k58R3K43k97M87K36l54J33K98J0K2
2403C31j87L32k0o1jm4o35K37m5m75J74J47R0o03M86j08K83k12M80J44j91J31
2425B53K31jj71K69l54N1l2k01j13k34p3J69r4j52j1J7J44L57k43L99K89k17K6
$$ plain form
2267 411 504 480 752 653 293 218 209 -40 -456 -79 -280 -526 -571 -33 -477 -321 -212 -165 180 121 93 401 505
2290 505 740 125 57 267 190 86 -317 -98 246 -230 -341 -234 -161 -236 -73 -622 -217 233 -30 45 448 482
2312 482 209 152 221 427 4 217 417 37 -136 -303 -78 -191 -135 -189 -257 -147 -376 36 183 159 316 212
2334 212 419 560 -46 248 218 90 238 432 -223 -252 -196 9 -382 -399 -357 -39 -345 -479 -142 31 175 80
2356 80 119 227 155 546 -88 59 469 137 73 68 -150 -251 -64 -304 -395 -279 -188 -123 97 45 -131 32 -67 86
2380 86 438 529 471 261 122 112 -58 179 71 -139 -138 -282 -540 -447 -204 -501 -14 222 -132 1 299 309 331
2403 331 144 476 456 395 394 350 -285 -48 -93 -568 -394 -247 -157 -760 -274 -382 -99 -311 169 313 122 253
2425 253 484 483 312 581 227 278 246 45 -68 -302 -375 -206 -300 -452 -463 -446 -302 55 -188 211 500 283 309
2448C09L19J48m55l16J08J4k81J28m3k74n4K2L4j45R2N47j74R5L58K0J76m26M27
2471F29k57k30N8K19l65j32q0q7k4m5l26L19r8L16o1p6K28L35j67L15J11k93j5
2494B74j21M5J79k18l77k3M7J79k71k27K34m1J78o6L31k7j37M16J38k78R2j36
2516A91P2q0r4Q9l93L37k91j91l5J23M7k15M02r5O0k87M17N4m2J09l3J89n3k43
2540C8L75m56K17l69n8P2L08k42k62L40m1j16L33j13j38L05L00m06j30K56J82
2561C95n9j69J19J20l93J78m96J01J72j93j60j24M08j93J08p5N92l72M43k96L39
2582D45l44J37J03j25P1m96K69o5K30o35qK2M60k82J32J66l53L48O7J24j27O4
2604B03J87j87K47r9l13j01J99j88j47o6J61l20L84j55q3P6N6K15kkp0J99J12
$$ plain form
2448 309 628 776 321 5 113 127 -154 -26 -69 -343 -397 -375 -341 -486 -394 153 -21 74 432 452 628 202 629
2471 629 372 142 200 419 54 -78 -158 -245 -269 -314 -640 -321 -419 -103 -164 -240 -12 323 156 471 582 289 274
2494 274 153 198 377 159 -218 -241 -194 -15 -286 -513 -279 -320 -142 -208 123 96 -41 375 513 235 327 191
2516 191 263 183 89 178 -215 122 -169 -360 -395 -272 -225 -440 -38 -133 -73 -360 57 111 69 178 145 334 281 38
2540 38 413 -43 174 -195 -253 -181 127 -115 -377 -37 -78 -194 139 26 -112 193 493 87 -43 213 395
2561 395 336 167 286 406 13 191 -305 -204 -32 -225 -385 -509 -101 -294 -186 -261 331 -41 402 106 445
2582 445 101 238 341 216 287 -209 60 -5 225 -410 -418 -396 64 -218 -86 80 -273 75 142 266 139 203
2604 203 390 203 450 351 38 -63 136 -52 -199 -265 -104 -424 -40 -195 -278 -202 -146 69 67 65 -5 194 306
2627C06K4K01l24J02l36J81j46J9k04j02Kj77J39q7j7J99O7J98J76n4K23p5K58
2650E73k64J92k94P1j10l52J72j1j51j27q1j27K01N3J48l55N64j26M48j57j88
2671G9L87j85O8k32M31k67q5K7l82J60n77J14n2J61k1R1K32m5J78k42J83K28J51
2694D02J5k10qP1n6L8n89K99j01j84J15J89j66J94m69N46P7K4K33k95JK22k69
2717G9K94r6n4j19j54K73n67M5P9P7l37J58O0J29K42j68J24k89L05K08k15O9n
2740A38k4K85l22k25J98KK6j58j87OJ99k11J73m9k13J20J21N44j58k56J86J6P7
2763B88k84L41k03J83l31J82m13K30l09o5J10J82l56M02j61M39l05j28L63Rlo
2785A65j07K34j77k38J93N5j47J75k95k53L70j74M6L0k23K20R1R5P1k14K99L2
$$ plain form
2627 306 330 531 207 309 -27 154 8 27 -177 -279 -277 -454 -315 -402 -419 -220 -153 45 221 167 390 315 573
2650 573 309 501 207 278 168 -184 -12 -23 -174 -301 -382 -509 -308 -255 -107 -462 102 -24 424 267 79
2671 79 466 281 349 117 548 281 196 223 -159 1 -576 -462 -514 -353 -374 -283 -51 -96 82 -160 23 251 402
2694 402 417 207 199 270 214 252 -337 -38 -139 -323 -208 -19 -185 9 -460 86 163 187 420 125 126 348 79
2717 79 373 277 223 104 -50 223 -344 -299 -220 -143 -480 -322 -262 -133 109 -59 65 -224 81 289 74 143 138
2740 138 114 399 77 -148 50 52 78 -80 -267 -261 -62 -273 -100 -149 -362 -242 -121 423 265 9 195 211 288
2763 288 4 345 142 325 -6 176 -237 -7 -316 -381 -271 -89 -445 -43 -204 235 -70 -198 165 174 171 165
2785 165 58 292 115 -123 70 125 -22 153 -142 -395 -25 -199 -153 -123 -346 -126 -35 60 131 -83 216 248
2807B48j03j92J86K5l20L78m6k71J51k55q1K5J45J99k54J41j48J61JK05L02m11
2829H6K14K2k16qk7j77J74J7q1R3m92J77J67k60K2N3J36j15K06K54m7k33P13o03
2853G5K04j13J06k32N9l28J52L8k97Pj70J92J57j1J43K39N0l16J9L32oj47M7j36
2877F4Q9J18l40j21l38K36J31l7k54M60l15N4L84p4J91J11j16r8J82l8J13j62
2899B40L78n12k95K09K69m22Jm9k2R1R2M0Jj07M1L85L6qj53r6m5M87j32n23L98
2924C04l50k21P4K70l17J73k21j37L33N4J49j76J12M02p42K58J62K15m3l52K32
2945A79k03M0m9J64l08k10K93j95L0R4n9o5j32N68j38j06L70j89K50k55J36k17
2967bJ80j87K1N4J81l08j79N1r5O7j93K97J22jMqM14L1l0j49k35MN8j9j3j35J28
$$ plain form
2807 248 145 -47 139 164 -156 222 176 -95 56 -199 -280 -255 -110 89 -165 -24 -172 -11 -10 195 497 86
2829 86 300 322 106 98 71 -106 68 85 4 97 -395 -218 -51 -311 -289 -236 -100 -215 -9 245 198 -35 678 75
2853 75 279 166 272 40 99 -229 -77 -39 -336 -329 -499 -307 -150 -161 -18 221 271 -45 -26 306 300 153 200 64
2877 64 153 271 -69 -190 -528 -292 -161 -198 -452 8 -307 -253 131 57 248 359 243 145 327 289 402 240
2899 240 618 106 -189 20 289 -133 -132 -181 -203 -112 -20 20 21 -86 -45 340 376 368 215 119 74 561 429 -94 304
2924 304 -46 -267 -193 77 -240 -67 -288 -425 -92 -38 111 -65 47 449 -293 -35 127 342 299 -53 179
2945 179 -24 16 -33 131 -177 -387 -94 -289 -259 -165 -224 -289 -421 147 9 -97 273 84 334 79 215 -2
2967 -2 178 -9 12 66 247 -61 -240 -189 -284 -217 -410 -113 9 8 12 4 418 449 419 270 35 39 97 78 65 -70 58
2994E8l22K01Q9m12N41k15M3j97K93K46j81P9Nm0L0j36K46j64j68M9k33O7j57
3017b78J46P7J42l35J80k27K33o2R5L14J50k53J90j75K55j44k07o7O3j31m9o7
3039a50qNK4k50J44j0rL09q3K02k0M1L90l81MK39l14O2k72J97l07j9N5J50j21
3064a22J07R7m52L01j3N5J91P9l2j74J3K78l84K01L7j79j12P1K47m63K80l00q8
3087c62J41K34k48j8K32m1q2L43L2k7J23k83K21M9Jn08R6Q6n1j45J11j18J41k2
3111i5L1R0k58l8J52M74m30J78j3J52Oj99Lj28K20j02j37M5k3N6k51L09Q3j31
3135fj3Q8L7J18kM3k44J66k22J19K1k0J74m95j66j34O06j39j10j4Qm1L19qL5N0
3161A70J29k41J61O8k81j75L10K4j19P9j96Pj44J84k24Q6K05k57J72J4R5l91Q23
$$ plain form
2994 58 -264 -63 26 -386 155 -60 -17 -214 79 325 144 223 228 188 218 82 328 164 -4 45 -188 -121 -278
3017 -278 -132 -55 87 -248 -68 -295 -62 -124 -29 285 435 182 372 197 452 308 101 34 97 -34 -83 -150
3039 -150 -158 -153 -129 -379 -235 -245 -254 55 -28 174 154 195 585 204 208 447 133 195 -77 120 -187 -206 -151 -1 -122
3064 -122 -15 82 -370 -69 -82 -27 164 243 211 37 50 328 -56 145 182 3 -109 -38 209 -254 26 -274 -362
3087 -362 -221 13 -235 -253 -21 -62 -144 199 231 204 327 44 265 314 315 -193 -97 -11 -62 -207 -96 -214 -73 -95
3111 -95 -64 26 -232 -270 -118 356 -74 104 91 243 249 50 53 -75 145 43 -94 -49 -72 -16 -267 42 125 -6
3135 -6 -19 69 106 224 222 265 21 187 -35 84 105 85 259 -236 -402 -536 70 -69 -179 -193 -185 -226 93 85 120 170
3161 170 299 58 219 287 6 -169 141 165 46 125 -71 -64 -208 -24 -248 -162 43 -214 -42 -28 67 -324 499
3184D99n23M15j81J9l59K13J82j04n00J48J26j43K85k08M5J08K1j3j39K80k79
3205a08K55k39L35J51n8k26M0p3n1N8n5Q6j91O7k60J71J12l63L04L6j11N4P7J54
3229A65J98k84m1K57j91k12L49J9l52K47k34j08O9M5l2k67K47M4j91J92R7K43
3251B60j83K07k13p5L05j38P9k2L6m36J62j46O2J62j16m3k50K32J8j85M66J56
3273C38l07J88j02p8K19j54L01l17j99M0J03j9M1k03j16K19o5o4O5j32K72k14
3295a84J08L5L21m5M7n2L2p8J10k67l2J75l76L71l34o7k70M85j12Q7J94j44O5
3318F9K26k18J09q1J4L5J04k2k54j0j46K9l3l5K68j79q8L06k22J71p1j11K15J45
3342B21K08l67L07r5q3k7k3L6l67j06K95j52K56l89J43k1J63rM2k6k15L99q0j71
$$ plain form
3184 499 -24 391 210 229 -130 83 265 161 -339 -191 -65 -208 77 -131 -86 22 43 30 -109 171 -108
3205 -108 147 -92 243 394 336 110 150 77 26 84 29 115 -76 -9 -269 -98 14 -349 -45 -9 -120 -66 11 165
3229 165 363 79 38 295 104 -108 241 260 -92 155 -79 -187 -118 -73 -105 -372 -125 -81 -272 -80 17 260
3251 260 77 284 71 -4 301 163 242 220 256 -180 -18 -164 -102 60 -56 -99 -349 -117 -99 -284 182 338
3273 338 31 219 117 39 258 104 405 88 -111 -71 32 13 54 -149 -265 -46 -111 -175 -110 -242 30 -184
3295 -184 -76 -41 280 235 282 230 262 184 294 27 -5 170 -206 165 -169 -236 -506 -21 -133 -46 148 4 69
3318 69 295 77 186 105 119 154 258 236 -18 -28 -174 -145 -178 -213 55 -124 -212 94 -128 43 -28 -139 76 221
3342 221 429 62 369 274 191 164 141 177 -190 -296 -1 -153 103 -286 -143 -164 -1 -10 32 6 -209 190 110 -61
3366f1L61J10m9k50j17q9j31L35j20j41k56P4K73n5l6J12P1p6K89n7k47K24m2
3389A22o2K07Mr6k06p3j58J70m16K99Q6J63m07N10l99M80K24n81J64LL43k39J48
3412B86k52q2P6j49Q4J88j85Q3r6j88j35M22j8K08k36o5M08r7j55k7J04j54L65
3435C85o52P63m46k94M98q3j98J9l38N67m44N7M52l00l4q7L15j59j35L37K2l03
3457e8K60k08k5K43l74Q1O9j90o0J53N0q2j71K04J90mj21J12j49J68m9m9J22J51
3481B63K4j15j91j12L33k53R8k72J3Oj36O0J2J08K37p6J55O1j77K07j98k2L25
3504C50o32J34J92o5J83j47k65Q7j85K40l7J40j8p2K05J46k42J18R5l10L97n20
3526b06J33J93K1J8k49q9J99j69L12p51O46k36M5N84l31p3k36J59j9l7J70K17
$$ plain form
3366 -61 300 410 361 111 -6 -95 -226 109 -11 -152 -408 -334 -61 -116 -152 -40 31 -45 244 187 -60 164 122
3389 122 60 267 271 175 -31 -104 -262 -92 -508 -209 -123 40 -367 143 -256 224 448 -133 31 34 377 138 286
3412 286 34 -48 28 -121 -37 151 -34 49 -47 -235 -370 52 34 242 6 -59 349 252 97 70 174 20 385
3435 385 -267 496 50 -244 254 171 -27 -8 -346 221 -223 -166 286 -14 -48 -135 180 21 -114 223 245 -58
3457 -58 202 -6 -31 212 -162 -81 -12 -202 -262 -109 -59 -141 -312 -108 82 78 -43 69 -80 88 39 -10 112 263
3481 263 287 172 -19 -131 202 -51 47 -225 -212 -206 -342 -282 -270 -162 75 -1 154 215 38 245 47 25 350
3504 350 -282 -148 44 -21 162 15 -250 -163 -348 -108 -145 -5 -23 -95 110 256 14 132 227 -83 314 -206
3526 -206 -73 120 141 159 -90 -179 20 -149 163 -588 58 -178 -133 451 120 47 -189 -30 -49 -86 84 301
3548C01l85N3K18j65j83j32K85m08L32K75l18k4M36k63J67m19J70K37j83K58l5
3569B17l35K29J13j90r2k07K14j56K9k64K56Q9L0k00O9P2M15o0q0m3j23J96k09
3592c0K35k21J4K11n29K91j26k38L47N7N5p8l7j6k36K92p5L34m49M18j35Q9P6
3615B49k60lq2J67Rq0m3j35K98k43L9R4j50O7k22L11N1J27j89n6L73q4L4k54R0
3640A08J81j96J77l89R5l97J97R9%J19p7K57k17J59j11n1M2L18m33R0j9J02M10
3663D64n61K76k40J9O1j80l3J8J64n6p6K57k10J11j70M87k16n8j80K39PJ43k54
3686A2M6l02K85n6l11Q0R0o4J40J49K10m72J48J97Jj9k41J45KL3n5J08k14j7r0
3711a95qJ26l6k2m0Q1P0k32N75J11n61K81o3L01m79o4K68j12k16m9R4K35j73j57
$$ plain form
3548 301 -84 -31 187 22 -161 -293 -8 -416 -84 191 -127 -151 285 22 189 -230 -60 177 -6 252 217
3569 217 -118 111 224 34 -58 -265 -51 -207 -178 -442 -186 -97 -67 -267 -198 -126 289 229 149 106 -17 179 -30
3592 -30 205 -16 -2 209 -320 -29 -155 -393 -46 11 66 -12 -49 -65 -301 -9 -84 250 -199 219 84 173 249
3615 249 -11 -14 -96 71 80 0 -43 -178 120 -123 -84 10 -140 -73 -295 16 67 194 5 -51 322 238 272 18 108
3640 108 289 93 270 -119 -24 -421 -224 -125 -125 -6 -83 174 -43 116 5 -46 -4 314 -119 -29 -48 54 464
3663 464 -97 179 -61 -42 19 -161 -194 -176 -12 -68 -144 113 -97 14 -156 331 115 57 -123 116 123 266 12
3686 12 58 -244 41 -15 -326 -246 -156 -220 -80 69 279 -193 -45 152 153 134 -107 38 40 73 18 126 -88 -105 -195
3711 -195 -203 -77 -113 -135 -175 -94 -24 -256 319 430 -131 150 87 388 -91 -155 113 1 -215 -264 -170 65 -108 -265
3735b65J34J2l15M64j59K55K0k3N9k49K52k85J38J48n8r1j51O8J76k13j57M4K45
3758D9k40J13K18m30K93j98L98r5K5j06Q1n2J78O4l96j7K64jk82J61j42n6l63
3781e34N89j25M7n2R4OJ14j55J00j56P0J41k70K45k51J17M9p8o5o0R0k41M28l39
3805b36P6J50p7K22j89pJ93m9j41K15j99K9K13m7l33L06k6l53K01l03K93K0j73
3828b15r0L77j78l0K53j11K47j14J28L7O5k82j05m4j52K69j69r4K00j32l01N16
3850G5q9O0J21n16K87K63r4R2k03L0j51J11J34j14J20j87J38j46k40K28n6R1m8
3873i4J17k58J02N36n43J8K71l60K66j46M40j62p0mj63p5K05j30k26K12Q7m7k4
3896d8j00L09j39k00K62pk04L78q3l28L77k55L04l65J2R5K33m17k06L17R0k3j29
$$ plain form
3735 -265 -131 -119 -434 30 -129 126 146 123 182 -67 185 -100 38 186 128 37 -114 -46 130 -83 -240 -196 49
3758 49 -191 -78 140 -290 3 -195 203 108 133 27 108 56 234 298 -98 -115 149 148 -134 27 -115 -171 -534
3781 -534 55 -70 -23 -75 19 25 139 -16 84 -72 -2 139 -131 114 -137 -20 29 -49 -114 -174 -84 -325 103 -236
3805 -236 -160 -10 -87 135 -54 -61 132 83 -58 157 -42 -13 200 153 -180 126 100 -253 -52 -355 -62 -42 -215
3828 -215 -305 72 -106 -136 117 6 253 139 267 304 369 87 -18 -62 -214 55 -114 -208 -8 -140 -441 75
3850 75 -14 46 167 -349 -62 201 107 199 -4 26 -125 -14 120 6 126 -61 77 -69 -309 -81 -137 -46 -94
3873 -94 23 -235 -133 403 -140 -122 149 -211 55 -91 349 187 117 113 -50 -125 80 -50 -276 -64 23 -24 -48
3896 -48 -148 161 22 -178 84 77 -127 251 168 -160 217 -38 266 -99 -87 8 241 -176 -382 -65 25 2 -127
3919a27m3p7N27k22m9P5P5k14J40k33K06rl33J98m2q8L86k78P8Nm2J24j76J8J40
3944C9j47J68p5q0J22J44Lq2k50Q5K75j82j50k32K6L64k38R3K88k01n1J20L3J
3968G3j31O5L8J35J12m31K30Q2l60l5M89k38p7q7NJ62l91L73L6o9J07j05M23k43
3992A63R1Jj56mQ6J02j59l54L33k23q3K44P5L1o37N19j80K0L08o0M6l6j36K94
4016B85m4k95n0P4J83m3Pj26j60P2o7L9K13J43l41J12J12k34K74k60M8j2J25O5
4040A20j13K30K7k03r8j00J03m5J73k80L31l02m5O9K21M4l6j08L72j65m1j06j33
4063h5Q9J43J56l49J22J8l32J95j7o9L84l16J58r7q7QL73k20j7J38j80r7K0OM0
4088a6M3J52j97j01l6N3J29k05J98m35O53j93pl2K71l17j76L33J33J11k71J13
$$ plain form
3919 -127 -170 -247 280 58 9 84 159 -55 85 -148 58 49 -284 -86 -128 -216 170 -108 -30 -25 -67 57 -119 -101 39
3944 39 -108 60 -15 -95 27 171 174 92 -158 -73 202 20 -130 -362 -336 28 -210 -117 171 -30 -81 39 72 73
3968 73 -58 7 45 180 292 -139 91 173 -187 -222 267 29 -48 -135 -130 32 -359 14 50 -19 88 -17 406 163
3992 163 254 255 99 95 181 283 124 -230 103 -120 -203 41 116 147 -490 29 -151 -131 177 117 163 127 -9 285
4016 285 241 -54 -104 -30 153 110 117 -9 -169 -97 -164 -125 88 231 -110 2 114 -120 154 -106 -58 -70 55 120
4040 120 7 237 264 61 -37 -137 -34 -79 94 -186 145 -157 -202 -133 88 132 96 -12 360 195 154 48 -85
4063 -85 4 147 303 -46 76 94 -238 -43 -60 -129 255 -61 97 0 -87 -79 294 74 57 195 15 -82 -62 -56 -16
4088 -16 27 179 -18 -119 -155 -102 27 -178 20 -415 238 45 38 6 277 -40 -216 117 250 361 90 203
4110B03j11p6j34J95l35J00J50j59n2K54k03K10J18m22K03K65p4j08j33J87l7
4131D1j42K80j98OJ8j60M1K09j44j45J58k5J21O9o4O7k85M36k75J40j09L08l50
4154cJ12k02O5L6l47J96O7j5L42k62N2Q6k00l4L00P3k72n6R4k19L58k33J79j11
4178FO0k54K60l13L0M38l01q8k49J04K55o2M35r1k47Q2p9J01l07L79k93N8K01
4201A25j22m3J37j64L84j70k30J02l4J79k27J99j75J81l54J45N8k32L06K88L7
4222C90m17N4K45l47N9M02m47J12j09o1J33n0K4l00L37J85J52m34K1J29K17l03
4244hM7k03M31k50j46J4j26L59j82J83l48K07J74m30K76j08J01j2M0o8K01J00
4266B52m80L21J56l50O7J40l18L88l45j19M61l06J76O2j70K43j52J5k6Q4j09j35
$$ plain form
4110 203 92 16 -118 77 -258 -158 -8 -167 -219 35 -168 42 160 -262 -59 206 132 24 -109 78 41
4131 41 -101 179 -19 -13 5 -155 -114 95 -49 -194 -36 -61 60 129 65 132 -153 283 8 148 39 347 -3
4154 -3 109 -93 -28 8 -339 -143 -76 -91 251 -11 41 127 -73 -107 193 266 -6 -62 32 -187 171 -62 117 6
4178 6 66 -188 72 -241 -211 227 -74 -162 -411 -307 -52 -114 321 230 -17 65 -14 87 -220 159 -134 -76 125
4201 125 3 -40 97 -67 317 147 -83 19 -15 164 -63 136 -39 142 -212 -67 -9 -241 65 353 390
4222 390 -27 27 272 -75 -16 386 -61 51 -58 -119 14 -36 -12 -312 25 210 362 -72 -51 78 295 -8
4244 -8 39 -164 267 17 -129 -115 -241 118 -64 119 -229 -22 152 -278 -2 -110 -9 -21 19 -49 152 252
4266 252 -228 93 249 -101 -34 106 -212 176 -169 -288 173 -133 43 105 -65 178 26 41 15 99 -10 -145
4288a45K69r9q0n0Q7K25n50M11k09J68Q1p3J09r5N1k35L13j27NP1k31J15K84n83
4312b88L47J4O9k71P5K3M6lk77M17q1k45M38j45j14oj06K15P5j7j67K32j42j50
4336f1k4L9J64K5l4l61K95p3R0r6J76j74j51Q5K61N2k46J85n3l92K17j7l05O57
4360B59l25l5P4k20R2j68M35k25N5J15j30K51j62P2L6J8J83j05j97R3j36K42j97
4383B5j34J06J00j90o0L76j07n5k40NO4l2J18Q9j54M1K95k00K16l22K60l49M04
4406B56l43m1K76m1P1j42J20k33J04k14L89J32j13j95k53R6K83n34K39o8nQ9J85
4429E8k78J64j66J87J98l59K65Q4k63K58p5k14L53J4j22k85K1m3L21P8k80j50
4451b34M45k11r1J41P0K65M1k84k21M6R8N2J81n06L16J51m09n8L27K15n65JJ66
$$ plain form
4288 -145 124 25 -55 -105 -18 207 -343 68 -141 27 108 35 144 49 100 -135 178 51 56 127 -104 11 295 -288
4312 -288 59 73 142 -129 -54 -31 15 12 -265 152 71 -174 264 119 5 -1 -107 108 183 166 -1 231 89 -61
4336 -61 -85 -46 118 143 109 -252 43 -30 60 -36 140 -34 -185 -100 161 213 -33 152 99 -293 -76 -93 -398 259
4360 259 -66 -101 -27 -247 -155 -323 112 -113 -58 57 -73 178 16 88 124 142 325 220 23 116 -20 222 25
4383 25 -109 -3 97 -93 -153 223 116 61 -179 -174 -110 -142 -24 65 -89 -48 247 47 263 -59 201 -148 256
4406 256 -87 -128 148 107 178 36 156 -77 27 -187 202 334 221 26 -227 -131 152 -382 -143 -211 -216 -127 58
4429 58 -220 -56 -222 -35 163 -196 69 153 -110 148 73 -141 212 226 104 -181 -160 -203 118 196 -84 -234
4451 -234 211 0 -91 50 120 385 426 142 -79 -33 65 117 298 -208 108 259 -150 -208 119 334 -231 -230 -64
4474f4K69K6k48j87K63k6n0j08K08J2l13L90k70j32K29j01q0L2j97L16p5nK26
4497A15L0r9j03j80L93k04P6p5l64P00k15j3k8J49l07K77J7j66n8n0J79Ro0J30
4521A53r2j78J70k23J26K75j15p2m5j82L70l9j38J11M7q1K36j45j41j13j25R4
4543a07L5j21J58J6K07l31J52j5nj10N01k15L1k47p0R3K31j34k04j9J48k84J65
4566a25N29l93j08K03m1L52j19k68J23n6nj21n1P7J40k91r6J63L74n70J08K9J62
4589A6p3n6J38J59q7j70L11o4k99L52K0j29M2J03l94J19K70l56j92J03M20n04
4611b71L95j99K47q8o1q4L25j56R7m05J08J95l4mj03k41K14q3k2rJ26J97l7k48
4635a41K23l3j37n8J19o3J34O6q5P2j00J88k40KJ15qj02P3j21J49P2k0p2L5j32
$$ plain form
4474 -64 205 231 -17 -204 59 33 -17 -125 83 95 -218 172 -98 -230 -1 -102 -182 -150 -347 -31 -106 -111 115
4497 115 145 46 -57 -237 156 -48 28 -47 -411 289 74 61 33 182 -125 152 169 3 -55 -105 74 83 23 153
4521 153 61 -117 53 -170 -44 231 116 44 -1 -183 187 148 10 121 168 87 323 178 37 -76 -201 -107
4543 -107 -72 -193 -35 -19 188 -143 9 -6 -11 -121 380 165 196 -51 -121 -28 203 69 -135 -154 -6 -290 -125
4566 -125 404 11 -97 106 65 417 298 30 153 97 92 -29 -80 -3 137 -154 -250 -87 287 -283 -175 -146 16
4589 16 -57 -113 25 184 97 -73 238 174 -125 227 247 118 160 263 -131 -12 258 -98 -290 -187 233 -271
4611 -271 124 -75 172 84 23 -61 264 108 205 -200 -92 103 69 65 -38 -279 -65 -148 -170 -179 -53 144 107 -141
4635 -141 82 49 -88 -146 -27 -90 44 110 25 97 -3 185 -55 -53 62 54 -48 25 -96 53 125 105 33 68 -64
4660f4P7K45l34rL38M4m32K37Ro7M2n3k16R5P1J1K5k43J16j02M7Q6K31l41J4J64
4686in6L34k98J81k03L2K16k13L95j14l39l05K95j21L01j68Q4j40K17J94n15M31
4708A99l30M96l59P1j51J59k16M5Km3K38l50J61P4j15J04k2j42J53N21o23Q8J5
4731b5M8kK15l06K18l14J03K19j8j43J8j51L62k56k96M02J11l18K51K17k91M8
4753I2j70K64k50K18N1l84K71l7j65J35j97P8J09k07J60K5k19Rj6K68j50M05k44
4776D6n8j41O0K77j13J75j83j14j79O0M4M4J12J38l50q5M05j71K15l64N0K31l52
4799b53Q1J19J38l3J58j99J02K33n82J70r0Q6l61L23n1J03jN1n5J39J63j5l15
4822h9o4J19J68J6k61j0p6M45j90m2r2nJ34m42L55m7k5J83J64j22n9qMJ32j72
$$ plain form
4660 -64 13 258 -76 -85 253 297 -135 102 111 44 86 33 -183 -88 -17 -6 19 -224 -108 -210 -163 -77 154 -187 -173 -9
4686 -9 -65 269 -29 152 -51 -19 197 -16 379 265 -74 -379 -84 -205 96 -72 12 -128 89 283 -232 199
4708 199 -131 365 6 77 -74 85 -131 -86 -84 -127 111 -239 -78 -4 -119 -15 -37 -179 -26 495 -128 -40 -25
4731 -25 23 21 236 -70 148 -166 -63 156 138 -5 13 -138 224 -32 -328 74 185 -133 118 335 44 92
4753 92 -78 186 -64 154 205 -179 92 55 -110 25 -172 -94 15 -192 -32 -7 -226 -217 -233 35 -115 290 46
4776 46 -12 -153 -93 184 71 246 63 -51 -230 -170 -126 -82 30 168 -182 -267 138 -33 182 -182 -132 99 -253
4799 -253 -172 -53 85 52 210 11 113 346 -236 -66 -156 -70 -431 -108 -159 -56 -57 -6 -61 78 241 226 -89
4822 -89 -153 -34 134 150 -111 -121 -197 248 58 16 -76 -81 53 -389 -34 -81 -106 77 241 119 60 52 56 188 16
4847A6R0j22k10J06J45l3j17J06O8j89K27J32l60J98N1j91L20k82J37j73J71J99
4869B89n9l95k8R1k39L56j66Q8l5Q8J48k20K21j20lK89j43M7j59j38m0K01p8J1
4893FJ08m47O77n60M56n33L10k66M17p5j60L32k08K83k44R1l15R3P3p7Q8J8K00
4916B67k65M8P7k15N1K43l10J38l0j62L65j92j79N9J87j50K96j43q7j6J28r8j08
4939i6K67k37Q5q0k11M21k42m1L4O7J14P0r1L6j68K80j11p1j81K46l29J01P9J86
4963A28k37J9Q4N7j55k32K73K81j79%o6J8J07J78l79K76j78K59k14j33L06q9l06
4986a82J4%K87k95j6K47Jk84J57K77j95k9R3j18P2R0K2k47J9L22k84n3M9l1L00
5011B16k27j80K24K18l39J95j01MK16O8j76J04J56l97J24j21L0R9k48Q0K8J3j02
$$ plain form
4847 16 106 -16 -226 -120 25 -8 -125 -19 49 -140 87 219 -141 57 108 -83 237 -45 92 -81 90 289
4869 289 230 -165 -193 -102 -341 15 -151 -63 -98 -10 138 -82 139 19 16 305 162 209 50 -88 -128 73 -5 6
4893 6 114 -333 344 -216 240 -293 17 -249 168 93 -67 265 57 340 96 187 -128 -35 38 -39 49 67 267
4916 267 2 50 127 -88 -37 206 -104 34 4 -158 207 15 -164 -105 82 -68 228 85 -2 -18 110 12 -96
4939 -96 171 -66 19 -61 -272 149 -93 -134 -100 -33 81 151 60 96 -72 208 97 26 -155 91 -238 -137 -58 128
4963 128 -109 -90 -6 51 -104 -336 -63 218 39 39 -27 -9 98 276 -103 173 -5 254 40 -93 213 124 -182
4986 -182 -168 -168 119 -176 -192 55 56 -228 -71 206 11 -18 75 -43 29 119 141 -106 -87 235 -49 -102 -53 -84 216
5011 216 -11 -191 33 251 -88 107 6 10 226 294 118 222 378 -19 105 -16 14 113 -135 -55 -27 -14 -116
5034a16J74Oj12j0j60Q5L37K4k02L6l5k75L41j24J45k52J00m4OJ98k74K69m32
5057c15K41q3k5QR3q8K09j37L54k07J26j99J33k43K92j73JN1k67J87k68K60m5
5080i5n4M1L10k00J28o1j66K00k4j07k5L42k74j87L3J3J82O5M8l21j11L93l19
5103a89K11l35M17j64n9K75q0k8K97o84M36j69R2K52k62j73R2J38k23j4J15J9
5125c6J72l56M56mk05q5Q0J15k40L68k54j8r7J36r0J66j05l7J38J28m11k60P18
5148B79m64K38j53J35Q7p7p3q1J14k03K27q4K08Rk91K20K19o17L25l80J68P3N3
5171f8R1l9J1J63o8N4k10p9J74p5J46r0j03M39m33P8K3r5m0q1N7Q0J22o3L0o8
5197d4PJ52J41k63J50N4l57K41q8m5K09k60O3J53R0q0n49K33J30J27R5m21K00
$$ plain form
5034 -116 58 64 -48 -58 -218 -133 204 228 26 62 27 -248 93 -31 114 -138 -38 -82 -76 122 -152 117 -315
5057 -315 -74 -157 -182 -174 -81 -169 40 -97 257 50 176 -23 110 -133 159 -14 -13 38 -229 -42 -310 -50 -95
5080 -95 -149 -108 202 2 130 69 -97 103 79 -28 -53 289 15 -172 -139 -126 56 121 169 -152 -263 130 -189
5103 -189 22 -313 104 -60 -119 156 76 48 345 -339 97 -72 20 272 10 -163 -71 67 -156 -170 -55 -36
5125 -36 136 -220 236 232 27 -58 22 137 -103 265 11 -7 -104 32 -58 108 3 -34 104 232 -179 -439 279
5148 279 -185 53 -100 35 122 45 -28 -109 5 -198 29 -55 153 162 -129 91 310 -307 18 -362 -194 -121 -68
5171 -68 23 -16 -5 158 90 144 -66 -145 29 -46 100 10 -93 346 -87 -9 14 -81 -121 -202 -145 -65 57 -6 24 -44
5197 -44 -37 115 256 -7 143 197 -160 81 -7 -52 157 -103 -40 113 203 123 -426 -193 -63 64 159 -262 -62
5220f2K37o7k69P5J74k0n3K10k42j67p9J37M2N9n0J97l48J45J15%p5k5K50j14
5244G0k24J47m5j61L84k09K06j73j1n9K29l86J40J72J5m24K08K11r4j06K02L2
5266A24k59K37M5k81L09n7k79K35l62K39r9J17J23l01J69J86m7k05N8k5J95k91
5288a69O4K83k80j3J65j8k79R3K12j69J45k80J28K43j74mj13K05Q7p4J23j53M8
5311G0J32j60oj7J09r9O5j32j3J64l14N37k90L7j31M1R0j56pq2L80j87J02j07
5335B6l00L18j22K22j74J21O1L6j87l14k7M03j41O2J57J0j31j28K05j13j04J88
5357F8j30J96o9J96j77l39K25k90N72l56O0L9M0p2J58k73l2J73j56J66R2J88m75
5380a96J15pK0O6L00o08L75r3J70k34j92K39J6k24K50q8J53j23O9J17j37J31r4
$$ plain form
5220 -62 175 108 -161 -86 88 68 15 225 -17 -184 -263 -126 -84 -25 -75 122 -226 -81 34 34 -41 -66 184 70
5244 70 -154 -7 -52 -213 171 -38 168 -5 -16 -75 154 -232 -92 80 95 -329 -121 90 -4 -110 92 124
5266 124 -135 102 147 -134 175 118 -161 74 -288 -49 -148 -31 92 -209 -40 146 99 -106 -48 -73 122 -169
5288 -169 -105 178 -102 -115 50 32 -247 -154 58 -111 34 -246 -118 125 -49 -53 -166 39 126 52 175 22 70
5311 70 202 42 36 19 128 29 94 -38 -51 113 -201 336 46 83 -48 -7 83 -73 -80 -162 218 31 133 26
5335 26 -274 44 -78 144 -30 91 152 188 1 -313 -340 63 -78 -16 141 151 20 -108 97 -16 -120 68
5357 68 -62 134 65 261 84 -255 -30 -320 252 -104 -44 -5 35 -37 121 -152 -184 -11 -167 -1 91 279 -196
5380 -196 -81 -88 -68 -2 298 -310 65 -28 142 -92 -284 -45 -29 -253 -3 -91 62 -61 8 125 -12 119 25
5403B5J38k41q4J43J4j76m6r7J89J21k64N1L74m68K73r2j1J99O9j96M19k42j3
5426H5j11o5J73Jm4K1j87P9J31k41j3L60K21l71O0j6LN6M4j86M18k87J43m27M48
5451B95k15Q6m1k83m6m3L18j01k4J71k30J97l64L94k35j20M01r8p5j42ML33n2
5474A30j31p%J85On01M08l66L16j43o3K27r7M3p2K47rq0P5k05j29N07l91J26j00
5499b4k0Kk55L74p9j00J42j22M1M8q8J74n9J09pp2J74k00l41J49LQ1K60j53J90
5524B27l1Jm47M90k82J07K1m27L37Q3m2j45J64j42R6PJ37k05Q6k2j29N5p5j58
5548b94K17j24K48j67J68R6m5k38R0J40p1J77q4l87L15m1p4m2k6J34K78k48j08
5571h6j25J55k5j0K77j84j39k8J95N9j43J82M9j13j78L06k34m3J0M71n66K16l07
$$ plain form
5403 25 163 -78 -162 -19 -5 -181 -227 -324 -135 -14 -278 -227 147 -321 -48 -140 -151 48 117 -79 340 98 85
5426 85 -26 -91 82 83 39 60 -127 -48 83 -158 -171 189 410 39 99 83 86 142 186 0 418 131 274 -153 295
5451 295 80 166 125 -158 -204 -247 71 -30 -54 117 -113 84 -280 114 -121 -241 160 62 -13 -155 -151 182 130
5474 130 -1 -8 -8 177 183 -318 90 -276 40 -103 -166 61 -36 7 -65 182 173 93 168 -37 -166 341 -50 76 -24
5499 -24 -44 -42 -297 77 -2 -102 40 -82 -41 7 -81 93 34 143 136 64 238 38 -303 -154 -151 -70 190 37 227
5524 227 196 197 -250 240 -42 65 86 -341 -4 79 37 -108 56 -86 10 17 154 -51 35 13 -116 -61 -136 -294
5548 -294 -77 -201 47 -120 48 144 99 -139 -49 91 20 197 113 -274 41 0 -74 -116 -142 -8 270 22 -86
5571 -86 -211 -56 -81 -91 186 2 -137 -165 30 89 -54 128 177 64 -114 192 -42 -85 -75 396 -170 46 -261
5594b61K32j59M01j99o7j61p4L85M0j33rJ95k9k0k60P4o5q8J35j40qK91k29J61
5618A2J10n5j46J66n5K94k36pRp8K80m42J32J83l08K15q5R3l9o2o7q2J22N3l0
5643b3J95k16N3L13m27J79n6J67j1l0j48O3O9o3J15k4o6j27m5r1k4L57L0j77K24
5668B37l45j14L37k49L66j22J78k17p3k2K00m7J07k74o3n6K61j53J67O9j11n5
5690B1o0j57J14Ml0J42K8M3qj6k91m1M52j44k50j5K69j47J5J2N8N8j05L90m13
5715g1k24N90m62J41j50L51J70m33R3N9j03k61R6M42l35K73k89oL11l86K12M4
5737F2r9J57M6j17j9k08K74k39J77j17K46j10M2k19q8J70J68k00R8N1JL6k78L06
5761A40j79Q5j99N07m01m0M5O4nk01m5J73k52K50r0n5q1L81R7j82l9L25p0k03
$$ plain form
5594 -261 -29 -188 213 14 -53 -214 -288 97 137 4 -5 190 161 141 -119 -45 -110 -198 -63 -203 -211 80 -149 12
5618 12 122 67 -79 87 32 326 90 83 92 14 294 -148 -16 167 -141 74 -11 82 43 -19 -86 -168 -46 7 -23
5643 -23 172 -44 9 322 -105 74 18 185 174 144 -4 59 128 65 180 156 90 -37 -82 -173 -197 160 190 13 237
5668 237 -108 -222 115 -134 232 110 288 71 -2 -24 176 129 236 -38 -101 -157 104 -49 118 187 76 21
5690 21 -39 -196 -82 -78 -108 34 62 105 97 81 -210 -251 201 57 -193 -208 61 -86 -71 -59 -1 57 -48 342 -71
5715 -71 -295 295 -167 -26 -176 175 345 -88 5 64 -39 -300 -204 238 -97 176 -113 -119 192 -194 18 62
5737 62 -37 120 166 49 30 -178 96 -143 34 -83 163 53 95 -124 -212 -42 126 -74 24 75 76 112 -166 140
5761 140 -39 46 -153 354 -47 -87 -42 22 17 -184 -229 -56 -308 -58 -148 -203 -284 97 194 12 -27 298 228 25
5785B5m1J33k51r1J85j09j0Q3njJ38k16J74o7j5L81l56O6J19l42J77K3L1J12j99
5810e6j40M17j82k13J77q2J30R8k98J61k0J42j82p8O1J18K06l40J03N3j42K72
5832B05%k68N39m96m2M1Q7j64r3J70q4J83J79k99m6J2j30L08q7Q7k21K61k57j1
5856a26R5n3k28K59J19j68k66L84r7n6K22Q0j01j72M17j20j29k15J71m8M0q4n6
5879a32K16n3P5k84J21J65k04J71j05k2J31K0J79l00j11J72j02K66j46J66k22
5900Ao0l34M26O1Q5Jj91N1J04j46J8l60L96J42n2mJ8k13J56j92K43k6mj57J21
5925H4p4j91j50N47j23k04j29K78r0k27L26Q4l14qJ94j04K14r0R8q1l61L79J67
5948B25l58K20l45J91j15N7l4N6lo1K07k82l6J46M8J13R0k54J45pJ62j78N3j41
$$ plain form
5785 25 -16 117 -134 -225 -40 -149 -159 -76 -81 -82 56 -160 14 -53 -68 313 -43 23 142 -200 -23 0 31 143 -56
5810 -56 -196 221 39 -174 3 -79 51 149 -149 12 -8 134 -48 -126 -65 53 259 -81 22 75 -67 205
5832 205 205 -63 476 -20 -62 -21 66 -98 -191 -21 -105 78 257 -42 -88 -76 -206 102 15 102 -119 142 -115 -126
5856 -126 -31 -84 -312 -53 66 -102 -368 16 -81 -137 85 165 64 -108 309 189 60 -155 16 -32 8 -76 -132
5879 -132 84 31 106 -178 -57 108 -96 75 -30 -52 79 99 278 -22 -133 39 -63 203 57 223 1
5900 1 -59 -393 33 94 179 180 -11 40 144 -2 16 -344 52 194 142 138 156 -57 99 -93 150 124 120 -37 84
5925 84 10 -181 -331 216 93 -111 -240 38 -52 -279 47 131 -183 -191 3 -101 113 23 121 40 -321 58 225
5948 225 -133 87 -258 -67 -182 -125 -159 -103 -106 -167 40 -242 -278 -132 -84 29 119 -135 10 3 165 -13 40 -101
5972a01q1J07j21K42j16L17k61k24M80j95j63L59k74J05J05j27j57j8J68J63l93
5993a85L5J22l49K95j25L61l8j17p7j68J33J7j8n5K42p8J91l00K44O1k8k81M82
6016C64n13K30k6m05K11J56N1M4kn7p1L48n5k77K98l9j31l11L95l97M20k90K3
6039c4L9J2j04J25j38O7M7r7O7o0K3m8J56J53j79j78L7LRJ06K47k20k35K66p6
6064a2K65k25j4M8l85M40n3J42j32k06L26l53o8M14j96M3K27j87l0l53M28j97
6086g8N9j1k2J83m0O0k10M4j79P1NM67m53K61k58J47q7r8L16k39J29R6k24K42
6110A81l18p1J39J27j13L4K5M3l21M80p5k70K79j71m2l2Q8o2R5J3k3k54K44j76
6134a80K63Pk45J40j81R6O0OJ02j9j03p1n6J19L4j8J20o1q9j54LK37Q0j11j09
$$ plain form
5972 -101 -182 -75 -196 46 -70 247 -14 -238 242 47 -116 243 -31 74 179 52 -105 -123 45 208 -185
5993 -185 -150 -28 -377 -82 -207 154 116 -1 -78 -246 -113 -96 -114 -169 73 -5 186 -114 130 191 163 -118 364
6016 364 -149 81 55 -350 -139 17 68 112 110 53 -18 330 275 -2 296 257 126 -185 210 -187 233 -57 -34
6039 -34 5 17 -87 38 -100 -33 14 -83 -16 -76 -53 -101 55 208 29 -149 -112 -109 -100 6 253 33 -202 64 -12
6064 -12 253 28 14 62 -323 117 64 206 74 -132 194 -159 -227 187 -9 34 261 74 44 -309 119 -78
6086 -78 -19 -30 -52 131 91 151 -59 -15 -194 -123 -118 349 -104 157 -101 46 -41 -139 177 -62 67 163 -61 181
6110 181 -137 -208 -69 58 -55 -21 4 47 -274 206 131 -139 140 -31 -73 -105 -17 -79 16 29 6 -248 -4 -180
6134 -180 83 90 -155 -15 -196 -100 -40 -34 68 49 -54 -125 -181 -62 -28 -46 74 13 -76 -230 -227 10 90 -21 -130
6159a30kN9K20J45k9k43J8O8q9Ro7n4j6j66J10L24m11K04l9r6J95k56L19j17J71
6184A27n0o6L11m77J22R4k73L8L2J45j78J65j60J84p6M8J5l10P2K10O0r0L39m61
6208a79L93k52J38m1%j98J06j19J0L26l37J86Q2M0j14n2k98K06N5K58k75J38l6
6231C7q3k1Q2K4l7l03K70L5j91K91j77k10K16J0j9O6J3N9m9j63J98k0q2J03q2
6256c3O4K09j34qRr2j21j06J04K54l79O6J51q7j75O5J99k62L03L5j09J2Pj57M41
6281B56j2j87j84K89j81J68j95J9k03Q3L1q9O1n3Q4J63j5o1Q8j1k11K44l4k41
6305a91K79J48l34K20l31L35j03J19m1j81m1J25J53p9r9j55J24L07N2n56K52J4
6327A7J97l54P6K1m9l9L0K3k32L17kk6PJ04Pk7k96K37K47k08n7j37mJ95M3j81
$$ plain form
6159 -130 -132 -73 147 292 263 20 38 106 17 26 -41 -95 -111 -277 -167 157 -254 -50 -89 -185 10 -246 73 -44 127
6184 127 77 11 322 -155 -33 61 -212 -174 -142 3 -175 -10 -170 14 -62 -14 1 -309 -237 -27 33 -57 282 -179
6208 -179 214 -38 100 59 59 -139 -33 -152 -142 184 -153 33 115 155 41 -11 -309 -103 -48 210 -65 73 37
6231 37 -46 -67 15 39 2 -301 -31 4 -187 104 -73 -283 -67 -57 -76 -10 3 62 13 -150 48 28 -54 49 -33
6256 -33 31 240 106 98 107 15 -106 -212 -108 146 -233 -167 -16 -103 -278 -213 -14 -276 27 62 -47 -35 -28 -185 256
6281 256 244 57 -127 162 -19 149 -46 -27 -230 -147 -116 -205 -144 -197 -113 50 35 -26 62 51 -160 84 50 -191
6305 -191 88 236 -98 122 -209 126 23 142 101 -80 -121 4 157 78 -21 -176 -52 255 307 -249 3 17
6327 17 214 -140 -64 -43 -92 -131 -101 -78 -310 7 5 -21 -14 90 97 70 -226 11 258 50 -7 -144 -148 47 90 -91
6353i1J60m07L51JK08k16J1m2J66p0J32l1P5j37j72j22O9J80j14k03n4J30l8J98
6377a6J21j59K83j97k14P7j69M40r0o8MR2jk39K37N8j51k83K29j6k87N37j27l1
6401C0n9J08r0J94j46j17J71J9q6k7K11m37J4K61J03m5k35R6k2j43L39l04J77
6424A2J85r1j82L0J31l16M35K03m12Q6p1J01k49J9j15L93j01KQ6k44J46L3j47
6447f6J59j02k10L13l10J38O8r0J3K07N8l37K76k52M24k82r2R4K06k23o1L3KL24
6471B90j85LJ46j82N1j4j33J22p0J81j54J46r0O6n2q1j40K23o7r8O9J1p2j08M86
6496C48n35J82J51L0k55K98j20l65N05j35L5j91k4K61j31q7j56j23J19J90j02
6517a05K63n7j50j36N8J50L4k52L74l04K39rj24K21j94P0l72L45m5k11K78l22
$$ plain form
6353 -91 69 -338 13 14 222 6 17 -25 141 71 203 172 247 110 -62 -184 -115 65 -49 -252 -306 -176 -214 -16
6377 -16 105 -54 229 32 -182 -105 -274 166 76 8 12 104 103 -136 101 159 8 -275 -46 -62 -349 188 61 30
6401 30 -29 79 -11 183 37 -80 91 110 24 -3 208 -229 -215 46 149 104 -131 -35 -57 -200 139 -165 12
6424 12 197 106 -76 -46 85 -231 204 407 -5 81 10 111 -138 -119 -234 159 58 60 146 -98 48 81 -66
6447 -66 93 -9 -219 94 -216 -78 -10 -100 -87 120 178 -159 117 -135 289 7 -85 9 215 -8 -69 -36 -34 290
6471 290 105 108 254 72 123 109 -24 98 28 209 55 201 111 177 125 44 -96 127 60 -38 31 42 -30 -138 348
6496 348 -187 -5 146 176 -79 219 99 -266 239 104 139 -52 -76 185 54 -33 -189 -312 -193 -3 -105
6517 -105 158 101 -49 -185 -127 23 57 -195 179 -125 114 105 -19 202 8 78 -294 51 6 -205 73 -249
6539b49L26q4k79M88k99Q9J05L5j84p2L23j01J24j78r5PJ83k32K2km2Q5R1J5o8
6564Hp6Q8l8J14j20K83k89K12ll4n3Jn5Oj05J06j97M36l09l6k64K36J80N0k03
6589f2M71o37J75jk91L16R8n9L48m79J27J2k9J92k46J35o4R5k52R6k89M23k37
6612a58K99j85Rn2O4J13r9J25J41l95J78k54K05J05k5k20q5L98l60K17l1m7J45
6635H8j46J6J81m8j29K7Q6n44M26J8l9J58o9J15n7j34J43k10K38n5J1k87K47j46
6659a10j8R2K64m62L56q6K7j6K64q2l42J72j53J30j41K37k66Q2Q8R2j51L73j84
6682A66j21J58k51J04j90J95j21P6k57M18J31k75j56K45J04k67Q8m8OJ35m9J7
6704A08k45K9L51k04j82L75l45L78q2o8k45K09J64l81M01l15L2k7M5K56k40k04
$$ plain form
6539 -249 77 -7 -286 202 -97 -8 97 132 -52 -124 199 98 222 44 -51 -44 139 -93 -71 -73 -115 -30 61 76 8
6564 8 -68 20 -18 96 -24 259 -30 182 179 145 92 93 38 44 -61 45 -152 284 -25 -61 -325 -89 91 141 -62
6589 -62 409 -228 -53 -54 -345 -29 69 10 358 -121 6 18 -11 181 -65 70 6 101 -151 -55 -344 79 -158
6612 -158 141 -44 -35 -87 -23 90 -9 116 257 -138 40 -214 -9 96 71 -149 -234 164 -196 21 -10 -57 88
6635 88 -58 -42 139 91 -38 -11 75 -469 -43 -25 -64 94 25 140 83 -51 92 -118 120 65 76 -211 36 -110
6659 -110 -128 -36 228 -234 122 36 63 47 311 229 -113 59 -94 36 -105 132 -134 -52 36 128 -23 350 166
6682 166 45 203 -48 56 -134 61 -60 16 -241 177 308 33 -123 122 226 -41 47 -1 5 140 91 108
6704 108 -137 -108 243 39 -143 232 -113 265 183 115 -130 79 243 -138 263 -52 -20 -47 -2 254 14 -190
6726a90Q9J43L9k35J02R8k7l9N6J56l91K41K44l11Q4l3j46J15J40n9j11K48l82
6749a69K12j6O1q7j51P7q1K10Q3j66M0j28K62j07N6N1k10l0k94K94L48j69l57
6772b71L26L07n61K62j10N1K01k14K7K53n3j58j06L4j60L15j47q2J4k9J16q4L72
6795C03j60k22J95o2m0P1J5k4J09k11j67K47j07n1k06M75k49J3O7P1j44k99M51
6818G5l3P8m5k2M7l87J31L5K72k75K58N3l63J82p7J54j66K55j4k7r0n1NJ38j46
6843a3P5j84lP0j05K62l6k29JL03p1k76L09k02K14p4j34L58k18k0L13l51j1J9
6867cN3k40K06q6j71K67j79K49l24J17R1J45j04L3m8J34K13l29n6l3R0J80l05
6890a00O1n7J17nl70L92j93J88j91N29m49K35k16P1J78l07K68k86L85l20j87M28
$$ plain form
6726 -190 -101 42 81 -154 -52 46 19 -20 36 192 -199 42 286 -25 59 26 -120 -5 135 76 -35 213 -169
6749 -169 43 27 88 1 -150 -73 -154 56 139 -27 13 -115 147 40 96 147 -63 -93 -387 -93 255 86 -271
6772 -271 55 362 -199 63 -47 4 205 -9 18 271 218 60 -46 -12 -172 143 -4 -86 -72 -101 15 -69 303
6795 303 143 -79 116 54 14 85 100 76 185 -26 -193 54 -53 -104 -310 165 -84 -71 -4 67 -77 -376 75
6818 75 42 120 75 53 100 -287 -156 -121 151 -124 134 187 -176 6 -71 83 -83 172 158 131 41 -10 -5 133 -13
6843 -13 62 -122 -125 -55 -160 102 66 -163 -162 141 70 -206 103 -99 115 41 -93 265 47 27 340 -11 -22 -3
6867 -3 50 -190 16 -70 -241 26 -153 96 -228 -111 -20 125 21 54 6 140 353 24 -32 -65 25 205 -100
6890 -100 -39 -96 21 16 -354 38 -155 33 -158 371 -78 157 -59 12 190 -117 151 -135 250 -70 -257 171
6912A71j58o0L84l41j15K10j95R3O3m27O30k57k59J59O4M03l08R7r2Q0k76K22
6934H8j92K24k76J94J13j90K77k71j73o9K62J2q8M31m28J32J05k18K45K5k72L1
6956c8m4l5p6J5M30j19r8j10J23J41l87J57j6q1J15R9j17J57J28j74q5j50L33
6979A68l72q2J77K76j74j14m6K03j8j15j90N07j49k00L30j66j96q0N11j70p2p3
7001d5J31j60J80j25Jj72J39N6m3J93o9M2k78J58J00r0L2j32K21j16qn3J2P3P1
7026A18J9q3J33l00k9J86l9k46R8K37j04M7k04j28N31j78J84k07l2j38P9K7J44
7049A15k19J28j30j3J48J2J47l38L3J18J34l37L1J30l0L85k72l00K60K77j08j99
7071b8J01m8K02m25K19j02K29rO3j49J71l87L50k05l6R8j22n5M19l23q7K0M45
$$ plain form
6912 171 13 -47 337 -4 -119 91 -104 -11 52 -375 255 -2 -261 -102 -38 365 57 154 62 142 -134 88
6934 88 -104 120 -156 38 151 -39 238 -33 -206 -275 -13 -1 -89 342 -86 46 151 -67 178 203 -69 -38
6956 -38 -82 -117 -193 -178 252 133 35 -75 48 189 -198 -41 -57 -138 -23 76 -41 116 244 70 -15 -165 168
6979 168 -204 -286 -109 167 -7 -121 -167 36 18 -97 -287 220 71 -129 201 35 -161 -241 270 100 28 -45
7001 -45 86 -74 106 -19 -18 -190 -51 5 -38 155 86 128 -150 8 108 18 50 -82 139 23 15 -38 -26 47 118
7026 118 137 54 187 -113 -142 44 5 -241 -143 94 -10 37 -167 -295 236 58 242 35 3 -135 -56 -29 115
7049 115 -104 24 -106 -119 29 41 188 -150 -117 1 135 -202 -171 -41 -71 314 42 -258 2 279 171 -28
7071 -28 73 25 227 -198 21 -81 148 139 202 53 224 -163 187 -18 -54 44 -78 -133 286 -37 -124 -104 341
7094C41k57j71K7R2K58n32K82N9j08J36pj14l3K4k44J08J85K82k98j14K01k46
7116a29J07l48K05N58k64O4lk33RK39m7l04K50L9l09K04q2M5N7j27J25j85J63
7139C4j39L70j61k48K86j93j32M03k92Ll9m2J56J45j14k6j27O2j03OJ59k00L50
7162A58j88K0K44m00o7L47k09j3L71m48L00k32O4K67j64j72J75j62K80n4J77l89
7184i5j22j10K5L37o4M5o3k76K13O5J39r3Q6k27N6p2K7K86k03n4L0K6l47N83k51
7209e9K47k64K4J38n2k12K82p6q4K24j66K66m68K42k8R1k45L18l20K19r7k7K3
7232b4K56l57L6j62j03M68j46Q9O1k56Ll3J77j23Mj19J78R2J95m37L75j90k08
7255b24J40L93m73K57P0k74J66J83q7n8J55k94J44j71km1K62m10L75N9k72K97
$$ plain form
7094 341 84 -87 -60 32 290 -242 40 99 -9 127 120 6 -27 -3 -247 -139 46 328 30 -84 117 -129
7116 -129 -22 -370 -165 393 129 193 190 -43 -34 205 158 -146 104 143 -166 38 -44 1 58 -69 56 -129 34
7139 34 -105 265 104 -144 142 -51 -183 220 -72 -69 -108 -150 6 151 37 11 -116 -54 -157 -151 8 -192 158
7162 158 -30 -10 234 -166 -233 114 -95 -108 263 -185 115 -117 -53 214 50 -122 53 -109 171 117 294 -95
7184 -95 -217 -327 -302 35 -29 16 -47 -323 -110 -45 94 1 87 -140 -84 -156 -129 157 -46 -100 -70 -44 -391 192 -59
7209 -59 188 -76 -52 86 34 -178 104 28 -56 168 2 268 -200 42 14 105 -140 178 -142 77 -20 -47 -24
7232 -24 232 -125 -89 -251 -354 114 -32 57 118 -138 -135 -168 9 -114 -110 -229 -51 41 236 -201 174 -16 -224
7255 -224 -84 309 -164 93 163 -111 55 238 151 93 248 -46 98 -73 -75 -116 146 -264 111 170 -102 195
7277A95j46j62K88P3l25K29m29L03j44k17J55J76JL46m2o8l92J98K33p7l49Lm7
7300a98K58k38O0r9L81j32Q4j70L4K7R0r9J5j44J92j78o7K45k23N02l87J23n4
7323B2N4j67K66J9j36P1k56N4K79k69o1n8K64K12k28Lj08l4N7n5M8k12K20L06
7347B91k09j43k14L25j64K86j78j09J47j12q0P4J46j0k33J30J79j06L3j64J85
7368G4N0k52K92k77J71L54l96J90k91J50P0k77K99j52j22J04J7j23O5k13N33n57
7390b91L09L5n6j25J72QL5j54N5j04K86K8j00j57P1J99l46K41k32L82l28M2J46
7413A16j00j14N1p4R0J65k64J50r5j12K06P9j10J00k39l5L00j81l8j9N2j20J07
7436h5K04k48j0L14k57J45O2p0j16K57k31l2M4L12n4j15L8m4R3j72j42Q4j70J70
$$ plain form
7277 195 49 -113 175 248 -77 152 -277 26 -118 -335 -180 -4 -3 343 301 233 -159 39 272 195 -154 -151 -198
7300 -198 60 -178 -118 -217 164 32 116 -54 -20 7 97 -2 13 -131 61 -117 -184 61 -162 340 -47 76 22
7323 22 76 -91 175 194 58 129 -127 -73 206 -63 -124 -182 82 294 66 69 -39 -73 -16 -71 -23 -235 -15 291
7347 291 82 -61 -275 50 -114 172 -6 -115 32 -80 -160 -86 60 50 -183 -53 126 20 53 -111 74
7368 74 124 -128 164 -113 58 412 16 206 -85 65 135 -142 157 5 -117 -13 4 -119 -54 -267 266 -291
7390 -291 18 53 -3 -128 44 52 87 -67 -12 -116 170 198 98 -59 12 211 -135 106 -126 256 -72 -30 116
7413 116 16 -98 -47 -121 -31 134 -130 20 -75 -187 19 98 -12 88 -151 -186 114 -67 -105 -124 -72 -192 -85
7436 -85 119 -129 -139 175 -82 63 125 55 -61 196 -35 -67 -23 289 235 120 158 114 207 35 -107 -23 -193 -23
7460b3M9K30k86K52j58j65J32J30n8Rj44m5J79j96L24l11K36k11j42J72l0m4K79
7483A79j14k12K7K52j36J86j47k3J93j34k07L2K01j33p1K12mO3l47j87M27J67
7505B24l7m5k53J39j16K07j72j99J01K82l83L12R3k15m6n6J47r7l0K92j80j13
7527a45J67Q7j23k32K73J28l22K36R3k79K21r1j52K06j06M6o7n5j30M09N6j04
7549A16N7J30k03n2N60n53l7q7O1o3K97k47K30J22j89p6M8O7j22j38j84J49K73
7572A59l12J88L1n3j16L89R1m26k2N5J15l34K80j60j8M13m42J35l3J10j11K0j67
7595b08K22k85L69j8N9m9l40L88j48J17k02J05j88K5K78j14k46M25j82k1J12m0
7617E9K83l39j75J43P1j71J17j05k88L63J2P3k74K19p0J87j48j32L42j10O3j60
$$ plain form
7460 -23 26 256 -30 222 64 -101 31 161 103 112 -32 -77 102 -94 230 -81 155 -56 -198 -26 -56 -100 179
7483 179 65 -147 -120 132 -4 182 35 12 205 71 -136 -104 97 -36 -107 105 101 164 -183 -370 57 224
7505 224 187 142 -111 28 -88 119 -53 -252 -151 131 -252 60 153 -62 -108 -164 -17 -114 -144 148 -32 -145
7527 -145 22 109 -14 -246 27 155 -167 69 162 -117 104 13 -139 67 -39 7 -60 -115 -245 164 220 116
7549 116 173 303 100 48 608 55 18 -69 -8 -71 226 -21 209 331 142 66 114 181 59 -79 -263 -114 159
7572 159 -153 35 66 13 -103 286 377 -49 -71 -16 99 -235 45 -115 -133 280 -162 -27 -60 50 -61 -41 -208
7595 -208 14 -271 98 80 139 90 -250 138 -10 107 -95 10 -178 -153 125 11 -235 190 8 -13 99 59
7617 59 342 3 -172 -29 42 -129 -12 -117 -405 -42 -30 43 -231 -12 -82 105 -43 -175 167 57 120 -40
7639d0L60m59K04k0oM4j05j41K11m5k42J98J19k3J6P8m3M4j1k94J57j00j14M81
7663B69l47m7J03K11Om58K03p4J21J85j47m6q6R4K4j40K27j75L93k63l14N06m06
7686a61J20p4L36q4l39J45J80j39M6j40R0M2J49k19j69L53j07k9k2M2k39J88K74
7709B43j65O7k66K96k14n0Q2k32j98L56n1L3l0J18J79j88j50K37O9l84K61J12
7731A25j36j40N5N0n7K42j68j56K31Q6k67M00k78j0K12l44K94j47k13J16K15k56
7753a46J69J4M7j53L23k26J65L6q1k40j54L42k07j54K29l40K83J05k48L57l29
7774b08J07j39J79n6K19or8q9K48k04Q0k19L20L1j73O7r7P0j80J36j15J13j52
7797a66N6K86k45P5k6k7J55k17L0O7J6j52J27O6K01l84L9J07J74j05k76J89L6
$$ plain form
7639 -40 320 -139 65 45 39 83 -22 -163 48 3 -239 -41 78 55 71 149 106 150 139 -155 2 -98 -212 269
7663 269 -78 -125 -22 189 195 -263 -60 -134 -13 172 25 -21 -107 -13 11 -129 98 -77 316 53 -261 245 -161
7686 -161 -41 -115 221 137 -202 -57 123 -16 30 -110 -20 22 171 -48 -217 136 29 0 -22 20 -219 -31 243
7709 243 78 145 -121 175 -39 -89 -7 -239 -437 -81 -132 -99 -129 -11 168 -20 -170 67 136 -248 13 125
7731 125 -11 -151 -96 -46 -103 139 -29 -185 46 132 -135 265 -13 -23 189 -155 139 -8 -221 -105 110 -146
7753 -146 23 37 84 -69 254 28 193 229 148 -92 -246 96 -111 -265 -36 -376 -93 12 -236 121 -208
7774 -208 -101 -240 -61 -117 102 96 -2 -91 157 -47 33 -186 134 165 -8 59 -38 32 -148 -12 -127 -14 -166
7797 -166 -110 176 -69 6 -20 -47 108 -109 -79 -12 4 -148 -21 45 246 -138 -99 8 182 77 -199 -10 26
7820B6J69k30q6N0J47n3p7J61q8K67o19L54j25K16P5n28O04j65k10J05r2J40L07
7843C48o21K15R3K36l06J66j25J33K4k72p9R3J64j25K94n08J02K53j90n4J20J78
7865A39j78K44j6k76Q3j48J23L1J29k68J01N6q8L19k99j24K79m21J89K1K30M2
7887A68k98l7J59j68K24n2k6N7K53m28L9L64j61rm10L21j03J86j84K42k57J33
7909A3o3Q6j21J43j20M8J85l05k6n8j7M52l70k36J53K87J37j22j38N1o7J99k27
7932a16m0K10M1k4K66m11p3L52n59L86J25j3l65j24O21l55j72N25n10L13j72K06
7954A11Qj24J81m06R6K86Q0k95j8M6j22j01N39l89O4Rl5L5KJ4L87l59m8K60k70
7979d9N7Kj6j14J16J08j32j02l7J82Q5j06L4q5L01j56K43l66p8J0j06J14n5Q8
$$ plain form
7820 26 195 -35 -121 -71 76 23 -54 107 19 286 -333 21 -104 112 187 -341 263 98 -112 -7 -99 41 348
7843 348 -273 -58 35 271 -35 131 6 139 163 -109 -188 -95 69 -56 238 -270 -168 85 -105 -159 -39 139
7865 139 -39 205 189 -87 -4 -152 -29 2 131 -137 -36 20 -68 251 -48 -172 107 -314 -125 -104 126 168
7887 168 -130 -167 -8 -176 48 -4 -30 27 280 -148 -109 255 94 85 -325 -4 -107 79 -105 137 -120 13
7909 13 -50 36 -85 58 -62 -14 171 -134 -160 -218 -235 217 -153 -389 -236 51 188 66 -72 -21 -88 111 -116
7932 -116 -156 54 95 71 337 -74 -147 205 -354 32 157 144 -221 -345 276 -79 -251 274 -236 77 -95 111
7954 111 119 -5 176 -230 -134 152 232 -63 -81 -35 -157 -258 281 -108 -44 -35 -70 -35 -33 -19 368 9 -39 221 -49
7979 -49 8 10 -6 -120 -4 104 -28 -130 -167 15 100 -6 28 -57 244 88 331 -35 -113 -103 -209 -95 -150 -62
8003f2o9K57r4k90N57k38RQ6rk10P7R5K98l66r8J28N0k22L20k76P2j71K12Nk73
8028b12K33M6k81L31k28nN9j82L10j34q0PK40k33N8l14N23l94K75J1J87j35q3
8051aJ02l34K1J85J89r4Qj96J47J0p8K52k74J54Q9l30p3M75k85P4K8Q0k34J77
8075I2kn1j37l9K56l89L18o1%k40M28k05l19N62l32J81QJ43q8J59k66j4mj08O7
8100d1L60m11J77N4j0l58%J44j17L40k62q8J38K52p8l59K55jq6J01l6k22L29k29
8124a48n7N2j43J83O4K3k08M02k2n4k30m7q5L80O0j27J54k49K51j54m3j02l9J44
8148Ek52J59J08k68L23k39L20j37k11K90j14L13k74j16J5nK47m8k54M1q5L7L12
8171A67l14J70J49j53k35K46M3o5LJ11l69K12J35r2J04j50J19r4R1k27
$$ plain form
8003 -62 -131 126 32 -258 299 61 70 156 147 -63 14 109 407 41 -57 71 121 -101 219 -57 15 -156 56 61 -212
8028 -212 21 67 -214 117 -111 -116 -57 -239 71 -63 -143 -136 104 -129 -71 -385 138 -256 19 30 217 82 -1
8051 -1 101 -233 -212 -27 162 68 76 -120 27 37 -41 211 -63 91 180 -150 -223 252 -33 41 69 149 -85 92
8075 92 90 39 -98 -137 119 -270 48 -13 -13 -253 175 -30 -349 213 -119 62 70 213 125 284 18 4 0 -108 -41
8100 -41 319 -92 85 139 129 -229 -229 -85 -202 138 -124 -212 -74 178 100 -259 -4 -5 -91 10 -26 -248 81 -148
8124 -148 -205 -153 -296 -113 -49 -26 -234 168 146 92 -138 -185 -270 110 170 43 197 -52 199 45 2 -100 -139 5
8148 5 -247 -88 20 -248 75 -164 156 19 -192 98 -16 297 23 -93 -78 -83 164 116 -138 -97 -182 -145 167
8171 167 -147 23 172 19 -216 30 73 8 11 122 -247 -35 100 8 112 -38 81 -13 78 -149
8191a49
$$ Imaginary data points
##PAGE= N=2
##DATA TABLE= (X++(I..I)), XYDATA
0@%%%%%%%pJ5j6J6k1K9l2M0n6P0q6J04j21J45j76K08k48K94l42L98m60N31o11
30c26P00p99R08j030J164j312J476j656J853k069K305k566K849l154L492l862
46b027M265m706N187n714O296o936P641q428R307j0295J1413j2692J4171j5901
60h419J7963k0466K3582k7585L2944m0530N2172p2509J18097m05462J13283O68110
72D51180n29213l04641M28738L29420m19318j68544L45545K23805k53596j76675
82g3299P7492J20002q2658j40591j5990J56905L4469j56365q2968J41113L4630
93A2740j74510n1547K39941J56897j40961j50545J34265J80818q8358j69256J31637
104H1121K00684j92657l22501J11461K41722j92924k42321K50471K43500k54975
$$ plain form
0 0 0 0 0 0 0 0 0 -7 8 -8 8 -13 16 -16 24 -32 38 -48 56 -65 80 -96 112 -136 158 -184 214 -246 285 -326
30 -326 374 -425 483 -547 617 -695 781 -875 978 -1091 1214 -1352 1497 -1657 1835 -2027
46 -2027 2238 -2468 2719 -2995 3301 -3635 4006 -4422 4885 -5410 6003 -6689 7482 -8419
60 -8419 9544 -10922 12660 -14925 18019 -22511 29661 -42848 75249 -330213 -216930 451180
72 451180 -78033 -382674 46064 375484 -43834 -212378 133167 356972 103376 -73299
82 -73299 4193 124195 41537 -99054 -115044 41861 76330 -80035 -163003 -21890 12740
93 12740 -161770 -213317 26624 183521 42560 -107985 26280 207098 118740 -50516 81121
104 81121 281805 89148 -233353 -121892 119830 -73094 -315415 -64944 178556 -76419
114g6419j87435K78176J59152k05320j9315K32406j6227j93395K2474Q5799p3549
125F347j9814Q3757n3845j01458O4241L5535j30169k2903J46068J2087j12467
136i2621M6879J24812n1427r5955Q8835J28283l9171q5818K5001K7671q7897p4879
148h6287O4223O0377q5361p4141P8428M8322r4450l864J55131K2834j31058L5254
160a0592J46371p1625j44067R8163J18646j23761q9007J21471K1266j55138j0949
171i9222J28656j9741r2533M7280N6275n6883q718P1581j047k7249O0736K4483
183H3618p9003r240P7415l4957j06837L4613R1336o6109j10603N5918J01762n0428
195a2515p7544Q3443J06240o7817r8853P8429J05335q0034j02689Q2719Q5044
$$ plain form
114 -76419 -263854 14322 173474 -31846 -51161 181245 165018 -28377 -5903 79896 6347
125 6347 -13467 70290 16445 -85013 -20772 14763 -115406 -138309 7759 19846 -92621
136 -92621 -45742 79070 27643 -68312 20523 148806 109635 23817 48818 76489 -11408 -86287
148 -86287 -22064 38313 -47048 -121189 -42761 5561 -88889 -92753 62378 85212 -45846 -10592
160 -10592 135779 64154 -79913 18250 136896 13135 -75872 45599 66865 -88273 -99222
171 -99222 29434 9693 -82840 -35560 20715 -36168 -44886 26695 25648 -1601 59135 83618
183 83618 4615 -4625 72790 37833 -69004 -34391 56945 -9164 -119767 -63849 37913 -12515
195 -12515 -90059 -6616 99624 31807 -67046 11383 116718 36684 -66005 16714 101758
206A01758j06813q9384R6751O1615j05221m7480R2202K5329p3778l475N5716j849
218E371j3221K8629K816j2469L7836P807o7359k530P6094k7872j06256K4026Q9522
231D2394n7896r6759P1322R9669o6404p3522Q8527Q0626p2945n7828P9599N1940
243H8723p8243n1944O2997L2954p0245l7349N2930J9475n3485j5888M4259P249
255A433l1266P543K7715l652Q93K3686k111j4684K3336J4327m0055j5431L8748
268C0482j1450o4924M468N2131k8127n3651M2244N5424m1445l2594O6014L9417
280E7989n6209j6755O2301O287o3228j704N2000j6268n8011J1127M0957k3394
292d908m0764K2336L0778k4812k2860K9164K5453j6426o990K5700J2447j1987
$$ plain form
206 101758 -5055 -94439 2312 63927 -41294 -88774 3428 28757 -45021 -48496 7220 5371
218 5371 -7850 20779 23595 11126 48962 56769 -10590 -13120 62974 35102 -71154 -47128 42394
231 42394 -15502 -112261 -40939 58730 -7674 -81196 7331 87957 15012 -42816 36783 88723
243 88723 10480 -41464 21533 54487 -15758 -53107 -177 19298 -34187 -50075 -5816 1433
255 1433 -29833 -22290 5425 1773 2666 26352 24241 9557 32893 47220 7165 -8266 30482
268 30482 19032 -45892 -41424 10707 -17420 -71071 -28827 26597 -14848 -47442 18572 57989
280 57989 1780 -14975 47326 53613 -9615 -11319 40681 24413 -33598 -22471 18486 -4908
292 -4908 -45672 -23336 7442 -17370 -40230 -11066 14387 -2039 -9029 16671 29118 17131
304A7131K058J0338r117r259J955j4194k1506P957J0581k5121j5263L4657J7657
317G874l3004K23N2048N106m6663Q737N1725j5175n1151J9364M2747l1171m4107
330c3447K9859L2730l6503l2186L0165K0891l0252j5087K8764J4252j7075k795
342a0684K1477J0552n837k472L087J22k843p739j2623k271O938o724j7913N459
356b1471K3190k967k0982J3499L2814j0656l1072J9096L4989k3279l5408K6057
368C810L0642l2740k9829L3452K1725l8522k0517L3402J1278l0079n159K5474
380B937K664j6396O282J6693k94m956N37j222J103K920q430j1648N770O946j3274
395a0368r240J6631J1141j5997q324K0943J3862j6128j1870J6594J3948j9350
$$ plain form
304 17131 19189 29527 20410 11151 13106 -1088 -22594 -14637 -4056 -29177 -44440 -9783 7874
317 7874 -25130 -24907 27141 32247 -14416 -5679 46046 30871 -20280 -916 41831 10660 -33447
330 -33447 -3588 29142 -7361 -39547 -9382 11509 -18743 -33830 -5066 9186 -7889 -10684
342 -10684 10793 21345 15508 13036 16123 16245 13402 5663 -6960 -9231 -2293 -9017 -26930 -21471
356 -21471 1719 -1248 -22230 -8731 24083 13427 -17645 1451 36440 13161 -22247 3810
368 3810 34452 1712 -28117 5335 27060 -11462 -31979 1423 12701 -17378 -22537 2937
380 2937 5601 -10795 -4513 12180 11886 6930 7467 6245 7348 10268 1838 -9810 -4040 2906 -10368
395 -10368 -19608 -2977 8164 -7833 -16157 4786 18648 2520 -9350 7244 21192 1842
407A842j6367J9431J5426k4609j8390K4251J3612k7292j1038K8271O433k6466
419a4896J185K6650l934j8275J1432J4792j0775o718R865j486j0447L177K04j2320
433a1546K157J0498r080j0330J5856R319j5436J27K2656J948j8244K877J4809
446A5611n211j2771L134P848o259j1262j607P853K122j1529m465J6073O160j5565
460i868j731K1576L259j8031O145K0519p877j6052P943N361j3401l112P062q142
474f349q313Q336q60j1794J0502J5819j0277o659K1380O191k0332K168K1206o242
488A4776j7494P645P828j5337r094R288n8q460J482K620l521K068L422j606N913
503e28J0324l183l491J0650K454j2823J016J1039q855j2751N889P25j6019j180
$$ plain form
407 1842 -14525 4906 20332 -4277 -22667 1584 15196 -12096 -23134 5137 11570 -14896
419 -14896 -13711 12939 9005 -9270 2162 16954 6179 -539 9326 7840 -2607 570 774 -11546
433 -11546 -9389 1109 -7971 -18301 -2445 6874 -8562 -8435 14221 16169 -2075 802 15611
446 15611 10400 -2371 763 8611 2352 -8910 -10517 -2664 -542 -12071 -16536 -463 5697 -9868
460 -9868 -11599 9977 13236 -4795 1350 21869 13992 -2060 5883 11244 -2157 -5269 1793 -6349
474 -6349 -14662 -6326 -7186 -18980 -8478 7341 -2936 -9595 11785 17976 -2356 -188 21018 14776
488 14776 -2718 4927 12755 -2582 -11676 -2388 -2446 -10906 -9424 -6804 -10325 -8257 -4835 -6441 -528
503 -528 9796 6613 3122 13772 16226 3403 4419 15458 6603 -6148 -259 466 -15553 -16733
517a6733J1953l559n412J0714K815p944P680J1518p690k157J7668j717j9545M434
531B025J3717j3884j2799J4181L905j9490l042J3285n407r132J0883P825n846
544c779K190P496k555R94Q312k796o050P666N82j6099l933J0835n300j1634P914
559f157O771j0508k914J0425L28j927R434K883p329L506O930r270l054J2587k121
574I584j5577M121R134j3079r719J3221M056j3147K595J1735n061o110J1075M418
588G246o107N375O340r259m730P612k973r617N355N059j0554l372R076k434o978
603i961Q757P273p853p94Q597k672o186O318L752o372N86M758p161n446Q097j9
619A674q971L627P681p480n399J0074K869p899L991Q858n547n495O771j76q433
$$ plain form
517 -16733 -4780 -8339 -13751 -3037 -222 -8166 -486 11032 3342 1185 18853 17136 -2409 2025
531 2025 15742 1858 -10941 3240 7145 -12345 -15387 -2102 -7509 -16641 -5758 2067 -3779
544 -3779 -1589 5907 3352 4346 12658 9862 3812 11478 12060 -4039 -7972 2863 -2437 -14071 -6157
559 -6157 614 -9894 -12808 -2383 -2055 -3982 5452 8335 1006 4512 11442 2172 -882 11705 9584
574 9584 -5993 -1872 7262 -5817 -15536 -2315 1741 -11406 -8811 2924 -2137 -8247 2828 7246
588 7246 1139 6514 12854 3595 -1135 6477 3504 -6113 -758 4301 -6253 -9625 -549 -2983 -9961
603 -9961 -1204 6069 -1784 -2578 6019 3347 -2839 3479 7231 859 1445 6203 -958 -6404 1693 1674
619 1674 -7297 -3670 4011 -3469 -8868 1206 4075 -3824 167 9025 3478 -2017 4754 4578 -3855
634c855K660M962o359l118N755k585o227P115O244o222q00Q414k112o407N557
649C022M964o772j984N211l668n837L787J160n958J218N817l282l807O122J636
664A629m558L807O678l786k996N264L57o865J005M143n065m856L095m69m861J690
680e788L721k756R90O050j86l163M174L943l239j36M762l219n927K343J191o149
696c389j715L570k464l922K527K407j601J538L850m91N92N152L19l957K511L503
712H430m120l766K785o02o951r71K007j711k634K051J063p07K819K487j99K868
728B849L763j610j974L788J455n362k037K744k052n611k39J137k076j360O77O11
744e297Q83L171O32k93L291L278j318q40L708q3m165q40R83k603k646m30j033
$$ plain form
634 -3855 -1195 3767 -2592 -5710 45 -2540 -8767 -1652 4592 -1630 -2430 5984 3872 -2535 3022
649 3022 7986 1214 -770 4441 773 -5064 -1277 -117 -6075 -4857 960 -2322 -6129 -7 1629
664 1629 -2929 878 7556 3770 774 6038 6395 -470 535 4678 -387 -5243 -2148 -2617 -7478 -5788
680 -5788 -2067 -4823 -3833 2217 2031 -1132 3042 6985 3746 3610 8372 5153 -774 1569 2760 -3389
696 -3389 -5104 -1534 -3998 -7920 -5393 -2986 -4587 -3049 801 310 902 6054 6373 2416 4927 8430
712 8430 4310 544 3329 2727 -4224 -5195 -3188 -4899 -7533 -5482 -4419 -5126 -2307 180 -19 2849
728 2849 6612 5002 3028 6816 8271 2909 872 3616 1564 -4047 -4286 -3149 -5225 -6585 -5908 -5297
744 -5297 -4414 -1243 -611 -904 2387 5665 4347 3507 7215 7132 2967 2127 3110 507 -2139 -2569 -3602
761c602k139M35J050p68J188K308Q44L58K864J742j544J057J823p71k490M15o19
778B151k553r13J10k231j839J659P7j668J458L179k24n07K606K216k65L86K97
795C939p31n08K21j217k124j89n64k230m31J750K22j526Q2K116Q06N46Q20J007
813A989K12J13j10l1Q97o93k950L0J648q94k743K00J638j336j214K095J388j407
831a168o4J929O35k32O77n90q60R01K26j953l81R66j67j600O43J776j280j202
849a744J585J147j253l01J473j08j007m89J318L96j338j211Q65J699r64j477J004
866d05J720j385j183K233J299j922j276J825L33j537j15J004j793q46J307M29
882c12j311O64Q70j464Q36K827o98j833J674K181k473j278K644J02l558r60K352
$$ plain form
761 -3602 -5741 -5306 -4256 -5024 -3836 -1528 -684 -326 2538 4280 2736 3793 5616 4845 2355 2770 2151
778 2151 -402 -1315 -1205 -3436 -5275 -3616 -3539 -5207 -3749 -570 -794 -1301 1305 3521 3256 3642 3939
795 3939 3208 2700 2921 1704 -420 -609 -1173 -3403 -3834 -2084 -1862 -3388 -3306 -1190 -384 162 982 1989
813 1989 2201 2314 2204 2173 3070 2377 -573 -543 1105 211 -2532 -2332 -694 -2030 -3244 -1149 239 -1168
831 -1168 -1232 697 1332 1100 1777 1187 327 1228 1454 -499 -880 86 -81 -1681 -1038 738 -542 -1744
849 -1744 -159 988 -265 -566 907 799 -208 -697 621 1017 -321 -1532 -667 1032 68 -1409 -405
866 -405 1315 -70 -1253 980 2279 357 -919 906 1239 -298 -413 591 -1202 -2048 -741 -312
882 -312 -1623 -959 -89 -1553 -717 2110 1412 -421 1253 3434 961 -317 2327 2429 -1129 -2089 263
899B63n51k667J45J790l50r60J728O20%N78M06P45L96K04p36L36j63j358m46K00
919A80j244j754R48J44j665O42J921p38r81K944K070k137L23L216j08k799J370
936B332J876l144k457K384p77l732M94K879k734k469L428K647k646k05L853L90
952B119j378J627J672j030p03J0o45o28j70j700j179N4k09j076K02P90n1K44J097
971i54J469J82J235N51q87J132J678k608j954K368j05m516m13L982k135m831K464
988c342L989k825k039M302J707l285J072M264q77k263K108R65k806l68J636k009
1004B29k720J331P30j934o64J156J27j053J711J595O0n7L01O14J274Q7j491L55
1022A651P64j622j764J426J32l435j31K866j202k203K831J504l052O5N198p79
$$ plain form
899 263 -288 -2955 -2810 -1020 -1370 -2330 -602 18 18 596 1002 1747 2143 2347 1611 1947 1784 426 -20 180
919 180 -1064 -2818 -1870 -1726 -3391 -2749 -828 -1566 -2547 397 2467 330 653 3869 3761 962 2332
936 2332 4208 1064 -1393 991 214 -3518 -3024 -145 -2879 -5348 -1920 727 -1919 -2124 1729 2119
952 2119 741 2368 4040 3010 2307 2317 1672 1044 874 -826 -2005 -1951 -2160 -3236 -3034 -2244 -2295 -2051 -954
971 -954 515 697 1932 2483 1596 2728 4406 1798 -156 2212 2107 -2409 -2822 1160 -975 -5806 -3342
988 -3342 647 -2178 -4217 85 1792 -1493 -421 3843 2966 703 2811 3776 970 602 2238 229
1004 229 -2491 -1160 -430 -2364 -3028 -1872 -1745 -2798 -1087 508 568 511 812 1426 2700 2787 1296 1651
1022 1651 2415 793 -971 455 587 -2848 -2979 -113 -1315 -3518 -687 817 -2235 -2170 3028 2249
1038B249l510K125L237l130k158L910K86m593J68L559k600k606K642R16l065m7
1054b617L554q18k639K464J895j619m56J481L08j162l30P63K50m32j440J36J338
1071F76l74j854P80K048k004j502K819R72l011k6L081j106k195K476J182l688
1087a726J5M041p76l843K598K527l690j280M043J61m232J015K733j947k302K660
1103cR71l054K22L029m62k131J732R94j019l99J367N07j051k17R5J33l75j449
1121a110M84Q03q87j928J344J893j957r94K948O54k012O38K619p75j791K491Q07
1138C227l540L78K588k263l588K548J718l539j685M329p2l292J334L344j343q53
1154g09K281J631k155k46J808m92k080Q88n2j398q65L49l78n40n29P69O47m91
$$ plain form
1038 2249 -1261 864 4101 971 -1187 2723 3009 -1584 -1416 2143 -457 -3063 -421 495 -2570 -2617
1054 -2617 937 119 -2520 -56 1839 220 -236 1245 1553 391 61 824 1074 642 -798 -662 676
1071 676 302 -1552 -772 1276 -728 -2230 589 1561 -1450 -1476 1605 499 -1696 780 1962 -1726
1087 -1726 -1711 2330 1554 -2289 309 2836 -854 -2134 1909 2070 -2162 -1147 1586 -361 -2663 -3
1103 -3 968 -2086 -1864 1165 703 -1428 304 1298 279 -120 1247 1754 703 486 581 714 339 -1110
1121 -1110 -626 177 -710 -2638 -1294 599 -1358 -2352 596 1250 -762 -124 2495 1720 -71 2420 3227
1138 3227 -313 65 2653 390 -3198 -650 1068 -2471 -4156 173 101 -3191 -1857 1487 144 -709
1154 -709 1572 3203 1048 802 2610 2118 38 926 874 -524 -1389 -1040 -1418 -1958 -2487 -1718 -1071 -1562
1172a562K57J276J778j079j48J816J241k480o56K277r03k954O37J521k279j915
1188c173K045L59k380R18K714q80j725K899K119k568m5K926J7l074P64J977j765
1205A128k572J014O89k077q42J192M53j028J3J296M79R2N74J011L52o63M41N18
1223B070p36q70N63O7k006q21J463m21k076L53K499r33j492J457K288j383p90
1240g68K632N24k283N59K318j743j638P84J177k151r90J250K38j805J60J879r95
1257h52m94J358J048j115j3R66O21j213r7R12r3j447O2R68m50j426N05P57j80
1276a83j198J308M71j388m9J708k25j280Q08J223n55j586J340R44j673k50J626
1293A041l87j675O79J374q56j180Q71P60j333j05J165j73j143N97P61p13q16J557
$$ plain form
1172 -1562 -1305 -29 1749 670 522 2338 3579 1099 443 2720 1817 -1137 -500 1021 -1258 -3173
1188 -3173 -1128 -769 -3149 -2231 483 -397 -2122 777 2896 328 283 3209 3226 152 916 2893 1128
1205 1128 -1444 -430 259 -1818 -2660 -1468 -1015 -2043 -2030 -734 -255 -163 411 1422 1774 1111 1552 2070
1223 2070 1334 464 1027 1094 -912 -1733 -270 -691 -2767 -2414 85 -848 -2340 -883 1405 22 -768
1240 -768 1864 2388 105 664 2982 1239 -399 385 1562 -589 -1579 -329 -91 -1896 -1736 143 -852
1257 -852 -1346 12 1060 -55 -68 898 1519 306 209 1121 1028 -419 -357 611 161 -1265 -760 -3 -183
1276 -183 -1381 -73 398 -990 -1039 669 444 -836 -28 1195 640 -946 394 1338 -335 -585 1041
1293 1041 654 -1021 -342 1032 176 -1004 -133 627 -706 -811 354 181 -962 -365 396 -317 -1133 424
1311D24O09j052k27P73O40j010j51P46Pj001l52N38N2j252N30N01m27n91J075
1330a68N63o97j11J102P35j654N41J463o97j391R92P04j748n69O29j33j287O65
1348a061M73n96k35J323M95j059O48J091j16m84Q28N31r40p72K69M71j144o40
1366i18N17J17r61j60Q78K3r39O3J412O73n21O4J105j39m74K70N15n72q33L62
1386D82k82j264K90K32q12n93J095O30r36L06J608N6q95Q32J053q73m38L63O99
1405A553p98p01K14n41l67k36r6o56N37K60p4j54J112K04j10j53P40K42J71l14
1425H33k72O13l72p77p38R82l77r91L16M91n16m97O78N33l60K77P64M3o87R01
1445H44L56n83n0N48m46r37M62N70j073q42Q46M76j182J61N55j40l21M56N69j1
$$ plain form
1311 424 1033 -19 -246 527 1167 157 6 752 759 -242 -594 -56 -4 -1256 -726 -225 -652 -1243 -168
1330 -168 395 -302 -413 689 1424 -230 311 1774 1077 -314 678 1382 -366 -935 -306 -439 -1726 -1061
1348 -1061 -588 -1184 -1419 -96 399 -660 -12 1079 963 479 1307 1838 898 126 395 866 -278 -918
1366 -918 -401 -284 -1245 -1405 -527 -504 -1443 -1380 32 705 184 248 1353 1214 740 1010 1525 953 120 482
1386 482 200 -1064 -774 -542 -1354 -1947 -852 -222 -1158 -852 756 812 -83 749 1802 929 491 854 1553
1405 1553 755 54 268 -273 -640 -876 -972 -1628 -1091 -831 -905 -1059 53 257 147 -6 734 976 1147 833
1425 833 561 1174 802 25 -713 269 -108 -1099 -783 -292 -808 -1305 -627 -94 -454 -177 587 630 -57 844
1445 844 1200 617 567 1115 669 -268 194 764 -309 -1151 -305 171 -1011 -850 -295 -435 -756 -300 269 258
1465B58k34P25k95J27L13m36n1j57l5j35l55o5l85k5L43l18j9J99R5l43L75Q51
1487D33r5l22O25L11o90K74Q07o86r53O05M07j059l25M06l8q62L59L56k23j10
1507g80O98L04m98M28Q03k91m17O32P0n53J86L55p89l23n3l00n83M60j04j17j58
1528a030P28j59L96M47k29J78L82L51l69n83R13j53p22j36K01k38r67M06J47r50
1548a387L76O97p09L55J161m83j16O31P83q45O9O68j18r71K50l6n23k37k05O0
1568e80j52o6K17j31K94L91J38k63P10M45q79j9P87j29k79O7J0m95nJ86r60J54
1590e59L33k83n67L97O84k82M4N45K66n80K84M65j87p6j66J10k41K08m49l90o7
1611e11O72m51m62K76N00m24l54O74L47n24K44K40n1L77O8l74p9O73j71j078J16
$$ plain form
1465 258 24 749 454 581 894 458 407 250 215 80 -275 -340 -725 -750 -407 -725 -744 -545 -450 -793 -418 433
1487 433 338 16 641 952 262 536 1343 657 -296 309 716 -343 -668 -262 -300 -1162 -803 -447 -670 -780
1507 -780 -82 222 -276 152 955 664 247 879 949 396 582 937 148 -175 -228 -528 -1111 -651 -755 -872 -1030
1528 -1030 -302 -461 -65 382 153 331 713 1064 695 112 1025 872 150 14 215 -23 -990 -584 -437 -1387
1548 -1387 -1011 -314 -1023 -668 493 10 -106 525 1308 463 532 1200 1082 111 361 325 -198 -435 -640 -580
1568 -580 -732 -798 -581 -712 -418 -27 111 -152 558 1003 124 105 892 763 484 551 561 66 61 247 -713 -559
1590 -559 -226 -509 -1076 -679 5 -277 -233 312 578 -2 282 747 560 484 318 428 187 395 -54 -444 -511
1611 -511 161 -290 -752 -476 24 -400 -754 -80 267 -257 -13 227 176 553 621 247 168 841 670 -408 -292
1632b92O58q21m64O69K1m42J26O12l33k11K18O84m13K39N07o25J96L23l7n76L94
1653D33J54l73m56K17P1l66k37m44K22K36M48n47L19L19K17l98O45N19j62l75
1673D42K03J86m02qj70n65k51K61k64o06O39L5l70K01N25M83l75K82M32K2q7K82
1695H95J2l31K24l33p45K06j89l87m7N7j95J56%L55k09O88J25Q3J05M07J27k40
1717G64J5K77o70l09N4m2o93l01O08m38r5o2J95M65kL78L73J3O1M80m31N1K90
1740I81k57o88j75K90k64k97p4j92j75L11l14L35L41R5Q0J69L43J52j91J42j48
1761D64O4J06j51n64K7l8m80j22mJ16j43q8N79k07J06J05L60J07j76M90n0k11
1783B90J5O0K01o23J77q0p42k1L03k69J39K95J17r5J03j01M48lj22P9L82L4K8
$$ plain form
1632 -292 366 -455 -919 -250 -229 -671 -545 67 -266 -477 -259 425 12 251 758 133 329 652 615 39 433
1653 433 587 214 -242 -25 46 -320 -557 -1001 -779 -543 -95 -642 -323 -4 213 -185 460 979 817 442
1673 442 645 831 429 421 251 -314 -565 -304 -568 -1174 -535 -500 -870 -669 -144 339 -36 246 678 700 613 895
1695 895 907 576 800 467 -278 -72 -261 -648 -695 -638 -833 -677 -677 -322 -531 157 282 365 470 877 1004 764
1717 764 779 1056 386 77 131 89 -604 -905 -297 -735 -830 -892 -697 -232 -234 144 517 530 591 1071 640 691 981
1740 981 724 36 -139 151 -113 -410 -484 -676 -851 -540 -854 -519 -178 -83 -3 166 509 661 470 612 464
1761 464 528 634 483 -81 -54 -92 -572 -694 -698 -582 -725 -813 -234 -441 -335 -230 130 237 61 551 501 290
1783 290 305 365 566 -57 120 40 -702 -723 -420 -689 -550 -255 -138 -233 -130 -231 217 214 92 171 553 587 615
1806F15m81J4L94o32O8%l20J95j28M1j48K41L1mk47N02M34n06j00Q76l61l43L03
1829D44K00l45j74j06Q3o3n95K82k04l9K28j33P0K23K36k54Q9M68r2k97K59L11
1851E91K7k67k33j03j08K77n20k16L09j70n16L27K42m3n9J71N63j33Q3K42M0M0
1873E44l03J55l12L03q4l84l49L64j62j96j29J49L49l22RN3J06L91r8J14J83J13
1895D94O1J7k17K47n51j48K78l22n3j92k22L04l14J63K09O5L93k83J93Q6M42m16
1917B34K89J11j30k95p1J17k01q6k98j7j45k57K77j81K05L55j00L05l8L41K38
1938F53j96o7L44m74m2L91l22k81o6j91p1j45O3j92n4K97K26o4j40P75j2j51L38
1961F19k53P6J95j40k02q7j60N2o21J45L1l86J60N1J99j22M20j38N75l03M70J11
$$ plain form
1806 615 134 148 542 -90 -22 -22 -342 -147 -275 -234 -382 -141 -110 -114 -361 141 575 69 -31 845 484 141 444
1829 444 644 299 125 19 102 39 -556 -274 -478 -517 -289 -422 -352 -129 107 -147 -58 410 318 21 280 591
1851 591 618 351 118 15 -93 184 -336 -552 -243 -413 -929 -602 -360 -403 -462 -291 272 139 222 464 504 544
1873 544 241 396 84 387 303 -81 -430 -66 -228 -424 -553 -404 -55 -377 -368 -315 -209 182 84 198 381 494
1895 494 555 572 355 602 51 -97 181 -141 -194 -386 -608 -304 -618 -455 -246 -181 212 -71 122 208 650 234
1917 234 523 634 504 209 138 255 54 -32 -330 -347 -492 -749 -472 -653 -448 -93 -193 112 74 415 653
1938 653 457 390 734 260 218 609 287 6 -60 -251 -322 -467 -404 -596 -650 -353 -127 -191 -331 444 432 281 619
1961 619 366 442 637 497 295 208 48 100 -521 -376 -345 -731 -571 -520 -321 -443 -23 -161 414 111 581 692
1983F92l57J90M6k88N2J90o27k44K22k95j75j48K66J18kN9K90J40Q5J17J08L14
2005G53l99M04l00m1j48l9k42j30k33j1q2j04J92m04M46R2L71k18M94j24N1J42
2027D70n5o6jJ29k38pl18Q6k21l13o3J70J03j94k3J83R0M99Q2m21K52K98Q0l43
2051A79L78n32M07j08p96K47J60l37j48J09M06k18j33M28J25j11M0j89L22J26
2071C55Q6n9k25r6K12j96j2P8l95M9m39N13j1k99L06J07j53p1n4K85J63J61k18
2094H7L01l18K15k79J15J93k89o0P4J40k32l90o0L43J38m1j31j64J64L20K5k9
2116A22L60l3j74K9N4r0l72L36K2m85rK15r2n19L47M0j8J5J36L9R7J74J10J44
2140D48q1ol8K20k92r4k16J38l84j15p4J21n2k27L18KJ14j32K19K97j25M6K03
$$ plain form
1983 692 335 525 571 283 335 525 -102 -346 -124 -419 -594 -742 -476 -358 -360 -301 -11 129 214 331 439 753
2005 753 354 758 458 417 269 230 -12 -142 -375 -386 -468 -572 -380 -784 -338 -246 125 -93 401 277 328 470
2027 470 415 349 348 477 239 232 -86 0 -221 -534 -597 -427 -324 -518 -541 -358 -268 231 313 -108 144 442 522 179
2051 179 557 25 432 324 -472 -225 -65 -402 -550 -441 -35 -253 -386 42 167 56 96 -93 229 355
2071 355 441 382 157 61 273 77 65 143 -252 -203 -642 -129 -140 -439 -133 -26 -179 -250 -304 -19 144 305 87
2094 87 388 70 285 6 121 314 25 -35 39 179 -53 -443 -503 -160 -22 -63 -194 -358 -194 126 151 122
2116 122 482 449 275 304 358 268 -104 232 254 -231 -240 -25 -117 -636 -289 -249 -267 -252 -116 -77 20 194 304 448
2140 448 367 361 323 543 251 157 -59 79 -305 -420 -494 -373 -425 -652 -334 -332 -218 -350 -131 166 41 87 290
2163B90P4L92m79L51n56J82k79j83l40K98m8j93L9r8l6P7L05J52j8M32R7J52q
2186F03J82m0l23K62m08r4k45j14j38j07J6k67J81K27N5k75M68L09l05J46J31
2207B64K69QL8o5n16M50m45l6m00J91m66Q6j70L05K78l08L83K67R6J56J68j69
2229C84j2M4L69m42l11nq1oK9l70r0o7P4j13J10M81j55K07P4J42N6K36Q4q8q8
2254D62j4M0l39R5l80j6l91J29p2P2L41k63k42K23K81J68L13j56L40k1k95K30
2276E05l02n7r2M5j32k57J21l90J71l8p0M7O26j43k88K87L32M5j71J77l1k53K75
2299D07j19r5k03K72q5m59qq4P8l25L48K11K5j84J1M31j24K24k8%j17L53j09k17
2323B03nk64J12k75N7K07k94K88k08l10M77k49L54k43N58k99K79j74N2M9l63M02
$$ plain form
2163 290 364 756 277 628 72 254 -25 -208 -548 -250 -298 -491 -452 -550 -586 -509 -204 -52 -70 362 459 611 603
2186 603 785 745 422 684 276 182 -63 -177 -315 -422 -406 -673 -492 -265 -210 -485 -17 292 -13 133 264
2207 264 533 541 579 514 -2 448 3 -33 -433 -242 -708 -622 -792 -487 -209 -517 -134 133 229 385 553 384
2229 384 372 416 785 343 32 27 -54 -60 -31 -401 -491 -558 -484 -597 -487 -6 -161 46 120 262 318 554 638 550 462
2254 462 448 488 149 244 -136 -152 -543 -414 -486 -414 -73 -336 -578 -355 -74 94 407 251 591 570 275 505
2276 505 203 146 54 99 -33 -290 -169 -559 -388 -426 -496 -449 177 34 -254 33 365 410 239 416 385 132 407
2299 407 288 193 -10 262 177 -282 -290 -374 -296 -621 -273 -62 -37 -221 -210 221 97 321 293 293 176 529 420 203
2323 203 198 -66 46 -229 -172 35 -259 29 -179 -489 -12 -261 93 -150 408 109 388 214 266 315 -48 354
2345C54j70p9q1n8k23j21K02p8M0K55m33J49q5L62J76l11J79L72l67P9L20n79
2367i7L7R7K48l23M3q5L7m31K4K73l90K92k8K42l5J0N4oK21m0q4P0K30j68j0m9
2393A32j59k90L5J69Ql04K0R6L29j39Q2L40k46J79k7M5N1P0N2l94M50k78k44j25
2417a48K44k02j73m86L71j49j6N33j65L51M3j3J10j67J70K56k48K3j00o4r7M3
2439A16k64l81M98l88K02k83M67p3j14P5K39M2J03M15k52k60L16k7l15j24j46
2460a54K26k08qj82k03K35l3J44J42L5L12l79J83M24k43K8J04J18k06k75j09N1
2482BLj23l26J04K5r9q7L15j8J65M2k4K44q4M53ln37N71m27J32l97j97K05l36
2506c97O6J18n7k55J01K00j26K42L17j49R6o9L51k56J72k29l1K61k30k63n8K1
$$ plain form
2345 354 184 105 24 -34 -257 -378 -176 -254 -214 41 -392 -243 -328 34 210 -101 78 450 83 162 482 -97
2367 -97 -60 37 285 -38 5 -80 -43 -474 -450 -177 -567 -275 -303 -61 -96 -86 -32 -38 183 143 59 129 359 191 181 132
2393 132 -27 -317 -282 -113 -105 -409 -389 -293 36 -103 -21 319 73 252 225 270 321 391 443 49 499 221 -23 -148
2417 -148 96 -106 -279 -765 -394 -543 -559 -26 -191 160 203 190 300 133 303 559 311 334 234 170 73 116
2439 116 -148 -529 -31 -419 -217 -500 -33 -106 -220 -145 94 136 239 654 402 142 458 431 116 -8 -154
2460 -154 72 -136 -144 -326 -529 -294 -327 -183 -41 -6 306 -73 110 534 291 319 423 541 335 60 -49 2
2482 2 5 -118 -444 -340 -315 -414 -501 -186 -204 -39 3 -21 223 139 592 589 52 623 196 328 -69 -266 -61 -397
2506 -397 -331 -213 -270 -525 -424 -224 -350 -108 209 60 156 87 438 182 354 125 94 355 125 -138 -196 -175
2528a75K99k99j59j21J35L75o47K67L30J98J81n15L80n3q0m8K9j3rj40J95j16
2550A4j89j57j23K53j12L69l54%J45J43J5j26M62q4r4j0N6L75k05k50r2rK8j42
2574h7j91n5M18n24l4J65K02J45k13J99J31p3Q8j33J05J38j09Q6l0j12n6q1k61
2597b82L31j66o32O59J95k02j72l1K53J94J0o3j41J26N40l30l15J14j1k63K43
2618E7k67k27N1J03m0J00K11j8j37K77j14o9M41j59L71p28R7R0K30k89j21MJ1
2641a26N9l08p9k5L04j83J49P8J36J49k4K13j15p9MN4J84L7l16kl73Q6J53j78
2665b02O3o5oJ47j91K6K90J14m71N35k4J98M8m9j93Q9j43l56L73l26R3j66K9j73
2689c60O6l5oL69m17O00K24l47L4l0Q7P3O7l51M3k49K20k47mJ03l9O5j64R9j55
$$ plain form
2528 -175 124 -175 -334 -455 -320 55 -592 -325 5 203 384 -131 249 196 116 68 97 84 75 -65 130 14
2550 14 -175 -332 -455 -202 -314 55 -299 -299 -154 -11 4 -122 340 256 162 152 208 583 378 128 36 27 55 -87
2574 -87 -278 -333 85 -439 -473 -308 -106 39 -174 25 156 83 171 38 143 281 172 258 228 116 60 -21 -282
2597 -282 49 -117 -749 -90 105 -97 -269 -300 -47 147 157 94 -47 79 619 289 -26 88 77 -186 57
2618 57 -210 -437 -386 -283 -323 -223 -12 -30 -167 110 -4 -73 368 209 580 -148 -51 39 269 -20 -141 -137 -126
2641 -126 -67 -375 -454 -479 -175 -358 -209 -131 5 154 130 343 228 149 153 207 391 428 112 110 -263 -177 -24 -202
2665 -202 -139 -204 -210 -63 -254 -228 62 176 -295 240 216 414 462 413 220 309 166 -190 183 -143 -50 -216 -187 -360
2689 -360 -294 -329 -335 34 -383 217 441 94 128 98 185 258 325 -26 17 -232 -12 -259 -263 -160 -199 -134 -298 -199 -354
2714c54Q8J48j3J78m9L41Q3l40N97m27l82M29k3j86k8M5l5k95j6K51l07m7J61
2737a81nR0K17k8k70M74P7j04J22k12j0J81k28k77R5j51L16l62m2J61L72n20L35
2760E0k77P0J00K4k42N39K07m62P3K09j10Mj59J40l71J53r2L32k73n5j29Kk4K02
2784h9pR9j53K6K70k5J49j3l48R1L36j22n89K31O0N1j71j99K85K13k47m0J44J1
2808c7K97k26K33o2J48k21K30j40j42j08m6j8k75J11j1K12m56N36k05q2J83j3
2830i2M81j55m5O4P9Jj74J2k39j5j72J30k2j50J16k70L40J01l4k33L60k61J36
2853d2K18J79j39J5R1j4j75j23k2o8k1N5l28R5K13j09j08j6K7NQ1L22n1J04K16
2878D05m86L15J11p7k13L3M08m28k32j14j04l5l6O31l03k04K40N5J69M1q8o3O8
$$ plain form
2714 -354 -266 -118 -131 47 -2 339 422 82 679 252 -130 299 276 90 62 107 72 -223 -239 12 -295 -342 -181
2737 -181 -186 -96 121 93 -177 297 374 270 392 180 170 351 123 -154 -59 -210 106 -256 -298 -137 235 -285 50
2760 50 -227 -157 -57 -33 -275 264 471 9 82 291 181 185 26 166 -205 -52 -144 188 -85 -140 -269 -267 -291 -89
2784 -89 -96 3 -150 -124 146 121 270 257 -91 0 336 214 -375 -144 -84 -33 -204 -403 -118 95 -152 -192 -48 -37
2808 -37 260 34 267 205 353 132 362 222 80 -28 -74 -92 -367 -256 -267 -55 -511 25 -180 -262 -79 -92
2830 -92 389 234 189 253 332 333 159 171 -68 -83 -255 -125 -147 -297 -181 -451 -111 -10 -44 -277 83 -178 -42
2853 -42 176 355 216 231 322 308 133 10 -12 -80 -101 -46 -374 -279 -66 -175 -283 -299 -272 -267 -186 136 85 189 405
2878 405 -81 234 345 268 55 88 496 68 -164 -278 -382 -417 -453 178 -125 -329 -89 -34 135 176 88 25 93
2901I3j5Q0m3j4J0O7k58J17k09P6N6j98j45m1L75J87j07n49N36J83j01r7K35r0
2925A48j25K25k0l56K54j89l41J94K77k95j35J53K2J31j7p2M34l11o4P3J56L9
2947A81j75J81n6J35p1j42M2k2l10p8J09m3J29k07K32R3M1l08L44k5M8N8J17R6
2971C69l15j64L4M64l54l75J3L9J3J14NJ08k49L74k8k50K45J56M1k10M96j5l56
2994A55Nj75J02k02j11K45k38L7k3j96K02j3J64n8j2j62O07Q9l23K99l35m7J87
3017A97p5J7q5j89N4R7j60j14l01J72J39p6J13k2M75P0l2o7K14o2j33j04K38m88
3041a22K63p7k80J14k5j99j12J0K56J38j9n3K11Q0m9r6K43k82J09l7K27n9n3j12
3065G6Pj86o5J65j62J6l26M34j12J04K2Q4M10j02J07M2k11Jj99j31M8j43N4J10
$$ plain form
2901 93 78 158 115 101 111 178 -80 37 -172 -96 -40 -238 -383 -424 -49 138 31 -518 18 201 100 3 238 148
2925 148 23 248 228 -128 126 -63 -404 -210 67 -228 -363 -210 -188 -57 -74 -146 288 -23 -87 -14 142 181
2947 181 6 187 131 266 195 53 95 73 -237 -315 -206 -249 -120 -327 -95 -2 39 -269 75 50 98 156 273 369
2971 369 54 -110 -76 388 34 -341 -328 -289 -276 -162 -157 -49 -298 76 48 -202 43 199 240 30 526 511 155
2994 155 160 -15 87 -115 -226 19 -219 -182 -205 -401 -199 -212 -48 -106 -118 -280 327 416 93 392 57 10 197
3017 197 122 139 54 -135 -81 16 -144 -258 -559 -387 -248 -324 -211 -233 242 312 280 213 427 365 232 128 366 -122
3041 -122 141 64 -216 -102 -127 -326 -438 -428 -172 -34 -53 -106 105 185 136 40 283 1 110 73 300 241 188 76
3065 76 83 -103 -168 -3 -165 -149 -475 -41 -153 -49 -27 57 467 365 472 514 303 304 105 -26 22 -121 -67 43
3089D3m00n1L15L0k35K81p8j87M50J04k36R9l6j72N50k66l66Q8j2Q2P4j94m0K21
3113F4l93M3J98L1M06l53j5Q3q2J29j4P5J15j55j99J83N9j8l81j70K53l1n0K54
3137C2m17J40K12OJ87k31K06j71J8K67k80l4K80J24L4j95j66J47r8l12j62Q8K60
3160f5j37J36k02K68mj2n4O9K28J02l48K81n7k90J8K53J14l86J35k25K7k25K56
3183a18PJ0j08M43l39Q1K12J55k13j14L92m3k87j65K58j93r2o4q0J31J34j8k20
3206b31K60k41K56n3O0K58l0l38K32J07Ql40M9j46r7%J27L36l87k09J07M42k16
3229d6j8l0J59j86L91J1j50Qk79J79n9lK70k25K9o1M5j29l32K56l02M77k22J28
3253h9o9M09M0j46j2J46P9k26J78l86K55J81k14k64M2M88o83K38k65l0L49J92
$$ plain form
3089 43 -357 -408 -93 -63 -298 -17 -95 -282 168 272 36 135 99 -73 477 211 -155 -67 -79 3 77 -117 -157 64
3113 64 -329 -286 -88 -57 349 -4 -19 64 -18 111 97 172 287 132 -67 116 175 157 -224 -394 -141 -172 -222 32
3137 32 -385 -245 -33 -27 160 -71 135 -36 -18 249 -31 -65 215 339 373 178 12 159 61 -251 -413 -325 -65
3160 -65 -202 -66 -268 0 -4 -16 -70 -1 227 329 -19 262 205 -85 -67 186 300 -86 49 -176 -149 -374 -118
3183 -118 -111 -101 -209 234 -105 -24 188 343 130 16 408 365 78 -87 171 -22 -114 -178 -258 -127 7 -11 -231
3206 -231 29 -212 44 -9 51 309 279 -59 173 280 288 -52 -3 -149 -246 -246 -119 217 -170 -379 -272 170 -46
3229 -46 -64 -94 65 -121 270 281 131 139 -140 39 -20 -23 247 22 51 -10 35 -94 -426 -170 -472 5 -217 -89
3253 -89 -158 251 291 145 133 279 358 132 310 -76 179 360 146 -118 -76 412 -271 -33 -298 -328 21 213
3275B13k72l1Q3J3M3L36o3o5j69K14m00K76k25K2Mp5jk1l8J7N8L7l75N43k60K81
3301A45m7j63K62j09R8l9K27j75O2k03k02K42j06O8k42j20K28k36M3J65P0r8J66
3324C6K60Pk27L03m65K03r3J31k85N6j1q2j66R1P4k35K51R4N6k57L70l36O32n03
3348i6L30Q5j40m9L5j55k81L19k01K47m32M68l50R1p3K47j27L1J19j86L14J47
3370C43k46j0K06j54q1j59j67k6J30p8J20j05RLJ27J24j33K98m36J52K77l9j12
3393D3M3r9L7o7K95k89M3J15l39M8o2K5K53m96K37J6K5L46j5J44k79L22j89r8
3417E9L61m01M2N3k36O0k24J88k17J48J64j24j10K09Q4l5l07L54J02j33R5J64
3439B96j88o4L55l35l42L49o5L2J6k53J47r1R5J51l21J56Q9L7J92K6j88Mn1K24
$$ plain form
3275 213 -59 -90 -7 6 49 385 322 257 88 302 -98 178 -47 -25 -21 -96 -97 -118 -156 -139 -81 -44 -419 124 -136 145
3301 145 98 -65 197 88 186 147 374 199 261 58 -144 98 -8 60 -182 -302 -74 -310 -267 -102 -32 -130 36
3324 36 296 303 76 379 -86 117 24 155 -130 -74 -85 -167 -333 -242 -168 -403 -152 -58 -2 -259 111 -225 407 -96
3348 -96 234 319 179 130 165 10 -271 48 -153 94 -338 130 -220 -129 -202 45 -82 -51 68 -118 196 343
3370 343 97 87 293 139 58 -101 -268 -294 -164 -242 -122 -227 -218 -215 -88 36 -97 201 -235 -83 194 155 43
3393 43 86 -13 24 -43 252 -37 6 121 -218 -170 -232 -207 46 -450 -213 -197 -172 174 159 303 24 346 157 59
3417 59 420 19 61 114 -122 -62 -286 -98 -315 -167 -3 -127 -237 -28 56 21 -286 68 170 37 132 296
3439 296 108 44 399 64 -278 71 6 38 54 -199 -52 -143 -48 103 -218 -62 27 64 256 282 94 98 47 271
3463B71l6k21L5K79n30O5k43j82M46j16K69k66J51K47n31M33j09N7J4J80J15k86
3485D2J21K5M1j6m07K91Qm2j24j05K2j81K08j7K31j11q4L3n1L23n9r9q0K41k84
3510g4K64k31L4Q9j14j50J29LO2k14K97K11k86M5pp0L31n2j75J31k20q7L20j08
3534A28k90j02L56k0j87N9j59J42L09n40K92o2J77Rr8L94m45J56J52k82K05l08
3556a14p7K22j25J14P6k94k01K28L84m63M92j27j46K34r9R2J60l39r9L13j09M2
3578A64N6J1m31M1J1j16J8J93j06k09L74j02q2l2Q0K50J94j66j80K49m3m28L06
3601E2J80k17J0o0j57J37m0M2K27%j70l3pL29l15K9k5M23n11L0N2J07j3J70n1
3626A89l76mj58l7L18J14j01P4k03L8j5L05r9J79k06N4n7p3l1J97M2k59o5K9O9
$$ plain form
3463 271 235 14 49 328 -202 -137 -380 -562 -116 -232 37 -229 -78 169 -362 71 -38 19 33 213 328 42
3485 42 163 188 229 213 -194 97 105 63 -61 -166 -144 -325 -117 -134 97 -14 -98 -65 -116 207 148 49 -31 210 -74
3510 -74 190 -41 -7 82 -32 -182 -53 -50 12 -202 95 306 20 65 58 -12 319 267 92 223 3 -84 236 128
3534 128 -162 -264 92 72 -115 -56 -215 -73 236 -304 -12 -74 103 112 14 408 -37 119 271 -11 194 -114
3556 -114 -191 31 -94 20 96 -198 -399 -171 213 -250 242 115 -31 203 104 196 356 17 -82 231 122 164
3578 164 220 231 -200 -159 -148 -264 -246 -53 -159 -368 6 -96 -178 -210 -130 120 314 148 -32 217 174 -254 52
3601 52 232 15 25 -35 -192 -55 -95 -53 174 174 4 -29 -36 293 -22 7 -18 405 -106 -76 -24 83 70 240 189
3626 189 -187 -191 -349 -386 -68 46 -55 19 -184 -146 -161 144 45 224 18 72 15 -58 -89 108 150 -109 -174 -145 -76
3651g6J15l7j93L16k99L04k1j12j73J84OK75J67m00J35j41j23j08K25p9m59M43
3673e1k20L63j21OJ52l21j30M17j45K27j78m0R0o6J85l99K82l16M96k03L6J99
3695B63m78Q5j9L4J49l4l7J02J98q4n6K23j83L33l26k52L71j6k55P0l35J94k10
3718b63J03Q2P6j39J18j58R7J14K17k16N1K17k89J58qK02m90L82r3k65L8L1j61
3741a96J79K86k89k18K62j57K18j31J11L8q9J32k18K76j60J64l14R4Q7j3K9j38
3763d7L5O6r2k5N2O5J97j88Q0l6J24j58J7K32J0m25J41J9o5j54J36j49J70m2K2
3788a5j08rL0L76o0r9j8n1L0n6J10J09l62j2J38N0m7j27l6N9N6j93J61J07k4k5
3814a6j04L49m5J81l44K31K4k20J52k64k5K78l99K15j57kpj11L41j65L1K0jR2
$$ plain form
3651 -76 39 2 -191 125 -174 130 109 -3 -176 8 14 289 456 56 191 50 -73 -181 44 -35 -494 -51
3673 -51 -271 92 -29 -23 129 -192 -322 95 -50 177 -1 -41 49 -17 168 -231 51 -265 231 28 64 263
3695 263 -215 -130 -149 -115 34 0 -37 65 263 179 123 346 163 496 170 -82 289 273 18 88 -247 -53 -263
3718 -263 -160 -78 -2 -141 -23 -181 -84 30 247 31 82 299 10 168 160 362 -128 254 161 -104 -66 -35 -196
3741 -196 -17 269 -20 -238 24 -133 85 -46 65 103 14 146 -72 204 44 208 -106 -12 75 62 91 -47
3763 -47 -12 54 -38 -63 -11 54 251 63 143 107 231 73 90 322 332 -93 48 67 2 -152 -16 -165 5 -37 -15
3788 -15 -123 -132 -102 274 214 115 97 46 76 20 130 239 -123 -135 3 53 6 -121 -157 -98 -42 -235 -74 33 9 -16
3814 -16 -120 229 184 365 21 252 276 56 208 -56 -81 197 -202 13 -144 -146 -153 -264 77 -88 -57 -37 -38 54
3838E4l99L55K35k08kQ0J94k30m47P03k98Rk36J23m4N0j17J06j2j49M01k88J80
3861F0n4J71k32O1l0L75k45k4o3j91O1q2j6K0J4j42K78j55L7K58n6Q0j43J90k9
3886A43j60J30Pk36K88j09j56J8o3l6N4j2O6PN3J5j41q1N35m20J58J77j11k65
3910a39K44M3oJ92m54Lk6j3K03k91K59N6j94P7k08K71j8l6l2J63O5j78j52R0K31
3935A50n4Kj87o5j39M36j48j91J66l34K04J77l1l7j04L63k07J38o9j26L07l36
3957h5O1J62n5j26l25LM17K49o25J66Q5J52j54K64J2Q2k44j12Q2k6R6j59K99j49
3981G0l8J66l58p9L15l93O87k62q1m01N3K54k1J09J92Q7l61j01L79j61N8o4J47
4004A97j04k18K85l47K07j62J64K08k21J56m57L36j23O4K27j76r3R1L1J10J9q7
$$ plain form
3838 54 -345 10 245 37 35 115 309 79 -368 335 37 46 -190 -67 -111 -61 -178 -72 -84 -233 168 -120 60
3861 60 6 177 -55 6 -24 351 106 82 19 -172 -111 -193 -209 -189 -175 -317 -39 -194 -157 101 45 125 -18 172 143
3886 143 -17 113 120 -116 172 63 -93 -75 -138 -174 -120 -132 -66 -59 -6 9 -132 -213 322 -98 60 237 126 -139
3910 -139 105 148 142 334 -120 -117 -143 -156 47 -244 15 71 -123 -46 -254 17 -1 -37 -69 94 159 -19 -171 -81 150
3935 150 96 98 -89 -154 -293 143 -5 -196 -30 -364 -160 17 -14 -51 -155 208 1 139 70 -56 251 -85
3957 -85 -24 138 83 -43 -368 -365 52 301 -324 -158 -73 79 -75 189 201 283 39 -73 9 -17 79 -80 219 70
3981 70 32 198 -160 -239 76 -317 370 108 27 -374 -321 -67 -88 21 213 300 -61 -162 217 56 114 50 197
4004 197 93 -125 160 -187 20 -142 22 230 9 165 -292 44 -79 -15 212 36 -57 34 65 175 194 107
4026A07P5k19Mk05J88k00j4J54q5J30J1j96K14J4J55l53K82l1k04L51l32J2P5
4049f7J15J17k94o8L90l00j3O4K1k02K50m8N9j24J07O3o1K38r2j86Q0L8j25j51
4073a89K23K8k84L05k88J03R2J03K9J17j04j17J72j65OM1k54J95O0lN4l0j24J9
4097a1j9k55l7J90P1k23K94j09j20K37p1K95k31J5j79L24K00k56q4r6k3j19K41
4120C4l3pk3j4J78k19k45L13r5J13N1N2J39k59L94k37k90K83n3O0l99M52m26M38
4144B07k30k41%K10L05j54l2p9K65l69K81k37L8K50j51k4k76L55j79K88p4l08
4166a55J35j25J9J01m10M13j64J89j61K29Q2K9l6J25k53l5P2J35m34k1L82k23
4188a06L44l83J41J86k61J36j18J25p7L95m68L70l13l4K41p6m92K89K84l13J70
$$ plain form
4026 107 182 -37 -33 -238 -50 -250 -264 -110 -195 -65 -54 -250 -36 -22 133 -220 62 31 -173 178 -154 -142 -67
4049 -67 48 165 -129 -197 193 -107 -120 -56 -35 -237 13 -35 24 -100 7 70 9 247 155 -31 49 87 -38 -189
4073 -189 34 62 -222 83 -205 -102 -10 93 122 239 135 18 190 25 31 72 -182 13 73 70 124 94 -30 -11
4097 -11 -30 -285 -322 -132 -61 -284 10 -99 -219 18 -53 242 11 26 -153 171 371 115 31 -65 -88 -207 34
4120 34 1 -6 -29 -43 135 -84 -329 -16 -111 2 53 105 244 -15 379 142 -148 135 82 142 -257 195 -231 207
4144 207 -23 -264 -264 -54 251 97 65 -14 251 -118 163 -74 -36 214 63 39 -237 118 -61 227 153 -155
4166 -155 -20 -145 -126 -25 -435 -22 -186 3 -158 71 153 182 146 271 18 -17 55 190 -244 -265 117 -106
4188 -106 238 -145 -4 182 -79 57 -61 64 -13 382 -86 284 -29 -63 178 102 -390 -101 183 -130 40
4209D0j46L8J02k00J61J06j34O6r6j17J84J91k76K17j15k91K86J69k03M6j60J50
4231A8j3K0N1j68J30J74k40j69J99R1J1j17J36j91Q7j61N64l52L1J32l52j28J96
4254e1j11K6l9O3K94j83l00K53K02j09J43j3j11J55k44J09k52L35J39k48J89l23
4276g6L74M7m78K22N6l63L16R4j37j46L3L0L28j86j34K82m2m8J8m3j84J41j83
4299g9O9j77n1M39k11l2k34K63J50j33n3J10qj04pLL01k89M7j25O7J99l0n9K74
4324C30n60J87k2P4J26j22p4M30k84J48k21OJ42k18O6p4K48j05j0k78L3L59l81
4347b00k3K21o0J25k67K39l19N89k02j30L04k68L2J06k87K05J23k68N8j34R3r2
4369a55J37Q8k47K19J04j84K45j04j5m55K18L8K89K1j84k16K93j00pL0k55L16
$$ plain form
4209 40 -106 -68 34 -166 -5 101 -33 33 -63 -180 4 195 -81 136 21 -270 16 185 -18 28 -132 18
4231 18 5 25 76 -92 38 212 -28 -197 2 93 104 -13 123 -68 19 -142 422 70 101 233 -119 -247 -51
4254 -51 -162 -136 -175 -112 182 -1 -301 -48 154 45 188 175 64 219 -25 84 -168 167 306 58 247 -76
4276 -76 298 345 -133 89 145 -218 98 192 55 -91 -58 -28 300 114 -20 262 220 172 190 147 -37 104 -79
4299 -79 -10 -187 -238 201 -10 -42 -276 -13 137 4 -49 61 53 -51 -58 -55 246 -43 4 -121 -54 145 115 56 330
4324 330 -230 -43 -65 9 135 13 -61 369 85 233 12 18 160 -58 8 -66 182 77 67 -211 -178 181 -200
4347 -200 -223 -2 -62 63 -204 35 -284 305 103 -27 277 9 41 147 -140 65 188 -80 -22 -156 -63 -155
4369 -155 -18 70 -177 42 146 -38 207 103 88 -367 -149 -111 178 199 15 -201 92 -8 -15 15 -240 76
4391G6k26K07P4o0k70L71k32K72Q5p4l02P5K89m28J09J33j89K0j8J18k27M09n6
4414A56l09J03k02K86NJ11p4M9j57J54j53K72l09K5J02n8P9l28K11J39j14j51
4436a63K3Q6J91k21j14J88k6l4K72r9M9j41K32k95K26l06J62j36K12m17L97r4
4458hNj79j13L61K21k75j2O0j20k9O6J5M04k41j10k51M9N2p0o5L68k05L02j32
4482I3l49M08j67j33q1j21L81j38J91J9l41K59j06N5R6l41K06p3K74j87J81q0
4504D6j62j75J75J87k27J56K25j5m05L34k05K64k65j50J92J30j54l0K7L06l10
4525e6J52Q9l63L3K57j85R5j43m6M88n02M56l43J21q0k8K71m4l33n3N04m20J28
4548bj49K64l16N0J07J06j61j0Q1K35Lqk45M7p1K03j37k42L06j68M8j31J80j33
$$ plain form
4391 76 -150 57 131 71 -199 172 -60 212 297 223 -79 -4 285 -143 -34 99 -90 -70 -88 30 -197 212 156
4414 156 -153 -50 -252 34 39 150 76 125 -32 122 -31 241 -68 -43 59 1 80 -248 -37 102 -12 -163
4436 -163 -140 -54 137 -84 -198 -10 -36 -70 202 103 152 11 243 -52 174 -132 30 -106 106 -311 86 -8
4458 -8 -3 -182 -295 66 287 12 0 60 -60 -89 -23 -8 396 155 45 -206 -157 -105 -175 -240 128 -77 225 93
4482 93 -256 152 -15 -148 -229 -350 31 -107 84 103 -238 21 -85 -30 66 -275 -69 -142 132 -55 126 46
4504 46 -116 -291 -116 71 -156 0 225 210 -195 139 -66 198 -67 -217 -25 105 -49 -79 -52 254 -56
4525 -56 96 185 -178 -145 112 -73 22 -121 -167 321 -181 275 -68 53 -27 -55 216 172 -161 -214 290 -130 -2
4548 -2 -151 113 -203 -153 -46 60 -101 -111 -30 205 208 200 -45 2 -69 134 -3 -245 61 -107 -59 -190 -10 -143
4572a43J33K40l42N7R9q6K36j77J85j98M1r6m2l2L26j73k11J52o9J70k59o0K13
4595c6o0J44R9j18J15j98L2N5j96L45j82J82o4o8J40k87K59l53l3J27K32P2k42
4618c5m0J91l58K08l4L5J77k98M22j40m6q3P4j18q5%J90r9P7m4RP5j95K40J22
4643B45k27l22L66j2J89j03j0j36J40j36J93k50N1p4%K3j24J77k1k25L91k33k25
4666c23M14j2r1j18p2L81k14L89l44j77O9L9j17N0J5m0J31Q2J21q2j45M2k01J14
4690h9J94p2M6j18J1J4L4J04k34K78l30L30k63L4K66m49J14J78Lj94K9J30Pj17
4714i4P1M11j85l62J58k7K2k00K26K06k76R6l35L95p6P2j36L9J10j01Q3j8l3m31
4738c85M44q2qJ3J39O1k94J41p8J25j35n0K02j59P5p7N7L8k84M08j32R8N4k35
$$ plain form
4572 -143 -10 230 -112 -55 44 -42 194 17 202 4 45 -51 -93 -125 201 28 -183 -31 -100 70 -189 -249 -36
4595 -36 -96 48 147 29 144 -54 -22 33 -163 182 0 182 118 50 190 -97 162 -191 -224 -97 135 207 -35
4618 -35 -75 116 -242 -34 -68 -33 144 -154 268 128 82 -1 73 -45 -130 -130 60 -39 38 -6 3 78 -117 123 245
4643 245 18 -304 62 50 239 136 126 -10 130 -6 187 -63 -12 -86 -86 -63 -187 -10 -31 -256 135 -98 -323
4666 -323 91 79 -12 -130 -202 179 -35 354 10 -167 -98 -59 -176 -126 -111 -151 -20 62 183 101 -44 -2 -203 -89
4690 -89 105 33 79 -39 -28 -14 20 124 -110 168 -162 168 -95 -61 205 -244 -130 48 51 -143 -114 16 23 -94
4714 -94 -23 388 203 -159 -1 -28 -6 -206 20 226 -50 46 -289 106 30 102 -34 5 115 14 97 79 46 -385
4738 -385 59 -23 -31 -18 121 182 -112 29 -49 76 -59 -109 93 -66 9 -68 -11 27 -257 151 19 117 171 -64
4762f4k7J72K85l83n0J54p4Rk46M4J15kM5K72j72P8k28N3j08O0K18M4J56o39O2
4787b26M74l07J62m12J35J71K8N6j62R0j12K3J16J39j28J06n0m8L0j28J12o1k5
4810a7K5k58O6J39J04l20L26o9m5l1K56q4j52L55k41J90p3l6j48O3J74j93j20
4833h9M04l24k8j26K22j38k51K73j09L10j95k8K78j81K7J2J5j3J6r9Q0l0k10K25
4857D1o4M9j49N4j71J14K52k34J88j91J43j65J69MP7j20J5j13K91k24j13J08k01
4880b40J2K3J34j5r8L0L47k25J21J4j87L65k93o6K20o4K8M9P9k98J82j76J15n2
4904Eo8j72K3K23J80k70mk17M43Qj54L8K42l00r9K19o7q5M4N2k01J95l8O5m1J6
4930C7r9OJK04j67Q2L7K16k39j90L24m29J67L5R0J9k9k67K36N5J87k17k1k8J45
$$ plain form
4762 -64 -91 81 366 -17 -67 87 13 22 -224 -180 -65 -67 -22 250 78 156 -72 -19 -127 -67 151 195 351 -288 -226
4787 -226 248 -59 103 -309 -174 -3 25 81 -81 9 -103 -80 36 175 47 153 103 55 85 -43 69 8 -17
4810 -17 8 -250 -184 -45 59 -261 65 -4 -49 -80 176 92 -60 295 54 244 171 135 -13 50 224 31 -89
4833 -89 315 -9 -37 -163 59 -79 -330 -57 -166 144 -51 -79 199 18 45 57 72 59 75 -24 56 26 -184 41
4857 41 -23 26 -123 -69 -240 -126 126 -108 80 -111 32 -133 36 40 117 -3 12 -101 190 -34 -147 -39 -240
4880 -240 -228 -205 -71 -86 -184 -154 193 -32 89 103 -84 281 -12 -78 142 78 106 155 234 -64 118 -58 57 5
4904 5 -63 -235 -212 11 191 -79 -83 -300 143 151 -3 35 277 -23 -122 97 30 -55 -11 41 -160 35 -3 62 21 37
4930 37 -62 -56 -55 149 -18 64 101 317 78 -112 212 -217 -50 -15 75 94 65 -202 34 89 276 59 38 10 155
4955A55l02J76k95L92k12N1L17m7k84O2k87K67J45j90O7o2J06k44O8l9K00m5l4
4978c5J26l90K94j40J77L60m78K72j7J6l18R6o8J47k75J79L07l15Q6mk09K20Q4
5001A15j83K40M6j24k64q4J02N4Q5j48J77Q7k23J15J9k45j6J37N9J64j11m4J29
5024H7k60Q2j6K53R4m01J34n1J10j03J24r8k56L30j32K43k28K21n8j16k18M6M32
5047B19k65K83l5j01n7K02rk76j13lJ83k72K48q3P1J5J2k24N0M20j53j30J70P6
5071B28k6p2J56j7j49k5j54q0k51M39j71K87k50L57n89K93K8j3J66k18n4K04L6
5094A25l48K13Q2K0k8J55j88J20k1k65Q0n1J79K3O5m16M78k38L7q0J51J40j55
5117G8j05P7o8o6J66j9j74k38L92j46J96n4j12p1Rl5L41l25K75j19Rm8J7J5L41
$$ plain form
4955 155 -147 29 -266 126 -86 -35 282 235 -49 13 -274 -7 138 -52 15 -47 59 -185 -117 -156 44 -1 -35
4978 -35 91 -299 -5 -145 32 392 -86 186 169 185 -133 -37 -105 42 -233 -54 253 -62 24 20 -189 31 115
5001 115 -68 172 218 94 -170 -254 -152 -98 -13 -161 16 103 -120 -5 14 -231 -247 -110 -51 113 2 -42 87
5024 87 -173 -91 -107 146 240 -161 -27 -78 32 -71 53 -45 -301 29 -103 140 -88 133 75 -41 -259 -213 219
5047 219 -46 237 202 101 44 246 237 -39 -152 -155 28 -244 4 -79 -8 7 19 -205 -155 265 112 -18 152 228
5071 228 202 130 286 269 120 95 -59 -139 -390 49 -122 165 -85 272 -317 -24 4 -9 157 -61 -115 89 125
5094 125 -223 -10 72 92 64 219 31 151 130 -135 -55 -106 73 96 161 -255 223 -15 22 -58 93 233 78
5117 78 -27 50 -18 -84 82 63 -111 -349 43 -103 93 39 -73 -144 -135 -170 171 -154 121 2 11 -37 -20 -5 336
5142C36k06l06o5K90o0L1l61J73J3N6j46L03p8Q0l4k23r4M59j28o2L00m29J76
5165B5J14r4k00m5K15J07r3j6k06J60p1K9N5n0kL3o2K22k15R2J64l57J53J48j45
5190c9j3L0r9K29k3N9k70J14P9j43J98j38r3P0Lk84L56j7KK12o3k30J24J87l67
5215a16K14l8r7L9l38PL43n8Oj72J10M41p1j44Qj29k26L66m6o9J62j34n0m4p1
5240a07L4P8J25O8k26m4m4J86K4J18k34R6J98k66P6o3K4k13L59k83L3L8k7J1j88
5265b27M32j14k4j82J23J45p4J40J63j21j97j75Q6Jm1J52n2K4J8j69k4l40N21
5288F5k00J51j18mJ42m9J04J00o2l2P7j3m65L30QPJ33k76J78k73J40k4L56j28
5312A47k11Mk91K65pL04j13N8p6K23o1m11M47L6j93k02Q2j92K46O9NOk11M2O1
$$ plain form
5142 336 130 -176 -241 49 -11 20 -341 -168 -155 -99 -245 58 -20 60 26 -197 -291 168 40 -22 278 -151 25
5165 25 139 45 -155 -200 15 122 29 13 -193 -33 -104 -75 -20 -70 -72 -39 -101 121 -94 -2 162 -195 -42 106 -39
5190 -39 -52 -22 -121 108 85 144 -126 -12 67 -76 122 -16 -109 -39 -36 -320 36 19 21 233 170 -60 64 251 -116
5215 -116 98 60 -37 2 -336 -329 14 -44 -38 -210 -100 341 270 126 134 5 -221 145 99 30 192 58 8 -36 -107
5240 -107 -73 5 130 198 -28 -72 -116 70 94 212 -22 74 272 6 82 19 43 -170 189 -94 -61 -23 -50 -39 -227
5265 -227 205 91 67 -115 8 153 79 219 382 261 64 -111 -25 -24 -65 87 35 59 77 -92 -116 -456 65
5288 65 -135 16 -102 -106 36 -13 91 191 129 97 174 161 -304 26 34 41 174 -102 76 -197 -57 -81 275 147
5312 147 -64 -60 -351 -86 -93 211 98 156 80 303 242 -169 278 314 121 -81 1 -191 55 124 129 135 -76 -34 27
5337B7r8J09N7l91N58l14O7j8j7J61j60J53l31J29J12q0Q2J27k41KJ97k70M27
5360B88j21k78J18j80K86K8n6n1j27J44o6P9J16l00P2r6j51L77j08kR2pO3K19
5384C39m64J6K77j45L4o2j7j22J88j63J2k4l7K14j1n2q9o5M8J30N9K9J16r2n9
5409F0K81m41M64n35K48J18k17j28pj18R6J55j11L02n9k05L80l60k1M44m03k11
5431b68M32jj0J31m98J59j27J07Mk6L0O7K14l48J26N3j88L03l41K00P3j22L77
5454C47p6m02oK68n9J49l82L55m81L14k25J43J3p3J15J08j09m9O6M8j59K47L6
5477A88j2N5p3m37N64m07M27m53L16l64l2K63oQk9o1J10J6J55l39O1N31o04J56
5501C3k28K32J63q6K3J9n08J19L49j08l03K04J4K52j45k07N1N4J48J2p3R9p6M0
$$ plain form
5337 27 -71 38 95 -296 262 -52 15 -3 -20 141 -19 134 -197 -68 44 -36 46 173 -68 -66 131 -139 288
5360 288 167 -111 7 -173 113 141 85 34 -93 51 -15 64 180 -120 -48 -144 -295 82 -26 -28 64 57 120 339
5384 339 -125 -109 168 23 57 -5 -22 -144 44 -119 -107 -131 -168 46 35 -17 -106 -171 -123 7 66 95 211 119 60
5409 60 341 -100 364 -171 77 195 -22 -150 -157 -275 -179 -24 -135 167 108 -97 283 -77 -98 346 -57 -268
5431 -268 164 163 153 284 -214 -55 -182 -75 -71 -97 -67 0 214 -134 -8 45 -143 160 -181 19 92 -30 347
5454 347 271 -131 -137 131 72 221 -161 194 -287 27 -198 -55 -42 -115 0 108 -1 -50 16 64 -95 152 188
5477 188 176 231 158 -279 285 -122 305 -148 168 -196 -228 35 29 37 8 -53 57 73 228 -111 -50 481 -123 33
5501 33 -195 37 200 114 137 156 -352 -233 116 8 -295 -91 -77 175 30 -177 -126 -72 76 88 15 114 38 78
5525G8M8m8l00k52N36j42N4q4J19j30K91Ql10J70k21J62J50j48l4j04K30J04n3
5548A24j3j38%l6K85l07LJ80l15L14k24n6L03Q2k24N3j58OJ16j50n3M15k11JJ4
5573A1J00k11K8l4K7K8J01j33j78R4M41k80J41K1j39m5J73q1J75j54k39K64l70
5596b60M73m36J54J23J38k47k60J27o3N05l72J84LJ30k95P8J31k27J54j65k01
5617c26N89r9k14J20k33L34l76L5q3K55k02K52j36M9K95j50M6j2K8k40K51j79
5639Dk38K38j0J58l15K07j28k28L25M1j29O4k95L94n4J2L94n04K30r4o9j96K45
5662E2Q4J12j04q1Q0l4j67j9J80M8m0j27K31m48L53k28J8J09P5k68K11j45J37
5685B9J42m63L24j91K87P1n4l16J64K09k57j70K73r7L15k29P8L8j94l1m8L41k89
$$ plain form
5525 78 126 78 -222 -474 62 -80 -26 -110 9 -121 170 178 -132 38 -183 -21 129 -19 -53 -157 73 177 124
5548 124 111 -27 -27 -63 222 -85 -82 98 -217 97 -127 -183 120 202 -22 31 -127 -121 -5 -155 -208 207 -4 -3 11
5573 11 111 -100 -72 -106 -79 -51 50 -83 -261 -167 274 -6 135 156 17 -28 145 64 239 85 -154 110 -260
5596 -260 213 -223 -69 54 192 -55 -315 -188 -251 254 -118 66 69 199 -96 -18 113 -114 40 -125 -326
5617 -326 263 164 -50 70 -163 171 -205 -170 -253 2 -200 52 -84 -35 260 110 156 144 172 -68 183 4
5639 4 -234 4 -6 152 -163 44 -84 -312 13 54 -75 -11 -306 88 34 46 440 -64 166 72 3 -193 52
5662 52 136 248 144 63 143 109 -58 -77 103 151 111 -16 215 -233 120 -108 -90 19 94 -174 37 -108 29
5685 29 171 -292 32 -159 128 199 145 -171 -7 202 -55 -225 48 -49 266 37 115 153 -41 -72 -120 221 -68
5708f8o9M13l74rJ59l57J98q8K4J81Q6L54n47J80k42L85k09R4n5k3J43m9k19j63
5732b55K77q2J68j21J43k71K13K1k59J65K86j89n9j33K81k13K93j76k29K51l49
5753b38Q9jJ11n7j77K63l06L25l32K90q6N21k52j25K9L50j95kJ0k28k23J36K3
5776g5m5J28J9j30K36J30l69K12l50K04K3J0J77k29K49k31rJ00j63L6J24j7k65
5799b35L29l44L54l73L76k17P6J94k81J9omL40J06n65J43K82k55L3J25n3q5j42
$$ plain form
5708 -68 -137 276 -98 -107 52 -305 -107 -195 -171 10 96 450 -97 83 -159 226 17 111 56 33 176 127 -92 -255
5732 -255 22 -60 108 -13 130 -141 72 93 -166 -1 285 96 37 -96 185 -28 265 89 -140 111 -238
5753 -238 -149 -150 -39 -96 -273 -10 -316 9 -323 -33 -119 402 150 25 54 404 209 207 217 -11 -234 -98 -75
5776 -75 -120 8 27 -103 133 263 -106 106 -244 -40 -17 -7 170 -59 190 -41 -50 50 -113 -77 47 30 -235
5799 -235 94 -250 104 -269 107 -110 -34 160 -121 -102 -108 -112 228 334 -231 -88 194 -61 -28 97 44 -41 -183
$$ [...]
8191A05
##END NTUPLES=NMR FID
##END=
