##TITLE=1H_LR-784-R3-C1
 200.13MHz, CDCl3,
 8 sc
 
 28.1.2025
##JCAMPDX= 6.0         $$ Bruker NMR JCAMP-DX V2.0
##DATA TYPE= NMR FID
##DATA CLASS= NTUPLES
##ORIGIN= UXNMR, Bruker Analytische Messtechnik GmbH
##OWNER= pz
$$ XWIN-NMR		Version 3.5
$$ Tue Jan 28 16:29:27 2025 Russian Standard Time (UT+4h)  she@DPX200
##.OBSERVE FREQUENCY= 200.1313
##.OBSERVE NUCLEUS= ^1H
##.DELAY= (6, 6)
##.ACQUISITION MODE= SIMULTANEOUS
##.ACQUISITION SCHEME= undefined
##.AVERAGES= 8
##.DIGITISER RES= 18
##SPECTROMETER/DATA SYSTEM= spect
##.PULSE SEQUENCE= zg30
##.SOLVENT NAME= DMSO
##.SHIFT REFERENCE= (INTERNAL, DMSO, 0, 14.3821)
##AUDIT TRAIL= $$ (NUMBER, WHEN, WHO, WHERE, WHAT)
$$ ##TITLE= Audit trail, XWIN-NMR		Version 3.5
$$ ##JCAMPDX= 5.01
$$ ##ORIGIN= Bruker BioSpin GmbH
$$ ##OWNER= she
$$ F:/spectra/data/she/nmr/H-C/1/audita.txt
$$ ##AUDIT TRAIL=  $$ (NUMBER, WHEN, WHO, WHERE, WHAT)
(   1,<2025-01-28 16:28:35.28 +0400>,<she>,<DPX200>,
      <created by zg, POWCHK disabled, PULCHK disabled
       configuration hash MD5:
       00 E9 B6 7A A2 85 ED C7 34 08 36 98 17 FE 4E 26
       data hash MD5: 16K
       DC 0C D5 90 AC 97 75 85 A4 E7 07 B1 1F 36 5A 41>)
$$ ##END=
$$ 
$$ hash MD5
$$ C3 1C D4 6D E2 FF 90 54 AF A1 4C F3 1E 15 D0 8D
##$RELAX= 
##$RELAX= 
##$RELAX= 
##$RELAX= 
##$RELAX= 
##$RELAX= 
$$ Bruker specific parameters
$$ --------------------------
##$DU= <F:/spectra>
##$EXPNO= 1
##$NAME= <H-C>
##$PROCNO= 1
##$TYPE= <nmr>
##$USER= <she>
##$AMP= (0..31)
100 100 100 100 100 100 100 100 100 100 100 100 100 100 100 100 100 100 
100 100 100 100 100 100 100 100 100 100 100 100 100 100 
##$AQSEQ= 0
##$AQ_mod= 1
##$AUNM= <au_zg>
##$AUTOPOS= <>
##$BF1= 200.13
##$BF2= 200.13
##$BF3= 200.13
##$BF4= 200.13
##$BF5= 200.13
##$BF6= 200.13
##$BF7= 200.13
##$BF8= 200.13
##$BYTORDA= 1
##$CFDGTYP= 0
##$CFRGTYP= 5
##$CHEMSTR= <none>
##$CNST= (0..31)
1 1 145 1 1 1 1 1 1 1 1 1 1 1 1 1 1 1 1 1 1 1 1 1 1 1 1 1 1 1 1 1 
##$CPDPRG= <>
##$CPDPRG1= <>
##$CPDPRG2= <>
##$CPDPRG3= <>
##$CPDPRG4= <mlev>
##$CPDPRG5= <mlev>
##$CPDPRG6= <mlev>
##$CPDPRG7= <mlev>
##$CPDPRG8= <mlev>
##$CPDPRGB= <>
##$CPDPRGT= <>
##$D= (0..31)
0 0.7 0 0 0 0 0 0 0 0 0 0.03 0 0 0 0 0 0 0 0 0 0 0 0 0 0 0 0 0 0 0 0 
##$DATE= 1738067314
##$DBL= (0..7)
120 120 120 120 120 120 120 120 
##$DBP= (0..7)
150 150 150 150 150 150 150 150 
##$DBP07= 0
##$DBPNAM0= <>
##$DBPNAM1= <>
##$DBPNAM2= <>
##$DBPNAM3= <>
##$DBPNAM4= <>
##$DBPNAM5= <>
##$DBPNAM6= <>
##$DBPNAM7= <>
##$DBPOAL= (0..7)
0.5 0.5 0.5 0.5 0.5 0.5 0.5 0.5 
##$DBPOFFS= (0..7)
0 0 0 0 0 0 0 0 
##$DE= 6
##$DECBNUC= <off>
##$DECIM= 32
##$DECNUC= <off>
##$DECSTAT= 4
##$DIGMOD= 1
##$DIGTYP= 9
##$DL= (0..7)
0 120 120 120 120 120 120 120 
##$DP= (0..7)
150 150 150 150 150 150 150 150 
##$DP07= 0
##$DPNAME0= <>
##$DPNAME1= <>
##$DPNAME2= <>
##$DPNAME3= <>
##$DPNAME4= <>
##$DPNAME5= <>
##$DPNAME6= <>
##$DPNAME7= <>
##$DPOAL= (0..7)
0.5 0.5 0.5 0.5 0.5 0.5 0.5 0.5 
##$DPOFFS= (0..7)
0 0 0 0 0 0 0 0 
##$DQDMODE= 0
##$DR= 18
##$DS= 0
##$DSLIST= <SSSSSSSSSSSSSSS>
$$ [...]
##$SUBNAM0= <"">
##$SUBNAM1= <"">
##$SUBNAM2= <"">
##$SUBNAM3= <"">
##$SUBNAM4= <"">
##$SUBNAM5= <"">
##$SUBNAM6= <"">
##$SUBNAM7= <"">
##$SUBNAM8= <"">
##$SUBNAM9= <"">
##$SW= 18.0517328524113
##$SWIBOX= (0..15)
0 0 2 0 0 0 0 0 0 0 0 0 0 0 0 0 
##$SW_h= 3612.71676300578
##$TD= 16384
##$TD0= 1
##$TE= 0
##$TE2= 300
##$TE3= 300
##$TEG= 300
##$TL= (0..7)
0 120 120 120 120 120 120 120 
##$TP= (0..7)
150 150 150 150 150 150 150 150 
##$TP07= 0
##$TPNAME0= <>
##$TPNAME1= <>
##$TPNAME2= <>
##$TPNAME3= <>
##$TPNAME4= <>
##$TPNAME5= <>
##$TPNAME6= <>
##$TPNAME7= <>
##$TPOAL= (0..7)
0.5 0.5 0.5 0.5 0.5 0.5 0.5 0.5 
##$TPOFFS= (0..7)
0 0 0 0 0 0 0 0 
##$TUNHIN= 0
##$TUNHOUT= 0
##$TUNXOUT= 0
##$USERA1= <user>
##$USERA2= <user>
##$USERA3= <user>
##$USERA4= <user>
##$USERA5= <user>
##$V9= 5
##$VALIST= <valist>
##$VCLIST= <CCCCCCCCCCCCCCC>
##$VD= 0
##$VDLIST= <DDDDDDDDDDDDDDD>
##$VPLIST= <PPPPPPPPPPPPPPP>
##$VTLIST= <TTTTTTTTTTTTTTT>
##$WBST= 1024
##$WBSW= 4
##$XGAIN= (0..3)
0 0 0 0 
##$XL= 0
##$YL= 0
##$YMAX_a= 792188
##$YMIN_a= -861005
##$ZGOPTNS= <>
##$ZL1= 120
##$ZL2= 120
##$ZL3= 120
##$ZL4= 120
##$ABSF1= 10
##$ABSF2= 0
##$ABSG= 5
##$ABSL= 3
##$ALPHA= 0
##$AQORDER= 0
##$ASSFAC= 0
##$ASSFACI= 0
##$ASSFACX= 0
##$ASSWID= 0
##$AUNMP= <proc_1d>
##$AZFE= 0.1
##$AZFW= 0.1
##$BCFW= 1
##$BC_mod= 2
##$BYTORDP= 1
##$COROFFS= 0
##$CY= -3
##$DATMOD= 1
##$DC= 2
##$DFILT= <>
##$DTYPP= 0
##$F1P= 0
##$F2P= 0
##$FCOR= 0.5
##$FTSIZE= 0
##$FT_mod= 4
##$GAMMA= 1
##$GB= 0.15
##$INTBC= 1
##$INTSCL= 1
##$ISEN= 128
##$LB= 0.25
##$LEV0= 0
##$LPBIN= 0
##$MAXI= 10000
##$MC2= 0
##$MEAN= 0
##$ME_mod= 0
##$MI= 1.114404
##$NCOEF= 0
##$NC_proc= 0
##$NLEV= 6
##$NOISF1= 3.799351
##$NOISF2= 2.8
##$NSP= 1
##$NTH_PI= 0
##$NZP= 0
##$OFFSET= 14.38212
##$PC= 1
##$PHC0= 256.1739
##$PHC1= 5.792229
##$PH_mod= 1
##$PKNL= yes
##$PPARMOD= 0
##$PSCAL= 0
##$PSIGN= 0
##$REVERSE= no
##$SF= 200.129724274929
##$SI= 16384
##$SIGF1= 3
##$SIGF2= 2
##$SINO= 400
##$SIOLD= 16384
##$SREGLST= <1H.CDCl3>
##$SSB= 0
##$STSI= 0
##$STSR= 0
##$SW_p= 3205.1282051282
##$SYMM= 0
##$S_DEV= 0
##$TDeff= 0
##$TDoff= 0
##$TI= <>
##$TILT= no
##$TM1= 0
##$TM2= 0
##$TOPLEV= 0
##$USERP1= <user>
##$USERP2= <user>
##$USERP3= <user>
##$USERP4= <user>
##$USERP5= <user>
##$WDW= 1
##$XDIM= 8192
##$YMAX_p= 0
##$YMIN_p= 0
$$ End of Bruker specific parameters
$$ ---------------------------------
##NTUPLES= NMR FID
##VAR_NAME=  TIME,          FID/REAL,        FID/IMAG
##SYMBOL=    X,             R,               I
##VAR_TYPE=  INDEPENDENT,   DEPENDENT,       DEPENDENT
##VAR_FORM=  AFFN,          ASDF,            ASDF
##VAR_DIM=   8192,          8192,            8192
##UNITS=     SECONDS,       ARBITRARY UNITS, ARBITRARY UNITS
##FACTOR=    0.0002768,     1,               1
##FIRST=     0,             0,               0
##LAST=      2.2672688,     0,               0
##MIN=       0,             -861005,         0
##MAX=       2.2672688,     792188,          0
$$ Real data points
##PAGE= N=1
##DATA TABLE= (X++(R..R)), XYDATA
$$ [...]
1874C14l65j81m8j44K9n4M1M6kL12K51j78k73Q90j67k34J57J77J13k87m80K43
1896A60L7m47l43J44J91J13n57n2K76K16j45L00M72om5l4J32L17k54J5l80l2Q3
1919A61k23q8k72k47J71k87q5O27q7j78N91P7L83n5l28Q44m49l25L21m10K36k34
1941A43j46J11k47r5j50j37J05K1K27K7j27L90R9K64j12J04j72L06L01n45j97
1962A70j10N6j56m12L41j89l60K29L5l7K04l4Q0M87o8jK5L48J83k96l32J27m3
1985B47l24j00k10J38k90l9L2q2K91o9m9M01J27j12K40L10K2n2p3K3L6k92J89
2008C64k83l35j50J9O2k97R0J38p3K83k24L07L99R9j20K59K46k54p2q9N0j56l62
2031i9k48K85q9j55j9k58N5R7K74j76L91J11J24q8M02M14l99n59J08M65m41k48
$$ y = [314, -51, -232, -280, -424, -395, -449, -408, -362, -364, -52, 199, 21, -252, 638, 471, 237, 394, 571, 684, 397, -83, 160, 197, -250, -593, -449, -258, -145, -702, -754, -478, -262, -407, -107, 365, 359, 314, 280, 412, 729, 475, 490, 110, 78, 161, -62, -150, -422, -669, -498, -785, -870, -243, -330, -508, 83, 160, 543, 488, 160, 1004, 555, 230, 551, 141, 377, 143, -3, 108, -139, -234, -384, -521, -416, -395, -168, -141, -268, 122, 221, 485, 373, 477, 305, 611, 912, 367, 170, 60, 116, -40, -452, -111, -300, -660, -431, -396, -433, -229, -263, -183, 304, 236, 235, 260, 608, 791, 495, 163, 290, 247, -77, -177, -387, -249, -539, -578, -546, -628, -337, -406, -455, -54, 73, -39, 201, 511, 533, 481, 408, 431, 467, 175, 364, 81, -254, -404, -385, -323, -620, -530, -392, -465, -182, -406, -99, 300, 399, 279, 538, 784, 530, 458, 369, 419, 263, -99, -347, -62, -151, -306, -325, -583, -528, -431, -157, -333, 58, 169, 293, 205, 607, 1021, 622, 63, 171, 636, 195, -53]
2053e3K2j45l14j64k87R30L2l34l6L98J80j0r0J00J06J00l8J68k16K18n38n55
2075e26K96K04l8m48P3L20n05J20K32K61J43l6J74l8K32Q0l25J52R7j43K4k30
2097A19j55n3q3J14j90j00K4R0p2j68L66L07R1J66%o7J78k37J80q0jk54j81j8
2121b4j07n6j98j02K06o0k94N65j13O2k49O01K3QK07k72j3L86q7m33NJ89j70m81
2145d07l10N04k07J48J2k64J08k8M22RK6L41J49k37L8J03J00l78Q2ll95q9k1o2
2169c59k36L56j92k6K29J89k11L17J16n2P2J27L05k25j54J87j55k14l4J85n09
2190b84k36M68o24N9L38p2P8J18K83P7l19M96kK10k41L60l44j29P3J7m95j17L03
2213A7k15k4l63N44l69L58j25J56R3J85k69J71M10n7k00k63J43Q6j72J75l33l36
$$ y = [-53, -31, -176, -490, -654, -941, -11, 21, -313, -349, 49, 229, 219, 129, 229, 335, 435, 397, 565, 349, 567, 29, -526, -230, -26, -64, -512, -439, -119, -624, -504, -272, -11, 132, 96, 270, 232, 464, 544, 219, 371, 468, 325, 349, 119, -36, -89, -172, -58, -248, -348, -324, -234, -306, -474, -108, 199, 290, 456, 456, 389, 567, 330, 510, 430, 429, 175, -6, -24, -131, -187, -385, -487, -281, -341, -635, -70, -183, -121, -370, 231, 254, 262, 469, 197, 184, 570, 483, 50, 55, 244, 74, -407, -717, -213, -420, -272, -260, -524, -416, -444, -22, -13, 13, 354, 503, 266, 304, 407, 507, 129, 211, 208, -187, -276, -297, -359, -595, -239, -431, -457, -228, -39, -250, 67, 183, 131, 203, 330, 635, 410, 256, 443, 288, 74, 40, 225, -284, -520, -52, -676, -617, -279, -351, -273, -155, 128, 205, -114, 382, 380, 590, 349, 709, 365, 236, 309, 326, -169, -286, 17, -198, -222, -585, -41, -410, -52, -177, -21, 72, 257, -12, 159, 569, 512, 312, 49, 192, 278, 106, 281, -52, -388]
2235c88j84J03K48j92j40N60r8K91j52K36j80K67L56m30j2J38q1n9j53J3k25j74
2257b56J27m6j68J69l27j61N55M9r3M73k42K42k33L62Lj25o3m7K98n30j02R3k76
2280b98J8j32J65J82k81J07O8L25j11o5L74j40L05k93J92k40K07m8k46k92J68
2301c5m62mM72l22j10qK86K20K00j49m1K77l4J11j5j2O2j00j12K95j29m85J81
2324H6j16k39j69k3L06k75M23m4J35o9J83Q3l62L47K39j37qM0m00Pj10k28J83
2347a48j0n1n7j8l04M6M98J16k23O8K27K37j17M4M6m6l38J31j25j1J94m45K20
2370f6K0k41J59j21j4J70j56K44L52k20K51q9n7J03q6K00k82J84j01l74k59L59
2392b4j46j64j34J65OJ48j05j87N17N2j89K69K90Q9k50J43Jk49kl11o4p8J1k70
$$ y = [-388, -572, -469, -221, -413, -553, 7, -91, 200, 48, 284, 104, 371, 727, 297, 285, 423, 342, 283, 130, 143, -82, -256, -129, -175, -343, -174, -501, -662, -107, -58, -151, 322, 80, 322, 89, 451, 454, 329, 266, 219, 517, -13, -115, -22, -298, -280, -412, -247, -65, -346, -239, -171, 154, 43, -22, 352, 212, 517, 224, 416, 176, 383, 335, 89, -203, -35, -497, -501, -29, -351, -461, -469, -183, 37, 237, 88, 47, 324, 290, 401, 386, 374, 436, 336, 224, 519, 390, -95, 86, -30, -269, -438, -461, -155, -430, -7, -51, 84, 15, 198, 281, -81, 266, 505, 368, 360, 400, 0, 7, -103, -331, -148, -158, -209, -266, -284, -588, -542, -44, 72, -151, -83, 144, 381, 264, 308, 354, 308, -30, 101, -24, -35, 159, -286, -66, -46, -287, -128, -249, -263, -93, -249, -5, 347, 127, 378, 289, 232, 335, 249, 449, 167, 351, 250, -124, -383, -24, -170, -334, -468, -303, -297, -149, -254, -441, 76, 128, -61, 208, 498, 587, 337, 480, 481, 232, 230, -81, -145, -223, -212, -482]
2416d82K94j34J34J8k15Q1J51L05N4r9J45J60p7K0K35m78j99M78m41k81J55oJ54
2439b8k71l14N63l6J10l27M50J95n1j27K10k02Q8M0M6j17l76K50j54r6k46J23
2461b70j98J86M7j05R0N5L3K48P7P1n4J29n0J4jJ05m06K33l47j46j07J73j59K44
2485a38j09n1M73k63n6Q7J87J46k25M76j37K1oo7j18j95R4m61l5L53k12k29K00
2508b65j19R7L94k86NL02j1L8j73M59k64J33K93k18j35k63j0m1q7j35Nk32K76
2531b37K43k60J78p6M42k56L03j11k43Q8M42L0o23L48o6r0l28J24k54P1L7J41
2553i7j50j7N1J37j76O9M30j21L90k14k49J63P4J4j65l6k33q9N8K15K4j66k13
2576c01l2j08L91K31j63K13R5L01n30K70J54n78K44J62m73j88P91o36k58K20l82
$$ y = [-482, -188, -322, -188, -170, -385, -304, -153, 152, 206, 107, 252, 412, 335, 355, 590, 112, -87, 391, -50, -331, -176, -182, -28, -299, -613, -50, -86, 24, -303, 147, 342, 291, 164, 374, 172, 260, 300, 346, 229, -147, 103, -51, -147, -393, -270, -468, -282, -235, -340, -250, -195, -162, 86, 163, 234, 180, 309, 259, 273, 272, 377, -29, 204, -143, -289, -396, -223, -382, -138, -247, -298, 175, -88, -144, -57, 130, 276, 51, 527, 390, 411, 405, 338, 220, 25, 119, -342, -377, -24, -236, -465, -265, -384, -287, 107, -179, -174, 128, 117, 155, -18, 441, 177, 310, 603, 385, 250, -13, -23, -64, -151, -286, -281, -513, -237, 6, -254, -76, -152, 290, 34, 337, 226, -17, 71, 513, 543, -80, 268, 202, 112, -216, -92, -346, -275, -238, -97, -247, -264, -213, -76, -252, -183, 247, 126, 516, 302, 53, 216, 290, 304, 139, 103, -130, -219, -161, 54, 78, -88, -301, -333, -441, -50, 181, 18, 231, 326, 627, 97, 367, 521, -57, 187, 349, -124, -312, 479, -157, -415, -195, -577]
2597e77O67n73N84j04k04J28M29k0j27L0RJ07j34J64j30k58M0l05L18j07n6k93
2619d12j76K31J53l66O91J54k37J37J12l2j82Q6J41k2o6j19Lk66k35M03n74M46
2641a30k86N10j87k68M70j23qk5J03J1L08J43q7l57K4k16r2J08K09k45q1J77j88
2664b30J25l33J90j0L90k73K21K28k13J7J93J5R9j29o3k58K85m16j81K63r1m3
2686b14j76N7Q9J9K78j64J30L50l0k30J03o0n5J18j21R5J31k79L9j09l53O5J09
2709b08r6J32J62l8J0J16R4Pj61J57J59j35k04J26M0p7k63j6J13J18j08k72m5
2732c89J10k2L70o33N56j68M47n28L82K35J31k32l46K39J68ol50j74J29O6m07
2753d22J70K6n2J31m6P0K60j35L05r1p3M6Q0J8J59l28j11o5K83n04j62L38j04
$$ y = [-577, 90, -483, 101, -3, -207, -79, 350, 330, 203, 233, 242, 349, 215, 379, 249, -9, 31, -274, 44, -63, -119, -412, -588, -357, -204, -570, 121, 275, 38, 175, 287, 255, 73, 159, 300, 278, 212, 93, 96, -170, -405, -2, -576, -130, -416, 94, -93, -361, 109, -14, -22, -47, 56, 67, 375, 518, 431, 74, 98, -118, -210, -102, 107, -138, -219, -42, -230, -105, -438, -248, -258, 132, -141, 80, 308, 95, 112, 305, 320, 419, 290, 227, -31, 254, -162, -343, -80, -171, -214, -390, -333, -244, -225, 53, -111, 19, 369, 339, 109, 212, 152, 97, 215, 94, 189, 320, 41, 80, -29, -382, -317, -208, -304, -172, -10, -48, -38, 78, 172, 179, 18, 175, 334, 199, -5, 121, 161, 84, -179, -195, -82, 36, -72, -344, -389, -279, -301, 69, -564, -8, -176, 271, -257, 125, 360, 491, 259, -87, 152, 320, 314, -36, -210, -81, -15, -422, -252, -226, -278, -147, -193, -123, 137, 2, 307, 216, 143, 189, 269, 287, 446, 118, 7, -58, 225, -279, -441, -103, -207]
2776b07k99M01q9R4k16M06K57j42l0j84J95M2J73k72k7J90j30m05O2k7Q1l30L11
2799a46m82M22p8R7J13K49j0O6R9r1K58l51lk37M60l99K21l06k29M0P4J18l19
2822d34J91O2J1J67P5K21l9K12q6o6m5k56Q8j29N5j5j35J50m35K5J81K67l01J27
2846a09R5m3n6J25J4J08p1K18P7r0l67K37J48q0k46K13j46l90M28j65p3j68K82
2869e9j00K50j04L2k4J85n5P8k35L65l3m02L73o09L56k31j9K01k30n5K24j45K10
2892b7j28J66j99K42R1KN6R5P7k19j20j03K00j78j41J32j04J07l16K31k03K76
2914f3J68j69O1JJ81k16K36K48k18J17m17L21l20J24n6J6j97k64L78m02N59k7
2936F1l92M27q7k9J8J54J75j77P7p3j11j15K8J64m54J41j97J46N0M2K2N1oK89
$$ y = [-207, -506, -105, -194, -100, -316, 90, 347, 205, 175, -9, 186, 228, 401, 129, 102, 292, 162, -243, -181, -208, -127, -457, -146, -628, -206, -284, -187, -74, 175, 165, 231, 330, 239, 497, 146, 143, -94, 366, -33, 188, -118, -347, -307, -233, -115, -434, -243, -181, -170, -3, 72, 293, 254, 466, 380, 314, 269, 13, 101, -28, 27, 12, -123, 27, -408, -383, -202, 65, -236, -109, -14, -57, -113, 12, 26, 134, 63, 281, 358, 268, -99, 138, 286, 206, -40, 173, 27, -363, 65, -100, -173, -341, -59, -159, 91, -13, 19, -5, 180, 125, 203, -32, 333, 300, -102, 271, -338, 18, -213, -232, -31, -261, -316, -92, -237, -27, -155, 11, -188, 54, 145, 147, 203, 298, 375, 156, 36, -67, 133, -45, -186, -54, -158, -51, -367, -136, -339, -63, 105, -64, -3, -2, 179, -37, 199, 447, 229, 346, -71, 250, -70, 54, -2, 14, -183, -447, -69, -471, 88, 61, -331, 96, 9, -20, -2, 152, 327, 150, 227, 154, 43, -72, -44, 120, -334, -193, -390, -244, -194, -152, -130, -79, -85, 204]
2960B04n55M76rq8r3J18O8J30n30J36L78k66L10k99L7k10P4j04N4K13l50K46J06
2983D6J28k59L94k08K60j79l10M16K9k92j3j7pm92N46k90O0J73N5k55Q4j13J90
3006e4J46J06o6r5K35k92K75J49m13L69n13n7J43q7Qk78J81M6m9K04k76L64R5
3029A41J2k41P7J14K43j16j35J9j21J67j56P0o9q3k74L7K55j01P6j41K99R1k16
3052e2M2M49j10j43R4P4k44K36k57r2k8K21l39j07n6K47n09K30J67O8m1L31lJ59
3076C37Q1l02K54k62J43r2P4p7Ll93K38j58j64j16M68j03l05K22O2J63N1j98J02
3099B8o7K06j26qR5K01j52m45K18m1L84o10J0K34L6pJ78k50m2M08l46J60J10K80
3123D54k07j57L13k17k43L20k54k3k01K89k82N7J39j10j31j8J25J76J97j86J17
$$ y = [204, -351, 125, 116, 28, -65, 53, 121, 251, -279, -143, 235, -31, 279, -20, 17, -193, -119, -223, -169, 44, -306, -60, 46, 174, -85, 309, 101, 361, 182, -128, 288, 317, 25, 12, -5, -12, -504, 42, -248, -188, -15, 40, -215, -131, -244, -54, 92, 198, 132, 37, 272, -20, 255, 404, -9, 360, -153, -210, -67, -154, -146, -424, -243, -197, -246, -42, -318, 46, 141, 153, -88, -11, 103, 346, 230, 95, 114, -7, 160, 4, 74, 5, -78, -352, -315, -60, -161, -85, -226, 73, 164, -52, -10, 439, 329, 186, 280, 354, 110, 346, 89, -3, -31, 190, -149, -256, -312, -65, -574, -344, -177, -109, -150, 181, 178, 337, 418, 116, 370, 108, 251, 159, 233, 156, 159, -234, 4, -154, -318, -434, 34, -69, -374, -152, -90, 73, 124, -74, 28, -39, 167, 41, 33, 128, 329, 177, -268, -50, -91, 293, -317, -307, -73, -37, -44, 134, -116, -158, 250, -96, 64, 174, 454, 247, 90, 403, 186, -57, 263, 9, -14, -215, 74, -208, -151, -12, -122, -253, -271, -146, 30, 227, 41, 158]
3144A58j23J8RJ84M7m30j49L58K5k49k30K85m63L48L0n7k24L32l12K18J86J39
3166A00k5J28J45l91j1O0o2J84l58J56J44k28L4J06p5K5K48k41k2L45l7j08j08
3189Ij17L62Pj45L09r8j12j69m6P4n46K72k1J65j80J71q1J09J84n7M4Q9Lk01K68
3214B93o3k95K17k29k7J37l6k45N34l12k96k6J69J58kJ19q0k42L93O0k0j96p8
3237f7L14pr2j43R3K65o29Q6J56k2nm31M71p7K41k37J82R8J5l7j82o1J93J30k24
3262C0q3K17l59K44k51K64l81J79J66k52K5L87j32l0K39j87J29r3J35k44L61k72
3284I2o7J31j70J15M8P0l86R3k5k21K60N3Q3P2j52j32M94j75J80j91L9o5j95R
3308d0k36K89p7j5k6J29j28k90K45N4j78J51K60j20K33j34J20j25%nJ04j76J4
$$ y = [158, 35, 53, 62, 246, 293, -137, -286, 72, 97, -152, -382, -97, -560, -212, -182, -239, -463, -131, -443, -225, -39, 100, 75, 203, 348, -43, -54, 6, -56, 128, -230, -74, 70, -158, -124, -18, -93, -68, 180, -61, -83, 262, 225, 117, 9, -108, 254, 261, 116, 425, 327, 215, 46, 0, 74, -472, -200, -221, -56, -236, -65, -146, -37, 147, 90, 134, 223, 226, 25, 293, 230, -65, 152, -77, -104, 33, -3, -248, 286, -26, -322, -348, -179, -21, -23, 96, 16, -226, 167, 227, 207, 11, -67, 247, 240, 148, 5, 98, 363, -266, -180, -24, -46, -51, -482, -11, -88, 153, -84, 98, 196, 211, 174, -8, -69, 124, 254, 30, -53, 164, -195, 49, -202, 62, -319, -140, 26, -226, -201, 186, 54, 24, 263, 76, 205, 112, 247, 3, 364, 92, 25, 156, -14, 101, 149, 219, -167, -74, -99, -320, -60, -7, 76, 148, -4, -136, 358, 183, 363, 172, 211, 146, -49, -40, -276, 13, -64, -79, -105, 24, -104, -394, -149, -95, -273, -122, 138, 18, 251, 117, 237, 112, 112, 107, 211, 35, 49]
3331D9O7k64J70k96oP6Mo5J96L08k19N3%J55o9j90J71j1J38n1j60J3m0K0l3M8
3357F4k39L8Q9o7j18L15J39k25M4J24k0l4J06K10j48j00j22M1J38j36k8j79N1
3380e7o5K59j79j46K69j07L26l2j44J49r6M9j06j7Ln9Mq2p4KJ06m1n43M12K0R0
3406e9k11L77j29m2J52jO4q8j00j7J19k11L57l03O7lk76P5l4J12n9J23r2J95j01
3431h5J50l67K94J03j3Q9o0o8M5Q7j91nK6K41j69m70K96j20K28p2n1J88l1J02
3455A47k63L55J0jj14o4k97J43K87k69L3l7MJ74j87N1k58K87j54j1P1P1L65m00
3479e7J94k11J81m0M4L7J2l95R8j58K3K59P2j35k55Q1O0J67j32j09O65m21R5P
3503H2J01R5l46m5J15L25k54l64L77l63J08J82j21j29M02p7m50J76J22J08K49
$$ y = [49, 116, -148, 22, -274, -280, -204, -200, -265, -69, 239, 20, 73, 73, 228, 159, -31, 140, 129, 267, 216, 56, 69, 29, 49, 16, 64, -175, -137, -48, -115, -233, 82, 221, -4, 40, 164, 144, 110, 216, 426, 278, 178, 56, 97, 235, 99, 71, -108, -57, -122, 137, -42, -188, 81, -26, 300, 268, 124, 273, 177, 226, 120, 103, 106, 47, 51, -31, -105, -103, 3, -38, -581, -169, -149, -59, -270, 107, -22, -64, 88, 87, 151, 63, -37, -54, 65, -146, 211, -92, -25, -28, -304, -229, -263, -151, -210, -87, -179, 16, -85, 65, -302, -8, 95, 82, 171, 111, 43, 88, 175, -16, -21, 5, 246, 77, -393, -97, -217, 11, -61, -112, 76, 45, 147, -116, 239, 249, 248, 134, 70, -227, -84, 203, -66, -33, -70, -66, 108, -79, -28, -286, 1, -153, -164, -93, -22, 343, -57, 137, -74, 107, 67, 111, 148, 160, -235, -137, -295, -272, -13, 59, -76, -331, -250, -190, -23, -155, -264, 401, -20, 75, 82, 183, 278, -68, -113, 2, 327, 73, -291, 86, -277, -169, 13, -108, -237, 165, 88, -362, -186, -64, 44, 293]
3524B93j91J08l7Q7n8J80m20j13J66j24J2jk9K38k76k66N87k59L28j65q3j06M97
3547C68Jk05j24J8j20L26l4j66k81j26K29K30j59o2r9j09J63K22p5l4K12lr3p6
3571CK37n2k57J87R0M1j14k31L3r4K85k39J63k68j16L56J82k31r9K34K8O9j77
3594C0N0k34J89j14N4JJ6r8Q4j65k5J91r8K28Kp7j66L86j22k98K30K26j91L9K42
3619C80k57m7k5J81m66J35J06j2j11J39%j12O4o8J33j53j7K04r0L45j57j89J79
3642A62j79R2p8M1j85K25k21J0M79n41nL6M64k51p7L05l88K61J6k2N6K27m53J77
3666A51J48l62p4J10J53k26j68O40o55K38J4j61M23j39j19j95J65K29n6l96K68
3687a2Q4k32K35l04K18j60J04k56JJ06K01k27K15K37l04K36k77J99R0K03k01j65
$$ y = [293, 102, 210, 173, 260, 202, 382, -38, -151, 15, -109, -97, -98, -127, 111, -165, -431, 156, -103, 225, 60, -23, -129, 368, 369, 164, 40, 58, -62, 264, 230, 64, -217, -343, -114, 116, -43, -105, -204, -313, -150, 72, -3, -37, 175, 172, 79, 3, 240, 188, -69, 118, 208, 249, 135, -96, -63, -157, 128, -111, 52, -216, -332, 24, 206, -25, -124, 110, 138, 207, 30, 80, -154, 35, -79, -25, -24, -8, -106, -22, -187, -212, -21, -119, 109, 111, 34, -132, 254, 132, -166, 64, 290, 99, 138, 380, 123, 76, 51, 232, -234, -99, 7, -5, -116, 23, 23, -89, -25, -93, 40, -113, -130, 74, -16, 329, 172, -17, 162, -17, 75, -3, 38, -147, 78, -143, -133, 346, -195, -200, -164, 300, 49, -28, 277, -111, 150, 166, 144, 200, 427, -26, 151, 299, -63, -137, -27, 126, -100, -268, 372, -283, -45, -31, -192, 231, 92, -27, -222, -57, 172, 116, -280, -12, 72, -160, 75, -229, -11, -171, -67, -323, -322, -216, -15, -242, -27, 210, -94, 142, -135, 64, 154, 357, 156, -9]
3709iM5p3J30j88J51k12q0j9J46k08L5L20Q7k70P7K19q5K8J3q3r5L16l28J15J2
3734D4M9l43R2jK97k54j81N36l9p1j63R6R2j67K05l06K35j17J20k76J51K17l53
3757a37M79n06J82m5l9K33K25q45M57l5O2o6K47J9j32N6J41Ll00j60K76r1p6p0
3781a22J83K8j31o8q2K20q8J82o4R2J62m74L48J81l54K85k01J9k89K30j74l19
3803d36J25K99j03R8K1j04o6J01k0KJ29L0R3J5l22O5M16k78J4p5K9j8j5P6n4n4
3829c2j41j37K17J16k7J76L5r1kk08K54n7j19qj33L82k64o0p0J17J33m27K28p7
3853a95O8K2o9M28j80l52L54k7k1l7M1k0J74N9j58m2L7rn3O8k32l2K27K38k66
3878B3L9O4j15k1R3K81l54K4l5kQ6j5nj82M2j70L55m47M79k33J51r3K21k97J59
$$ y = [-9, 36, -37, 93, -95, 56, -156, -236, -255, -109, -317, -282, 38, 125, -145, -68, 151, 66, 94, 107, 24, -71, 245, -83, 32, 44, 93, -250, -158, -159, 138, -116, -297, 239, 200, 129, -34, 62, 154, -13, 192, -114, 121, 4, 124, -152, -1, 216, -137, 342, -164, 18, -27, -66, 167, 392, -453, 4, -31, 31, -35, 212, 231, 99, 155, 296, 299, -1, -161, 115, 24, -52, -122, 61, 89, -42, -110, -192, 28, -60, 122, 58, 150, 312, -162, 186, 367, 13, 298, 97, 116, -173, 57, -117, -436, -311, -12, -115, -17, 4, -100, -166, -65, -85, -83, 46, 76, 169, 184, -138, -73, 343, 65, 79, 4, 33, 15, 0, 76, 22, -32, -173, -310, -93, 23, -4, 172, 207, 116, 114, -94, 160, 103, -16, -24, -157, 225, -39, -99, -169, -52, 81, -346, -118, -195, -127, -105, -174, 254, 74, -278, 76, 49, 28, -9, 32, 12, 186, 245, 87, 45, 82, 73, 20, 88, -144, -176, 51, 289, 23, 62, 126, 11, -10, 83, 364, 10, 34, -1, -3, 83, 68, 63, -119, -77, -247, 108, -339, 140, -93, 58, -35, 186, -111, 48]
3903D8l6K12k35L44J84j61j87P8j86O3l47L27k05O9K06k23OJ8J5j26j7K08K0J36
3927B11P4j75j08J1nLo7NJ58j32P6N5l59N51l37O3M8k29J71k84J80O8n5N0l1o
3953f4K68k40R7L33l11j68j24M8M2J47r5Lj77K25l12J65K71j56J8R8l12J45m9
3976a48M9P3j11J78j8J24j12Q1l07J79k70L32K16j30j67O3j25j29J97L56o1k40
3998C0Q6O5p7j43M1pM6J1l8n8P9o5K2K3N0k02L31j74j79K51o4p1L59k56k77L66
4024A49l68n1L76q0K9m1J21k53M67n15k2O5R8O9Q9j60K99l32r5K66Mn5o8N7j55
4049a06p3k15M12J7J29k08P5J05q4J33M6k48Jm7L22p4o9k09j08J36l2pK87k64
4073h1j60QL96j21j35jM5j66L54J70k46Kk21K00j80L35k84k5O0j62K39j35j78
$$ y = [48, 12, 224, -11, 333, 517, 356, 169, 247, 61, 124, -223, 104, -101, -32, 174, -49, -43, -25, -10, -136, -153, 55, 75, 211, 285, 110, 2, 13, 8, 11, -56, -51, 107, -25, 51, 106, -253, 298, -39, 24, 72, -157, 14, -270, -90, -22, -77, -27, -58, -64, 204, -36, 61, 394, 83, -85, -209, -161, -119, 28, -67, -64, -241, -16, -328, -163, 108, -48, -30, 68, -244, -99, -148, -99, -26, -137, 41, 23, 147, 35, 116, -191, -12, -282, 50, 266, 136, -31, 32, -93, -222, -25, 331, 270, 30, 116, 181, 104, -39, 2, -5, 41, 52, 14, -44, 35, -30, -8, 15, 65, -137, 194, 20, -159, 92, 28, -43, 316, 60, -217, 149, -219, -270, 106, 26, 55, 14, 135, -118, 349, -166, -188, -123, -25, 44, 133, -27, 272, -60, -155, 111, 115, 60, -8, 49, -106, -179, -394, 18, 35, 164, -44, 31, 136, 52, 185, 231, -17, -16, -63, 259, 185, 116, -93, -201, -65, -97, -104, 183, -81, -241, -233, 163, 42, -93, -94, -49, -215, 139, 309, 63, 65, -156, 44, -136, 199, -85, -110, -50, -212, 27, -108, -286]
4096b86P3J36r9J18j92K48L4j01N4J67q7rJ3J84k35J8K9j94JJ57p1k04J64K17
4120A35k80P4J16l2m2L0p9O7r0J26j27K20l21M06j11l30K11j41L92k63j9K12k94
4143a40j44L13J47N2l19J66k80K57L1j01l2M7J43r2kj75K97j64J8j19l20M77j69
4166a09j69L13k59J86K60l00K47j51J36j24K25j07k38J50jj54l4N3K05n7l27J60
4188i5k42k1O30m18o7J54m3L37n7j81o1K15j16J87k93q9J66j99L03l32M9K47j3
4211F1j34K51k63K52j58n3J93l30Q3J58Q9K2m2k55L18q0k45j50K80L5k56J65K7
4234c2r5J1l0OJ20O6L5Q2o8l99M44j13O3j15P3L3M5k35J60Q4l29P9L6J20p6J22
4260H7R0l36J07J3m1J12j71m6k2J39K31j60j1J4l3p6q2K56j79M13l06J28j84j35
$$ y = [-286, -213, -77, -176, -58, -250, -2, 32, -69, -15, 152, 65, 56, 69, 253, 18, 36, 65, -129, -128, 29, -42, -246, -82, 135, -145, -71, 45, 13, -29, 1, -78, -11, -101, 25, -102, 118, -203, 203, 92, -238, -27, -168, 224, -39, -58, 154, -140, -284, 29, 176, 228, -91, 75, -205, 52, 83, -18, -50, -3, 140, 48, 46, -129, 168, 4, 22, -97, -417, 60, -109, -278, 35, -224, -38, 222, -78, 169, 18, 154, 30, 255, 148, -90, 60, 59, -95, -129, -76, 129, 72, -255, -95, -337, -358, 272, -146, -213, -59, -102, 235, 178, -3, -64, 151, 35, 222, -71, -160, 6, -193, 110, -222, -173, 74, 61, -73, 178, -85, 167, 9, -44, 149, -181, -98, 60, 149, 171, 129, -126, 192, 112, -133, -283, -3, 32, -224, -59, -32, -127, -116, -146, -140, -20, 46, 81, 163, 95, -304, 140, 27, 90, -25, 48, 81, 126, -109, 51, 135, -194, -115, -79, 41, -35, 87, 177, -159, -52, -39, -80, 32, -139, -185, -207, -68, 163, 3, -8, 6, -27, -103, -185, 71, -108, 305, -1, 127, -57, -192]
4284a92M10k26pJ12K74k30O3l8j48l9k79K43P0q9J10k32L67j20o5j2J55k67k50
4307c90N08j35J30j09j29K38k1j88M37l40jP5N8j38k3j62K18j27L05O8j97k31
4329a54L32j14Q5M0m9j69J76j09O5l23J03J24m9L17l60J06N6k67K30j23J81k91
4351a93j69M40R7p0k22J65Q7L8k03K75j08k09J1J40j79J19q2K03j80K39N4j4k37
4374BK3n4q8J60m5Q2J50j21n8j24J29O9j07o4K26l89L31k19K94k83J51rlK26m98
4399b19N61l76J98K8k46q9J94j16J86ql36K34op2p3j12M41l09J15N7j28o8J00
4422d4J30n2K23p0l75J84k50J47R2p0j50M25p9k1K7J56L5k94K78k61p5o2J36P
4446C7j88p1L89k60K67j78M0K37k13j34K38j38q2j64J66M22n21J18k2j2N7p9O0
$$ y = [-192, 218, -8, -15, 97, 371, 141, 204, 166, 18, -21, -300, -57, 13, -76, 34, -198, 169, 49, -16, -28, 127, -140, -390, 118, -17, 113, 4, -125, 113, 92, -96, 341, 1, 0, 75, 133, -5, -28, -190, 28, -99, 206, 274, 77, -154, 178, 64, 149, 189, 140, -29, 147, 38, 103, -220, -117, 7, -42, 275, -85, 21, 77, -190, 40, -83, 98, -193, -362, 78, 175, 105, -117, 48, 135, 173, -30, 245, 137, -72, -61, 79, -100, 19, -63, 140, -40, 199, 253, 239, 2, 25, -29, -117, 43, -2, 80, 230, 109, 51, -73, 56, 125, 18, -46, 180, -209, 122, -97, 197, -86, 65, 56, 53, 279, -219, 342, -34, 164, 192, -54, -143, 51, -65, 121, 113, -223, 11, 5, -67, -140, -252, 189, -120, -5, 52, -76, -144, -44, 86, 34, 257, 187, -188, -4, -254, -107, -15, -85, -235, 190, 111, 90, 117, 273, 308, 14, 292, 31, -44, -106, 30, 37, -151, -222, 167, -93, 174, -4, 36, 273, 60, -74, 164, 26, -56, -220, -54, 368, -153, -35, -57, -69, -12, -91, -31]
4469c1q6J74qj28J19j33k82L70o4N0l71M21J41k51j21L05j97J24OK9N2k31J03
4492iJ94L00p48L28J36k86J57l7K9P9l52K23j35K61l9L0n47L13J99j89M23l16
4514A4k24J27L26m09J2j05K6J91J21j20k7O4k0o0L50l34J79j40L76k64OO9k29
4537g1J64j19O7j61J38K22j91J03k72J39k0O0P6j9j94nk2J90q2R3j65J02j51J00
4561a8M9Pp4M8j22j04K28J05k60L90l83P5J38j64O9j71K06K0jj0M7J6k33J35K32
4586B25m7m48Q3l5J88NJ27j75K03j65kJ21n5J27k64J81j05M9O1oj68J52r4K79
4610B37l30nJ09J06R1n9o1j97R2K35j35j5O1l01K4K32M1J5K7O2j87k66K97j45
4634g2j02mQ8L43l46J43M2k08K1K22j55K4n3p7N6J4r4K81K0j75q5k3R6k3K15j98
$$ y = [-31, -117, 57, 49, -79, 40, -93, -375, -5, -69, -19, -390, 31, 172, -79, -200, 105, -92, 32, 38, 67, 119, -112, -9, 185, 485, -263, 65, 201, -85, 72, 35, 64, 143, -209, 14, -121, 140, 101, 131, -416, -103, 96, -93, 330, 14, -210, -83, 243, -166, -154, -259, -233, -42, 79, -41, -68, -4, -24, -84, 266, -68, 111, -29, 347, 83, 89, 158, -71, 93, -26, 41, -120, 18, 240, 49, 152, -120, 19, -1, 59, 135, 116, -78, -83, -105, 85, 3, 96, -69, 33, -118, -18, 31, 38, -36, 12, -110, -214, 14, 119, -141, 249, -134, -59, 79, -85, -16, -187, 19, 39, 38, 28, 75, 91, -142, -7, 225, 178, -270, -187, -222, -34, -29, 98, -77, 126, -39, -41, 80, 25, 152, -112, 69, -36, 13, 74, 68, -100, 52, -42, 237, -93, -98, 11, 117, 208, 149, 88, -109, -17, 218, 83, 68, 129, -172, -148, 84, 125, 140, 167, 229, 42, -224, 73, -72, -174, -178, -90, 253, -93, 50, 92, -116, -95, 127, -28, -4, -57, -134, -78, -64, -158, 123, 143, -32, -117, -140, -44, -67, 148, -50]
4660e0J96Kl92N53j26m8o3l81K57O3Nk56K54j36K36j12qK6k30J01j3L2K18j60
4684c2J42MO8j85j12J51k42J17K11j98m6j27K14k0PN2P5m1k41K69R1j80P1j84
4708a36O9K89j50k5Q5K08l01l4k72oK33J67k13j47K87k4K96n02M13j37l15L96
4730A81j98p2j8k2J33nj00K35j67J13m1j60R5J48k12M52l24j73K84N1k06r2K02
4753A04l53R6K79K8J54k64l6k3K30m31M68k44j42J05J63k30J7P3l6j03J17P7l5
4776A4Q9k9jj08n2m8l8L22k63J84K67k89q8R8K7l7l4O0k9m3L0jk90K32OJ92k54
4803h3K51j82k00N5K22J0L3m09L09J51jm97L40J37m57M40J11j40k95J30J77K02
4825C04k54K75k62j96K64j44Q4ml19K91K69p8m87J75K12k86j32L09l84M48l7j30
$$ y = [-50, 146, 148, -244, 309, 183, 135, 72, -309, -52, 11, 16, -240, 14, -122, 114, 2, -6, 20, -210, -109, -122, -90, 128, -32, 110, 114, 182, -3, -115, 36, -206, -89, 122, -76, -122, -249, -35, -55, -48, 4, 79, 38, -203, 66, 157, -23, 48, -136, -67, 222, 72, 47, 132, 340, 39, 5, -267, -273, -40, 127, -86, -233, 54, 30, 326, -176, 237, 100, -215, 181, -17, -89, -107, -129, 4, -1, -101, 134, -33, 80, 39, -121, -26, 122, -90, 362, 38, -135, 149, 200, -6, -98, 104, -249, -153, 126, 154, 308, 44, 8, -15, 215, -216, 252, 8, -134, -29, 134, -96, -79, -6, -42, -145, -28, 49, 14, 103, 74, 73, -35, -87, -135, -173, 149, -114, 70, 337, 48, -40, 58, 85, 48, 14, 74, 45, 2, 32, 31, -259, -27, -21, 171, -83, 168, -14, -214, -159, 63, 73, 106, -303, 6, 157, 156, -341, -1, 136, -321, 119, 230, 90, -205, -75, 102, 304, 50, 325, 63, -133, 131, -13, 71, 67, -252, 39, 308, 230, -257, -82, 130, -156, -288, 21, -363, 85, 48, -82]
4847h2P4J15P1l7j57J46l50M9J65J94k04l6K66j99Q8j34Q9j02L52l27o5J3N8Q3
4871G0J22k87k08O58j57j86J79k77qR2n6k61J06k3Q5j08K96n2J78q8m3Q3j12J14
4895A17J12k97j99J24K22K36l23l4J41J78l92j3K6J25rJ17l6k00K33k8j66J45
4917G9j51J34j49O0P6M0j24Q9j5k52J32P4R1o7l17J66L35l46K22OP3qj20k35L69
4942A62j77J11q9j57j72L82j6j27K7j7j19J73p4R8j18K26q2J08%m51N76j89j5
4965F0m9L2j6L42l95J65k75j22K85l19K49j12O8NM2J64q4k92L11j28K23J5o8q7
4989A4K85k70j40Q6j57n2K34K02k85NJ03K80l52oN7R1K63l56p3n6J56r6K20j08
5013D5P6k15j9K15k13k7J36j12j54N27j85L9l4j89J76l05J99q6P6K71j60J0j15
$$ y = [-82, -8, 107, 178, 141, -16, 130, -220, -171, -6, 188, -16, -52, 214, 15, 103, -31, 58, -44, 308, -19, -84, -71, -13, 70, 192, -95, -303, 355, 198, 12, 191, -86, -94, -2, -58, -319, -213, -236, -151, -259, 37, -15, 163, 75, 32, 115, 3, 117, 229, -68, -267, -143, 79, 315, -8, -42, 99, 277, -115, -128, -102, 23, 14, 131, 95, -105, 128, 100, -66, 79, -72, 62, -87, -27, 49, 89, -35, 54, 39, -213, -81, -7, 84, 17, -300, -134, 201, -145, 77, 83, 156, 148, 28, -207, 162, -15, 96, 7, -150, -322, 60, 44, -83, -56, -73, -192, -19, -93, 5, -113, 113, 31, 139, 139, -312, 264, 75, 60, 11, 43, 27, 369, -26, 139, -136, -258, 27, -292, -43, -155, -87, -82, -40, 124, 40, -252, 59, -69, 154, 169, 101, 14, 299, 29, -111, -25, -182, -234, 0, 202, -83, -78, 25, 305, -47, -53, 4, 95, 358, 2, -71, -127, 29, -67, 153, 45, 121, -94, -113, 102, -111, -138, -2, -114, -268, 259, 74, 113, 79, -110, 66, -239, -40, -126, -50, 221, 61, 71, -44]
5036d4nR9j08J65k67L74m52J80l0K65K5Kk36K83k71J28J76n44M98k16M9k01M10
5059B80n13L52n9l02R1L02k14j59J29K09j8l65M11k38K31O5l00N9Q5n7K9J71l3
5082A56k03J15o3K81m06J69J91m47K59Jl67K10L57k66L2p5J03q7j1l2K02k51J79
5105D7j38J77k69R0K97k48O3m4J91n39K40K80O3l32K63K55n26N0O5j26J60J70
5127A89l01R4J6M7j02NJ04n3m19L81j10J78P6k28K38K1p0l5Q6j27N8j98K46l2
5151F4j64Q3M4n5k9K31K9P2k11q6K12R2k06J44q2j64N9P7j93K84j75J1q3j13L30
5176A71j46j29K7J77l0l06K21j28M9m6L99l46J41N6K2j86j05J91k06J10P1j13
5198a06L40l43o1K13k35K94k79L45p3j99K5J82K15l20J01j81k0L60k91N4Q4k85
$$ y = [-44, -49, 50, -58, 107, -160, 214, -238, -58, -88, 177, 202, 204, -32, 251, -20, 108, 284, -260, 238, 22, 71, -130, 280, -233, 119, 60, -242, -151, 151, -63, -222, -93, 116, 98, -267, 144, -94, 137, 202, -98, -39, 46, -11, 18, 189, 156, -47, 68, 5, 286, -120, 49, 240, -207, 52, 53, -314, -104, 253, -13, 19, -56, 47, -40, -51, -83, 119, -132, 47, -91, 86, -183, -93, 204, -44, 19, -25, 166, -373, -133, 147, 210, -122, 141, 396, -130, -80, -15, -141, 19, 189, -112, -18, -2, 45, -57, -52, 52, -1, -420, -39, -149, 29, 105, -123, 115, 136, 66, 31, 117, -10, 48, -150, 96, 64, -100, -17, 27, -28, -57, 174, 203, 275, 64, -22, 190, 282, 76, 220, 138, -26, 33, 110, -83, 201, 26, 37, -46, -159, 171, 25, -104, -77, 100, 70, -236, -15, -143, -94, -140, 259, -87, 54, 110, 132, -54, -159, 32, -174, -64, 7, -106, 234, -109, -170, 43, -192, 102, -177, 168, 95, -104, -79, 103, 318, -2, 99, -82, -102, 258, -33, 21, 105, -180]
5220a80KK27l34K84N8k12K23k37O2K3n5K27J18n8l09M04m36n2J67J3lr6L51k24
5244c7K57l56K72l34L21q7kk7J77j85K4L25l29Kj98K15J03mj05K1j79K37J04j15
5268A00K3ok94J84l98M93L4j45o7K25j43j73K38P2J47k07j45K16j59k72L59k47
5290a65K20P9j55Ljq6J80o3Q6P8k74K24o7k36pO4L4m3J20P0l73K87p5k6J5J50
5316C9J31j22M1o7J38j49J73l79J87j07L41k5j16m34L41J68l8k58J59P4N5j56
5338dQ0M3k40J75k8M6N2k4M0m57L01j83k5J22l5J77N6P2r5j14J10j16K32k96L54
5363B43j84l09L24n9j35J78j7J28r9Q7k9k46P8n8J45K8j36J65J05m7k37J35M9
5386A09k78J68M2J26l94K98L7J90r8l65L6P5q5P4Q7r4Q1k76L88k01J1J67l03K70
$$ y = [-180, -178, 49, -285, -1, 57, -155, 68, -169, -107, -84, -139, 88, 206, 148, -161, 243, -193, -245, -78, -65, -68, -164, 187, -37, 220, -136, 136, -198, 123, 36, 34, 7, 184, -1, 23, 348, 19, 21, -177, 38, 141, 137, 32, 53, -126, 111, 215, 100, 123, 117, -177, 7, -391, 102, 136, -9, -76, 149, 6, -167, 71, 143, 290, 83, -62, 154, -5, -277, 82, -165, 55, 134, -21, -18, -19, -105, 75, 12, 98, 176, -98, 126, 59, -177, -184, -120, -86, -129, -9, 61, -312, -25, -100, -126, -111, 39, 170, 48, 89, 22, 160, 11, 184, -195, -8, -115, 226, 201, 85, -349, -8, 160, 122, -136, 23, 97, 152, -4, 76, 119, -121, 54, 26, 72, 124, 100, 140, -317, -16, -199, -224, -102, -137, 40, 96, 168, 73, -41, 69, -47, 185, -111, 243, 59, -250, 74, 15, -120, 58, 41, 169, 70, 157, 128, -118, -40, -98, 47, 75, -61, 104, 209, 162, -75, 60, 109, -169, -1, 41, 167, -227, 71, 108, 298, 200, -165, -129, -54, -139, -65, 22, -72, 9, -267, 121, -80, -69, 98, -205, 65]
5410F5j16J22k8J47K9j67m9n1r9L02r7J05j70j8Q8j82m1J66j78J31N0k4R3k38
5434a60J48N5N4l6j82o0K52L9k65J99j25R4J15n0o1l9r9J63L5j80J18J36o7j95
5458a11K87j19j13K9R2K68kj84r8m1O4j49Q1j25n4R0J30j8j23K13r5j67L81k88
5482e2J86k48j01J21j77L62l3q9j07j35l2J80J22M5J68q0l3k54O4j80J93k5K47
5505A42m5k61K22J3k15M39m94J98J31n2J91l36J40k69K52O1r5N2k17M67j65p7
5527H2O5j92o5J74o2J16m12L14K30l55N6L02Pj10l05l4M5m9K80J60k11PJ27j47
5551B3Q4r4P6k7k8j65M26m56j6K36p8j61R2J98j12K41j31k1k43K39k6K1K8j91
5575h5J73j87l7j02J57o1O9j10J43J36k28j51M12J10m19L48n4j09l4N5J2k21M2
$$ y = [65, -51, 71, 43, 190, 219, 52, 3, -48, -147, 155, 58, 163, -7, -25, 63, -119, -160, 6, -172, -41, 9, -15, 78, -160, -12, 43, 97, 61, -121, -181, 71, 110, -155, 44, -81, 13, 128, 78, 17, -22, -121, 42, 77, -103, 15, 151, 84, -111, 176, 57, -56, -27, 65, 333, 331, 147, 49, 8, 72, -77, 4, -121, -175, -85, 45, 27, -96, 117, 22, -145, 236, -52, 134, -114, -215, -94, -271, 91, 58, -31, -138, -273, -305, -125, -3, 42, 210, 130, 97, -157, -93, -273, -80, -105, 142, 97, -164, 58, 71, -144, 295, -199, -1, 130, 78, 269, -67, 73, -196, 56, 117, 22, 74, -143, 324, 159, 82, 147, -45, -110, 64, 2, 118, -294, 20, 250, -105, -49, 253, 260, 150, -155, -189, -144, -193, 87, 247, 36, 43, 170, 23, 107, 13, 89, 62, 34, -131, 295, -161, -177, 59, -19, -180, -88, 110, -2, 239, 108, 87, -156, 83, 57, 78, 106, -85, 88, -99, -136, -238, -81, -142, -73, -183, -40, 96, -132, -283, 129, 239, -180, 168, 114, 5, -29, 26, 38, -183, -141]
5598a41J23j1l1j1J18l07P7j6J54Q3j87j58M24j81MJ48J72K3o4j43p3j62k2J05
5622g6J72N4L1j81M1%k83L1J63K13n62J92J47M27l42m7j8N1m0O6k99L42o42N10
5646e0r3Q0Kp0R1oJ81l23L19J1m1P0j56J28j47K20l25r6J38j01K70Ok13J53k16
5671a68J39j23J68j31J7L21n5r4J37l09J10N5j19J94k19K50n7j73K62l83J51J0
5693a7n4J86k10J21j52J07O1p3J60k94J84K6K3O1m6j02n3L17l68L95l28K52j68
5716B8m16K98p0p7K87L7M9k79J91K00k19J28k73K03j18k2K27O3l21j52J44K44
5738A52J04q1m01R4K01k49RR4o5J59o0o4J84Q5p9r7j52P0J08J63l01K0K23k82
5762a65N1m6J81L8O4j47j04m9J46l1K70l24k71O02oq3j94j62Q9j32L75k58L56
$$ y = [-141, -18, -29, -60, -71, 47, -260, -183, -199, -45, 38, -149, -307, 117, -64, -60, 88, 260, 283, 219, 76, 3, -159, -181, -76, 96, 150, 181, 0, 41, 41, -242, -211, -48, 165, -397, -205, -58, 369, 27, -20, -38, 13, -27, 39, -260, 82, -560, -50, -143, -63, -61, -131, -40, -46, 135, -188, 131, 142, 101, 171, 15, 143, -4, 216, -109, -205, -67, -168, 102, 108, -105, 48, -168, -29, -152, 16, -115, -98, 223, 168, 74, 211, -98, 12, 67, -52, 142, -77, 173, 116, -57, 205, -178, -27, -17, -71, 115, -95, 26, -126, -19, 42, -31, 129, -165, 19, 45, 68, 129, 83, -19, -72, 245, -123, 272, -56, 196, 28, -388, -90, -160, -237, 50, 87, 136, -143, 48, 248, 29, 157, -116, 87, -31, -53, 174, 237, -84, -236, -92, 152, 256, 175, -226, -132, 69, -180, -171, -77, -142, 17, -43, -107, 77, 162, 83, -14, -166, -96, 12, 175, -126, -106, 117, -165, -114, -160, 21, 59, 123, -24, -128, -177, -31, -62, 208, -116, -387, 215, 209, 126, -68, -230, -141, -273, 102, -156, 200]
5785B00j54k4l11L55r3K69k27jL59m55k9K35L8j99J6k13L48r4J20k44R6LRl7P4
5810D1j29J66j41j02K93Q9k52o2M7o8J82m4J1j41l5j92J96o4J07q5K8j57L31l1
5834a2Q4J28j77j90L45k52L9k1J5R1R3j79p8K06J40k44Q9o2J54k50J48j96K65
5857A36j37o3M91n57M1j59L32j54J51k10P2K05q7J9J20m89K36R8l63L01P4O9r7
5880B9p7K35k32L07N5n68N70k91J86j03L5j48qN4q6j27L01q0mq2o8k78K07J67
5904fj15J43j33J86k29L54m22J1K69PL5k28R3j24K45j3P7n5J0qR2m23L66J44j79
5929I7J04r0J45j85k66K65n1j57J88q1Kk31O1l2M8J68j43M33j21j14j76L89l80
5952a27R3J1K25n7q2M6j10J47p2j57J88j61k1M04m23J26r9l5J54J64j42j26K82
$$ y = [200, 46, 22, -289, 66, -27, 242, 15, 14, 373, -82, -111, 124, 162, -37, -21, -234, 114, 20, 140, -104, -8, -5, 4, -33, 41, -88, 78, -63, -165, 128, 217, -35, -97, -50, -118, 64, 20, 31, -110, -145, -337, -141, -205, -98, -183, -155, -312, 19, -12, 72, 200, 23, -167, 178, -74, -35, -56, -41, 50, 143, -36, -114, 92, 232, -12, 77, 15, 169, -81, 67, -129, 136, -1, -64, 427, -130, -89, -248, 84, -70, 81, -129, -57, 148, 61, 80, 200, -289, -53, 45, -318, -17, 57, 126, 29, -48, 187, -45, 262, 317, -251, 319, 28, 214, 111, 146, -2, -10, 44, -42, -169, 132, 52, 48, -34, -102, -380, -173, -6, -121, 22, -111, 75, -154, 200, -222, -211, 58, 65, 100, -128, -35, -159, 86, 73, 150, 95, 105, 97, 189, -234, 132, 276, 97, 201, 111, 256, 71, -195, 70, 19, -138, 50, -31, -29, -260, -199, -231, -183, -15, -158, 275, 154, 40, -136, 253, -127, -34, -23, 202, 145, 63, 109, -1, 146, 74, -83, 105, -56, -77, 327, -96, 30, -69, -104, 50, 214, 72, -54, 228]
5975B28j25l7J7k70P0K5K18j27n1n3K2k6J31L64m68K21j60J4L04m94K69k1k63
5998b12L18J61l78K56j77R8o8j28K39m1l9j31L22k96K66k09J72j99J84k44J21
6019A5L2k21N1J22N5k46K59M7k54j51J47jK51k62R0j22K31Q1k26K79j47j49Q0
6042c9J91l11L30n3j77K5J12j5q3n3K06O0j74%J67k04j23M04l95N3J40j70L5K76
6066B02r6k54J99K9J45m23K91n33M05kJ82J16m24R3q3J91J69N3p9j99j3j2K4O3
6090D4O8j75j43L78k15P4j24J34k64N38j04m45K98qR7l47J52j14L64j87M8o6n3
6113e0k1N4j01Q0q9Q4r9K80o9r4l7J66j36Q0R4j77N45n54Qo3L1l2M8j98P6O1J19
6140Fp7n2p1K26k18J95j93K48M6k05K7K43j26l2Q6o6J17j55J30j23j0K3N0m7j68
$$ y = [228, 103, 66, 83, -187, -117, -92, 126, -1, -52, -105, -83, -109, 22, 386, -82, 139, -21, -7, 297, -197, 72, 51, -212, 106, 267, -111, 145, -32, 66, -2, -130, 109, 68, 29, -102, 220, -76, 190, -19, 153, -46, 138, -106, 15, 47, -174, -123, -1, 54, -192, 67, 114, -140, -291, -144, -145, 106, -156, -66, -188, 43, 124, -102, 177, 30, -119, -39, 152, -159, 171, 118, -59, -34, 78, 63, -20, -73, 133, 193, 19, 19, 186, -18, -141, 263, -132, -79, 61, -109, -74, 202, 106, -148, 51, 80, 225, -198, 93, -440, -35, -37, 145, 261, -163, -70, -153, 38, 207, 260, 181, -18, -31, -43, -19, 44, 112, -63, -206, 172, -43, 31, -93, 41, -223, 315, 211, -234, 64, 56, 153, -194, -42, -156, 208, 21, 69, 3, -50, -71, -17, -118, -38, -127, -43, -142, 138, 69, -25, -62, 104, -32, 48, 142, -35, 510, -44, -36, -99, -68, -100, -52, -250, -174, -113, 6, -71, -123, -194, 32, -186, 9, -184, 64, 110, -95, -68, 175, 49, 17, 103, 37, 154, -1, 129, 6, -4, 19, 69, 22, -146]
6165a46n1K88j57l1pj01L50j19J35M9j30j36j92J66qJ0K03n5j92J93k86R1R5j37
6189a68J2N3J97L8k67m0J97p6K88k40j5j04k0L85j41N6M3j14j65j31Q2l3K25P8
6213A40k87M2L15m47K53r1N5k17J36J18k83L77J34k40L15p3j24j60M8j34J79P3
6235A29k00J11k66J62l88M64J69%o8j76M8J38k84K26k97J86N5m4k44j57L01K11
6257G6J20k87j05K59J7l73K01Q1J03n6j15k27K72j12O6J14j92K17L1k53J57K0
6279A4j38j59K60O1K07l20J36l33Ql4K6J89o9M18l67K50j51J08L4j72j25j88L99
6302E4J09L09m82J56k6l7k4j90P1J80j76J07k98l6L78k51J81N9j16P3K9J91l47
6325h6Mj8K15O4k33q0j01q8J61K74r3j59L65m41Q3K71q1n9l8L4j32N2k03J07K39
$$ y = [-146, -197, 91, -66, -97, -104, -205, 145, 26, 161, 210, 80, -56, -248, -82, -90, -80, 123, 68, -124, 69, -217, -126, -31, -168, -156, -103, 94, 132, -135, -175, 22, -54, 234, -6, -21, -125, -145, 240, 99, 155, 198, 84, -81, -212, -130, -163, 62, 140, -147, -105, 210, -237, 16, -75, -20, -237, -101, 17, -266, 111, 245, 5, 320, 247, 123, -37, 11, -123, 56, 129, -71, 40, -226, -64, -452, 12, 181, 181, 113, -63, -15, 123, -161, 65, -232, -46, 9, -35, -279, -436, -135, 76, 196, -91, -196, 63, 80, -293, -92, -11, 92, 36, -79, -306, -34, -146, -80, 34, -158, 59, 90, -163, -6, 14, -124, -283, -23, 38, 245, -75, 61, -272, -264, -298, -272, -83, -152, 266, -101, 149, -2, 106, 140, -32, -157, -345, 54, 163, 472, -10, 146, 120, 83, 59, -131, -60, 120, -56, 51, -247, -283, 95, -156, 25, 84, -32, 41, 70, 261, -86, -82, -100, 115, 179, -54, -134, -235, -323, -162, 112, 19, -140, 225, -216, -133, 138, 57, -2, -40, -6, -138, -86, -289, -182, 57]
6350E7l84L42j23k4j3P1K86k18N3p1L09l89O7M4N7j94J29q5l4J9L34n19L34L6
6374H4k38J91M33l65k4q5o4K07j82P2J12j83j35N21k79j59P0j81J86l26L71n7
6396c1O4j69L12k33q5J7N0J58j60P8k43L10o8L0j49K33r9K66j17m1n6k2l6R1j85
6421h5J40k50M83p3k68J49k20L25m11J7Q4J58k8j30J67k37J01J37k31Q9j47K8
6443b02P5K51O0k52j52J38N3J43N2m68M09k07J56J4m7n9l7L63l53J46P2l00M6
6466i9J78l5J57o1k32J97m09L31N1m58M37k47L04l24K71Mk31kL22q6k42N1l7J48
6490a2k5k88N14l17N0k5p6J27J58j83j65K42L5%K13m97M72k50J46jl17K65j41
6513g5j43K96k59L24m01M71Q9k32j11Q3K12o0j44k71K17L65m68K47k79J66p1l6
$$ y = [57, -327, 15, -108, -132, -145, -74, 212, -6, 47, -24, 285, -104, -37, 7, 64, -130, -1, -86, -120, -101, 233, -286, 48, 84, -154, 37, 470, 105, 81, -4, -68, 139, -43, 29, 141, -42, -177, 344, 65, -94, -24, -205, -19, -345, 26, -31, 33, -136, 176, -57, -142, -125, -75, 83, -77, 1, -242, 68, 0, 30, -119, 114, 15, 281, 164, 123, 67, 45, 9, 100, -85, 55, -195, 288, 215, -53, 96, -124, 201, -210, -193, -109, 49, 21, -109, 58, -179, -78, 59, -172, -83, -230, -202, -127, 124, 184, -68, -220, -82, -29, 114, 166, -302, 107, -100, 56, 70, 23, -36, -73, 290, -63, 83, 155, -145, -99, 79, 44, 201, 140, -92, 105, -304, 27, 78, -380, 57, -190, 114, -210, 61, 65, -166, -168, 154, 68, -174, -123, -160, -12, -37, -325, 189, -128, -78, -103, -179, -52, 106, -77, -242, 0, 35, 35, 248, -249, 223, -27, 119, 118, -199, 66, -75, -218, 78, -181, 143, -258, 213, 302, 70, -41, 42, 254, 194, 50, -221, -4, 361, -107, 140, -139, 27, -44, -80]
6535h0J38L7k57Q1N2J21j97L57n1l27J53J65k73m8J90k37R4q1L5P1J21J23r3k
6559I2l53N30j16k38j34K52j13J31kr3M4P9k51N2P3J05L9m0j78K65j77j20J5L00
6583A62j14l3P9l65L34rJ38k70J66j75n8J62M9j00Q0j89M6J14l2J04j33N8N9J82
6607B55j26j49J30jK7p8nl2J97k46j78J30o2J70k68J64n6R0k07J08q4K46J86j42
6631F9or8k82K46r8J84j65Q5J17L2j10j4L6J74K5k96K21Lj15n0N1J14j04R3m6
6656F6k30J83l4J27j71m4M01k75l9K9l1J42J18n42K46k30M11j48J03J89k82J0
6678aj08R3K12m16K31k04J15K99k15j46k9K74l25L32k45j14M33j8L5k67K26m21
6700b59M1L45k18M2L2j47J16M10k52O4j50k92K88O3j49L56l09K21l16Q7K1n3j53
$$ y = [-80, 58, 95, -162, -81, -29, 92, -105, 252, 201, -126, 27, 192, -81, -129, 61, -176, -82, -163, -128, -57, 64, 187, 94, 92, -261, 269, 153, -85, -219, 33, -80, 51, 49, -44, 0, 79, -172, -120, -47, 58, 97, 57, -121, 144, -33, -153, -138, 162, 48, 15, 94, -271, 63, 54, 192, -78, 88, -87, -145, 17, 66, -34, 46, -143, -97, 17, -15, 89, -44, 14, 73, 255, 129, -20, 110, 109, 136, 58, 53, 21, 218, -28, -206, -76, -138, 32, -236, -72, -128, -38, -245, -137, -221, 25, 211, 69, 63, -35, -317, -71, -169, 15, -150, -65, 52, 84, -26, -40, -4, 170, 195, -101, 120, 123, 8, -42, 9, 123, 19, 112, 66, -164, 19, -15, 112, -59, -103, 298, 23, -16, 13, -18, 124, 242, -300, -54, -284, 127, -21, 82, 271, -11, -1, -109, -16, 196, -220, 11, -193, -78, 221, 6, -140, -169, 105, -220, 112, -133, -247, 186, 168, 203, -64, 162, -259, -218, 127, -91, -49, -17, -164, -48, 362, 110, 174, 24, -268, 20, 83, -66, 290, -19, 202, -114, -27, -6, -59, -212]
6723b12K89j20K00l9l38J29J21j0k85J3J18K06j17J1Q8NL3m5j84J59j73J69l6
6746a8O4l8o3K30k13K36j01k23J64Pjj21P9K7j39K00J0j73J04J73j92j19J56j10
6770f1K53j67j07J51J19l28N3J39L4j37K13j98j61K41K45l11J82k04k0j47K37
6791B6K04L9j32j96m5J78K33k85N4k06J07R7lk67K86k71J74j24J93n7n4J80k27
6814i6K20l79J20j08J11K42J3mk19N2J21j64J38O8l63L35k07K59l19K0K51q6R8
6837A03r6M2k8K36k74K52J07l80K87k63L4j76L33j22o0k8K02l46M04l32J39q4
6859e0r7M41k35j82J9L02Qk5L4j27K49k09p0Q4j59j57K39K7J13k75M59m44j55
6882b10K66p3J86m10L82p1l43K11O7O9j42J31QO4L07n77M55k31l8N2k50M39k13
$$ y = [-212, 77, -43, 157, 118, -220, -91, 30, 20, -265, -252, -134, 72, -45, -34, 54, 59, 92, 47, -137, 22, -151, 18, -18, 46, 8, -55, 175, -38, 198, 97, -126, 38, 45, 44, -77, 2, 29, -110, 90, 100, -73, 31, 204, 12, -107, 49, -61, 192, 25, -82, 69, 188, -140, -87, 52, 86, -51, 162, -36, -197, 44, 289, -22, 160, -44, -64, -211, 26, 230, 269, 137, -59, -104, 74, 307, 22, 76, -130, -23, 74, 71, -196, 90, -181, -7, -131, 62, 5, -49, 131, -96, 124, -255, -135, -243, -132, 110, 123, 119, -100, -48, 73, -91, 47, 115, -248, 87, -120, 139, -180, -160, 91, 5, 103, 7, 49, 21, 257, -17, 235, 342, -38, 249, -14, 20, -156, 177, 55, -5, -33, 169, -177, 227, -105, 34, -50, -147, 294, 59, -123, -104, 198, 206, 181, 215, 88, 337, 128, 58, 142, -17, -174, 65, 92, 205, -70, 389, -55, -210, 56, -17, 169, -241, 141, 70, -273, -62, 5, 74, -68, 63, 71, 135, 442, -135, 320, 89, 51, 103, -147, 292, 79]
6905G9j30J95r2M2m9k5J0L23j96l89L87j49K3o1J21J12q6Q1k88K37k63J43k60
6928b35j43M45J08l72J59j0j42K78o3J25Q4j88k17p2M53j80J03q4m0K73l31j90
6950b39L22j38L9L76n74L24j91LJ54o3j26J37n4j05L5Q6K10k44K9j46N07m35j07
6973b00J52J28k6j26n2q9L63K9l18K93m94J06K77m3q0K7j6o8j37M53j29r7r8j1
6997a56K98j86K00j32r9q5k4J43K5p3J46P0n6r2R1k74J58J42n1J71m48L78j56
7020a0R0l3M4K58m26m7K31k67K60k87K29nj70P3L48k88k50K75JJ32l25J05j84
7043b46L14j71N0R4J7P3l3l0p9Rr4J37l50K98j93K76k4k17J86j12L87k81L2Q6
7067A29N1l13L32j06O3J1j87K8m4k41J92J16q3K5K18j53o6q7L3J0O4n9L4J20j23
$$ y = [79, -51, 144, 52, 94, 45, 20, 30, 353, 157, -232, 155, 6, 29, -32, 89, 201, 115, 196, -92, 145, -118, 25, -235, -378, 67, 175, -197, -38, -48, -190, 88, 25, 150, 234, 46, -171, -243, 210, 30, 133, 49, 9, 282, -49, -239, 83, -55, -16, 360, -214, 110, -81, -78, 76, 13, -113, 24, -30, -135, -100, -14, 196, -48, -19, -165, 342, -93, -200, -48, 80, 54, -72, -124, -213, 150, 179, -139, 154, -340, -234, 43, 0, -80, -53, -69, -137, -274, 179, 50, -47, -145, -156, 142, -44, 156, 24, -75, -160, -184, -41, -16, -89, 57, 127, 71, -21, 70, -204, -46, 96, 45, 216, -232, 146, -10, 80, 47, 91, 349, -77, -124, 107, -160, 100, -187, 42, 37, -133, -60, 288, 0, -250, 25, 26, 158, -167, -62, -246, 68, -103, -53, 41, 58, 131, 98, 68, -11, -2, -96, 41, -309, -11, -204, 72, 48, -169, 17, -95, 292, 11, 43, 129, 180, -133, 199, 93, 156, 167, -20, 8, -36, -277, -85, 31, -52, -27, 191, 38, -28, -115, -82, -72, -8, -67, -33, 87, -36]
7092c6L23m07J74m0K4J45j49k43M00J14k94J02j95q2qL60k99N0J23k54O7J4J70
7115E9K1j10j80J09R8J12k88K14Q6J17l35R5k6J28k5J58j57p9P8l00J76L47j46
7138A52j08J24k59j1J51N6j9L0L6k24N5j09J51R6k41L54o1j17k50K30j43L43l40
7161a04L69j94j90J30K24m69L42k72M31k60j62J99k06O8L01r5k80K17k34K59L94
7182D68k51l39M61k66Q5j79j2J40j58m5Q6j17R1L30l61K21J11k60j59K28nl19
7204b50K52M8R8j99j26J61K39j44k10oj5K93m49O10r8j17j88l1m5JL33l25J15
7227e3J11J6J29j95J36l59R8J54j73K6J69k80K19J45k21J25o3J09j19j27J49J22
7249A18n6j18J98J9l76K79k40J29k06L96r4k27L69J1Rj26m5k31J49j42L66l88
$$ y = [-36, 287, -120, 54, 14, 38, 183, 34, -209, 191, 305, 11, 113, -82, -164, -172, 188, -111, -61, 62, -192, -125, -111, 59, 80, -30, -210, -101, -3, 109, -179, 35, 121, 238, -97, -2, -28, 100, 75, 233, 76, -3, 75, -225, -49, 298, 152, 44, 168, -91, -102, 49, 105, 86, 116, 152, -72, -17, -126, 25, 121, -120, 234, 173, 56, -194, 36, -107, 236, -104, 265, 71, -119, 11, 235, -234, 108, -164, 267, 7, -155, 44, -162, -94, 207, 112, -168, 49, -185, 74, 468, 217, -122, 339, 73, 158, -21, -33, 107, -51, -96, -10, -127, -36, 294, -67, 154, 265, 5, -154, 74, 69, -250, 2, 50, 148, -51, -177, -16, 223, 79, -131, -137, -152, 141, -308, 302, 204, 87, -101, -132, -177, -176, 157, -168, -53, 58, 74, 203, 8, 144, -215, -117, 37, -136, -110, 59, -221, -2, 143, -78, 47, -16, 93, -26, -153, -4, 118, 62, -56, 142, 161, -215, 64, -176, -47, -253, 143, 49, -178, 191, 202, 211, 85, 40, -191, -42, -184, 182, -206]
7271b06J92o4M9K62j34k03J79P9k83j01J1K80k56J22J15j45J77k1m8L0l6J58k06
7294d9n5K40m8k79K95j17J43l8j20J83j43k4R5j07Q4N9l4j81j10P8J72l29L65
7317H0k4L69k22j6p9q6j89J31J1O7j08J20j93J53l15M43j18k57K42J67k98J38
7339A6k6o7R3pk4M1l7l9O7j42j48L96K4k31R5j06K94k57k1K3J15j73J3P8o6K31
7365A42Q4l59J05j64K23j31R4L6K7J4j3M7j20Q0j19J16m9M5J3J14m39L21j69J0
7389i2L48l15L64l45K29k92n1J34j90J73J47m12J82J26m7j12J76J64l39K91j66
7410b7o7J51j46J00j44P2m5l2J32l12M59l42k11M92L1o7J05k96J30Q8j69J13M3
7433E8j10L8l1j37J91J38k63P4p3K62K9j89n5j29K54K2j16k2J82l95M38N2pJ0
$$ y = [-206, -14, -78, -29, 233, 99, -104, 75, 154, -129, -230, -219, 61, -195, -73, 42, -103, 74, 53, 5, 35, -1, 157, -49, -104, 136, 88, -191, 104, -13, 130, 92, -28, 155, 12, -12, 83, -24, 60, 119, 85, -96, -206, -128, 44, -285, 80, 56, 425, 203, 187, 108, 22, -167, -36, -25, 42, -66, 54, -139, 14, -301, 142, 24, -233, 9, 176, -122, 16, -10, -77, 16, 9, -15, 26, -11, -50, 17, -125, -273, 123, 147, -84, 11, -95, 199, -58, -79, -56, 59, -114, -101, -23, -89, 142, 226, -133, -28, -192, 31, -100, -6, 30, 57, 71, 58, 105, -15, 65, -54, 62, 13, 58, 71, 185, -254, 67, -102, -92, 256, -59, 305, -40, 189, -103, -154, -20, -210, -37, 110, -302, -120, 6, -41, -153, 23, 187, -152, 139, -27, -94, 57, -89, 11, -133, -61, -106, -138, -6, -318, 141, -201, -412, 80, 111, 44, 149, -147, -17, 71, -98, 15, 58, -52, -14, -45, -182, 9, 147, -116, -42, -115, 147, 176, -13, -68, -197, 57, 79, -37, -59, 123, -272, 166, 218, 211, 221]
7457B21j94k22L56j66j27K73r0k52L94j88R7j44m2K67l81L99k48J64r2M39l31
7478A33k96j36L65n8l06K16K80l89K57j08oJ98j50L1j2m0J64m2j33J80j64j29
7500a45P7N3K13k05K10j27j82m2j00K15J52L0k22J06l59M8L55o1j41p1K63o4j67
7523a64J70J49l6J70m69J67L28k68j11J93m85L44J52k12k31L68K6J30l23K45j27
7544A6m3k53K90K10l33j26N32m89m8J36L8j11J38R0J77Mj51l52N18k02k80J43
7566i6K17o7N4j79J4J5K7n1P6j35K30p3j66N09k46M2l9j25q9kJ62Q6j8j41j25
7591a20J31J67p7l07L01N5Kj96j39r5K38R2k27K32k63K01J00j88LM2K13k47K2
7614f0K35n0Jk57P8K03j38j52K61J06R9m24j03J5Q9K10l40K57O5R8n23L96k23
$$ y = [221, 27, -195, 161, -5, -132, 141, 51, -201, 193, 5, 102, -42, -84, 183, -198, 201, -47, 117, 25, 464, 133, -163, -299, 66, 8, -298, -82, 198, -191, 66, -42, -48, 150, 0, 31, 19, -21, 143, 101, -32, 148, -16, -145, -68, -15, 198, -7, 203, 76, -106, -148, -248, -33, 119, 149, -73, 33, -326, -278, 77, 16, -125, -196, 67, 3, -164, 6, 155, 119, 289, -180, -13, 315, 47, -64, 129, -356, -12, 140, -72, -303, 65, 91, 221, -102, 143, 16, -27, -280, 10, 220, -113, -239, 293, -196, -244, -108, -70, -181, -43, 47, 224, 228, 77, -275, 243, 41, -239, -96, 121, 54, 108, -71, -57, -42, -15, -66, 10, -125, 105, 32, -134, 375, 129, 171, 132, 7, -82, -84, 78, 164, 146, 5, -120, 11, 178, 101, -206, 95, 150, 152, -44, -183, -278, -40, 52, -175, 57, -206, -5, 95, -93, -90, -48, 165, -82, -60, 175, 125, 126, -131, -53, 150, 12, -140, 121, 227, 326, -98, -201, -186, -97, 113, -227, 30, 95, 193, -330, 66, -157]
7637a57J12J76k68K05j56J41k20M34l15RK79j77N7k89J47M0k32K67m11M18q8M3
7659A5L05j81k74R5J32j93j48L48k1k25O2M1J83q5n8j24L02p4l52J04Q5J22j61
7682a02J12Q3l05K89P3m03N6K84j49J82o7rj60O4L26n6k27j87J0r1M30k05j19
7705a71l9J41N9J4j26MJ07p4J20LM1j63L17j26j37J04J23j86K16k82k7lM4J11
7729G0k46K80j33L0K25j46J70j98j67J59o9R0k38J99L5Mj35K93m53j4L44L8j06
7752C2Q9k00M2K60k27j27J1K11j20n6K44j69N7P7m7r2l37K27o0P1J72R6l55J94
7776gj92K47J94l43J08J62l41J34K06j16q3J00J32j66k24K73l9j85J7m2K17n5
7798ck00O7K73m1k21J54j41P0jM9J17m38M27k96L5k54M25m1O0l6j5o8M5M9p6K12
$$ y = [-157, -45, 131, -137, 68, -88, 53, -167, 267, -48, -39, 240, 63, 120, -169, -22, 18, -214, 53, -358, 60, -28, 15, 320, 139, -135, -40, 92, -101, -249, 99, 78, -147, -85, -44, 139, 54, -4, -128, 174, 100, -252, -148, -63, 59, -102, 10, 93, -212, 77, 150, -253, -197, 87, -62, 120, 53, 44, -116, -52, 274, 218, -9, -196, -186, -277, 153, -52, -171, -210, -69, -10, 4, -122, -118, -11, -85, 35, 38, 79, -84, 233, 107, -30, 74, 197, 11, 227, -55, -82, -85, -41, 70, -176, 104, -29, 1, 226, 80, 250, 52, -115, 44, -25, 65, -173, 26, 61, 65, -70, 223, -230, -244, 100, 138, 32, 121, -79, -37, 223, -4, -131, -120, 91, -29, -85, 159, -10, 47, 124, 77, -15, -352, -125, -185, -114, 58, 154, -201, -7, -199, 48, 242, -101, 7, 169, -172, -38, 168, 52, -31, 69, 201, 35, -189, 84, 45, -140, -123, -165, 52, -3, -203, -136, 137, 96, -125, 29, -112, -42, -43, 6, 123, -315, 112, -184, -149, -403, 22, -19, 41, 5, -10, -78, -33, 16, -60, 152]
7824A52M5k58o7J89J05n6K79k56k13L27m68M48l0P0k72R8r2p1q3J6J26l32M94
7847A51k59J87k11K74j71J28n2qO8J06J3k67J31j08p8J33J55j81m7J55j40J16
7869I5K0O4l15J8J51J86j86j0o3o3N0M8J44Q3j63k30K74j2qj79L2p1K55J80k47
7894E3j07J26K2q8q6L4R1K0k53L44L4k05l41M00J08j47k38K67j97p2P5J78j50
7917a32L87l58J22p5P3P2l0J96l58j22J96N0q1N2K6Q6m3j05K58k40R4l0Q6k8j39
7942d3RJ46j48K08r0j2k9j67K60k53n2J01K12P6l15J8qK97l06r9L42p2m9q7J8
7967d3J78j59j30J16J04j91M3J47L2j46p7J77j31J62q4K3j64p3J25l4J67l3l6
7990b7j69M57j37J2k89M15k45l77L00K50o2k52J73j3q8O4J85k54J63j29q8Q6M7
$$ y = [152, 197, -61, -128, 61, 166, 110, 389, 133, -80, 247, -221, 227, 197, 267, -5, 93, 1, -70, -153, -137, -11, -343, 151, -108, 79, -132, 142, -29, 99, 47, 39, 107, 213, 226, -41, 90, -18, -96, 37, 192, 11, -36, 119, -21, 95, 115, 179, -136, -118, 33, 219, 33, 23, -40, -103, -53, -5, 139, 222, 59, -171, 103, 91, 83, -96, -64, -135, 120, 300, 53, -54, 72, 94, 6, -80, -46, 45, 65, -188, 156, 190, -15, -356, 44, 152, 5, -233, 34, -163, -235, -160, 18, -132, 255, -103, 19, -56, 17, 89, 59, 255, -103, -225, -29, 21, -60, -8, 18, 104, 61, -44, 214, -26, 68, 38, 124, 96, -43, -34, 112, -36, 172, 82, 70, 41, -126, 134, -119, -171, -70, 142, 218, -97, -79, -87, 210, -96, -195, 147, 75, 26, -61, -43, 135, -24, -154, -38, 66, -125, -82, 65, 97, -49, -126, 51, -80, 82, -2, 21, -143, -216, -91, -125, 42, 9, -27, -196, 261, 124, 136, -153, 262, 17, -360, -60, 190, 128, -124, 49, 36, -52, 12, 197, -57, 106, -23, -111, -25, 22]
8013B2J8j14J21rj50M26n91K97r4r0J50k5r4P0k2K55l90J98r9m1L07p7p0K21r6
8038A23K8p2k90L79j43p3J6K09O3j51N9k49n6M87n64L06J12j61J60p4j44J72N1
8061A88k26RQ9J02j92o8M7j21R2q7o3J28OJ08p6J44J18k0l71L69n8k21K11M4j92
8086d0j60n1J28L02j35k64LM8o7J32J68j8k37j74M72N7J3m59J49M7K45J9j8j46
8110A4R4k42n5r0P2Q7J80l1J52J14m01M3j4K56j71P6ol05J89J90ql35L75j20r6
8135c2%L07m75J23L21M4k52k01J05m0J83k42K95m79O20l27j44N85j79k92N8K23
8157B01K23n61K24J13m8k22j64J87J47K64n02J38K8K41k33o1p7K89pk38n8K51
8179A35M3k35l9R8K17k07P3j78P4L60m84O5
$$ y = [22, 40, -74, 47, 38, -112, 314, -277, 20, -74, -164, -14, -39, -133, -63, -85, 170, -220, -22, -121, -162, 145, 68, -2, 219, 123, 151, 79, -211, 168, 25, -48, -32, 177, 240, 89, 148, -101, -157, 330, -234, 72, 184, 23, 183, 109, -35, 137, 188, -38, -29, 60, 162, -30, -98, -51, -172, -80, -167, -230, -102, -96, 12, -64, 80, 198, 178, -193, 176, 118, -103, 108, 152, -40, -200, -251, -123, 179, 44, -220, -217, -169, -236, -104, 64, 46, -191, -365, 107, 164, 177, -282, -133, -86, 159, 178, 160, 14, 108, -134, -189, -279, -207, -120, 60, 29, 181, 295, -106, -63, -77, 179, 8, 84, 78, -227, -38, 152, 144, -191, 184, 64, -32, -32, 275, -200, -77, 244, 288, 36, -165, -60, -100, 83, -159, 136, -343, 277, -50, -194, 391, 212, -80, -22, 201, 424, -137, 87, 200, 152, -70, -234, -47, 100, 364, -138, 0, 28, 269, 36, -25, -102, 187, 180, -58, -116, 135, 178, -57, -96, 2, 219, 12, 85, -93, -19, 341, -143, -78]
8191g8
$$ Imaginary data points
##PAGE= N=2
##DATA TABLE= (X++(I..I)), XYDATA
0@%%%%%%%qJ6j6J7k5L2m0N6p2Q8j06J31j62J94k34K82l31L87m58N38o19P11q20
30d39R41j073J219j383J565j764J983k226K491k781L099l449L830m241M693n191
46b726N735o323O967p679Q461r319J0269j1326J2506j3833J5337j7055J9040k1366
60a1312K4135k7496L1676l7047M4235n4401O9974r7083J57425n27235K46035R73282
72G92188q74174o07917O83463O63482o51489m57617N16066M58950m32514l49524
82b59086K32697K66825j77198j89919K6815J28659K5096p0271j35664K7124J78236
93E3314N851k57490K851L61304Q9296l76115q5148M08066J14937l93389o7961
104a44484L85781j2464m51473L073L87264r5102l83207J60093L64851j97814l13756
$$ y = [0, 0, 0, 0, 0, 0, 0, 0, -8, 8, -8, 9, -16, 16, -24, 32, -40, 48, -58, 73, -89, 105, -129, 153, -178, 209, -249, 289, -330, 381, -439, 502, -571, 648, -735, 830, -934, 1049, -1177, 1314, -1467, 1632, -1817, 2013, -2228, 2465, -2726, 3009, -3314, 3653, -4026, 4435, -4884, 5385, -5941, 6565, -7268, 8069, -8986, 10054, -11312, 12823, -14673, 17003, -20044, 24191, -30210, 39764, -57319, 100106, -427129, -181094, 792188, -81986, -689903, -6440, 657042, 5553, -452064, 64002, 522952, 90438, -259086, -26389, 240436, 63238, -126681, -99866, 28793, 53889, -16382, -152046, -124922, 53314, 59165, -198325, -195474, 165830, 255126, -120989, -206137, 201929, 316866, -76523, -144484, 241297, 228833, -222640, -219567, 167697, 72595, -310612, -150519, 214332, 16518, -297238]
115b97238K52359K93692k27004j98203K53059J55779k30842j13692J81681N7386
125A26977j49031l1975R3990n941p6731j8968N703J0101M5574m231q2709K0632
137f6609J51036J525j78244R217K43728L2244k54513n3086K43136K8706k76120
148a18980n1950K59742L7430k64077m5248K39418M2928j98593j0419J96297K9159
159A15707j50917l0602J10054M2327o2995n6912J4131O4656J9292q7375o8650
170i1284P6645Q2260p8175q8912P4853Q5405o9553o9166P4945P2344n2614m4244
182b7496N7296L8364n3276m1171L2900K3702l1367l4086l23J5598J1954l310j9601
195c0816O587N1277K1433n3068k8046O2291L3424o7118l3604O8068J8652q3756
$$ y = [-297238, -44879, 248813, 21809, -176394, 76665, 232444, 1602, -112090, 69591, 126977, -22054, -54029, 39961, 34020, -42711, -61679, -55976, -45875, -301, -4532, -87241, -66609, 84427, 85952, -92292, -83075, 160653, 192897, -61616, -114702, 128434, 157140, -118980, -170930, 88812, 126242, -137835, -183083, 56335, 99263, -99330, -109749, 86548, 115707, -35210, -65812, 44242, 86569, 23574, -33338, -19207, 45449, 64741, -22634, -91284, -14639, 67621, -10554, -99466, -24613, 60792, -8761, -77927, -2982, 69362, 16748, -27496, 29800, 68164, 14888, -26283, 6617, 30319, -1048, -35134, -35457, -19859, -7905, -11215, -30816, -24229, 27048, 48481, -4587, -32633, 29658, 63082, -4036, -37640, 30428, 49080, -34676]
207c4676j6693Q4149j055r2915R507R4700j5996q9204K1516Q1795j3764n5181
219b7817K2361L9539j2583p681J4691k0317k3188L1471J4132n7700k9649N2912
231c829J8554n7687q929O6733J2973n3423P568O4388n210n6384J2598N4093j8129
244C3316n5874Q946L5071j6903k7559J1165K313k0310J4845K9319k9402l5348
256e0421M7515N1350m4098m7558N4182N7497m3474n0274L7246L9634l7572l9502
268b5475J8841J5125k6732j8201J3571J1186l196j029L735Q491J9556Q622k0055
281D439r594L1607K0278l6942l5679K9812L8806l1245n3916J2759M7604n389m6879
294c4339q293L8481J8049k3371j6486J9870K6855o7j7886j244K2311J1477k1338
$$ y = [-34676, -51369, 32780, 31725, -61190, -51683, 43017, 27021, -62183, -40667, 41128, 27364, -27817, -5456, 34083, 21500, 13819, 28510, 8193, -14995, 16476, 30608, -27092, -56741, -3829, 14725, -42962, -51891, 14842, 27815, -25608, -18040, 46348, 41138, -15246, -2648, 51445, 33316, -22558, -13612, 21459, 4556, -23003, -11838, -9525, -29835, -14990, 14329, -15073, -50421, -2906, 48444, 4346, -43212, 10970, 68467, 24993, -25281, 11965, 51599, 14027, -25475, -6634, 8491, -18241, -36442, -22871, -11685, -14881, -15910, -12175, -3684, 15872, 24494, 4439, -5155, 26452, 46730, 9788, -25891, 3921, 42727, 11482, -42434, -29675, 17929, 12540, -34339, -42632, -4151, 13898, -9473, -25959, -6089, 20766, 20699, 2813, 1569, 23880, 35357, 14019]
307A4019k2324J1511J8397k0786l6970P782L9421l442m7463o070N8083K7901n1636
320a1577l6290N5029N7687m3233o6641L3767P4215k2868q0103O666P2210r84p1165
333c3287j2090N7509J3686n1901j8451M3553K5581l1206k4664K8660L7327j0992
345B3725l6421J835L9480R366m3131k7104L3926L1592l2007m2396K0765M1849
357B1479j2738l6541Q338L3330k779k0926N535J3920o769l835J2960k874j8430
370i330P787K2051j2962k6953J4797K4791k1503k7103K4249K7269k8669k9332
382c4908L1218L5724k4132l6514J8917L9373p092l8795o342L4054J7566l0644
394a575l1164K1011M0111j1017m3787K481M7214N715m6820j1269M5589J4338m7109
$$ y = [14019, -8305, 3206, 21603, 817, -36153, -28371, 11050, 7608, -39855, -45925, 12158, 40059, -11577, -47867, 7162, 64849, 21616, -45025, -11258, 62957, 40089, -40014, -33348, 38862, 37878, -33287, -45377, 12132, 25818, -26083, -44534, -981, 24600, -6606, -31270, -2610, 34717, 23725, -12696, -10861, 28619, 37985, -5146, -32250, 1676, 33268, 1261, -41135, -20370, 21479, 8741, -27800, -19462, 13868, 11089, -9837, -4302, 9618, 2849, -986, 11974, 9100, -9330, -1543, 20508, 7546, -19407, -4610, 20181, -1322, -28425, -4176, 23093, -5576, -34908, -3690, 32034, 7902, -28612, -9695, 29678, 22586, -16209, -22551, 11503, 29069, -1575, -32739, -11728, 28383, 17366, -26421, -23940, 23274, 28989, -17831, -29100, 16489, 30827, -16282]
407a6282j9146M8302K2432m8787k7324M9233L2510m5401l5501M0404L8376l2433
419F383l7722K2699L4234j2339k8616M298K2327K322j7499p448J1203Q149j1481
432c490j1713J0710J2573j1755j1863J6402J7143j4363j6883J4661K0105j0341
444A1186k0739M796J6325k752j7125j612J1763J13j1911P16J0964m191r583Q884
458c166J3988q858j2897J0961J6897o366j3860L902J0840l99r897p097K479N937
472B464l998r846O66Q222j945o230O974R485o573n385J3795R119j1935r579J0060
487E294J0930o930j3416j314Q394J273j1086o979Q586P132r815o635J1686P108
501D228r909m92J6573L296j4938j129J7038M757j6326j1526Q846J2290p711k0549
$$ y = [-16282, -35428, 12874, 35306, -13481, -40805, 8428, 40938, -4463, -39964, 440, 38816, 6383, -31339, -8640, 25594, 13255, -15361, -11063, 11264, 13586, -3913, -11361, -158, 7991, -3490, -15203, -4493, 8080, -3675, -15538, 864, 18007, 3644, -13239, 1422, 21527, 11186, -9553, -4757, 11568, 8816, -8309, -9921, 1842, 1955, -9956, -9240, 1724, -2467, -12050, -3166, 10822, 1964, -10933, 28, 16925, 10559, -3301, 601, 11441, 11042, 1145, -5952, -3473, 2464, -1534, -11380, -10714, -2492, -4437, -10667, -3693, 5792, -781, -6166, 7629, 16748, 4813, -4766, 5294, 16224, 9294, -4122, -5436, 2958, 4231, -6855, -13834, -5248, 1884, -7931, -14566, -2880, 4228, -5681, -6173, 10400, 13696, -1242, -2371, 14667, 19424, 3098, -8428, 418, 12708, 4997, -15552]
515a5552k009J8656L883j9250m712K0906Q296j6224n349J6889Q694r700o054Q974
529G448P271q692j1916M789J4088m610k2133l317K2480M260k5242r057K4616J3843
543A3828j8365j1509J6636J5307q264j1389N357J1867j411j2144l872Q803J043
556E887j1897m000J1136K865j3548n554J2929Q326q501p335P747J1027j624r682
570b224q63J0144M877p860o307L806L111m688l053O51j714j384L594J744n887
585f053j887P609N340n190k789N895L648m353k407L562J084l953j714L314R75
600C081n219n073M174P933k517j0483k04J1499L879j1820n926J2455J0801r530
614C050j2453O663J3256l339j2972P68J1575K6j2033j398J1189J927j2010k482
$$ y = [-15552, -17561, 1095, 4978, -14272, -18984, 1922, 10218, -6006, -11355, 5534, 14228, 4528, -1526, 7448, 14719, 6027, -5889, -1100, 12988, 8378, -13755, -17072, 5408, 9668, -15574, -24631, -15, 13828, -4537, -16046, 590, 15897, 7633, -3756, 1601, 13468, 12057, -87, -3959, 4844, 5887, -6010, -10010, 1126, 3991, -9557, -15111, -2182, 6144, -2357, -9692, -1945, 9082, 7458, -2224, -3087, 7057, 11934, 4074, -2233, 1573, 4684, -4, -3057, -2406, -4120, -5504, -1910, -166, -6053, -7940, -331, 5009, -181, -2970, 2925, 6573, 2220, -187, 3375, 4459, 506, -1208, 2106, 3081, -2138, -7211, -3037, 4896, 2379, -8104, -8308, 3191, 7070, -4750, -10676, 1779, 12580, 3050, -9403, -2740, 10516, 7177, -5795, -5027, 6548, 6574, -5459, -6857, 4332, 6259, -5751, -8233]
628h233J2207M237j2853o512J1707Q934r492j0327P009J2209k486j2895q11J2523
642E217N765j0373q376Q532P908o688q548N161P224n477p700M577O632m749p245
657h140M359Q699j697q448K89R985K891q284l740P732N502n725o876J939M630
672C116r64m688k277J315J961p48j608M81K830r52N1L967J826l270r94M835K344
689G225m325k954J796J034k239k673j426J45R85L34j874j906J496M157J411j569
705c83j487K956N458K30m809j276M535J324n273l554K112J49l049k176J078R49
721c216o66j317K047L567k65k510K662O643L10o937j195Q162K338q736n887N694
737F94M456o044p394J980O156j133n867J109N603J756k946M96N453J718l790j395
$$ y = [-8233, 3974, 8211, -4642, -11154, 553, 9487, -5, -10332, -3323, 8886, 6400, -6495, -7306, 5217, 10982, 609, -7767, 765, 8673, 1985, -6563, -1402, 5822, 345, -7355, -2778, 3854, -895, -8140, -3781, 4918, 3221, -5227, -4938, 5047, 7938, -346, -4086, 3646, 9148, 3423, -3453, -1514, 3116, 2152, -2536, -4813, -3498, -1537, -2285, -3893, -3412, -582, -1534, -1483, 2484, 4310, 1040, 46, 4881, 7225, 2900, -54, 1742, 2776, 537, -2136, -3562, -3417, -2432, -2098, -3972, -5878, -4382, -225, 1186, -383, -1870, 1086, 6544, 6774, 1965, 689, 5224, 6548, 1275, -2279, -167, -18, -3067, -5243, -4165, -3216, -3882, -5199, -3152, 415, 150, -2360, 302, 6945, 7255, 318, -877, 7285, 9623, 887, -5000, 694, 5150, -894, -8288, -6308, -152, -1285, -7152, -6043, -440, 1316, -1630, -1134, 4319, 6037, 2247, 852]
753H52M580K163n414m993L408M397m048q265N95P301J70p161k912P738M997m188
769g80l820N008N612j718l869K258L383j999l833O87K054k833m191J095K875j602
785a673l815L44L497J728j538j732K287M412O41l170j097L688J548k465k390J460
801A725r6k647n62J225j728k355J566L096j559l050J768M381J36l063Q7L477J817
818D218k448q07J607J02j953J2O10j797k586J462J933j777k463J387K238p6o52
835i90J29L15R61K116o15k436Q54L402q07l372O45K090j453k098Q40M01k697j00
853b815L112k85l227k84M424J402l501j171L398K550k356k183K324J464j662j791
869f01J983O32k841j180K025P98k544j950J898J672j67j612q05K460K747n90l598
$$ y = [852, 5432, 7595, 2181, -2812, 596, 4993, 945, -7320, -6725, 576, 746, -6415, -9327, -1589, 3408, -780, -4600, 408, 6020, 4302, 433, 2691, 6074, 4075, 242, 929, 2983, 150, -4041, -2946, -71, -1673, -5488, -5144, -1647, 81, -1457, -3189, -902, 3510, 4151, 981, -116, 3572, 5120, 2655, 265, 1725, 1629, -1018, -1580, -355, -2083, -4438, -2872, 224, -1335, -4385, -2617, 1764, 1900, -1163, -1076, 2401, 4218, 1770, 963, 2570, 2672, 719, 731, 1341, -456, -3042, -1580, 353, -1424, -3887, -2500, -262, -338, -990, -861, -546, 415, 2531, 1916, -520, 334, 3736, 2929, -443, 202, 2292, 839, -1259, -419, -18, -2715, -2815, 297, 12, -3215, -3499, 925, 2327, -1174, -2345, 1053, 3603, 1247, -936, 1388, 2852, 1190, -601, 1382, 2014, -827, -2007, 18, 816, -1728, -3678, -1780, -108, -275, -1887, -2692, -232, 2515, 1925, -1673]
886a673N74N768M76o668q78N692J394n616k773M376J232m480k015L540K015l145
902b181k152L080L386j312l340J616N111L7m090j251M203J985m122l546J506K936
918A866o85m558j387L162K150k628k311K160L358l81k400J736L478n48k963J244
934A293K735r11l551k55K294l15l627j122K007J258k151j490J344J691J022jn34
951c13n66K563K873j830l411J803L693j752m492j61L633j200m664j06L474j70
967f26k858J66K621P55q64J36J812J178P17j626j181K607K427l585m925K334N207
984D295k771p831J451O897l64p491K07P795R54o355j33O788J164m863o97M382
1000C428O72l407o75J392R6j778j595j03O93R46j614k279J748L756j38m105M45
$$ y = [-1673, -1099, 4669, 5145, -1523, -2401, 3291, 4685, -931, -3704, 672, 1904, -2576, -4591, -1051, 964, -2181, -4333, -1253, 2133, 821, -2519, -903, 4208, 4245, 155, -1096, 3107, 5092, 970, -2576, -1070, 1866, 1181, -3377, -4764, -1602, 548, -2080, -4391, -2231, 1127, 746, -1654, 82, 3560, 3012, 49, 1293, 4028, 3117, -434, -689, 1605, 1290, -2337, -3459, -1452, -194, -2345, -3835, -2491, -800, 222, 221, -313, -879, 1684, 4557, 2727, -684, 1119, 4812, 3060, -1432, -1593, 2040, 840, -3824, -3930, -456, -626, -3484, -3318, -697, 58, -806, -670, 1142, 2320, 3037, 1411, 230, 2837, 5264, 1679, -3246, -912, 4295, 1524, -6307, -4856, 2041, 1677, -5814, -5607, 2188, 3142, -3213, -3346, 3442, 4606, -257, -954, 3428, 4100, 693, 18, 1410, 1506, -272, -1867, -1970, -1277, -331, -1945, -4224, -2476, 1280, 1142, -2963, -2518]
1017b518N575R63m373k54M100N01l749r68K896n97k968O0K230j627k786J402K418
1034C05j892j711K804K053k119p20K818J260k193lK225n73k768N10J838m63k681
1051a310j10P56J09o37o80m44J350J168l88j027L86K150N50j578l28K003Q09j487
1069A292k146J409J550j849k340J695J387k710j846L020J349k625j222K975J598
1084A537j541q20J958M61m48j10L35K04m64p05J33n95p48l64R25q5k157K80J563
1103f41P38j672N83J473k11J30R41n66m15J691P25k446q64K459j36l733K87K802
1121A145j261l525J094L465o73l652R65M112M41l100o39L505K130k793k199K461
1137A476K269k600k501J203O01n17j558o4k89N29Q12j600RL193Q21l021k40M109
$$ y = [-2518, 3057, 4020, -353, -607, 3493, 3994, 245, -723, 2173, 1576, -1392, -1332, 898, -729, -3515, -2113, 305, -1587, -3298, -494, 1559, -560, -1280, 1538, 2798, 605, 602, 2827, 2254, -514, -4, 1834, 1371, -1310, -1420, -664, -555, -1192, -1872, -2316, -966, 202, -186, -1213, -827, 1323, 1873, 295, -33, 1970, 2779, 1292, -854, 555, 2105, 256, -2084, -389, 998, -1712, -3558, -538, 811, -1814, -3036, -61, 1537, -4, -824, 1134, 1595, 1147, 1037, 1372, 1576, 1112, 407, 540, -55, -803, -1167, -242, -327, -2484, -2204, -641, 97, -1575, -992, 481, 270, 400, 1341, 775, 360, 2051, 2776, 330, -534, 1925, 1789, -1944, -1657, 1145, -116, -3641, -2547, 918, 245, -3407, -2442, 1670, 2111, -989, -1628, 1877, 4007, 1214, -985, 1476, 3745, 1145, -1356, -153, 448, -69, -1627, -1691, -1980, -1451, -639, -2239, -2230, 963, 1784, -1237, -1477, 2632]
1155B632J229m061p42M054L01l737j090K200J07j783j443M7J624Oj190k08R13
1172a141R83K41L05K34J61J114l9j041k19K072j56k954o42K032n59k673j69J997
1190d54K99k335K10J754J105n55r08P91K287M82j738r11J578J306j565k177J39
1207f92J245J30k509j076J915J325j566j938K140K672j626j844J714L096j100
1222A886k522J496J781k96k811P5J130L47j769j625J265R67p27j233N8J608O70
1239C00m02o19L51J822R61k506j67K746j93k449o63K289rl001k84K153n03j834
1257b008J3J726j90o33N51Q51j21M46N02n50k0Q20L88r79j134P03R74j365j342
1276a368N87J073j150j151P41J418m17j164J423N74p21j68J537o2p71N13O72j012
$$ y = [2632, 3861, -200, -942, 3112, 3413, -324, -1414, 786, 893, -890, -2333, -2286, -662, -656, -1846, -2054, -1141, -158, 83, 388, 622, 783, 1897, 1858, 817, 598, 2670, 2514, -440, -1082, 950, 391, -2282, -2451, -454, -155, -2490, -2280, -526, 579, 24, -884, -93, 2194, 2676, 938, 27, 1605, 2911, 1346, -831, -692, 553, 683, -1826, -2902, -987, 338, -1228, -3166, -1026, 1646, 20, -1824, -110, 2986, 1886, -636, 860, 2641, 2345, -466, -391, 739, 1086, -683, -2308, -1043, -76, -803, -2036, -1978, -370, 300, -102, -721, -370, 1452, 2413, -93, -260, 2486, 2293, -156, -819, 1470, 1461, -1540, -1824, 329, -174, -2008, -1995, -269, -459, -1092, -541, 310, 189, 635, 1137, 587, 567, 1387, 1775, 796, -338, 365, 1339, -26, -1368, -781, 292, -858, -2009, -1268, 150, -267, -1431, -8, 566, -155, -323, 1214, 1152, 381, 894, 1566, 554]
1294E54n18J009l96j863k44J995n59k255N40K100n18j868R14J794j18j145Q58
1311B80J242j70l66k43L27l41k50k6m04o70j3K16m84l67L33M10k12l99Q22O74
1331C59k58n24J696L67j206M8O90J13j020J39L81p99n39r0N29j027p63J004R55
1350E5r96l17J133P75n25K90L09N40O1j67k40l48J31kj111j44R6j00q00j21P38
1371g43j35r0J13O94Q64r32J00R46Q30n84n58o1J255k24j858m14J051k77j255
1390a278jL63J81j55lL50M35L43k16K00L72Q42m62m61N21M81o51q71J40J79o48
1411c39o37j17K83K02j94m09L32R44K93n58K76R56J19l40l12N81k15J2q48l37
1431c08L42L90p07q34J30O16m85n93O45Q86J81o08L32Q44N86o08o79O34Q22o86
$$ y = [554, 36, 1045, 649, -1214, -1458, 537, -22, -2277, -1737, 363, -155, -2023, -1109, 685, 567, -578, 280, 1522, 1352, 986, 743, 1070, 729, 479, 453, 49, -621, -634, -418, -902, -1269, -936, -526, -738, -1137, -315, 359, 101, -423, 1273, 1640, 434, 482, 1172, 1285, 265, 404, 785, -14, -553, -643, -114, -1141, -1904, -900, 55, -941, -1258, -125, 650, 125, 415, 724, 1264, 1325, 1158, 918, 570, 701, 699, -412, -556, -460, -560, -1360, -1481, -743, -878, -968, -855, -161, 703, -229, -129, 817, 1647, 1063, 505, 444, 1699, 1475, -383, -797, 254, -23, -1278, -1279, -916, -735, -890, -893, -543, -108, 235, 19, 219, 591, 1433, 971, 510, 1031, 1512, 861, -10, 130, 309, -339, -976, -1093, -810, -608, -802, -1211, -879, 65, 358, -200, 76, 1032, 1151, 811, 499, 1080, 865, 877, 29, -308, 34, 424, -283, -1117, -987, -371, -856, -1449, -804, 82, 263, -345, -13, 831, 1417, 809, 130, 764, 1586, 900]
1451I00j313K69O03k37r39m92Q96On96o26N97J117j72o45K58J278K90r48j0J205
1471A441K5r40o15N21K10q27n83m0P93p26o70K86Q28J88p84J82J111K02k70J98
1491E30K83k71L45j09m93K91k03j70r62M36K35j038j30O03j6j68J38M65J74J91
1511A31M32j78K81M16K2m55k84J91P2o51n2j07k27k58J52l07j1L93p2k05N01R19
1533G03l14k60M53N86k91q2j24Q2m27J19r09J95m0k00n43o0N09k67k91J001K16
1554E6K2J13J95K62M93k72l25L81J1m09n48j14J56j96o56J7M19k12p30N26P11
1575a00j11j06O78K54J33J43k24R5L32l93m08k1J89o33m16P4j58l1k91M66j77
1596g05J10K45P1J91O01J28k66L85M49p72k92L14L3j82m99k4l58n3m2r2m73R24
$$ y = [900, -413, -144, 459, 222, -717, -1209, -313, -307, -903, -1529, -932, 185, 13, -632, -374, 904, 1194, 246, 236, 1441, 1466, 526, -89, 432, 642, -185, -768, -808, -15, -741, -1411, -1125, -297, -109, -893, -711, 400, 602, 332, 530, 813, 542, 887, 778, 285, 576, 373, 203, -759, -323, -88, -1126, -1256, -653, -669, -837, -699, -234, -60, 131, 563, 385, 666, 1082, 1104, 649, 365, 556, 628, -23, -75, -182, -409, -667, -515, -822, -833, -440, -512, -717, -216, 703, 389, 129, 582, 1168, 877, 795, 671, 753, 326, 445, -464, -269, -309, -509, -1052, -1112, -603, -870, -1161, -160, 56, 78, 191, 386, 648, 1141, 869, 544, 925, 936, 527, -21, -135, 21, -175, -831, -814, -395, -607, -1337, -811, -100, -211, -317, 361, 615, 748, 891, 667, 762, 1094, 701, 293, 272, 461, -172, -588, -514, -672, -703, -994, -528, -705, -595, -350, -279, -88, 513, 641, 375, 760, 1209, 437, 145, 459, 492, 310, -189, -213, -571, -624, -666, -758, -1231, -307]
1618c07K7l22K00Q55l7m25M82M16m47J36L35j34m22j04j73n16k4K85m04l76J62
1639g93J00K54j42M50n0J82N93L2j45L19Ll29k85K81K00n69m58R4k05j35Q2J62
1661c59m53K70K50m05K88O07K61m16K26O82j86n23K74K59j58m94l87K74r6k38
1681c24l14K2Q8k87M39o9M0K35L62m7L17kJ17J42k43R2l02N5J43n11k31j70O1
1704c87K4j63m59K69J49K38R7p9O16J76j67K81K85M4n42J21K05%j089L13j02l06
1726d76Lj53L65j95l67M15K50p2M25J90Q0K46J52k69n0j58J95L07q95l20J88o2
1748b01o05j61O06l13J57k87P45Q0l03M42N91l06L4L36l6l73k18L47l34o32J01
1769c30J83n10on4N05j67j62QP87j06m49Q21K1l5l48L29L74m06M0m71R6k01l23
$$ y = [-307, -280, -602, -402, 453, 416, -9, 473, 889, 442, 578, 913, 779, 357, 253, 80, -436, -460, -175, -579, -955, -793, -693, -439, -581, -131, -181, 1, 594, 626, 481, 800, 803, 474, 189, 470, 670, 101, -357, -263, -468, -603, -521, -359, -812, -542, -292, -697, -409, 198, 459, 43, 269, 951, 765, 242, 516, 775, 617, 123, -264, 10, -86, -324, -638, -616, -528, -815, -376, -445, -405, -170, 192, 145, 462, 460, 577, 719, 476, 568, 266, 321, 464, -47, -278, -448, -387, -363, -526, -985, -716, -567, -329, -232, -311, 305, 481, 314, 595, 880, 924, 382, 503, 708, 708, -381, -68, -170, -476, -473, -626, -261, -456, -823, -408, -158, -230, 195, 385, 465, 711, 863, 594, 544, 386, 581, 888, -7, -327, -139, -201, -806, -967, -361, -674, -517, -804, -59, 21, -282, 160, 751, 445, 479, 815, 779, 406, 188, 535, 201, -431, -330, -147, -657, -663, -717, -212, -379, -541, -533, 254, 148, -301, 520, 541, 506, 158, 487, 861, 455, 495, 24, 120, -81, -404]
1792d04j39l14K7J09K85l2j6N94P8n13K10R79k08k48k7L66J83q82J13j37J17p32
1814e91o7O4M22m45N8K49o5J28J12K55lJ69J32L5M7Q5j64l17j09M50m80m69j63
1837f67L46J09n32j24O54j68k59J07N38K64K14J56r0J15k60J51K0k6l08j22R6
1858B14n38k91J39N1j25j96J56M02k67J93L40K82j30o8O10k67n2j89K11l20K11
1879C66k37l82L3k62K8k61J12L67R6m2M0K45K32r8L0L38K13q9l14M4K29m37l88
1902a37k13K00j57k13J41j3L4Q2L0K4K16%j3L3N43oJ24l00J10p7k83j21l5p9k86
1927c96l12R2J33j79M99l87K49R4J48K15L97P7l96K41L25j43m2l01J43m76l21
1948c40M8N2k02j62J46q4J42M1j14M33J60J14ON13k15q1j63K96o9k10j18l57J60
$$ y = [-404, -543, -857, -830, -721, -436, -468, -484, 110, 188, -325, -115, 864, 656, 408, 381, 747, 930, 48, 161, 24, 141, -591, -658, -594, -172, -617, -559, -310, -375, -247, -135, 120, 117, 286, 418, 453, 500, 585, 421, 104, -5, 445, -35, -504, -667, -321, -212, -744, -868, -214, -382, -641, -534, 4, 268, 482, 638, 548, 663, 403, 554, 574, 548, 240, 118, 214, -324, -615, -476, -425, -550, -746, -590, -188, -455, -262, 78, 360, 230, 162, 772, 505, 453, 264, 475, 155, 366, 129, -253, -220, -482, -454, -715, -603, -236, -140, -182, -142, 103, 335, 237, 267, 605, 818, 729, 415, 459, 688, 251, -137, -350, -150, -307, -520, -379, -392, -358, -276, -246, -222, -6, -6, -19, 14, 557, 551, 675, 375, 485, 408, 125, 4, -31, -110, -396, -708, -616, -483, -662, -163, -550, -301, -207, -59, 156, 553, 630, 234, 475, 800, 657, 615, 314, 457, -19, -340, -292, -240, -442, -604, -458, -542, -400, -359, -473, -40, 120, 234, 240, 753, 538, 457, 294, 590, 521, 311, 193, -164, -4]
1971dk30m79O4R3M86q83L14O11k47J07M4N40L38l98J62P1Q2j55k64p0j87j6l80
1994d01L0nJ0m08J70K83l61N44J75J29k7J94J47J96p6J9l14n5rj66k93n7l35l
2018f13L76k04J57j01l6O00r7k4J94L88k38R9J67k50K11n35K09j41k6l68k11o3
2040e06j06L8J49r9P9O27k12J11N9M92j80k89M90k73Ok0k09L2j21m07k33M07j30
2063b95k25J82k14L54J32j67L50n1L21p4p7J6K47o7m39O6N50o24j30J85n44o0
2085e64J08m7Q8K92k25J95L95n1J18qoO6j5N0p5l1l50j6pn6o8O5j95k09j99N59
2111a86j72QL05PK07k90M30j3j56L12qn40L10J9l20k04K42kr8k53N3l1N2j56M27
2136e7K58R7k18k3p8M73Q2n25J87M91m10l29J07R7l73k93L93k82j2J12O0j6K32
$$ y = [-4, -234, -713, -649, -556, -70, -953, -639, -28, -275, -168, -124, 416, 754, 356, 518, 589, 671, 516, 252, 182, -5, -21, -401, -371, -376, -366, -774, -604, -321, -682, -138, 37, 166, 139, 333, 480, 676, 600, 619, 305, 250, 241, 75, -218, -275, -610, -613, -237, -441, -284, -385, -421, 179, 82, 58, 252, 640, 402, 501, 668, 418, 629, 94, 303, 162, 136, -232, -443, -506, -612, -574, -425, -524, -445, 182, -30, 81, 140, 632, 452, 163, 653, 380, 386, 366, 157, 189, 68, -339, -572, -165, -295, -520, -338, -552, -198, -66, -233, 117, 66, 387, 313, 236, 252, 499, 432, -7, 59, 609, -15, -145, 40, -504, -564, -456, -503, -415, -123, -348, -153, 242, 191, 309, 301, 295, 361, 346, 396, 321, 290, -60, -76, -83, -139, -207, -142, -337, -546, -745, -186, -358, -350, -45, -38, 169, -121, 309, 296, 140, 452, 444, -96, 214, 233, -87, -291, -49, -51, -149, -402, -349, -380, -328, -484, -57, 201, 298, 80, 57, -21, 452, 534, 9, 196, 687, 277, -52, 55, 152, -221, -514, -121, -403, -415, -303, -243, -259, -27]
2159b7L98k00o9J08O68p09M2K81J40m16k9k4m33j4k20j49k3J39J88K8M7K42n5
2182h7j8M43L32n60L59R9k4l37k0j11R0k48K85l84l73K45J05N9m31K35J67k97
2204d71P10p7L7M82l82j35J06K45J19l29m53K37k46p2r0nn7k09J90j50L31K51
2226C2k99N1K72M19k41K65l1k01R1p9M1l65l05M49j62k57j58K8lJ20L88j36n0
2249a31L41k00O5M42k10P2J03l6jm08j38J09k05K8k30K56k75q1K06j78K06N29
2271B64m79K53M55k14J36k18J08K68m10j45K90l76j08K46j49Q6m30Q2l7j74L22
2292b30q6K86P3K75k46lM00J68k24j03L0Q0l76m1j57Oj20j06j99K64K11j87L7
2315b48K34J56o9K4K41P0k34j39K40p0M5j92M9k62mK33l72k8j3K11Rm46O83j34
$$ y = [-27, 371, 171, 102, 210, 878, 169, 211, 492, 632, 216, 187, 163, -270, -284, -504, -653, -676, -537, -349, -321, -274, -32, -87, -105, 338, 670, 110, 469, 568, 544, 207, 187, 76, 166, -82, 203, -181, -554, -309, -204, -145, -576, -341, -174, -471, 239, 162, 199, 681, 299, 164, 270, 515, 634, 305, -148, 89, -157, -229, -319, -324, -381, -590, -400, -550, -219, 32, -267, -216, 56, 475, 234, 499, 468, 267, 358, 279, 320, -45, -350, 99, -63, -320, -478, -450, -453, -333, 55, -81, -131, 210, 10, 75, 517, 307, 379, 482, 446, 445, 37, -101, 8, -197, -169, -399, -143, -418, -499, -293, -471, -265, 264, -215, 38, 493, 279, 415, 197, 305, 573, 163, 18, 308, -68, -176, 70, -79, 7, -423, -341, -378, -552, -230, -316, -30, 43, 318, 72, 69, 469, 637, 413, 310, 340, 420, 44, 3, -154, -148, -268, -374, -573, -309, -98, -285, -248, -14, 142, 73, 97, 338, 408, 174, 35, 275, 205, 250, 58, 107, -155, -159, 74, -298, -326, -339, -128, -119, -565, 118, -16]
2339a6j71L18J61OM1j1j11k2l1N8n6l81Q3M0o7L1l82r2K46q1K41L31q2m1L81j26
2365B67r6j6L8r9J79P4k43j89J25k53l01K27J3J3j42J36K20k16J17K87p6K06l3
2388B38J47J15k03K1Km63M38k30m24J23K71k31k3l20L98j0J58k5L9J85j10J18
2410B14P1J09J29l38m0m3j37Rj30M2J49j80k29K57l34L61l11R7L73J85j23P0j0
2433A91L71j50m4J0k32j78j86M08k19l29J60q0j71J68J92k8j24M76l93K85K2K43
2455C92R0J03l81J02k44p4J96j46k09l7k21K8N3K69l40L53Q3Q9N7k94K52j14M31
2478D38o6J10l19nK90k35l15k0j27J12j45J46k28OL07o0j38J26L91j01L9m7J87
2501C46K6k35N2K4n68K82j3Q9j47K7j38P9J62k11J15J66m3q3K15J97j19R5J57
$$ y = [-16, -187, 131, 292, 298, 339, 328, 217, 195, 164, 222, 166, -215, -132, -92, -159, -128, -510, -602, -356, -437, -196, 135, 53, 12, 393, 267, 171, 155, 193, 94, 273, 347, 104, -85, 40, -213, -514, -287, -274, -261, -403, -267, -47, -263, -146, 141, 65, 271, 238, 385, 500, 297, 318, 320, -143, 295, 65, -359, -236, 35, -196, -219, -539, -141, -151, 7, -18, 21, 206, 96, 214, 285, 394, 523, 185, 145, 102, -35, -26, -156, -114, 35, -145, -374, -117, -451, -90, -401, -304, 69, 254, 131, 201, 191, 562, 412, 368, 378, 146, -32, -218, 190, -29, -358, -198, -278, -449, -281, -89, -117, -241, 235, -158, 127, 149, 392, 482, 585, 204, 306, 62, -12, 184, 38, -171, -208, -429, -401, -348, -79, -419, -66, 17, 106, 163, -131, 121, 7, 438, 372, 482, 163, 158, 448, 213, -102, -122, -249, -137, -282, -136, -364, -358, -51, -111, -249, -123, 268, 167, 206, 159, 346, 372, 137, 189, 213, -355, -73, -86, 3, -144, -117, -255, -176, -14, -225, -110, 56, 13, -70, 145, 342, 223, 318, 475]
2524D75Q5m33J9J16j53o1J34k19k68j3j2m6K47l49J4K18K18J61j57L95l72L37
2546C36l51M08k39k11J64j59J08j63M0k44j35L01j56q3K84k27M14k29L81N0p1
2567B18m2Q4j04M25k99k75o0j0J92l31m0J66j33k34K90k28J06k53M42M76j01j06
2589A83O7J1l3J73p3R6l01K7O7m78N4n7l7o0j34N0M13k02J30R0L76k47m7KM83
2614E53n07J40o3K38j62j67k21J10j63J51m47M41Q0L5j87o1K52J44j38M8K95Q3
2636D54l41J12J02l41J34K41n77K56k00n0j96J97j5j10L14l4m6Q5J26J08m47N96
2658C68K65m70O1J20R2m31J98k12j76k04P6o1J02J82j73P6J51q3L91j6j78J37
2680B15Ql56L33L92n48l7M71n08k90jOJ77n9M04o04M8L88r7O07k00L0j52K08k22
$$ y = [475, 560, 127, 146, 262, 109, 48, 182, -37, -305, -318, -330, -376, -129, -478, -464, -246, -28, 133, -24, 371, -1, 336, -15, 393, 154, -57, 107, -52, 56, -107, -67, -311, -446, -145, -301, -384, -100, -327, 87, -142, 239, 289, 218, 176, 260, 156, 581, 282, 7, -53, -63, 129, -202, -242, -76, -209, -443, -153, -381, -275, -528, -86, 390, 289, 183, 250, 261, 228, 401, 328, 424, 123, 150, 217, -261, -207, -264, -301, -361, -495, -445, -32, -234, -104, -14, 362, 115, 68, 70, 553, 46, 186, 123, 361, 199, 32, -189, -79, -242, -91, -538, -97, -17, 18, -169, -230, 22, 166, 28, 76, 371, 454, 113, 225, 327, -14, 120, 361, -216, 40, -160, -210, -406, -209, -224, -334, -20, -54, -100, -15, 111, 219, -228, 368, 633, 163, 224, 344, 436, 5, 203, -9, -185, -389, -313, -374, -272, -90, -263, -187, -36, -119, 272, 256, 78, 215, 223, -133, 200, 592, 44, 7, 478, -30, -320, -321, -315, -138, -197, 207, -397, -349, 39, -58, 549, 349, 379, 227, 435, 213]
2704B13M9j93j1L54j80j50k73Pj56o2M54l78K95j45k2R9Q9l7J78N0K71j47j59
2727A46M0o3p9j06j1K5l34K74o4J05l00R2L05j65r3K68j23J14r7M42l34j35M94
2750D01j66k46l73L27J5q5j36K42j31m13L27M3K67j28J89K33p7l6l53J37K47j84
2772A00P8J05ml64J36q1k29J2J17j22J62j78N90k86j76j15N3N20j8m1j31K22j39
2795B11k9l31L20j90N2j44j6k97J13L44j06k78M15J15o3j95K05j38J63K17j08
2816B60j55K55l19o6n3n6K13j33j54p5L19m49L47MP6k24o6K39K85j57K57r3R8
2839C53k54M2k7j03J46k45K8j78K43k36Q4J76O7m48K75L15j80J42lm0K44k21J53
2862C33j29J92l80Q3k31l3K81l6k94L67n88J96J16k98J89L19K07j56K41k82K45
$$ y = [213, 262, 69, 58, 412, 232, 82, -191, -184, -340, -402, 52, -326, -31, -176, -198, -99, -10, -47, 131, 181, 452, 305, 146, 186, 123, 44, -62, -73, -48, -382, -108, -172, -67, -367, -275, 30, -135, -228, 40, -83, 31, -66, 376, 42, -93, 401, 235, -11, -384, -57, -42, -127, -263, -21, -152, -565, -238, -195, 72, -56, 133, 366, 289, 253, -100, 37, 284, 100, 178, 283, 279, -85, 51, -30, -259, -247, -130, -252, -90, -268, 322, 36, -140, -255, -202, 318, 300, 259, 128, 350, 211, 182, -149, 171, -19, 33, -111, -127, -424, -311, 33, -73, -351, 64, 179, 116, -79, 126, -12, 151, 368, 260, 105, 360, 41, -25, -78, -134, 79, -54, -208, -283, 36, -413, -66, -62, 14, -210, -276, -37, 248, 91, 348, 255, 353, 99, 141, 114, 11, 157, -88, -60, -238, 5, -231, -147, 29, 96, -352, -77, 238, 58, 200, 197, 157, 401, 180, 333, 204, 396, 16, 99, -132, -165, 116, 80, -214, 153, -435, -239, -123, -421, -232, 87, 294, 138, 379, 97, 342]
2883C42k52P7o7J08k1k09j13J50k42J37j94j0P9n5l5L60J26j48j1L09j0J10l57
2906G4J12J37l63J69k92j2k89N30n20L07J70k52M2J57L3J42l55Q1J7L44m4L50
2928E38n76L15j45L09k42R6j49j21j63k49K69j66J01k93K22J59L02j85L07j09
2948B20m6J08j07N7k1j41K17j84j84j67p4K78l30R9R5P0o8o1M12l49M82j71P0
2971B05J62j66J24l56O6M6k26J25L3J20k12j59p7Q5J08r5K2P8O7L07l6o3mJ35
2995B89j73m4PJ91l24p8J66j10j49P2j53K15k4n3k0k8L56o6j24L03k54K07j4l7
3019A55j4J36n9q4n9J50l05l61L15m3Q8k93N04m72N05M7l1l4K0J2Q7L5j16k82
3043i9K87j43K1j30l06R0K49n40L80L6j29J3M11j11k61L33M12o48K53N7M6k99
$$ y = [342, 90, 167, 100, 208, 187, -22, -135, 15, -227, -90, -284, -294, -215, -270, -305, 55, 181, 33, 22, 331, 321, 431, 74, 186, 323, -40, 129, -163, -175, -464, 66, -454, -147, 23, -229, -187, -30, 3, 145, -210, -129, -112, 232, 188, 538, -38, 277, 132, 441, 199, 295, 146, 25, -138, -387, -118, -284, -183, -476, -254, -95, 207, 22, 329, 220, 174, 282, 175, 232, 211, 70, 287, 103, -81, -248, -322, -44, -374, -275, -180, -110, -178, -239, 173, -176, 306, 135, 205, 367, 201, 325, -31, 35, 81, -145, -20, 13, 133, -79, -238, -315, -230, -122, -217, -195, -117, -50, 257, 221, 158, 154, 289, 116, 72, 79, 270, -54, -132, 34, -76, -225, -153, -306, -91, -115, -168, -188, -216, 140, 74, -50, 253, -1, 206, 192, 155, 141, 277, 218, 134, 75, 225, -80, -441, -126, -169, -81, -374, 130, -342, 163, 210, 179, 145, 165, 177, 264, 299, 183, -99, 188, 45, 66, -64, -370, -280, -31, -571, -191, -155, -284, -271, 140, 29, -232, 101, 513, -135, 118, 175, 221, -78]
3065g8O2J31J94k17L4k83J37r3l48Q7K62J81j00j1Q0J12O9L2r9K97n26K04m5j57
3089g5o6rR9k62K06j67Q8n2l5L4K91p4n3J00K73k43J48Nr1j19L6J44j29j94J51
3114Fj67k20K62R5k12R6K63j47o2O4K90k07k27K70J02n7P0k07K09j37j05j19j1
3137a51L6NR1k57l0J10j22N33l52n7J66M58j84j60K30l0k42n7J99Q8l11J10k30
3160a57p2J04q6j80M52j1r8j42K76M8J14K5j39J52j09l6l0k44J38K27j39l17N3
3183a71r5J29J19N0j99Q5L3K00j03J94j08j34L46l54K45m87L21k07J13j34M0J1
3205a06k22L19l67J76N3J15M4K4K85pJ0j48l3j71R8QQ3p4J03k04j65J43J6m9j34
3230b03mK50j37K56j3k40K86j1l7j73J39K8j15M07m19P5k57j14J10K4L7n7j72
$$ y = [-78, -16, 115, 309, 92, 126, -157, -20, -113, -461, -374, -112, 69, -31, -42, 38, 150, 219, 251, 152, 449, -77, 127, 82, -75, -141, -150, -51, -313, -107, -274, -186, -238, -273, -239, 52, -22, -75, 25, 298, 55, 203, 208, 117, -2, 34, 178, 49, -145, 6, -161, -381, -119, -24, -236, -140, 123, -24, -86, -22, 268, 61, -166, 104, 206, 149, 219, 12, 221, 84, -21, -140, -151, -115, -110, -19, -276, -306, -196, -318, 215, -137, -194, -28, 430, 246, 86, 316, 286, 44, -13, 186, 274, -37, 73, -157, -229, -125, -211, -391, 61, 50, -48, -190, 86, 134, 248, 273, 134, 286, 177, 141, 111, -133, 5, 232, 93, -224, -171, -266, -137, -18, 32, -167, -82, -49, 151, 48, 242, 134, 0, 346, -8, 237, -250, 71, -136, -23, -157, -117, -106, -328, -9, -376, -200, -147, -32, 12, 36, 321, 314, 324, 176, 143, -28, 70, 78, 161, 87, 190, -14, -179, -36, -20, -69, -203, -207, 43, -94, 162, 149, -91, 195, 184, 147, -26, 113, 141, 26, 433, 14, 89, -168, -282, -172, -148, -111, -168, -340]
3253c40K72q7K03j22J68mr8L07J56j45j34O0k77L48k65P6j97K21k86m7J73P5R3
3276A50n82L94L32l66p4J5P8l8K65p6K27j15J83k75N5l86J30j9m3k39K25KJ12
3299d5O6j5J34J7m5Q0P1J3j8k78L95j61L2K09j87n13M23j24l9J76k36J46k36k37
3323c72L8L37j27J72m6K40qp0J35n2J6m63j0K53n15M57j76r3j06L46l06J9L19
3346a2j64J56K83q2q7J85j01J3J9J50k04P7j65L5k21K94k72o8L56l10J72j34K16
3369A36j15j56J79J87J25k16m8J66j57J23j37J02k52N2j59N3M9q7Q6l53L08O8
3391d6O7m8L01m8p9k66M39j58l2j20p8J88Jk05j90Q3l84O30q8P5j20K45P9q8j34
3416B4K2L7jj68jJ20o3P6J06j19q6J42r7k18r0L13N1k0K30m07O3L7J2N30l16j6
$$ y = [-340, -68, -155, 48, -74, 94, 90, -8, 299, 455, 310, 176, 236, -41, 307, 42, 118, -79, 142, -144, -191, -18, 57, 150, -432, -38, 294, -72, -146, -131, -53, -91, 174, 98, 325, 210, 393, 118, 173, -213, -83, -102, -145, -384, -159, -157, -45, 21, 6, 140, 157, 112, 192, 263, 276, 258, -20, 375, 214, 246, 455, 268, -245, 178, 54, 15, 191, -45, 101, -135, -372, -334, 3, -124, 48, 2, 242, 234, 164, 299, 247, 263, -200, -210, 43, -472, -15, -191, -284, -390, -44, -350, -331, -12, -176, -20, 263, 181, 94, 279, 178, 191, 210, 360, 156, 233, 68, 103, -118, 176, -96, -164, 192, -118, 54, -80, 136, 21, -135, 44, 231, 356, 140, 92, 258, 101, 224, 87, 189, -63, -11, -170, -117, -68, -155, -69, -422, -114, -46, 21, -27, 274, 226, 147, -119, 320, 162, 130, 10, -68, 120, 121, -84, -274, -191, -575, 55, -33, 42, -78, 167, 246, 158, 24, 46, 83, 82, -86, -87, 33, -30, 46, 152, 33, -53, 89, -8, -226, -316, -3, 48, 28, 258, -149, -86, -49, -37, 493, 177, 161]
3442A61k20J05j29MJ26O3n3M7k24j67K39j0j42j56L8L97j6l7k54M81j90l6j0k8
3466a1J64j77jJ53m3lj08J20k92K00j89K1N1J37j42K02j69J40J63j43J03O2k51
3489a3K52m3m31J71j58L1J70P1k49q7N5J47J58k4j07Q1p5N2Q9J15Q7j34j46k23
3513b11N32L2Oo10L69m1l71P8O3J21j25j55N82l68L27n0o4j57K92j94K70n21J74
3536b1Qj42K84k23J93n26K42j2N0n6J38J40m19K23L04k40L23j44j36m1K13R3j46
3559A05r7m5mp7K00k42J26j95P9R4j04K32Q9L2j52J18j7J56j46q6j08J55j81q8
3583a56J42L7o9k34J77j08J75J45l30R5K20j03L40o39O17j04j23J08k56L58m5
3604B47j00j28l25M33j89j03J32K27n75K67j5J8K9J20K68m00K57j70J52L2k01
$$ y = [161, -59, 46, -83, -79, 47, 110, 57, 104, -120, -287, -48, -58, -200, -356, -318, 79, 63, 26, -228, 253, 63, 27, 17, -11, 153, -24, -25, 128, 85, 82, -26, 94, -198, 2, -187, -166, -115, 22, -120, 82, -87, 53, 216, 73, 176, 238, -13, 239, 196, -235, -64, -222, -191, -21, 50, -199, -286, -231, -84, 74, 50, -57, 24, -51, 1, 90, 205, 292, 158, 12, -211, 321, 353, 359, -251, 118, 77, -294, -216, -153, -32, -157, -312, 270, -98, 229, 179, 115, -42, 250, 56, 326, -195, -21, -13, -155, 129, -94, 99, -427, -185, -197, -147, -203, -65, 75, -344, -121, 183, -57, 266, 122, -14, -55, 158, 251, 105, 8, -37, -41, -118, 82, -160, -34, -229, -150, -56, -160, 72, 161, 193, 41, 159, 142, 298, 152, 66, -42, 113, -68, -156, -14, 23, -46, -280, -103, -211, -36, 109, -221, -126, 94, -9, 331, -308, 309, 205, 82, 190, -66, 292, 247, 147, 19, -306, 127, -62, -165, -33, 194, -381, -114, -129, -111, -82, 38, 306, -94, 163, -7, 145, 177, -24]
3625b4o5J61j19L0j11m5J58j12k57N73q8j53J71l5j88L20j96j3k9J72nk31K27
3648A41L9l84l7J63j94J18J0n3q2K45n7J52K6J50M1l18K28m3j03m0QR4J9J36j62
3673I7k09m3L08j18k6l62K06L16n75L65J70m0k05M54m09K5J09J62j28o4m22M47
3695E8K4P5k58j12o2M6L39k71j60K08K2M4M9j16K90K4j46r4j64K51j06l6K6J30
3719F1l04K63l23J81R5j51l3K71N4l48J95J53R0l05o2n6K84R3l12K90j49k0J0
3742b3j8j21j01R9J31J85m75L31J84o7k90J65J09m4J56j20j34J33M9K81k87k11
3764f8K14M2l6k76N6j10L06m13J91M20l06Q0j92M8J41J69j35r5J58Ml97K61l3
3787B9n6N7o7j57K31j29l3J99K3K8l4L4j13L98k45j34J93r6mm15J87oR9l4L18
$$ y = [-24, -89, 72, -47, -17, -128, -173, -15, -127, -384, 189, 101, -52, 119, 84, -104, 216, 20, 7, -22, 150, 145, -86, 141, 180, -204, -241, -78, -272, -154, -144, -197, -279, -34, -91, 61, 87, 237, 278, -40, 188, 145, 42, 2, 10, 104, 123, 259, 97, -112, -155, 153, 35, 9, -353, -147, 169, -406, -41, 129, 89, -116, 338, -71, -46, 63, 225, 97, 33, -389, 58, 82, 157, -101, -213, -275, -229, 110, -161, -321, -113, -91, -47, 2, -114, 176, 200, 54, -40, -204, 47, -59, -95, -69, 61, -243, 20, -303, -122, -27, -178, -211, 60, 114, -234, -39, 114, 204, -101, -163, -219, 65, 158, -154, 136, -13, -33, -23, -41, -162, -263, -164, -33, 152, -323, 8, 192, 125, -165, 0, 109, 65, 221, 101, -33, 100, 149, 430, 143, -68, 146, 188, 152, -124, -68, -178, 128, -285, -94, 326, 20, 100, -92, -44, 97, 266, 131, 36, 194, 198, -199, 62, 29, -27, 30, -37, -194, 37, -92, -125, 74, 97, 125, 91, 125, 12, 410, 165, 31, 224, 128, 124, -291, -104, -110, -11, -45, 273]
3812B73m11J51P5J5j78Q2J90j72O4pl21K06P1M5M9l75M08k51k81M56l48J31m03
3835e31N00J4q9J68J16n8j6m6K17l21j02j93K07J84p0j51J96J1j76J08m4P1q4
3858h9K43l12m4N6k07M41J14q9K28l28mK31j05m60K46k3K38j53l3K34k32m0Qk25
3882c05K27M6r4M05k2j1o0q4j42m3J21l2J78N0j66k42K41j23l04K69O0k23M05
3905A51k85M5K45n6q8k10K45J17J8qj28J3n47M88J48J4j95n16M83k47L17K11j51
3928F4k81O7P3J48l3k69L80J00j99Q0j07p2J50p3j14j07M27k85p6K27j58q2J37
3951cj70R9J94k44j79N80k32J23l25J59J64k20kJ62o3M3k26K0P7O7O3l29L27m7
3975C8J59k12j61L95k69o1N6j43K20L00m47K25j42j54pM8K31k08J51j62K63J34
$$ y = [273, -138, 13, 88, 103, -75, 7, 197, 25, 89, 82, -239, -33, 38, 83, 132, -243, 165, -86, -367, 89, -259, -128, -531, -31, -17, -106, 62, 178, 120, 104, 58, 275, -46, -148, -341, -134, 50, -20, -171, 25, 36, -140, -32, -76, -5, -89, 154, -158, -202, -146, -353, 88, 202, 113, 341, 13, 9, 240, 135, -325, -79, -102, 136, -17, -50, 184, -48, -88, -80, -305, -78, -32, -126, 279, 257, 246, 186, 102, -40, -83, 38, 6, 184, 234, 68, -174, 67, -56, -360, -91, -31, -254, 151, -134, -89, 156, 100, 12, -198, 47, 164, 182, 174, 46, 59, -488, 0, 148, 162, -33, -549, -66, -313, 4, 215, 64, -217, -150, -77, 71, 38, -231, 149, 249, 50, 130, 23, -49, 101, 28, -86, -193, 234, -51, -127, 100, -58, -140, -3, -173, -74, 120, -124, -303, 277, 45, 168, -157, 2, 166, -54, -56, 106, 43, 86, -140, -120, -43, 24, 87, -242, 85, 38, 197, -15, -176, 219, -50, -111, -55, -198, 22, 322, -125, 100, -42, -196, -203, -155, 76, -132, 19, -143, 120, 254]
3997B54K1k68j28O6j01J0L76k77j8J66j63J51k11k7J61o9L65o86M17k23J90J39
4019A45n9l7m5K85l66K60m18L10J33j14K2j27j30NK41l21J98J87q0J7k18N8k4
4042g8J97L18l66k23K24j22J1QJ77j57J09j66O9p1K0j82J22l9o9K88q6R9J34k29
4066a2l0Q0J56l03J87J11L3o08L99m8J27j69J7k53J33L64l07K61m23K59K08j25
4088E7k52K91j10j41K3P7p7Q5K8K51k79P3j00L79k53k18M02j62j61N7J07P6k19
4111f6J56j17p7M2m5J03m1r3J54m6J4O9n3J83m36M64k72m5j30P3J51J59j77j58
4135a88K81Q0Pm22J49Q7k07K62n3ol2j89J06J4L64l09j04j11L90p5J6K5J67j88
4159F4j07N2q7K03l42N56k89j83q2J07q3M4J60PJ40l10L8J49Q1k03j0L87j60R5
$$ y = [254, 275, 7, -121, -55, -156, -146, 230, -47, -65, 101, -62, 89, -122, -149, 12, -57, 308, -378, 39, -184, 6, 145, 86, 49, 4, 289, -77, 183, -235, 75, 208, 94, 116, -11, -141, -136, 105, -216, -18, 169, 89, 106, -112, -54, -78, 119, 437, 71, -152, 72, -50, -39, -31, 146, -11, 98, -68, 1, -70, -50, -232, -110, -149, -218, 70, -16, 83, 217, -12, -42, 38, 194, -109, 78, 189, 222, -386, 13, -35, 92, -77, -60, -313, -180, 184, -123, 138, -285, -26, 182, 57, -195, 96, -14, -155, -132, -55, -132, -47, -19, 232, -47, 26, -74, 305, 52, -166, 236, 74, -87, -30, 77, 153, -66, 90, -27, -104, -62, -107, -4, -45, -138, 16, -30, -16, 53, 0, 183, -253, 211, -61, -106, -236, -163, -12, 147, -30, -188, 93, 173, 180, -242, -93, -6, -213, 49, -4, -10, -42, -231, -125, -111, 253, -56, -160, -271, 119, 44, 60, 85, 252, 64, -43, 9, -78, 125, -217, 339, 50, -133, -215, -108, -191, -147, 13, 20, 160, -150, -112, 37, 118, -85, -95, 292, 132, 227]
4183B27o5k00N3Q2k61J7M6K53j99Ml4J24m2K9R2l42M59j65qJ03P2j33l02K16J72
4208A98n6N0q8O6k43RJ35k65O5R8N5R1r9m3k27J03J36j12K26Q8k75J89k73K95
4232A23o5j53L57j17l5P3k14M7p8K69n27N72k62k34L42p1j11j47K77j62K74m20
4254b62L49r9j28LJ27P0j08K6P8J4L9P6k46J81j77o3J06P3j37K15j75k9K31l14
4278a50J90J56r4k53N5J76kk55L20j27j6k10J21k8K57l15N1Q0J26q7j96J18k36
4301c19l9L93k11R0J19k32q5L31l81K61J09L5J88l13J3K91k78l7L2J61n0j68J28
4324C8j2m0Q0j02k58K15o0Q7Rk1J30j49N5N0R5p7j36J74r6p0n8MK18j10J12k58
4350a80K66j90l8J88r6Jj04K44K25j84k8k6j96R1n2K6j25J76p2k67L82l66L06
$$ y = [227, 162, -38, 15, 97, -164, -147, -101, 152, -47, -43, -77, 47, 5, 34, 126, -216, 243, 78, 70, 173, 245, 112, -190, 26, 198, 142, 192, 104, 170, -73, -64, 71, -194, -129, -31, 24, 115, 16, -27, -254, -151, -15, -127, 99, 187, -88, 101, -172, 123, 58, -95, 262, 145, 110, 183, -31, 16, -62, 207, -320, 252, -10, -244, 98, 27, -84, -231, 46, -116, 158, -262, 87, -12, -140, -137, -10, 60, -48, -22, 56, 70, 109, 185, -61, 120, -57, -120, -14, 59, -78, 137, -38, -67, 164, -150, 40, 196, 102, -151, -96, 80, 78, -177, 143, 16, 0, -210, -89, -117, 140, -175, -124, -44, 82, -5, -201, -83, -319, -358, 35, -176, -86, 33, -199, -284, 47, -334, -73, 36, 71, 259, -54, -41, 250, -28, -65, -33, 128, 78, -90, 38, 26, -14, 66, -36, -294, -79, -139, -52, -43, -64, 66, -83, -28, 22, 117, 40, -96, 78, -18, -88, -146, -142, 76, -34, 78, -180, 86, -104, -142, 46, -50, -49, -153, 91, 316, 132, 104, 78, -118, -27, -79, -53, -178, -2, -74, -341, 41, -325, -19]
4373a9K31j82J94K6m80N77l38j43O8P2N1J85k04o6R7O9o4O2k44k2J87k9J63k15
4397b4J17j71M6J00r3J63k24K61P8lp9J2j77j25K63j8j06j34%o3j04M32l7J26
4421B40l30j01M21l19L0K17p1J0l20L97j21J07m38l6RJ57J48J18l93M18j71J44
4443A16j26j1L4l1Pj0nN6j77q3K59j74k80M73j7n6j11J93K31k91K59j06j70L41
4467C21k76j69L30l40J03O3P7j07j5lj0R4k77J67j2r6M46m71J56jj73J61Q2k73
4491b23K56q0j17P5J86l0j62L89q3k98QL44k58j14Q8J57j76j09N7n1K12n18K84
4514a63J90j8j4O5j77M20j37k72J00j56K55l15M0o2J16M05l53M3K25L3l31RK29
4537A32m07M92j38k36l3K44k45L54j2l81L77j28j53J21L03j36l1j8K3l95L07J70
$$ y = [-19, 212, 30, 224, 250, -230, 347, 9, -134, -66, 6, 57, 242, 38, -28, 69, 138, 74, 136, -108, -130, 57, 28, 191, -24, 93, -78, -32, 68, -25, 138, -86, 175, 253, 250, 171, 183, 6, -119, 144, 126, 20, -114, -114, -177, -281, 151, 114, 240, -90, -191, 230, -89, -59, 158, 87, 97, -223, 174, 53, 160, -278, -314, -305, -148, 0, 118, -275, 143, -28, 116, -10, -21, 13, -18, -11, -21, -26, 30, -147, -230, 29, -145, -425, 48, 31, -25, -136, 57, 288, -3, 256, 150, -20, 321, 45, -124, 206, -134, -31, 32, 109, 2, -13, -16, -26, 68, -209, -42, -54, -150, 296, -175, -19, -20, -193, -32, 50, -223, 33, -47, -164, -89, 97, 67, -95, 294, 211, -87, -79, 265, 7, -107, -19, 138, -38, -147, -90, -141, 71, -447, -163, 27, 9, -5, 60, -117, 303, 166, -106, -6, -162, 93, -222, -182, -244, -128, 277, -76, -33, 192, 225, -106, -97, 132, -275, 217, 79, -157, -190, 54, -191, 163, 151, -230, 147, 19, -134, -13, 290, 154, 123, 105, 128, -267, 40, 210]
4559B10k90M6M6j70K55j61M4J72k84J5R0j18M24o15Q07l63l28J41J21mj04J77
4581A11o4p3k36M41k02k8q2k7K39j01q9K11l3J20j86m8K34r9M4l35L68k17O2p2
4605f2K38l88J66J57j27Q9m50M42j50J21q7j20j5J82j15J28r2R1j79J04J00j21
4627h8j28K98j72J90q7q1J58k45K45J07l87K33k3L6j2m7K4r4k45L95k68K35J06
4650A50m1j35J41k1n2j47J14J18k86L95j80l2J00L9J8n46J17J74Lk3J51jj34O1
4674a7J49k98K50O5k59K85j41j98J79K51l91K31j97j7JM7j80N24j35j02pL15k28
4697A27q2l41L40r6J3J47M6j16k65K63j86J34P6n6N5R5l25L10J41l08J43L1j37
4720Ik7J09k94KL95n4J63k02m19M35j10k82J03K55O0j17j90Q3J41R4l04J79o1
$$ y = [210, -80, -34, 12, -158, 97, -64, -20, 152, -132, -117, -27, -145, 279, -336, 471, 108, -220, -79, 42, 38, -66, 111, 47, -26, -262, 179, -23, -51, -133, -160, 79, -22, -111, 100, 67, 187, 1, -47, 187, 88, 132, -203, 165, -52, 10, -62, 176, -212, -46, 111, -16, 73, -377, 65, -85, 36, -51, -171, -186, -4, -119, 9, -83, 8, -171, -67, 33, -88, -216, 82, -90, 100, 13, -68, 90, -155, 90, 197, -190, 43, 20, 56, 44, -3, 21, -73, -318, 77, -191, 44, 150, 109, -26, 115, 94, 42, -105, 9, 127, -159, 236, 56, 24, 124, 163, 181, -365, -248, -74, -71, -94, 57, 56, -78, -17, 132, -166, 84, 149, -110, 175, 34, -164, 15, 266, -125, 106, -91, -108, -107, -60, -240, 284, 149, 47, 40, 355, 127, 45, -296, 44, -52, -39, 108, 154, 38, -227, 36, -150, -16, 60, 4, 59, 154, -171, 139, 280, -28, 115, 146, 9, -18, 91, -203, -201, 194, 140, 303, 101, -318, 117, 7, -275, -172, 83, 143, 26, -164, -81, 60, 154, -150, 29, -32]
4743c2J44km29K72O7M0j23L1k32K81o9K41l62jJ41r9K30j27K7qj05R1L6j52J00
4768d0Q1J92k85K06k05J66l57J89r0J87P8j15j45k7p3K49Q4k51J3L19k82j80N25
4791B39j73Jj46K53r4j45L66l98J21N8r2J69l91M17n0K38j36k94P1j10K08m1r7
4814b6Q9Pk7j46J20J0K5Nj51R3O5K14l34n8P7J21j07J28k09J84o1J29q8n7K5k7
4840Aj8j87L23j01L2j72lK13k77J77j70J72J67l17k9L45j17J01Lq6M7j06J37k18
4864h3J61j66J01r5K95k52J34K4Mj79L30j34O5k74M4J47j23O9O9r4k08K21O8M
4888A28j44J78l57J81O9J37k52J66j72J79J18j32J3O0j36l4j64J80K72j40k64
4909a14J68K7k18J2j0J76j24R0k31K66N3p3J97j37pJ11M9j46j38J38j43J8p6L02
$$ y = [-32, 112, 110, -319, -47, 20, 60, -63, -32, -264, 17, -52, 189, -173, -174, -33, -132, 98, -29, -2, -10, -115, -24, 12, -140, -40, 41, 233, -52, 154, -51, 115, -242, -53, -143, 44, 122, 7, -138, -165, -238, 11, 95, -156, -143, 176, -106, -286, 239, 66, 67, -79, 174, 80, -65, 301, -97, 24, 82, -10, 159, -232, 185, 135, 373, 237, -57, 14, -96, 112, 71, -26, 63, 70, 43, -103, 17, 27, 52, 57, -94, -1, 64, 278, -56, -114, -37, 84, -23, 105, -104, 80, 19, 148, 60, 3, 28, 1, -17, -204, 119, 18, 50, -122, -125, 88, -189, -12, -182, -10, 157, -160, -189, 156, 39, 140, 143, 57, 104, -2, 135, -83, 78, -88, 13, -82, 213, -39, 95, 119, 123, -56, 274, 140, 205, -69, -25, 122, -1, 68, 137, 43, -165, 56, 124, 128, -16, 162, -195, -14, 55, 192, -60, 106, -66, 113, 231, 99, 112, 172, 36, 2, -162, 18, 290, 150, -114, 54, 81, -137, -125, -135, 41, -83, 7, -224, 42, 95, 22, 219, 82, 75, 186, 235, 89, -49, 89, -54, -36, -112, 190]
4933A90j52l41M05k35K87o3l97K23K84k21j65K62j89K49j27J29j34j08K82j81
4953bo4L21k82j59M4K92j42j43P3J26j74r9j17N61m15L33k83J88q9q4P9K90k88
4976c4N6nO6j28r5J39j27M1O9K65l08m48L98J78P1k4k08J05j62J27J83j18J15
4999A56n5j93J87j94K40k73J55R0j6k7p5J60m21M19j46M38n23n0p9K41K3k21J10
5022e4j08J04L7J07k5O5J0j94N5J62J4k36L38k07m0K32k31L9p2R6j84J27J75l21
5046a11kK89j83K8J34m45L29m0L1j04K63j21Q8J6N9k94k36J50L41k62j06Q6l06
5069c96M29n5k10L69J61n12J22j7J80n3J5J41j84J48k93r1J21M7m2j02J91J35
5091A04J3l8L4l21P9j16K61P3j92P4J37j76K33j54jL9m45K86j21K70O0m8m5j25
$$ y = [190, 38, -303, 102, -133, 154, 91, -306, -83, 201, -20, -185, 77, -112, 137, 10, 139, 5, -103, 179, -2, -66, 255, -27, -186, -142, 150, 8, -135, -62, 64, -110, -209, -326, 235, -180, 153, -130, 58, -31, -115, -36, 254, -34, 22, 17, 83, -45, -140, -1, -128, -87, -18, 247, -61, -509, -111, 67, 138, 114, -94, 11, -151, -24, 159, 41, 156, 101, -92, 95, -99, 141, -132, 23, 113, 97, 70, -5, 155, -266, 153, 7, 445, -78, -128, -207, 34, 57, -164, -54, -162, -58, -21, 86, 61, 126, 136, -58, -3, 159, 173, -63, 275, 68, 28, 260, 29, 68, -4, 92, -92, 35, 210, -111, -113, 176, -7, 21, 155, -290, 39, -1, 30, -74, 189, 68, 156, 172, 231, -63, -299, -149, 192, -70, -176, -90, -396, 33, -22, -232, 137, 298, -214, -92, -109, 71, 18, 33, 174, -10, 138, -155, -246, -125, -78, -120, -222, -31, 104, 117, 79, 113, -208, -129, -245, 16, 89, -103, -29, 108, -68, 165, 11, 10, 49, -396, -110, -231, 39, 99, 51, 6, -119]
5115a19O7l5J08n7O4p1J77J46l5q3l45l6J7K78m2l6k68J17q2N45p1k77j12o2L14
5140A02j16k37j25N24o0j07m3P7K59j22k00Q8J41j86O5j23J62J05k30L5o4n8J68
5163E5n6L0K72j03k13J77r3L2r7j36J85j27J49n1j08J68r4J01k05L47j87P1j48
5186c1R8J59k04J66j61j4j31J47m7n6J65j19J92l48pJ96k2r8R8j04K57j70L7j94
5210a91j42M47J82k64j17L51k44k59M43J00m50M0J41J67p1j3l97K35R5n0J11k24
5232a10q7J59R0J03j70J62k78K05j40K24k44K72n42rO12l88J6J83j88j8K4L36
5254B12m04N2P0m4J00J54J54m05P4L86l95N5q2K30j75J29j28j9n8L67k37J63n9
5277A40j9O0j5j84j70J8J52J53q7j70J43P8j52P9j01k93K86J96O1j63l52L22Q3
$$ y = [-119, -52, -87, 21, -36, 28, -43, 134, 280, 245, 162, -183, -219, -202, 76, 34, -2, -270, -153, -235, 310, 239, -38, -150, -212, 102, -14, -251, -376, 148, 88, -19, -62, 15, 274, 152, -48, 40, 181, -5, 60, -63, 99, 204, -26, 9, -55, -113, 55, -1, 29, 301, 198, -15, 162, 69, 101, 4, -132, 53, -74, 75, 24, -84, 84, -10, 91, -114, 233, 46, 117, -31, 67, 226, 22, 188, 27, 13, -118, 29, -18, -74, 91, -28, 164, -184, -191, 5, -17, -115, -17, -121, 136, -34, 3, -191, -333, 114, 296, 32, -85, 266, 22, -237, 206, 306, -144, -104, 37, 204, 133, 120, -277, -42, 53, 3, 114, -110, -197, -38, 52, 155, -15, 147, -131, 74, -66, 158, -86, 186, -356, -365, 247, -141, -125, 58, -130, -148, -124, 212, -192, -140, -70, -114, -14, 140, 294, -111, -37, 349, -46, 9, -73, 157, -18, 111, -17, -36, -94, 273, 36, 199, 140, 121, 181, 166, -18, -188, -170, -18, 135, 48, -122, 21, 99, -53, 26, -75, -368, -82, 114, 175, 12, -340, -18, 65]
5300F5k31J41J56j59R9j10J46m9J52j32J77j70J6j24K3j8K51j39j28rJ12n8j47
5323a36J28n1q8p1K17K85j97j57K29k52L27j93J32j31k67K53J14l18lPN09m39
5345a02j2K72J17l50R4L4n0L3k36K76k52J43J93j0j05Kl17J64K37J62k31n5k6
5368a9j79J98j84J09J58K61m25j34J82r8K7J96k59k2R4k4J28K00m69M76l10K70
5390A76k91K69k11p4J31Kj69K55j05j53J47j41m0k3q6O12m33Q1j27pQ2L19m00
5413a86J33R9j08J68K99m65k42L65j15K00j04J26k58K64N6m01j5J68m0j83N8M89
5435C08k35j39J61R8l1L1r4R8n1j95R4j72M01K1k60q3L1o0n29N41k4R9j7J82k51
5460g6m1J28L9j27J45j63l4J85O4j31l6J15Kl10K01Q6j16mj36M50k32k1o5J06
$$ y = [65, -166, -25, 131, -28, 71, -39, 107, 58, 210, 78, 255, 85, 101, -23, 0, -18, 233, 94, -34, -43, 69, 11, -136, -8, -59, -147, -218, -1, 284, 87, -70, 159, -93, 234, 41, 173, 42, -225, 28, 142, -176, -179, -172, 337, -102, -114, 158, 275, -75, 19, 53, 3, 36, -200, 76, -176, -33, 160, 150, 45, 47, -270, -106, 131, 293, 62, 7, -19, -198, 0, -184, -75, 83, 344, -81, -215, -33, -131, -104, 92, -167, -189, -95, -119, 9, 209, -260, 216, -94, 176, -115, 154, -57, -131, 0, 2, -167, 88, -17, -170, -23, -164, -204, -227, -313, 299, -134, -53, -180, -187, -105, 214, -186, -53, 46, -62, 106, 405, -60, -302, 63, -52, 148, 44, 170, -88, 176, 232, -169, -184, -16, -56, -239, -181, 308, 73, -66, 95, 193, 162, 193, 99, 197, 146, -49, 45, -127, 274, 295, 35, -48, -17, -77, -606, -65, -89, 10, -7, 175, -76, -117, 11, 50, -77, 68, -95, -129, 56, 120, -11, -47, 68, 70, -240, -39, 47, -69, -73, -209, 241, 9, -12, -77, 29]
5484B9m64L71Q1kq4L1K42k30L51k35m6n0k18L03m06L63J6J66k10l97O03k71O6
5507Im8O3j66j2K31k81N0j25M24lk98Q3K73m06R1K28j62J83l2j98L53m65J58J19
5531F9k85K93p1j41K62k20j88L49m4j54J8J10k56L47j93K6R4o2P4J64k4J2j73
5554GK00k97K60k18J30k2K5k4k96J86j32k1J78J29k8l20Q9N17k10k77K52j62q
5577d2l7J10j11L4l4J20k90N6J13J32K36J10n21K90j07o4K07k04K15j4R3l88r5
5600a91J35O8N8k34l0J22J77j53j9j4OJ34j69M59l17r7j63J63R5l18L41N1l6J47
5624B15p5j04k48M47k40k41L93j61k38J53J17J74k20j45J30m0J27p7J52P2Oj60
5646C7r9L33j75k39J74l2Q6j72K1J17j43K8J21P4r2J20r9J46Kk98J05k0J33J11
$$ y = [29, -435, -64, 17, 15, -69, -38, 204, -26, 325, 90, 44, -6, -224, 79, -327, 36, 52, 218, 8, -389, 214, -57, 9, -39, 24, -142, -154, 77, -204, -154, -279, 145, 142, -156, -73, 200, -206, -115, 113, -49, 134, 102, -96, 257, -208, -50, 69, -216, 77, 6, -135, 127, -93, -281, 68, 24, -130, -112, -2, -258, 89, -104, -78, 16, -46, 28, 192, 168, 180, 7, 207, -90, 170, -48, 82, 60, 85, 61, -235, -49, -181, -202, -24, 105, 77, -243, -154, 363, 153, -124, 128, -34, -42, -79, 31, -80, -46, -80, 40, -250, -194, -81, 51, 287, 397, -124, 166, 59, -5, 202, -2, 213, 199, 292, -96, -191, -56, 12, 70, -164, -194, -72, 105, -48, -67, -81, -75, 59, -110, 349, 32, -65, -228, -65, 30, -288, 53, 104, 68, 215, 140, 36, -212, 235, -5, -246, 147, -14, -252, -99, 18, 192, -28, -173, -43, -83, 44, -33, 119, 191, 197, 37, -62, 271, 96, -143, 31, -1, 85, -87, -66, 51, -92, -64, 57, 131, 39, 159, 60, 206, 208, -90, 15, -5, 128, 239]
5670B39l85L66k98k7L69l99J00j5J48k54K85n3j23J92k13M0J93J50l44J17J26
5691B14m61L54k67M45j40l0r3m9j26K94j40l40M61l04J85J1L1q7j59K84K30k33
5713H0K6k4l7J06k87J0J40m8l5K13R3j00J17q1l58L57k20Qj08M01j2J20j47k47
5737c3j09j17K23N9r5K39j98qR5L1R9k61L8j19K65k97K53p6J25j58J6m9k54L43
5761A2R6o9l72K43n9o2K73o4K01m18K70k4o0K97j49o7j04J84j4N0J22j75O5j65
$$ y = [239, -146, 220, -78, -105, 264, -135, -35, -50, 98, -156, 129, 76, -47, 145, -68, -28, 165, 315, -29, 88, 214, -247, 107, -160, 285, 145, 115, 22, -27, -153, 141, 1, -339, 122, -182, 3, 14, 45, -42, -201, 83, 313, 80, 106, 82, 45, 151, -136, -126, 14, -34, -69, 144, 237, 137, 254, 173, -185, 172, -48, -40, -148, 253, 241, 361, 214, -33, -142, -259, -36, 23, -72, 167, -31, -39, 56, 87, 186, -75, -37, -156, 109, -188, 65, -11, 114, -44, -28, -77, -331, 12, 108, 39, -333, -90, -149, -211, 62, -2, 199, -219, 51, 27, -33, 264, 115, 48, -56, 128, 114, 164, 286, 111, 176, 11]
$$ [...]
8191H5
##END NTUPLES=NMR FID
##END=
