##TITLE=1H_LR-784-R2-REG2
 200.13MHz, CDCl3,
 8 sc
 
 22.1.2025
##JCAMPDX= 6.0         $$ Bruker NMR JCAMP-DX V2.0
##DATA TYPE= NMR FID
##DATA CLASS= NTUPLES
##ORIGIN= UXNMR, Bruker Analytische Messtechnik GmbH
##OWNER= pz
$$ XWIN-NMR		Version 3.5
$$ Wed Jan 22 13:53:34 2025 Russian Standard Time (UT+4h)  she@DPX200
##.OBSERVE FREQUENCY= 200.1313
##.OBSERVE NUCLEUS= ^1H
##.DELAY= (6, 6)
##.ACQUISITION MODE= SIMULTANEOUS
##.ACQUISITION SCHEME= undefined
##.AVERAGES= 8
##.DIGITISER RES= 18
##SPECTROMETER/DATA SYSTEM= spect
##.PULSE SEQUENCE= zg30
##.SOLVENT NAME= D2O
##.SHIFT REFERENCE= (INTERNAL, D2O, 0, 14.3821)
##AUDIT TRAIL= $$ (NUMBER, WHEN, WHO, WHERE, WHAT)
$$ ##TITLE= Audit trail, XWIN-NMR		Version 3.5
$$ ##JCAMPDX= 5.01
$$ ##ORIGIN= Bruker BioSpin GmbH
$$ ##OWNER= she
$$ F:/spectra/data/she/nmr/H-C/1/audita.txt
$$ ##AUDIT TRAIL=  $$ (NUMBER, WHEN, WHO, WHERE, WHAT)
(   1,<2025-01-22 13:51:55.92 +0400>,<she>,<DPX200>,
      <created by zg, POWCHK disabled, PULCHK disabled
       configuration hash MD5:
       00 E9 B6 7A A2 85 ED C7 34 08 36 98 17 FE 4E 26
       data hash MD5: 16K
       0F FD 2F A8 7E AC 34 9D C7 BA C1 E9 CE DE FD 61>)
$$ ##END=
$$ 
$$ hash MD5
$$ 61 74 1B 1C 82 0E 60 FD A8 C5 E8 41 29 68 92 29
##$RELAX= 
##$RELAX= 
##$RELAX= 
##$RELAX= 
##$RELAX= 
##$RELAX= 
$$ Bruker specific parameters
$$ --------------------------
##$DU= <F:/spectra>
##$EXPNO= 1
##$NAME= <H-C>
##$PROCNO= 1
##$TYPE= <nmr>
##$USER= <she>
##$AMP= (0..31)
100 100 100 100 100 100 100 100 100 100 100 100 100 100 100 100 100 100 
100 100 100 100 100 100 100 100 100 100 100 100 100 100 
##$AQSEQ= 0
##$AQ_mod= 1
##$AUNM= <au_zg>
##$AUTOPOS= <>
##$BF1= 200.13
##$BF2= 200.13
##$BF3= 200.13
##$BF4= 200.13
##$BF5= 200.13
##$BF6= 200.13
##$BF7= 200.13
##$BF8= 200.13
##$BYTORDA= 1
##$CFDGTYP= 0
##$CFRGTYP= 5
##$CHEMSTR= <none>
##$CNST= (0..31)
1 1 145 1 1 1 1 1 1 1 1 1 1 1 1 1 1 1 1 1 1 1 1 1 1 1 1 1 1 1 1 1 
##$CPDPRG= <>
##$CPDPRG1= <>
##$CPDPRG2= <>
##$CPDPRG3= <>
##$CPDPRG4= <mlev>
##$CPDPRG5= <mlev>
##$CPDPRG6= <mlev>
##$CPDPRG7= <mlev>
##$CPDPRG8= <mlev>
##$CPDPRGB= <>
##$CPDPRGT= <>
##$D= (0..31)
0 0.7 0 0 0 0 0 0 0 0 0 0.03 0 0 0 0 0 0 0 0 0 0 0 0 0 0 0 0 0 0 0 0 
##$DATE= 1737539515
##$DBL= (0..7)
120 120 120 120 120 120 120 120 
##$DBP= (0..7)
150 150 150 150 150 150 150 150 
##$DBP07= 0
##$DBPNAM0= <>
##$DBPNAM1= <>
##$DBPNAM2= <>
##$DBPNAM3= <>
##$DBPNAM4= <>
##$DBPNAM5= <>
##$DBPNAM6= <>
##$DBPNAM7= <>
##$DBPOAL= (0..7)
0.5 0.5 0.5 0.5 0.5 0.5 0.5 0.5 
##$DBPOFFS= (0..7)
0 0 0 0 0 0 0 0 
##$DE= 6
##$DECBNUC= <off>
##$DECIM= 32
##$DECNUC= <off>
##$DECSTAT= 4
##$DIGMOD= 1
##$DIGTYP= 9
##$DL= (0..7)
0 120 120 120 120 120 120 120 
##$DP= (0..7)
150 150 150 150 150 150 150 150 
##$DP07= 0
##$DPNAME0= <>
##$DPNAME1= <>
##$DPNAME2= <>
##$DPNAME3= <>
##$DPNAME4= <>
##$DPNAME5= <>
##$DPNAME6= <>
##$DPNAME7= <>
##$DPOAL= (0..7)
0.5 0.5 0.5 0.5 0.5 0.5 0.5 0.5 
##$DPOFFS= (0..7)
0 0 0 0 0 0 0 0 
##$DQDMODE= 0
##$DR= 18
##$DS= 0
##$DSLIST= <SSSSSSSSSSSSSSS>
$$ [...]
##$SUBNAM0= <"">
##$SUBNAM1= <"">
##$SUBNAM2= <"">
##$SUBNAM3= <"">
##$SUBNAM4= <"">
##$SUBNAM5= <"">
##$SUBNAM6= <"">
##$SUBNAM7= <"">
##$SUBNAM8= <"">
##$SUBNAM9= <"">
##$SW= 18.0517328524113
##$SWIBOX= (0..15)
0 0 2 0 0 0 0 0 0 0 0 0 0 0 0 0 
##$SW_h= 3612.71676300578
##$TD= 16384
##$TD0= 1
##$TE= 0
##$TE2= 300
##$TE3= 300
##$TEG= 300
##$TL= (0..7)
0 120 120 120 120 120 120 120 
##$TP= (0..7)
150 150 150 150 150 150 150 150 
##$TP07= 0
##$TPNAME0= <>
##$TPNAME1= <>
##$TPNAME2= <>
##$TPNAME3= <>
##$TPNAME4= <>
##$TPNAME5= <>
##$TPNAME6= <>
##$TPNAME7= <>
##$TPOAL= (0..7)
0.5 0.5 0.5 0.5 0.5 0.5 0.5 0.5 
##$TPOFFS= (0..7)
0 0 0 0 0 0 0 0 
##$TUNHIN= 0
##$TUNHOUT= 0
##$TUNXOUT= 0
##$USERA1= <user>
##$USERA2= <user>
##$USERA3= <user>
##$USERA4= <user>
##$USERA5= <user>
##$V9= 5
##$VALIST= <valist>
##$VCLIST= <CCCCCCCCCCCCCCC>
##$VD= 0
##$VDLIST= <DDDDDDDDDDDDDDD>
##$VPLIST= <PPPPPPPPPPPPPPP>
##$VTLIST= <TTTTTTTTTTTTTTT>
##$WBST= 1024
##$WBSW= 4
##$XGAIN= (0..3)
0 0 0 0 
##$XL= 0
##$YL= 0
##$YMAX_a= 275480
##$YMIN_a= -292251
##$ZGOPTNS= <>
##$ZL1= 120
##$ZL2= 120
##$ZL3= 120
##$ZL4= 120
##$ABSF1= 10
##$ABSF2= 0
##$ABSG= 5
##$ABSL= 3
##$ALPHA= 0
##$AQORDER= 0
##$ASSFAC= 0
##$ASSFACI= 0
##$ASSFACX= 0
##$ASSWID= 0
##$AUNMP= <proc_1d>
##$AZFE= 0.1
##$AZFW= 0.1
##$BCFW= 1
##$BC_mod= 2
##$BYTORDP= 1
##$COROFFS= 0
##$CY= -3
##$DATMOD= 1
##$DC= 2
##$DFILT= <>
##$DTYPP= 0
##$F1P= 0
##$F2P= 0
##$FCOR= 0.5
##$FTSIZE= 0
##$FT_mod= 4
##$GAMMA= 1
##$GB= 0.15
##$INTBC= 1
##$INTSCL= 1
##$ISEN= 128
##$LB= 0.25
##$LEV0= 0
##$LPBIN= 0
##$MAXI= 10000
##$MC2= 0
##$MEAN= 0
##$ME_mod= 0
##$MI= 1.114404
##$NCOEF= 0
##$NC_proc= 0
##$NLEV= 6
##$NOISF1= 3.799351
##$NOISF2= 2.8
##$NSP= 1
##$NTH_PI= 0
##$NZP= 0
##$OFFSET= 14.38212
##$PC= 1
##$PHC0= 253.4604
##$PHC1= 10.7922
##$PH_mod= 1
##$PKNL= yes
##$PPARMOD= 0
##$PSCAL= 0
##$PSIGN= 0
##$REVERSE= no
##$SF= 200.129724274929
##$SI= 16384
##$SIGF1= 3
##$SIGF2= 2
##$SINO= 400
##$SIOLD= 16384
##$SREGLST= <1H.CDCl3>
##$SSB= 0
##$STSI= 0
##$STSR= 0
##$SW_p= 3205.1282051282
##$SYMM= 0
##$S_DEV= 0
##$TDeff= 0
##$TDoff= 0
##$TI= <>
##$TILT= no
##$TM1= 0
##$TM2= 0
##$TOPLEV= 0
##$USERP1= <user>
##$USERP2= <user>
##$USERP3= <user>
##$USERP4= <user>
##$USERP5= <user>
##$WDW= 1
##$XDIM= 8192
##$YMAX_p= 0
##$YMIN_p= 0
$$ End of Bruker specific parameters
$$ ---------------------------------
##NTUPLES= NMR FID
##VAR_NAME=  TIME,          FID/REAL,        FID/IMAG
##SYMBOL=    X,             R,               I
##VAR_TYPE=  INDEPENDENT,   DEPENDENT,       DEPENDENT
##VAR_FORM=  AFFN,          ASDF,            ASDF
##VAR_DIM=   8192,          8192,            8192
##UNITS=     SECONDS,       ARBITRARY UNITS, ARBITRARY UNITS
##FACTOR=    0.0002768,     1,               1
##FIRST=     0,             0,               0
##LAST=      2.2672688,     0,               0
##MIN=       0,             -292251,         0
##MAX=       2.2672688,     275480,          0
$$ Real data points
##PAGE= N=1
##DATA TABLE= (X++(R..R)), XYDATA
0@%%%%%%%%%%%%%%%%%qJ6j6J6j6J6k0K8l2L5m2M7n3O1o9Q0q9R8j11J25j39J54
39H1j71J92k13K35k59K84l15L48l83M21m64N11n63O22o87P62q46R43j056J188
59F30j348J545j790K110k543L163m114N725q942J7613q2585k21715K89593K78138
73B75480j93340j91527J94534J49427j89999j55364J37772J21779j16345j44221
83a11804K2269O4957l8259p6855J1399P9504M4779r087K4085Q2210L8518p2122
95E9594o8418N6373Q1932o1836j24016J5564R1493n4965j27595N7191J48394o0119
107A3592j68470N1595J67204m0474j30193Q1315J48480n7980j06062P2809Q6277
118A18093p1098o8305N2096L3142n6849m2922j282j4753j2046J2465L356L457
$$ plain form
0 0 0 0 0 0 0 0 0 0 0 0 0 0 0 0 0 0 0 -8 8 -8 8 -8 8 -12 16 -16 19 -23 24 -29 32 -37 43 -46 52 -59 66 -73 81
39 81 -90 102 -111 124 -135 149 -166 182 -201 220 -244 267 -296 326 -361 401 -445 498 -558 630
59 630 -718 827 -963 1147 -1396 1767 -2347 3378 -5564 12049 -70536 -292251 -2658 275480
73 275480 82140 -109387 85147 234574 44575 -110789 26983 148762 32417 -111804
83 -111804 -89535 -24578 -62837 -139692 -128293 -48789 -4010 -13097 10988 93198 131716 59594
95 59594 -8824 47549 129481 67645 -56371 -40807 50686 -4279 -131874 -74683 73711 13592
107 13592 -154878 -103283 63921 23447 -106746 -25431 123049 65069 -40993 31816 118093
118 118093 46995 -21310 30786 63928 7079 -35843 -37125 -51878 -63924 -51459 -48103 -44646
130d4646L8593K3370k8883J598O6857K5097n9119k2723N5212L989q4620k6359
142e1634P3567J5934q2874j9293Q0228P706r0431m946R5043J2241p3922J3416
154b4965P8109j6879o4512L1258O1458l1498m5289K7457J4832m6397j7085K9474
166d037n323k7360J4358K0137j8145k319L4440Q734j8645J5024K5723k1648l0759
179i820J4448J4445k8488j7822K8477J0562l5643j1714L6788J1181l1631K718
191a6499M2287j828m1384Q100M3105j1520l8904J7962L4466k9270l6951K3916
203f520K3066l2341j9438L0684J0789k8096m81K9118K930j1396J4589J5723j1138
216A7489o036R532p998j8890M626P014k1486j5120J8195Q205k2638k599L3818
$$ plain form
130 -44646 -6053 17317 -11566 -9968 56889 81986 22867 144 55356 59345 -25275 -51634
142 -51634 21933 37867 -45007 -64300 15928 23634 -66797 -71743 23300 35541 -38381 -24965
154 -24965 53144 36265 -28247 3011 64469 32971 -12318 15139 29971 -16426 -33511 -4037
166 -4037 -9360 -36720 -22362 -2225 -20370 -22689 11751 20485 1840 16864 42587 20939 -9820
179 -9820 4628 19073 -9415 -27237 1240 11802 -23841 -35555 1233 12414 -19217 -16499
191 -16499 25788 23960 -17424 -9324 33781 22261 -16643 1319 35785 6515 -30436 -6520
203 -6520 16546 -15795 -35233 -4549 6240 -21856 -22337 6781 9711 -1685 12904 28627 17489
216 17489 11453 20985 12987 -5903 -1277 5737 -15749 -30869 -12674 -4469 -27107 -29706 4112
229D112J0314k5444J226L6069L990l2050K214L5132m228l8991p6K8898j1318l6939
243b7091M455K6111j2011k7431J0732K2757n745r888J5331J6361o19R79O971M83
257B1395k44K257r564j4129K413L674j9859j7842J3764J2481j9021j0198K7168
270g705J7739j9191p651L1559J7600k2700j0044K6086J0303k7921j3648K0177
282A4604M537k8098j4047J6155M222k0418p561J5760P976p100J68J3561J0561
295A0320J920J37K813N918M097p986j2891J013N955j3135j9487N094J4041j1540
309a3731j7751J3644K2274r423j4818J7432K2799j0398j5428J5231J8892j2669
321A6054j8087R765J2898j4026j8214N668R234j0617j4551N112J1030k884o312
$$ plain form
229 4112 14426 -11018 -9792 26277 30267 -1783 431 35563 31335 -7656 -7732 21166 9848 -27091
243 -27091 -22636 3475 -8536 -35967 -25235 -2478 -8223 -18111 -2780 13581 12962 13941 20912 21395
257 21395 21151 23408 13844 -285 2128 5802 -14057 -31899 -18135 -5654 -24675 -34873 -7705
270 -7705 10034 -9157 -16808 14751 32351 9651 -393 25693 35996 8075 -5573 14604
282 14604 19141 -8957 -23004 -6849 -2627 -23045 -30606 -14846 -6870 -13970 -13802 -241 10320
295 10320 12240 12377 15190 21108 25205 17219 4328 5341 11296 -1839 -21326 -16232 -2191 -13731
309 -13731 -31482 -17838 4436 -4987 -19805 -2373 20426 10028 -5400 9831 28723 16054
321 16054 -2033 7732 20630 6604 -11610 -5942 3292 -7325 -21876 -16764 -5734 -8618 -14930
334a4930O248J0857L466j693R83O450M924l140q271j33O522m970j4119j012J1091
349B273k733j6113K168J6444j543j5365M318J8754j217j5235M750J7205k030j4428
363b752K683J3994l313j4640J80J0874l555j2239K43R399m27q290M88P659J548
378A852m209p28M611K453j784l611M06M961R18o386j680P787K524r586l258J0882
394E152K482j1993k849J1558J499j2454k414J1834J656j1109j485J0487J620r344
408e360r14J0074K897p344j355Q787K165o709j528N231j99o371k459J816j069
423b338l844j464J19J903K851j341j308N596N654k671k763P440M703o837n563
438A37O570L219r446n465N094J077q898l897N275K097n235j662P058N242k529
$$ plain form
334 -14930 -8682 2175 5641 3948 4931 11381 16305 13165 4894 4761 11283 6313 -7806 -8818 2273
349 2273 -460 -16573 -14405 2039 496 -14869 -10551 8203 6986 -8249 -3499 13706 11676 -2752
363 -2752 -69 13925 10612 -4028 -3848 7026 3471 -8768 -8525 874 447 -7843 -7355 304 1852
378 1852 -2357 -3085 1526 3979 2195 -1416 -1010 3951 4869 -1517 -3197 4590 7114 -2472 -5730 5152
394 5152 7634 -4359 -7208 4350 5849 -6605 -9019 2815 4471 -6638 -8123 2364 3984 -5360
408 -5360 -6274 3800 6697 -647 -2002 6785 8950 2241 713 5944 5745 -626 -3085 -1269 -2338
423 -2338 -6182 -7646 -7527 -5624 -2773 -4114 -5422 174 5828 3157 394 7834 12537 5700 137
438 137 6707 9926 480 -4985 109 1186 -7712 -11609 -6334 -4237 -9472 -11134 -4076 1166 -1363
453a363k60P706M950l162j480M768J880o706n076N25r49n158l568j441k83K68
469i349K97q61K673O779J470k559M528Q004q70m534L687M096n112n960J808M36
485D533p802n145K056Q11n235k694L810L563l54K26O203P110P43k194L174M376
501A3181j874m338q75k28m097m445k077k281j802j77n18q47L721L139r46R06O566
518C008K995j874K491N018k143m715J548K452n011n371K35n05m860l536J202K069
534f997j83n35K286M679K622l63J192M652J556k209o04J230j637l839j587k08
550E5j766j565j382j699J35J325l72j87K968L256j669l63M927K301l028O59M196
567G791j641m371L34J067k728k960K4Jj079r15k79M13K138M16o41K310K593j158
$$ plain form
453 -1363 -1623 6083 11033 7871 6391 11159 13039 6333 1257 1782 833 -4325 -7893 -9334 -9617 -9349
469 -9349 -9052 -9913 -7240 -461 1009 -1550 2978 10982 10112 5578 9265 13361 8249 2289 4097 4533
485 4533 -3269 -8414 -6358 -5547 -10782 -13476 -9666 -6103 -6457 -6231 -28 7082 7825 5631 8805 13181
501 13181 11307 6969 6094 5866 1769 -2676 -4753 -7034 -8836 -9013 -9531 -10378 -6657 -3518 -4464 -3558 3008
518 3008 6003 4129 6620 11638 9495 4780 6328 8780 3769 -1602 -1367 -1872 -6732 -10268 -9066 -6997
534 -6997 -7180 -7715 -5429 -750 1872 1509 2701 7353 8909 6700 6096 7326 5689 1850 263 55
550 55 -1711 -3276 -4658 -6357 -6222 -4897 -5269 -5456 -2488 768 -901 -1264 3663 5964 2936 3595 7791
567 7791 6150 1779 2113 3180 452 -2508 -2484 -2483 -3562 -4477 -4756 -4343 -2205 -1789 -2430 -120 2473 1315
585A315j372K080J835j288l90R63j16j394n08o00q94M17k40k349o30J500j436
602c107j794K164K543j352j092L329J187j705R82K456M33j621K10L05q73m79q26
619G60q69n49K42j998j679R86K83k148N90K563J86l26J721K047O85R90R66O68
637E118J83o71j176j956k23j119k716j192N16j465k029R98K247q2L61K269K245
654A308L06J176J705J009K25N0p26r40n24k140k208j126p41k307k158Q16M71q54
672f658Q24L040K046J295J915K340J155P22M45r03m41q92j975l319j104j113k261
689d884j333Q9j4p29J325J842J347J303K133J972J589J167Q71n5Q9o06k272j434
707B400j251k219k661j967j12p63q76Q54J680J296J314K034K587J901J037N05
$$ plain form
585 1315 -57 2023 3858 2570 2180 3143 3027 1633 1125 525 -369 48 -192 -2541 -3171 -1671 -3107
602 -3107 -4901 -2737 -194 -1546 -2638 691 1878 173 1155 3611 4044 2423 2633 2938 2065 1586 760
619 760 -109 -658 -416 -2414 -4093 -3107 -2824 -4972 -4382 -1819 -1633 -1959 -238 1809 2494 3484 4450 5118
637 5118 5301 4630 3454 1498 1275 156 -2560 -3752 -3236 -4701 -6730 -5732 -3485 -3567 -3206 -937 1308
654 1308 1614 2790 4495 5504 5729 5779 5053 4113 3589 1449 -759 -1885 -2626 -4933 -7091 -6275 -5804 -6658
672 -6658 -5834 -2794 -748 547 2462 4802 5957 6679 7124 6221 5780 4888 2913 -406 -1510 -2623 -4884
689 -4884 -6217 -6128 -6142 -6871 -5546 -3704 -2357 -1054 1079 3051 4640 5807 6678 6623 6712 6106 3834 2400
707 2400 1149 -1070 -3731 -5698 -5810 -6573 -7449 -6595 -4915 -3619 -2305 -271 2316 4217 5254 5759
723E759M30Q6l06j945j165j156j747k128j146q29j193q06L30J220L18J103J241
740a934K163J359J231J439J114M30k98o07p94q99j860k021r64j046j662q79K23
757e005N65n2P73J585J437J354O85Q15J422M37J4j83K35r24j199r97o71o68j408
776a785p68j16n63o40k04J028P18Q53O67J530J002N02M30N71M03k87p01m17m76
795A747q98j172n60l75n18q39n80P58J46mL0J291Q63k53N83J377N92k5N52N65
815C280l07m59o12m31m82j477j100r8l86p18n35j02O13M60N56Q31J181Q04L79
834A397O06P83N15j99k74l9q2j423r32m40l01j598j425L95j79q29K22R88J037
853a778P99J043J623J265M36K89N25J98o24o05j354q38r48j436j271n54j25q03
$$ plain form
723 5759 6189 6275 5969 4024 2859 1703 -44 -2172 -3318 -4147 -5340 -6146 -5816 -4596 -4278 -3175 -1934
740 -1934 229 1588 2819 4258 5372 5802 5504 4897 4103 3204 1344 -677 -1641 -2687 -4349 -5228 -5005
757 -5005 -4440 -4492 -3719 -2134 -697 657 1342 2157 3579 4016 4030 3847 4082 3158 1959 962 291 -377 -1785
776 -1785 -2553 -2669 -3232 -3872 -4076 -3048 -2330 -1477 -810 720 1722 2224 2654 3225 3628 3341 2640 2223 1747
795 1747 849 -323 -883 -1258 -1776 -2615 -3195 -2437 -2291 -2295 -2265 -974 -111 -364 219 1596 2188 2163 2715 3280
815 3280 2973 2514 1902 1471 989 -488 -1588 -1686 -2072 -2790 -3325 -3427 -2814 -2354 -1798 -967 214 1018 1397
834 1397 2003 2786 3301 3102 2828 2789 2707 1284 352 -88 -389 -1987 -3412 -3017 -3196 -4025 -3803 -2815 -1778
853 -1778 -979 64 1687 2952 3388 3677 4202 4400 3776 3171 1817 979 31 -1405 -2676 -3230 -3355 -4158
871d158l95M67J243K81Q94J465J786O22O07R85J101j82q90m36l71j304k039j251
889a575n06j330j715K67K71M44L0J424J591J339J101J590J009M42J98Rj24j085
907C380p80j611j424p80j421j385r44L03L78l47O19J764J555M10J256K220J080
924D273k62N04Q97p29j691q19o61j880j667q77o23p84m22j8R70R13M40J331J655
943E50J074P17J274M16K03j4l6j381j121l82j342j761q30mj313p78R71J126o02
962c233K33K985P94r6R91K046K49p89K59M94q44j784n49n59j352j152l45k70k61
981c183j20K9P28Q26Q99O75J060O21N22Q90K11n57K21M73j632r87J38q74k047
1000b107m0P44r27j553J205J398j222K93K167J046n81M09J773P9p89M31N58j008
$$ plain form
871 -4158 -4553 -4086 -2843 -2562 -1668 -203 1583 2205 2812 3797 4898 4716 3826 3390 3019 1715 -324 -1575
889 -1575 -2081 -3411 -5126 -4859 -4588 -4144 -4114 -2690 -1099 240 1341 2931 3940 4382 4580 4589 4465 3380
907 3380 2600 989 -435 -1215 -2636 -4021 -4965 -4662 -4284 -4631 -4012 -2248 -693 -283 973 3193 4273
924 4273 4011 4515 5412 4683 2992 2173 1512 -368 -2035 -2912 -3535 -4319 -4741 -4759 -3789 -2876 -2436 -1105 550
943 550 1624 2341 3615 4031 4234 4220 4184 2803 1682 1300 -42 -1803 -2633 -2637 -3950 -4728 -3757 -2631 -3233
962 -3233 -3000 -15 779 683 1674 3720 3969 3180 3439 3933 3089 1305 756 197 -1155 -2307 -2652 -2922 -3183
981 -3183 -3303 -3274 -2546 -1720 -821 -146 914 1535 2057 2947 3158 2601 2822 3295 1663 676 814 -60 -2107
1000 -2107 -2147 -1403 -2330 -3883 -2678 -1280 -2502 -2209 -42 1004 423 832 2605 2684 1895 2326 2884 1876
1018A876n47l41k14j453k89m96p99k76j00J97p0P09M51N48Q10N35N66J315n0m88
1038A884Q34N31j610p37P97q05k204k31P48j225j585J155J108j198k77J816J091
1055I2o56J318J742l32k98J059N22q66o07j44q18j339j97o21j112o60m0l26J52
1074c131Q25M83Q55Q44O00Q28J304J90J3O19K07j300r26K78o37k285q40M65j298
1093b906j819J422J034j035L78K145O53j22J534K188n76j02J077j13j214o0m11
1110B073j823j173n40n16j423k30M96k07L19R44Q51R00Q19J222N74J225K72n80
1128C203P14l01j668j540N45r61k324n04L40j156o48Q87J360n99O80J727R69R3
1146H17J746J123o44J6O23p92j246m93k84j527j411J23m47j007o9O58J64R5J265
$$ plain form
1018 1876 1329 988 774 -679 -968 -1464 -2263 -2539 -2639 -2442 -2512 -1803 -1352 -804 6 541 1107 2422 2372 1884
1038 1884 2718 3249 1639 902 1699 894 -1310 -1541 -793 -2018 -3603 -2448 -1340 -2538 -2815 -999 92
1055 92 -564 754 2496 2164 1866 2925 3447 2581 1974 1830 1012 -327 -524 -1145 -2257 -2917 -2957 -3283 -3131
1074 -3131 -2306 -1823 -968 -124 476 1304 2608 2798 2811 3430 3637 2337 1411 1689 1052 -1233 -2073 -1608 -2906
1093 -2906 -4725 -3303 -2269 -3304 -2926 -781 -128 -250 1284 3472 2896 2794 3871 3758 2544 2484 2073
1110 2073 250 -923 -1463 -1979 -3402 -3632 -3136 -3343 -3024 -2080 -1229 -329 490 1712 2286 3511 3783 3203
1128 3203 3917 3616 1948 408 953 -8 -2332 -2836 -2496 -3652 -4300 -3413 -2053 -2652 -1972 -245 724 817
1146 817 2563 3686 3042 3058 3681 2889 1643 1150 866 -661 -2072 -1949 -2396 -3403 -3472 -2814 -2650 -2555 -1290
1165a290J178M47Q20R09O44O05r1p85O34m03j408j221j9p36j432o84N40j011J9
1184c284P09J007M4N66J616K89J44J085R24q28Q7M00o08j247j83k94j270q63p2
1203a778j81n59l50N08M59M17M05P98O84P13J97P93M38r8m45J18Qr15j173j24
1223h5l30r05q79N07m42k32K86L97L76N48O00P48K50P89O12n6j53M99p4j245n61
1244F50N0p08j073j84l47n11m95L66L21K38L82N91P30Q13M10K60R77j10m68K10
1264B102P3o17p16l39p29r65p67K35n32q20O45N82J16N56P46N74N90R14P11m9
1284B310K11m34J29n35n98n17o48j169l58o81M1n62K68%Q45J66P72J013J015J03
1304A371N40O70J34n62J90j47p31p01o95n76j133n98l68mm46O63N66M03M29Q93
$$ plain form
1165 -1290 -112 335 1155 2064 2708 3313 3222 2437 3071 2668 1260 39 20 -716 -2148 -2832 -2292 -3303 -3284
1184 -3284 -2575 -1568 -1524 -958 658 947 1091 2176 3100 2272 2359 2759 2151 904 721 427 -843 -1706 -1778
1203 -1778 -1959 -2518 -2868 -2360 -1901 -1484 -1079 -281 403 1116 1313 2106 2544 2446 2001 2119 2127 1212 39 -85
1223 -85 -415 -1320 -2199 -1692 -2134 -2366 -2080 -1683 -1307 -759 -159 589 839 1628 2240 2184 2031 2530 2456 1211 650
1244 650 700 -8 -1081 -1265 -1612 -2123 -2618 -2252 -1931 -1693 -1311 -720 10 823 1233 1493 2470 2360 1892 2102
1264 2102 2175 1558 842 503 -226 -1191 -1958 -1723 -2255 -3075 -2430 -1848 -1732 -1176 -430 144 734 1648 2359 2310
1284 2310 2521 2087 2216 1681 1083 566 -82 -1251 -1609 -2290 -2249 -2811 -2543 -2543 -1698 -1532 -760 253 1268 1371
1304 1371 1911 2581 2715 2153 2343 2196 1465 764 69 -507 -1640 -2238 -2606 -2610 -3056 -2393 -1827 -1424 -995 -102
1324a02R37M64O94P04J16N2n26j80r18l51j290m30k65j075m50M2l35j18R78N80
1344a473M67R31P83Q30M31L33Q41j60o44k96l48j054m64n53r82o40n21j62J24
1363b557j8N22O16O33N72Q41Q62%N76P33j64m5q07j09n07j194j13q60o76n47l15
1384b557K0k28M15R08O38K74Q04P90R19j28R5L70j76l23k69k75r73r21P5q75p29
1405b146j98M31j28l10R01P22J52M54P79N25L67R9M82j8l51k91p1q40m82m16n82
1426i21m36k95n72J94Q4K70N72L59N75K13Q92K00O03K18L43k48m42j64k85o06
1446E54p84j7n47r16k98J2lk5M01N75L08N43P05L75J02N12N90o8l20j32j14m55
1468I98q58m50m19m13n38m00L09l29M55pO36O63N72P25J82M99K73L24j48m78N2
$$ plain form
1324 -102 835 1299 1993 2697 2813 2865 2339 2159 1241 890 -400 -830 -1095 -2170 -2620 -2578 -2913 -3031 -2053 -1473
1344 -1473 -1006 -75 708 1538 1969 2302 3143 2983 2339 2043 1695 641 177 -376 -1358 -1998 -2519 -2681 -2557
1363 -2557 -2575 -2053 -1437 -804 -232 609 1471 1471 2047 2780 2616 2571 1764 1655 1148 -46 -159 -1019 -1695 -2242 -2557
1384 -2557 -2537 -2765 -2350 -1442 -804 -530 274 1064 1983 1855 1950 2320 2144 1821 1552 1277 304 -617 -542 -1417 -2146
1405 -2146 -2344 -1913 -2041 -2351 -1450 -728 -576 -122 657 1182 1549 1648 2130 2112 1761 1470 1399 559 77 -339 -921
1426 -921 -1357 -1652 -2224 -2030 -1946 -1676 -1104 -745 -170 43 935 1135 1738 1956 2299 2051 1609 1445 1160 554
1446 554 -230 -247 -794 -1710 -2008 -1996 -1999 -2024 -1623 -1048 -740 -197 508 883 985 1497 2087 2019 1699 1567 1453 998
1468 998 140 -310 -729 -1142 -1680 -2080 -1771 -2100 -1645 -1652 -1016 -353 219 944 1126 1625 1898 2222 2074 1596 1648
1489A648j38r18n77l95l47q56m74M55n01NN35P57j13O87P25O35J99M90N08k10
1509B115l66J54m82p74l56n32o36m89m35j93n53N25L74j21N51P95O23O72N93K59
1529A724l3L42J88q65L67n82m50q36l60p55o13j57J95k14o3P67K82L80M99R24
1549G40N47j11J154j44j54J56m00o38l57q05n01o24n14j74j62l07M99M61m6P25
1569f55O70K97P47N83p8M28J9l2j70o17j93r62n44l99q03l0j04j02O7L37L39N47
1591f55L57M98Q85L99K09M20o3k04l64o8o64m34k90p05q58N4j64k45J7M05Q6M68
1613i16O74J35N04P75M82K7K22N2l77k62n05l94j44p86m76l44n73Q4L21l63M55
1634a409M77M61L04N34L08O46R5N07j42k34J6o23m32k61n18o39j79r3l51k51K20
$$ plain form
1489 1648 1510 592 15 -380 -727 -1583 -2057 -1602 -2103 -2098 -1563 -806 -919 -232 493 1128 1327 1817 2325 2115
1509 2115 1749 1903 1421 647 291 -241 -877 -1366 -1801 -1994 -2547 -2022 -1648 -1769 -1218 -423 200 872 1465 1724
1529 1724 1691 2033 2221 1356 1723 1141 691 -145 -505 -1260 -1873 -2030 -1835 -2049 -2112 -1345 -1063 -683 -184 740
1549 740 1287 1176 2330 2186 2032 2188 1788 1150 793 -12 -513 -1137 -1651 -1825 -1987 -2294 -1795 -1334 -1380 -655
1569 -655 15 312 1059 1642 1564 1992 2011 1979 1809 1192 999 37 -507 -906 -1709 -1739 -1843 -1945 -1878 -1541 -1202 -655
1591 -655 -298 200 1085 1484 1693 2113 2050 1846 1482 1414 750 316 26 -679 -1537 -1483 -1647 -1892 -1875 -1470 -1384 -916
1613 -916 -242 -107 397 1172 1654 1681 1903 1955 1578 1316 811 417 273 -513 -989 -1333 -1906 -1822 -1501 -1864 -1409
1634 -1409 -932 -471 -167 367 675 1321 1416 1923 1781 1547 1563 940 508 247 -271 -910 -1089 -1182 -1533 -1784 -1564
1655a564J69J21K67O95L70J90O62L02M35j92J62k62n24Mj46p22n65l00p0m97j62
1676a627J06K1L16N54J02M87L7P05L31J84N02p1o7r8m02l78n42k13m89o36n3m50
1698a681l46P47k2J47P1P26O16K59O47M03J71n9K14j76o07j29o66n03l95k55k56
1719a094l04p1m77M16J20L96L53K78O47M02L15N87J82j89J2K8k24n31n44l97p79
1740h74n02J95m16k90J13L39M5N03Q20J60L85O53K19M65Q4j39j37k26o14l61n39
1761a17m86l25k05n01j78P3J96L05O14J52P03R1O41J71K05L07J79l91l36j81m54
1782D63m16p09l52m17n3j20q6j17N49j7Q73K61N43M19J10N12J20L64k15j21n99
1803I92l93n24l66k89o84k55q4p1Q6N04K62K63L91N36N02Q5M26J06J78j92l98
$$ plain form
1655 -1564 -1395 -1274 -1007 -312 58 248 910 1212 1647 1455 1617 1355 831 835 689 -33 -598 -898 -968 -1465 -1627
1676 -1627 -1521 -1500 -1184 -630 -528 -41 -4 701 1032 1216 1718 1647 1580 1482 1080 702 160 -53 -542 -1178 -1231 -1681
1698 -1681 -2027 -1280 -1302 -1155 -1084 -358 258 517 1164 1567 1738 1679 1893 1717 1110 981 315 -188 -583 -838 -1094
1719 -1094 -1398 -1469 -1946 -1530 -1410 -1014 -661 -383 264 666 981 1568 1750 1561 1573 1601 1377 846 302 -95 -874
1740 -874 -1376 -1181 -1597 -1887 -1774 -1435 -1390 -887 -67 93 478 1131 1350 1815 1899 1760 1623 1397 783 422 -117
1761 -117 -603 -928 -1133 -1634 -1812 -1739 -1543 -1238 -624 -472 231 322 963 1134 1339 1646 1825 1434 1098 917 463
1782 463 47 -662 -1014 -1431 -1484 -1604 -1690 -1807 -1258 -1275 -402 -141 402 821 931 1443 1563 1927 1712 1591 992
1803 992 599 75 -291 -580 -1264 -1519 -1603 -1674 -1588 -1084 -822 -559 -168 368 870 955 1381 1487 1665 1473 1075
1824A075O1o77k71k74m46p49k63K19j34M7qL50L92L26M16L79K25L85J74J62O6
1845A455J68m82k31o73k23k87k63n51J13j74p1q3L09O6M56L85K93L72K13M48K05
1866A445J14l19j13j79k74m60m40l60l21k96K35k69k8R7K30R6M02N34J27K77L25
1887H23L91NK4L33l54p02J31p52n3l52m50j39m09L88j63N4L98M52J54Q6Q42L56
1909A063K58L78m36o8qJ1n98k49n88oo59k05l57p0J48K04K83M40j44P45R6M75
1931G13J32L29pJ37k72j2M2n10n36m8o58l31l57j10K68k7j36P20J11K32M59L89
1953E28L29J64M68k83J26rl02m55n28k20l16m60p9k89n1j46L98J72M99K91L73
1974B10K86R1P93R5K3m6r1j56o72k87k75n74k79J07m77Mp4L4k32P88L94K23M88
$$ plain form
1824 1075 1136 459 188 -86 -532 -1281 -1544 -1325 -1459 -1412 -1420 -1070 -678 -352 64 443 668 1053 1227 1389 1455
1845 1455 1623 1141 910 237 14 -273 -536 -1087 -974 -1148 -1219 -1302 -993 -927 -471 -86 207 579 792 1240 1445
1866 1445 1559 1240 1127 948 674 214 -226 -586 -907 -1203 -968 -1237 -1265 -1168 -938 -842 -440 94 221 498 823
1887 823 1214 1219 1243 1576 1222 520 651 -101 -154 -506 -956 -1095 -1504 -1116 -1279 -1225 -827 -375 -221 -135 707 1063
1909 1063 1321 1699 1263 1195 1187 1198 600 351 -237 -243 -902 -1107 -1464 -1534 -1386 -1182 -899 -459 -603 142 238 713
1931 713 845 1174 1167 1304 1032 1020 1062 552 16 -32 -690 -1021 -1378 -1488 -1220 -1247 -1383 -663 -552 -320 139 528
1953 528 857 1021 1489 1206 1332 1323 1021 566 38 -182 -498 -958 -1037 -1326 -1377 -1523 -1125 -953 -454 -163 210
1974 210 496 587 1380 1475 1498 1452 1361 1205 533 246 -29 -603 -882 -775 -1252 -1248 -1322 -1288 -1520 -732 -338 -115 373
1997C73O09J55J55L30j28j94l17p0n59k40m95k43l99k00qm1j28J81K49P10K5N65
2019C30K64M19K72J03R0l49R1m85l02j45n19k17n35j46r5l5j8J90Q7L48M39M48
2041B35J43N72J82L0K20k80K43m26j77k91o09m23l97j43j7k37K01J0M26L85j87
2062e40N07M27J17N42K2J42K2j66l34M6k18m87k37m96k30J34n02l0M08l05N56
2083f22K11J94M03K22K68L82Q2J28k62q2J6k51m14l72m16j64j68k67P0r9M8O08
2105d85K8m2O43J86J9L38M22l6k9j00M2m85j59k7m96l65j72j52j5n1j34m1M34
2128f77L30Q2N43QL08K54M20K9k91j73L92o66k25l49m21Q2m51j01j41k61J69K34
2150i05N75J77J39J44L79j14P39k30L25l19j14k61P8l53o98m03O8l49j49j48J59
$$ plain form
1997 373 982 1137 1292 1622 1494 1300 983 913 354 114 -381 -624 -1023 -1223 -1231 -1272 -1400 -1219 -970 -260 -235 330
2019 330 594 1013 1285 1388 1478 1129 1220 735 433 288 -231 -448 -983 -1129 -1224 -1259 -1277 -1087 -1000 -652 -213 235
2041 235 378 950 1132 1162 1382 1102 1345 919 742 451 -158 -581 -978 -1121 -1138 -1375 -1174 -1164 -738 -353 -540
2062 -540 -33 394 511 1053 1075 1217 1239 1073 739 785 567 80 -157 -653 -883 -749 -1251 -1281 -873 -1178 -622
2083 -622 -411 -217 186 408 676 1058 1140 1268 1006 924 940 689 275 -97 -513 -677 -845 -1112 -1042 -1141 -1093 -485
2105 -485 -457 -499 144 330 349 687 1109 1073 1044 944 986 501 342 315 -181 -546 -718 -870 -885 -936 -1070 -1111 -677
2128 -677 -347 -265 278 286 594 848 1268 1297 1006 833 1225 559 334 -15 -436 -354 -805 -906 -1047 -1308 -1139 -905
2150 -905 -330 -153 -14 130 509 395 1134 904 1229 910 796 535 613 260 -438 -841 -773 -1122 -1271 -1419 -1260
2171a260K16K56L95J77J71K00N46K07J60K6M17p52m6m07j95o5m46l00k05k54j56
2192a315Q8J22L02O9M7Q33p7M20L81j1M78m25M39l83l58l87k37k4q12Lk85M3J05
2215i84k14K53L07K96M64J81K18M23J08K89k74n6N5k97Kr34m47J29p7n22o9o7
2237a216r3K44K09L62L38M75K67J47j25N38j09K31j22m16k65k76m15m83l02kk91
2258a304K46k15M66rJ97K96L25L91K33N62n1ok40J58r1k62l69k51q7m67k29k26
2280i33k32J89K3m6K65M22K99M19J41K14J17kJ70j01l16k06J11o28j06j24k67
2301e91l98n7K49m02K52L81J44QM93K62N50k89L65J4K6M7l12o9l65k55l52j01
2323d00o44J57J58l48J00L65l9M99L55K31n2L84K5L78k5K4m29j7k69l31k38k37
$$ plain form
2171 -1260 -1044 -788 -393 -216 -45 155 701 908 1068 1094 1511 759 713 306 111 46 -400 -700 -905 -1159 -1315
2192 -1315 -1227 -1105 -803 -734 -687 146 69 489 870 859 1337 912 1351 968 610 223 -14 -38 -850 -847 -1132 -1089 -984
2215 -984 -1198 -945 -638 -342 122 303 521 944 1052 1341 1067 1011 1066 769 771 -163 -610 -481 -558 -1080 -1149 -1216
2237 -1216 -1309 -1065 -856 -494 -156 319 586 733 608 1146 1037 1268 1146 730 465 189 -226 -709 -1011 -1013 -1304
2258 -1304 -1058 -1273 -807 -816 -619 -323 2 393 626 1188 1137 1131 891 1049 958 696 327 76 -11 -478 -707 -933
2280 -933 -1165 -976 -953 -999 -734 -312 -13 406 547 761 878 876 1046 945 629 423 534 -94 -200 -324 -591
2301 -591 -989 -1046 -797 -1199 -947 -566 -422 -414 79 341 891 602 967 981 1007 1054 742 673 308 53 -299 -400
2323 -400 -1044 -887 -729 -1077 -977 -612 -651 -152 203 434 382 766 791 1169 1144 1168 739 722 453 122 -116 -353
2345c53m13j72k71J26J9K01J95N21p9J85K20K5P45M9K43k12j59Ok91m04k2k34
2367g5q08K20k53M7l8J30K36K10j9M17L30J22J28J15j55M07M7m13J6j64n96l08
2389d04j11R5k70k10j35p4R0L42M27K21K96L43J59l5K06L17l83MJ02l07m52k39
2411a8j54k67m52j70oJ68J90k41M27K12L67K24LO31J00p2j9k93Oj89l48j96j07
2434b04m15J8l13J72j6k08J66K62R4L86L16J89K39J05K90j88P4q9j05k71n35k12
2456b45j61k04Pm2j39p9K05p2J73O35J77M08P5J71O2L1j91j52N5k54k88k01k12
2479b41k17k73l8j94M9j22L72J72L63J71J45L05K83J16P5P8o1l69l94K97k52o41
2501c76j79jO1l58N2K6K65K4K9M73o5K51N34j0Q0J69q4l25M4j92m49j49R1k80
$$ plain form
2345 -353 -766 -938 -1209 -1083 -1064 -863 -668 -147 -226 -41 179 204 949 998 1241 1029 870 876 585 181 159 -75
2367 -75 -883 -663 -916 -869 -907 -777 -541 -331 -350 67 397 519 647 762 607 1014 1061 648 664 500 -96 -404
2389 -404 -515 -420 -690 -900 -1035 -1109 -1019 -677 -250 -29 267 610 769 734 940 1257 874 878 980 673 221 -18
2411 -18 -172 -439 -891 -1061 -1067 -899 -709 -950 -523 -311 56 280 283 914 1014 942 923 630 636 447 99 -97 -204
2434 -204 -619 -601 -914 -742 -758 -966 -800 -538 -444 -58 258 447 686 791 1081 893 967 878 773 502 -33 -245
2456 -245 -406 -610 -603 -645 -784 -863 -658 -730 -557 78 255 663 738 909 971 1002 811 659 714 460 172 -29 -241
2479 -241 -458 -731 -769 -963 -914 -1036 -664 -492 -129 42 187 492 775 891 966 1044 983 614 220 517 265 -376
2501 -376 -555 -556 -495 -853 -801 -775 -510 -486 -457 16 -49 202 736 726 806 975 891 566 610 418 -31 -180 -89 -369
2525c69l18K21n83Q2J40K31K29K50J07L39J56K39L21j74l2J43l09m4m57l80l45
2546e53j6j70m2m9J06n3O4J91R9J55L00O01N5o9J23M9j07k93L9m31J4l17j7k69
2570e90p8j6j3l70N09L9K04K41j86M05L33J67O6o2R5J73l86J5n93Qn5l27m21K26
2594f16jq7j35K71J59k60M11L98K85J19L32K8k49J98j6k31m54R8m59l7l45k94
2616h85J29J44j53K37j7K48K27P5M92j05L55O4j77J93o1m4k44l10J21l43k45k68
2638e67j42o0K3n1O7L16J52L15k1O45l21L87J64k9O9l33R5j75n03k71j4k56j94
2661g04k30J20J90l5J32K13Q9K85J48L84J39J37j60K21j51m20Q7l27j39n70J83
2682d08j57l06K14k07L07j36K22L53K34L35m1rL11L16k62j42q1j83k52j05k27
$$ plain form
2525 -369 -687 -466 -1049 -967 -827 -596 -367 -117 -10 329 485 724 1045 871 839 982 673 629 172 -208 -553
2546 -553 -569 -739 -781 -830 -724 -777 -713 -522 -423 -268 32 633 688 619 742 791 684 391 430 -1 13 -304 -321 -590
2570 -590 -668 -684 -697 -1067 -558 -519 -315 -74 -260 145 478 645 711 649 744 917 531 546 -47 -39 -94 -421 -842 -616
2594 -616 -617 -704 -839 -568 -409 -669 -258 140 425 544 876 904 655 853 837 606 152 250 -209 -246 -591 -885
2616 -885 -756 -612 -765 -528 -545 -297 -70 5 497 392 747 811 634 827 766 722 478 168 289 -54 -299 -567
2638 -567 -709 -769 -746 -797 -730 -414 -262 53 32 677 356 743 907 878 947 614 709 534 31 -240 -254 -510 -704
2661 -704 -934 -814 -624 -659 -527 -314 -225 60 208 592 731 868 708 929 778 358 445 118 -21 -591 -408
2682 -408 -565 -871 -657 -864 -557 -693 -471 -118 116 451 410 401 712 1028 766 624 543 360 108 3 -224
2703b24J0l21k89MK9l2L91q2K98N8M32J89K21J02j4M2j32k99J35l41j70j91k83
2726d67j14l07K11qO0J87P5qK07M37PN27L8j70K15k53k17J97k90j09k88j54k52
2749d76k71J2J65k09N3K67J1R0M14L84K1L13j14j54K75j74J61m53M5j30k90k30
2771b90l39O2l01K79n0K29J01Q9L16J52l7L84m9j24L20O5l21l0O8k38m07p4j82
2794c77m22J78j04j61P2R7N74N9N21m50M02N78l04L1qp5N5k71l04j26j05k04j28
2817d72l11j02M6J90o1L08K05J25L28r3M29P3j01J62r7j58R5k71k99j64j71j1
2839c50j82k50P9j24J75O1L35K56K66o6J54L05j24K29k88M86l13k00l52j25m2
2860g0k46j91l40J83J90r3k51N34J95K86L7N1K14L54k88K29j62M6j98l50K26m14
$$ plain form
2703 -224 -214 -535 -824 -820 -791 -823 -432 -514 -216 -158 274 463 684 786 772 814 682 383 518 177 7 -184 -467
2726 -467 -581 -888 -677 -685 -625 -438 -363 -371 -164 273 280 807 845 675 890 637 420 617 327 218 -70 -224 -476
2749 -476 -747 -735 -570 -779 -726 -459 -448 -358 56 440 461 774 660 506 781 607 768 315 360 230 -60 -290
2771 -290 -629 -567 -868 -589 -639 -410 -309 -220 96 248 211 595 546 422 742 807 486 456 524 286 -121 -195 -377
2794 -377 -799 -621 -725 -886 -814 -717 -143 -84 437 -13 389 967 663 694 686 611 666 395 91 -35 -140 -344 -472
2817 -472 -783 -885 -839 -649 -710 -402 -197 -72 256 163 592 665 564 726 629 471 566 295 -4 -168 -339 -350
2839 -350 -532 -782 -703 -827 -652 -591 -256 0 266 200 354 659 535 764 476 962 649 449 97 -28 -70
2860 -70 -316 -507 -847 -664 -474 -567 -818 -284 -89 197 234 285 499 853 565 794 632 678 480 130 356 -58
2882e8k53j92m09L61k23J53J85Q0J3K84J40J71K86J99Q5k59o6K8p7j03j58l80
2904a93j16P2l57J77k92r4L40J48n1K26K92J31J01K81j2K7j92K20j34m50k59J05
2926c0m48K26l72j21r9j97M63n9M69J24L1k4M00J89j71L7K14k19j14J10k27k89
2948a07P4k27n6l02q4J63O8k83K53L42J03J89O5jM72n4J31j96j77J82k03l02m0
2971A0j36n52j14J32J0j5M3K7N22M2J78p0L19L55L8k15R9O7k67q4q1m7l31k18
2995b88j28N7q9J6k76Q0K51O3K52L32R4K02j43J93K84j5m56O0j78J16o72O8j06
3018b83l22L9J80m12J65J40J74L71O2M33j91J54L80j37k65J30j89O7l30m5n72
3039d51J49n35M33p2l6k6K0L09j6L48J58L3QL40L3o1J77k32l16j76P9l98r3j43
$$ plain form
2882 -58 -311 -503 -912 -551 -774 -621 -436 -356 -343 -59 81 252 538 737 822 563 497 525 448 345 187 -193
2904 -193 -309 -237 -594 -417 -709 -803 -463 -315 -366 -140 152 283 384 665 653 680 488 708 574 124 -135 -30
2926 -30 -478 -252 -624 -745 -844 -1041 -578 -637 -168 -44 -13 -37 363 552 381 418 632 413 299 409 182 -107
2948 -107 -33 -260 -316 -618 -702 -539 -471 -754 -501 -159 -56 133 198 197 669 615 746 550 373 555 352 50 10
2971 10 -126 -678 -792 -660 -650 -665 -622 -595 -73 -31 147 77 396 751 789 574 673 740 473 389 308 261 -70 -288
2995 -288 -416 -359 -448 -432 -708 -628 -377 -314 -62 270 364 566 423 616 900 885 429 489 311 427 -245 -177 -283
3018 -283 -605 -566 -386 -798 -633 -493 -319 52 114 547 356 510 890 753 488 618 429 496 166 121 -451
3039 -451 -302 -837 -404 -476 -512 -538 -518 -209 -225 123 281 314 322 662 695 634 811 579 263 87 166 -232 -325 -468
3063d68n5k95L47J13k7l8K36K07O7l2M24K25j51O0m6k40L16l01j25m2o59K30k73
3086e27r1J3m0K95p1MK37K54R6J81R6K74k03P8m4k54O0k58j79j19j59j05m3j90
3110f95L0J58nJ6O34j65N07j29k3M05l17L09l68jj58J80m40j96j33j56J8Ql01
3133h22M27J01k71Q3L89L90j34K55LJ9J37k1j37J36j34p0k98l67L4k45P3J57j48
3156d43N4r7MN83l29M10J74Oj5Q6K81m63K73k19q9K3j64m24j5m2j04j29K49K69
3180a21j88L45j46L28M4K58ko3N9j38R0j8k24Kk80l18J75k24l14J41J32j47K40
3203c69Q6J4K08K84J09p1oJ11K92k79m0r5J18o18J45j10j2m27L3K47j26J89k8
3226c45r4M45l2K99K37j26J62l37K21J37K07n85l42j01Q8m31J69k91J84jK99k09
$$ plain form
3063 -468 -523 -818 -471 -358 -385 -423 -187 20 87 55 479 704 553 613 567 327 643 342 217 175 -484 -254 -527
3086 -527 -618 -605 -645 -350 -421 -417 -180 74 170 351 447 721 518 596 552 298 358 100 -79 -198 -357 -462 -505 -695
3110 -695 -665 -507 -512 -496 138 -27 480 351 328 733 416 725 357 356 198 378 -62 -258 -391 -547 -529 -521 -822
3133 -822 -395 -294 -565 -482 -93 297 163 418 421 440 577 556 419 555 421 351 53 -314 -280 -525 -452 -295 -443
3156 -443 -389 -486 -482 101 -228 182 356 362 347 433 714 251 524 305 216 239 75 -349 -364 -406 -510 -639 -390 -121
3180 -121 -309 36 -110 218 262 520 518 455 514 376 466 448 224 226 -54 -372 -197 -421 -735 -594 -462 -609 -369
3203 -369 -283 -269 -61 223 332 261 255 366 658 379 339 244 362 -256 -111 -221 -233 -660 -627 -380 -506 -317 -345
3226 -345 -439 6 -26 273 510 384 546 209 430 567 774 189 -153 -254 -166 -597 -428 -719 -535 -536 -237 -446
3248d46j1M44Q3J93o9L2M42j73J03k09J81k36k54k75J25j81j30j74J6R1M3K34
3270a71m62K35K07L45L54j01N4J32n6J01O0m98j89r2J21n13J58l16k1L05j31P4
3292d04nj2K45L85o2K56l01N49k37j81L56M8n66lj61P2l31l01K65p1j06O4J86
3315c15K30j94M52j65J31J31L22o1pk61K6n0j38N0l16k0k40l2r6j85L20j9K88
3338a49J39j91M29J54r0r2M5N5J26q1k4k81O1q7k97j92J16M8j45j88J88Q5K78
3361i3o3j7J61J27K51M3m3j29K70r6l17J31k09k73l4l9k02L19m72n6L4M01K43
3384f3q0K73J35J55k1Q7k19L98l14k10J05l09l7j09M5j50j47p2L37l72K36N2K04
3407g6J71p2K92R1j6l8J33j32K71m15J56k80m82K63k47j03N7j71K44N3R7N9J35
$$ plain form
3248 -446 -457 -13 70 263 194 226 668 495 598 389 570 334 80 -195 -70 -251 -381 -555 -539 -448 -405 -171
3270 -171 -633 -398 -191 154 508 407 461 593 537 638 698 200 11 -81 40 -473 -315 -631 -652 -347 -478 -404
3292 -404 -409 -421 -176 209 147 403 102 651 414 233 589 637 71 68 -93 -21 -352 -653 -388 -459 -565 -501 -315
3315 -315 -85 -279 173 8 139 270 592 531 524 263 289 239 101 151 -165 -185 -425 -457 -553 -738 -418 -437 -149
3338 -149 -10 -201 228 382 292 200 245 300 426 345 321 40 101 14 -283 -475 -359 -311 -456 -644 -456 -371 -93
3361 -93 -156 -173 -12 115 366 409 366 237 507 411 94 225 16 -257 -291 -330 -532 -213 -685 -741 -707 -306 -63
3384 -63 -143 130 265 420 399 486 267 665 351 141 246 -63 -100 -209 -164 -314 -461 -533 -196 -568 -332 -280 -76
3407 -76 95 23 315 406 390 352 485 353 624 209 365 85 -397 -134 -381 -484 -427 -598 -354 -301 -204 -145 -10
3430a0K6P3O33l51L2k0%J34m12O7k57K35k10k58k49K08r1o7L37Kj04J13K61K5
3454A17Q7J50L18j3N9m08K7k94J99k58l27K91j99j90l2r3J79J32K61M2k7L4J89
3477B44R5k4K63K6l45l6J33j75j23l3m30J59O6k21k18q8N33l43L15J30J45L12
3499C85j51J02L00j00j36M4J98k58m04j23M0j53k13j20R6k4J35J38J01J12M29
3520C98k96K37l2K76M0o3l38K97k62k95Q9J59m16j35j31K64m10J82L22p1j25P1
3542b39K65K33r5M35j48j83r0J20j48j49J50l62n3K8o7m04K91Q3J08p9o2M35O9
3565A38K15J77j41J49k16K57k19k53j6J15j16j77r1j51j12j4m0K92n21O48j31
3586b07K55K39l35L84P1k07K23l52J48r3k03J74n29L8J54j57j58K28k0j1K1L63
$$ plain form
3430 -10 16 89 722 371 403 383 383 517 105 172 -85 150 -60 -318 -567 -359 -450 -517 -180 -178 -282 -169 92 117
3454 117 204 354 672 659 718 310 337 43 242 -16 -343 -52 -251 -441 -473 -566 -387 -255 6 48 21 55 244
3477 244 339 315 578 604 259 223 356 181 58 25 -405 -246 -180 -401 -619 -707 -174 -517 -202 -72 73 385
3499 385 234 336 636 536 400 444 642 384 -20 -143 -103 -256 -469 -589 -493 -517 -382 -244 -143 -31 398
3520 398 102 339 307 583 623 560 222 519 257 -38 51 210 -206 -341 -472 -208 -618 -436 -114 -185 -310 -239
3542 -239 26 259 164 599 451 268 178 298 150 1 151 -211 -264 -236 -303 -707 -416 -333 -225 -304 -366 69 138
3565 138 353 530 389 538 322 579 360 107 91 206 90 -87 -178 -329 -441 -455 -495 -203 -724 -76 -207
3586 -207 48 287 -48 336 407 200 423 71 219 126 -77 97 -432 -394 -240 -397 -555 -327 -347 -358 -337 26
3608B6q7J81M1qK27k10K03m5k80J26j83k52J08j77J31n3M2k73K9N9k43O20k03
3631b21L33J06NN1o5J27N3j4n6j67p8j58Q0j18l24j89k8J38o1M58J74k38Q6k9
3655a35J19M43M9m36K73l5n3k41j31J48p7K0m17J69j83rK11n5J86j62N31l08J83
3678I0K08k31L66l33L2LK26m07m2K77l56k74J01n1n3K47j86k6K78O2K45j15K93
3701C54M27m51K20j36R4j36j92j81j75j83l5jR2l17K23J8j17L15l51M35L76r3
3723A86J50K63m17L39k72j12O0J02j83k9j05j71q0p8p0r0J38L9K01Om6L95J09
3746C35P9K00k18j96R6J09l33J61j95m39M9J96j72J41j41o9R5j29K88N7J96J85
3768B95j20L06l9q9K88l08k46K04k84j84p6j02j61L6Q2J08J07P5L52q6L0J07N2
$$ plain form
3608 26 -61 120 161 153 380 170 373 328 48 174 -9 -261 -153 -330 -199 -252 -210 -483 -454 -395 -638 -18 -221
3631 -221 112 218 223 274 209 336 389 375 319 152 74 -84 -4 -122 -446 -635 -663 -525 -586 -128 46 -192 -106 -135
3655 -135 -16 427 476 40 313 278 225 -16 -147 1 -76 -56 -473 -304 -487 -496 -285 -340 -154 -316 215 -93 90
3678 90 298 67 433 100 132 135 361 -46 -88 189 -167 -441 -340 -391 -444 -197 -383 -409 -131 -69 176 61 354
3701 354 781 330 550 414 508 372 180 -1 -176 -359 -394 -395 -303 -620 -397 -379 -496 -181 -532 -97 279 186
3723 186 336 599 182 521 249 137 197 299 116 87 -18 -189 -269 -347 -417 -507 -369 -330 -129 -123 -169 226 335
3746 335 414 614 396 200 296 405 72 233 38 -401 -352 -156 -328 -187 -328 -397 -302 -431 -143 -86 110 295
3768 295 175 481 442 353 641 333 87 291 7 -177 -253 -355 -516 -480 -398 -290 -183 -108 244 158 188 295 347
3791C47m3J52j73J05l8m91K05j12J87m49j93N08k27j84k39L98j25N09j74K06j96
3812b7K65J64j32K47l6m35K50j93k9k97K69m6l16n7mR8j12qL8J97K25Q8r5J27
3836A81R9J90l99L55l59J01J2m79J77l59L3M8q1N2J89k80J90K98L12j12M06n63
3858A1J07J47J23j94l0k1L6k09P5j98l5k40L2k37K61j78J95M16k22K74k7L53m17
3881B2J73K12N8m04K15p0l56K81k09m2l1j98j34k06N60Qm3j23K35L8J4N07j29
3904C78m0P8J35j56k01K1j95k29j09K41k68M5O5j38L1J48R1n1K31J00L32j89J24
3927D44R7r2k19Jq1o4p3k86m2l1J71q1k25k28N14K47n8L2L96j93j30K01J75r6
3951C79j48RN5k31j5k26j09K35m64J68J51j04O5j60L46K27m2l3O6r0K24Q3l33
$$ plain form
3791 347 304 456 283 388 350 -141 64 -48 139 -310 -503 5 -222 -406 -645 -247 -372 137 -37 169 -27
3812 -27 238 402 270 517 481 46 296 103 74 -223 46 0 -316 -373 -377 -279 -391 -399 -361 -164 61 149 54 181
3836 181 280 470 71 426 67 168 180 -299 -122 -481 -448 -400 -481 -429 -240 -520 -330 -32 280 168 574 11
3858 11 118 265 388 194 164 143 179 -30 45 -153 -188 -428 -396 -633 -372 -550 -355 61 -161 113 86 439 22
3881 22 195 407 465 61 276 206 -150 131 -78 -120 -151 -349 -483 -689 -129 -121 -164 -287 -52 -14 0 507 378
3904 378 338 416 551 395 194 215 20 -209 -318 -77 -345 -300 -235 -373 -342 -194 -103 -154 77 177 509 320 444
3927 444 541 449 230 231 150 86 13 -273 -315 -346 -175 -256 -481 -709 -195 52 -6 26 422 229 99 300 475 379
3951 379 231 240 295 64 49 -177 -286 -51 -515 -347 -196 -300 -235 -395 -49 178 136 103 169 79 303 386 53
3974E3M22ql95M7n03L57j11j34o8J39j61j17J68P7K00J29J93j84K51R3k33N1m0
3997B26J64l42O9m80L08j82P4j29q7J95k39K36k47M35K8J21r9K73n3j02oJ17o8
4020B12J98j25j72j23k40Q8J16j29j88L2J59J49r9R1j13j1M55q8P2K6L0J85j90
4043C35j09n5k31J17k50K6j63O7K74k99l06K03N78k22J07K56k14J83l43N65l67
4064A52K12l25K37k57N6l05J98k14j22L89l36K26J9j56N3R1K24K29j08L3k99N64
4086E61l94rj06n8J21j14m3M7l23J66j01j47K80r5N3L66o2L27l59j3L70l53K08
4109C22lp6k07K03m52J17j26m11K64k4Q6k37J18K10J02k1K47K64M4j74p6Nj34
4132D1Q4l50K69n5o7k65K95m49J4j8M58R7m02K33J72J68L68k73N9k04o4K71l96
$$ plain form
3974 53 475 467 72 119 -384 -27 -138 -272 -340 -201 -362 -479 -311 -234 -34 95 288 104 355 448 215 266 226
3997 226 390 48 117 -363 -55 -237 -163 -292 -379 -184 -423 -187 -434 1 29 150 51 324 271 169 163 280 212
4020 212 410 285 113 -10 -250 -162 -46 -175 -363 -331 -172 -23 -122 -31 -144 -155 300 212 284 310 340 525 335
4043 335 226 171 -60 57 -193 -167 -330 -263 11 -288 -594 -391 187 -35 72 328 114 297 -46 519 152
4064 152 364 39 276 19 75 -230 -32 -246 -368 21 -315 -89 -70 -226 -173 -82 142 371 263 296 -3 561
4086 561 167 158 52 -6 115 1 -42 5 -318 -152 -253 -400 -120 -215 -162 204 142 469 110 97 467 114 322
4109 322 319 243 36 239 -213 -96 -222 -633 -369 -393 -307 -544 -426 -216 -114 -135 112 376 420 246 170 175 41
4132 41 125 -225 44 -11 -78 -343 -48 -497 -483 -501 -43 54 -348 -115 57 225 593 320 379 175 111 382 -14
4155a4Q2M1J07p11M74k10l18M13j71r6J49J14KQ0K90NL7J30l04K74o1j08j6qj12
4180F9k29j44J01L61l45j30j10M38q0J09j11O5k0J39J55J23j73j22M18k37j83
4201I4n8O2k22j29J34j72J71j77o4L02k71L10M5J66k74L25m6L70M1o23J32K41
4223C57l26M7o6j18O6k42o8L0N1J54K1J0J14j60j28N29J5K19l14k8j14P1P2k15
4247b3j44Pj1j01M2L6j11rK09P9p4K07J60k86L95j09J90Ll50O6j63k31L31l0m06
4272c23O3l01L99l35K20K9mK22Q5R7pj62M77k06ll4k50qj26Q4j80J51q0j19o3
4297c74oL47o7j3o2J85K05p4K46j00M9J0j69K01l55L7J06J95n38j00R7k33r5N
4321e03M06j36o2L83J8J88R0j44K59k61k30R1K42k60j25n1R7k24j31J94r0k01
$$ plain form
4155 -14 68 109 216 -495 -21 -231 -549 -136 -307 -403 -254 -140 -138 -58 232 237 274 404 100 374 313 205 189 181 69
4180 69 -160 -304 -203 158 -187 -317 -427 11 -69 40 -71 -6 -26 113 268 391 218 96 514 277 94
4201 94 36 98 -124 -253 -119 -291 -120 -297 -361 -59 -330 -20 25 191 -83 242 196 566 607 -16 116 357
4223 357 31 78 12 -106 -40 -282 -350 -320 -269 -115 -94 -84 30 -130 -258 271 286 505 191 163 49 120 192 -23
4247 -23 -167 -160 -171 -272 -230 -194 -305 -314 -105 -26 -100 107 267 -19 376 267 457 460 110 176 13 -218 113 83 -323
4272 -323 -260 -561 -162 -497 -277 -248 -252 -30 55 152 145 -17 460 254 251 217 -33 -41 -167 -83 -263 -112 -192 -311 -374
4297 -374 -380 -33 -100 -113 -175 10 215 141 387 287 336 346 177 378 23 60 166 361 -177 -277 -180 -413 -508 -503
4321 -503 -97 -233 -295 88 106 294 384 240 499 238 8 99 341 81 -44 -95 2 -222 -353 -159 -249 -450
4343d50N48l65J27k62O85R3k48L70j97R4j49n4K4m2Q3M7l07J01l73rO5n1J54o5
4367a81O4k32J76K21J2K14M1j37k4p0K13k19k14P8j45L2q5K63m49J84N9j66K74
4390i1%r0ko7L44J86K2k56K73K00k77Q7k96j77J29k36J69j46j95j13L90j10J41
4413a15o4LK77j35L89j25q4R4K5j91K06l3k39j51R8m5M0m35K93N2k03N8J64O2
4437e9J13L6J32K5K15k45j59J76j05J02j94P6j46ol0m2j38j13K80m3k0j29L25
4460E1j80J00J68n8L11m7j05r7J05K29m38r9l7P1k09m1j74J44J3K65N7O2J66n5
4484B02o4j31L69P7k38N3j17j69j4r6J49j83J66k01m7J32j23q9M01j47J81l3Q8
4507A66p7K0O1JL3j52J25J53n46J8P4j1R2k67p1N04l21J09RRk7O3K11o7J59Ko4
$$ plain form
4343 -450 98 -267 -140 -402 283 376 128 498 301 395 246 192 216 174 257 304 -3 98 -275 -284 -219 -270 -116 -181
4367 -181 -117 -349 -173 48 60 274 315 178 154 84 297 78 -136 -58 -203 -171 -256 7 -442 -258 -199 -365 -91
4390 -91 -91 -181 -183 -250 94 280 302 46 319 519 242 329 33 -144 -15 -251 -82 -228 -423 -536 -146 -256 -115
4413 -115 -179 -176 101 -34 355 230 146 240 265 74 280 247 8 -143 -45 -90 -50 -485 -192 -140 -343 -285 -121 -59
4437 -59 54 90 222 247 462 217 58 234 129 231 37 113 -33 -39 -69 -111 -249 -362 -82 -125 -145 -274 51
4460 51 -129 -29 139 81 392 345 240 143 248 477 39 -60 -97 -26 -235 -276 -450 -306 -293 -28 29 91 257 202
4484 202 138 7 376 453 215 268 151 -18 -32 -128 21 -162 4 -197 -244 -112 -235 -324 77 -70 111 78 166
4507 166 89 109 170 171 204 52 177 330 -216 -198 -124 -135 -43 -310 -381 123 -198 -89 -80 -71 -98 -35 176 109 268 270 206
4534B06l2q7j51J93j61O7q6j47K20j29l95K04Q6r5K44qO6j94L99J07q6nO6j30
4558A52N3j14j27K10m40j1J72M8k95J68k04L44J47k40L36q2L24j37R9l10J6j35
4580b6M1J62k15j79n6L8nj14J22k5J42M9J19j16J08l48J51O34j93L7l8j02M5j28
4604A03k92J12o6L1l61K95n9m4KJ52j4J06R9K03J50l74q5j04L80M2r2r0m3o2m4
4629e5j96J67k42J43j35J87J50J5j61P8QM23k92L45K30o86j0K12k68RP4k48K73
4652B1k21m0m9R6J21l32K17O8K0o6J77K11J71k78J69j87R8l0L29k49n30P6q4J53
4676a39k70K08j47N5K13k33L96L9j45K63P3pj79M3p6J23k4k15J18k89Q5k61K68
4699a01k21K4j5K90k49L06L6m9K42N1q9j50L29j69J37k29Mr6k72K89j89k68j96
$$ plain form
4534 206 174 87 -64 129 -32 35 -51 -198 22 -107 -502 -298 -212 -307 -63 -71 -5 -199 200 307 221 216 282 152
4558 152 205 91 -36 174 -266 -277 -105 -57 -352 -184 -388 -44 103 -137 199 117 441 304 403 93 109 -26
4580 -26 15 177 -38 -217 -273 -235 -240 -354 -232 -257 -115 -66 53 -63 45 -303 -152 482 289 326 288 186 231 103
4604 103 -189 -77 -143 -112 -473 -178 -237 -281 -279 -127 -141 -35 64 267 417 43 -42 -146 234 276 184 94 51 -11 -55
4629 -55 -251 -84 -326 -183 -318 -131 19 34 -127 -49 -41 382 90 435 665 -21 -31 181 -87 -78 -4 -252 21
4652 21 -200 -240 -289 -193 -72 -404 -187 -119 -99 -165 12 223 394 116 285 98 196 166 495 246 -284 -208 -292 -139
4676 -139 -409 -201 -348 -293 -80 -313 83 122 -23 240 313 306 127 170 94 217 193 -22 96 -193 -108 -369 -101
4699 -101 -322 -298 -313 -23 -272 34 70 21 263 314 225 75 404 235 372 143 147 51 -221 68 -121 -389 -585
4722e85L14j06L45o7N7o4J89j62K26J4pN8N9j4j53Q2k57K21l11J58k71r2K94l03
4746c75K28K59m51J82L18k9o0M3J26k95L40J50k34J54o4j01j44j22N6q9k63m2
4768d13J04L52L2k42L94o5J15k5k45L11j04o9j30Q1K81k97j61j93J58J06kk13
4790b25J69k35P8n9RM03j74j02L38j65O21n83J40j22K75l73J79K6j02j83m67O10
4812E8k63j92J26K42j77K50J47n2M6l48K93K06J0M7k60K5J00k05j84Mn1o9q0l7
4836c64M7J67j63M02o9J06K8J36p9O3Rk8j81N3k0m2j29M6n0l9L9k06K33k8k70
4861c39K53L0M2Q3J56J80j44k63K37M8k58J94j59j94l4M1j57MK3K13j3j35l0J12
4885a10J14O0R1Q1j19M25m17o3J94k01J8o1j34o8M4j54J61j05J95k17p9J39J56
$$ plain form
4722 -585 -271 -377 -32 -99 -42 -106 83 -79 147 161 154 212 271 257 104 186 -71 150 -161 -3 -274 -366 -72 -375
4746 -375 -147 112 -339 -157 161 132 72 115 241 -54 286 436 202 356 292 191 47 -75 -19 -108 -371 -413
4768 -413 -309 43 75 -167 227 162 277 252 7 318 214 145 15 96 377 80 -81 -274 -116 -10 -12 -225
4790 -225 -56 -291 -213 -272 -263 140 -34 -136 202 37 658 75 215 93 368 -5 174 200 98 -85 -552 58
4812 58 -205 -397 -271 -29 -206 44 191 139 185 -163 130 336 346 393 133 158 258 53 -131 -127 -178 -247 -327 -364
4836 -364 -317 -150 -313 89 20 126 154 290 211 274 283 255 74 127 107 65 -64 -18 -68 -107 -68 -274 -41 -69 -339
4861 -339 -86 -56 -14 69 225 405 261 -2 235 283 25 219 60 -134 -168 -127 -284 -280 -257 -44 -57 -192 -222 -110
4885 -110 4 64 155 236 117 542 125 62 256 55 73 12 -122 -190 -146 -300 -139 -244 -49 -266 -345 -206 -50
4908e0P4N5M6M38k81q9L8p8N4k68R7o9k00o5kJ04q6J99P7j44M96m94J91KL06k27
4934A24J31L7l9j64o7J77k34PJ59m64r0M59l14j26K32L96l24L34k28OJ59J26j64
4957A33J93k62j7L62l4l04J07m93J25j80K28J02k10K38J2m6o2K81K4o4R2j28J59
4980B56M7p4K07l86K5j15j65J0N1j09K39k33K94j21j07K13K19j44k53L06OJ73
5002C39j97N8J00k80j12L6j01J32m17L44J43q8k44K00j64J82J37j72K82O5j25
5023A18j51L29j82j7J0J47j96Q4n1nm41L60k80j15L8K68J69k12K19J28j8j44L
5046F1j36N80m39J0K03j64L5k05Rl5N8j93k57L77j88L60l62L14K3l0K56j68L4
5069A43L04k69M8j87m2M3Q2j16J01l63o9J24j57O7j25M0K03O6M77k69K76k2Jj50
$$ plain form
4908 -50 24 79 125 563 282 193 231 153 207 -61 36 -33 -233 -298 -300 -196 -282 -83 -6 -150 346 -148 43 45 351 124
4934 124 255 292 253 89 22 199 -35 -28 131 -333 -423 36 -278 -404 -172 224 -100 234 6 12 171 297 133
4957 133 326 64 47 409 375 71 178 -315 -190 -370 -142 -40 -250 -12 0 -46 -108 173 197 133 225 97 256
4980 256 303 229 436 50 75 -40 -205 -195 -144 -253 -14 -247 47 -74 -181 32 251 107 -146 160 166 339
5002 339 142 200 300 20 -92 -56 -157 -25 -442 -98 45 -43 -287 -87 -251 -69 68 -104 178 243 118
5023 118 -33 296 114 97 107 254 58 142 91 86 -355 5 -275 -390 -352 -84 85 -127 92 220 202 58 61
5046 61 -75 505 66 76 279 115 150 -55 -46 -81 -23 -216 -473 -96 -284 76 -286 28 51 21 277 109 143
5069 143 447 178 226 39 -3 40 122 6 107 -256 -325 -201 -358 -291 -416 -376 -173 -107 370 101 377 355 356 206
5093B06m9K17P2l70k26J21k25J40Po9k2j13K64l38K18K50q2K93P3k30k63N54n65
5116a37M53k54k13K7J40j05lj15l0Mj13K02j27J69M6L52k92Q9J20k4lj08J42l21
5140a01J09q2L5R1p3O4r3k09k9J81m6P2k1LK97j6j65K60J54j77O8l41n0L04%k00
5166C5j96J03k1j15J27j46N0J01oq6L56k34K66n4r1kj19K13j55K41n25L32k36
5189a62p2J75l78N19k65K9L62n12L32K1P4J43J48k04j20K38j46L25l42R6l89j77
5211c05M20j21k31n1J65k27k0K56J40J10m7rK41l35K93j08n9K85k79p9k98J55
5233a04l3OK6r4j12JR5L5P8J22j44N8K83j69K9K3O0p6m6J53k8l08J55l73L13M2
5259hk8q6J48j65K21J91n97N16p9J66j70J23J77j53l56K72j85n5lq6J57j91N5
$$ plain form
5093 206 157 374 446 76 -150 -29 -254 -114 -107 -176 -198 -311 -47 -385 -167 83 1 294 367 137 -126 428 -137
5116 -137 316 62 -151 -124 16 -89 -92 -207 -237 -233 -346 -144 -271 -102 -56 296 4 93 213 189 186 78 220 -101
5140 -101 8 -74 -39 52 -21 43 -50 -259 -288 -107 -153 -81 -102 -99 198 182 17 277 431 254 322 -19 -69 235 235 35
5166 35 -161 -58 -79 -194 -67 -213 -163 -62 -68 -154 202 -32 234 180 89 87 -32 181 26 267 -258 74 -162
5189 -162 -234 -59 -437 82 -183 -154 208 -304 28 49 123 266 414 210 90 328 182 507 165 261 -128 -305
5211 -305 115 -6 -237 -288 -123 -350 -370 -114 26 136 89 80 321 -14 279 171 112 397 118 39 -259 -104
5233 -104 -137 -131 -105 -199 -311 -310 -215 -180 -102 20 -124 -66 217 48 77 100 160 84 38 191 163 -145 10 -363 -50 -8
5259 -8 -36 -122 26 -139 82 273 -324 192 113 279 109 232 409 256 -100 172 -13 -68 -71 -157 0 -191 -136
5282a36k96P4L81j25j15K06K87m1p5K7j95J77J24k69L05M1k1m53Q6j15l7J28k03
5305b45P7M7J00m35L76r4m9M14l80L36O9j37L35k59r9J32l70RJ93m02L14n51K43
5328c76M29j40j35l7K16k6K08J61rk54K56P2k00l1lL9j7l03K61k64J66k88l16
5351e91K19K23J67k92O3K10J77J29j6J04k98Q5l0k13Q5k07K24o9j88K32k23J78
5373c1m9Q4j55J48n0J42l6j44L36J3q6q8J95j16j99q5N4K91l85j61M6K58P1n90
5397e37J70N42m84J36M61l64L28J15m41J18K44l10J42j26K05m98J71l07M70j56
5417a21j43N3OL44j16J28j06K30J24l13J53M7j36n0k78N43k75l7j25O9m36L43
5439i6j33j35K42LJ45j63K29k30L20k2l44M85l52J26R3r6nj86k3R0j69J5J02k20
$$ plain form
5282 -136 -432 -358 23 -102 -217 -11 276 235 160 187 -8 169 293 24 329 370 349 -104 -18 -133 -170 -42 -245
5305 -245 -168 -121 -21 -456 -80 -174 -223 191 -189 147 216 79 414 155 56 188 -182 -173 20 -382 -68 -619 -376
5328 -376 53 -87 -222 -259 -43 -69 139 300 291 37 293 365 165 134 131 170 153 -150 111 -153 13 -275 -591
5351 -591 -372 -149 18 -274 -211 -1 176 305 289 393 95 180 150 -63 22 -185 39 -30 -218 14 -209 -31
5373 -31 -80 4 -151 -3 -53 89 53 -91 245 258 172 84 279 163 -36 -121 -67 224 -161 -322 -276 -18 53 -537
5397 -537 -367 175 -309 -173 288 -76 252 367 -74 44 288 -22 120 -6 199 -299 -128 -435 35 -121
5417 -121 -264 -211 -205 139 23 151 45 275 399 86 239 286 150 100 -178 365 90 53 -72 -3 -439 -96
5439 -96 -229 -364 -122 -119 26 -137 92 -138 182 160 -184 301 -51 75 168 72 67 -119 -142 -52 -221 -206 -104 -324
5463c24K53j12M68l53K27J75k86L41k39q8M4M27l26m1k20j61J32J03j61J27o5
5484g9j75J06o5N0J90k11K25N2J2J69p7Q9j23lJ13k61m1M3k9l25J06M7J77k65
5508b75o7J19L88k50L4L39l93L11OR0j31n5j73J70j5k4j41o1k84j5L04Jl06J54
5532b74L14o8N9R6L02k13p2k2J65k4l23q9P7J53k36K16k90J81n5j71J84j69K32
5555b7j34K17K3R3o3j40K81o4l01L42k79K7n8K59l61J03K4j38P3q2J29l17L41
5578e2j81J90L01j93M1J20P3j48J83l72J38j58j42L67n40K17J83j82r7L97m7k01
5600a03j2K44L1m4k01J48P0k44N79o39J75J84J6k50m3j82R4J72o2l26K92j16J35
5623h2J37J62P0o7J48k89q6N0ok3o5M6J46k28r1Q2l48L66j25K27k49J56J10K23
$$ plain form
5463 -324 -71 -183 285 -68 159 334 48 389 150 62 106 533 207 166 -54 -215 -83 20 -141 -14 -79
5484 -79 -254 -148 -213 -163 27 -184 41 93 105 274 197 286 163 160 273 12 -29 14 -15 -340 -234 -187 -10 -275
5508 -275 -342 -223 165 -85 -51 288 -105 206 212 302 171 116 -57 113 98 74 -67 -128 -412 -427 -123 -122 -428 -274
5532 -274 40 -28 31 127 429 216 144 122 287 263 -60 -149 -72 81 -155 61 -229 -48 -103 -274 -90 -259 -27
5555 -27 -161 56 79 172 109 -31 250 186 -115 227 -52 -25 -83 176 -185 -82 -58 -196 -123 -205 -76 -393 -52
5578 -52 -233 -43 258 65 106 226 299 151 334 -38 100 -58 -200 167 -373 -156 27 -155 -252 145 98 -103
5600 -103 -115 129 160 116 -85 63 133 -111 468 -171 4 188 204 -46 -89 -271 -177 -5 -67 -393 -101 -217 -82
5623 -82 55 217 287 220 368 79 -7 43 37 14 -51 -5 141 -87 -178 -96 -444 -78 -203 24 -225 -69 41 264
5647B64m14M72l22J60j5J02M5Kl21l9P0m03M09j45Ll4J35l13L42K0K49p08N29
5670H8k6o0J66k81RN24k92o8j13K45j06l8k05J37l01Q5J34p6p6L19J5K80k76R3
5694A77J89l83M6K46j52k11j36J87Lr1Lj44K2mk6J55j4M0j56M13j11K95k43k5
5718H0K42K2n07M52p9n79N48o4j61p4Q1k3j80K27J37n16J28R8L92j47K6Q8j53
5741C8J88m6K7j57j74J11O4n5j16K9o9J29q0k47K39n4J17K85J26m43K87J18l07
5764A0O2QjL38k54n1o2j33k54J12K20k52k8K22O6J93j48K01k48m3K91l38K07L80
5788D98n20m9K16k80m6J68r6m1j52J94r4r2R8l9K66N9m9p7J56K42k14J32J23k78
5812A25J12k49o8K26l62K25k03J78k07M43k99M2m2L42K7n81L84J95j45j99K37
$$ plain form
5647 264 -150 322 0 160 145 247 292 294 -27 -66 4 -399 10 -135 -132 -166 -31 -344 -2 18 267 -441 88
5670 88 62 2 168 -113 -104 420 128 60 -53 192 86 48 -157 -20 -321 -236 -102 -178 -254 65 80 360 84 177
5694 177 366 -17 29 275 123 -88 -224 -37 -34 -125 -122 -266 -244 -248 -274 -119 -133 -93 -249 164 53 348 105 80
5718 80 322 344 -163 289 210 -369 179 115 -46 -120 -39 -62 -242 -15 122 -394 -266 -168 224 77 103 191 38
5741 38 226 180 207 50 -124 -13 51 -4 -120 -91 -160 -31 -111 -358 -119 -173 -56 229 355 -88 199 317 10
5764 10 72 80 79 417 163 112 50 -83 -337 -225 -5 -257 -285 -63 3 196 48 249 1 -42 249 -89 118 498
5788 498 -22 -71 145 -135 -181 -13 -109 -150 -302 -108 -202 -294 -196 -235 31 90 41 -36 120 362 148 280 403 125
5812 125 237 -12 -80 146 -216 9 -194 -16 -223 220 -79 -37 -79 263 290 -291 93 288 143 -56 181
5833A81j11rJ88Ll87J76Ll35M1J20M1o5J04k96J85K05M4Q3j96K09l39K53p8k26
5857b06L11J26j37k31r0R7L7k02M74l50K07O8j82O1K05N4r3O7j52O8J5J3J16j58
5881A18j69m7J67l09J12j89K42j40K58j59K31l65L06J67j73J14J67kl33K1N28
5902E45l71m1P7qj00k86R7q9J03j13K3J89J85l71j68P6L37n3K45m3k17J19J8l3
5926A21j49K25j57j5k40N6L17k29J37r2l6j98K11N3K17J29k32p5P5J53q5p0j21
5949eq3J28Rl21k3J71p6M71m28r1K85j60L5K25j22L21r4J4j3k69J2K0k2M9k90
5974b57J76m7JJ6J17k34K63l03K42J49j71L6l5J16J08j1J06k75N2j75p4K36n34
5997d98K46K77j58k23K93j04O3L48l7j1j09J10r3qRK09L8o2k45j4J7M4r5j36M0
$$ plain form
5833 181 70 61 249 252 -135 41 44 -291 -250 -130 -89 -154 -50 -346 -161 44 88 171 -25 184 -155 98 20 -206
5857 -206 105 231 94 -137 -227 -130 -93 -295 179 -171 36 104 -78 -17 188 242 149 216 64 132 147 160 276 118
5881 118 -51 -98 69 -240 -128 -317 -75 -215 43 -116 115 -250 56 223 50 164 331 329 -4 17 545
5902 545 174 133 210 202 102 -184 -87 -176 -73 -186 -163 26 211 -160 -328 -252 85 32 277 234 17 136 154 121
5926 121 -28 197 40 25 -215 -159 158 -71 66 -26 -62 -260 -49 4 221 350 118 43 118 271 186 116 -5
5949 -5 -88 40 49 -272 -295 -124 -200 271 -157 -248 37 -123 -88 137 15 336 242 256 243 -26 -14 6 -16 33 -257
5974 -257 -81 -128 -127 -111 6 -228 35 -268 -26 123 -48 -12 -47 69 177 166 272 -3 49 -126 -200 36 -498
5997 -498 -252 25 -133 -356 -63 -167 -104 244 207 196 87 197 104 96 105 314 352 290 45 31 48 92 -3 -139 -99
6022i9l29J95J37R2L74l29j01L29m25L03l7J9r4p5o9J51j05L83n01J43n2O4n07
6045e33R26m81l74P24j78k73O06q9m67K94R4mk93K75j86j46O6j21j18K03MR9k97
6068b69K29l25N22l52M74L6j35m2n8N9J87l57L30l44R6j12r2K8j87J05j15J06
6090b16K0J80j21J52o8J9L11L4pk93kK46j64J53l36J95J5j32Q4j51j12J21k75
6113c47K57L74m16L23j7J31l0k83K57r7j3o0J94l35J41M4j85Ml10L06k6j20J43
6136f5k3J41R1l16J20J80k0l9K62M9m32J34J9k79K1J78j18J19Ro6J01k55L8J65
6160A4j7J56L3j69J01j46N7k2J38J04k04j12L3L1j02K8j93J0k47M39j94J90p9
6183a51K38j0p3M8k9K93k54m9jj72m8K85j64K81k63J3m6j1l4o2K31l9NqL52n6
$$ plain form
6022 -99 -428 -233 -96 -4 370 41 -60 269 -156 147 110 129 35 -40 -109 42 -63 320 -181 -38 -90 -26 -533
6045 -533 393 -88 -462 262 84 -189 417 328 -139 155 249 245 -48 227 41 -105 -39 -160 -278 -75 -71 28 -269
6068 -269 -40 -365 157 -195 279 315 180 138 80 139 326 -31 299 -45 51 -61 -153 -125 -312 -207 -322 -216
6090 -216 -196 -16 -137 15 -53 -34 277 311 304 11 9 255 91 244 -92 103 118 -14 70 -81 -193 -72 -347
6113 -347 -90 284 -132 191 174 305 275 -8 249 152 139 79 273 -62 79 123 -62 -58 -368 -62 -88 -208 -65
6136 -65 -88 53 144 -172 -52 128 108 69 331 380 -52 82 101 -178 -157 21 -97 22 31 -35 66 -189 -151 14
6160 14 -3 153 186 17 118 -28 29 7 145 249 45 -67 -34 -3 -105 -77 -270 -260 -507 -68 -262 -72 -151
6183 -151 87 77 4 52 23 316 62 13 12 -160 -208 77 -87 194 -69 -56 -102 -113 -147 -209 22 -17 -12 -20 332 276
6209B76l39J29K35j78M7j0RK1l46J07l0o8j68J1l4J53oO3o1o3K39J61P6k33Q6
6234G7L20l06R0j2j66o3M7j81J62J12k59L11j27k35P5k70L44m0K60j8j9J93K1
6257C16j95K01j47o1j9j66P3l68J83J41k82L98j36j1Q3J15k80K69K1k99J91N8
6279H5Q1J71l4j40j06N1k05k2J2m8j24K17l0j07J55j9M05n72M73J12k76O4K6l0
6303A39L6j81j16J9J40rk70M8q1j56L66j89K90m9l77N51k5P4K2rP5m17M9J14Q
6328E2L5P7j60k00K75j75j39R5J09k05L67J40k01J34K68j97j94L0Q7r7j65O4K92
6351B92l25Oj47j10O5K69lj78k11J73K43J00j30r4K65o9j88K01p0M4mk77K74j05
6375B1l47K42n0m0K9K18q0K01k32J73j76J9J76L4k5r9j7L1o0R3k23J64o1q1k65
$$ plain form
6209 276 -63 66 301 123 170 160 169 190 -156 -49 -79 -147 -315 -304 -338 -185 -191 -128 -189 -252 -13 148 224 -9 77
6234 77 397 91 181 169 3 -60 -13 -194 -32 80 -179 132 5 -230 -155 -425 -81 -121 139 121 102 295 316
6257 316 121 322 175 114 95 -71 2 -366 -183 -42 -324 74 -62 -73 10 125 -155 114 135 -164 27 85
6279 85 166 337 303 163 57 108 -97 -119 -107 -155 -279 -62 -92 -199 -44 -63 342 -230 243 355 79 143 169 139
6303 139 175 -6 -122 -103 37 28 -242 -194 -275 -431 -65 -254 36 -13 -390 161 136 210 232 223 298 -119 -70 44 52
6328 52 87 164 4 -196 79 -96 -235 -140 -31 -236 131 271 70 204 472 275 81 111 198 101 -64 0 292
6351 292 -33 -27 -174 -284 -219 50 47 -131 -342 -169 74 174 44 -50 215 146 -42 159 89 133 129 -148 126 21
6375 21 -326 -84 -134 -174 -145 73 -7 194 -38 135 -41 -22 154 188 163 64 47 78 18 111 -112 52 -9 -90 -355
6400c55L33j03k4J71k72J38P7J69m0K01k90n6J28j99L03j97n3J99l55K39m6L8
6422FO3q2LJ43n38N30n6j04J80k79J81mp0K30k47j20K31q7J11k90mj91L53R1l11
6447b61K04K3j79j16J17J68N7J17L3J33n5k08L15k66J9j34q5k4K01j84M8P7Q0
6470H0k70O2J24k47N35k25P3j10K9R1P0j17n8J25k82K86k67MJ73k36mJ33j35j7
6494a83P6K43j56K12j98J38m36L54M61p01K61q4P3j44K6m6P0n1J84k31j19J65
6516h6M4K0n7J00K76j44j21k01K72j0j8J1k29J76p7Q1n34L53J41k28R2P4K26j31
6540C0j79j00O31m46j5L0L53k88n1Q3M9N6j72j15l4K50J20l20K34l77K01M2o7
6563h5J54l31M25j13L55j35l77M86k23l2P7l47O5J32k63L13j02j07O4o0J46j29
$$ plain form
6400 -355 -22 -125 -149 22 -250 -112 -35 134 94 295 5 -51 77 -122 181 -16 -69 130 -225 14 -32 6
6422 6 69 -13 -10 133 -405 125 69 -35 145 -134 47 43 -27 203 -44 -164 67 -20 91 -199 -203 -394 -41 50 -261
6447 -261 -57 -34 -213 -329 -212 -44 13 130 163 296 241 33 348 82 101 -33 -118 -142 59 -125 -77 0 80
6470 80 -190 -128 -4 -251 284 59 132 22 51 142 212 95 37 162 -120 166 -101 -97 76 -160 -164 -31 -166 -183
6494 -183 -107 136 -20 192 -6 132 -304 50 511 -190 71 -13 60 -84 -58 -104 -34 -85 99 -132 -251 -86
6516 -86 -42 -22 -79 21 297 153 32 -169 103 93 75 86 -143 33 -44 37 -497 -144 -3 -231 -139 -65 161 30
6540 30 -149 -249 382 -64 -79 -49 304 16 -35 48 97 153 -19 -134 -168 82 202 -118 116 -261 -60 -18 -85
6563 -85 69 -262 163 50 405 270 -107 379 156 124 201 -146 -81 51 -212 101 -1 -108 -44 -104 42 -87
6585h7J74k13K58k69J19PM6J48k93K0L11l15L04K7m39m9P7K29j98J55n5J67j3
6608A11M7k43K10o4J72k58L43m43K37o3j25p5k1p0K52l2M8k83J81j83L40k30k4
6631a73L49p4jj39K62k88P4K14j75j66K92k77j25J58jK28j61j05o6n6L06k87M12
6654B01j28J29k94K05K01j77j4n5J18j65j08J41j2nk19J53l56J21R4R1J98M4j78
6677a5J95j38K2J32k05M13m54L68k66j92J82k58L39l81J49J16j06m7o3K73j43
6698g9K31k80J43j08Q6M3j4j22J71L3K3j50P6r4J42j60J77k49R6j95K69k4O0K1
6722I6R0j9o6J5J45j98K43j30k49J99k39K36k90L23j66k04J87k24M8M13k82O1
6744a1J49j68J0Q4K23l03K97k7k15K78j14n94L85j11l1j26J93p8O6R7N9k56M4
$$ plain form
6585 -87 87 -126 132 -137 -18 -11 35 183 -110 -90 221 -94 210 237 -202 -251 -174 55 -143 12 -43 124 111
6608 111 158 -85 125 61 233 -25 318 -125 112 49 -76 -151 -172 -242 10 -22 26 -257 -76 -259 81 -149 -173
6631 -173 176 102 101 -38 224 -64 10 224 49 -117 175 -102 -227 -69 -70 158 -3 -108 -174 -230 76 -211 201
6654 201 73 202 -92 113 314 137 123 68 186 21 -87 54 42 37 -182 -29 -385 -264 -170 -79 119 163 -15
6677 -15 180 42 64 196 -9 404 -50 318 52 -140 42 -216 123 -258 -109 7 -99 -146 -209 64 -79
6698 -79 152 -128 15 -93 -7 36 22 -100 71 104 127 -23 53 -41 101 -59 118 -131 -35 -230 39 15 75 96
6722 96 186 167 101 116 261 63 306 176 -73 126 -113 123 -167 156 -10 -214 -27 -251 -203 210 -72 -11
6744 -11 138 -30 -20 64 287 -16 281 254 39 317 203 -391 -6 -117 -148 -274 -81 -159 -93 4 63 -193 -149
6767a49LL56j76qk15K3M11j12j94K26m28K33n5m5Q2k27J10j86K22j65J42J9J34
6790Ao5J39JK13j27j64l8o6J56j25m6K81q5O9l38L0L52j81J8m1j20M55k03j78
6814f2k78N28L8m3J09l17P1k94K3J76q7k90K28J74M0j42R6q5J67Kkk39L63M9k45
6839b0L09j72j14rj20K88j68j63J21J73j21k37j23K62j00m0J81M04j00j56K5p5
6861D5J93j12J4p6N9j23j28jm7J90j36J49k69K81r9q8JJ65j47J56K31k77J28J37
6885B46l10K99j97k38Q0K86j53m7N3l4O5j97K77L8k35K02J06j88K4K18j50j19
6907B6mk0L79m54J95n7j41N7j57J88j62M5J55k36L52j7l2R6j37J1J51k94j8J04
6931C0L8o2P2j16K23j95k03K72Q2m8k44O7J09m3J01o7J7J23k70K75k44M1K88j53
$$ plain form
6767 -149 -146 210 34 26 -189 -166 245 133 -61 165 -263 -30 -85 -130 -48 -275 -165 -351 -129 -294 -152 -133 1
6790 1 -64 75 76 289 162 -2 -40 -106 50 -75 -121 160 75 144 -194 -164 188 7 25 -16 -136 319 116 -62
6814 -62 -340 188 226 183 292 -25 46 -248 -225 -49 -136 -426 -198 -24 16 -126 -30 -115 52 54 52 -187 176 225 -20
6839 -20 289 117 3 -6 -126 162 -6 -169 -48 125 4 -233 -356 -94 -194 -234 -53 351 251 95 120 45
6861 45 238 126 140 64 123 0 -128 -129 -176 14 -122 27 -242 39 -60 -148 -147 18 -129 27 258 -19 109 246
6885 246 -64 235 38 -200 -120 166 13 -34 19 -15 50 -147 130 168 -67 135 241 53 77 295 145 26
6907 26 22 2 381 -73 122 65 -76 -19 -176 12 -150 -105 50 -186 166 149 117 213 76 87 238 -56 -74 30
6931 30 68 6 78 -38 185 -10 -213 59 141 93 -151 -84 25 -18 83 16 33 156 -114 161 -83 -42 246 93
6955I3k8r6lJ00k15J50k4j33L73n00K80j28L81k79j79J87J92j65j33J97Q7K6m51
6978b68L99l42K38n1j62J14k9J25j67L0K48Q9%N9q8j07k1J52j56J29J30k41J15
7001A96j96R5j85Q2k50L2J96o7l29L83J76l29K86j19n1N31Kl77p8J66k43J79M9
7024A49n5l71J51k32L79o2p4j12J48J39r3J66j04J71j67n8K99k37k5j4K81n07
7046b28J41j51M5L66k38K0j20L71l51L21k21J79J39j04j90L64m23K23P8j43k61
7067a83M6J41J30J9l10J64ln12L73M64m36L15n35K35R7j53K10K02k93O6r7q9J72
7090B3j79M5k72N93o14L14K52j91l8O5k89J98J28k44L44jk87m8M10l9k51l8K10
7113I1J05m65K27k65J33j46q5K79K78k45j00L64l29K43R0N1N5j40j37K82p2j89
$$ plain form
6955 93 65 -31 -34 66 -149 1 -23 -156 217 -283 -3 -131 250 -29 -208 -21 171 6 -127 70 157 183 -268
6978 -268 131 -211 27 -24 -186 -72 -101 24 -143 -113 135 224 224 283 195 88 67 219 63 192 322 81 196
7001 196 0 95 -90 -8 -258 -226 -30 -97 -426 -43 133 -196 90 -29 -80 451 453 76 -2 164 -79 100 149
7024 149 94 -277 -126 -358 21 -41 -115 -227 -79 60 -33 133 29 200 33 -25 274 37 12 -2 279 -228
7046 -228 -87 -238 -193 173 -65 -45 -165 206 -145 176 -45 134 273 169 -21 343 -80 143 221 78 -183
7067 -183 -137 4 134 153 -157 7 4 -508 -135 329 -107 208 -327 -92 5 -148 62 264 -29 37 -60 -149 23
7090 23 -156 -111 -383 210 -404 -90 162 -29 -67 -2 -291 -93 35 -209 135 134 -153 -201 209 170 -81 -119 91
7113 91 196 -269 -42 -307 -174 -320 -405 -126 152 -93 -193 171 -158 85 175 226 281 141 4 286 214 25
7135B5k70Q4J56r2L7p1J60l44P4L95j87j84M49j39j71M4J81q3r4j13K70m0k37
7158a50J06K2O9j51o1k6L53j75k6J03j89K74r4j41Q1k5K29l31J32L14j97o3l48
7181b94M52j53P2k77J54M9N9l02K26JK01l34J29R5k7J78n0J44K9n19Q2J28j25
7204h2l2L73l42n3J96j45K14k18KQ4O2K21J18p09K77J7J88k04J23QR4k04l4j11
7228a57O4r2K2J26j15P4K63k12K23m37K72K79k1r9o5p8J82l30L25p0l08K44N4
7251A44k8l87QK11k70L62J23J11r5j74j2k4J39J58R2k51j66J85M6k36K1k54L49
7274E2k05K71m3m64Q7J30J89M6Q1O4k79K93k47J60j90K04k37R9q0L0m8K67m83
7297c03N6K33JJ58k91J52P5J1j43J26O2Q2k62M3q0P5J58q9J9k5p0j02qJ98J18
$$ plain form
7135 25 -245 -161 -5 -97 -60 -131 29 -315 -241 154 -33 -217 232 93 -78 -34 147 64 -30 -143 127 87 -150
7158 -150 -44 -22 47 -104 -165 -191 162 -13 -39 64 -125 149 55 -86 -5 -30 199 -132 0 314 117 54 -294
7181 -294 158 5 77 -200 -46 3 62 -240 -14 -13 188 -146 -17 78 51 229 179 323 352 -167 -85 43 -82
7204 -82 -114 259 -83 -136 60 -85 129 -89 -87 -3 59 280 398 -311 -34 -17 171 -33 90 98 192 -12 -46 -157
7228 -157 -93 -185 -163 -37 -152 -78 185 -27 196 -241 31 310 289 190 125 47 229 -101 224 154 -154 90 144
7251 144 116 -271 -263 -52 -322 40 163 274 179 5 -7 -31 108 266 358 107 -59 126 172 -64 -43 -297 52
7274 52 -153 118 75 -389 -302 -172 17 63 144 208 -71 222 -25 135 -55 149 -88 11 -69 -39 -87 180 -303
7297 -303 -247 -14 -13 145 -146 6 81 92 -51 75 137 219 -43 0 -80 -5 153 64 83 58 -12 -114 -122 76 194
7322A94m61L47j70j28L17n4L43k13J8J16k12K73l40L7Q7l33J83j6j25j29QK02
7344e6k67M23o4J40j14M21n00Q3P9J0j36j56J78J90j01p1o6R2l49K55k15J67j8
7367g5J7J08k19K80LN8K8j51j8P4k55M41j48K36n92J66J27j55j64J95j32R1J85
7390A00l02L39j08j05OK92k21N0N3J94j89j62K69k31J53n7r3m8j32J40M7Mj11
7413a12K69k74M7K15k86K75j27O0r8J85r2j43K18l5j72M4j03l4J6oo7K18l97L90
7437iJ04j90q6J61q6N5J76k03K14k75L39l43K70j83J90j59k47R7M7L6K37j32N
7460A8q5m1J15j0l2j34L70k23o1J00j94M3N3K1J2J13j93J61k26J36N8k46K73j02
7484g4J77J9j7k6k31QJ82L1J92j70l01M1k18M10K63n05j0R5j28M23q3j74M79l19
$$ plain form
7322 194 -267 80 -90 -218 99 45 388 175 193 309 97 370 30 67 154 -179 4 -12 -137 -266 -258 -56
7344 -56 -323 100 36 176 62 483 -17 66 145 155 19 -137 41 231 130 59 -7 85 -264 -9 -224 -57 -75
7367 -75 -58 50 -169 111 114 172 200 49 31 105 -150 291 143 379 -213 -47 80 -75 -239 -44 -176 -85 100
7390 100 -202 137 29 -76 -70 222 1 51 104 298 109 -53 216 -15 138 81 -12 -60 -192 -52 -5 -1 -112
7413 -112 157 -117 -70 145 -141 134 7 67 -31 154 62 -81 137 102 -70 -26 -129 -163 -147 -153 -220 -2 -399 -9
7437 -9 95 -95 -181 -20 -106 -51 125 -78 136 -139 200 -143 127 -56 134 -25 -272 -175 -128 -92 145 13 18
7460 18 -67 -108 7 -3 -35 -169 201 -22 -83 17 -177 -134 -81 -60 -48 65 -128 33 -193 -57 1 -245 28 -74
7484 -74 103 122 105 79 -152 -144 38 69 261 91 -210 -169 -387 23 286 -219 -229 -134 -262 161 78 -96 383 64
7508F4j41K80k42Q5L7J1j84k5J02J56k02q1J6N6k83L62j3j20J64l61L47L17k38
7531A07j64J62k53J40M4k4N1k75K78k95K24j05Q3O0M4k2j58j15J00J81q4J68J01
7554B48k42J97j1j86J39k39J84k5j48n4j76N57n16J30K10p0J28j83J23J28j34
7575F0K90j29k51L02j13j79J46k76L59r6q6J00m75R8m5K38j49J92K9r1r4L6M0
7598i4L35j7l19K95k10n4L7k20K12k77J56K27k80K51k34M6O1q1L91k97k17L52
7620F3J19j49J55m7r8J42l67L00K5k10R9j16K61j61k23K01R1j47o2J24J51j4j9
7643A18j96R1J16k91J40M0k49J02q0L64q9k95lK61J20%k42N8J78N9k32J61K26
7666C57k25N0m1k4J24l75j88j9K79O8p5J25p4j44N8l96L01N4M10l50L4L38m78
$$ plain form
7508 64 -77 203 -39 46 83 94 -90 -115 -13 143 -59 -140 -124 -68 -351 11 -2 -122 42 -319 28 345 107
7531 107 -57 105 -148 -8 36 12 63 -212 66 -229 -5 -110 -27 33 77 55 -103 -218 -118 63 -21 147 248
7554 248 6 203 192 6 145 -94 90 65 -83 -137 -313 244 -272 -142 68 -2 126 -57 66 194 60
7575 60 350 221 -30 272 159 -20 126 -150 209 113 27 127 -348 -250 -295 -57 -206 -14 15 -76 -170 -134 -94
7598 -94 241 224 -95 200 -10 -64 -27 -247 -35 -312 -156 71 -209 42 -192 -146 -85 -166 225 -72 -289 63
7620 63 182 33 188 141 43 185 -182 118 143 -67 32 -84 177 16 -207 -6 85 -62 -124 0 151 137 118
7643 118 -78 13 129 -162 -22 18 -231 -129 -209 155 66 -229 -232 29 149 149 -93 -35 143 202 -30 131 357
7666 357 132 182 141 117 241 -134 -322 -341 -62 6 -69 56 -18 -162 -104 -500 -199 -145 265 -85 -51 287 -191
7689a91M91l74K82j04j69J48l8P0j47K65k24J70n37O32k70r7K1J55q4J75r9r3
7711a8J67j31N3j41K18k27J01Mj20p2M15l36J19L0j98j01K83K1l24J50J63k3p2
7734c9J30k95N23q1k92J55k53j12L03J04j62P7k09j44M42m60L7J38K86j7p8k8
7756B5m7J98P3K12l30pj63k2k61J82Q5j09J22L2k40N4K13k23K12J37NJ29l32J82
7780A27Mj9k89J61K39j54j17j06J59k64L25O0m46K60J22l04L61k51l0M7K21O0
7802A66j25J64r3k5j75lr0L5J31K0m7J1q5j8O8k79K27J93j97K37M5n6k9k06K6
7827a05K46j19J79k54r4J51N3l00L3K18j38J49l7j46J90K88q1j60m1rJ26J2j34
7850B7O7O6k79L43m58J21J00J14n4k07R3k46L88k23L71k25j06k1K24m6J11l2j65
$$ plain form
7689 -191 300 -74 208 104 -65 83 45 115 -32 233 9 179 -358 274 4 -93 -72 83 -1 174 75 -18
7711 -18 149 18 71 -70 148 -79 22 26 -94 -166 249 -87 32 62 -136 -237 46 67 -257 -107 56 33 -39
7734 -39 91 -204 319 238 -54 101 -152 -264 39 143 -19 58 -151 -295 147 -313 -276 -138 148 131 53 25
7756 25 -22 176 249 461 131 124 -39 -61 -322 -140 -55 -164 -42 -10 -250 -196 17 -206 6 143 148 277 -55 127
7780 127 131 112 -177 -16 223 69 -48 -154 5 -259 66 126 -320 -60 62 -242 119 -132 -162 -115 106 166
7802 166 41 205 112 87 -88 -91 -181 -146 -15 5 -42 -31 -116 -134 -66 -345 -118 75 -122 115 160 104 75 -131 -105
7827 -105 141 22 201 -53 -147 4 57 -243 -210 8 -130 19 -18 -164 26 314 233 73 32 23 149 161 27
7850 27 94 160 -119 224 -234 -113 -13 101 47 -160 -67 -313 75 -148 223 -2 -108 -129 95 49 160 128 -37
7873c7J39j03J01o4p9R0j17J17P3j72J45j00J03k02K41k16L16j92j30K02J82k47
7895E0k06O4K0L7k55N75n41J48qk81M85k71j49M91l49R9K15p4m14O61r2l25j14
7918b34J75n3K90l54K18m2O0p8K3J1O5j32p0m6K15j4J12l03M56l02l0j62J62J25
7942I2j48R9k34R0k59L03k13K12J46k35K27J23j92o3L65l71j00L45m32L92l84
7963b37P1K25l03M37m37J76Jk66M91l04P8J71K7L03j99n7m11M67j9P9j64l1j67
7986f9K12o1nj09J29l40L23k0k57K34j59Q9K6q4kL27J5k61N2J9j48l2N77n39j62
8011b45K18O4j61J1j38K83o4j09J03J54j96K08k38M02j95k90M28L1k24k16J43
8032c1J17k32K64l89M06j01l00J51o4NJ29J69J92j17q1j34M8J15J19k41j39P3
$$ plain form
7873 -37 102 -1 100 36 -43 47 -70 47 120 -52 93 -7 96 -106 135 -81 235 43 -87 115 297 50
7895 50 -156 -92 -72 -35 -290 285 -256 -108 -116 -397 88 -183 -332 159 -190 -91 124 50 -364 297 205 -120 -234
7918 -234 -59 -112 178 -176 42 0 60 -18 5 16 81 -51 -121 -167 48 34 146 -157 299 -3 -33 -195 -33 92
7942 92 -56 43 -191 -101 -360 -57 -270 -58 88 -147 80 203 11 -52 313 -58 -158 187 -245 147 -237
7963 -237 -166 59 -244 193 -244 -68 -67 -333 158 -146 -68 103 130 433 234 177 -234 233 214 293 129 98 -69
7986 -69 143 82 77 -32 97 -243 80 60 -197 37 -122 -33 -7 -91 -93 234 249 -12 40 59 -89 -121 456 -83 -245
8011 -245 -27 37 -124 -113 -251 32 -32 -141 -38 116 -80 128 -110 292 97 -193 235 266 42 -174 -31
8032 -31 86 -146 118 -271 135 34 -266 -115 -179 -174 -45 124 316 199 118 -16 32 147 266 25 -114 -41
8054d1j15R7o4MQ4L32l62K95l1k30J1J24K0J12k8k56K30k12l1J56j53K24Pj72
8078Aj0r7k13J69k75K59J43R7j65Q6R5o9j60O3K75P0j12k08J16k35k37L04R9k30
8102b34J93q0j61J78O2p5J72o2j11K77p5j49J1K19k82L97l31N3K14j0k15j13J06
8125a6l01J07n9K36k65K09p2J82j4k74M51j71p5K14j16l0J10j15j16l8j9K5J42
8148eO5Q6o3k9K6l39J62O5J40M7k30K14m09K85pJ57j17R3l25J32nJ77P0j74k85
8173b69N8J25o1M95n47K84k47M22k52J53j51n1K83p9m6k07l9o5
$$ plain form
8054 -41 -156 -59 -123 -119 -35 297 -65 230 199 -31 -20 104 124 236 208 -48 182 -30 -61 95 -58 166 173 1
8078 1 -9 -106 -319 -150 -425 -166 -23 74 -91 -5 90 21 -139 -76 199 269 157 -51 65 -170 -407 -103 -4 -234
8102 -234 -41 -121 -282 -104 -42 -117 55 -7 -118 159 84 -65 -54 165 -117 280 -51 2 216 206 -9 -122 -16
8125 -16 -317 -210 -269 -33 -298 -89 -161 21 7 -267 184 13 -62 152 36 6 116 1 -115 -153 -172 -147 -5
8148 -5 60 146 83 54 80 -259 -97 -32 108 155 -75 139 -270 15 8 165 48 141 -184 -52 -57 120 190 16 -269
8173 -269 -211 -86 -147 348 -199 85 -162 260 8 161 10 -41 242 163 117 -90 -129 -194
8191a94
$$ Imaginary data points
##PAGE= N=2
##DATA TABLE= (X++(I..I)), XYDATA
0@%%%%%%%%%%Qj6J6j6K4l2M0m8N6p2Q8j04J20j42J66j92K25k63L03l46M00m57
32b42N18n89O66p51Q44r47J059j181J318j468J629j804J997k209K439k689K963
49A553l263L597l963M365m817N320n884O524p255Q100r090J0268j1700J3486j5781
64h540J8856k3216K9929m1704O8341k42156K5267L70348k40320j59780K07510
75D535K17394j88900j25476J58695J49635j39097j30297N3438R9587n1771q7993
86d0250r511N2762j1814n7639k1564M9850J5446n4178k8235R5068R8417l9083
98D9269r2272M8648J15546k5967j06290N2482J22250q4143j91517K3913J40299
109E2218o5219j60196O1340J50469n1725j05205R0380J18901n3762o3506P1425
$$ plain form
0 0 0 0 0 0 0 0 0 0 0 0 8 -8 8 -8 16 -16 24 -24 32 -40 48 -56 64 -78 88 -104 121 -142 161 -185 215 -242
32 -242 276 -313 353 -398 446 -501 558 -623 695 -773 856 -948 1049 -1160 1279 -1410 1553
49 1553 -1710 1887 -2076 2289 -2528 2792 -3092 3432 -3823 4277 -4813 5455 -6245 7241 -8540
64 -8540 10316 -12900 17029 -24675 43666 -198490 -173223 197125 -43195 -202975 4535
75 4535 221929 33029 -92447 66248 215883 76786 -53511 -73 99514 47743 -40250
86 -40250 -49761 3001 -8813 -66452 -88016 -38166 -22720 -76898 -105133 -10065 88352 49269
98 49269 -43003 5645 121191 95224 -11066 41416 163666 79523 -111994 -88081 52218
109 52218 -13001 -173197 -111857 38612 -13113 -118318 -27938 90963 37201 -26305 45120
120D5120N3884n6291m2809K1018N616j5705J982p330k2033J730k701m0062r564
133f7145N5229K3137n1042j1227O9808K4422n9292o095Q6609K5157p9394k3391
145a3224P1650K94r9704k0191Q1002n23r0657o78Q0217o855n9654L7803P5396
158E4876k2367m8185L1592L0381l8982j7728L4591P81l4987K724J6542k2783j5612
171b9157K4214N844k4096P190K7331j3159k2551K3817K7733j7651j4575K8676
183B3616J1876l6360j5939L0840O218l9815r374L3222m352m0995Q123M8568j948
196A3680l3610K1415M1248k0963l5454K5375K6773l3060k7247K5704R152l4674
208b1661r803K7195J694j8850Q800J8163q095n765J6505M571r537R675J4017j4237
$$ plain form
120 45120 99004 42713 -96 20922 26538 10833 12815 5485 -16548 -14818 -17519 -57581 -67145
133 -67145 -11916 11221 -39821 -51048 18760 43182 -16110 -22205 64404 89561 10167 -13224
145 -13224 58426 58720 -40984 -61175 19827 19304 -71353 -72031 8186 1331 -58323 -20520 54876
158 54876 32509 -15676 15916 46297 7315 -10413 24178 24959 -10028 -7304 9238 -13545 -29157
171 -29157 -4943 901 -23195 -16005 11326 -1833 -24384 -567 27166 9515 -5060 23616
183 23616 35492 -868 -16807 14033 20251 -19564 -28938 4284 -68 -41063 -32940 15628 13680
196 13680 -19930 1485 42733 21770 -13684 11691 38464 5404 -21843 3861 13013 -21661
208 -21661 -31464 -4269 -2575 -21425 -12625 5538 -2557 -8322 8183 12754 3217 12892 26909 12672
222A2672j3947J5399O433k6646j1381K1938K28l3782p051L0484L782k9368N687
235b5552M1659M944k9439Q568L8532l003l3550N172K6682j5512l4757L027J7750
248D521j4677k0793Q399J2958o575l634R790O552L827Q384K082k723J0027J0490
262B8628j1757j3254J2400R410k3940j9270J5308P878k8973j6031K4843J3720
274a038k3162q645L1841J8637j8797m329K9915J3423k2862j0420J9040M046k5109
287B540j3080J0547R60j7470p890Q011M934m341j488N264Q961P271o85k521R278
302A0291J3152n238j2716P694J3102j3436k1652O113J4003j7477k3236J0456J7738
315a206j3200j6724J7529K2568q196j2592J7104K0291q927j4511R557J1947j1622
$$ plain form
222 12672 -1275 14124 20557 -6089 -17470 4468 4696 -29086 -36137 -5653 -1871 -31239 -25552
235 -25552 16107 21051 -8388 180 38712 35709 2159 7331 34013 18501 -16256 -13229 4521
248 4521 -10156 -30949 -22550 -9592 -16167 -19801 -10011 -3459 368 8752 10834 8111 18138 28628
262 28628 16871 3617 16017 25427 1487 -17783 -2475 5403 -23570 -39601 -14758 -1038
274 -1038 -24200 -32845 -1004 17633 -1164 -5493 24422 37845 14983 4563 23603 27649 2540
287 2540 -10540 7 967 -16503 -24393 -16382 -11448 -15789 -17277 -12013 -3052 4219 3534 1013 10291
302 10291 23443 18205 5489 13183 26285 12849 -8803 -2690 11313 -6164 -29400 -18944 -1206
315 -1206 -14406 -31130 -13601 8967 771 -11821 5283 25574 16647 2136 11693 23640 12018
328A2018j5918L411P746q446j2432J327O826k044n705N34O263N336j035k887N158
343A52J0467M80q944K418J2735k415j6177n60J2771m916j8914K08J5381l560j7093
358a7967L517J8432j116j3579M751J6609j394j3250K703J3133k315j2178J055
371a599R391j564j0235n66O880J31o905j296L938J882k623k503J664N103R17n041
387b426j514P848K269q881k420R687L042j0892k507J2012K243j2007j551J1861
401F764J217j1913k361R548P36j1085j983Q883J949q507j334Q889L374o193k69
416b285P650J984m833m12L861O91l709j622M2K3j075l837l824J995K341m082l583
433a0675O121N694m392k645R624O879n501k356P843L157q057m591M409j7r120
$$ plain form
328 12018 -3900 -489 7257 -1189 -13621 -12294 -5468 -7512 -13217 -12683 -6420 -1084 -2119 -5006 152
343 152 10619 11099 2155 4573 17308 14893 -1284 -1844 10927 6011 -12903 -12695 2686 -874 -17967
358 -17967 -14450 3982 2866 -10713 -5962 10647 9253 -3997 -1294 11839 9524 -2654 -1599
371 -1599 7792 6228 -4007 -4573 2307 2438 -4467 -5763 -1825 57 -2566 -5069 -3405 1698 2615 -2426
387 -2426 -3940 3908 6177 -2704 -5124 4563 7605 -3287 -5794 6218 8461 -3546 -5097 6764
401 6764 7981 -3932 -6293 3255 3991 -7094 -9077 -194 1755 -6752 -8086 803 4177 -2016 -2285
416 -2285 5365 7349 2516 2104 5965 6656 2947 1325 1367 1390 315 -3522 -7346 -5351 -3010 -7092 -10675
433 -10675 -4554 1140 -3252 -5897 3727 10606 5105 2749 10592 13749 5692 1101 5510 5493 -3627
448c627m748L236J416o535k912N876M167k725o30P567N165l025p18N921L468k698
464I198k170L11j433k145k910m632k245J103k750o275J497O256l50k809N565Q411
480D622K52j385O261M657m540l176L164M81p338n138O5l51n089l855J882K910
496f578j970k267L707O540J188p43L949N067K29o79Q65K59j491j874k640l889
512c27k151j471m986k987K998J557k908J987O460O89j622N768O710j392k398L100
528I027J566m215l361k6j10l315m145j281N37r36k365m54L674K674j068R96M775
545A973J519l62K006K725J42r07j166k157j531q57k612k794JK32l240j414M208
562d234K157k429J275N342M54k740J986M028r38k519J342M19j255j463r51r54
$$ plain form
448 -3627 -8375 -5139 -3723 -10258 -13170 -7294 -3127 -5852 -6482 1085 6250 3225 2507 8428 11896 9198
464 9198 7028 7339 5906 3761 851 -3781 -6026 -4923 -7673 -13948 -12451 -6195 -6545 -9354 -3789 4622
480 4622 4874 3489 9750 14407 9867 6691 9855 10336 2998 -2140 -2075 -2426 -7515 -11370 -9488 -6578
496 -6578 -8548 -10815 -7108 -568 620 -123 3826 8893 9122 8443 9308 9567 8076 6202 3562 -327
512 -327 -2478 -3949 -8935 -11922 -8924 -7367 -10275 -8288 -1828 -1139 -2761 3007 9717 8325 5927 9027
528 9027 10593 6378 3017 2991 2881 -434 -4579 -5860 -5323 -6259 -8624 -9078 -5404 -2730 -3798 -2802 1973
545 1973 3492 3130 5136 7861 8003 7096 5930 3773 2242 1385 -1227 -4021 -4020 -3788 -7028 -8442 -4234
562 -4234 -2077 -4506 -3231 2111 2565 -175 1811 5839 4901 2382 3724 4143 2888 1425 474 -480
578d80M72j196k343K40J133j457j893K223K491r50j14K629J289m85L65J115Q7
595C126L53p2j956l25P62j336k362J039J870k627k463J964Q36k071n65K369N04
612i54j459J209J968M76O68J184L74M36P55j359j138J30j90l049j167O96j205
629b625k066k97J417l10L64J755Q73N85J199P39Q63J713J417j173o09J317j226
646C936k755p36K89k663k821j51k9j721k97K200J489Q92J837K066J377K003P86
663E702K3P73L14k007k094o73j311k765k051j61q15j197m25J040M47J244J635
680b321J970J732K100J279M39J740P44j521j392j70k218k828k146j227j624j612
696g055n86P21M67J378J873J942K310J849J532J094J459L3j559k56k4k257k290
$$ plain form
578 -480 -8 -1204 -3547 -3307 -2174 -3631 -5524 -3301 -810 -1760 -1874 755 2044 1559 1924 3039 3126
595 3126 3479 3407 1451 1126 1888 552 -1810 -771 1099 -1528 -3991 -2027 -1191 -3262 -3827 -1458 -954
612 -954 -2413 -1204 764 1240 1908 3092 3466 3902 4657 3298 2160 2290 2100 -949 -2116 -1420 -2625
629 -2625 -4691 -4988 -3571 -3881 -3517 -1762 -889 -304 895 1634 2497 4210 5627 4454 3845 5162 3936
646 3936 1181 445 734 -1929 -4750 -4901 -4930 -6651 -6948 -4748 -3259 -2367 -530 1536 2913 4916 5702
663 5702 5725 6498 6812 4805 2711 2038 727 -2038 -4089 -4250 -5065 -6262 -6687 -5647 -5200 -3956 -2321
680 -2321 -351 1381 3481 4760 5199 6939 7683 6162 4770 4600 2382 -446 -2592 -3819 -5443 -7055
696 -7055 -7641 -6920 -6453 -5075 -3202 -1260 1050 2899 4431 5525 6984 7017 5458 5202 5178 2921 631
713F31j701r40j680j946n78K01j23L24Q79K014K035J752J321J465K253O09l18
730F198j42j54j634k345j301j431k025j562j094j95K68j49J130J492J283J021
746f40J264K104J298L32j27P61j43r86j128o34q76j907j779o75n06r32j75j22
764d871R47J109M99J026K024J258P57O78P81J55m80o17o01q49j295j134o38m75
782a726r66k03j77L36m86N73R00R08M58N11J185P52N33l1J64N51l20q95p95j87
802A085o65j676p16o3l82q92L77L97Q21j57N21J231R17p2Q74O75N21j84K8rj5
823B616n80r21p23n53q98q12m89l87n37l52K87Q24R85O11O49J405J349K22j7J173
843C852K33q09r28l45m50j461j527m06k71j094r12K87M06l0O11J277J211R78P57
$$ plain form
713 631 -1070 -2010 -3690 -5636 -6214 -6013 -6136 -5812 -4933 -2919 -884 868 2189 3654 5907 6516 6198
730 6198 6056 5902 4268 1923 622 -809 -2834 -4396 -5490 -5685 -5417 -5566 -4436 -2944 -1661 -640
746 -640 624 2728 4026 4358 4231 4992 4849 3863 2735 2101 1225 -682 -2461 -3136 -3642 -4574 -4749 -4871
764 -4871 -3924 -2815 -2316 -1290 734 1992 2749 3427 4208 4363 3883 3266 2665 1816 521 -613 -1251 -1726
782 -1726 -2692 -2895 -3072 -2736 -3222 -2649 -1749 -841 -383 128 1313 2065 2598 2567 2731 3282 2962 2067 1272 1085
802 1085 420 -1256 -1972 -2035 -2417 -3309 -2932 -2535 -1714 -1871 -1350 -119 798 726 1600 2275 2796 2612 2640 2631 2616
823 2616 2036 1115 392 -161 -1059 -1871 -2360 -2747 -3284 -3636 -3349 -2525 -1540 -929 -280 1125 2474 2696 2679 3852
843 3852 4085 3276 2348 2003 1553 92 -1435 -1841 -2112 -3206 -4118 -3831 -3425 -3455 -2844 -1567 -356 622 1379
862A379J312P64P79J93l88k96n46j245j592q86j333j081j329j84Q7M0K37J092
880b997J587R98Q61J372J544Q85j83M62J14p72j445m67q63j627j905o58n05q68
898d467q35N13Q88N88P62K029J273J314J396O68M09N83j23j176j257o98r89k141
916a263j718J77r56j155k0Q46N73N9J528K248Q36P20J187J425K36m33j19o6j154
935B951j645j363l66j651j536n97k00k18jJ265Q73R59J110J325J252P41J142L85
953D426n09m78K80j247k000l18j93k081j397L44j1j036n8K009K71m6J525J787
971A268L54M19P91J125k22l72j81o90j074r28j149p73o14q03n63M62j68k36J267
990b087Q19L68J222J589o25M93J214K82j352l0J274j324j779l43Q97j993j456
$$ plain form
862 1379 2691 3455 4234 4427 4039 3743 3197 1952 360 -526 -1859 -2940 -4269 -4453 -4366 -4326 -4089 -2997
880 -2997 -1410 -412 449 1821 3365 4250 4067 4529 4643 3871 2426 1959 1096 -531 -2436 -3094 -3599 -4467
898 -4467 -5302 -4789 -3901 -3313 -2551 -522 751 2065 3461 4129 4538 5121 4998 3822 2565 1867 878 -1263
916 -1263 -2981 -2804 -3760 -4915 -4935 -4089 -3516 -3457 -1929 319 1155 1875 3062 4487 4723 4290 4171 4105 2951
935 2951 1306 -57 -423 -2074 -3610 -4207 -4407 -4625 -4626 -3361 -2488 -1529 -419 906 2158 2899 4041 4426
953 4426 3917 3439 3719 2472 472 154 -39 -2120 -3517 -3173 -3184 -4220 -4278 -2269 -1998 -2044 -519 1268
971 1268 1622 2041 2832 3957 3735 3363 3182 2492 1418 490 -659 -1432 -2046 -2849 -3412 -2950 -3118 -3354 -2087
990 -2087 -1268 -900 322 1911 1286 1779 2993 3275 1923 1893 3167 1843 64 -279 618 -1375 -2831
1007b831J106J23j526k83K003J08n93J483J365k89N88R76N28l45j0J14o18l13
1025A586n52j174m09m07j006j0k05m10J19L02M43QJ105J557l94K84J713M93j197
1044A846L51J104o39k002N41j67k074j554J171q6j726K1J246j37n19J640J279
1061B95m7Q12J609j48j8N67K30p46m83m38q23j165q29o96m90o27o39L86P74K37
1081b239o8J401J652R0L77J795Q97j296K77R10q02k278N00m35k416j310P37m71
1099b679j548M71J268k72j91K452R38L60R00J528J72k30N56Q8j345m34p53j263
1117A8j508m41o36p55o20Q9N49Q72O98M39J619J164K37L87J710L20j383K2O36
1136C417j350j894n61J32j666j490M84k18r13O49J388J83Q9K090P92N09O24J415
$$ plain form
1007 -2831 -1725 -1602 -3128 -3411 -1408 -1300 -1893 -410 955 666 1254 2230 2758 2413 2403 2517 1899 1586
1025 1586 1034 -140 -549 -956 -1962 -1972 -2177 -2587 -2468 -2166 -1723 -1715 -610 947 553 837 2550 3043 1846
1044 1846 2197 3301 2662 660 1201 1034 -1040 -2594 -1423 -1509 -3235 -3214 -1968 -2105 -2624 -984 295
1061 295 248 1060 2669 2521 2503 3070 3300 2554 2071 1633 810 -355 -1184 -1880 -2370 -2997 -3636 -3250 -2476 -2239
1081 -2239 -2307 -906 746 836 1213 3008 3905 2609 2886 3796 2994 716 1216 781 -1635 -2945 -2208 -2679
1099 -2679 -4227 -3756 -2488 -2760 -2951 -499 439 799 1699 3227 3399 3169 3725 3813 2468 2034 1281 18
1117 18 -1490 -1931 -2567 -3322 -3942 -3853 -3304 -2432 -1734 -1295 324 1488 1725 2112 3822 4142 2759 2781 3417
1136 3417 2067 173 -388 -256 -1922 -3412 -2928 -3146 -4059 -3410 -2022 -1839 -1750 340 1132 1641 2265 3680
1154C680n16j62M07k54j737q48m49j316r04l00m02m80J93J38K42J162O97N74J068
1173G93J187o0K44J455j85q76o53K98j175j589k50j39j244o78N10l02k4M97J019
1192a172J27J60J723O84k03O35R47n18k85L48l79j044o60l98p83o61n83k06k24
1211b492j72M65K17R36O42q5J059J181o9P9L17M19p05J6j00o74j073l35l63p70
1231a507m27l58J22n9M10M20Q5L73J257L60L23N49J001l73rj01l63j11q51n38
1251B03l95r08o07k65l59J41p7L63L98O37K10R83P34M08J90M83O10j00n50K4o66
1272A457r08m45o63p88o83N9m05k47K37N12L75N02J053Q42K22P23M50P08l50l31
1292B320k68n34m37j108n58n98p49o02j11M28n50L88J010M07K62J089R71M24M80
$$ plain form
1154 3680 3164 3002 3409 3155 1418 570 121 -1195 -2099 -2399 -2801 -3281 -3088 -2950 -2708 -1546 -849 -275 793
1173 793 1980 1920 2164 3619 3434 2558 1905 2203 1028 -561 -811 -950 -2194 -2872 -2362 -2664 -2688 -2191 -1172
1192 -1172 -1045 -885 838 1522 1319 1954 2901 2383 2098 2446 2067 1023 363 -35 -818 -1479 -2062 -2268 -2492
1211 -2492 -2664 -2199 -1982 -1046 -404 -489 570 1751 1682 1761 2078 2497 1792 1808 1708 1034 -39 -374 -737 -1507
1231 -1507 -1934 -2292 -2170 -2229 -1819 -1399 -1314 -941 316 676 999 1548 2549 2176 2167 2066 1703 1592 741 203
1251 203 -192 -1100 -1707 -1972 -2331 -2190 -2267 -1904 -1506 -869 -659 324 1058 1466 1656 2139 2749 2649 2099 2123 1457
1272 1457 549 104 -559 -1347 -2030 -1971 -2376 -2623 -2386 -1874 -1499 -997 56 898 1120 1843 2293 3001 2651 2320
1292 2320 2052 1518 1081 -27 -585 -1183 -1932 -2534 -2645 -2217 -2767 -2379 -1369 -962 -700 389 1360 1784 2264
1311B264N41J81l54l70k87q75j139k91r20n52n06l88mj97L11O01N76J091Q06N61
1331A049R48J48N80L88l70p17k12n45r46j047l35m36q79n74K32J25K13M85R79
1350i14M89L87Q64R64L74K78L85q0m78q25j80p83q00p15j91q89n38kL53q8M49
1371a940R33O42K70P00R05M01K69P09k79l90l80n55l71r64o33l84o10o40j77K03
1391b291K01J32O54Q12M69N74P52P60j8j41O28n55m52k08l37r73r78j69l55l62
1411a857m30L13p8j0O54P00J83M94Q53P88o4L54J06K62o54k97l14n69l95n74p91
1432a326j61k83o28L75N28j92N55M14Q77J94N39N98L00q6J2L57o68j85m38k76
1452E06j103m20p2l77n68M6K78j28L21P27K76L84Q91O78j17J09N90k55k74j14
$$ plain form
1311 2264 2805 2986 2632 2262 1975 1100 -39 -330 -1250 -1802 -2308 -2696 -2700 -2897 -2586 -1985 -1409 -318 488 1049
1331 1049 1997 2145 2725 3113 2743 2026 1814 1269 323 -724 -1059 -1495 -2374 -2948 -2716 -2591 -2378 -1893 -914
1350 -914 -425 -38 826 1790 2164 2442 2827 2747 2269 1444 1264 481 -319 -1034 -1225 -2114 -2652 -2654 -2301 -2389 -1940
1371 -1940 -1007 -365 -95 605 1510 1911 2180 2889 2610 2220 1840 1285 914 -50 -683 -1067 -1677 -2317 -2494 -2291
1391 -2291 -2090 -1958 -1304 -492 -23 551 1303 2063 2045 1904 2532 1977 1525 1317 980 7 -971 -1140 -1495 -1857
1411 -1857 -2287 -1974 -2052 -2062 -1408 -708 -525 -31 822 1610 1546 1900 2006 2268 1614 1317 1003 434 39 -535 -1326
1432 -1326 -1487 -1770 -2398 -2023 -1495 -1687 -1132 -718 159 353 892 1490 1790 1704 1716 2073 1405 1220 782 506
1452 506 -597 -1017 -1089 -1466 -2034 -1988 -1710 -1838 -1517 -790 -514 -130 761 1439 1322 1431 2021 1766 1492 1378
1472A378n24l52n54k28o58j75q01j94J57L46J24N2P39M70L34M51R00K18R2J92
1492A967L16n58j44m72o70p18l48m40n88l97K7p9lN53N23K67O09J015L98J14N31
1513A903K29j62k02lo59q16l16l38p78l01k84k48l06L02K00K38R11L08P50R14
1533A342K48l6J92P33l74k85n84o7r64r99L1l26r30r7K98j96o2O71M26M78Q63
1554C62O62K74M44M17M8j09l48J14q33q03j65r63p06j4j94m05L00N02q8L31R66
1575b08M79M17P32M85J52k09L42l12m85m67k75p80p55l05L7r77j63N10K59j56
1595a679P62L66N44O58M00M93O9L80r5l40J56o09n40o83k90n35n19k51k1j83J47
1616a770K71M75L94J96O28O32K84M19J6L12l98j0m00l11j06q92m08o52j22l39
$$ plain form
1472 1378 854 502 -52 -280 -938 -1113 -1914 -2108 -1951 -1605 -1481 -1429 -690 -220 114 565 1465 1683 1775 1967
1492 1967 2283 1725 1581 1109 439 -279 -627 -1067 -1655 -2052 -2025 -2104 -2107 -1554 -1031 -764 -155 860 1258 1372 1903
1513 1903 2132 1970 1768 1765 1106 290 -26 -364 -1142 -1443 -1727 -1975 -2281 -1979 -1779 -1541 -630 -322 428 1342
1533 1342 1590 1554 1746 2479 2105 1820 1236 1169 205 -794 -763 -1089 -2019 -2116 -1818 -2014 -2076 -1405 -979 -501 362
1554 362 1024 1298 1742 2159 2207 2098 1750 1864 1031 228 63 -900 -1606 -1620 -1814 -2219 -1919 -1417 -1505 -1174 -208
1575 -208 271 688 1420 1905 2057 1848 2190 1878 1393 926 651 -129 -884 -1189 -1152 -2129 -2292 -1782 -1523 -1679
1595 -1679 -917 -551 -7 651 1051 1544 1613 1993 1898 1558 1714 1105 565 -118 -408 -943 -1462 -1713 -1734 -1917 -1770
1616 -1770 -1499 -1024 -630 -434 194 826 1110 1529 1545 1857 1459 1449 1049 738 632 -260 -668 -1320 -1442 -1781
1636a781P4M42j57j50Q31M21L90O60N48n7O10M1j45l31j49k24n54p08k19m32o07
1657a497K55l38k55N2N25K84p8J038L70K34N17M50O7j94J82%m71p07mn75m43o22
1679a210j27k36q1qM2K29N35N68J60M78P51J34M71k57L51k27l26k36o31m86r3
1700a99m85n75j08j13l27n9P61m5N51O00K10N71J62N79M3K03Q0l07l32n5p48o18
1722b11k83m48m26j12l07J37N8M61K08O70M45M86N14K43L2L5J57j69q1l20q18
1743B71q5o96k47o97l20K70k62K23L12L59j8R49N94N1K27M13M44Q2l96j0n01m37
1765E26l66l85o01n88j29m8j86R3K24N07L12M72N39P12L01KR7K77k41j74j18l45
1787H81o64m56o66N7o73l75L95k5k4K22Q54K17K54N46N98P3K63j5j90K01k68l16
$$ plain form
1636 -1781 -1707 -1265 -1422 -1572 -741 -320 70 730 1278 1221 1831 1872 1727 1396 1247 1023 469 -239 -458 -890 -1497
1657 -1497 -1242 -1580 -1835 -1783 -1258 -974 -1052 -14 356 590 1107 1557 1624 1430 1612 1612 1141 434 430 -145 -588 -1210
1679 -1210 -1337 -1573 -1654 -1662 -1620 -1391 -856 -288 -128 350 1101 1235 1706 1449 1800 1573 1247 1011 380 -106 -199
1700 -199 -684 -1259 -1367 -1480 -1807 -1866 -1105 -1150 -599 1 211 782 944 1523 1566 1769 1849 1542 1210 1155 407 -211
1722 -211 -494 -942 -1368 -1480 -1787 -1650 -1592 -1131 -923 -253 192 678 1192 1435 1467 1502 1659 1490 1409 1089 271
1743 271 186 -510 -757 -1454 -1774 -1504 -1766 -1543 -1231 -872 -890 59 653 704 931 1344 1788 1870 1474 1464 963 526
1765 526 160 -225 -826 -1414 -1543 -1591 -1777 -1684 -1460 -953 -641 -169 370 1082 1383 1385 1482 1759 1518 1344 1226 881
1787 881 217 -239 -905 -848 -1521 -1896 -1501 -1526 -1550 -1328 -474 -257 -3 543 1141 1214 1477 1462 1272 1473 1205 889
1809H89n51o36n3l78o68k08k00J75K92R3K12O20L77N31O35K54J14J37o5n6l86
1830A128J06q80j03j036J1k35m09jj09K73qO04R9M24N31J42N02K40j8M47m03k92
1852A013qn03m37j43m29j54n76r7m5J14k1K68K93N17P2N39K92J84M25k22L13k08
1874A187q9n77j44k92n92j31n12l71K53K93m69L77Q8K42N22L79O42p1L36K08L09
1895A588l56l8l88j7m88k85k58o27M9l35j03Jp9K48L89K59O67j13R05J74K7j38
1917A082L87k30j60k41m73p33J33k93l79l31J76j85k29K64K07N39j20O97N84J93
1937H88K00K75j55O5l70K38n06m92n20j7l08m46l56j44J14J30L63K40O82o1N03
1958C23M50K47J55L97k54J56k90j44o13k85n21n09O4n56j70J57L08l69P37J01
$$ plain form
1809 889 338 -298 -351 -729 -1397 -1605 -1805 -1630 -1338 -1245 -1033 -413 -36 495 1130 1384 1498 1635 1570 1514 1128
1830 1128 1234 354 251 -785 -774 -1009 -1418 -1419 -1528 -1255 -1263 -659 -560 -136 395 537 1039 1279 1261 1708 1305 1013
1852 1013 1005 502 65 -78 -507 -661 -1237 -1334 -1379 -1265 -1286 -1018 -725 -208 -136 403 695 879 1304 1082 1395 1187
1874 1187 1098 521 377 85 -507 -638 -1150 -1521 -1268 -975 -1444 -1067 -979 -737 -215 164 806 735 1071 1279 1588
1895 1588 1232 1194 806 789 301 16 -242 -869 -820 -1155 -1258 -1257 -1336 -1088 -699 -440 227 114 1019 1193 1220 1082
1917 1082 1469 1239 1079 838 365 -368 -235 -528 -907 -1238 -1062 -1247 -1476 -1212 -1005 -466 -586 111 695 888
1937 888 1088 1363 1208 1273 903 1141 635 143 -377 -394 -702 -1148 -1504 -1648 -1534 -1404 -1041 -801 -119 -180 323
1958 323 773 1020 1175 1572 1318 1474 1184 1040 427 142 -379 -888 -824 -1380 -1550 -1393 -1085 -1454 -717 -616
1978f16P84K99K38Q6O74j35P0J21l45l43j98m05m02o65L2k91l22j77M97q5L69
1999h14L32K6L81N16K98M82J63k40M80m48r2n47j81o98k55o7m11k74K80k99L9
2020a329L59K09O03K54M07L41K81o4M66j06l18J84o39k19k36o37l29k81p6k73
2040a403K73j81j8M97M11K83N69J74M35L69m9J79l82l78k5l10j75o88m8m07n06
2061a380K3L80k53J2K43M27K22M89L40K73k25P20J35r0j65j94o17j2n01l50m1
2082e64j45k40j51K5j74K94K61J80M34K49N07K89L2O7K65j86n20j37P3l29n16
2103b86o1m08j39rk50K46K50o1K65L88J00O30k63N25K95j73j21K9l42l1k41k42
2125A01l92l47l21Lm10K45qM08kO12K9L70K50L25K6L94l87J91j4o20j25l4p29
$$ plain form
1978 -616 168 467 705 791 1465 1330 1400 1521 1176 833 635 230 -172 -837 -805 -1096 -1418 -1595 -1098 -1183 -814
1999 -814 -482 -456 -75 441 739 1221 1384 1144 1624 1176 1084 537 356 -342 -597 -664 -1075 -1349 -1069 -1368 -1329
2020 -1329 -970 -761 -158 96 503 844 1125 1061 1527 1421 1103 1287 648 429 193 -444 -773 -1054 -1130 -1403
2040 -1403 -1130 -1311 -1329 -832 -421 -138 431 605 1040 1409 1360 1539 1157 779 754 444 269 -419 -467 -874 -1380
2061 -1380 -1357 -977 -1230 -1218 -975 -548 -326 163 503 776 551 1271 1406 1316 1151 957 340 328 -173 -523 -564
2082 -564 -709 -949 -1100 -1075 -1249 -955 -694 -514 -80 169 676 965 997 1064 1329 1143 623 486 559 230 -286
2103 -286 -347 -755 -894 -903 -1153 -907 -657 -718 -453 -65 35 665 402 927 1222 1049 928 957 615 584 343 101
2125 101 -291 -638 -959 -956 -1366 -1121 -1129 -721 -723 -111 -82 288 538 863 889 1283 896 1087 1073 453 328 294 -435
2148d35lk45l13O8k13MJ10J76J38M95M47K39K49m6N95O8l43P6n7l01l24l38m74
2171d27k01j90k01q4j91r8M47M27J33J18P16j38N55L56k12L41l84k30J83l79l70
2192A71n71p7p2m78j05q8L20j18L76m3K04N32O14j03K62L08Q0j04q4k2o12j25
2214B65k03o84k23n3K02m11j17L26K15nN20K3M58N27K23O2j23J3L36q55J58l19
2236C35n81k82j56k52k34J90L1j27J80M36R1N99J9M66L98l20N55k16j00m0m60
2257E32l78N7o10k31k7l11K6j49K3M10qL09K57J03L78M18L29L18l33k19r5J29
2279I28l43n04o4n79l14Q1j90J5p2K27o1L26M28L83j42N18K12L3L76k28Kl04o6
2302F62n62k22L6n19j50J64j58j69q6L40Q9N8L94M34j71N34KN1M09k64o8j92l83
$$ plain form
2148 -435 -438 -683 -996 -928 -1141 -1137 -1027 -851 -713 -218 229 468 717 671 1266 1334 991 1067 1010 709 385 47 -427
2171 -427 -628 -818 -1019 -1103 -1294 -1392 -945 -518 -385 -267 449 311 866 1222 1010 1351 967 737 920 541 171
2192 171 -400 -477 -549 -1027 -1132 -1220 -900 -1018 -642 -685 -481 51 665 562 824 1132 1212 1108 1024 1002 390 265
2214 265 62 -622 -845 -898 -696 -1107 -1224 -898 -683 -688 -168 -145 313 840 1063 1125 1002 1015 1351 496 654 335
2236 335 -246 -528 -684 -936 -1170 -980 -949 -1076 -896 -460 -369 230 249 715 1113 793 1348 1132 1032 992 532
2257 532 154 211 -399 -630 -657 -968 -942 -1091 -1068 -658 -666 -357 -100 3 381 799 1128 1446 1113 894 799 928
2279 928 585 81 17 -562 -876 -795 -985 -970 -1042 -815 -876 -550 -122 261 119 637 849 882 1258 1030 1032 728 662
2302 662 100 -122 -86 -605 -755 -591 -749 -918 -1004 -664 -575 -517 -123 311 140 674 676 727 1136 872 804 612 229
2325B29k3k47m12j19rl21M6k54K41N73k31K32K95L34K26M2J3L30M2j1j23m88m42
2348g7K18l77m99j62l3K93k29p0K37O5L02K01M72J61J55L22l4l16L31n03J97l24
2370C30k23j64l70k27j14l2J14l89j0L50K43K83K9O91R9K95J23j13p4N9j45m74
2392B81j73l51J63o16q7k0j62k9J03P5K22N32K7L30N9L14K25J38l67K56n5l5m95
2415C35m05j1l25m1l12rk03J15Q2J61L91Q5K89M1L02N62k7p9O0l01k01n2l92j36
2439g1j7o28l24J49o2j27J93L78J54J80L27K13K58L49J4j44m7J65k76m47p9j32
2461B6m52R5k56l81K81l44J11j4L94L41%K32K82M63R6j56j00k3K57o6l98j03k65
2484B0k29k45l24J49l51l01N69L20L8j09N99o3K46O01q4Q4l00L25l15k71l28j44
$$ plain form
2325 229 206 -41 -453 -572 -581 -902 -856 -1110 -869 -296 -527 -295 0 334 560 602 615 945 987 976 853 365 -77
2348 -77 141 -236 -735 -897 -930 -637 -866 -936 -699 -634 -332 -131 341 502 657 979 945 629 960 457 654 330
2370 330 107 -57 -427 -654 -768 -800 -686 -1075 -1085 -735 -492 -209 -180 511 610 905 1028 915 841 900 755 281
2392 281 108 -243 -80 -696 -783 -803 -965 -994 -891 -816 -594 -62 -35 295 354 668 893 1031 664 920 865 830 335
2415 335 -70 -81 -406 -447 -759 -768 -971 -856 -774 -613 -222 -137 152 193 495 1057 1030 951 1011 710 509 457 65 -71
2439 -71 -88 -716 -1040 -891 -953 -1080 -887 -509 -355 -175 152 365 623 972 986 842 795 960 684 237 158 26
2461 26 -426 -331 -587 -968 -687 -1031 -920 -934 -540 -199 -199 33 315 778 874 718 618 595 852 786 388 285 20
2484 20 -209 -454 -778 -629 -980 -1281 -712 -392 -354 -463 136 73 319 920 836 920 620 945 630 359 31 -113
2506a13J5m74k19r2k48J64k35M73M09J42J66K24L36k2P8L52j03j47K09m71m3m61
2528f0k9m48k87J47l29J55J18k7K17p3L14M87M6M72J17j20J40k24L82o64j21J05
2550C18j34n77l1k09k81m01O29o4j5J76L62K03M39L10np4j35L04j46L0j04l81
2572B14m80n6k51J79n65L41j59k2K04O7m9M90K61j25M54R5L51l23k5J7J48l54
2594D12k92k79k49l64p8K52l44J14J34J38K4K16K00M24K81L0J34J00m1j17j33
2615E62K9l76m46r3O5l66l61N9nK27O7r1N08q9N99J94J81j12J79K7K8l6l99J39
2639D90m74q7k42j84J60l01j68J31J27K93l5K16L17J02MM38j73L99J12o80P6l4
2661D87n01j64lj40l73k76J99j66L88l9K12J72J28K76J78K39Q2K55k83J42k46
$$ plain form
2506 -113 -98 -572 -791 -883 -1131 -967 -1202 -729 -320 -178 -12 212 548 526 604 956 853 706 915 444 401 -60
2528 -60 -89 -537 -824 -677 -1006 -851 -733 -760 -543 -616 -302 185 231 703 820 700 840 616 998 334 213 318
2550 318 184 -393 -424 -633 -914 -1315 -686 -750 -765 -589 -227 -24 415 725 720 646 511 815 669 699 595 214
2572 214 -266 -322 -573 -394 -959 -618 -777 -799 -595 -528 -577 -87 174 49 503 598 949 626 601 618 766 412
2594 412 120 -159 -408 -772 -850 -598 -942 -828 -694 -556 -532 -316 -116 308 589 619 753 853 812 695 562
2615 562 591 215 -231 -324 -259 -625 -986 -927 -932 -705 -638 -729 -221 -310 289 483 664 552 731 758 786 750 351 490
2639 490 16 -71 -313 -497 -337 -638 -806 -675 -548 -255 -290 -74 243 345 349 787 614 1013 1125 445 521 487
2661 487 -14 -178 -181 -321 -694 -970 -771 -937 -549 -588 -376 -204 -76 200 378 617 699 954 671 813 567
2682E67r6Q0n61l14r2m65J09M3q1R7J74k2N64r1L63O2K51Q6J45J13k68K6k35K42
2706F97n96n9l92o6l94M1j5m8R4J69K81L01J91J41J17J95K91j48P8j39k33p7j55
2729B74n26k69K50k14j73k33m2K54J8J61L21L93j7O9L63J56J4P3l13J94k25k19
2751C09p5l52j42n36J73l5N1k00J5J23M25K44r0L50L20j82M3K01O3j39K04n30
2773B40o1m73pN0m24k31J47P4j16M76k01J50O13JK63J19O6R8k10J4L5l17j54k23
2797g1p4k34k53KL60m78O7J42J36K6N05L4R1L21j23K07N4J33j96kl57N3k42l01
2821b00j10j41n4n5k28J19m3L64M3J93K05L86j91N66J1j24k09l64L98n06O9j61
2843c2m17m8k48l3j5JJ89L60O1J22K32L65N2KP5N8J33j86l22j90L4j90k61j58
$$ plain form
2682 567 471 551 -10 -324 -416 -881 -772 -729 -810 -713 -539 -561 3 -88 275 337 588 674 819 932 664 690 455 697
2706 697 101 42 -350 -416 -810 -769 -784 -832 -738 -569 -288 13 204 345 462 657 948 800 878 739 506 429 274
2729 274 -252 -521 -271 -485 -658 -891 -933 -679 -661 -500 -179 214 197 266 629 785 799 872 559 753 528 309
2751 309 234 -118 -260 -796 -623 -658 -607 -807 -792 -669 -244 0 -90 260 580 398 441 642 705 566 770 240
2773 240 179 -294 -301 -251 -675 -906 -759 -685 -801 -325 -526 -376 237 238 501 620 686 784 574 588 623 306 152 -71
2797 -71 -145 -379 -632 -630 -270 -748 -681 -539 -403 -377 128 162 253 574 451 658 712 845 649 647 290 343 101 -200
2821 -200 -310 -451 -505 -560 -788 -669 -712 -348 -305 -112 93 479 288 854 865 741 532 168 566 60 129 -32
2843 -32 -449 -497 -745 -778 -793 -792 -603 -243 -182 -60 172 537 589 591 666 724 857 671 349 159 193 3 -258 -416
2867d16K0m54K85j64P4L18j9J39M48J58L79k17K95M5n80K34k56J10p4l31j89j00
2889b95m77Q2l5L3Q8kJ77K73K85K38K79k16PJ93J4k01N6p8k49q9j39n05p3j55
2913g89r6M1J57L09MJ62K24K94K08j19P6nqQ8n0j50O0k97l4k73k43l49J99k68
2937h59M38q6l7K11o1M13L70j60K81K13N4j20Q1l47J6j40k10m57J74j42l92j65
2959i25L13m6L09J21M6L21p3K39K90m9J4J21j02lk32Nj66m25K6l43J76k21j24
2982g28q9L00j66J02M16L96j19K06R0K40l2J5Nj45L2k88k37j19k66k48L3O2J0
3005e30j14K67M2J91j10L61K72j69L19J02J21L2j90l41j28n9l63k76K07k15j54
3026g35j4K19J36J8J26Q7L38J10%N0K69k32M35j24k17l67K01m04J6k86k26j13
$$ plain form
2867 -416 -396 -850 -565 -729 -655 -337 -356 -217 231 389 768 551 846 891 311 545 289 399 325 -6 -195 -295
2889 -295 -772 -690 -725 -692 -604 -606 -429 -156 129 367 646 430 437 630 644 443 499 421 172 83 -56 -561 -634 -789
2913 -789 -885 -844 -687 -378 -374 -212 12 306 514 395 471 466 458 546 496 346 406 109 75 -198 -441 -790 -591 -859
2937 -859 -421 -507 -544 -333 -394 19 389 229 510 723 777 657 738 391 407 267 57 -400 -226 -368 -760 -925
2959 -925 -612 -658 -349 -228 -182 139 66 305 595 546 560 681 579 576 344 349 183 -242 -216 -559 -383 -604 -728
2982 -728 -817 -517 -683 -581 -165 231 112 318 408 648 616 631 636 491 523 235 -2 -121 -387 -635 -602 -540 -530
3005 -530 -644 -377 -335 -144 -254 107 379 210 529 631 752 784 594 253 125 66 -297 -573 -366 -581 -735
3026 -735 -749 -530 -394 -376 -250 -163 175 285 285 335 604 372 807 683 466 99 300 -104 -88 -374 -600 -713
$$ [...]
8191b5
##END NTUPLES=NMR FID
##END=
