##TITLE=1H_LR-784-R2-REG1
 200.13MHz, CDCl3,
 8 sc
 
 22.1.2025
##JCAMPDX= 6.0         $$ Bruker NMR JCAMP-DX V2.0
##DATA TYPE= NMR FID
##DATA CLASS= NTUPLES
##ORIGIN= UXNMR, Bruker Analytische Messtechnik GmbH
##OWNER= pz
$$ XWIN-NMR		Version 3.5
$$ Wed Jan 22 13:59:53 2025 Russian Standard Time (UT+4h)  she@DPX200
##.OBSERVE FREQUENCY= 200.1313
##.OBSERVE NUCLEUS= ^1H
##.DELAY= (6, 6)
##.ACQUISITION MODE= SIMULTANEOUS
##.ACQUISITION SCHEME= undefined
##.AVERAGES= 8
##.DIGITISER RES= 18
##SPECTROMETER/DATA SYSTEM= spect
##.PULSE SEQUENCE= zg30
##.SOLVENT NAME= D2O
##.SHIFT REFERENCE= (INTERNAL, D2O, 0, 14.3821)
##AUDIT TRAIL= $$ (NUMBER, WHEN, WHO, WHERE, WHAT)
$$ ##TITLE= Audit trail, XWIN-NMR		Version 3.5
$$ ##JCAMPDX= 5.01
$$ ##ORIGIN= Bruker BioSpin GmbH
$$ ##OWNER= she
$$ F:/spectra/data/she/nmr/H-C/1/audita.txt
$$ ##AUDIT TRAIL=  $$ (NUMBER, WHEN, WHO, WHERE, WHAT)
(   1,<2025-01-22 13:58:58.70 +0400>,<she>,<DPX200>,
      <created by zg, POWCHK disabled, PULCHK disabled
       configuration hash MD5:
       00 E9 B6 7A A2 85 ED C7 34 08 36 98 17 FE 4E 26
       data hash MD5: 16K
       F3 36 F3 C5 54 FB 61 69 A7 FC 4C 8D 8F 17 5E 6A>)
$$ ##END=
$$ 
$$ hash MD5
$$ 72 8A D0 EE 9C 67 3F 59 E0 07 D1 19 1C A9 D0 55
##$RELAX= 
##$RELAX= 
##$RELAX= 
##$RELAX= 
##$RELAX= 
##$RELAX= 
$$ Bruker specific parameters
$$ --------------------------
##$DU= <F:/spectra>
##$EXPNO= 1
##$NAME= <H-C>
##$PROCNO= 1
##$TYPE= <nmr>
##$USER= <she>
##$AMP= (0..31)
100 100 100 100 100 100 100 100 100 100 100 100 100 100 100 100 100 100 
100 100 100 100 100 100 100 100 100 100 100 100 100 100 
##$AQSEQ= 0
##$AQ_mod= 1
##$AUNM= <au_zg>
##$AUTOPOS= <>
##$BF1= 200.13
##$BF2= 200.13
##$BF3= 200.13
##$BF4= 200.13
##$BF5= 200.13
##$BF6= 200.13
##$BF7= 200.13
##$BF8= 200.13
##$BYTORDA= 1
##$CFDGTYP= 0
##$CFRGTYP= 5
##$CHEMSTR= <none>
##$CNST= (0..31)
1 1 145 1 1 1 1 1 1 1 1 1 1 1 1 1 1 1 1 1 1 1 1 1 1 1 1 1 1 1 1 1 
##$CPDPRG= <>
##$CPDPRG1= <>
##$CPDPRG2= <>
##$CPDPRG3= <>
##$CPDPRG4= <mlev>
##$CPDPRG5= <mlev>
##$CPDPRG6= <mlev>
##$CPDPRG7= <mlev>
##$CPDPRG8= <mlev>
##$CPDPRGB= <>
##$CPDPRGT= <>
##$D= (0..31)
0 0.7 0 0 0 0 0 0 0 0 0 0.03 0 0 0 0 0 0 0 0 0 0 0 0 0 0 0 0 0 0 0 0 
##$DATE= 1737539938
##$DBL= (0..7)
120 120 120 120 120 120 120 120 
##$DBP= (0..7)
150 150 150 150 150 150 150 150 
##$DBP07= 0
##$DBPNAM0= <>
##$DBPNAM1= <>
##$DBPNAM2= <>
##$DBPNAM3= <>
##$DBPNAM4= <>
##$DBPNAM5= <>
##$DBPNAM6= <>
##$DBPNAM7= <>
##$DBPOAL= (0..7)
0.5 0.5 0.5 0.5 0.5 0.5 0.5 0.5 
##$DBPOFFS= (0..7)
0 0 0 0 0 0 0 0 
##$DE= 6
##$DECBNUC= <off>
##$DECIM= 32
##$DECNUC= <off>
##$DECSTAT= 4
##$DIGMOD= 1
##$DIGTYP= 9
##$DL= (0..7)
0 120 120 120 120 120 120 120 
##$DP= (0..7)
150 150 150 150 150 150 150 150 
##$DP07= 0
##$DPNAME0= <>
##$DPNAME1= <>
##$DPNAME2= <>
##$DPNAME3= <>
##$DPNAME4= <>
##$DPNAME5= <>
##$DPNAME6= <>
##$DPNAME7= <>
##$DPOAL= (0..7)
0.5 0.5 0.5 0.5 0.5 0.5 0.5 0.5 
##$DPOFFS= (0..7)
0 0 0 0 0 0 0 0 
##$DQDMODE= 0
##$DR= 18
##$DS= 0
##$DSLIST= <SSSSSSSSSSSSSSS>
$$ [...]
##$SUBNAM0= <"">
##$SUBNAM1= <"">
##$SUBNAM2= <"">
##$SUBNAM3= <"">
##$SUBNAM4= <"">
##$SUBNAM5= <"">
##$SUBNAM6= <"">
##$SUBNAM7= <"">
##$SUBNAM8= <"">
##$SUBNAM9= <"">
##$SW= 18.0517328524113
##$SWIBOX= (0..15)
0 0 2 0 0 0 0 0 0 0 0 0 0 0 0 0 
##$SW_h= 3612.71676300578
##$TD= 16384
##$TD0= 1
##$TE= 0
##$TE2= 300
##$TE3= 300
##$TEG= 300
##$TL= (0..7)
0 120 120 120 120 120 120 120 
##$TP= (0..7)
150 150 150 150 150 150 150 150 
##$TP07= 0
##$TPNAME0= <>
##$TPNAME1= <>
##$TPNAME2= <>
##$TPNAME3= <>
##$TPNAME4= <>
##$TPNAME5= <>
##$TPNAME6= <>
##$TPNAME7= <>
##$TPOAL= (0..7)
0.5 0.5 0.5 0.5 0.5 0.5 0.5 0.5 
##$TPOFFS= (0..7)
0 0 0 0 0 0 0 0 
##$TUNHIN= 0
##$TUNHOUT= 0
##$TUNXOUT= 0
##$USERA1= <user>
##$USERA2= <user>
##$USERA3= <user>
##$USERA4= <user>
##$USERA5= <user>
##$V9= 5
##$VALIST= <valist>
##$VCLIST= <CCCCCCCCCCCCCCC>
##$VD= 0
##$VDLIST= <DDDDDDDDDDDDDDD>
##$VPLIST= <PPPPPPPPPPPPPPP>
##$VTLIST= <TTTTTTTTTTTTTTT>
##$WBST= 1024
##$WBSW= 4
##$XGAIN= (0..3)
0 0 0 0 
##$XL= 0
##$YL= 0
##$YMAX_a= 342864
##$YMIN_a= -393737
##$ZGOPTNS= <>
##$ZL1= 120
##$ZL2= 120
##$ZL3= 120
##$ZL4= 120
##$ABSF1= 10
##$ABSF2= 0
##$ABSG= 5
##$ABSL= 3
##$ALPHA= 0
##$AQORDER= 0
##$ASSFAC= 0
##$ASSFACI= 0
##$ASSFACX= 0
##$ASSWID= 0
##$AUNMP= <proc_1d>
##$AZFE= 0.1
##$AZFW= 0.1
##$BCFW= 1
##$BC_mod= 2
##$BYTORDP= 1
##$COROFFS= 0
##$CY= -3
##$DATMOD= 1
##$DC= 2
##$DFILT= <>
##$DTYPP= 0
##$F1P= 0
##$F2P= 0
##$FCOR= 0.5
##$FTSIZE= 0
##$FT_mod= 4
##$GAMMA= 1
##$GB= 0.15
##$INTBC= 1
##$INTSCL= 1
##$ISEN= 128
##$LB= 0.25
##$LEV0= 0
##$LPBIN= 0
##$MAXI= 10000
##$MC2= 0
##$MEAN= 0
##$ME_mod= 0
##$MI= 1.114404
##$NCOEF= 0
##$NC_proc= 0
##$NLEV= 6
##$NOISF1= 3.799351
##$NOISF2= 2.8
##$NSP= 1
##$NTH_PI= 0
##$NZP= 0
##$OFFSET= 14.38212
##$PC= 1
##$PHC0= 252.585
##$PHC1= 10.7922
##$PH_mod= 1
##$PKNL= yes
##$PPARMOD= 0
##$PSCAL= 0
##$PSIGN= 0
##$REVERSE= no
##$SF= 200.129724274929
##$SI= 16384
##$SIGF1= 3
##$SIGF2= 2
##$SINO= 400
##$SIOLD= 16384
##$SREGLST= <1H.CDCl3>
##$SSB= 0
##$STSI= 0
##$STSR= 0
##$SW_p= 3205.1282051282
##$SYMM= 0
##$S_DEV= 0
##$TDeff= 0
##$TDoff= 0
##$TI= <>
##$TILT= no
##$TM1= 0
##$TM2= 0
##$TOPLEV= 0
##$USERP1= <user>
##$USERP2= <user>
##$USERP3= <user>
##$USERP4= <user>
##$USERP5= <user>
##$WDW= 1
##$XDIM= 8192
##$YMAX_p= 0
##$YMIN_p= 0
$$ End of Bruker specific parameters
$$ ---------------------------------
##NTUPLES= NMR FID
##VAR_NAME=  TIME,          FID/REAL,        FID/IMAG
##SYMBOL=    X,             R,               I
##VAR_TYPE=  INDEPENDENT,   DEPENDENT,       DEPENDENT
##VAR_FORM=  AFFN,          ASDF,            ASDF
##VAR_DIM=   8192,          8192,            8192
##UNITS=     SECONDS,       ARBITRARY UNITS, ARBITRARY UNITS
##FACTOR=    0.0002768,     1,               1
##FIRST=     0,             0,               0
##LAST=      2.2672688,     0,               0
##MIN=       0,             -393737,         0
##MAX=       2.2672688,     342864,          0
$$ Real data points
##PAGE= N=1
##DATA TABLE= (X++(R..R)), XYDATA
$$ [...]
1936I38j37q1l95k31k26l15k88l56Rj36p6J88L34M84K41M86K90l74O88OK96n76
$$ 938 801 720 325 94 -132 -447 -735 -1091 -1082 -1218 -1294 -1106 -772 -288 -47 439 729 355 1043 1049 1345 769
1958G69L21j9n48m78j98n58j26j51l58l15O60o1K9O44N95p8J55P62J62q2J76J48
$$ 769 1090 1071 523 45 -153 -711 -837 -988 -1346 -1661 -1001 -1062 -1033 -389 206 128 283 1045 1207 1125 1301 1449
1980A449o61j12k64j16j000R8j50n02j4k45M80l50M29N96K68M09M23L71j32R7
$$ 1449 788 676 412 296 -704 -606 -756 -1258 -1272 -1517 -1037 -1387 -958 -362 -94 315 738 1109 977 1074
2000A074J26J85m85k19m61k04j29j11p55m0j5J09m22R8O00J57J32O18M13j29M06
$$ 1074 1200 1385 900 681 220 16 -113 -224 -979 -1019 -1034 -925 -1347 -1249 -649 -492 -360 258 671 542 948
2021I48K98m53j6K71l03m04k67j63o02n0j57l50K14LM32m3J78O46J21J7M53L73
$$ 948 1246 793 777 1048 745 341 74 -89 -691 -741 -898 -1248 -1034 -1031 -599 -642 -464 182 303 320 773 1146
2043A146l90J38L21m94l49J73l29p89jl4j94l15N99k55l69M38Q91l18J66N26J85
$$ 1146 756 894 1215 721 372 545 216 -573 -574 -608 -802 -1117 -518 -773 -1142 -704 187 -131 35 561 746
2064G46r7J05J55k14J2j49j54m79j0m4o71j8J48l11P9L15K19k78M16M44K12P5
$$ 746 649 754 909 695 707 558 404 -75 -85 -129 -800 -818 -670 -981 -902 -587 -368 -646 -230 214 426 501
2086E01K11L32k22k43J90q0l45J29k40o22J19q8k81l30M67k90j58K33P51l81R8
$$ 501 712 1044 822 579 769 689 344 473 233 -389 -270 -358 -639 -969 -502 -792 -950 -717 34 -347 -249
2107b49M86r0J70L71Oj43pL21j82o49m0J00o38P7J58o55J43J22J91k55rO82K81
$$ -249 237 147 317 688 694 551 544 865 683 34 -6 94 -544 -467 -309 -964 -821 -699 -508 -763 -772 -90 191
2130A91k95N16L20j57J89L27n70j01Q6l03l73j84K15n92o5K74m80J54R4K70M23
$$ 191 -104 412 732 575 764 1091 521 420 506 203 -170 -354 -139 -731 -796 -522 -1002 -848 -754 -484 -61
2151f1m21Q31J07j29K40K11j4%J32m10l68L22l04o26k68L33k35l72K51K24l10
$$ -61 -482 349 456 327 567 778 764 764 896 486 118 440 136 -490 -758 -425 -660 -1032 -781 -557 -867
2172h67L86L20K56K07J41L90k84P9M05j58m43k9k87j80k07k92k32l58K61J49J2
$$ -867 -481 -161 95 302 443 833 549 628 1033 875 432 403 116 -64 -271 -563 -795 -1153 -892 -743 -731
2193g31K55N1Q5K23N29L89l54N79NJ87l15k7m14l13j92om28l58o6o6J7L02K70
$$ -731 -476 -425 -340 -117 412 801 447 1026 1031 1218 903 876 462 149 -43 -49 -477 -835 -901 -967 -950 -648 -378
2216c78k69L32M38P6N15K04l60j9J41J38k24k78j51j34j21o09J71k63n1J7k2m3
$$ -378 -647 -315 123 199 714 918 558 539 680 818 594 316 165 31 -90 -699 -528 -791 -842 -825 -847 -890
2238h90K52N72L5J01K84M55j13R6J69m24J02J75m86k63k77k55l4k53Q7j99J63
$$ -890 -638 -66 -31 70 354 809 696 792 961 537 639 814 328 65 -212 -467 -501 -754 -667 -866 -703
2259g03P5L12J8K00Q4P30m6lO2k87L22j28K0m74j20r4l76p0j25l58J12j11L06
$$ -703 -628 -316 -298 -98 -14 716 670 667 729 442 764 636 656 182 62 -32 -408 -478 -603 -961 -849 -960 -654
2282f54j50M36P9L17J72K89L7k9J0k1N7Q5j91m01k57l43K82l16j10mL4J93m7K03
$$ -654 -804 -368 -289 28 200 489 526 497 507 486 543 628 437 36 -221 -564 -282 -598 -708 -712 -678 -485 -532 -329
2306c29m4L70J33J66O8K73l9K61j61o9p3n76m4j75r4Ol05J86k0j41K00J30K0o
$$ -329 -373 -3 130 296 364 637 598 859 698 629 556 -20 -64 -239 -333 -327 -632 -446 -466 -607 -407 -277 -257 -263
2330b63J30K19K40oK82M6o9p0j71N0m8n55j49K21l00R3l32J69Rj18K11QJ95M75
$$ -263 -133 86 326 320 602 648 579 509 338 388 340 -215 -364 -143 -443 -350 -682 -513 -504 -622 -411 -403 -208 267
2354B67j28M01k17N13J64m41j54J82k28j84l20n2j49k70j9Nl0J73J14K55OL31
$$ 267 139 540 323 836 1000 559 405 587 359 175 -145 -197 -346 -616 -635 -630 -660 -487 -373 -118 -112 219
2376B19K8Q9k03O14k22L4r3R5k61k64K75l42j46k14M8k93J69l61K49L94K7L08
$$ 219 247 336 133 747 525 559 466 561 300 36 311 -31 -177 -391 -343 -636 -467 -828 -579 -185 -158 150
2398A50O8J63J58K3O1J20Qk23n9j67k75J93p49K6k19K7m5J54j08J78K32k6M18
$$ 150 218 381 539 562 623 743 751 528 469 302 27 220 -529 -503 -722 -695 -740 -586 -694 -516 -284 -310 108
2421A08n0M45l5J30q5N5j98J64k26j33k42k25k5k00k6K1j26L1k1N31k5M79k76
$$ 108 58 503 468 598 513 568 370 534 308 175 -67 -292 -317 -517 -543 -522 -648 -617 -638 -107 -132 347 71
2444G1K91J59P6K23r4k37Q0k38k77K38j35k58n86K86k97r3J51K39l6L39M0K07
$$ 71 362 521 597 820 726 489 569 331 54 292 157 -101 -687 -401 -698 -791 -640 -401 -437 -98 -58 149
2466A49L02J76K5R3j54k83M75m65j47j55l0m74K65l08q6R8j30J87r2M51j17M79
$$ 149 451 627 652 745 591 308 783 318 171 16 -14 -488 -223 -531 -617 -519 -649 -462 -554 -103 -220 259
2488B59LK8%M2M7K03l23J28K3m58km12k9J15QJ32m23N42j49M5J5R7L18R4J11K25
$$ 259 262 290 290 332 379 582 259 387 410 -48 -50 -462 -491 -376 -368 -236 -659 -117 -266 -221 -206 -109 209 303 414 639
2514F39P1j75J70l44l7k39k34M7l45P2%k37J76j5l58N01K15m6q1M80J95l09K99
$$ 639 710 535 705 361 324 85 -149 -102 -447 -375 -375 -612 -436 -451 -809 -308 -93 -139 -220 260 455 146 445
2537D45K71l71m2K31m43k64K10m01J40l1j39k3k95K66L9L74m4K30LL7J50M52m09
$$ 445 716 345 303 534 91 -173 37 -364 -224 -255 -394 -417 -712 -446 -407 -33 -77 153 156 193 343 795 386
2560C86r7K17J02k47m28M46m20l30j8J00l16J80j81K90j58L61K59j91K27J84K5
$$ 386 289 506 608 361 -67 379 -41 -371 -389 -289 -605 -425 -606 -316 -474 -113 146 -45 182 366 391
2581C91J05j31K34l80O4N30r93K9O0l5j51l07J88j18J25K35J0j74L55K42J61K3
$$ 391 496 365 599 219 283 813 -180 -151 -91 -126 -277 -584 -396 -514 -389 -154 -144 -318 37 279 440 463
2603D63n2p1q0J24k72o0N1p0l58k7O1k60J12j03p1o6M23r6L73K93K54k48K35Q
$$ 463 411 340 260 384 112 52 103 33 -325 -352 -291 -551 -439 -542 -613 -679 -256 -352 21 314 568 320 555 563
2627E63l7K2l20K95l45k1k71k09l09L8J68l79N08KK52l0J83mL48j39J08J88pp8
$$ 563 526 548 228 523 178 157 -114 -323 -632 -594 -426 -805 -297 -295 -43 -73 110 106 454 315 423 611 604 526
2651E26k69M8p1l3j36Q8m85Q7rk31N1j51Q0J68J28J55O9J63L21k25N7K10l91K60
$$ 526 257 305 234 201 65 153 -332 -245 -254 -485 -434 -585 -505 -337 -209 -54 15 178 499 274 331 541 150 410
2675D10j27l03j34J42j10l24j67Q3J41j68P4L17m2K09j85L86L02N2j67O6j21j46
$$ 410 283 -20 -154 -12 -122 -446 -613 -530 -389 -557 -483 -166 -208 1 -184 202 504 556 389 455 334 188
2697A88M41m30j00l39k77N52m33n8q6O7No1O36k01J61q5J29K86j6N7k04L3j1j12
$$ 188 629 199 99 -240 -517 35 -398 -456 -542 -475 -470 -531 105 -96 65 -20 109 395 379 436 232 265 254 142
2721A42j12j27J39j65k61K5k43M2n6K13K68q1L28r5K17l1J89k1Q9j03J40j68j69
$$ 142 30 -97 42 -123 -384 -359 -602 -560 -616 -403 -135 -216 112 17 234 203 392 371 460 357 497 329 160
2744A60k41o5k20L09k67k7j86K0K67j22L52j40L54j8J74PQ7j52K66j96J02l00
$$ 160 -81 -146 -366 -57 -324 -351 -537 -517 -250 -372 -20 -160 194 176 350 357 444 292 558 362 464 164
2766A64l20N8k39m9k59M54j9k80J24L42l08J41M03j43K77j50N6R9Q6j74J74k23
$$ 164 -156 -98 -337 -386 -645 -191 -210 -490 -366 -24 -332 -191 212 69 346 196 252 351 437 263 437 214
2788B14n9k94M6j70j39N5j56K78%K8R4k30K86K2J40M47k41L48n04J79k37L31j91
$$ 214 155 -139 -93 -263 -402 -347 -503 -225 -225 -197 -103 -333 -47 -25 115 562 321 669 165 344 107 438 247
2811B47k56l25J24J40l40q3J72K4k35J00N71l08L47j82K12J31p9NJ48k19Nj21
$$ 247 -9 -334 -210 -70 -410 -493 -321 -297 -532 -432 139 -169 178 -4 208 339 260 265 413 194 199 78
2833G8m7l8j4k53J45k92l79M43j57J37L15j38K21O2M13q6m8J50r3l44OM25l83
$$ 78 31 -7 -21 -274 -129 -421 -800 -357 -514 -377 -62 -200 21 83 496 410 362 512 419 75 81 506 123
2856A23m3l7j72j63L2j1j98L53k76L1L00j7L58j6k06M06j58J00J84k99j6j62M6
$$ 123 80 43 -129 -292 -260 -271 -469 -116 -392 -361 -61 -78 280 264 58 464 306 406 590 291 275 113 159
2879A59l25k7k10l2j51J33N9J28K7M1K61l43M56J54J58m3J61j75N7j99j40k5k22
$$ 159 -166 -193 -403 -435 -586 -453 -394 -266 -239 -198 63 -280 176 330 488 445 606 431 488 289 149 124 -98
2902i8q6Q8k11oj25J03J11J88n4K03j14J58O3M19l19k09K38o6m4k61K79l03M5
$$ -98 -184 -96 -307 -313 -438 -335 -224 -36 -90 113 -1 157 220 639 320 111 349 283 239 -22 257 -46 -1
2925ak1l07j1N9j2R6j80q4M24j59k1N76p0R0j19J69k62K32m17J00k6j96R2j64
$$ -1 -22 -329 -340 -281 -293 -197 -377 -461 -37 -196 -217 359 289 379 260 429 167 399 -18 82 56 -140 -48 -212
2949b12k66J47m2j1J12k9K9J72J12j1L25K0J43k92J80J20m91P7j38n9L0j5R6k36
$$ -212 -478 -331 -373 -384 -272 -301 -272 -100 12 1 326 346 489 197 377 497 6 83 -55 -114 -84 -99 -3 -239
2973b39K41k73r2P7J7K27j95K98K80l95J39L59l22L83k64k05j4J16m96M00j30
$$ -239 2 -271 -363 -286 -269 -42 -237 61 341 -54 85 444 122 505 241 36 22 138 -358 42 -88
2994h8q7J8l06L06j41M7J7K76J93k48L41j39M9J90k29K63j13l15J04j00j24j58
$$ -88 -175 -157 -463 -157 -298 -251 -234 42 235 -13 328 189 238 428 199 462 349 34 138 38 -86 -244
3016b44P6k44R3K02r7k24L50O8O6l2J65j50J92p3j10L42m36L81j63k30n0J18o3
$$ -244 -168 -412 -319 -117 -214 -438 -88 -20 46 14 179 29 221 148 38 380 -56 325 162 -68 -118 0 -63
3039f3k19K03l6m78L21JK62L2k38L03q7K76J73k43J86l3l94J79k68J37q8k65J05
$$ -63 -282 -79 -115 -593 -272 -271 -9 23 -215 88 1 277 450 207 393 360 -34 145 -123 14 -74 -339 -234
3062b34k06J57J66j11J65k38K65N8K39l76L27j15K72m16J57o6n8J00l53M09k41
$$ -234 -440 -283 -117 -228 -63 -301 -36 22 261 -115 212 97 369 -47 110 44 -14 86 -267 142 -99
3083i9j31j18j56O9mL05j77J03N3J89j61K09n1J42L6mNj92j03J69K0n4j4k87P5
$$ -99 -230 -348 -504 -435 -439 -134 -311 -208 -155 34 -127 82 31 173 209 205 210 18 -85 84 104 50 36 -251 -176
3108a76L35k76p6K28l98J99J38O4J5M08j63n5J57k80l3J5j28M1j50Mk42p9OL50
$$ -176 159 -117 -193 35 -363 -164 -26 38 53 461 298 243 400 120 87 102 -26 15 -135 -131 -373 -452 -446 -96
3132i6o9r8J16J60Q6j77o7K51L01j49j29j11K20j4P0m39J72k35J1q7j75N7L12
$$ -96 -165 -263 -147 13 99 -78 -145 106 407 258 129 18 238 224 294 -145 27 -208 -197 -284 -459 -402 -90
3155i0j11J82p5j72P10l06R6j0J83k9L2j1r9q7j9o6k20l55J55q7K33r2j0J29k87
$$ -90 -201 -19 -94 -266 444 138 234 224 407 378 410 399 300 213 194 128 -92 -447 -292 -379 -146 -238 -248 -119 -406
3180d06M21M5j52J01L92k07m5k8K41j3j09l86K68m14L15l28K5J27m1j16N18n54
$$ -406 15 60 -92 9 401 194 149 121 362 349 240 -146 122 -292 23 -305 -280 -153 -194 -310 208 -346
3202c46K61J75P4rn6l5J95j95K9L02l08Jj52j99J28M9j98P9q3RKJ85l40L21N6
$$ -346 -85 90 164 155 99 64 259 64 93 395 87 88 -64 -263 -135 -86 -284 -205 -288 -279 -277 -92 -432 -111 -55
3227e5K39k17K85J63j10r3J10j76j13P6K8j74k2j12j54K04j57o2L83p0R0m11N94
$$ -55 184 -33 252 415 305 212 322 146 33 109 137 -37 -59 -171 -325 -121 -278 -340 43 -27 63 -348 246
3250B46j54j2L33k13L82j63l09J2n9j35k9k38P8N4l47M16j74K11Q0j69L27K75
$$ 246 92 80 413 200 582 419 110 122 63 -72 -101 -339 -261 -207 -554 -138 -312 -101 -21 -190 137 412
3272D12k57J8L8k8n1jJ25M3q0n39O0K95l6l76K05j31M9M8k44K47J27K95j31J86
$$ 412 155 173 211 183 132 131 256 299 219 -320 -260 35 -1 -377 -172 -303 -254 -206 -450 -203 -76 219 88 274
3296B74j19K15j15J4J4l90L11m2k45j00J46m90J87J29M5j61M09J7k01oQ6L10j98
$$ 274 155 370 255 269 283 -107 204 162 -83 -183 -37 -527 -340 -211 -166 -327 82 99 -102 -108 -22 288 90
3319I0K87N9l15j40p8J77p5j58L14k97j46M08m87p9O26o49J33M26m49L76J22j42
$$ 90 377 436 121 -19 -97 80 5 -153 161 -136 -282 126 -361 -440 186 -463 -330 96 -353 23 145 3
3341CK35l1J56j51k73J55r6M74n10Q7j68k20m7K13M1l96L36J8J70j86L3K13N8
$$ 3 238 207 363 212 -61 94 -2 472 -38 49 -119 -339 -386 -173 -132 -528 -192 -174 -4 -190 -157 56 114
3364A14MJ21m92L08J24j1M2m71K53r8l65N53k29j55j0K26j44K20N4Q7mk0K36m91
$$ 114 118 239 -253 55 179 168 210 -261 -8 -106 -471 82 -147 -302 -312 -86 -230 -10 44 131 127 107 343 -148
3388a48K91J60j92l5J26j62Q3K10j24l89o1j78M18J05l14o0J67J16K25K5r3K12
$$ -148 143 303 111 76 202 40 123 333 209 -180 -241 -419 -1 104 -210 -270 -103 13 238 263 170 382
3410C82j89J56j55r5R2l62L51k36k8j58q5J40j0J79k53N4M54k38J50k45L8L10
$$ 382 193 349 194 99 191 -171 180 -56 -84 -242 -327 -187 -197 -18 -271 -217 237 -1 149 -96 -58 252
3432B52j06J07j31K0kj94p7J57oj26n3Q5k61K04k21M30j47j11L67j37M7J24J00
$$ 252 146 253 122 142 140 -54 -131 26 20 -106 -159 -74 -335 -131 -352 78 -69 -180 187 50 97 221 321
3455C21j6j68j62mL97n97P6K44m05J80M9N72o79L36k45K21O5o4k92J54l9L06K20
$$ 321 305 137 -25 -29 368 -229 -153 91 -314 -134 -85 487 -192 144 -101 120 185 121 -171 -17 -56 250 470
3478D70m06J48J55m97J67J33k21k87M01j95k6J33k8j7J45q0j86M6j19K06o1L02
$$ 470 64 212 367 -130 37 170 -51 -338 63 -132 -158 -25 -53 -70 75 -5 -191 -145 -264 -58 -119 183
3500A83pM8k34j82J92N2j37K33k31j14K0L15l82K18Pj38N3m5M61n51K14Q6r5K88
$$ 183 176 224 -10 -192 0 52 -85 148 -83 -197 -177 138 -244 -26 -19 -157 -104 -149 312 -239 -25 61 -34 254
3524B54j57k66r6K84j26l7j09M11o18M33k08R7j00K00q2j5K24J1P3l7O0NM8p2
$$ 254 97 -169 -265 19 -107 -144 -253 158 -460 -27 -235 -138 -238 -38 -120 -135 89 100 173 136 196 201 249 177
3548A77j19M3j05j36j72K7N8j4n3L00r1J78m5L4J11l94K09K4J37L3j51j02J82
$$ 177 58 101 -4 -140 -312 -285 -227 -241 -294 6 -85 93 48 82 193 -201 8 32 169 202 51 -51 131
3571A31j55l2K02J18P3m93K4J95k20j14L07j68K23r0N1J6J74j56L1Oq0J73k15
$$ 131 -24 -56 146 264 337 -156 -132 63 -157 -271 36 -132 91 1 52 68 242 86 117 123 43 216 1
3594AJ38k5k02o8m6K38r4j02N9n1J59O7J70j27o4NJ65j95j95M16n3l63K66K03
$$ 1 139 114 -88 -156 -202 36 -58 -160 -101 -152 7 74 244 117 53 58 223 28 -167 249 196 -167 99 302
3618C02m46K01k57l2L29k10l88J10L28P2Oq1J74r6N4l44L19J24J34k31r7k5j46
$$ 302 -144 57 -200 -232 97 -113 -501 -391 -63 9 15 -66 108 12 66 -278 41 165 299 68 -29 -54 -200
3641b00J19k55L0K62O2j36J10j59M59m48J8J45K42l7j0p7L5J3k14k2P6k3L19j22
$$ -200 -81 -336 -306 -44 18 -118 -8 -167 292 -156 -138 7 249 212 202 125 160 173 -41 -63 13 -10 309 187
3665A87l74J08J01n4J4n7j22K99m31L39P7K40j63j95J47J9NJ62k28n6k20K29k0
$$ 187 -187 -79 22 -32 -18 -75 -197 102 -329 10 87 327 164 -31 116 135 140 302 74 18 -202 27 7
3688Gj59K18k46J44lK46J98n74J77K1j9K0k67J28J66O3J11k65K59j31q2k3n9j39
$$ 7 -152 66 -180 -36 -39 207 405 -169 8 29 10 30 -237 -109 57 120 231 -34 225 94 12 -11 -70 -209
3712b09j89O4K13J85j49K66L6N5k00o3r6N1J75L20l15j90r0QL14k41o5J08p0J30
$$ -209 -398 -334 -121 64 -85 181 217 272 72 9 -87 -36 139 459 144 -46 -136 -128 186 -55 -120 -12 -82 48
3736D8j73M1j7l45N02K61k23J0N7r1J71O9n92L39J21p6L0l84K53j79J39o3K08
$$ 48 -125 -84 -101 -446 56 317 94 104 161 70 241 310 -282 57 178 102 132 -252 1 -178 -39 -102 106
3759A06k67m8k1M32j8j98q1M28k02k11Q1k04K40J48j95J37j1k70J8o0J46J2R0
$$ 106 -161 -209 -230 202 184 -14 -95 333 131 -80 1 -203 37 185 -10 127 116 -154 -136 -196 -50 -38 52
3782E2j12J04J7l6l3K02q9Nk40k20L24K60k29O9R6k73p3K34k80l4Q7R4R7j51j94
$$ 52 -60 44 61 25 -8 194 105 110 -130 -350 -26 234 5 74 170 -103 -176 58 -222 -256 -169 -75 22 -129 -323
3807c23L04l3K54l1j39j60J14L4j8j24o5n4K02M4k47K48k58J11Rl4J80j1M0k07
$$ -323 -19 -52 202 171 32 -128 -14 20 2 -122 -187 -241 -39 5 -242 6 -252 -141 -132 -166 14 3 43 -164
3831a64l4L68n3O6J7j99P7P5J84k91J9j03K50l36p5J63k11J07k5K22l56M49l2
$$ -164 -198 170 117 183 200 1 78 153 337 46 65 -38 212 -124 -199 -36 -247 -140 -165 57 -299 150 118
3854A18jj23Q0J92k13o6J31Q4l3j80j95K85l72K64J05k11J02n7j00L58j28n6l5
$$ 118 117 -6 74 266 53 -13 118 202 169 -11 -206 79 -293 -29 76 -135 -33 -90 -190 168 40 -16 -51
3877e1Q6l7O3K56l66L6q3o0L80j38j1j84k12L49k92K47o7rk44L77PJ67j72k09
$$ -51 35 -2 61 317 -49 -13 -96 -156 224 86 75 -109 -321 28 -264 -17 -84 -93 -337 40 47 214 42 -167
3901a67J15J01P5K12l43q1m2J75l7p1rJ7K35k61KK35j34j09JJ77k1o9rn8O2j75
$$ -167 -52 49 124 336 -7 -88 -130 45 8 -63 -72 -55 180 -81 -79 156 22 -87 -86 91 70 1 -8 -66 -4 -179
3927a79J24R9m2J52K22m13K8r1K23j85N5Op1R4K9j13J5L7L4n1N7Qmj40L28j7j40
$$ -179 -55 44 2 154 376 -37 -9 -100 123 -62 -7 -1 -72 22 51 -62 -47 -10 24 -27 30 38 34 -106 222 205 65
3954F5j36q9Qk49L00J3j79J66M5k5J24J57N1k34K04j43L7J77k21n9K5m1l8M6k34
$$ 65 -71 -160 -152 -401 -101 -88 -267 -101 -56 -81 43 200 251 17 221 78 115 292 71 12 37 -4 -42 4 -230
3979b30P8R7j8P2K2rJ38l0j1j45Q0k6J15n1j86O0O7j58j59J67K2m7J85j95K72
$$ -230 -152 -55 -73 -1 21 12 150 120 109 -36 44 18 133 82 -104 -44 23 -135 -294 -127 -105 -152 33 -162 110
4004A10r1R3L6j21R3Nj91L32j22k38J64m3r7J83q9k67L43Kj62J16m5j88J2K16
$$ 110 19 112 148 27 120 125 -66 266 144 -94 70 27 -70 113 24 -243 100 102 -60 56 11 -177 -165 51
4028E1j16J44J25l42L29j99R7P1m13L22k7K59m60M5K18j61Mm9K5K17J72k62O2
$$ 51 -65 79 204 -138 191 -8 89 160 -253 69 42 301 -159 -114 104 -57 -53 -102 -77 140 312 50 112
4051A12q7M9jk35J11K26j73r9l6L2J43J46j58O6j54MK74l69J85l5j61J87j56j0
$$ 112 25 74 73 -162 -51 175 2 -97 -133 -101 42 188 30 96 -58 -54 220 -149 36 1 -160 27 -129 -139
4075a39k4K62l62K98p1P7L3m23M75l5o6N4L8j62k35L01l94J14J93r1j8J92n7J76
$$ -139 -163 99 -263 35 -36 41 74 -349 126 91 25 79 117 -45 -280 21 -373 -259 -66 -157 -175 17 -40 136
4099A36j53J01p0K4K64l24q5k1J91j13j2L29l20K28k73JJ09j27J50L01l82K3P2
$$ 136 -17 84 14 38 302 -22 -107 -128 63 -50 -62 267 -53 175 -98 -97 12 -115 35 336 -46 -23 49
4122D9J92L2k53k3L0J72k78J04o3J72k06K30j91r7R4J01n7q8K89k37J62q5J03
$$ 49 241 273 20 -3 27 199 -79 25 -38 134 -72 158 -33 -130 -36 65 8 -80 209 -28 134 49 152
4145A52j60N6KJ76r1n1j95Q8Q2R1m43K87j21J73k87J52L21k98O6j01J29j25J50
$$ 152 -8 48 50 226 135 84 -111 -23 59 150 -293 -6 -127 46 -241 -89 232 -66 0 -101 28 -97 53
4168E3J77j97O4j1J47j82Q1O5r9k4N0k98L16k50L6K85j24m34M00r6k05K96j17
$$ 53 230 33 97 86 233 51 132 197 98 74 124 -174 142 -108 -72 213 89 -345 55 -41 -246 50 -67
4191f7J95qm8q4J72j18j43K10L2k3q9PJ22k25j63K44j13J39n2j30Q3K04rl58K82
$$ -67 128 120 72 -12 160 42 -101 109 141 118 29 36 158 -67 -230 14 -99 40 -12 -142 -59 145 136 -222 60
4216F0q6O9L52l57J17k36M7lr0N6oP0l30J81m1M08r6o6j14K75j10k68J01NL0K73
$$ 60 -26 43 395 38 155 -81 -34 -37 -127 -71 -77 -7 -337 -156 -197 211 115 49 -65 210 100 -168 -67 -62 -32 241
4242B41l05j97J81k13K27k48J93M05l41n8K1K37k73j06J52K16q7j74J52R3p0p8
$$ 241 -64 -261 -80 -293 -66 -314 -121 284 -57 -115 -94 143 -130 -236 -84 132 45 -129 23 116 46 -32
4264c2L60m69j51J15J95k71K83l0j57K01n9K93m64K81P8L2k2J87n23L32l49K50
$$ -32 328 -141 -292 -177 18 -253 30 0 -157 44 -15 278 -186 95 173 205 183 370 -153 179 -170 80
4286H0j1j35J4J00k41K9J15j17J74J14oo6J16Q8m80J94J56j27j26J29JN3R8j78
$$ 80 69 -66 -52 48 -193 -164 -49 -166 8 122 116 50 166 254 -226 -32 124 -3 -129 0 1 54 152 -26
4310b6J81j62j0j77L7j42M88j67n0l09N32k63K31k10j10O0J35j04m4J09n4J03
$$ -26 155 -7 -17 -194 -157 -299 189 22 -28 -337 195 -68 163 -47 -157 -97 38 -66 -110 -1 -55 48
4332D8j16J92l9j07K69j33K07k82J10J37l69O8nJ4L15r9j13k13J57J86p0k11J02
$$ 48 -68 124 85 -22 247 114 321 39 149 286 -83 -15 -20 -6 309 210 97 -116 41 227 157 -54 48
4355D8k03m2K08q3J01J66k12J92l7k49J95k8j71n6J46N4K6k1j06j97L66j20R5
$$ 48 -155 -197 11 -72 29 195 -17 175 138 -111 84 56 -115 -171 -25 29 55 34 -72 -269 97 -23 72
4378G2m8m9k20J64k8L34k87J69qk31J68K72k52jL9k89J79m2L9j74L86o7l38J87
$$ 72 24 -25 -245 -81 -109 225 -62 107 99 -132 36 308 56 55 94 -195 -16 -58 -19 -193 193 126 -212 -25
4402b5K00k05j7L6R1o1n8J06j25Q7K1R0m9r1n1k8j92L29j82j8n6K23J91k29J48
$$ -25 175 -30 -47 -11 80 19 -39 67 -58 29 50 140 91 0 -51 -79 -271 58 -124 -142 -198 25 216 -13 135
4427A35j02N8N7n1r7J40j92J80O9P8k24l7j04n5QJ82P5Pk32K84j76Q1J78m95J63
$$ 135 33 91 148 97 0 140 -52 128 197 275 51 14 -90 -145 -137 45 120 127 -105 179 3 84 262 -233 -70
4452g0P8O2j15K11O1oj88J72k23O4R0m0k24L85l81j6J63k52M09l34J82J42j39
$$ -70 8 70 -45 166 227 221 33 205 -18 46 136 96 -128 257 -124 -140 23 -229 180 -154 28 170 31
4475C1k58K95J0K8J1j06J6L0O8k76R1K78L7k65k8q5K66r5n8k27L87k17j6mj8J50
$$ 31 -227 68 78 106 117 11 27 57 125 -151 -60 218 255 -10 -38 -123 143 48 -10 -237 150 -67 -83 -87 -105 45
4501D5N7q5N1J0p0l0J21J18k09m4k7R4q5j89J96LL8k0J5q6k3N6K7J14p0K81l93
$$ 45 102 17 68 78 8 -22 99 217 8 -36 -63 31 -54 -243 -47 -44 -6 -26 -11 -97 -120 -64 -37 77 7 288 -105
4528a05L18J6n54N15l48RK15qr9lJ21N0Mj89J37K5k45L67k9k38M23m77K45k82
$$ -105 213 229 -325 190 -158 -149 66 58 -41 -44 77 127 131 -58 79 104 -141 226 197 -41 382 -95 150 -132
4552a32L87k61J12k63K27j54K08j09k88J91J07O8r8J94L0k09J68J27m33L75l26
$$ -132 255 -6 106 -157 70 -84 124 15 -273 -82 25 93 -5 189 219 10 178 305 -128 247 -79
4573g9L14r7k57n8L14j35q1J44k51L67l49K63j17k0j55%R9k3K60p3n7j63K00J17
$$ -79 235 138 -119 -177 137 2 -79 65 -186 181 -168 95 -22 -42 -197 -197 -98 -121 139 66 9 -154 46 163
4597A63j81j55M55l41K62l02P2k16K10j57P2J38k4L9O6j18J94r2j78L96k29n0
$$ 163 -18 -173 282 -59 203 -99 -27 -243 -33 -190 -118 20 -4 35 101 -17 177 85 -93 303 74 24
4619B4KK20l38L1K66m98J61L00o1k5l08L39j05j96J14J72q2R7j97K03j71j24M6
$$ 24 26 246 -92 -61 205 -293 -132 168 107 82 -226 113 8 -188 -74 98 16 113 -84 119 -52 -176 -130
4642a30J59j50K54l27L4L46j70o9j86K91R6k49J10o6K13j72J01r5K3r6M0j5R7
$$ -130 29 -121 133 -194 -160 186 16 -53 -239 52 148 -101 9 -57 156 -16 85 -10 13 -83 -43 -58 39
4665C9J77j65l08K61J62k10O3k87K57n7O09n97J09m2o5P1J9j01K16k9l73L20k34
$$ 39 216 51 -257 4 166 -44 19 -268 -11 -68 541 -56 53 11 -54 17 36 -65 151 122 -251 69 -165
4688a65J12o2J70k9l7J10J05l30K16L5M5j82n4LK24l89M12j04n9k34M45P2l76
$$ -165 -53 -115 55 26 -11 99 204 -126 90 125 170 -12 -66 -63 161 -228 184 80 21 -213 232 304 -72
4711g2J74j05k7r4L27j87R4l48L84L8l74O9M38j36k19k04R7L47L53m72L1k52J7
$$ -72 102 -3 -30 -124 203 16 110 -238 146 184 -190 -121 317 181 -38 -242 -145 202 555 83 114 -138 -121
4734a21J03K96k33j93l7K77r3j00J64Pr7K4J54j0o5j81R8j28k56L49l0J82l0j73
$$ -121 -18 278 45 -148 -185 92 -1 -101 63 70 -27 -3 151 141 76 -105 -7 -135 -391 -42 -72 110 80 -93
4758i3J74j91pK23o4j49K91k80L63k90J06J98j24l02K0O4l5K47j02j99K46k41
$$ -93 81 -110 -117 106 42 -107 184 -96 267 -23 83 281 157 -145 -125 -61 -96 151 49 -150 96 -145
4780a45J47J25j11j47P7K52j10k30oj8R3J65k06j12J92j7m9P5J97l09K69m1j19
$$ -145 2 127 16 -131 -54 198 88 -142 -148 -166 -73 92 -114 -226 -34 -51 -100 -25 172 -137 132 91 -28
4803b8R2k34J91R3m3k10O8J92o1j03M20l38j6M8J69k18p5R9j98K62k32M2qM6k93
$$ -28 64 -170 21 114 71 -139 -71 121 60 -43 377 39 23 71 240 22 -53 46 -152 110 -122 -80 -88 -42 -335
4828c35L13RN7P2l02mK17j70J70K5j94L64J97o06J71r0J45J25l85J99j2Q8n0n4
$$ -335 -22 -13 44 116 -186 -190 27 -143 27 52 -142 222 419 -187 -16 -106 39 164 -221 -22 -34 54 4 -50
4852e0K38L3l58M49m07J43o8o1R7m5P7J81k28K07k81l27N80l36L33k83j77L04
$$ -50 188 221 -137 312 -95 48 -20 -81 16 -29 48 229 1 208 -73 -400 180 -156 177 -106 -283 21
4874B1J52l74O6J21o2J93l78L27p6k03K42k43J78M5k82J73M00k54j22q9J50p8
$$ 21 173 -201 -135 -14 -76 117 -261 66 -10 -213 29 -214 -36 9 -273 -100 300 46 -76 -165 -15 -93
4896i3j06M01k28J55k10j99K02N95k51k02n6l6k87J78J45j17L2p2oQ1J1J63j03
$$ -93 -199 202 -26 129 -81 -280 -78 517 266 64 8 -28 -315 -137 8 -109 -77 -149 -155 -74 -63 100 -3
4919cN08n06m4l0L49j60K46l57J48k6r3o2l1J66o2J09j56k2k01J87KJ23j03K27
$$ -3 505 -1 -45 -75 274 114 360 3 151 125 32 -30 -61 105 43 152 -4 -26 -227 -40 -38 85 -18 209
4943B09j3j14n1R1o8j6J6J19O7k90J01m9k08J11K31k6l3l62L31m7n8j41J73J25
$$ 209 196 82 31 122 54 38 54 173 240 -50 51 2 -206 -95 136 110 77 -285 46 -1 -59 -200 -27 98
4967I8Ll57K88n8j74J73Lk57K41N0p5R4J32j88p4lJ78O3j14NK55m09Q3M0J66q6
$$ 98 101 -256 32 -26 -200 -27 -24 -281 -40 10 -65 29 161 -27 -101 -104 74 137 23 28 283 -126 -43 -3 163 77
4993G7K04k74k7L45m28p8K71j61L2j65J81M5K4J41k04M2k08K85m3J57r3k97L04
$$ 77 281 7 -20 325 -103 -181 90 -71 -39 -204 -23 22 46 187 -17 25 -183 102 59 216 123 -174 130
5016A30J14k63l4L09l38PK72q9p1r3J16j07j19J73J40O1j61L0k11%K87j91J51
$$ 130 244 -19 -53 256 -82 -75 197 108 37 -56 60 -47 -166 7 147 208 47 77 -134 -134 153 -38 113
5039A13j36o4o9M60l70l5j8K73j25r7J83j82k5J02N9k7j28Q4K05n1m6l37L73k74
$$ 113 -23 -87 -156 304 -66 -101 -119 154 29 -68 115 -67 -92 10 69 42 -86 -2 203 152 106 -231 142 -132
5063a32J70K51j62k66N4J4L2P6j79L2K07K5J26m42L56o0k73K64p4J2Q3J89k47
$$ -132 38 289 127 -139 -85 -71 -39 37 -142 -110 97 122 248 -194 162 102 -171 93 19 31 114 303 56
5086E6O9m5J06m74K46K12k90L45m41J37k40L28j32J77L3j34M35n11k6NN6j78K59
$$ 56 125 80 186 -288 -42 170 -120 225 -216 -79 -319 9 -123 54 87 -47 388 -123 -149 -144 -88 -266 -7
5109gO8j09j26K35j0o2q6K17L3j87l5J18j75qp9J51L22k95N8J2j03j4Pk08L78
$$ -7 61 -48 -174 61 51 -11 -97 120 153 -34 -69 49 -126 -134 -213 -62 260 -35 23 35 -68 -82 -75 -283 95
5134I5n04L03n0O6J80j46p0R8J82j93m4K29k59L32k23R4K6J60J8j90k41P2m4j15
$$ 95 -409 -106 -156 -90 90 -56 -126 -28 154 -39 -83 146 -113 219 -4 90 116 276 294 104 -137 -65 -109 -224
5158b24J26k5k5J61K96n39M22k8L2j34Q4L5k8m19J56J79j81j4lJ62l3r8M0qq9
$$ -224 -98 -123 -148 13 309 -230 192 164 196 62 146 181 153 -266 -110 69 -112 -126 -129 33 0 -98 -58 -66 -155
5183a55j71L41J39j44k64J57r3M69k81J81o7J16p1j40k14P4J15Rq5J03j76J44
$$ -155 -326 15 154 10 -254 -97 -190 279 -2 179 112 228 157 17 -197 -123 -8 1 -84 19 -157 -13
5205a3o3J61LK37m10L5P7R9Q4J14l11j68Q2k31j10L10J7l3J12R5j86J89qq9L4
$$ -13 -76 85 88 325 -85 -50 27 126 210 324 13 -155 -73 -304 -414 -104 -87 -120 -8 87 -99 90 82 -7 27
5230B7J37l91L52j82j33Q9K07K05l56J99j01J03l10Jk4N3m9J47j52K40j11j00
$$ 27 164 -227 125 -57 -190 -101 106 311 -45 154 53 156 -154 -153 -177 -124 -173 -26 -178 62 -49 -149
5252a49K90k53N27l10j02K57q5o7j46n1l9K84j09k18P7Q2J98k50Mj82N00k65k07
$$ -149 141 -112 415 105 3 260 175 108 -38 -89 -128 156 47 -171 -94 -12 186 -64 -60 -242 258 -7 -214
5275b14J79q4P5Q6J5j87K04lO8O3Lm41K99j02J53m28L33k14M1RK41lo7mk08L18
$$ -214 -35 -119 -44 42 57 -130 74 71 139 202 205 -236 63 -39 114 -314 19 -195 -154 -145 96 93 26 22 -186 132
5301A32NO3k41K33N8l82J39k93L44p8l7o7l9L25o1Ol47P5K87l04K91R8j65r2L3
$$ 132 137 200 -41 192 250 -132 7 -286 58 -20 -57 -124 -163 162 101 107 -240 -165 122 -182 109 207 42 -50 -17
5326a7k0r5J4nK87j39r2K36j59n2j02K71j03Nj20M8J1J09J0j56R8O9o2j13K00
$$ -17 -37 -132 -118 -123 164 25 -67 169 10 -42 -144 127 24 29 -91 -43 -32 77 87 -69 29 98 36 -77 123
5351A23j07N8j67J57J11N5m00L0K30k97J31N4m2N5r8K05r1k98J65K91k10J79l18
$$ 123 16 74 -93 64 175 230 -170 -140 90 -207 -76 -22 -64 -9 -107 98 7 -291 -126 165 -45 134 -184
5374a84K63O2q6J35l87L81j40o8p6o3K64m9j24J10k45J70j9J83l10J09L53l7o1
$$ -184 79 141 55 190 -197 184 44 -24 -100 -163 101 52 -72 38 -207 -37 -56 127 -183 -74 279 242 181
5397A81k00o4N0r0K83l8k31J99k63M5j27J46L67k02j38m4K22j55K31k96J33J00
$$ 181 -19 -83 -33 -123 160 122 -109 90 -173 -128 -255 -109 258 56 -82 -126 96 -59 172 -124 9 109
5419A09k07j05Q1J39l8P7k5j36j71M28k32O7k42J37K86j33J78k15L7j34j08qK53
$$ 109 -98 -203 -122 17 -21 56 31 -105 -276 152 -80 -13 -255 -118 168 35 213 -2 35 -99 -207 -215 38
5442C8n1j25M35n41L15P5k12K96p9j64k01L21J83l38K24k90l45O06j63P9k60L7
$$ 38 -13 -138 297 -244 71 146 -66 230 151 -13 -214 107 290 -48 176 -114 -459 147 -16 63 -197 -160
5464a60M7K87k73K95j11m6j32J09k54N57j76j63L2j7K10j99j47k3M66m60L12K3
$$ -160 -113 174 -99 196 85 39 -93 16 -238 319 143 -20 12 -5 205 6 -141 -164 302 -158 154 177
5486A77k00n3L5l10L80k87K46r1J89j00Jm1m9K52l94K87K5o9P7k27K31J84m09
$$ 177 -23 -76 -41 -351 29 -258 -12 -103 86 -14 -13 -54 -103 149 -245 42 67 -2 75 -152 79 263 -146
5509a46Q1j35L63k85P8L43l18k7O2p0P6j45j2J61j00R5J36j6k81J07J27p3J66
$$ -146 -65 -200 163 -122 -44 299 -19 -46 16 -54 22 -123 -135 26 -74 21 157 141 -140 -33 94 21 187
5532A87l10j11K23j0p0L3j08J10Q7L74l31j70L80j82l6j16J97l3m2j17o9K45j89
$$ 187 -123 -234 -11 -21 -91 -58 -166 -56 31 405 74 -96 284 102 66 -50 147 114 72 -45 -114 131 -58
5555e8KJ19k13K67R6o01M12l4q6K21l15M05k82J86p9O9Q0j88Jj09N3J32r7K78
$$ -58 -56 63 -150 117 213 -388 24 -10 -96 125 -190 215 -67 119 40 109 189 1 2 -107 -54 78 -19 259
5579B59l61R1J12l10J88l83K07L2J65O9n3O8K4j6M3o1l34N33j48k72K34m18K30
$$ 259 -102 -11 101 -209 -21 -404 -197 -165 0 69 16 84 108 92 135 74 -260 273 125 -147 87 -331 -101
5602a01K20n7j57j73J78m2q9J65%K81j18o6j25J33L64O8n78J6R6k43L55l17K90
$$ -101 119 62 -95 -268 -90 -132 -221 -56 -56 225 107 41 -84 49 413 481 -97 -81 15 -228 127 -190 100
5625A00L3k30L0J97Q8j03j44J85j03k17R8J95j11J78k9j86K05j49Pk6N1J51k76
$$ 100 133 -97 -67 130 218 115 -29 156 53 -164 -66 129 18 196 167 -19 186 37 44 18 69 220 -56
5648e6L5k02N9j04J23J48J95k54R3K16k97O6R8j37k29N9L83j40J56k37J22J5j87
$$ -56 -21 -223 -164 -268 -145 3 198 -56 37 253 -44 22 120 -17 -246 -187 196 56 212 -25 97 112 -75
5671g5lQ2K2m5j84L90k05j03K9m3j39K11J15k08K32j72K95l47JL26q3r7l0k30
$$ -75 -78 4 26 -19 -203 187 -18 -121 -92 -135 -274 -63 52 -156 76 -96 199 -148 -147 179 96 -1 -31 -261
5695b61M59m00o7K44r8L02j11l3j08O9M4j76l0L06q7k3kj07j0L0J29p2k49J38
$$ -261 198 -202 -269 -25 -123 179 68 35 -73 -4 40 -136 -166 140 53 30 28 -79 -89 -59 70 -2 -251 -113
5719a13J53j6P1j19Kj85L62k38k9K12j9J90l67K75Q1l24j31J74j76K32P7j19p4
$$ -113 40 24 95 -24 -22 -207 155 -83 -112 100 81 271 -96 179 260 -64 -195 -21 -197 35 112 -7 -81
5742h1oK52n9k31L57J34l99R8R4ok85K08j26J28JMO1j91L13k85j38K96p6j97K49
$$ -81 -87 165 106 -125 232 366 -33 65 159 153 -132 76 -50 78 79 83 144 -47 266 -19 -157 139 63 -134 115
5767A15k30R1p1J62J34p4j29j8K01j28Mj85J5p7J53j00K06l98J95L36j19n4L8
$$ 115 -115 -24 -95 67 201 127 -2 -20 181 53 57 -128 -113 -190 -37 -137 69 -329 -134 202 83 29 67
5790F7q3K31K4o2n7K37j94k15Q9n7J33j95J13k91J78j62J14K50l27K10o0L1j10
$$ 67 -16 215 239 177 120 357 163 -52 37 -20 113 -82 31 -260 -82 -244 -130 120 -207 3 -57 -26 -136
5813a36P2r5J25r0j51M33k28J24l2j9o1K35l30j90L23J56l05l2k3J47K04j4j77
$$ -136 -64 -159 -34 -124 -275 158 -70 54 22 3 -58 177 -153 -343 -20 136 -169 -201 -224 -77 127 113 -64
5836f4N7K1J4J53K70m99j90K63j19R7P3On1%K77l05j69PK24l67K23K91m20J67
$$ -64 -7 14 28 181 451 -48 -238 25 -94 3 76 82 31 31 308 3 -166 -159 65 -302 -79 212 -208 -41
5860d1j09K98j50qNK13k68J47r0K8J3j03j17K5K96N9q1Jk90J83OO5R8l15K16K19
$$ -41 -150 148 -2 -10 -5 208 -60 87 -3 25 38 -65 -182 -157 139 198 117 118 -172 11 17 82 180 -135 81 300
5886C00j60k04o3J62O9j26Q4j25J93r9N1j30n2p5K20k66M5K97j01n7K83k81J1
$$ 300 140 -64 -127 35 104 -22 62 -63 130 31 82 -48 -100 -175 45 -221 -176 121 20 -37 246 -35 -24
5909b4K29m19j11M30l2Q3k2j54k7p9R6R1O6j69k26J54N1j9J68k55J99l8K66J44
$$ -24 205 -214 -325 105 73 156 134 -20 -47 -126 -30 61 127 -42 -268 -114 -63 -82 86 -169 30 -8 258 402
5933D02l17j18o6QK2j82K23L84k02m18J91K8k04RR1Q8J73k64J35K55Nl39K20j39
$$ 402 85 -33 -99 -91 -69 -251 -28 356 154 -264 -73 -45 -249 -240 -149 -61 112 -152 -17 238 243 -96 124 -15
5957a5rR8O6l15j10L17Q6k00j72K08k57P9M51O9m43L26m5l67O68o75M87l51j9
$$ -15 -24 74 140 -175 -285 32 118 -82 -254 -46 -303 -224 227 296 -147 179 134 -233 435 -240 247 -104 -123
5980a23J22p4j25Q7K74j45j38K98P7l41N2j16J61J27j43j3OQ7R0l01J35R2k68
$$ -123 -1 -75 -200 -113 161 16 -122 176 253 -88 -36 -152 9 136 -7 -20 -14 73 163 -138 -3 89 -179
6003a79M60n04J06J07j01L93j30j99J3J17j02r4J97J56j19l50J76M1K8r8j1K62
$$ -179 281 -223 -117 -10 -111 282 152 -47 -34 83 -19 -113 84 240 121 -229 -53 -12 16 -82 -93 169
6025A69l09M7J20k52K65k33L05k78K68j09j24J82J3L88m11r2J90j05K35l41K71
$$ 169 -140 -93 27 -225 40 -193 112 -166 102 -7 -131 51 64 452 41 -51 139 34 269 -72 199
6046A99k34M3j11r8J08j03M13k11o9Kl5O9J45n31L84L05l49l8J78j18M5m1K13
$$ 199 -35 8 -103 -201 -93 -196 217 6 -63 -61 -96 -27 118 -413 -29 276 -73 -111 67 -51 -6 -47 166
6069A66j15p5L0o5k38K46R1k8q7L66k56k08L18O9j46l35K12J34k7j91K12P5j89
$$ 166 51 -24 6 -59 -297 -51 40 12 -75 291 35 -173 145 214 68 -267 -55 79 52 -139 73 148 -41
6092d1M7k65L71k36p4J63p4Q8R7O1k01j1J57l32N1oJ79P1k44Q3J86L0k75K60k45
$$ -41 6 -259 112 -124 -198 -35 -109 -21 76 137 -64 -75 82 -250 -199 -205 -26 45 -199 -116 70 100 -175 85 -160
6117a60J86p9J82m1J97l97j66M71l21K5J75j07L05k66o7N9L09l91N5j50K23J4
$$ -160 26 -53 129 88 285 -112 -278 193 -128 -103 72 -35 270 4 -63 -4 305 -86 -31 -181 42 56
6139E6m9O6j74J19q1L7J34l2j90j37K95kj37K27j46K22j75J49r2r2K16j1m86K83
$$ 56 7 73 -101 18 -63 -26 108 76 -114 -251 44 42 -95 132 -14 208 33 182 90 -2 214 203 -283 0
6163@p9L4Q0J74l63P5M16j73k19K03l63J1J69J17m34K96K41k16K7M6O1l07L71
$$ 0 -79 -45 35 209 -154 -79 337 164 -55 148 -215 -204 -35 82 -352 -56 185 -31 -4 42 103 -204 167
6186A67j52MM0l2m7J14J7k41K78l7jK74k08l25J68j60L73k35K4K38l18r0J00L5
$$ 167 15 19 59 27 -20 94 111 -130 148 111 110 384 176 -149 19 -141 232 -3 21 259 -59 -149 -49 -14
6210a4k31J65J51Q7p1M7j29r3P1Qj57K05R5k0o4j72J40L4J8k12K12p6j62L85k77
$$ -14 -245 -80 71 158 87 134 5 -88 -17 -9 -166 39 134 114 50 -122 18 52 70 -142 70 -6 -168 217 -60
6235f0o0L0j2K34j70j19J40L04l73M20l28r6r4Q8J72j21k41K08q5J34N1Jj0j41
$$ -60 -120 -90 -102 132 -38 -157 -17 287 -86 334 6 -90 -184 -96 76 -45 -286 -78 -163 -29 22 23 13 -128
6259a28L23j61m4J03j2o4K4O6J10o2l2j04O8j64K42k64j35K74l29L31lj01J70
$$ -128 195 34 -10 93 81 17 41 107 217 155 123 19 87 -77 165 -99 -234 40 -289 42 39 -62 108
6282A08k31M03o0k55K28l24J09N1O3J23k94M3O9m7J61J8k99Q5k03N75j73m63K79
$$ 108 -123 280 220 -35 193 -131 -22 29 92 215 -79 -36 33 -14 147 165 -134 -49 -252 323 150 -313 -34
6305c4L60l60q6j34j9K71j72K17n7k18J93J42kk24J58k14Q4J46q3Q3q8j0K7N1
$$ -34 326 -34 -120 -254 -273 -2 -174 43 -14 -232 -39 103 101 -123 35 -179 -95 51 -32 51 -37 -47 -20 31
6329C1n1N9k6k6k5k37M5M62k1p1j11o5J49j09o0m1nJ78L2r8k7k0R1Q7P6k08j78
$$ 31 -20 39 13 -13 -38 -275 -230 232 211 140 29 -36 113 4 -56 -97 -102 76 108 10 -17 -37 54 141 217 9 -169
6356a69RJ18J6Q5jj74J62k39K77k31K47l23L17k00L49l41L2K36k98M20l06K42
$$ -169 -160 -42 -26 59 58 -116 46 -193 84 -147 100 -223 94 -106 243 -98 -66 170 -128 292 -14 228
6378B28j83j77k0qK15r7l28K78L1k47L47J48rql82J82j21N7p6K25j63J08M88m62
$$ 228 45 -132 -152 -160 55 -42 -370 -92 -61 -308 39 187 178 170 -212 -30 -151 -94 -170 55 -108 0 488 26
6402B6j76K95j25j46O6Q3O2K08l42m1q2J64j13R1m1N8J13K01n25J16K39o0k81
$$ 26 -150 145 20 -126 -60 23 85 293 -49 -90 -172 -8 -121 -30 -71 -13 100 301 -224 -108 131 71 -210
6425b10K25J76k68m8K07m00J76J31J01j87J31j86J60L9J08j14j57Q5K99k36j28
$$ -210 15 191 -77 -125 82 -318 -142 -11 90 -97 34 -152 8 47 155 41 -116 -31 268 32 -96
6446i6R8O1j02L02j42j91mP8l92M29M8k54J44j74L64k63L32j36o9o5J65l14J28
$$ -96 2 63 -39 263 121 -70 -74 4 -388 41 89 -165 -21 -195 169 -94 238 102 33 -32 133 -181 -53
6469e3Q0J47j34q3K88m32L49k47L46k06J34n2j68R1j62J95n3m0j74K00J96j65
$$ -53 27 174 40 -43 245 -187 162 -85 261 55 189 137 -31 60 -102 93 40 0 -174 26 222 57
6491E7q8j30N8j68P0K13M8N2k33K33l3m25K28L05k94L8J80k40J95K96j38k34o
$$ 57 -31 -161 -103 -271 -201 12 60 112 -121 112 79 -346 -118 187 -107 -69 111 -129 66 362 224 -10 -16
6514a6K7j13n9K13j95l0R0J98k06M9k0nK16k92J85K88k51J4j42J08k14L80n4j71
$$ -16 11 -102 -161 52 -143 -173 -83 115 -91 -42 -62 -67 149 -143 42 330 79 93 -49 59 -155 225 171 0
6538@k10N14l40K45l61J13J84l11Q6j78K96j16r6M11j02k30J20l6Q2k04M41j03
$$ 0 -210 304 -36 209 -152 -39 145 -166 -80 -258 38 -78 -174 237 135 -95 25 -11 71 -133 308 205
6560B05r7k50J4r2J96l9J10k21l1j69O18k49j09K06q6K20k43k47K45K59J3q8k44
$$ 205 108 -142 -128 -220 -24 -63 47 -174 -205 -374 244 -5 -114 92 6 226 -17 -264 -19 240 253 165 -79
6583g9L30j31m06L67j22j72L17J18o6k4j81j07O8KP3R8j71R0Jj46J57lj24R0l10
$$ -79 251 120 -286 81 -41 -213 104 222 156 132 -49 -156 -88 -86 -13 85 -86 4 5 -141 16 13 -111 -21 -331
6608c31L70M0o4l7l08M80J46m64L85r6m74K73j79J64J39J56k09j19R1R4j68K13
$$ -331 39 79 15 -22 -330 150 296 -168 217 121 -353 -80 -259 -95 44 200 -9 -128 -37 57 -111 102
6630A02k9l2q0p5K94l32J75j28J96j04p8N08m09j71J19L43k17l8K68m10k9L83
$$ 102 73 41 -39 -114 180 -152 23 -105 91 -13 -91 417 8 -163 -44 299 82 44 312 -98 -127 256
6652B56l75K9J16n24L85r8J95J19k14J6L04k06PK3q0L1J0oJ29O4P2r0j99j55L19
$$ 256 -119 -90 26 -498 -113 -211 -16 103 -111 -95 209 3 10 33 -47 -16 -6 -12 117 181 253 163 -36 -191 128
6677A28N4j15r6Qk0M5j6j47J49j17J99n7k30m2J37m0L16l81L43k83J46o2K07k05
$$ 128 182 67 -29 -21 -41 4 -12 -159 -10 -127 72 15 -215 -257 -120 -160 156 -225 118 -165 -19 -81 126 -79
6701g9L52m52K62m7j29K81q8n9K92m04K96k61O3k02M01j89j33K1j25K26J24n6
$$ -79 273 -179 83 36 -93 188 100 41 333 -71 225 -36 27 -175 226 37 -96 -75 -200 26 150 94
6723I4l53N00m22J02O2J67j42Q6r4K17J35p02M11q0l2K96m0l76J01J82j60J56
$$ 94 -259 241 -181 -79 -17 150 8 94 0 217 352 -350 61 -19 -51 245 205 -171 -70 112 -48 108
6745A08l05J9M08j41j65K05j82J33k01K61j36k7K73k89m4K00k58L17L2j08j4j12
$$ 108 -197 -178 230 89 -76 129 -53 80 -121 140 4 -23 250 -39 -83 117 -141 176 208 100 86 -26
6767b6Qr8K79j19m7J39k89J42lK13k03J24J05k87m6o0N93m44k5J1k9O7j36R8P9
$$ -26 -18 -116 163 44 -3 136 -153 -11 -14 199 -4 120 225 -62 -108 -168 425 -19 -44 -33 -62 5 -131 -33 46
6792D6M2J67j98l09L82j86j21K55o2j37K77j62j63P1J49k19k8J87J05L7j14r0
$$ 46 88 255 57 -252 130 -56 -177 78 16 -121 156 -6 -169 -98 51 -168 -196 -9 96 133 19 -71
6814g1j93L03Q8k27L22l20r0Q4j80M05mk06J04L59m49j13K58l35Q3K90k18j43
$$ -71 -264 39 127 -100 222 -98 -188 -104 -284 121 117 -89 15 374 -75 -188 70 -265 -182 108 -110 -253
6836b53J62J36j11J7N9k4K1K60r6m02M94k93j34K85j17K82m30K57l37M7K39K4
$$ -253 -91 45 -66 -49 10 -14 7 267 171 -231 263 -30 -164 121 4 286 -144 113 -224 -177 62 86
6858H6k83m9L18j00J05k60K12K39n50N68l27K54k74K0o4K96k78R4R2j19j09K78
$$ 86 -197 -246 72 -28 77 -183 29 268 -282 286 -41 213 -61 -41 -105 191 -87 7 99 -20 -129 149
6880A49q1l57J76K28k19J41K68l70O9J33k47L18m59M53r5J38j62j29K30j84k0
$$ 149 68 -289 -113 115 -104 37 305 -65 4 137 -110 208 -251 202 107 245 83 -46 184 0 -20
6901b0m52N39m94L61K70p5j6k66Jj02m5L74K6j46o2J67J16k35j32L16k94L80J7
$$ -20 -472 67 -427 -66 204 129 113 -153 -152 -254 -299 75 101 -45 -107 60 176 -59 -191 125 -169 211 228
6924B28q8j98k16L73j26n1L2J09r6m7l0J29p4J89k50o9K73k14K28P4n7m3J40k16
$$ 228 140 -58 -274 99 -27 -78 -46 63 -33 -80 -110 19 -55 134 -116 -185 88 -126 102 176 119 76 216 0
6948@J23j38pK49o5p2N8q5k02J90j17O0K41l04q7J19j15N7l2K91r7j68N7j85J45
$$ 0 123 -15 -22 227 162 90 148 63 -139 51 -66 -6 235 -69 -156 -37 -152 -95 -127 164 67 -101 -44 -229 -84
6973h4K03K4K7l25L63j84K98m32K79j6j91j51L78k14J27J39l95J2%K59k52j13
$$ -84 119 143 170 -155 208 24 322 -110 169 153 -38 -189 189 -25 102 241 -154 -142 -142 117 -135 -248
6995b48M19k43KJ27O3j35J47J47j71j53j84K52q9N2pO1j37K32j60M9K43k00rj77
$$ -248 171 -72 -70 57 120 -15 132 279 108 -45 -229 23 -66 -14 -21 40 -97 135 -25 24 267 67 58 -119
7019a19L71k03J44j86k64M00j68Q5J24J35m11K04k88O7J76R2k97K64j72j10J89
$$ -119 252 49 193 7 -257 143 -25 60 184 319 -92 112 -176 -109 67 159 -138 126 -46 -156 33
7040C3J41l28K42j45L7J89J87l39J6K24k63RK1k7j18J68j55L74m66J0k3O99n66
$$ 33 174 -154 88 -57 -20 169 356 17 33 257 -6 3 24 -3 -121 47 -108 266 -200 -190 -213 486 -80
7063h0J89J55r4j97J09J49j72J23k2j12Jr0j24J6J95j08j12P3J51l8O3J04l45
$$ -80 109 264 170 -27 82 231 59 182 160 48 49 -41 -165 -149 46 -62 -174 -101 50 12 75 179 -166
7086a66K02j04L3J85j60p7R4K08k42j92M61k77j24o8Q6M8L7j61L43k72J14J36
$$ -166 36 -68 -35 150 -10 -87 7 215 -27 -219 242 -35 -159 -227 -141 -93 -56 -217 126 -146 -32 104
7108A04k46J32k6J23J56j55lk28Q2K21j93k6R8O8j53%K75k84J02N0l95M47k18
$$ 104 -142 -10 -36 87 243 88 85 -143 -61 160 -33 -59 39 107 -46 -46 229 -55 47 97 -298 149 -69
7131f9n1qJ74k02jK34L7j91m4P2j64J62L7j5R1m9M6J35m11K40N9l5L0p8P9J11
$$ -69 -120 -128 46 -156 -157 77 114 -77 -121 -49 -213 -51 -14 -29 62 13 59 194 -217 23 82 47 77 -1 78 189
7157A89j98J8Nl43K70N67n14n4k17J56J68l31J71K10l65L55L6j70L1J70n7K45
$$ 189 -9 9 14 -329 -59 508 -6 -60 -277 -121 47 -284 -113 97 -268 87 123 -47 -16 154 97 342
7179C42k89n1lo6n7J6L1ml8l25L35K03k18J71pj2J70l32J37Rq4o0L38l05K98k32
$$ 342 53 2 -1 -67 -124 -108 -77 -81 -119 -444 -109 94 -124 47 40 28 198 -134 3 12 -72 -132 206 -99 199 -33
7205c3N3n9j02K24P4k82K98j83j72L9L77k79p6k6L20j72O9k29K33K3m0M4m4pj10
$$ -33 20 -39 -141 83 157 -125 173 -10 -182 -143 234 -45 -121 -147 173 1 70 -159 74 97 57 101 57 50 -60
7230f0j37K08np1L41m31n5J69k17KK71O7J05j10j16k9nQ9J53l18M49m02K10j44
$$ -60 -197 11 6 -65 276 -155 -210 -41 -258 -256 15 82 187 77 -39 -68 -73 16 169 -149 300 -102 108 -36
7254c6L1j23L21j74k45M64k50r4J79j7j53J22JQ7J5q3k48M51j75j45p8J15k24
$$ -36 -5 -128 193 19 -226 238 -12 -106 73 56 -97 25 26 113 128 45 -203 248 73 -72 -150 -35 -259
7277b59L90qj90Q0l0j58M02m02K6q2J59J75J23p3ol4k81R4J96n8o8k60J75K78
$$ -259 131 123 -67 13 -17 -175 227 -175 -149 -231 -72 103 226 153 147 113 -168 -74 122 64 -4 -264 -89 189
7301A89l01K52J28m90L06j03l9J01N1q5r3J42j25k6Kp9L10j58j83J01J32k25J76
$$ 189 -112 140 268 -222 84 -19 -58 43 94 9 -84 58 -67 -93 -91 -170 140 -18 -201 -100 32 -193 -17
7324a7K97j58j34l9K39k0j98N4M6k48L84j10j19J78m0l18J45j14K23k7j68J39
$$ -17 280 122 -12 -51 188 168 -30 24 70 -178 206 96 -23 155 115 -203 -58 -172 51 24 -144 -5
7346eM1o1J65m89K13K06p7N4Q0n65J37N4j2J08K39n5j83P2J47K3m7J34l05n5J38
$$ -5 36 -25 140 -349 -136 70 -7 47 127 -438 -301 -247 -259 -151 88 33 -150 -78 69 92 45 179 -126 -181 -43
7371d3J94l2l68J96J5l3j48J35O0LJ40j36P8J40q2K36p7m48L90m29M87m53QJ6
$$ -43 151 119 -249 -53 -38 -71 -219 -84 -24 -21 119 -17 61 201 119 355 278 -170 220 -209 278 -175 -167 -151
7395a51J19M7JJ28l12m9K64k71L76lm14L76j78N3J53k74N26l27k77J37j24K10
$$ -151 -32 15 16 144 -168 -217 47 -224 152 149 -265 111 -67 -14 139 -135 391 64 -213 -76 -200 10
7417A0j25J72m0j28P6K00k34m4lR8j33J39K8Q1q9j62J82l3L3J91l89K71R8k56
$$ 10 -115 57 17 -111 -35 165 -69 -113 -116 -18 -151 -12 16 97 8 -154 28 -5 28 219 -170 101 199 -57
7441e7R9M2l97L65j24O9Q6J89m1k01k50K60R6O2l38L71k99J04M4p0jj06k14M36
$$ -57 42 84 -313 52 -72 -3 83 272 231 30 -220 40 136 198 -140 231 -68 36 80 10 9 -97 -311 125
7465A25j18Q2k78L40J2p7Pp9l46K60L4N9j39l7L33j81K18k72PJ56m9k50K93q4
$$ 125 7 89 -189 151 163 86 93 14 -332 -72 -38 21 -118 -155 178 -3 215 -57 -50 106 57 -193 100 16
7489A6K8l30J33K08J9j13KRJ04l10K60J55n1O5%l03K84j06j36J1N8L7j7j51J08
$$ 16 44 -286 -153 55 74 -39 -37 -28 76 -234 26 181 130 195 195 -108 176 70 -66 -55 3 40 23 -128 -20
7514b0K7P1M8j70J40Jp0lJ3j74M24m75J50Q0k03K09l8k7j02K52Jj74J67j95M0
$$ -20 7 78 126 -44 96 97 27 24 37 -137 287 -188 -38 42 -161 48 10 -17 -119 133 134 -40 127 -68 -28
7539b8J49l46RK75K24j73p0l7J19j75m0r3J54J92k46J15L9k80L59k21N9j20K78
$$ -28 121 -225 -216 59 283 110 40 3 122 -53 -93 -186 -32 160 -86 29 68 -212 147 -74 -15 -135 143
7562A43j39J08M8k47R8j45J34j91L25n4j71J18l03L50pp1J16p2m3K02o7K3k12
$$ 143 4 112 160 -87 11 -134 0 -191 134 80 -91 27 -276 74 67 -4 112 40 -3 199 132 155 -57
7585e7j42N09k70Q9J34o2k57K41k01J24k03J42p6K07l18O8J81q0j37K06L4j48
$$ -57 -199 310 40 129 263 201 -56 185 -16 108 -95 47 -29 178 -140 -72 109 29 -108 98 132 -16
7607a6J01j41J86q9k37K62J85k57o3L6J76m18O3K80J67j33k23J43l12O7L32j86
$$ -16 85 -56 130 41 -196 66 251 -6 -69 -33 143 -275 -212 68 235 102 -121 22 -290 -223 109 -77
7629g7L30k86m7K57k04J6j45K25J1j21j3j50J4j5O5M5p3K37q3M4J90j77o4j88
$$ -77 253 -33 -80 177 -27 -11 -156 69 80 -41 -54 -204 -190 -205 -140 -95 -168 69 -14 30 220 43 -21 -209
7653b09qL93j87r3j4P9QJ02j54J9mJ0K52Lo08M25L1J49n8O1k31L4J03k83K14k7
$$ -209 -217 176 -11 -104 -118 -39 -31 71 -83 -64 -68 -58 194 197 -411 14 45 194 136 197 -34 0 103 -180 34 7
7679GLj67R6K04j33K11l20J91j06r3O6K7J97j54j56K26j27k11L41j79o0j5K40
$$ 7 10 -157 -61 143 10 221 -99 92 -14 -107 -41 -14 183 29 -127 99 -28 -239 102 -77 -137 -152 88
7702H8J76l83K40j17j66N7K47k02L3J00k81M31l09K07j18N3P8j13JJ31j10l4K19
$$ 88 264 -119 121 4 -162 -105 142 -60 -27 73 -208 223 -86 121 3 56 134 21 22 153 43 9 228
7725B28M3m16K65r9P2k05M3L93l98K18k6j34M6k46J61J08j56j15M49l51J06J42
$$ 228 271 -145 120 21 93 -112 -69 324 -74 144 118 -16 30 -216 -55 53 -103 -218 231 -120 -14 128
7747A28o2j42J64k60P7K22l47L09qJ89l42J57P2k47n1M62j62J09l59l1M63m53
$$ 128 66 -76 88 -172 -95 127 -220 89 81 270 -72 85 157 -90 -141 321 159 268 -91 -122 341 -112
7769a12j28L80k55K63r0q8j12J60NJ61N0k04n1J27j36o8M2J52p2N2j39O7j3m56
$$ -112 -240 140 -115 148 58 -30 -142 18 23 184 234 30 -21 106 -30 -98 -56 96 24 76 -63 4 -9 -465
7793d65O20l36K06LL4j91p8Q3L82l45P5K89o9j37l00M57l92J90N3l61M14j62r2
$$ -465 155 -181 25 28 62 -129 -207 -124 258 -87 -12 277 208 71 -229 228 -164 26 79 -282 132 -30 -122
7816a22P7l43R0J31L59j17J09j48m5p0J91j45K07Q4m34K16j2J70k0k02K20j62
$$ -122 -45 -388 -298 -167 192 75 184 36 -9 -79 112 -33 174 258 -176 40 28 198 178 -24 196 34
7838C4q4k43K36l00M23M4j62J43M2m85N49n8j38J06p6q4L16k84K14j01r8p8r6
$$ 34 -50 -293 -57 -357 66 110 -52 91 133 -352 197 139 1 107 31 -53 263 -21 193 92 -6 -84 -180
7861a80J41j4k83M20L9k45K68j14j84n1K63l5K48j60r4j77J10j07k7K68J16m0
$$ -180 -39 -53 -336 84 123 -122 146 32 -152 -203 60 25 273 113 19 -158 -48 -155 -182 86 202 162
7883A62l72N79m92K0J60j87J95k1j62Q8k2q9P6K68l6m0q2J18k9J7j38k2Q6r0Q7
$$ 162 -210 369 -123 -103 57 -130 65 44 -118 -30 -52 -141 -65 203 167 127 45 163 134 151 13 -9 77 -13 74
7908G4q1N0k6R7k56L35k78j50r4K72J84j81J43J74l60K99j27M10n41N5p4J89k62
$$ 74 -7 43 17 114 -142 193 -85 -235 -329 -57 127 -54 89 263 -97 202 75 485 -56 -1 -75 114 -148
7931a48R3R3l60K21o3K21k49J96r3J28k05L12j21K63k8l15P4k44K98M3j27J35
$$ -148 -55 38 -322 -101 -164 57 -192 4 -89 39 -166 146 25 288 260 -55 19 -225 73 116 -11 124
7953A24P9l37j70K21K10j50p4J35m11K83J52J52j45j86K03Nk06K4K57n8l1j69
$$ 124 203 -134 -304 -83 127 -23 -97 38 -373 -90 62 214 69 -117 86 91 -115 -91 166 108 77 -92
7975i2j0J21l06K46lj2K55k22P7qQ2k54K99l02L19l5j92P5J38p6j7k0j33J82k05
$$ -92 -102 19 -287 -41 -44 -56 199 -23 54 46 128 -126 173 -129 190 155 -37 38 176 100 83 63 -70 112 -93
8000i3K9j08R0L17k05k3o6J63q5k9M6M3j81L36k74K43j88j19O0K05qn4K58l93
$$ -93 -64 -172 -82 235 30 7 -59 104 19 -10 36 79 -102 234 -40 203 15 -104 -44 161 153 99 357 -36
8024c6Pm7j9j9J86J22p6k65M3O4O1j17L11k85j15KK33J36Mj86J0j41K69l07J2
$$ -36 -29 -76 -95 -114 72 194 118 -147 -104 -40 21 -96 215 -70 -185 -183 50 186 190 4 14 -127 142 -165 -153
8049a53M59l66j55K69L2j38k19L81q2J8j68N7j8J82j51Q7K17k56q2K05P3k72K4
$$ -153 306 -60 -215 54 86 -52 -271 110 28 46 -122 -65 -83 99 -52 35 252 -4 -86 119 192 -80 -56
8072e6LL36j18j20Q5j35j92K57m8m2K11m67K82o1K90k6p4k25J21o4Km3N0P0J8
$$ -56 -53 283 165 45 130 -5 -197 60 12 -30 181 -286 -4 -65 225 199 125 -100 21 -43 -41 -84 -34 36 54
8097E4j08K96k11k13J84O7l92M98k01k00K85j03o6j6J73k45M8J77k1j58L64l65
$$ 54 -54 242 31 -182 2 69 -323 175 -26 -226 59 -44 -110 -126 47 -198 -150 27 6 -152 212 -153
8119a53j34K91L4j10J76m7M6j44P4K0k03r0N2M3Q0O1p0m1L17n5kj45R3q9n1j76
$$ -153 -287 4 38 -72 104 57 103 -41 33 53 -150 -240 -188 -145 -65 -4 -74 -115 202 147 145 0 93 4 -47 -223
8145b23K19R4j71K58l0ll09J48J41k50K94j53J5Nl29M20j38j26L3K06K9l48K20
$$ -223 -4 90 -81 177 147 144 -165 -17 124 -126 168 15 30 35 -294 126 -12 -138 -105 101 130 -218 2
8168BJ71q7Rl13Q7j40K28Q0J50j74k98K06K7k08K88k68K48J11q2J76j59k87M71
$$ 2 173 86 95 -218 -131 -271 -43 37 187 13 -285 -79 -52 -260 28 -240 8 119 37 213 54 -233 238
8191B38
$$ Imaginary data points
##PAGE= N=2
##DATA TABLE= (X++(I..I)), XYDATA
0@%%%%%%%%%qJ6j6J6k4L2m0N6o5P5r8J20j39J63j92K29k69L12l62M18m80N52o32
$$ 0 0 0 0 0 0 0 0 0 0 -8 8 -8 8 -16 16 -24 32 -33 42 -56 64 -75 88 -104 125 -144 168 -194 224 -256 296 -336
32c36P19q16R23j041J170j311J466j639J827k032K256k499K766l058L378l724
$$ -336 383 -433 490 -551 619 -692 774 -865 962 -1070 1186 -1313 1453 -1605 1773 -1951
48a951M103m522M982n489O048o670P366q148R035j0050J1221j2594J4228j6213
$$ -1951 2152 -2370 2612 -2877 3171 -3499 3867 -4281 4754 -5296 5925 -6669 7559 -8654
62h654J8687k1867K6130l2178M1487n7828R4818l32954K1999N29402k99279k22724
$$ -8654 10033 -11834 14296 -17882 23605 -34223 60595 -272359 -250360 279042 -20237 -242961
74b42961K26288K53633k21220j14603K15354J93925j65037j91296P241J27594
$$ -242961 -16673 236960 15740 -98863 116491 310416 145379 -45917 -38676 88918
84H8918j4344j14365n8338P3421J9985p0933k4935Q1940n086j18840l0464J60078
$$ 88918 74574 -39791 -98129 -24708 -4723 -75656 -100591 -18651 -23737 -142577 -173041 -12963
96a2963J33135m4096r7890M6154J12205j6078r8099N4618J29567j00677k55229
$$ -12963 120172 76076 -21814 24340 136545 120467 22368 76986 206553 105876 -149353
107a49353r746J79457l7007j87402N4121J80137m9007j20593J08441J41665n9078
$$ -149353 -159099 20358 -16649 -204051 -149930 30207 -18800 -139393 -30952 110713 51635
118E1635n7563R1349M9101o8575l9753j2l0876o101L1518j9597l8371K2128j284
$$ 51635 -5928 85421 134522 65947 26194 26182 -4694 -10795 20723 1126 -37245 -15117 -16401
131a6401p6981j2679R4342L3179p1093j0500Q6403K7136o2679n93R7420L9522
$$ -16401 -93382 -106061 -11719 21460 -49633 -60133 26270 53406 -9273 -9866 87554 127076
143A27076p7502m6425N3533K738j11274m9574Q4683K9254r2372k2054Q8042J1292
$$ 127076 49574 3149 56682 59420 -51854 -101428 -16745 12509 -79863 -101917 -13875 -2583
155b583o2604M0861J00309j0493n4800K8674K3440n0902j7513L8647j2575m3032
$$ -2583 -65187 -24326 75983 65490 10690 39364 62804 11902 -5611 33036 20461 -22571
167b2571J5386J4595m4514j5173M1974K574l3210K1920L8761k4057k7544L3668
$$ -22571 -7185 7410 -37104 -52277 -10303 -7729 -40939 -19019 19742 -4315 -31859 1809
179A809L0523j6199m29L7211L540m3798k1515K0312j610l7179j1268K5750n655
$$ 1809 32332 16133 15704 52915 56455 12657 -8858 11454 9844 -27335 -38603 -12853 -18508
192a8508m2443M321N5320J4340k6446K2966N0514j6265m2532K0958K9872l6415
$$ -18508 -60951 -56630 -1310 13030 -13416 9550 60064 43799 1267 22225 52097 15682
204A5682l4892K4445O591m1768j0901K7686l188j9058J8501K0431j3486k327K2876
$$ 15682 -19210 5235 11826 -29942 -40843 -13157 -16345 -35403 -16902 3529 -9957 -12284 10592
217A0592j259j3758K1284K5160j6668j5525K0132L441l5964j4219K4825j971m2374
$$ 10592 9333 -4425 16859 42019 25351 9826 29958 33399 -2565 -16784 8041 6070 -36304
230c6304j4313K7199M929k7487P244M8184J5049k5614N481M3351N917l4921k509
$$ -36304 -50617 -23418 -18489 -45976 -38732 9452 24501 -1113 4368 47719 53636 18715 16206
243A6206K4773j3677m0076m657J5593j3467k2991M062J2683J81J691P105K502
$$ 16206 40979 27302 -12774 -17431 -1838 -15305 -38296 -34234 -21551 -21370 -19679 -12574 -10072
256a0072P422J4067K48m521J7672J7100j6897j9440J7080J4740k8047k6292J3790
$$ -10072 -2650 11417 11665 7144 24816 41916 25019 5579 22659 37399 9352 -16940 -3150
269c150O891l5528k3375K5646K0080k1953j1129L4456K8011j2875n461L1773J8412
$$ -3150 3741 -31787 -55162 -29516 -9436 -31389 -42518 -8062 19949 7074 1613 33386 51798
282E1798k2776j7189J4607N437k5456k0713M159J955j3216j0087N348Q923K066
$$ 51798 29022 11833 26440 31877 6421 -14292 -10133 -8178 -21394 -31481 -26133 -17210 -15144
295a5144l710J313J2755J5348j762p332J1864J8285o151j6872Q965J7139j5915
$$ -15144 -18854 -17541 -4786 10562 8800 1468 13332 31617 25466 8594 17559 34698 18783
308A8783k9387K380J5369j6942k9183P105K2095r969j8290J8184L1968j025j3999
$$ 18783 -10604 -8224 7145 -9797 -38980 -31875 -9780 -19749 -38039 -19855 12113 11088 -2911
321b911J4540K3206n976j8619M259J1530j2327k1538k531Q539m289j2297j594
$$ -2911 11629 34835 28859 10240 14499 26029 13702 -7836 -10367 -1828 -6117 -18414 -20008
334b0008Q884L504n301j617R020J0089j791o942O372J4782R71j2469J272J4500
$$ -20008 -11124 -7620 -12921 -14538 -5518 4571 2780 -4162 2210 16992 17963 5494 6766 21266
348B1266l349k0388k527J3663n800k4082l003J7823O87j5508M459K2439L417j3049
$$ 21266 17917 -2471 -4998 8665 2865 -21217 -24220 -6397 -5710 -21218 -16759 5680 9097 -3952
362c952M124J9311J674j6159m192J0388j726j5419m542J0984J769j1296l898J0351
$$ -3952 172 19483 21157 4998 806 11194 9468 -5951 -10493 491 2260 -9036 -12934 -2583
376b583N856n839l065N347M595k335m586J685O716J999p732m264R866N031j1984
$$ -2583 3273 -2566 -5631 -284 4311 1976 -2610 -925 5791 7790 58 -4206 5660 10691 -1293
391a293q045R852L897j4063m424J5027N479j3111j867J5290N823r559j463R135
$$ -1293 -9338 514 4411 -9652 -14076 951 6430 -6681 -8548 6742 12565 3006 1543 10678
405A0678M52j1519o970M894L706p965p826N850P753l993l871R507Q462m368l224
$$ 10678 11130 -389 -7359 -2465 1241 -6724 -14550 -8700 -947 -4940 -8811 696 9158 4790 1566
420A566O817K571n008l051J443o88j318k234n415n67L856l833r279N534J0195
$$ 1566 8383 10954 5946 2895 4338 3650 2332 98 -5317 -5884 -2028 -5861 -15140 -9606 589
435E89o253p740J1627J1347p444l404J4183P101r244m120M470k625q700l868l8
$$ 589 -5664 -13404 -1777 9570 2126 -1278 12905 20006 10762 6642 11112 8487 -213 -4081 -4119
450d119j913m063n977j242P188L821l493M958J2050N67o254N565J0253l042n852
$$ -4119 -6032 -10095 -16072 -17314 -10126 -6305 -9798 -4840 7210 7777 1523 7088 17341 14299 8447
465H447J731k59n373j491m605p516J047L306q515n595R774M366j0374K429J6346
$$ 8447 10178 9919 4546 3055 -1550 -9066 -8019 -4713 -13228 -18823 -9049 -4683 -15057 -12628 3718
480C718M110m826P983Q476o734m986P125Q85r753m678j610p720n121K94j780L90
$$ 3718 7828 3002 10985 19461 12727 7741 14866 15751 5998 1320 -290 -8010 -13131 -12837 -14617 -14227
496a4227N369k4l378P324R984k465l34J0582L938o779M48L990o192n508J556l130
$$ -14227 -8858 -8882 -12260 -4936 5048 2583 2249 12831 16769 9990 10438 14428 8236 2728 4284 1154
512A154o538M68k116r520m0Q385k280k754J2048O629q109J430J4285J321p337
$$ 1154 -5384 -4916 -7032 -16552 -16592 -8207 -10487 -13241 -1193 5436 -2673 -1243 13042 14363 7026
527G026N659N493j0079p650K503k939o670O63P81o472N0M112k518o44R990M244
$$ 7026 12685 18178 8099 449 2952 13 -6657 -5994 -5213 -11685 -11635 -7523 -10041 -10685 -695 3549
543C549m452L870P929m155m756O773K587o136n61K450o889n484K254k520m573
$$ 3549 -903 2967 10896 6741 1985 8758 11345 5209 4648 7098 209 -5275 -3021 -5541 -10114
558a0114N197K789p145r6R248j342m116R976P606p569l122P465k405p822L746
$$ -10114 -4917 -2128 -9273 -9369 -121 -1463 -5579 4397 12003 4434 1312 8777 6372 -1450 2296
573B296M343o666l492L461l563m644N279K854m713K862N549m771m179O873K212
$$ 2296 6639 -27 -3519 -58 -3621 -8265 -2986 -132 -4845 -1983 3566 -1205 -5384 1489 3701
588C701n648K111O712m482m708L666P89m246J914M402l942k705L635k059m675
$$ 3701 -1947 164 6876 2394 -2314 1352 2141 -2105 -191 4211 269 -2436 1199 -860 -5535
603e535N080M915m987j518N890l020o950M671M942m942k278N298j451n349L853
$$ -5535 -455 4460 -527 -2045 3845 825 -6125 -1454 3488 -1454 -3732 1566 115 -5234 -1381
618a381M578k324N41M948k403l476L428K95o052R43M613n206m945L829M26n681
$$ -1381 3197 873 1414 6362 3959 483 3911 4206 -1846 -903 3710 -1496 -6441 -2612 -2186 -7867
634g867J314O141o58j843M645J128l085K696M388j547n17K944l164n617J644J684
$$ -7867 -6553 -412 -1070 -2913 1732 2860 -225 2471 6859 5312 4795 7739 4575 -1042 602 2286
650B286n771k445L736k219n503J930M354j284M54N599J577n44L645K322k637Q99
$$ 2286 -3485 -5930 -2194 -4413 -9916 -7986 -3632 -4916 -4462 1137 2714 2170 5815 8137 5500 6399
666F399L121l098m144J481k093p235k022L101k329k998K883K090k168J589N415
$$ 6399 9520 6422 2278 3759 1666 -5569 -7591 -4490 -6819 -9817 -6934 -4844 -7012 -5423 -8
681hJ418J641L971J105j378J381J186l770k244J781l256n940q02L36m138j560
$$ -8 1410 3051 7022 8127 6749 8130 9316 5546 3302 5083 1827 -4113 -4915 -4579 -8717 -10277
697a0277K972Q56j043K594L668J192J788M096J274O20K012j40l277j342j13l864
$$ -10277 -7305 -6449 -7492 -4898 -1230 -38 1750 5846 7120 7740 9752 9612 6335 4993 4880 1016
713A016l917p8r22m312j082J787q8j46L350L083M91K783K380K93J438K760r1k873
$$ 1016 -2901 -2979 -3901 -8213 -9295 -7508 -7596 -7742 -4392 -1309 -818 1965 4345 4638 6076 8836 8745 5872
731E872m00n41l230l240M0j315l169j294O22j04N18J488J652J214K560K427O90
$$ 5872 5472 4931 1701 -1539 -1499 -2814 -5983 -7277 -6655 -6759 -6241 -4753 -3101 -1887 673 3100 3790
748C790J758J346q10j098P23n95l192j783m09k329k272k81P89p47j29N25J369
$$ 3790 5548 6894 6084 4986 5709 5114 1922 139 -270 -2599 -4871 -5152 -4363 -5110 -5239 -4714 -3345
765c345J687J545J199J072J399M52n15L81R55j262j721r18l86j403j273m38O3
$$ -3345 -1658 -113 1086 2158 3557 4009 3494 3875 4830 3568 1847 929 543 -860 -2133 -2571 -2508
782b508j142m8O08O87O72Q30M51O92J015N10J78O72L68q99r41K31p4o22j088J90
$$ -2508 -3650 -3698 -3090 -2403 -1731 -901 -450 242 1257 1767 1945 2617 2985 2086 1145 1376 1302 680 -408 -218
802b18l14p46j78K03N36l20m76NP04O1j84P88M50j30L0M15Q24J82J69m30K01m7
$$ -218 -532 -1278 -1456 -1253 -717 -1037 -1513 -1508 -804 -743 -927 -139 311 181 211 626 1450 1632 1801 1371 1572 1525
824A525m67n10j53k40j159o07j32J42N8j061N10K99N21j07R77J408L77j55R34
$$ 1525 1058 548 395 155 -1004 -1611 -1743 -1601 -1543 -2604 -2094 -1795 -1274 -1381 -404 1004 1381 1226 2160
843B160J039R8m72l2k07j141j503j50p29j155j461m6j18m24O51R32J115J106R54
$$ 2160 3199 3297 2825 2793 2586 1445 -58 -208 -937 -2092 -3553 -3599 -3717 -4141 -3490 -2558 -1443 -337 617
862F17J204P36J615L40m88k14k51o42j375j375p42j215k053o90m6O92q81M14J709
$$ 617 1821 2557 4172 4512 4024 3810 3559 2917 1542 167 -575 -1790 -3843 -4533 -4579 -3887 -4768 -4354 -2645
881b645J367N53J382K536J348m24M66J354q71j565r37r07j765k194j211n24p96
$$ -2645 -1278 -725 657 3193 4541 4117 4583 5937 5066 3501 2564 1657 -108 -2302 -3513 -4037 -4833
898d833o10l5M20J325J730Q14J755K000J211L34L35J441k53j249j519p32r32j979
$$ -4833 -5443 -5478 -5058 -3733 -2003 -1189 566 2566 3777 4111 4446 5887 5634 4385 2866 2134 1202 -777
916g77k066q83n04q39j283J051J980o5O5K927K677J88P09K271R28j918J24K03
$$ -777 -2843 -3726 -4230 -5069 -6352 -5301 -3321 -3386 -3321 -394 2283 2471 3180 5451 6379 4461 4585 4788
934D788j877k141k78j528k451o57J77j371P0J643N94l58J995K821o7K14K350J495
$$ 4788 2911 770 492 -1036 -3487 -4144 -3967 -5338 -5268 -3625 -3031 -3389 -1394 1427 1360 1574 3924 5419
952E419q63o27K81q57j058j507j218p59j059j600j331J521J89p33J248K400L87
$$ 5419 4556 3929 4210 3353 2295 788 -430 -1189 -2248 -3848 -5179 -3658 -3469 -4202 -2954 -554 -167
969a67j53J847J882r68M32J798l32k152m5m98k340l28Q16j202k055R05Q56j878
$$ -167 -320 1527 3409 2441 2873 4671 4339 2187 2142 1644 -696 -1024 -208 -1410 -3465 -2560 -1704 -3582
987c582j87K918P04j456J504K286r42o18J996O61j282r9N87j121r81k94j113o01
$$ -3582 -3769 -851 -147 -1603 -99 2187 1245 627 2623 3284 2002 1903 2490 1369 388 94 -1019 -1620
1005a620Q16r68j089J282J81j387O70K592j96j204J672R95j533l19K711l29j569
$$ -1620 -804 -1772 -2861 -1579 -1398 -2785 -2115 477 281 -923 749 1744 211 -108 2603 2274 705
1022G05J044N33k208q69K492j397k297J611N57k613p97K327m62j506J592K223
$$ 705 1749 2282 74 -795 1697 300 -1997 -386 171 -2442 -3239 -912 -1374 -2880 -1288 935
1038I35j099n20J962K15j62M46J061q22k69N86j989n26P53n77j738M49L83j819
$$ 935 -164 -684 1278 1493 1331 1777 2838 2016 1747 2333 344 -182 571 -6 -1744 -1295 -912 -2731
1056b731r24J720j2m43J778J608j153K26K606J56j021J790O87k807l48J234j662
$$ -2731 -3655 -1935 -1947 -2390 -612 996 -157 69 2675 2831 1810 3600 4287 1480 1132 2366 704
1073G04l149J159O10k853j108K610l90k027J889K386k15K13K755K34m39J000O35
$$ 704 -2445 -1286 -676 -3529 -4637 -2027 -2417 -4444 -2555 -169 -384 -171 2584 2818 2379 3379 4014
1090D014r31k17N11k348j759L41j239j950P14O37j959l82J835M77LJ981K187J6
$$ 4014 3083 2866 3377 1029 -730 -389 -1628 -3578 -2864 -2227 -4186 -4568 -2733 -2256 -2253 -272 1915 1931
1108A931M78J916n51j004J301j24k399j097N86k067k803M95Q87k090K1K284J75
$$ 1931 2409 4325 3774 2770 4071 3947 1548 451 1037 -1030 -3833 -3338 -2451 -4541 -4520 -2236 -2061
1125b061q55J735K175K31Q55J839K40p16L09o1j809k04k52j888j497q7m36k040
$$ -2061 -2916 -1181 994 1225 2080 3919 4159 3443 3752 3691 1882 1678 1426 -462 -1959 -2046 -2482 -4522
1143d522N06J079l02L10J833P80K59J659J578j97L74R26j127j138M36k96k827
$$ -4522 -4016 -2937 -3239 -2929 -1096 -316 -57 1602 3180 2983 3357 4283 3156 2018 2454 2158 -669
1160f69p64J037j562j684N88O16j104J14K170P34m02J070J506j06P85R10M9p92
$$ -669 -1433 -396 -1958 -3642 -3054 -2438 -3542 -3428 -1258 -524 -926 144 1650 1544 2329 3239 3288 2496
1178B496K09o88j650l13Q4j620q45M19j00r79M09J051j01L41J585J60j56J381
$$ 2496 2705 2017 367 54 138 -1482 -2327 -1908 -2008 -2987 -2578 -1527 -1628 -1287 298 458 302 1683
1196A683L81o80L49R86p91j267O01Q0j977m66N44k08j643O57M33o16k6P60O26
$$ 1683 2064 1384 1733 2719 1928 661 1262 1342 -635 -1101 -557 -765 -2408 -1751 -1318 -1934 -1960 -1200 -574
1215e74J40O33L64K98L81O35p26J39M18n97p68j02L45r97n34J61k36o62K2J73
$$ -574 -434 199 563 861 1242 1877 1151 1290 1708 1111 343 241 586 -411 -945 -784 -1020 -1682 -1660 -1487
1235a487Q4n6P38j65L32Q69N57l68Q35Q49k13q32N00M29j101q27k1m59r17k77
$$ -1487 -1403 -1459 -721 -886 -554 315 872 504 1339 2188 1975 1143 1643 2072 971 144 123 -336 -1253 -1530
1255a530J10n15mk01M24Q13J12N16N17Q95J56L58K18M21J1l72j11m34q85o61n68
$$ -1530 -1420 -1935 -1939 -2140 -1716 -903 -791 -275 242 1137 1293 1651 1869 2290 2301 1929 1818 1384 499 -162 -730
1276g30m99r37j41l19k67P44N21J61P81J199P45N93L04P96j46l36j65j48p06j754
$$ -730 -1229 -2166 -2307 -2626 -2893 -2149 -1628 -1467 -686 513 1258 1851 2155 2951 2805 2469 2304 2156 1450 -304
1296c04J51p35j041o84R8k73qLQ39J005N68Q72P81P97N83L32m6M59p87q91l66
$$ -304 -153 -888 -1929 -2613 -2515 -2788 -2796 -2793 -1954 -949 -381 491 1272 2069 2652 2984 2938 3397 2610 1719 1353
1317A353j372q76m58q03n66j89m3j91N87J077P89N68N85J474L14P2N20L50j22
$$ 1353 -19 -895 -1353 -2156 -2722 -2911 -2954 -3145 -2558 -1481 -692 -124 461 1935 2249 2321 2841 3191 3069
1336C069j303l69j42r23j053p10l50o93p18O59L2J52O22O41J032O39P12J017K72
$$ 3069 1766 1397 1255 332 -721 -1431 -1781 -2474 -3192 -2533 -2501 -2349 -1727 -1086 -54 585 1297 2314 2586
1355B586P4Q0J8m26j098l00q82q72n37l11r90K89N6M83j27L79R95Q98J34K91J511
$$ 2586 2660 2740 2758 2332 1234 934 52 -820 -1357 -1668 -2658 -2369 -2313 -1830 -1957 -1578 -583 315 449 740 2251
1376B251j94j42P2K45n86n14o15l28n90q16k99j33l65j59K57P12k11P62M71N83
$$ 2251 2057 1915 1987 2232 1646 1132 517 189 -401 -1217 -1516 -1649 -2014 -2173 -1916 -1204 -1415 -653 -182 401
1396D01N29L95M79m7m4J80l91n50q5m20o05o30j96J18m54n79O2O25K61m4M43L19
$$ 401 930 1325 1804 1757 1713 1893 1502 952 867 447 -158 -788 -984 -866 -1320 -1899 -1837 -1212 -951 -995 -552 -233
1418b33L65R6M53N80L31k37J26j17n53k40j5o50n73Nn98k46J83k32M04Q5M87J02
$$ -233 132 228 681 1261 1592 1355 1481 1364 811 571 556 -94 -667 -662 -1260 -1506 -1323 -1555 -1151 -1066 -579 -477
1440d77J67L17Q44R4K8J94M42k40k6Kq63L3m61k62n84n3n31k05LJ38R6J77R12
$$ -477 -310 7 851 945 973 1167 1609 1369 1343 1345 482 515 54 -208 -792 -845 -1376 -1581 -1578 -1440 -1344 -1167 -255
1463b55K28j24Q66P43m09M84M48m31l56m06J89r74l49Qo35m42k44J12m29lR12
$$ -255 -27 -151 715 1458 1049 1533 1981 1550 1194 788 977 3 -346 -338 -973 -1415 -1659 -1547 -1976 -1979 -1067
1484a067J94J42P40N33L45M79P33r2L3L25p20j027j43m3j160q59M02m91j004P19
$$ -1067 -873 -731 9 542 887 1366 2099 2007 2040 2365 1645 618 475 432 -728 -1587 -1185 -1676 -2680 -1961
1504a961O69k79M98J241l5q0J126P08j49M8N46n61k26l56l58j160l23m8p18q63
$$ -1961 -1292 -1571 -1073 168 133 53 1179 1887 1738 1786 2332 1771 1545 1189 831 -329 -652 -700 -1418 -2281
1524b281J64N68q26M49J309J50K18J174N55O7L33M19j58m25L93r62j088l35J5
$$ -2281 -2117 -1549 -2375 -1926 -617 -467 -249 925 1480 1547 1880 2299 2141 1716 2109 1147 59 -276 -261
1543b61j263n13M47o29l67P06Q81m54M22J326N80l36J131M80m61q9O02l70j075
$$ -261 -1524 -2037 -1590 -2219 -2586 -1880 -999 -1453 -1031 295 875 539 1670 2150 1689 1600 2202 1832 757
1562G57j50k11j437m66O01j263k60P41N34m46L19J205l1J2J259O13n34M35M47
$$ 757 607 396 -1041 -1507 -906 -2169 -2429 -1688 -1154 -1600 -1281 -76 -107 -95 1164 1777 1243 1678 2125
1581B125o42n10M13n75j149m11N04j051o13M12j8n07N90R52j86J69J298L32l71
$$ 2125 1483 973 1386 811 -338 -749 -245 -1296 -1909 -1497 -1515 -2022 -1432 -480 -666 -497 801 1133 762
1600G62O09Q03n19m52L10o37n41m1J7j645K03J65n41p98Q81O95n58L71J186R4
$$ 762 1371 2174 1655 1203 1513 876 335 294 311 -1334 -1131 -966 -1507 -2305 -1424 -729 -1287 -916 270 364
1620C64k13J260L4l41J47O09o52k97J76l72j253N7L23p35o01J70J02p86Q78N60
$$ 364 151 1411 1445 1104 1251 1860 1208 911 1087 715 -538 -481 -158 -893 -1494 -1324 -1222 -2008 -1130 -570
1640e70J48j17R05K36k19Q42L52m96j84N78p21n70J73k78p31l24M56n84l48L28
$$ -570 -422 -539 366 602 383 1225 1577 1081 897 1475 754 184 357 79 -652 -976 -520 -1104 -1452 -1124
1660a124L03m54J31J248l66J55Q48M85l97J22P69n77l61L04l73r91J02j83m85
$$ -1124 -821 -1275 -1144 104 -262 -107 741 1226 829 951 1720 1143 782 1086 713 -278 -176 -359 -844
1679h44m52K01J47q16M20N95N3J1R00K22MO95L26k96L1L70M9q69j44l67n94o68
$$ -844 -1296 -1095 -948 -1764 -1344 -749 -696 -685 215 437 441 1136 1462 1166 1197 1567 1616 747 603 236 -358 -1026
1701a026K05l53m12K06K09k76K44R60K9J61P00O60k89K98K24L9m73K98n98p44
$$ -1026 -821 -1174 -1586 -1380 -1171 -1447 -1203 -243 -214 -53 647 1307 1018 1316 1540 1579 1106 1404 806 62
1721F2m38J28p01n82L44l90j05K71O26m8N71Q82P1j34N73Q01k74j13l2k90k60
$$ 62 -376 -248 -949 -1531 -1187 -1577 -1682 -1411 -785 -833 -262 620 691 557 1130 1931 1657 1544 1512 1222 962
1742I62o56n23o77m4l87K8p19N78J73q1L32O57K24O39L81L93K56p0J04k19k22
$$ 962 306 -217 -894 -938 -1325 -1297 -2016 -1438 -1265 -1346 -1014 -357 -133 506 887 1280 1536 1466 1570 1351 1129
1763A129n04j48l65n97l32j24p23J18k63L39K83L92J93N86R08P3j3L12N48o09
$$ 1129 625 477 112 -485 -817 -941 -1664 -1546 -1809 -1470 -1187 -795 -602 -16 892 965 952 1264 1812 1203
1783A203k26J92k94m85n08o13k8m82r6r2qOR6K88O73L68L86J81N74J89j06L95
$$ 1203 977 1169 875 390 -118 -731 -759 -1241 -1337 -1429 -1437 -1431 -1335 -1047 -374 -6 380 561 1135 1324 1218 1613
1805A613k09l36k24m99k34m50l15m96k21J28j16Q1K7N33M58J1N90K10L22p9K34
$$ 1613 1404 1068 844 345 111 -339 -654 -1150 -1371 -1243 -1359 -1278 -1251 -718 -260 -249 341 551 873 794 1028
1826A028M5R8m36l48M61p43n50O2Qm51k39q2MM12k4J51N54J52M24J53KM96j01
$$ 1028 1073 1171 735 387 848 105 -445 -383 -375 -826 -1065 -1147 -1143 -731 -755 -604 -50 102 526 679 681 1177 1076
1849A076J48n24K20m99j25l73J09m28j17m91k26K75K28O0N2J27K99L22K40P9K42
$$ 1076 1224 700 920 421 296 -77 32 -396 -513 -1004 -1230 -955 -727 -667 -615 -488 -189 133 373 452 694
1870F94J84K57m48J35k67r2j73m17J41r69K94j54l36N4K29J34J54L84J53J25M57
$$ 694 878 1135 687 822 555 463 290 -127 14 -955 -661 -815 -1151 -1097 -868 -734 -580 -196 -43 82 539
1891E39J15K05l14K06N8o8k35k8m51n1k45k89k19k23J43l85J58L06J97N27k9L75
$$ 539 654 859 545 751 809 741 506 478 27 -24 -269 -558 -777 -1000 -857 -1242 -1084 -778 -581 -54 -83 292
1913B92L21p9K70L53j17pl22l08Q7l10l72l96l18k4K9J5m37L49K78P0O81J7M47
$$ 292 613 534 804 1157 1040 1033 711 403 490 180 -192 -588 -906 -930 -901 -886 -1323 -974 -696 -626 55 72 519
1936E19oM49J91Q5j45L1m85k58k50k56p06J67l13k94P6J48k94L01P52n1P2Q22
$$ 519 513 962 1153 1238 1093 1124 639 381 131 -125 -831 -664 -977 -1271 -1195 -1047 -1341 -1040 -288 -339 -267 555
1958E55L92J43k92K79M61m79k1j20p67j81k07n84j14J38k41k67K3L84K33J26Q83
$$ 555 947 1090 798 1077 1538 1059 1038 918 151 -30 -237 -821 -935 -797 -1038 -1305 -1282 -898 -665 -539 344
1979C44K75k58K93Q74l64J17k07l52k25j15m03n16l06lm39kK02K44k11M05N57
$$ 344 619 361 654 1528 1164 1281 1074 722 497 382 -21 -537 -843 -846 -1285 -1287 -1085 -841 -1052 -647 -90
2000i0K66J15K48O27j67J78j04J66n98K46m86n57k27l96l65k38L15L0J65R7N30
$$ -90 176 291 539 1166 999 1177 1073 1239 641 887 401 -156 -383 -779 -1144 -1382 -1067 -1037 -872 -775 -245
2021b45J85QP08L00j07J32J05K38l68j0k44n48P7l69o08l56K22j02l73M06M35
$$ -245 -60 -52 656 956 849 981 1086 1324 956 946 702 154 231 -138 -746 -1102 -880 -982 -1355 -949 -514
2042e14j91L49M69R2L52O1M46jj89J84l71m46J91k91n94k45N59o48k42K27L8k5
$$ -514 -705 -356 113 205 557 618 1064 1063 874 1058 687 241 432 141 -453 -698 -139 -787 -1029 -802 -764 -789
2064g89N3P21k36L50K67K24J26K20J82l80k36K62l67o69J88l6n01l0N8k71j26
$$ -789 -736 -15 -251 99 366 590 716 936 1118 738 502 764 397 -272 -84 -120 -621 -651 -593 -864 -990
2085i90M90J00m8K50M04N9k23Q07J31o86J54M85j73o52n8J47n97LJ14o64J03N81
$$ -990 -500 -400 -448 -198 206 265 42 849 980 294 448 933 760 108 50 197 -400 -397 -283 -947 -844 -263
2107b63k86j12L62L16o0k61N15N13l62O3M68m30R4K20l36m42J27o4m05m25J23
$$ -263 -549 -661 -299 17 -43 -304 211 724 362 425 893 463 557 777 441 -1 126 62 -343 -768 -645
2128f45K08k82j09M17k06j30O51M39L8k7O50n47L14K46m86l7J35j42q53K32q1
$$ -645 -437 -719 -828 -411 -617 -747 -96 343 381 354 1004 457 771 1017 531 494 629 487 -366 -134 -215
2149b15l13n56M86k64o5Q8N46J52M2M81k5K23J94N21m21jk41p0n20q2j50m54q8
$$ -215 -528 -1084 -598 -862 -927 -839 -293 -141 -99 382 357 580 774 1295 874 873 632 562 42 -40 -190 -644 -732
2172g32J56l53j65L12J92j59M78L21M23k03L07K84J69m38M88l50n07L78k50p58
$$ -732 -576 -929 -1094 -782 -590 -749 -271 50 473 270 577 861 1030 592 1080 730 223 601 351 -407
2192d07j83P2o52L99j96nk3M5M54M72m2N14N36n39M53J07j78k23N3k41l88m6k06
$$ -407 -590 -518 -1170 -771 -967 -972 -995 -950 -496 -24 -66 448 984 445 898 1005 827 604 657 416 28 -18 -224
2215b24o50L6j25Q5PK98O6J47J9L45M93J54L02M7k66N1L78o10k10m56k16j32j32
$$ -224 -874 -838 -963 -878 -871 -573 -507 -360 -341 4 497 651 953 1000 734 785 1163 553 343 -113 -329 -461 -593
2238e93J00o00L06j18K97j61N35M8L71K28J21J44J8j2J73K31l82m88R7o57J3r4
$$ -593 -493 -1093 -787 -905 -608 -769 -234 -186 185 413 534 678 696 684 857 1088 706 218 315 -342 -329 -423
2260d23j43k17k1j30J23L21L06J8K67P4L44K89LJ22k34k4N5o25j00Q3j62j93j48
$$ -423 -566 -783 -804 -934 -811 -490 -184 -166 101 175 519 808 811 933 699 675 730 105 5 88 -74 -267 -415
2283d15j89r6L00k43J33K46n2L13J65L13o6K17k50L68j18j11k66K14n75K45n02
$$ -415 -604 -700 -400 -643 -510 -264 -316 -3 162 475 409 626 376 744 626 515 249 463 -112 133 -369
2304c69P6m9p5l19P0Q6L51j13K47Q7K03R0R9P5j5L69k48K2k49k79k00Q3j89k29
$$ -369 -293 -342 -417 -736 -666 -580 -229 -342 -95 -8 195 285 384 459 444 813 565 587 338 59 -141 -58 -247 -476
2328d76q4J35l21J78j19Q8M02K83J33k68K81M37k57R0K06o1j85m86J28K30l07
$$ -476 -560 -425 -746 -568 -687 -599 -197 86 219 -49 232 669 412 502 708 647 462 -24 104 334 27
2349B7p09K73l9j75Q4J33j05L09j88M41L01r1Q7R1n8L72j31j70j89O8m03q4J51
$$ 27 -682 -409 -448 -623 -539 -406 -511 -202 -390 51 352 261 348 439 381 753 622 452 263 331 -72 -156 -5
2372en56j24P6J02p7K65n01O09n6M33J31m0J73J79Q3l61K59j89r8j82k3k94o9
$$ -5 -561 -685 -609 -507 -584 -319 -820 -211 -267 166 297 257 430 609 692 331 590 401 303 121 98 -196 -265
2395b65l64j20n3M75q7J00P3j23M63K9K69L53l33K04J69k94J43l09k83j73l50
$$ -265 -629 -749 -802 -327 -414 -314 -241 -364 99 128 397 750 417 621 790 496 639 330 47 -126 -476
2416d76K31j96j82k2k32K8N33k6Q7K92J74J32j29N41l69K97j39l65M13l76k93
$$ -476 -245 -441 -623 -645 -877 -849 -316 -342 -255 37 211 343 214 755 386 683 544 179 592 216 -77
2437g7j25j66j04l35N5J71j2k25%O56Q1L09NK08Rl0L76k54k73J54j15k33l47k71
$$ -77 -202 -368 -472 -807 -752 -581 -593 -818 -818 -162 -81 228 233 441 450 420 796 542 269 423 308 75 -272 -543
2461e43j49L51k7j49j91M08M5l2J51K31p5M53J01j20J44N1j86k62j05P3pl53L9
$$ -543 -692 -341 -368 -517 -708 -300 -255 -287 -136 95 20 473 574 454 598 649 463 201 96 169 162 -191 -152
2484a52l66j83m6J74j69k0M25n8N27k32p1N92k8K70j58l2J80k82Om14k51Ql02
$$ -152 -518 -701 -747 -573 -742 -762 -337 -395 132 -100 -171 421 393 663 505 473 653 371 377 -37 -288 -280 -582
2507e82J68m8L54o78K08L49q8J76J93J07J01K20l8K78k34J64l69on41L90k37k15
$$ -582 -414 -462 -108 -786 -578 -229 -317 -141 52 159 260 480 442 720 486 650 281 275 -266 124 -113 -328
2529c28mm14K24j46J34L1K19K9J91q4K52J61O1J89K62n83O0R5l6j78j04k11j93
$$ -328 -332 -746 -522 -668 -534 -503 -284 -255 -64 -148 104 265 326 515 777 194 254 349 313 135 31 -180 -373
2552c73J30k84K96j06j56J12L48J8J27M11l73O6M83N9j13q9k25j50k23k3k3j3
$$ -373 -243 -527 -231 -337 -493 -381 -33 -15 112 523 150 216 699 758 645 556 331 181 -42 -65 -88 -101
2574a01m48J32k65O8L06M8J47J43j42J58L91K22j77K8J17l15oQ2l87l16K68m64
$$ -101 -549 -417 -682 -614 -308 -260 -113 30 -112 46 437 659 482 510 627 312 306 388 1 -315 -47 -511
2596e11o8J67o2J08k87M16r1j42K08K70L73O3R3j51O0P5n4J5o48N19P8m57l50
$$ -511 -579 -412 -474 -366 -653 -237 -328 -470 -262 8 381 444 537 386 446 521 467 482 -166 353 431 -26 -376
2619c76j47k63K31l3K50m5K23J81oK19J26L96l94R2j77o4J50J48k92n88J56m1
$$ -376 -523 -786 -555 -588 -338 -383 -160 21 15 234 360 756 362 454 277 213 363 511 219 -369 -213 -254
2641b54k34J59k19N4K2K80j62N05k42K57J48N8L5J56k33J78l18p7o1j39M5r7l1
$$ -254 -488 -329 -548 -494 -472 -192 -354 151 -91 166 314 372 407 563 330 508 190 113 52 -87 -42 -139 -170
2664a70j99j58M3J72l5J88j02L02j65K19K19M74m61L56k85j12j5m8k15n2o6j54
$$ -170 -369 -527 -484 -312 -347 -159 -261 41 -124 95 314 788 327 683 398 286 271 223 8 -44 -110 -264
2686b64l31j33K84j73L75o1j74N83j08K39N4j16Q6M31k30r9m5l30J46j16p8q0
$$ -264 -595 -728 -444 -617 -242 -303 -477 106 -2 237 291 175 261 692 462 363 318 -12 134 18 -60 -140
2708a40j71p8j93Mk2K50J81k3J28J88m7L82J35l02K11j21Q8k16k52J1r0k89L3
$$ -140 -311 -389 -582 -578 -600 -350 -169 -192 -64 124 77 459 594 292 503 382 470 254 2 13 -77 -366 -333
2731c33p8j49K57j72O0j52J94M93J42k9j77L98k20R4J17j34j10O6k82j8k25L87
$$ -333 -411 -560 -303 -475 -415 -567 -373 120 262 233 56 454 234 328 445 311 201 267 -15 -33 -258 129
2753A29m12K1l22L48J72j40L9J25j90L20J44K10j46J08J32o0j89j45m8J20m85
$$ 129 -283 -262 -584 -236 -64 -204 -165 -40 -230 90 234 444 298 406 538 478 289 144 96 216 -269
2774b69k4j2r7J28k54J17K19j51O79l64lJ39J34K7O4M57k79k54K70m09l59R4K23
$$ -269 -293 -305 -402 -274 -528 -411 -192 -343 336 -28 -31 108 242 269 333 790 511 257 527 118 -241 -147 76
2797G6o29J84J83j33j60M43j31J16N9K7J62k5J63J45m8n1Q8m2l75K65k85l50j05
$$ 76 -553 -369 -186 -319 -479 -36 -167 -51 8 35 197 172 335 480 432 381 469 427 52 317 32 -318 -423
2820d23L36m72K52r7J91j74P2L8K04L26j40L24l36K94n9r1L7j41N1j71j45r5k2
$$ -423 -87 -559 -307 -404 -213 -387 -315 -277 -73 253 113 437 101 395 336 245 282 141 192 21 -124 -219 -241
2843b41K26l42J71j72K2m6L05n5L87k88K38j52j4K59O3k63K09j68j89mM6n5l41
$$ -241 -15 -357 -186 -358 -336 -382 -77 -132 255 -33 205 53 39 298 361 98 307 139 -50 -54 -8 -63 -404
2866d04K2k43M02j37K0K15O5J73j51N5N01j50K5J11k60j63m8k3k0l85L80m47J24
$$ -404 -382 -625 -223 -360 -340 -125 -60 113 -38 17 518 368 393 504 244 81 33 10 -10 -395 -15 -462 -338
2889c38J73k32J96j26K87j22K12k37K21j7L93n7j97K10n7k31J5N5l52j81J38j40
$$ -338 -165 -397 -201 -327 -40 -162 50 -187 34 17 410 353 156 366 309 78 93 148 -204 -385 -247 -387
2911c87K56k45nJ93j8K70j83K66j47N18l83K54j40o0J70k95j5J60l50J07k50k08
$$ -387 -131 -376 -381 -188 -206 64 -119 147 0 518 135 389 249 189 359 64 49 209 -141 -34 -284 -492
2933d92J45k00K03L34j19o9l8J61N5L17j00p0J90l2J01q7j16l98K12K4k48l0l1
$$ -492 -347 -547 -344 -10 -129 -198 -236 -75 -20 297 197 127 317 285 386 299 183 -215 -3 21 -227 -257 -288
2956b88J31J9j60J59r1M54q5QQq5M28m18J58l1K08k66R2l76q0K9J43k68J03n9
$$ -288 -157 -138 -298 -139 -230 224 139 147 155 70 498 80 238 207 415 149 241 -135 -215 -186 -43 -311 -208 -267
2980b67k33rK92J94k1kL46J23k82K33N5j42k39K47j07J09r4j15k74Q1m04K59j83
$$ -267 -500 -509 -217 -23 -44 -46 300 423 141 374 429 287 48 295 188 297 203 88 -186 -105 -509 -250 -433
3003d33K69j19L31k0r9j9L39k3k06K50K7K60kn31p3j3N0l24K5P4j77J68p4Q9K
$$ -433 -164 -283 48 28 -71 -90 249 226 20 270 297 557 555 24 -49 -62 -12 -336 -311 -237 -414 -246 -320 -231 -229
3028b29L11j50J03J51j10Q5J1N08m59j28J2k30K38k63L5j59k1L56m41j69J01Q7
$$ -229 82 -68 35 186 76 161 172 680 221 93 105 -125 113 -150 -115 -274 -295 61 -380 -549 -448 -361
3050c61K80K57k7j26J01J70J75n4l45K67J98m83j66J25M5j99J65P5o2k94j39K58
$$ -361 -81 176 149 23 124 294 469 415 70 337 535 52 -114 11 56 -143 22 97 35 -259 -398 -140
3072a40q6L98n3j56k2N7K32K15j79J4R4m28K00J69o19K47o3j9j63l6J19p3m9K53
$$ -140 -226 172 119 -37 -59 -2 230 445 266 280 374 -54 146 315 -304 -57 -120 -139 -302 -338 -219 -292 -341 -88
3096h8Q8J1J80J1l0J31k84J64j02J04J16l27l1J18q4P6l00Q8l90L63K39k96J33
$$ -88 0 11 191 202 172 303 19 183 81 185 301 -26 -57 61 -23 53 -247 -159 -549 -186 53 -243 -110
3119a10j3L01J6l8K90k64r3J4Q6nK33l96K70k49J14k63P1R0n01K77j96L83P3R8
$$ -110 -123 178 194 156 446 182 89 103 189 184 417 21 291 42 156 -107 -36 54 -447 -170 -366 17 90 188
3143A88l5k49N21r3n03L04j72K06r6k50L03k83r1K60l27J04m2K53l22J08J95j74
$$ 188 153 -96 425 332 -171 133 -39 167 71 -179 124 -159 -250 10 -317 -213 -255 -2 -324 -216 -21 -195
3165a95J76J69J16J00k39J3j02J45K21m72J32k53k17L42j13M9p1Pk09K91J27k48
$$ -195 -19 150 266 366 127 140 38 183 404 -68 64 -189 -406 -64 -177 -128 -199 -192 -401 -110 17 -231
3187b31L94j05K69J02j15j18M3k70J97n3j92q1L9j90J37K82m44K14Q3k04L24j23
$$ -231 163 58 327 429 314 196 239 -31 166 113 -79 -160 -121 -311 -174 108 -336 -122 -39 -243 81 -42
3209d2K4k7K09K15l73Q1n2K34k7k77Mj42K76k79N4l93M13j30P6K15j59J00j46
$$ -42 -18 -45 164 379 6 87 35 269 242 -35 -31 -173 103 -176 -122 -515 -102 -232 -156 59 -100 0 -146
3232a46M42k90l9K27j6J28mj11J35m07J48Q7k5J17l38J88k10r7K30l3j37P3J44
$$ -146 296 6 -33 194 178 306 302 191 326 -81 67 154 129 246 -92 96 -114 -211 19 -14 -151 -78 66
3255F6J21k18K10R3j80J76j06J42l60k1R3l46J76o1J7J47p1j36L1K50P7J27P9
$$ 66 187 -31 179 272 92 268 162 304 -56 -77 16 -330 -154 -215 -198 -51 -122 -258 -227 23 100 227 306
3278C06j98MOo1J58k73K77J89k55l80O3M1j55K64j46k6mK6J1K31j57l16M42P1
$$ 306 108 112 118 57 215 -58 219 408 153 -227 -164 -123 -278 -14 -160 -186 -190 -164 -153 78 -79 -395 47 118
3302A18L90l43J30j77k22J79o6p9j49j0M3l3L19k09M7l6J9N2N8L04j46R6pMj86
$$ 118 508 165 295 118 -104 75 9 -70 -219 -229 -186 -219 100 -109 -62 -98 -79 -27 31 335 189 285 278 282 96
3327I6p5M11l22K9K20l02j12p1J56k14J71k14K65k11MP1K41p2J3K82k75o1J92
$$ 96 21 432 110 139 359 57 -55 -126 30 -184 -13 -227 38 -173 -169 -98 143 71 84 366 91 30 222
3350B22Q3k48j22K1n1l59J80J4L8K09p1J24k83M32l00j52J68l4K10j36k0O3K84
$$ 222 305 57 -65 -44 -95 -454 -274 -260 -222 -13 -84 40 -243 189 -111 -263 -95 -129 81 -55 -75 -12 272
3373B72p9K9k22K3r8R4%k58Ol2K10j09J54K2l80N40M2k07j40N11j86j40N8nK2
$$ 272 193 222 0 23 -75 19 19 -239 -233 -265 -55 -164 -10 12 -368 172 214 7 -133 378 192 52 110 105 127
3398A27k37J22j73j03Q5Q0m48J67L63J04mr4k80K84j39K12L70l48P0R6k10j48
$$ 127 -110 12 -161 -264 -179 -99 -547 -380 -17 87 83 -11 -291 -7 -146 66 436 88 158 254 44 -104
3420a04J44J27j44l34K19k92L66m7k25J78J18r9k51L51k93M91O5k02J81q5K03
$$ -104 40 167 23 -311 -92 -384 -18 -65 -290 -112 6 -93 -344 7 -286 205 270 68 249 164 367
3441C67j87J40m49J21R4k31l3O7m9p4P3N8j32L25j93o2M19k2J30m7r7L3k13Q9
$$ 367 180 320 -129 -8 86 -145 -178 -111 -160 -234 -161 -103 -235 90 -103 -165 254 232 362 315 218 251 38 127
3465A27j84lM6n0%Q1j10o7o1j70K09R3J83K36j78o1r7j19O0J89r9k11J33k31K10
$$ 127 -57 -60 -14 -64 -64 17 -93 -160 -221 -391 -182 -89 94 330 152 91 -6 -125 -65 124 25 -186 -53 -284 -74
3490g4J20nj81j72K51l41M12o7O7J81K4K11n33j53L38mJ4j4j91L94K6k51j75k9
$$ -74 46 41 -140 -312 -61 -402 10 -57 10 191 215 426 -107 -260 78 74 88 74 -117 277 303 52 -123 -152
3514a52q0J63J02l41L11n5J4M9j48M29j42J43j49j75L23l30K18J74k55k00O9j35
$$ -152 -232 -69 33 -308 3 -52 -38 11 -137 292 150 293 144 -31 292 -38 180 354 99 -101 -32 -167
3536a67n6K97k46Q6LJ56K8l36J78J39l8j3K99j39L1j10R0k54nK31l36L42k40j12
$$ -167 -223 74 -172 -86 -83 73 101 -235 -57 82 44 31 330 191 222 112 202 -52 -57 174 -162 180 -60 -172
3560a72M8j01J59k25J32PK44l23J98J47j73p0R4P9Oj94J90r1Q1k05MJ48l7k45
$$ -172 -124 -225 -66 -291 -159 -152 92 -231 -33 114 -59 -129 -35 44 50 -144 46 -45 36 -169 -165 -17 -54 -299
3584b99p1K52j82K45n8R6Oj77L14J80j59K53j56q1k20J73O0j77J53m8j66j05j9
$$ -299 -370 -118 -300 -55 -113 -17 -11 -188 126 306 147 400 244 163 -57 116 176 -1 152 104 -62 -167 -186
3607a86J47m7o0J81j00j2J93j50J86l8pj82J11j50O4K85m1k92J06R9j08r6J23
$$ -186 -39 -86 -146 35 -65 -77 116 -34 152 114 107 -75 36 -114 -50 235 194 -98 8 107 -1 -97 26
3630B6K7k81K03l8L93k59k24qL81K2j40o5K32l70J32J04n25M71pl14K12k6p7j92
$$ 26 53 -228 -25 -63 330 71 -153 -161 220 242 102 37 269 -101 31 135 -390 81 74 -240 -28 -54 -131 -323
3654c23J92L61j02K90k47qj58K32k54J6J52r9j02R4j6m8j21p8L16j42o9J34k14
$$ -323 -131 230 128 418 171 163 5 237 -17 -1 151 52 -50 44 28 -20 -141 -219 97 -45 -114 20 -194
3677a94j1K20N5p4K0n1M31k86L1o3M3K2k53J48j60m8R2j15K24L88o60O0J94K28
$$ -194 -205 15 70 -4 16 -35 396 110 141 78 121 143 -110 38 -122 -170 -78 -193 31 419 -241 -181 13 241
3701B41Qn43L50O3K2R8j74J17k20J18j70j69J46O5J38P1m71J89J2J32oK7j67J50
$$ 241 249 -294 56 119 141 239 65 182 -38 80 -90 -259 -113 -48 90 161 -310 -121 -109 23 17 44 -123 27
3725B7o7J22k2Q9l91K68K82l40L46q4k07L44j2l36k9K06j51k5Rj11q8K50J75n02
$$ 27 -40 82 60 149 -242 26 308 -32 314 230 23 367 355 19 -10 196 45 20 29 -82 -170 80 255 -247
3749b47L70k9n1j43K28q3l4N9J18k21j77p6n3L24J44k80O1J86oj55K13Q1n6m2
$$ -247 123 94 43 -100 128 45 11 70 188 -33 -210 -286 -339 -15 129 -151 -90 96 90 -65 148 229 173 131
3773A31pj48J37m6J4O8j08m4J05j88J79r8O7l35M12j05J51j77J65j05j80N1M69
$$ 131 124 -24 113 67 81 149 41 -3 102 -86 93 -5 62 -273 139 34 185 8 173 68 -112 -61 408
3796D08j17q2j20k94M67J6m42J09o8J81k72J78J70j06j44K39l8Qm3j6J09j15N2
$$ 408 291 209 89 -205 262 278 -164 -55 -123 58 -214 -36 134 28 -116 123 85 93 50 34 143 28 80
3819H0L35l40j80j07Q5k30K32O1k2j92K21L1R1k32L5k0LK02j33j7K35n5J77l42
$$ 80 415 75 -105 -212 -127 -357 -125 -64 -86 -278 -57 -26 65 -167 -132 -152 -149 53 -80 -97 138 83 260 -82
3843h2O6j8j1p3j10J84j39j40J07RJ74QJ88N1j69qmj5j06N8J63j85J25k75J82
$$ -82 -16 -34 -45 -118 -228 -44 -183 -323 -216 -207 -33 -25 163 214 45 37 33 18 -88 -30 133 -52 73 -202 -20
3868b0K23j06j54o9J1J41N6k31j5L29q4l29j3R6J85J3k34R7K29j04M5Nq7j72M03
$$ -20 203 97 -57 -126 -115 26 82 -149 -164 165 81 -248 -261 -165 20 33 -201 -104 125 21 66 71 -16 -188 215
3893B15j43j3j12j95l2L66j76K58j76j25L77o1j01J17l18j9m2O8j31K15j8j56
$$ 215 72 59 -53 -248 -280 86 -90 168 -8 -133 244 183 82 199 -119 -138 -180 -112 -243 -28 -46 -202
3915b02K22r5Q1l01J46O1N4R0j6m30L49K01j22j06N0pk14M04K0l8j53K18nj54
$$ -202 20 -75 6 -295 -149 -88 -34 56 40 -390 -41 160 38 -68 -18 -25 -239 165 185 147 -6 212 207 53
3939E3o5K3n2J54k28R3K86m1Q3l43L4K5J57m56L83j42J27K4j45J27m7%j45j86
$$ 53 -12 11 -41 113 -115 -22 264 223 306 -37 -3 22 179 -277 106 -36 91 115 -30 97 50 50 -95 -281
3963b81M65j00k52o7J13j38K88M9k24M08l40l04L52J38K7k66K07m21L50j69K73
$$ -281 184 84 -168 -235 -122 -260 28 77 -147 261 -79 -383 -31 107 134 -132 75 -346 4 -165 108
3984A08j48Q3j6j94M9m3J70J8q8m33N01j81J96j21p8P3K6J71R8k87K85r2q9Q6
$$ 108 -40 43 27 -167 -118 -161 9 27 -61 -494 7 -174 22 -99 -177 -104 -78 93 191 -96 189 97 8 94
4008I4j45p7J35O4J06l34J73R2j18j17K22kk73p9J88k7J30p6J37k59J28k65L30
$$ 94 -51 -128 7 71 177 -157 16 108 -10 -127 95 93 -180 -259 -71 -98 32 -44 93 -166 -38 -303 27
4031B7j23j37K22J59P8j61j69M87m54J15J91k57q0M0K80j19K71m58nJ29K5j35
$$ 27 -96 -233 -11 148 226 65 -104 383 -71 44 235 -22 -102 -62 218 99 370 -88 -93 36 61 -74
4053g4k1k37N21j91m0j64Q5J14m3J49l3J15J5k30R0l1J68j57q8J33k22K47j50
$$ -74 -95 -332 189 -2 -42 -206 -121 -7 -50 99 66 181 196 -34 56 25 193 36 -52 81 -141 106 -44
4076d4k84N5J05J45K27k32j75LL84j92j1k15L93j26J99j17J9k75J86j45L6J11
$$ -44 -328 -273 -168 -23 204 -28 -203 -200 184 -8 -19 -234 159 33 232 115 134 -141 45 -100 -64 47
4098D7l87L37q6J46j57ML4o5K57K8j59o2P1l2K03m25M36j2j96k03L01j91p6L6
$$ 47 -340 -3 -89 57 -100 -96 -62 -127 130 158 -1 -63 8 -24 179 -246 190 178 -18 -221 80 -111 -187 -151
4122a51K15j34K39j81O5o2m9j07K10j70R4o4J24L4Op0R1jj09O9j17j5q5J60K42
$$ -151 64 -70 169 -12 53 -9 -58 -165 45 -125 -31 -95 29 63 69 -1 90 89 -20 49 -68 -83 -168 -8 234
4147B34k52n2K75l19K9K60j63M1l1J8l9M3j90J44j6N5J62k9j65j51J75O6p6k8
$$ 234 -18 -70 205 -114 -85 175 12 53 22 40 1 44 -146 -2 -18 37 199 170 5 -146 29 95 19 -9
4171iJ31J95l20Nk1nJ57m9J80o42J15M15k40J28k70L68k22J45k71K32K66n64J27
$$ -9 122 317 -3 2 -19 -24 133 84 264 -378 -263 152 -88 40 -230 138 -84 61 -210 22 288 -276 -149
4194a49j03M95m02NJ47j11K52J3j77K86l36L42m97k8M35n20K21J58p1Q8m11K20
$$ -149 -252 243 -159 -154 -7 -118 134 147 -30 256 -80 262 -235 -263 172 -348 -127 31 -40 48 -363 -143
4216a43R1L80n63J98KQ1ml90K64j6J17R3k4J10l89R5K50l28J10L6J83j95M20n01
$$ -143 -52 328 -235 -37 -35 46 42 -348 -84 -100 17 110 86 196 -193 -98 152 -176 -66 -30 153 -42 378 -123
4240a23q2K83l12J81l8J90L0k06K60q6l83M05k90L19l36J89j6J07j20j24Q1oO7
$$ -123 -205 78 -234 -53 -91 99 129 -77 183 97 -286 119 -171 148 -188 1 -15 92 -28 -152 -71 -77 -10
4263a0n9J40j05O9j95J25J56k85L67n01J88J52j16k31K10J82j00l9M6j5j85M99
$$ -10 -69 71 -34 35 -160 -35 121 -164 203 -298 -110 42 -74 -305 -95 87 -13 -52 -6 -21 -206 293
4285B93j50k15K7Jo2J44J64j37J01k98M3J45J6j75Q6J20k40J76J53k7j10O3l38
$$ 293 143 -72 -45 -44 -106 38 202 65 166 -132 -89 56 72 -103 -17 103 -137 39 192 165 55 118 -220
4308b20J89K20k43Q4j62M4J40j15m1K8K24j4m8j17j41J6Q5K54k01J23j97k29K80
$$ -220 -31 189 -54 30 -132 -88 52 -63 -104 -76 148 134 86 -31 -172 -156 -71 183 -18 105 -92 -321 -41
4331d1O8J72k68JJ27k2K13l85J13nq3K71k63O2O5j06N5J98k83J88r8j13M31k88
$$ -41 27 199 -69 -68 59 37 250 -135 -22 -27 -110 161 -102 -40 25 -81 -26 172 -111 77 -21 -134 297 9
4355Ilm8K41m69J48N9j22k4K23o5j9J15k37P3n8K69L77n21l3K07K8j48j33l4J34
$$ 9 6 -42 199 -270 -122 -63 -185 -209 14 -51 -70 45 -192 -119 -177 92 469 -52 -85 122 150 2 -131 -165 -31
4380c1R1j26NJ58l46L04J89m40J65j54K02j53r1J26J76j73j48M61l00q2K60R6
$$ -31 60 -66 -61 97 -249 55 244 -196 -31 -185 17 -136 -227 -101 75 -98 -246 215 -85 -167 93 189
4402A89j42L2k34Q4p4q6K64q6j03p9J43n4J45M0j61K13J37l15K34j52n8K88j11
$$ 189 47 79 -155 -71 -145 -231 33 -53 -156 -235 -92 -146 -1 39 -122 91 228 -87 147 -5 -63 225 114
4425A14j72rM3K33m05L01p1L2K9Q9j29J38m51M11p9o3O8n4R6l5K60k39k72J37
$$ 114 -58 -67 -24 209 -196 105 34 66 95 184 55 193 -258 153 74 11 79 25 121 86 346 107 -165 -28
4449b8P2nJ48n12K23J7J20j1J19j42J36l1k49J58p4K03lk54L92k22r6K03j85J2
$$ -28 44 39 187 -325 -102 -85 35 24 143 1 137 106 -143 15 -59 144 141 -113 279 57 -39 164 -21 -9
4473io3k5j4m7J13M8l5K3o0K60j61O1k44J06K81l75L4J24Q0j04j4K14l33m7L57
$$ -9 -72 -97 -111 -158 -45 3 -32 -9 -69 191 30 91 -153 -47 234 -141 -107 17 97 -7 -21 193 -140 -187 170
4498A70r7r9O4j37R1j83J57J41j60N7L5R8m6J20M9k38K55m55K47j60K63k92K48
$$ 170 73 -26 38 -99 -8 -191 -34 107 -53 4 39 137 91 211 260 22 277 -178 69 -91 172 -120 128
4521A28k06J1J06m1r3j77L08l10M71j3j29l2r4j9K34j27j57j02K50O1k93J18M76
$$ 128 -78 -67 39 -2 -95 -272 36 -274 197 184 55 23 -71 -90 144 17 -140 -242 8 69 -224 -106 370
4544C70n22J93N4k10K70j04N3k02J05Mj55K39j42J54j30J16k7l38J24K41o1p1
$$ 370 -152 41 95 -115 155 51 104 -98 7 11 -144 95 -47 107 -23 93 66 -272 -148 93 32 -39
4566c9q6O8J07M3O6l12l8N41j66j54j84M54j91p9Ml6m5J7O1p2R1j22P1J54j72
$$ -39 -125 -57 50 93 159 -153 -191 350 184 30 -154 300 109 30 34 -2 -47 -30 31 -41 50 -72 -1 153 -19
4591a9j53M41k81O1K32j58M1j38k68M55l67P9k28K41J37J64j24j87L8j65K36n1
$$ -19 -172 269 -12 49 281 123 164 26 -242 213 -154 -75 -303 -62 75 239 115 -72 -34 -199 37 -14
4613a4M9O1Mq4Q0q1K07j77l8J16k68P1Q6K76k02k97K53N2j0j56J38J37m28K92
$$ -14 35 96 100 16 96 15 222 45 7 123 -145 -74 12 288 86 -211 42 94 84 -72 66 203 -225 67
4637F7J02j40k0Rjo4J53j26Q5p5PJ53m13J97J22k3K2q8k86K26j6j68K63J18ok47
$$ 67 169 29 9 18 17 -47 106 -20 65 -10 -3 150 -263 -66 56 33 55 -33 -319 -93 -109 -277 -14 104 98 -149
4663a49K80j58N0j13LJ97k23K32k34J66j74K56k06k12L65j10J00M4O9lm69M93
$$ -149 131 -27 23 -90 -87 110 -113 119 -115 51 -123 133 -73 -285 80 -30 70 114 183 180 -289 204
4685B04j46j78J33j76J60J25l83K87j70P7p6j41O7J54K54j17k43L19p8j90Q0k62
$$ 204 58 -120 13 -163 -3 122 -261 26 -144 -67 -143 -284 -217 -63 191 74 -169 150 72 -118 -38 -300
4707c00K85j09J82J32k62p5Q8J05j08J06p9J73j00k42J62P1J04k50O28o05j10
$$ -300 -15 -124 58 190 -72 -147 -59 46 -62 44 -35 138 38 -204 -42 29 133 -117 511 -94 -204
4728b04L11l70K21J39k00RL9J05j46L53l21k46M02l59J72k9L1j97K42M50m42p0
$$ -204 107 -263 -42 97 -103 -94 -55 50 -96 257 -64 -310 92 -267 -95 -124 -93 -290 -48 402 -40 -110
4750a10K48k36M46k45ml78L52L5j56j19J28P9l66J67n3L01p6J50l35PJ84L09m09
$$ -110 138 -98 348 103 99 -279 73 108 -48 -167 -39 40 -326 -159 -212 89 13 163 -172 -165 19 328 -81
4773h1j1J65k29N4P6k38J19N5o1J82J56l16L40j54k37K09l98N78l53K42j29l1
$$ -81 -92 73 -156 -102 -26 -264 -145 -90 -151 31 187 -129 211 57 -180 29 -369 209 -144 98 -31 -62
4795f2L59l60kJ36N7J01j18J0l24M25j46k52J15q7K08j89M8j07P8j38L62k24J54
$$ -62 297 -63 -65 71 128 229 111 121 -203 222 76 -176 -61 -148 60 -129 -81 -188 -110 -248 114 -110 44
4818D4O6p5K65l07j2J22k12Q6L06k78K8o3N5l47L91j59J9p3L13l12L15j30j28
$$ 44 110 35 300 -7 -19 103 -109 -23 283 5 33 -30 25 -322 69 -90 -71 -144 169 -143 172 42 -86
4841h6J81P8%N1j71k34K06j16J11Kj03K02Jm2j73J60O5l14L92l04J29O4K41l42
$$ -86 95 173 173 224 53 -181 25 -91 20 22 -81 121 122 80 -93 67 132 -182 210 -94 35 99 340 -2
4865bj61L18J4j08O2j89j37K03J48l12L67l21K08J93j82j40R7K6q2J45k08j52
$$ -2 -163 155 169 61 123 -66 -203 0 148 -164 203 -118 90 283 101 -39 58 84 2 147 -61 -213
4887b13L39n0j03p8J64k14K04J29j14k2j20Q2ok52M89k8o1m49L12L24k52M3k36
$$ -213 126 76 -27 -105 59 -155 49 178 64 42 -78 4 -2 -254 235 207 146 -303 9 333 81 124 -112
4910a12O9K1L5r5LM7k59N32l10p6j8O7N5l5J79M2p3k27K42pJ20l12L55j81j88
$$ -112 -43 -22 13 -82 -79 -32 -291 241 -69 -145 -163 -96 -41 -76 103 145 72 -155 87 80 200 -112 243 62 -126
4935a26L05l89J23O0pK31k21J14L4p3o7K88J6n23L12%k24L21j52j19j7j46R3J36
$$ -126 179 -210 -87 -27 -34 197 -24 90 124 51 -16 272 288 -235 77 77 -147 174 22 -97 -114 -260 -167 -31
4959c1o1K0o7J74q5r2K71j86p0P4j8M7J17j91J95k68N79l53L82n39J96j55l28
$$ -31 -92 -72 -139 35 -50 -142 129 -57 -127 -53 -71 -24 93 -98 97 -171 408 55 437 -102 94 -61 -389
4982c89N74j26J59j18J53k60J59m4k75K57k27K25k99L98l08R6K68m22K29k74K99
$$ -389 185 59 218 100 253 -7 152 108 -167 90 -137 88 -211 187 -121 -25 243 -179 50 -224 75
5003G5l09L43J8l71M02m29L98j16k21J24P5M1j53J26J86j1j76R7k2j05J77j81
$$ 75 -234 109 127 -244 158 -271 127 11 -210 -86 -11 30 -123 3 189 178 2 99 77 -28 149 -32
5025c2j1J10k22K07J1P9j91N7k10M21j22j65K36k92k8M57n72N34k90N6J6j78j
$$ -32 -43 67 -155 52 63 142 -49 8 -202 219 97 -68 168 -124 -152 305 -267 267 -23 33 49 -129 -130
5048a30K09k34K11l2J04j95k19K75p0Q1J62j80J81k63ok03L81l61J85Q9p5j22
$$ -130 79 -155 56 24 128 -67 -286 -11 -81 0 162 -18 163 -100 -106 -309 72 -289 -104 -15 -90 -212
5070b12K37Jj12ml31N18j04J69l06L12l47J06J46J25k02q0J66j11m2J16J73j90
$$ -212 25 26 -86 -90 -421 97 -7 162 -144 168 -179 -73 73 198 -4 -84 82 -29 -71 45 218 28
5092B8k24J28m8j08J41L45m36r7L64j03N6J81m5k64J2K61k28J12K6J04j66j46
$$ 28 -196 -68 -116 -224 -83 262 -174 -271 93 -10 46 227 182 -82 -70 191 -37 75 101 205 39 -107
5114a07N2K00j01l32K5N2J10k5O4Q9J00k19J90n1J83l83N6L67l41M2J63l7k34
$$ -107 -55 145 44 -288 -263 -211 -101 -126 -62 27 127 -92 98 47 230 -153 -97 270 -71 -29 134 97 -137
5137a37K8J6M5r6K08j18Q2o7J51k23l9J53j13K28r9Lk32K85r7j6L8j15Q2J31j40
$$ -137 -109 -93 -48 -144 64 -54 28 -39 112 -111 -150 3 -110 118 19 22 -210 75 -22 -38 0 -115 -33 98 -42
5162d2j9J07J2o2k58L71Q1m33K11k45J95n4J77K5j25O6n1J65k82K19l05m6J92
$$ -42 -61 46 58 -4 -262 109 190 -243 -32 -277 -82 -136 41 66 -59 7 -44 121 -161 58 -247 -293 -101
5185a01J06q4Q2O6n3l9j05L35j24m8J1j65J43m6L21m72N8O8J36k34J41K84k52
$$ -101 5 -79 3 69 16 -23 -128 207 83 35 46 -119 24 -22 299 -173 -115 -47 89 -145 -4 280 28
5208B8J03M4j74j40J60J3j45l85P22k78n0l6J7m0k8J14pm7K05k61L01p8J14k99
$$ 28 131 175 1 -139 21 34 -111 -496 226 -52 -102 -138 -121 -161 -189 -75 -82 -129 76 -185 116 38 152 -147
5232a47J27R0k33K23l3k55K08j48K04o4n0P2K46k63q7K56J2k22k05J15K69k56
$$ -147 -20 70 -163 60 27 -228 -20 -168 36 -28 -78 -6 240 -23 -110 146 158 -64 -269 -154 115 -141
5254a41m6L80m30K93n8j80j92P66o56L45l59L16l7M3o8L0j6M5k28J53L6j70N74
$$ -141 -187 193 -237 56 -2 -182 -374 392 -264 81 -278 38 1 44 -24 6 -10 35 -193 -40 -4 -174 400
5277D00l96K23m08M44j64r4J09k70K18j48PJ40N6m03M13k10j21K97m27M10j34
$$ 400 4 227 -181 263 99 5 114 -156 62 -86 -79 61 117 -286 127 -83 -204 93 -334 76 -58
5298e8mJ3K0p1O5K07j89J83j69J5k83J53J20o0lJ12j90J77l87M92n15K12K7J47
$$ -58 -62 -49 -29 -100 -35 172 -17 166 -3 12 -271 -118 2 -58 -61 51 -139 38 -349 143 -372 -160 -133 14
5322A4Q7o4k0J81j18j24L14k30R1j12j6K4J65K31n28L82n07o1M21k06K1N8J7j45
$$ 14 101 37 17 198 80 -44 270 40 131 19 3 27 192 423 -105 277 -230 -291 130 -76 -55 3 20 -125
5346a25P8M3J15q0r3j4j2L03r1p5j33q0J73J68R1l97N7m6L05k54M8K0j09k9K8
$$ -125 -47 -4 111 31 -62 -76 -88 215 124 49 -84 -164 9 177 268 -129 -72 -118 187 -67 -19 1 -108 -137 -109
5371a09O3j72K42N3n2K43l33N7p4J4K67k15K41j94k19L4N3j9L25k2j12J14l07
$$ -109 -46 -218 24 77 25 268 -65 -8 -82 -68 199 -16 225 31 -188 -154 -101 -120 205 183 71 185 -122
5394a22J62k1J85k78K40j91PP5k12K42j95J83k28JJ42N4q9J78j86r4N8Q5J40r7
$$ -122 40 19 204 -74 166 -25 -18 57 -155 87 -108 75 -153 -152 -10 44 -45 133 -53 -147 -89 -4 136 39
5418C9K31m1p0j4j83mJ19j75M7K3k66M01l67J14jO4K50k47L6j04O0J1M40l23M4
$$ 39 270 229 159 145 -38 -42 77 -98 -51 -28 -294 107 -260 -146 -147 -83 167 -80 -44 -148 -88 -77 363 40 84
5443H4p0j69K03P3q7O5k7J52l62J8m3N8Q9M1J8k94J95K41l34L21j7k22J69j31
$$ 84 14 -155 48 121 34 99 72 224 -138 -120 -163 -105 -16 25 43 -251 -56 185 -149 172 155 -67 102 -29
5467b9o2L48l91J08O7p0L39k29k5m6j48K20l6K51m59K55k14K01O8J03m42M66o6
$$ -29 -91 257 -134 -26 41 -29 310 81 56 10 -138 82 46 297 -162 93 -121 80 148 251 -191 275 209
5490B09k45Q2q0p7J11j84K20k0O9k19j5K18j1R0r4j58K18k26N3j39NJ24K88l45
$$ 209 -36 46 -34 -111 0 -184 36 16 85 -134 -149 69 58 148 54 -104 114 -112 -59 -198 -193 -69 219 -126
5514a26J31o2j01K12r7J59m27L82j96R9l1j5P7n4k4K09k3j22J55O0K5l01Q5J8
$$ -126 5 -57 -158 54 -43 116 -311 71 -125 -26 -57 -72 5 -49 -73 136 113 -9 146 206 231 -70 15 33
5538C3pJ40r9j76j57K10j57j48R5M26j67j51N85l57j7k09K5L50J76l37K22m73
$$ 33 26 166 67 -109 -266 -56 -213 -361 -266 160 -7 -158 427 70 53 -156 -131 219 395 58 280 -193
5560a93q6K34Q3L8k78M99m68J47K36k60K84k40K86k97j01L34l91J19j6Q0j66J31
$$ -193 -279 -45 38 76 -202 297 -171 -24 212 -48 236 -4 282 -15 -116 218 -173 -54 -70 10 -156 -25
5582b5L60l56M4n2k99K89r6J40K08k64j09J45Kl5J83p2P7l13j1R0K65l79K63Q
$$ -25 335 -21 23 -29 -328 -39 -135 5 213 -51 -160 -15 -13 -48 135 63 140 -173 -184 -94 171 -208 55 63
5606F3n8j04K77j46m00K03O1Q1r3p2L0L73K6k81J37j66P1O8j98J55K01l93J92
$$ 63 5 -99 178 32 -368 -165 -104 -23 -116 -188 -158 215 241 -40 97 -69 2 70 -128 27 228 -165 27
5629B7l2o9J64j32N8p6J15k77J55P8J33J45k86J92j06l71N63r1m1M1l81J94r0
$$ 27 -5 -74 90 -42 16 -60 55 -222 -67 11 144 289 3 195 89 -282 281 190 149 190 -191 3 -87
5652h7J75q2QR2m07J22L0M1p5M7M4N9J79l1j04J28k00K2j20K86J11l50K03O4J42
$$ -87 88 6 14 106 -301 -179 -149 -108 -183 -136 -92 -33 146 115 11 139 -61 -39 -159 127 238 -112 91 155 297
5677B97j33k51K8o9n5K99j68L1o3J81q7j08J62l05J32k0M36j65j31k5j07R2N6
$$ 297 164 -87 -59 -128 -183 116 -52 -21 -84 97 10 -98 64 -241 -109 -129 307 142 11 -14 -121 -29 27
5700B7l40J98O5J15K87k91k26O8J24j2o1J72j14J51j34J9o6J24l26J50Q6K0M2
$$ 27 -313 -115 -50 65 352 61 -165 -97 27 15 -46 126 12 163 29 48 -18 106 -220 -70 16 36 78
5723G8p0J26p7m7P2O0j74j90J09J43O7j12J25j9j41O4P4L6k16r6R1J39j97J45
$$ 78 8 134 57 10 82 142 -32 -222 -113 30 97 -15 110 91 -50 14 88 124 -92 -188 -97 42 -155 -10
5747a0K0k82K75k23L26pJ4j31P7mj50j14N5P0J96j42k08N76m76K20k18J86KJ04
$$ -10 10 -272 3 -220 106 99 113 -18 59 55 -95 -209 -154 -84 112 -30 -238 338 -138 82 -136 50 52 156
5771A56m66J80N2OJ62j26J79k64K4OJ44j01j12N4P4l7N9J5j93M97J1m89L6P5J72
$$ 156 -310 -130 -78 -72 90 -36 143 -121 -97 -91 53 -48 -160 -106 -32 -69 -10 5 -188 309 320 -169 -133 -58 114
5796A14k28j44L44j00J38n66M54K0r6j28n7N89J49o96M60l26l8J60j59J31q2L2
$$ 114 -114 -258 86 -14 124 -442 12 32 -64 -192 -249 340 489 -207 253 -73 -111 49 -110 21 -61 -29
$$ [...]
8191b24
##END NTUPLES=NMR FID
##END=
