##TITLE=1H_LR-784-R2-C1MM
 200.13MHz, CDCl3,
 8 sc
 
 21.1.2025
##JCAMPDX= 6.0         $$ Bruker NMR JCAMP-DX V2.0
##DATA TYPE= NMR FID
##DATA CLASS= NTUPLES
##ORIGIN= UXNMR, Bruker Analytische Messtechnik GmbH
##OWNER= pz
$$ XWIN-NMR		Version 3.5
$$ Tue Jan 21 14:07:49 2025 Russian Standard Time (UT+4h)  she@DPX200
##.OBSERVE FREQUENCY= 200.1313
##.OBSERVE NUCLEUS= ^1H
##.DELAY= (6, 6)
##.ACQUISITION MODE= SIMULTANEOUS
##.ACQUISITION SCHEME= undefined
##.AVERAGES= 8
##.DIGITISER RES= 18
##SPECTROMETER/DATA SYSTEM= spect
##.PULSE SEQUENCE= zg30
##.SOLVENT NAME= D2O
##.SHIFT REFERENCE= (INTERNAL, D2O, 0, 14.3821)
##AUDIT TRAIL= $$ (NUMBER, WHEN, WHO, WHERE, WHAT)
$$ ##TITLE= Audit trail, XWIN-NMR		Version 3.5
$$ ##JCAMPDX= 5.01
$$ ##ORIGIN= Bruker BioSpin GmbH
$$ ##OWNER= she
$$ F:/spectra/data/she/nmr/H-C/1/audita.txt
$$ ##AUDIT TRAIL=  $$ (NUMBER, WHEN, WHO, WHERE, WHAT)
(   1,<2025-01-21 14:06:00.42 +0400>,<she>,<DPX200>,
      <created by zg, POWCHK disabled, PULCHK disabled
       configuration hash MD5:
       00 E9 B6 7A A2 85 ED C7 34 08 36 98 17 FE 4E 26
       data hash MD5: 16K
       B4 04 CE D0 41 BE B3 14 A7 3E 5A B0 9E 0F C9 E8>)
$$ ##END=
$$ 
$$ hash MD5
$$ BB B3 68 67 2B 99 A5 1E 29 A1 F7 56 5F 66 B4 20
##$RELAX= 
##$RELAX= 
##$RELAX= 
##$RELAX= 
##$RELAX= 
##$RELAX= 
$$ Bruker specific parameters
$$ --------------------------
##$DU= <F:/spectra>
##$EXPNO= 1
##$NAME= <H-C>
##$PROCNO= 1
##$TYPE= <nmr>
##$USER= <she>
##$AMP= (0..31)
100 100 100 100 100 100 100 100 100 100 100 100 100 100 100 100 100 100 
100 100 100 100 100 100 100 100 100 100 100 100 100 100 
##$AQSEQ= 0
##$AQ_mod= 1
##$AUNM= <au_zg>
##$AUTOPOS= <>
##$BF1= 200.13
##$BF2= 200.13
##$BF3= 200.13
##$BF4= 200.13
##$BF5= 200.13
##$BF6= 200.13
##$BF7= 200.13
##$BF8= 200.13
##$BYTORDA= 1
##$CFDGTYP= 0
##$CFRGTYP= 5
##$CHEMSTR= <none>
##$CNST= (0..31)
1 1 145 1 1 1 1 1 1 1 1 1 1 1 1 1 1 1 1 1 1 1 1 1 1 1 1 1 1 1 1 1 
##$CPDPRG= <>
##$CPDPRG1= <>
##$CPDPRG2= <>
##$CPDPRG3= <>
##$CPDPRG4= <mlev>
##$CPDPRG5= <mlev>
##$CPDPRG6= <mlev>
##$CPDPRG7= <mlev>
##$CPDPRG8= <mlev>
##$CPDPRGB= <>
##$CPDPRGT= <>
##$D= (0..31)
0 0.7 0 0 0 0 0 0 0 0 0 0.03 0 0 0 0 0 0 0 0 0 0 0 0 0 0 0 0 0 0 0 0 
##$DATE= 1737453959
##$DBL= (0..7)
120 120 120 120 120 120 120 120 
##$DBP= (0..7)
150 150 150 150 150 150 150 150 
##$DBP07= 0
##$DBPNAM0= <>
##$DBPNAM1= <>
##$DBPNAM2= <>
##$DBPNAM3= <>
##$DBPNAM4= <>
##$DBPNAM5= <>
##$DBPNAM6= <>
##$DBPNAM7= <>
##$DBPOAL= (0..7)
0.5 0.5 0.5 0.5 0.5 0.5 0.5 0.5 
##$DBPOFFS= (0..7)
0 0 0 0 0 0 0 0 
##$DE= 6
##$DECBNUC= <off>
##$DECIM= 32
##$DECNUC= <off>
##$DECSTAT= 4
##$DIGMOD= 1
##$DIGTYP= 9
##$DL= (0..7)
0 120 120 120 120 120 120 120 
##$DP= (0..7)
150 150 150 150 150 150 150 150 
##$DP07= 0
##$DPNAME0= <>
##$DPNAME1= <>
##$DPNAME2= <>
##$DPNAME3= <>
##$DPNAME4= <>
##$DPNAME5= <>
##$DPNAME6= <>
##$DPNAME7= <>
##$DPOAL= (0..7)
0.5 0.5 0.5 0.5 0.5 0.5 0.5 0.5 
##$DPOFFS= (0..7)
0 0 0 0 0 0 0 0 
##$DQDMODE= 0
##$DR= 18
##$DS= 0
##$DSLIST= <SSSSSSSSSSSSSSS>
$$ [...]
##$SUBNAM0= <"">
##$SUBNAM1= <"">
##$SUBNAM2= <"">
##$SUBNAM3= <"">
##$SUBNAM4= <"">
##$SUBNAM5= <"">
##$SUBNAM6= <"">
##$SUBNAM7= <"">
##$SUBNAM8= <"">
##$SUBNAM9= <"">
##$SW= 18.0517328524113
##$SWIBOX= (0..15)
0 0 2 0 0 0 0 0 0 0 0 0 0 0 0 0 
##$SW_h= 3612.71676300578
##$TD= 16384
##$TD0= 1
##$TE= 0
##$TE2= 300
##$TE3= 300
##$TEG= 300
##$TL= (0..7)
0 120 120 120 120 120 120 120 
##$TP= (0..7)
150 150 150 150 150 150 150 150 
##$TP07= 0
##$TPNAME0= <>
##$TPNAME1= <>
##$TPNAME2= <>
##$TPNAME3= <>
##$TPNAME4= <>
##$TPNAME5= <>
##$TPNAME6= <>
##$TPNAME7= <>
##$TPOAL= (0..7)
0.5 0.5 0.5 0.5 0.5 0.5 0.5 0.5 
##$TPOFFS= (0..7)
0 0 0 0 0 0 0 0 
##$TUNHIN= 0
##$TUNHOUT= 0
##$TUNXOUT= 0
##$USERA1= <user>
##$USERA2= <user>
##$USERA3= <user>
##$USERA4= <user>
##$USERA5= <user>
##$V9= 5
##$VALIST= <valist>
##$VCLIST= <CCCCCCCCCCCCCCC>
##$VD= 0
##$VDLIST= <DDDDDDDDDDDDDDD>
##$VPLIST= <PPPPPPPPPPPPPPP>
##$VTLIST= <TTTTTTTTTTTTTTT>
##$WBST= 1024
##$WBSW= 4
##$XGAIN= (0..3)
0 0 0 0 
##$XL= 0
##$YL= 0
##$YMAX_a= 606833
##$YMIN_a= -655402
##$ZGOPTNS= <>
##$ZL1= 120
##$ZL2= 120
##$ZL3= 120
##$ZL4= 120
##$ABSF1= 10
##$ABSF2= 0
##$ABSG= 5
##$ABSL= 3
##$ALPHA= 0
##$AQORDER= 0
##$ASSFAC= 0
##$ASSFACI= 0
##$ASSFACX= 0
##$ASSWID= 0
##$AUNMP= <proc_1d>
##$AZFE= 0.1
##$AZFW= 0.1
##$BCFW= 1
##$BC_mod= 2
##$BYTORDP= 1
##$COROFFS= 0
##$CY= -3
##$DATMOD= 1
##$DC= 2
##$DFILT= <>
##$DTYPP= 0
##$F1P= 0
##$F2P= 0
##$FCOR= 0.5
##$FTSIZE= 0
##$FT_mod= 4
##$GAMMA= 1
##$GB= 0.15
##$INTBC= 1
##$INTSCL= 1
##$ISEN= 128
##$LB= 0.25
##$LEV0= 0
##$LPBIN= 0
##$MAXI= 10000
##$MC2= 0
##$MEAN= 0
##$ME_mod= 0
##$MI= 1.114404
##$NCOEF= 0
##$NC_proc= 0
##$NLEV= 6
##$NOISF1= 3.799351
##$NOISF2= 2.8
##$NSP= 1
##$NTH_PI= 0
##$NZP= 0
##$OFFSET= 14.38212
##$PC= 1
##$PHC0= 252.9726
##$PHC1= 12.7922
##$PH_mod= 1
##$PKNL= yes
##$PPARMOD= 0
##$PSCAL= 0
##$PSIGN= 0
##$REVERSE= no
##$SF= 200.129724274929
##$SI= 16384
##$SIGF1= 3
##$SIGF2= 2
##$SINO= 400
##$SIOLD= 16384
##$SREGLST= <1H.CDCl3>
##$SSB= 0
##$STSI= 0
##$STSR= 0
##$SW_p= 3205.1282051282
##$SYMM= 0
##$S_DEV= 0
##$TDeff= 0
##$TDoff= 0
##$TI= <>
##$TILT= no
##$TM1= 0
##$TM2= 0
##$TOPLEV= 0
##$USERP1= <user>
##$USERP2= <user>
##$USERP3= <user>
##$USERP4= <user>
##$USERP5= <user>
##$WDW= 1
##$XDIM= 8192
##$YMAX_p= 0
##$YMIN_p= 0
$$ End of Bruker specific parameters
$$ ---------------------------------
##NTUPLES= NMR FID
##VAR_NAME=  TIME,          FID/REAL,        FID/IMAG
##SYMBOL=    X,             R,               I
##VAR_TYPE=  INDEPENDENT,   DEPENDENT,       DEPENDENT
##VAR_FORM=  AFFN,          ASDF,            ASDF
##VAR_DIM=   8192,          8192,            8192
##UNITS=     SECONDS,       ARBITRARY UNITS, ARBITRARY UNITS
##FACTOR=    0.0002768,     1,               1
##FIRST=     0,             0,               0
##LAST=      2.2672688,     0,               0
##MIN=       0,             -655402,         0
##MAX=       2.2672688,     606833,          0
$$ Real data points
##PAGE= N=1
##DATA TABLE= (X++(R..R)), XYDATA
$$ [...]
$$ plain form
1877 -1078 -1346 -1038 -1178 -1346 -1367 -808 -681 -371 129 726 1061 1423 1362 1407 1285 1203 910 358 83 -404 -615
1898 -615 -852 -1183 -1217 -953 -1145 -1371 -884 -482 -335 140 506 745 1043 1219 1319 1253 1006 1038 1138 443 154
1919 154 -239 -480 -953 -1286 -1312 -1380 -1576 -1310 -788 -458 -123 142 652 1192 1304 1440 1232 1243 1148 972 757
1940 757 63 -169 -767 -774 -1211 -1332 -1181 -1383 -1181 -991 -557 -385 82 544 994 1035 1124 1454 1499 1123 1134 938
1962 938 361 54 -486 -708 -1085 -1194 -1570 -1151 -1150 -1048 -540 -366 -88 403 948 1426 1333 1254 1401 1363 927 584
1984 584 623 107 -513 -865 -872 -1212 -1194 -1247 -1394 -1273 -886 -417 -180 75 373 1001 1294 1249 1495 1331 1239 1015
2006 1015 466 43 -153 -590 -1088 -1112 -1239 -1392 -1154 -1026 -1016 -587 -176 247 376 850 1142 954 867 1204 1319
2027 1319 971 521 542 322 -382 -807 -725 -993 -1420 -1318 -1203 -1175 -819 -475 59 274 665 1153 1281 991 1152
$$ packed form
1877a078k68L08j40j68k1N59J27L10N00N97L35L62o1M5j22q2k93n52k75m87k11
1898f15k37l31l4K64j92k26M87M02J47M75L66K39K98J76J00o6k47L2J00o95k89
1919A54l93k41m73l33k6o8j96K66N22L30L35K65N10N40J12J36k08J1r5j76k15
1940G57o94k32n98pm37j21J51k02K02J90M34J72M67M62M50M1Q9L30M5l76J1j96
1962I38n77l07n40k22l77j09l76M19JJ02N08J74K78M91N45M78r3p9J47l8m36l43
1984E84L9n16o20l52pl40J8n3j47J21L87M69K37K55K98O28K93m5K46j64r2k24
2006A015n49m23j96m37m98k4j27j53K38J28J0M29M11M23J29M74K92j88q7L37J15
2027A319l48m50K1k20p04m25Q2k68m27J02J15K8L56L44N34K15L91M88J28k90J61
$$ plain form
2048 1152 1168 921 594 385 270 -272 -627 -804 -805 -908 -968 -1109 -1038 -616 -637 -373 197 379 262 918 1044 1117
2070 1117 1018 1160 1171 747 373 134 -384 -852 -1003 -1030 -1086 -1234 -1232 -702 -449 -256 47 483 674 777 1173 1058
2092 1058 982 828 790 823 303 -1 -120 -399 -934 -1005 -627 -1056 -1361 -1045 -844 -766 -551 26 699 562 1059
2113 1059 1268 1174 940 1037 950 425 81 -386 -354 -551 -931 -867 -751 -864 -1121 -655 -434 -166 -295 51 933
2134 933 556 1094 1142 1223 854 772 926 539 -97 -177 -214 -795 -1073 -903 -900 -980 -934 -673 -99 -310 37 837 450
2157 450 517 1292 1129 920 810 911 536 207 -165 -236 -597 -799 -1043 -1011 -988 -970 -851 -406 -75 -128 34 571
2179 571 911 830 847 1166 1132 838 635 710 253 -661 -587 -521 -1297 -1252 -926 -949 -743 -579 -80 -74 60 478 778
2202 778 681 868 920 871 1095 744 235 325 141 -347 -703 -694 -938 -1286 -1091 -1211 -840 -773 -75 21 121 650 1051
$$ packed form
2048A152J6k47l27k09j15n42l55j77jj03o0j41P1M22k1K64N70J82j17O56J26P3
2070A117r9J42J1m24l74k39n18m68j51k7n6j48KN30K53J93L03M36J91J03L96j15
2092A058p6j54l8L3n20l04j19k79n35p1L78m29l05L16K01P8K15N77O73j37M97
2113A059K09r4k34R7q7n25l44m67L2j97l80O4J16j13k57M66K21K68j29L46Q82
2134I33l77N38M8Q1l69q2J54l87o36q0l7n81k78J70Lq0M6K61N74k11L47Q00l87
2157D50O7P75j63k09j10J01l75l29l72p1l61k02k44L2K3J8J19M45L31n3J62N37
2179E71L40q1J7L19l4k94k03P5m57r14P4O6p76M5L26k3K06J64M99OJ34M18L00
2202G78r7J87N2m9K24l51n09R0j84m88l56Rk44l48J95j20L71O7O98R6J00N29M01
$$ plain form
2225 1051 1004 1017 955 1265 881 489 102 -128 -528 -713 -555 -853 -951 -1092 -824 -689 -511 -465 2 187 505
2246 505 844 853 1011 796 1010 950 536 359 44 10 -208 -827 -750 -890 -1179 -1103 -869 -643 -457 -126 441 453
2268 453 888 913 1196 694 825 924 737 343 211 -32 -366 -548 -679 -811 -990 -1128 -1066 -557 -399 -311 -59
2289 -59 363 408 853 609 1255 1115 880 938 771 -102 -270 -306 -720 -1169 -1081 -780 -763 -750 -495 -427 -228 -27 202
2312 202 356 663 954 1119 965 713 727 440 114 108 -298 -342 -478 -1065 -981 -898 -732 -834 -770 -456 -3 161
2334 161 482 528 706 1022 958 1032 661 372 194 82 -143 -506 -485 -643 -743 -871 -802 -542 -558 -561 -296 -51 70
2357 70 293 578 899 965 946 941 868 691 289 171 -351 -381 -569 -713 -1149 -1089 -721 -751 -507 -295 132 319 468
2380 468 412 828 708 728 791 887 622 618 150 50 -241 -340 -728 -941 -1041 -888 -653 -721 -543 -74 -134 289 240
$$ packed form
2225A051m7J3o2L10l84l92l87k30m00j85J58k98r8j41K68J35J78M6M67J85L18
2246E05L39RJ58k15K14o0m14j77l15l4k18o19P7j40k89P6K34K26J86L31N67J2
2268D53M35K5K83n02J31R9j87l94j32k43l34j82j31j32j79j38O2N09J58Q8K52
2289e9M22M5M45k44O46j40k35N8j67q73j68l6m14m49Q8L01J7J3K55O8J99K01K29
2312B02J54L07K91J65j54k52J4k87l26om06m4j36n87Q4Q3J66j02O4L14M53J64
2334A61L21M6J78L16o4P4l71k89j78j12k25l63K1j58j00j28O9K60j6lK65K45J21
2357G0K23K85L21O6j9np3j77m02j18n22l0j88j44m36O0L68l0K44K12M27J87J49
2380D68n6M16j20K0O3R6k65mm68j00k91r9l88k13j00J53K35o8J78M69o0M23m9
$$ plain form
2403 240 497 806 826 723 794 820 542 394 33 -323 -864 -616 -629 -784 -680 -710 -745 -596 -600 -252 96 123 647
2426 647 676 737 774 884 737 552 578 58 -175 -302 -356 -472 -855 -737 -933 -752 -793 -366 -151 -53 190 679
2448 679 604 753 729 983 681 482 518 185 116 -329 -328 -829 -789 -709 -781 -992 -585 -657 -436 -154 134 411 874
2471 874 330 714 767 683 791 574 328 86 -558 -409 -553 -750 -739 -825 -773 -874 -786 -486 -265 -64 388 416
2493 416 324 631 935 837 785 736 447 144 211 -241 -497 -473 -759 -899 -937 -727 -587 -337 -228 -19 137 289
2515 289 597 915 1018 878 854 742 437 344 -119 -428 -446 -723 -915 -1017 -725 -710 -696 -417 -50 -61 309 484
2537 484 577 697 1097 930 604 620 530 403 182 -7 -192 -634 -699 -639 -669 -849 -529 -426 -617 -57 195 372
2559 372 513 685 915 726 580 598 362 321 72 -184 -81 -335 -378 -673 -605 -412 -640 -633 -320 -165 -77 -76 482
$$ packed form
2403B40K57L09K0j03P1K6k78j48l61l56n41K48j3j55J04l0l5J49mL48L48K7N24
2426F47K9O1L7J10j47j85K6n20k33j27n4j16l83J18j96J81m1M27K15R8K43M89
2448F79p5J49k4K54l02j99L6l33o9m45Jn01M0Q0p2k11M07p2K21K82K88K77M63
2471H74n44L84N3q4J08k17k46k42o44J49j44j97J1q6N2j01Q8L00K21K01M52K8
2493D16r2L07L04r8n2m9k89l03O7m52k56K4k86j40l8K10J40K50J09K09J56J52
2515B89L08L18J03j40k4j12l05r3m63l09j8k77j92j02K92J5J4K79L67j1L70J75
2537D84R3J20M00j67l26J6r0j27k21j89j85m42o5O0l0j80L20J03j91N60K52J77
2559C72J41J72K30j89j46J8k36m1k49k56J03k54m3k95O8J93k28PL13J55Q8JN58
$$ plain form
2582 482 455 531 868 583 608 701 480 442 -58 -96 -186 -563 -671 -700 -642 -958 -647 -377 -364 -289 185 329 404 643
2606 643 697 581 682 475 466 350 178 -9 -32 -333 -538 -838 -825 -232 -643 -539 -235 -113 -236 5 443 533
2628 533 543 876 731 760 698 422 62 -12 -278 -491 -562 -718 -785 -661 -464 -588 -557 -82 -125 281 230 160 502
2651 502 518 760 493 831 712 227 305 -103 -388 -258 -527 -556 -612 -718 -793 -608 -453 44 -90 -40 558 658
2673 658 538 826 797 579 522 440 383 -49 -87 -183 -743 -635 -599 -636 -540 -493 -523 -419 -252 176 485 387 434 632
2697 632 822 414 815 502 321 309 25 -146 -577 -571 -722 -872 -688 -621 -703 -455 -186 75 300 321 437 691
2719 691 402 690 606 468 238 109 21 -80 -566 -573 -635 -547 -549 -705 -412 -425 -224 -161 112 738 560 500 793 797
2743 797 637 398 275 253 53 -181 -374 -364 -654 -635 -691 -542 -410 -424 -224 15 199 389 412 506 526 382 861
$$ packed form
2582D82k7P6L37k85K5R3k21l8n00l8r0l77j08k9N8l16L11K70J3P5M74J44P5K39
2606F43N4j16J01k07rj16j72j87k3l01k05l00J3N93m11J04L04J22j23K41M38R0
2628E33J0L33j45K9o2k76l60p4k66k13p1j56o7J24J97j24L1M75m3M06n1p0L42
2651E02J6K42k67L38j19m85P8m08k85J30k69k9n6j06p5J85J55M97j34N0N98J00
2673F58j20K88k9k18n7q2n7m32l8r6n60J08L6l7R6M7l0J04J67M28L09r8M7J98
2697F32J90m08M01l13j81j2k84j71m31Oj51j50J84O7q2K48K69K61K25K1J16K54
2719F91k89K88q4j38k30j29q8j01m86po2Q8kj56K93j3K01O3K73O26j78o0K93M
2743G97j60k39j23k2k00k34j93J0k90J9n6J49J32j4K00K39J84J90K3R4K0j44M79
$$ plain form
2766 861 608 423 268 101 60 -214 -435 -339 -580 -825 -585 -848 -378 -383 -116 172 233 405 613 493 633 575
2788 575 627 244 -36 153 -70 -205 -324 -471 -620 -443 -828 -762 -412 -144 -208 -13 59 134 353 427 378 510
2810 510 579 445 194 329 121 -79 -336 -441 -301 -652 -545 -574 -183 -508 -404 -95 -24 114 205 525 339
2831 339 619 548 417 439 258 231 102 -149 -153 -449 -638 -550 -609 -565 -640 -565 -131 -255 160 296 695 402 707
2854 707 710 712 363 378 297 98 -175 -269 -541 -592 -659 -672 -526 -444 -407 -396 -138 -120 180 366 188 356 530 527 646
2879 646 492 459 0 3 -10 -206 -417 -572 -437 -596 -835 -488 -331 -341 166 60 557 478 373 577 636 637 446
2902 446 367 19 -34 -95 -273 -368 -554 -535 -519 -508 -613 -420 -446 -400 24 313 447 303 771 660 374 467 339
2925 339 248 255 -97 -84 -284 -492 -557 -648 -481 -517 -194 -218 -144 30 352 286 382 266 791 547 664 249 229 58
$$ packed form
2766H61k53j85j55j67m1k74k21R6k41k45K40k63M70nK67K88O1J72K08j20J40n8
2788E75N2l83k80J89k23j35j19j47j49J77l85O6L50K68o4J95P2P5K19P4m9J32
2810E10O9j34k51J35k08k00k57j05J40l51J07k9L91l25J04L09P1J38R1L20j86
2831C39K80p1j31K2j81k7j29k51mk96j89Q8n9M4p5P5M34j24M15J36L99k93L05
2854G07LKl49J5q1j99k73r4k72n1o7j3J46Q2L7J1K58J8L00J86j78J68J74lJ19
2879F46j54l3m59Lj3j96k11j55J35j59k39L47J57j0N07j06M97p9j05K04N9Jj91
2902D46p9l48n3o1j78r5j86J9J6J1j05J93k6M6M24K89J34j44M68j11k86R3j28
2925C39r1Pl52J3k00k08o5r1J67l6L23k4P4J74L22o6R6j16N25k44J17m15k0j71
$$ plain form
2949 58 -20 -144 -336 -543 -647 -535 -870 -567 -404 -260 -216 26 85 203 514 485 586 595 295 570 326 244 -63
2972 -63 72 -256 -393 -268 -563 -759 -448 -489 -179 -284 -150 -100 76 450 414 619 466 420 332 379 286 278 -195
2995 -195 -109 -286 -291 -611 -546 -489 -565 -606 -303 -81 53 351 151 425 531 546 331 292 397 391 327 38 -232 -325
3019 -325 -388 -408 -389 -638 -312 -567 -422 -73 15 51 404 418 375 299 421 663 362 501 433 147 81 -344 -319 -309
3043 -309 -576 -690 -438 -457 -284 -317 -309 -22 72 259 538 265 505 723 614 423 255 158 172 -328 -24 -358
3065 -358 -515 -479 -566 -395 -424 -580 -234 41 241 104 295 649 499 446 652 267 154 116 305 34 -63 -271
3087 -271 -462 -235 -439 -374 -317 -146 -486 -187 6 117 270 413 555 448 550 474 495 256 192 112 -15 -168
3109 -168 -307 -370 -369 -574 -377 -348 -380 -12 -111 184 332 267 604 549 654 546 449 235 238 133 -104 -261 -245 -308
$$ packed form
2949E8p8j24j92k07j04J12l35L03J63J44M4K42N9J18L11k9J01Rl00K75k44q2l07
2972f3J35l28j37J25k95j96L11m1L10j05J34N0J76L74l6K05j53m6q8M7r3qm73
2995a95Q6j77nl20O5N7p6m1L03K22J34K98k00K74J06J5k15l9J05oo4k89k70r3
3019c25o3k0J9k49L26k55J45L49Q8L6L53J4m3p6J22K42l01J39o8k86o6m25K5J0
3043c09k67j14K52j9J73l3QK87R4J87K79k73K40K18j09j91j68r7J4n00L04l34
3065c58j57L6q7J71k9j56L46K75K00j37J91L54j50n3K06l85j13l8J89k71r7k08
3087b71j91K27k04O5N7J71l40K99J93J11J53J43J42j07J02p6K1k39o4q0j27j53
3109a68j39o3Jk05J97K9l2L68r9K95J48o5L37n5J05j08r7k14Lj05k37j57J6o3
$$ plain form
3133 -308 -391 -431 -369 -369 -278 -262 -27 -129 99 272 260 589 295 531 369 379 157 228 -37 -98 -357 -475 -462 -577
3157 -577 -687 -399 -426 -258 -21 111 111 108 256 352 399 380 546 399 219 287 -17 -193 -219 -358 -322 -330 -449 -298
3181 -298 -309 -417 -74 -142 -15 215 295 634 278 464 537 233 183 7 61 -134 -371 -354 -311 -502 -439 -642 -514
3204 -514 -211 -390 -113 27 269 297 458 463 417 269 504 277 171 197 -75 -203 -215 -322 -228 -507 -626 -419
3226 -419 -452 -342 -212 -54 251 224 335 318 473 340 413 345 110 343 12 -166 -209 -273 -486 -372 -416 -580 -495
3249 -495 -289 -329 -174 113 -74 377 234 334 628 594 528 201 308 261 65 -86 -194 -291 -390 -388 -476 -368 -205
3272 -205 -207 41 97 198 259 265 231 434 331 396 280 352 106 -118 44 177 -268 -271 -484 -367 -220 -469 -322 -133
3296 -133 -204 281 320 103 374 264 257 347 180 365 295 86 -64 33 -70 -325 -182 -238 -235 -318 -474 -324 -101 33
$$ packed form
3133c08q3m0O2%R1J6K35j02K28J73j2L29k94K36j62J0k22P1k65o1k59j18J3j15
3157e77j10K88k7J68K37J32%lJ48R6M7j9J66j47j80O8l04j76k6j39L6qj19J51
3181b98j1j08L43o8J27K30Q0L39l56J86P3l04n0j76N4j95k37J7M3j91O3k03J28
3204e14L03j79K77J40K42K8J61Nm6j48K35k27j06K6k72j28j2j07R4k79j19K07
3226d19l3J10J30J58L05k7J11j7J55j33P3o8k35K33l31j78m3o4k13J14m4j64Q5
3249d95K06m0J55K87j87M51j43J00K94l4o6l27J07m7j96j51j08r7r9Kq8J08J63
3272b05kK48N6J01O1Ol4K03j03O5j16P2k46k24J62J33m45lk13J17J47k49J47J89
3296a33p1M85L9k17K71j10pR0j67J85p0k09j50R7j03k55J43n6Lq3j56J50K23J34
$$ plain form
3320 33 82 324 265 437 414 582 494 -3 42 275 38 -90 -180 -432 -425 -438 -175 -174 -354 -313 -95 -143 -17 -95 -28
3345 -28 284 464 371 354 365 441 191 -103 -239 -197 -277 -305 -306 -429 -594 -389 -172 -126 29 -58 201 76 309 456
3369 456 380 148 464 246 336 57 19 -213 -180 -103 -406 -202 -414 -493 -65 -232 -277 -104 30 174 168 433 362
3392 362 291 256 427 487 213 -50 -144 -274 -165 -334 -407 -321 -541 -196 -416 -47 185 5 -112 6 133 524
3414 524 233 477 328 67 117 113 197 -192 -302 -483 -298 -569 -236 -305 -410 21 -295 115 137 308 278 379
3436 379 197 451 398 401 381 -27 157 -55 -271 -165 -317 -82 -422 -245 -146 -246 57 -193 138 -38 355 80
3458 80 365 315 227 357 384 71 270 124 -206 -242 -206 -208 -316 -254 -626 -188 -169 13 122 -114 383 438 39 332
3482 332 302 172 241 301 33 161 55 -51 -245 -446 -454 -329 -448 -597 -127 -6 -84 90 189 184 167 191 592 165
$$ packed form
3320C3M9K42n9J72k3J68q8m97M5K33k37j28r0k52Pj3K63Jj80M1K18m8J26p8O7
3345b8L12J80r3j7J1P6k50k94j36M2q0k8jj23j65K05K17M6J55q7K59j25K33J47
3369D56p6k32L16k18R0k79l8k32L3P7l03K04k12p9M28j67m5J73J34J44oK65p1
3392C62p1l5J71O0k74k63r4j30J09j69p3Q6k20L45k20L69K32j80j17J18J27L91
3414E24k91K44j49k61N0mQ4l89j10j81J85k71L33o9j05M31l16M10K2J71l0J01
3436C79j82K54n3Lk0m08J84k12k16J06j52K35l40J77R9j00L03k50L31j76L93k75
3458H0K85n0q8J30K7l13J99j46l30l6L6kj08O2l72M38J9J82J09k36M97N5l99K93
3482C32l0j30O9O0k68J28j06j06j94k01qJ25j19j49M70J21p8J74R9nj7K4M01m27
$$ plain form
3506 165 381 160 135 39 1 -286 -32 -432 -578 -326 -59 -170 -238 -149 -155 290 142 200 246 362 252 285 179
3529 179 194 87 195 -100 -178 -379 -380 -447 -412 -245 -165 -220 -162 -47 -32 111 352 258 196 239 423 379 110 242 -43
3554 -43 7 29 -2 -29 -251 -76 -221 -471 -339 -222 -63 -148 31 147 166 66 178 200 265 205 160 205 -84 -13
3578 -13 -91 -128 -98 -293 -476 -387 -91 -339 -223 90 -90 -23 182 357 421 629 194 251 124 210 258 -21 -245
3601 -245 -172 -211 -289 -344 -436 -323 -179 -262 -86 79 200 138 258 163 217 268 353 214 390 215 -55 -220 150 -113
3625 -113 -265 -184 -165 -325 -510 -218 -40 23 14 154 17 211 361 298 45 429 410 173 198 150 -68 -202 -313
3648 -313 -160 -172 -260 -290 -224 -223 -42 38 333 235 141 139 315 187 201 261 254 341 30 14 -18 169 -334 -241 -438 -133
3674 -133 -235 -298 -338 -67 399 14 196 197 188 177 349 171 165 37 -101 -316 -93 -398 -516 -418 -291 -282 -200 -154 -235
$$ packed form
3506A65K16k21k5r6l8k87K54m00j46K52K67j11o8Q9oM45j48N8M6J16j10L3j06
3529A79J5j07J08k95p8k01jo7L5J67Q0n5N8J15J5J43K41r4o2M3J84m4k69J32k85
3554d3N0K2l1k7k22J75j45k50J32J17J59q5J79J16J9j00J12K2O5o0m5M5k89P1
3578a3p8l7L0j95j83Q9K96k48J16L13j80O7K05J75O4K08m35N7j27Q6M8k79k24
3601b45P3l9p8n5r2J13J44q3J76J65J21o2J20r5N4N1Q5j39J76j75k70j65L70k63
3625a13j52Q1J9j60j85K92J78O3rJ40j37J94J50o3k53L84j9k37K5m8k18j34j11
3648c13J53j2q8l0O6JJ81Q0K95r8r4kJ76j28J4O0pQ7l11j6l2J87n03R3j97L05
3674a33j02o3m0K71M66l85J82Jrj1J72j78oj28j38k15K23l05j18R8J27RQ2M6q1
$$ plain form
3699 -235 -154 -170 274 204 213 423 233 444 353 359 257 -93 -15 -49 -236 -154 -85 -392 -98 -256 -408 -275 -184 -15
3723 -15 14 224 243 179 398 330 250 151 297 133 103 -63 -322 -362 -297 -377 -327 -183 -182 -90 -30 15 -27 303 225 183 207
3750 207 133 140 369 147 173 186 -126 -320 -104 -286 -184 -227 -474 -212 -182 19 -111 -57 8 332 237 316 130 375
3774 375 270 201 195 96 363 -99 -225 96 -258 -434 -200 -116 -227 -197 -75 -43 -6 214 103 547 69 164 345
3797 345 247 -189 -3 92 -137 -188 58 -193 -310 -14 -349 -386 -335 -144 143 15 20 67 2 239 292 306 121 160
3821 160 46 8 284 -269 -217 5 -45 -43 -335 -308 -385 -16 -131 -60 88 -17 -90 279 219 432 276 290 314 159
3845 159 112 -255 -234 -55 -228 -160 -363 -181 -385 -211 -76 -159 -123 -21 213 211 307 242 94 332 99 282 -95
3868 -95 -22 16 -150 -346 -288 -307 -253 -49 -35 -94 -102 119 -167 115 238 69 203 71 186 122 309 85 -232 -213
$$ packed form
3699b35Q1j6M44p0RK10j90K11r1Oj02l50P8l4j87Q2O9l07K94j58j52J33R1J69
3723a5K9K10J9o4K19o8q0r9J46j64l0j66k59m0O5q0N0J44JR2O0M5m2L30p8m2K4
3750B07p4PK29k22K6J3l12j94K16j82J02m3k47K62L0K01j30N4O5L24r5P9j86K45
3774C75j05o9or9K67m62j26L21l54j76K34Q4j11L0J22L2L7K20j11M44m78R5J81
3797C45r8m36J86R5k29n1K46k51j17K96l35l7N1J91K87j28NM7o5K37N3J4j85L9
3821A60j14l8K76n53N2K22n0Kk92K7p7L69j15P1J48j05p3L69o0K13j56J4K4j55
3845A59m7l67K1J79j73O8k03J82k04J74J35q3L6J02K34kR6o5j48K38k33J83l77
3868i5P3L8j66j96N8j9N4K04J4n9qK21k86K82J23j69J34j32J15o4J87k24l17J9
$$ plain form
3892 -213 3 -33 -2 -358 -463 -118 -348 -57 -313 -74 212 -88 74 112 101 430 26 210 186 109 -26 94
3914 94 -110 -103 32 -109 -100 -301 -137 -229 -167 33 -17 -95 233 172 176 222 156 119 175 36 -1 42 69 -19 -63 -220 -283
3941 -283 -200 -139 -117 -153 -59 -68 54 108 159 292 178 402 262 271 301 272 209 15 8 -126 -377 -50 -166 -77 -12 -263
3967 -263 10 -4 -185 80 6 -44 240 142 118 348 220 279 199 -8 -9 -218 -278 -3 -307 -385 -165 -57 -284 -139
3991 -139 -138 134 99 90 -6 355 272 280 326 68 293 -168 -317 -98 -311 -97 -222 -123 -262 -88 -134 -305 -199 -117
4015 -117 -85 238 90 128 362 219 425 47 4 129 171 -77 -29 14 -169 -100 -263 -161 -10 -77 237 -45 128
4038 128 6 184 73 -2 250 174 326 26 174 -41 -168 -93 49 -275 -297 -278 -312 -225 -126 -185 -181 70 -65 89
4062 89 32 260 82 112 146 74 84 9 -69 -160 -259 -281 -272 -114 -57 -210 -69 -215 -2 -74 -51 -64 5 281 317 290 69
$$ packed form
3892b13K16l6L1l56j05L45k30K91k56K39K86l00J62L8j1L29m04J84k4p7j35J20
3914I4k04PJ35j41Rk01J64r2O2K00n0p8L28o1MM6o6l7N6j39l7M3K7q8m4j57o3
3941b83Q3O1K2l6R4rJ22N4N1J33j14K24j40RL0k9o3j94pj34k51L27j16Q9O5k51
3967b63K73j4j81K65p4n0K84r8k4K30j28N9q0k07jk09o0K75l04p8K20J08k27J45
3991a39JK72l5rr6L61q3QM6k58K25m61j49K19k13K14j25R9j39J74m6j71J06Q2
4015a17L2L23j48L8K34j43K06l78m3J25M2k48M8M3j83O9j63J02J51o7L14k82J73
4038A28j22J78j11p5K52p6J52l00J48k15j27P5J42l24k2J9l4Q7R9n9MK51j35J54
4062H9n7K28j78L0L4p2J0p5p8r1r9k2RJ58N7j53J41j46K13p2K3j3O9K76L6k7k21
$$ plain form
4089 69 143 499 123 240 -15 -79 0 -342 -198 -182 -111 -139 -330 11 -35 -174 -15 -120 253 95 333 247 55
4112 55 207 58 5 -39 -48 -69 -64 -107 57 -147 44 -14 -182 -39 227 57 238 110 56 307 148 343 164 21
4136 21 61 2 22 -26 -39 -365 -266 9 -111 -257 -297 1 -64 -32 120 307 396 -47 105 242 84 100 99 -54 9
4161 9 -48 -135 -136 -288 -81 60 -135 -241 -119 233 47 143 214 135 160 83 292 230 73 99 -2 126 89 -323 26
4186 26 -178 -326 -160 -184 -298 -35 -69 -57 87 199 114 50 105 208 223 243 127 -25 -71 -72 103 -3 -11 -259 -311
4211 -311 -98 -254 -5 9 -50 119 -31 67 144 84 207 322 -43 -117 197 89 130 48 -74 -52 -84 -234 -242 -24
4235 -24 -160 -22 -67 173 101 239 -5 266 15 211 -37 180 225 166 102 40 -69 99 -33 -265 -284 -208 -145
4258 -145 -318 16 -118 58 135 8 223 96 154 76 74 120 112 100 -44 -290 -162 -55 -175 -127 -140 -233 -134 -219 -161
$$ packed form
4089F9P4L56l76J17k55o4P9l42J44J6P1k8j91L41m6j39J59j05L73j58K38q6j92
4112E5J52j49n3m4rk1Nm3J64k04J91n8j68J43K66j70J81j28n4K51j59J95j79j43
4136B1M0n9K0m8j3l26R9K75j20j46m0K98o5L2J52J87Q9m43J52J37j58J6jj53O3
4161In7q7jj52K07J41j95j06J22L52j86R6P1p9K5p7K09o2j57K6j01J28l7m12L49
4186B6k04j48J66k4j14K63l4J2J44J12q5o4N5J03J5K0j16j52m6jJ75j06qk48n2
4211c11K13j56K49J4n9J69j50R8P7o0J23J15l65p4L14j08M1q2j22K2l2j50qK18
4235b4j36J38m5K40p2J38k44K71k51J96k48K17M5n9o4o2j09J68j32k32j9P6O3
4258a45j73L34j34J76P7j27K15j27N8p8kM6qj2j44k46J28J07j20M8j3r3R9q5N8
$$ plain form
4283 -161 -118 -75 158 66 191 267 8 426 116 46 60 -26 -175 106 63 -60 -58 -180 -243 81 126 -198 -125 -73 293
4308 293 46 -67 -39 286 212 171 241 177 -57 -93 -174 -31 -251 -233 -163 -115 -217 -230 54 -100 14 20 90 169 292
4333 292 228 342 77 84 123 -187 -7 42 -218 -314 -312 -153 -267 -32 -108 -34 -34 -99 244 -62 -6 151 299 91 108
4358 108 234 213 55 118 58 19 184 16 -303 -143 -189 -177 -68 -63 -226 -177 57 194 74 161 237 -79 139 313
4382 313 -136 -36 -166 -75 -188 63 -231 -475 -346 -32 -62 -168 -158 -127 199 325 -51 65 181 197 160 243
4404 243 -107 132 82 -148 -88 -243 -306 -314 -128 64 10 -92 -130 176 -150 147 181 54 19 97 -60 375 273
4427 273 168 101 -197 38 -205 133 -198 -263 -184 1 -49 -72 -87 90 -4 17 118 -67 77 352 234 216 127
4450 127 -38 -198 -79 -117 0 -226 -90 -319 -217 -190 -111 -59 -50 -41 162 69 237 137 105 197 175 52 74 -113
$$ packed form
4283a61M3M3K33r2J25P6k59M18l10p0J4q6j49K81m3j23Kj22o3L24M5l24P3N2L66
4308B93k47j13K8L25p4m1P0o4k34l6q1J43k20J8P0M8j02j3K84j54J14OP0P9J23
4333B92o4J14k65PL9l10J80M9k60r6KJ59j14K35p6P4%o5L43l06N6J57J48k08J7
4358A08J26k1j58O3o0l9J65j68l19J60m6J2J09Nj63M9K34J37j20Q7P6l16K18J74
4382C13m49J00j30R1j13K51k94k44J29L14l0j06J0L1L26J26l76J16J16J6l7Q3
4404B43l50K39n0k30O0j55o3qJ86J92n4j02l8L06l26K97L4j27l5P8j57M35j02
4427B73j05o7k98K35k43L38l31o5P9J85n0k3j5J77r4K1J01j85J44K75j18j8q9
4450A27j65j60J19l8J17k26J36k29J02K7P9N2RRK03r3J68j00l2R2k2j23K2j87
$$ plain form
4474 -113 -155 160 -97 -64 -228 -54 -216 -12 -39 -158 -159 -43 58 12 95 234 -71 -13 183 83 23 74 -134
4497 -134 -59 -110 -416 133 -251 -277 -164 -36 -75 -3 41 -3 65 318 2 202 319 182 29 121 322 -19 -190
4520 -190 202 -259 -97 -139 -155 -319 -141 -120 33 47 60 83 150 72 -56 -95 319 75 -29 45 -16 -113 -70 -127 -228
4545 -228 -189 -200 -58 -3 -66 1 -19 20 5 -8 178 110 157 50 83 45 198 13 127 16 -162 -33 -177 -41
4569 -41 -173 -100 -211 -148 77 -92 100 157 61 249 299 202 270 274 157 -21 159 -65 -89 -325 -125 -171 -189 -159 -28
4594 -28 -6 -198 -19 -56 33 115 124 69 212 76 184 179 -203 -53 32 -58 -506 -131 -285 -255 -186 -306 17 255 170
4619 170 56 16 173 19 154 129 37 -72 -52 199 -49 -164 94 -145 -176 -154 22 36 -315 -99 -79 -280 -72
4642 -72 -95 126 231 132 215 101 219 40 311 86 -141 62 302 -27 -189 -116 -271 -14 -52 -281 -135 -73
$$ packed form
4474a13m2L15k57L3j64J74j62K04k7j19jJ16J01m6Q3J39l05N8J96j00o0N1k08
4497a34P5n1l06N49l84k6J13J28l9P2M4m4O8K53l16K00J17j37j53R2K01l41j71
4520a90L92m61J62m2j6j64J78K1J53J4J3K3O7p8j28l9M14k44j04P4o1r7M3n7j01
4545b28L9j1J42N5o3O7k0L9j5j3J86o8M7j07L3l8J53j85J14j11j78J29j44J36
4569d1j32P3j11O3K25j69J92N7r6J88N0r7O8Mj17j78J80k24k4k36K00m6j8L0J31
4594b8K2j92J79l7Q9Q2Rn5J43j36J08nl82J50Q5r0m48L75j54L0O9j20L23K38q5
4619A70j14m0J57j54J35k5r2j09K0K51k48j15K58k39l1K2J76J4l51K16K0k01K08
4642g2k3K21J05r9Q3j14J18j79K71k25k27K03K40l29j62P3j55K57l8k29J46O2
$$ plain form
4664 -73 -57 -51 157 160 284 -87 -8 -95 -29 181 2 -105 44 45 56 -66 -224 -77 -175 89 -140 -107 -208 -22 232
4689 232 149 310 183 169 32 155 60 -44 145 -161 -131 -126 -123 -192 9 -11 -141 -38 -171 -119 -179 122 64 -167
4713 -167 109 -32 121 89 176 37 27 197 -80 -142 -87 -239 -56 -138 -142 -92 -109 -145 26 -104 115 221 201 58
4737 58 -39 118 104 317 73 54 -21 13 -57 -141 -40 -70 -123 -135 -47 189 79 -101 -7 -14 180 67 160 56 63 -12
4763 -12 65 205 -86 36 21 -84 -173 65 -226 -45 -206 -51 83 -43 7 211 -77 314 75 -19 344 293
4785 293 -86 -97 -5 -21 -172 -79 -124 -165 -38 128 -303 13 -16 -121 76 89 25 62 -84 -133 272 165 137 -65
4809 -65 134 200 183 2 -75 -209 -108 -130 -199 -276 -74 -95 -31 -211 220 50 67 143 195 -7 -76 181 -224 130
4833 130 -63 24 -100 -1 -155 -82 -165 -169 125 104 101 200 188 7 42 203 -82 199 -258 136 182 -43 -109 66 -161
$$ packed form
4664g3J6OK08LJ24l71P9q7O6K10j79j07J49JJ1j22j58J47r8K64k29L3j01J86K54
4689B32q3J61j27j4j37J23r5j04J89l06L0NLo9K01k0j30J03j33N2o0L01n8k31
4713a67K76j41J53l2Q7j39j0J70k77o2N5j52J83q2mN0j7l6J71j30K19J06k0j43
4737E8r7J57j4K13k44j9p5L4p0q4J01l0n3j2Q8K36j10j80R4pJ94j13R3j04Pp5
4763a2P7J40k91J22j5j05q9K38k91J81j61J55J34j26N0K04k88L91k39r4L63n1
4785B93l79j1R2j6j51R3m5m1J27J66m31L16k9j05J97J3o4L7j46m9M05j07k8k02
4809f5J99O6j7j81p7j34J01k2o9p7K02k1O4j80M31j70J7P6N2k02o9K57m05L54
4833A30j93Q7j24R9j54P3q3mK94k1lR9j2j81L5J61k85K81m57L94M6k25o6J75k27
$$ plain form
4858 -161 -222 -2 -172 -7 -246 -144 -203 62 57 44 65 -1 171 122 257 -43 53 49 71 45 -198 203 -101 -35 84
4883 84 -16 -175 49 -43 18 -40 -15 51 186 10 15 45 92 205 -68 93 18 83 -135 114 103 -140 -91 90 8
4908 8 -45 141 231 124 87 -4 -70 -125 190 174 90 -47 -13 -73 -91 -153 14 -27 -108 -106 -100 -229 -99 -198 -15 42 -88
4935 -88 156 -97 168 206 179 192 -57 19 227 -54 -168 -147 -86 -161 170 -42 -81 -105 -81 -273 -107 0 153 231
4959 231 26 261 289 -88 -9 -374 132 196 -248 7 122 -369 -223 32 -37 -347 -291 144 -165 -98 -73 94
4981 94 143 -83 221 120 242 5 95 66 -4 119 -35 0 -379 -245 -242 -121 -104 29 -70 -114 -162 50 293 28
5005 28 -190 -41 142 53 -90 47 -103 227 -21 -126 70 -239 -57 -255 -41 -21 84 21 -32 17 -136 -28
5027 -28 215 318 233 299 124 14 114 -101 -28 -268 -40 -136 -254 -150 -38 21 -75 -5 -214 149 -18 52 217
$$ packed form
4858a61o1K20j70J65k39J02n9K65nj3K1o6J72m9J35l00R6mK2k6k43M01l04O6J19
4883H4j00j59K24r2O1n8K5O6J35j76NL0M7J13k73J61p5O5k18K49j1k43M9J81q2
4908Hn3J86R0j07l7r1o6n5L15j6q4j37L4o0j8o2J67m1q1KOj29J30r9J83N7j30
4935h8K44k53K65L8k7J3k49P6K08k81j14K1O1p5L31k12l9k4K4j92J66J07J53P8
4959B31k05K35K8l77P9l65N06O4m44K55J15m91J46K55o9l10N6M35l09O7K5J67
4981I4M9k26L04j01J22k37R0k9p0J23j54L5l79J34LJ21J7J33r9m4m8K12K43k65
5005B8k18J49J83q9j43J37j50L30k48j05J96l09J82j98K14K0J05o3n3M9j53J08
5027b8K43J03q5O6j75j10J00k15P3k40K28r6j18J04J12N9r6P0k09L63j67P0J65
$$ plain form
5050 217 -14 142 -78 123 -92 -212 303 -145 -76 -38 -146 -298 -122 -342 -7 -75 -42 3 81 236 -14 152
5072 152 88 121 42 195 110 282 -107 -12 124 -135 -89 -186 -9 40 37 -5 -210 4 101 69 230 76 156 -78 53
5097 53 -26 188 188 -172 -132 -3 -282 -38 45 -45 -141 -120 -299 26 -233 -8 113 22 261 39 37 -65 110 84
5121 84 22 -63 139 204 -177 73 -73 -37 -276 -330 -212 -166 -80 113 8 -28 68 184 179 -23 -23 -32 164 -92 173
5146 173 154 64 -161 -133 -120 6 129 -133 -65 3 -203 -13 205 -3 37 277 64 224 240 147 -30 58 95 -106
5170 -106 -79 -160 -70 -115 -36 -73 -20 12 -52 174 -70 124 188 295 -101 100 134 147 266 162 101 31 -34 24 25 -88
5196 -88 -59 -157 8 -17 -159 -14 23 9 24 180 123 2 211 94 139 -132 102 213 121 -111 -147 -305 -147 31
5220 31 -342 -112 221 213 -85 42 63 171 143 17 -120 -77 136 12 94 65 259 29 69 -162 -31 8 -113
$$ packed form
5050B17k31J56k20K01k15j20N15m48O9L8j08j52J76k20L35o8L3M5P8J55k50J66
5072A52o4L3p9J53q5J72l89R5J36k59M6r7J77M9lm2k05K14R7l2J61j54Q0k34J31
5097E3p9K14%l60M0J29k79K44Q3r0r6K1j79L25k59K25J21r1K39k22kj02J75k6
5121H4o2q5K02O5l81K50j46L6k39n4J18M6Q6J93j05l6R6J16nk02%rJ96k56K65
5146A73j9r0k25K8J3J26J23k62O8O8k06J90K18k08M0K40k13J60J6r3j77Q8L7k01
5170a06K7q1R0m5P9l7N3L2o4K26k44J94O4J07l96K01L4J3J19j04o1p0o5N8Jj13
5196h8K9r8J65k5j42J45L7j4J5J56n7j21K09j17M5k71K34J11r2k32l6j58J58J78
5220C1l73K30L33qk98J27K1J08k8j26j37M3K13j24Q2k9J94k30M0k31J31L9j21
$$ plain form
5243 -113 -126 -44 -124 -175 -65 -140 28 144 157 -83 -136 19 124 0 49 -53 -107 106 31 -136 -160 -174 -244 57
5267 57 87 -24 -48 -22 -25 162 106 124 230 3 -93 205 283 -3 -32 -69 -165 -94 64 51 -483 -135 46 -90 86
5292 86 -212 -9 68 209 186 186 140 164 86 139 -73 -68 -23 86 -99 -14 -198 -270 -268 -184 -101 -188 -60 -105 30 41 75
5319 75 9 64 189 112 39 35 -52 81 71 -29 6 -393 -245 -75 60 175 -121 127 -56 60 273 -124 175
5342 175 -145 -91 134 150 -91 -55 -30 -173 -138 -11 -114 -218 -355 -63 -98 -138 123 53 -19 -65 142 198 -93 245
5366 245 74 53 23 78 -184 115 -209 -108 15 -150 124 -166 220 -225 -75 -115 -21 -44 231 104 62 359
5388 359 155 105 73 -24 100 -143 54 -27 -317 -347 -72 88 31 30 -14 -32 -168 1 195 77 229 33 71 -134
5412 -134 -108 104 129 79 -32 -227 -176 62 -138 18 -235 28 -4 -72 117 -83 162 83 67 -19 170 -6 35
$$ packed form
5243a13j3Q2q0n1J10p5J68J16J3k40n3J55J05j24M9j02n4K13p5j67k4j4p0L01
5267E7L0j11k4K6lJ87n6J8J06k27r6K98P8k86k9l7r6P1J58j3n34L48J81j36J76
5292H6k98K03P7J41k3%m6K4p8N3k12NM5J09j85Q5j84p2KQ4Q3q7J28m5J35J1L4
5319G5o6N5J25p7p3mq7J33j0j00L5l99J48J70J35J15k96K48j83J16K13l97K99
5342A75l20N4K25J6k41L6K5j43L5J27j03j04j37K92l5m0K61p0p2m6K07N6k91L38
5366B45j71k1l0N5k62K99l24J01J23j65K74k90L86m45J50m0R4k3K75j27m2K97
5388C59k04n0l2r7J24k43J97q1k90l0K75J60n7jm4j8j36J69J94j18J52j96L8k05
5412a34K6K12K5n0j11j95N1K38k00J56k53K63l2o8J89k00K45p9j6q6J89j76M1
$$ plain form
5435 35 83 60 63 80 25 87 -8 8 -175 -46 198 -116 -102 37 -17 240 -31 160 200 70 63 -90 206 -75 -26
5460 -26 169 77 102 -166 -190 79 -13 -38 -129 -85 -107 7 140 37 88 42 176 370 150 280 -3 38 -118 -41
5484 -41 78 -111 -59 76 -149 -213 -62 82 -44 251 158 319 121 62 -77 260 -26 2 411 114 -30 -5
5506 -5 111 -36 -237 -115 -16 -157 -96 141 -235 112 113 125 66 -3 -116 20 93 198 164 -114 -8 -270 -249 -3
5530 -3 -76 -201 51 -281 -95 -110 30 47 -54 110 -118 -81 -27 170 192 237 122 64 135 47 -330 -46 79 47
5554 47 -81 -184 -152 -164 168 -28 -113 -74 -99 -74 68 5 38 139 115 197 95 105 31 -71 -56 9 136 -205 -134
5579 -134 95 7 -18 -40 53 -124 8 131 -33 208 -158 117 66 104 -27 170 30 106 85 -169 3 -167 -257
5602 -257 -253 -275 -144 -48 49 220 74 16 58 259 134 -125 9 -164 -312 -69 40 0 67 21 -104 -105 205 -314
$$ packed form
5435C5M8k3LJ7n5O2r5J6j83J29K44l14J4J39n4K57k71J91M0j30pj53K96k81M9
5460b6J95r2K5k68k4K69r2k5r1M4k2J14J33j03N1m6J34J94k20J30k83M1j56P7
5484d1J19j89N2J35k25o4J51J44j26K95r3J61j98n9j39L37k86K8M09k97j44K5
5506eJ16j47k01J22R9j41O1K37l76L47JJ2n9o9j13J36P3J05l4k78J06k62K1K46
5530cp3j25K52l32J86j5J40J7j01J64k28L7N4J97K2M5j15n8P1q8l77K84J25l2
5554D7j28j03L2j2L32j96q5L9k5K5J42o3L3J01k4Q2j02J0p4j02J5O5J27l41P1
5579a34K29q8k5k2R3j77J32J23j64K41l66K75n1L8j31J97j40P6k1k54J72j70r0
5602b57Mk2J31R6R7J71j46n8M2K01j25k59J34j73j48K43J09m0O7m6j25jL10n19
$$ plain form
5626 -314 7 63 -135 -245 119 -109 147 43 44 -28 -110 51 28 33 57 -181 -183 -113 113 -146 -187 -199 -8 -40 35
5651 35 18 26 -46 -48 173 -42 182 121 -67 197 66 93 -138 -9 -137 -146 -44 -169 -291 -15 64 -85 -80 241 95
5676 95 73 109 334 119 56 214 223 60 -113 -53 98 -66 -79 96 -8 -217 -107 238 -131 -52 212 161 -130
5699 -130 9 170 75 76 162 3 -226 -25 173 -52 -186 7 -164 -301 -78 13 -12 234 -76 -21 -120 122 -65
5722 -65 -135 -162 -41 40 49 195 -183 -122 289 85 86 -3 -80 39 -127 -26 35 125 -119 -28 -178 148 35 103 135
5747 135 86 -40 -145 -67 -95 -121 -247 24 -59 -215 -99 -273 99 -212 -210 48 -5 222 142 83 190 48 36 -51
5771 -51 76 116 -165 -42 -21 -88 -17 -56 89 -157 -221 -119 -32 164 132 0 -59 168 112 -16 119 -71 339 175
5795 175 -222 -78 84 -72 -86 -197 -237 90 -81 27 13 -218 27 114 -129 225 116 220 92 -77 39
$$ packed form
5626c14L21N6j98j10L64k28K56j04Jp2q2J61k3NK4k38kP0K26k59m1j2J91l2P5
5651C5j7Qp2kK21k15K24o1j88K64j31K7k31J29j28rJ02j25j22K76P9j49NL21j46
5676I5k2L6K25k15o3J58Rj63j73O0J51j64j3J75j04k09J10L45l69P9K64n1k91
5699a30J39J61r5JQ6j59k29K01J98k25j34J93j71j37K23R1k5K46l10N5r9K42j87
5722f5p0k7J21Q1RJ46l78O1M11k04Jq9p7J19j66J01O1R0k44R1j50L26j13O8L2
5747A35m9j26j05P8k8k6j26K71q3j56J16j74L72l11KK58n3K27q0n9J07j42j2q7
5771e1J27M0k81J23K1o7P1l9J45k46o4J02Q7J96l2j32n9K27n6j28J35j90M10j64
5795A75l97J44J62j56j4j11m0L27j71J08j4k31K45Q7k43L54j09J04j28j69J16
$$ plain form
5816 39 -89 14 -61 52 -111 27 37 -2 -13 -58 -276 -110 -63 -37 -61 -4 -129 39 56 -76 75 86 -22 47
5840 47 22 -56 -11 -155 -149 21 29 -86 -205 -15 -60 -24 60 92 11 -74 77 65 -9 120 145 204 113 26 -131 -68 -112
5867 -112 11 -11 -75 -111 -109 26 -68 -11 19 198 73 100 130 78 -17 71 187 -228 133 137 -96 -129 -62 250 -230 7
5893 7 -136 -140 39 85 40 13 153 59 -19 60 50 220 177 65 -213 122 113 -106 -65 -102 129 -136 -91 48 -44 -55
5919 -55 -78 147 130 224 -50 157 52 204 299 -67 101 -150 127 -64 7 -184 -122 184 -256 -276 36 -85 202
5942 202 137 -96 26 -120 179 1 69 2 174 37 -47 288 27 145 -69 130 54 21 -97 94 -171 -97
5964 -97 -64 216 280 103 37 133 257 290 -160 89 201 -70 144 -88 -13 -240 -62 -52 -64 -109 -73 -106 20 -22
5988 -22 -205 -72 224 -39 224 104 197 -3 -151 -264 -69 -302 -80 65 -72 45 -157 49 -69 -1 -66
$$ packed form
5816C9j28J03p5J13j63J38J0l9j1m5k18J66M7K6k4N7j25J68J7j32J51J1j08O9
5840D7k5p8M5j44OJ70Qj15j19J90m5L6Q4L2q1q5J51j2p4J29K5N9r1q7j57O3m4
5867a12J23k2o4l6KJ35r4N7L0J79j25K7L0n2r5Q8J16m15L61Mk33l3O7L12m80K37
5893Gj43mJ79M6m5k7J40r4p8P9j0J70m3j12k78L35rk19M1l7K31k65M5J39r2j1
5919e5k3K25j7R4k74K07j05J52R5l66J68k51K77j91P1j91O2L06m40k0L12j21K87
5942B02o5k33J22j46K99j78O8o7J72j37q4L35k61J18k14J99p6l3j18J91k65P4
5964i7L3K80O4j77o6R6J24L3m50K49J12k71K14k32P5k27J78J0j2m5L6l3J26m2
5988b2j83J33K96k63K63j20R3k00j48j13J95k33K22J45j37J17k02K06j18O8o5
$$ plain form
6009 -66 -69 16 -100 -10 120 68 37 127 47 223 190 -63 -7 -35 -236 -59 2 -25 -131 240 -83 157 119 -90 125
6034 125 72 10 71 173 159 94 -15 110 -28 34 -70 -31 -176 -45 27 25 -62 179 -71 54 42 -45 -110 69 93
6059 93 -2 40 -29 -96 223 -6 109 -63 -300 -63 -143 152 -129 -120 -42 -153 -12 -148 -120 -29 239 124 -114 305
6083 305 65 226 19 92 129 -183 29 -239 -165 -49 -127 -66 -175 142 84 -109 -55 90 35 199 429 94 176
6106 176 95 48 -120 126 93 -103 -95 -288 8 -21 -312 -11 -2 -297 -112 -106 -11 84 310 165 42 185 77 17
6130 17 185 -36 -185 -137 -125 115 -110 -82 -206 -95 107 33 -70 29 -171 -35 -234 207 82 170 246 41 289
6153 289 82 -34 -118 191 -19 -169 15 -120 -187 89 -277 -108 73 90 129 -30 80 97 245 -9 27 -70
6175 -70 45 127 178 -57 33 55 -211 -196 -100 34 6 -117 -48 -43 -28 -56 142 0 53 261 119 37 -94 -11 -11 -192
$$ packed form
6009f6lQ5j16R0J30n2l1R0q0J76l3k53N6k8k01J77O1k7j06L71l23K40l8k09K15
6034A25n3o2O1J02j4o5j09J25j38O2j04L9j45J31P2kq7K41k50J25j2q7o5J79K4
6059I3r5M2o9o7L19k29J15j72k37K37q0K95k81RP8j11J41j36K8R1K68j15k38M19
6083C05k40J61k07P3L7l12K12k68P4J16p8O1j09L17n8j93N4J45n5J64K30l35Q2
6106A76q1m7j68K46l3j96Qj93K96k9k91L01Rk95J85OR5R5K26j45j23J43j08o0
6130A7J68k21j49M8J2K40k25K8j24J11K02p4j03R9k00J36j99M41j25Q8P6k05K48
6153B89k07j16q4L09k10j50J84j35o7K76l66J69J81J7L9j59J10J7J48k54L6r7
6175g0J15Q2N1k35R0K2k66J5R6J34k8j23O9NJ5k8J98j42N3K08j42q2j31Q3%j81
$$ plain form
6201 -192 -165 -82 -75 -278 -254 -203 -84 -9 -89 -166 67 137 116 150 225 -6 80 14 -55 241 260 -102 46 -99 -345 -43
6227 -43 37 -20 -92 9 -229 -90 24 -97 -27 133 13 125 99 50 -105 75 62 -38 66 -77 1 110 -144
6250 -144 -109 -139 -273 -42 230 8 49 75 111 92 158 52 312 76 -42 141 -258 10 -151 130 -144 -238 -102
6273 -102 41 -118 -61 -68 70 -34 -208 25 44 115 122 71 136 225 -183 -92 44 4 -122 -249 -44 -26 -65 -59 -33 -85
6299 -85 -49 140 184 81 -33 84 66 89 156 139 75 103 68 9 -113 -117 132 24 38 -70 93 11 -158 -3 -124
6324 -124 14 236 -77 77 -36 -85 77 66 -51 -35 6 -64 -182 116 76 -231 111 -80 -233 -15 -324 -256
6346 -256 232 15 236 -35 63 91 -60 53 36 -79 52 -75 -42 -181 -250 -54 43 -206 94 71 52 48 160
6369 160 32 185 -59 121 50 20 178 45 72 103 34 -131 2 -146 -110 -179 -46 -9 -176 167 -145 -81 126
$$ packed form
6201a92K7Q3Pk03K4N1J19P5q0p7K33P0k1L4P5k31Q6o6o9K96J9l62J48j45k46L02
6227d3Q0n7p2J01k38J39J14j21P0J60j20J12k6m9j55J80j3j00J04j43P8J09k54
6250a44L5l0j34K31K72k22M1K6L6j9O6j06K60k36j18J83l99K68j61K81k74r4J36
6273a02J43j59N7pJ38j04j74K33J9P1Pn1O5Q9m08R1J36m0j26j27K05J8l9OK6n2
6299h5L6J89M4j03j14J17j8K3O7j7o4K8l5n9j22mK49j08J4j08J63q2j69J55j21
6324a24J38K22l13J54j13m9J62j1j17J6M1p0j18K98m0l07L42j91j53K18l09O8
6346b56M88k17K21k71R8K8j51J13j7j15J31j27L3j39o9J96R7k49L00k3j9mJ12
6369A60j28J53k44J80p1l0J58j33K7L1o9j65J33j48L6o9J33L7j67L43l12O4K07
$$ plain form
6392 126 96 230 144 80 150 14 -161 112 128 -79 -43 -53 77 81 -122 -17 -119 -142 100 20 106 42 49 -32 135
6417 135 270 2 38 275 -55 -207 11 -157 -33 -85 107 -54 -110 -135 -70 -24 16 125 86 82 65 310 -4 250
6441 250 71 -151 33 197 78 76 -97 -18 -47 -108 19 -60 -183 7 27 220 41 137 183 -66 -45 -11 158 126
6465 126 -232 179 10 86 -3 193 113 -173 92 14 -26 86 -46 -147 -48 227 172 118 78 14 -25 275 -94 169
6489 169 126 217 20 -70 -125 7 -109 -137 -15 -80 51 -158 -72 -18 -49 -104 149 149 103 229 -43 286 227 -64 32
6514 32 7 -121 -96 102 -70 -113 -137 -37 -133 91 -91 -9 -37 86 38 76 13 26 253 172 -178 -48 115 -233
6538 -233 -77 -167 -25 -241 36 -208 18 -37 -26 41 -119 171 81 89 35 218 60 31 -120 -8 112 2 -105
6561 -105 -7 3 -202 80 -11 -213 -118 -95 -30 3 95 -40 -54 182 115 174 -186 138 71 -172 19 28 -24 -123 -123 11
$$ packed form
6392A26l0J34q6o4P0j36j75K73J6k07L6j0J30Mk03J05j02k3K42q0Q6o4Pq1J67
6417A35J35k68L6K37l30j52K18j68J24n2J92j61n6k5O5M6M0J09l9mj7K45l14K54
6441B50j79k22J84J64j19kj73P9k9o1J27p9j23J90K0J93j79R6M6k49K1L4J69l2
6465A26l58M11j69P6q9J96q0k86K65p8m0J12j32j01R9K75n5n4m0o4l9L00l69K63
6489A69m3R1j97r0n5J32j16k8J22o5J31k09Q6N4l1n5K53%m6J26k72L29n9k91R6
6514C2k5j28K5J98j72m3k4J00r6K24j82Q2k8J23m8L8o3J3K27q1l50J30J63l48
6538b33J56r0J42k16K77k44K26n5J1O7j60K90r0Qn4J83j58k9j51J12J20j10j07
6561a05R8J0k05K82r1k02R5K3O5L3R2j35j4K36o7N9l60L24o7k43J91Rn2r9%J34
$$ plain form
6587 11 -110 148 -34 -50 98 158 33 119 191 77 -107 222 151 43 25 -122 -39 53 96 -247 -8 -309 -108
6610 -108 -134 -44 -17 -150 154 -36 59 -23 17 159 74 -212 -142 79 104 -5 135 81 -103 -193 -161 -49 -144 15
6634 15 -28 -24 -137 84 -107 111 -38 84 -28 156 158 -56 -44 98 -174 -29 106 -185 -144 50 65 -30 -87 71
6658 71 84 -97 12 -51 25 92 -36 80 157 39 184 -116 159 -77 21 -337 -145 -31 -89 -209 -210 14 -61 68
6682 68 151 6 191 78 215 175 -142 -43 -58 -15 8 31 -22 -73 -161 -74 251 -92 -17 48 -21 1 156 -14 -11 -157
6708 -157 387 26 234 109 99 95 288 26 63 35 -54 -75 -214 -51 142 -159 4 118 67 -14 -106 84 -52
6731 -52 95 114 -42 134 140 72 20 -48 132 43 -19 -110 -19 -123 43 -138 -111 -118 2 -69 41 69 27 -14 73 -31
6757 -31 -88 252 -75 31 33 13 27 -16 -103 -110 -229 -144 51 -22 31 -2 53 -26 33 -72 140 67 28 181 38 177
$$ packed form
6587A1j21K58j82j6J48O0j25Q6P2j14j84L29p1j08j8j47Q3R2M3l43K39l01K01
6610a08k6R0K7j33L04j90R5q2M0J42q5k86P0K21K5j09J40n4j84r0L2J12r5J59
6634A5m3Mj13K21j91K18j49J22j12J84Kk14J2J42k72J45J35k91M1J94J5r5n7J58
6658G1J3j81J09o3P6O7j28J16P7j18J45l00K75k36R8l58J92J14n8j20jK24p5J29
6682F8Q3j45J85j13J37m0l17R9j5M3K3K3n3n1q8Q7L25l43P5O5o9K2J55j70Lj46
6708a57N44l61K08j25j0mJ93k62L7k8q9k1j39J63J93l01J63J14n1q1r2J90j36
6731e2J47J9j56J76Oo8n2o8J80q9o2r1R1j04J66j81K7pJ20p1J10K8m2m1Q7j04
6757c1n7L40l27J06Kk0J4m3q7pj19Q5J95p3N3l3N5p9N9j05K12p3l9J53j43J39
$$ plain form
6783 177 125 65 -215 25 -170 -228 -193 -191 97 56 -37 50 -276 17 31 108 117 -101 -82 33 -11 32 -118 153 71 -25
6809 -25 -156 -135 -124 -88 75 61 -56 21 -34 -187 7 228 78 10 107 5 273 -8 39 -45 -5 -245 32 -54
6833 -54 -187 -120 -41 -70 119 58 16 117 -168 29 164 294 136 121 -31 -17 28 -187 44 -176 -101 -82 -25 -187
6857 -187 -146 -31 214 20 -116 46 -70 8 19 114 230 -174 -101 49 -92 -6 82 -56 -240 90 -83 -35 -227
6880 -227 -27 41 -17 -148 164 -103 278 177 6 8 190 109 -170 -90 7 73 45 28 -25 -97 -145 25 33 145 -62
6905 -62 7 190 197 -7 104 65 249 -74 107 1 208 -90 -48 -244 44 97 18 -25 -146 94 -59 -127 -30 56
6929 56 230 19 -84 144 7 11 8 88 11 37 -157 -191 -8 -84 -175 7 -143 56 -174 -186 64 -70 76 -119
6953 -119 37 161 106 111 -106 -38 34 -15 -54 -122 61 -294 -118 -113 -178 -165 208 90 182 133 -50 163 178 132 129 36
$$ packed form
6783A77n2o0k80K40j95n8L5KK88m1r3Q7l26K93J4P7Rk18J9J15m4M3j50K71q2r6
6809b5j31K1J1L6J63j4j17P7n5j53J94K21j50o8R7j02K68k81M7q4M0k40K77q6
6833e4j33O7P9k9J89o1m2J01k85J97J35J30j58j5j52J4M5k15K31k20P5J9N7j62
6857a87M1J15K45j94j36J62j16P8J1R5J16m04P3J50j41Q6Q8j38j84L30j73M8j92
6880b27K00O8n8j31L12k67L81j01j71KJ82q1k79Q0R7O6k8j7n3p2m8J70QJ12k07
6905f2O9J83Pk04J11l9J84l23J81j06K07k98M2j96K88N3p9m3j21K40j53o8R7Q6
6929E6J74k11j03K28j37MlQ0p7K6j94l4J83p6r1J82j50J99k30j2K50j34J46j95
6953a19J56J24n5Nk17O8P2m9l9o8J83l55J76No5J3L73j18R2m9j83K13J5m6lr3
$$ plain form
6979 36 271 73 87 76 216 105 108 -81 -175 -27 -198 -172 -147 47 51 -254 172 92 137 -132 -48 -12 90 299 19
7004 19 80 -144 -90 62 95 -6 161 -65 63 -11 19 257 96 123 -25 -144 13 -46 156 13 62 33 154
7027 154 -62 29 16 75 -155 -115 -244 17 143 -75 127 76 73 19 26 36 -90 -15 -27 -43 -6 19 32 98 177 -28
7053 -28 -263 -94 62 -54 -223 -88 33 -249 -79 243 -306 122 -103 47 284 245 29 9 189 11 -44
7074 -44 58 13 1 -148 -112 53 31 -143 23 9 10 -52 -164 62 7 167 203 28 108 41 83 -208 -58 -120 -7
7099 -7 -122 -40 -82 108 58 104 -56 -183 -89 74 -53 -73 -99 50 54 34 196 -228 -24 -30 214 40 90 -4 9 57
7125 57 -41 -179 79 29 -56 117 124 94 -42 149 -67 -49 142 90 -8 36 111 65 154 -424 -53 30 -52 -168 -12
7150 -12 13 -47 -63 -175 123 165 8 -4 156 -50 -108 150 60 -13 34 -158 33 35 -89 -18 -189 -264 -78 -55 -28
$$ packed form
6979C6K35j98J4j1J40j11Lj89r4J48j71K6K5J94Ml05M26q0M5k69Q4L6J02K09k80
7004A9O1k24N4J52L3j01J67k26J28p4L0K38j61K7j48j19J57n9K02j43M9k9J21
7027A54k16R1j3N9k30M0j29K61J26k18K02n1ln4PJ0j26P5j2j6L7K5J3O6P9k05
7053b8k35J69J56j16j69J35J21k82J70L22n49M28k25J50K37l9k16k0J80j78n5
7074d4J02m5j2j49L6J65k2j74J66j4Jo2j12K26n5J60L6j75Q0o7M2k91J50o2J13
7099gj15Q2m2J90n0M6j60j27R4J63j27k0k6J49Mk0J62m24K04oK44j74N0r4J3M8
7125E7r8j38K58n0q5J73Pl0j36J91k16J8J91n2r8M4P5m6Q9n78L71Q3q2j16J56
7150a2K5o0j6j12K98M2j57j2J60k06n8K58r0p3M7j92J91Kj24P1j71p5J86K3K7
$$ plain form
7175 -28 -152 74 141 304 79 18 128 111 -175 61 -5 -21 12 -88 -40 -82 -21 179 -61 -26 -15 -191 41 17
7199 17 26 211 -13 48 108 1 185 161 -64 65 11 -161 -201 -8 47 85 160 40 156 28 -15 -93 96 166 179
7224 179 108 267 -95 -62 32 207 -116 -86 -281 -239 62 101 -29 -120 -118 53 -97 41 -2 -94 -97 -42 133 269 219
7249 219 70 8 -149 18 -124 45 -168 -40 -262 -62 -47 -202 127 -69 -145 -13 -55 214 141 62 -24 -75 94
7272 94 140 163 134 -78 229 130 -75 -49 31 38 151 -240 38 31 76 -18 -144 58 94 86 -37 -117 -119 188 -49 70
7298 70 -298 82 -47 -209 -125 -188 -99 -96 -106 80 146 -135 -83 29 83 88 94 -25 45 -202 82 2 75 -3 26 276
7324 276 -26 -54 27 -125 -5 -184 -25 -42 -97 77 140 21 -143 -10 242 -10 -3 39 -46 -238 -120 -14 -74
7347 -74 26 10 -4 -131 -62 -47 6 134 -13 112 18 110 -77 -179 -49 104 45 230 -144 37 117 -16 -78 1
$$ packed form
7175b8j24K26O7J63k25o1J10j7k86K36o6j6L3j00M8m2O1K00k40L5J1j76K32k4
7199A7RJ85k24O1O0j07J84k4k25J29n4j72m0J93N5L8P5j20J16j28m3p8J89P0J3
7224A79p1J59l62L3R4J75l23L0j95M2L01L9j30r1KJ71j50J38m3r2lN5J75J36n0
7249B19j49o2j57J67j42J69k13J28k22K00J5j55L29j96p6J32m2K69p3p9q6n1J69
7272I4M6K3k9k12L07r9k05K6Q0PJ13l91K78pM5r4j26K02L6qj23q0kL07k37J19
7298G0l68L80j29j62Q4o3Q9Lj0J86O6k81N2J12N4NOj19P0k47K84q0P3p8K9K50
7324B76l02k8Q1j52J20j79J59j7n5J74O3j19j64J33K52k52PM2q5j92J18J06o0
7347g4J00j6j4j27O9J5N3J28j47J25r4R2j87j02J30J53n9J85l74J81Q0j33o2P9
$$ plain form
7371 1 53 -92 172 -61 -71 -31 75 64 -13 216 10 127 -156 65 -46 -12 50 57 27 -31 -67 -48 -57 -182 -272 -168
7397 -168 36 -216 16 14 20 76 -39 -57 -245 164 65 -22 -173 -26 -54 202 -143 -116 -12 -108 -114 6 -98 -57 57
7422 57 18 38 202 -56 89 13 -152 178 77 281 -113 -113 -33 -51 -236 12 -106 -183 -146 -101 1 -13 -82 153
7446 153 57 67 24 113 231 7 67 56 201 -56 -58 -133 -79 -119 64 -2 85 13 -215 -122 -86 5 35 13 -8 116 75
7473 75 -235 291 62 -68 162 26 44 36 -120 -62 4 -45 29 -40 70 151 100 -46 137 222 121 139 133 -86 16
7498 16 60 43 -6 93 11 63 -148 132 -44 -177 183 -45 31 72 -36 -47 104 -23 14 -139 224 132 -82 -28
7522 -28 -59 -88 -162 -67 -348 -51 61 134 -163 0 -4 -37 -149 -13 84 66 -39 80 318 64 -6 -34 -96 -41 -98
7547 -98 -127 -189 110 -97 -236 11 -205 3 99 -124 1 158 -5 159 -4 236 179 -13 150 18 -46 163
$$ packed form
7371AN2j45K64k33j0M0J06j1p7K29k06J17k83K21j11L4O2Pl0n8l6J9rj25r0J04
7397a68K04k52K32kON6j15j8j88M09r9q7j51J47k8K56l45K7J04r6oJ20j04M1J14
7422E7l9K0J64k58J45p6j65L30j01K04l94%Q0j8j85K48j18p7L7M5J02j4o9K35
7446A53r6J0m3Q9J18k24O0j1J45k57kp5N4m0J83o6Q7p2k28R3L6R1L0k2k1J24m1
7473G5l10N26k29j30K30j36J8qj56N8O6m9P4o9J10Q1n1j46J83Q5j01J8ok19J02
7498A6M4j7m9R9q2N2k11K80j76j33L60k28P6M1j08j1J51j27L7j53L63r2k14N4
7522b8l1k9p4R5k81K97J12P3k97J63ml3j12J36R7j8j05J19K38k54p0k8o2N5n7
7547i8k9o2K99k07j39K47k16K08R6k23J25J57j63J64j63K40n7j92J63j32o4K09
$$ plain form
7569 163 -23 -233 -178 -194 -65 -65 -105 -11 0 285 -66 125 209 19 44 -58 32 -41 18 -7 25 -22 -73 91 63 11
7595 11 83 -76 -170 -153 -26 -24 -13 -81 183 114 -9 30 -136 12 -86 83 13 -81 -136 -177 -46 -73 33 -65 -31 -149
7621 -149 -104 34 188 118 -138 265 143 -28 -42 -192 -93 153 -61 43 26 56 197 -125 -86 54 6 -30 18
7644 18 -13 50 103 1 216 5 52 -78 175 -64 124 -144 -27 -26 -47 199 219 -200 -132 -63 177 47 -43 18
7668 18 59 74 58 -10 -13 34 49 30 -85 128 -180 -12 -71 -22 -163 15 -12 -391 65 156 15 -21 177 -30 170
7693 170 81 -72 68 32 -77 39 -39 44 60 170 49 -247 -219 -203 20 -228 -31 112 3 -9 35 81 63 -89
7717 -89 84 13 -64 70 66 -7 78 -151 169 4 -167 25 -324 -175 67 -73 212 165 -13 114 200 49 -150
7740 -150 145 41 118 -143 46 -92 32 -89 126 -32 122 64 20 -118 -109 81 173 83 -31 47 -3 20 89 -72
$$ packed form
7569A63j86k10N5j6J29%m0R4J1K85l51J91Q4j90K5j02R0p3N9k5L2m7n1J64k8n2
7595A1P2j59r4J7J27KJ1o8K64o9j23L9j66J48r8J69p0r4n5m1J31k7J06r8L4j18
7621a49M5J38J54p0k56M03j22j71j4j50R9K46k14J04j7L0J41l22L9J40m8l6M8
7644A8l1O3N3j02K15k11M7j30K53k39J88k68J17Jk1K46K0m19O8O9K40j30r0O1
7668A8M1J5j6o8lM7J5j9j15K13l08J68n9M9j41J78k7l79M56R1j41l6J98k07K00
7693A70q9j53J40l6j09J16p8Q3J6J10j21k96K8J6K23k48J97J43j09j2M4M6j8j52
7717h9J73p1p7J34mp3Q5k29L20j65j71J92l49J49K42j40K85m7j78J27Q6j51j99
7740a50K95j04P7k61J89j38J24j21K15j58J54n8m4j38RJ90R2r0j14P8n0K3O9j61
$$ plain form
7764 -72 174 4 309 178 106 -175 185 21 -16 -165 -28 -51 104 -24 -214 12 -5 -206 70 31 -14 139
7786 139 -10 -37 173 123 155 183 -108 123 -102 -6 72 -35 -86 -59 215 129 -13 78 -80 69 143 -24 2 162
7810 162 94 -120 123 -90 -12 -39 182 -179 -4 4 -239 -33 -37 20 -62 -55 48 170 116 63 -31 -76 227 -17 49
7835 49 93 -169 53 -78 -125 122 -125 -160 -29 -45 -112 -2 201 207 1 230 -47 118 71 156 60 10 -42 -225
7859 -225 59 61 -16 -3 -100 85 251 -15 -219 -136 181 103 -134 230 -67 -235 217 -115 -169 -119 118 170 -45
7882 -45 -98 -145 -162 -124 -244 -145 -37 -79 -53 20 -34 -18 10 128 -42 -49 55 -126 189 49 -1 -111 -2 -97 40
7907 40 26 73 76 -135 -63 -40 -95 -148 273 -11 160 -37 -53 306 102 149 -252 108 52 31 192 -55 130 -137
7931 -137 -144 -66 56 -53 -126 76 31 -154 -67 -78 149 22 -249 -264 -117 -202 10 -56 41 -98 19 -121 21 -143
$$ packed form
7764g2K46j70L05j31p2k81L60j64l7j49J37k3J55j28j90K26j7k01K76l9m5J53
7786A39j49k7K10n0L2K8k91K31k25R6P8j07n1K7K74q6j42R1j58J49P4j67K6J60
7810A62o8k14K43k13P8k7K21l61J75Qk43K06mN7q2PJ03J22n4n3r4m5L03k44O6
7835D9M4k62K22j31m7K47k47l5J31j6o7J10K03Ok06K29k77J65m7Q5r6n0n2j83
7859b25K84Kp7J3r7J85J66k66k04Q3L17p8k37L64k97j68M52l32n4N0K37N2k15
7882d5n3m7j7L8j20R9J08m2K6P3n4J6K8J18j70pJ04j81L15j40n0j10J09r5J37
7907D0j4M7Lk11P2K3n5n3M21k84J71j97j6L59k04M7m01L60n6k1J61k47J85k67
7931a37pP8J22j09p3K02m5j85Q7j1K27j27k71j5J47q5K12o6R7j39J17j40J42j64
$$ plain form
7955 -143 -4 27 -113 -16 143 194 -118 57 -5 -132 -47 227 12 154 160 12 -171 -52 -120 15 -32 5 -51 -126
7979 -126 -48 -306 78 97 64 154 76 -24 -64 71 105 -56 -26 -35 -1 6 -95 77 -61 237 125 -144 158 145 77
8004 77 101 -5 10 -68 -18 57 6 27 -20 -47 29 45 -155 99 90 -176 -96 -1 -268 74 125 50 -213 16 -13 119
8030 119 -33 -46 78 124 63 276 -133 -43 -88 -43 -10 -189 -181 -181 -106 48 44 -116 355 61 137 -42 97 100 55 123
8056 123 8 281 -45 156 -68 69 -152 -88 210 169 -133 48 -50 -54 90 -106 115 17 -99 110 208 -1
8078 -1 -38 -7 -6 -45 -19 -53 -30 -65 161 -27 38 -234 -148 76 -47 100 -12 -59 -124 144 17 53 -24 111 -28 -72
8104 -72 -19 -2 28 -51 -99 -102 -19 -132 -28 -55 232 67 135 -128 -64 -61 -66 -52 80 92 3 -37 40 -245 -111 17 67
8131 67 -13 28 -101 33 138 -135 45 1 -104 204 163 58 2 187 30 108 25 165 -1 -274 -215 -28 -57
$$ packed form
7955a43J39L1j40R7J59N1l12J75o2j27Q5K74k15J42Oj48j83J19o8J35m7L7n6p5
7979a26P8k58L84J9l3R0p8j00m0J35L4j61L0rL4Pj01J72j38K98j12k69L02j3o8
8004G7K4j06J5p8N0P5n1K1m7k7P6J6k00K54rk66Q0R5k67L42N1p5k63K29k9J32
8030A19j52j3J24M6o1K13m09R0m5M5L3j79Q%P5J54mj60M71k94P6j79J39Lm5O8
8056A23j15K73l26K01k24J37k21O4K98m1l02J81r8mJ44j96K21r8j16K09R8k09
8078al7L1Jl9K6l4K3l5K26j88O5k72Q6K24j23J47j12m7o5K68j27L6p7J35j39m4
8104g2N3J7L0p9m8lQ3j13J04k7K87j65O8k63O4LnJ4J32J2q9m0P7k85J34J28N0
8131F7q0M1j29J34J05k73J80m4j05L08m1j05n6J85j57P8q3J40j66k73N9J87k9
$$ plain form
8154 -57 -96 -284 92 218 -66 60 -277 134 10 10 66 57 -50 -235 -30 10 82 72 102 46 -106 -159 15 33 -151
8179 -151 65 -14 -43 -102 21 164 35 14 9 -27 12 46
$$ packed form
8154e7l9j88L76J26k84J26l37M11j24%N6rj07j85K05M0P2j0L0n6j52n3J74J8j84
8179a51K16p9k9n9J23J43j29k1nl6L9L4
8191D6
$$ Imaginary data points
##PAGE= N=2
##DATA TABLE= (X++(I..I)), XYDATA
$$ plain form
0 0 0 0 0 0 0 0 0 -8 8 -8 8 -16 16 -16 24 -32 40 -48 57 -72 88 -104 121 -144 169 -198 230 -265 305 -351
30 -351 402 -457 520 -589 665 -747 840 -942 1051 -1174 1305 -1452 1610 -1782 1971 -2178
46 -2178 2405 -2652 2922 -3219 3546 -3907 4306 -4753 5252 -5816 6454 -7190 8042 -9049
60 -9049 10257 -11740 13605 -16039 19357 -24175 31835 -45924 80348 -346310 -175129 574809
72 574809 -99179 -528336 16354 499433 -3897 -305872 94671 395960 56144 -158078
82 -158078 36491 187432 16350 -88435 -38804 9022 -14593 -22811 -93253 -125222 -17210
93 -17210 50058 -115360 -172519 75493 209118 -39076 -159025 120245 273498 10361 -113295
104 -113295 135756 197321 -107662 -185264 63552 62214 -192382 -140577 101484 18654 -179831
$$ packed form
0@%%%%%%%qJ6j6J6k4L2l2M0n6P2q8J05j29J60j92K25k65L13l67M28m95N70o56
30c51P53q59R77j109J254j412J587j782J993k225K479k757L062l392L753m149
46b178M583n057N574o141O765p453Q213r059J0005j1068J2270j3644J5232j7091
60i049J9306k1997K5345k9644L5396m3532N6010p7759J26272m26658J71181P49938
72E74809o73988m29157N44690M83079n03330l01975M00543L01289l39816k14222
82a58078J94569J50941j71082j04785M9631M7826k3615q218p0442l1969J08012
93a7210O7268j65418n7159K48012J33625k48194j19949K79270J53253k63137j23656
104a13295K49051O1565l04983p7602K48816j338k54596N1805K42061q2830j98485
$$ plain form
115 -179831 -44675 137827 19557 -81120 64905 129271 -4668 -30193 78025 58372
125 58372 -43465 -13802 58434 8542 -63864 -43014 -11818 -28432 -29803 -19508 -40656 -30749
137 -30749 36736 37544 -43771 -25732 100271 102385 -30673 -38077 89791 74055 -85155 -87596
149 -87596 62027 50409 -111238 -103065 54108 47393 -89418 -59554 88667 79150 -42061
160 -42061 -41099 50192 62133 2492 -31661 -12315 37413 46733 -26651 -73818 98 56878 -23661
173 -23661 -82447 2258 59577 -20534 -63337 19386 60916 -4462 -28786 32180 50560 -923
185 -923 -20378 7262 13004 -4135 -14135 -27792 -33968 -4595 16432 -17529 -37827 20314 65384
198 65384 7895 -46931 9635 69286 12085 -51495 525 51744 -8692 -57328 -1085 28625
$$ packed form
115a79831J35156J82502j18270j00677J46025O4366j33939k5525J08218j9653
125E8372j01837K9663P2236m9892p2406K0850L1196j6614j371J0295k1148R907
137c0749O7485Q08q1315J8039J26003K114j33058p404J27868j5736j59210k441
149h7596J49623j1618j61647Q173J57173o715j36811K9864J48221r517j21211
160d2061R62R1291J1941n9641l4153J9346M9728R320p3384m7167P3916N6780q0539
173b3661n8786Q4705N7319q0111m2803Q2723M1530o5378k4324O0966J8380n1483
185i23j9455K7640N742j7139j0000j3657o176K9373K1027l3961k0298N8141M5070
198F5384n7489n4826N6566N9651n7201o3580N2020N1219o0436m8636N6243K9710
$$ plain form
210 28625 -32070 -46051 15553 20008 -28324 -14269 29107 11409 -6605 25880 25036 -15593 6754
223 6754 54782 9207 -54169 -5887 54121 -8564 -80737 -28163 36876 -9523 -60271 -11422
235 -11422 39438 9752 -18020 14943 39637 17450 3839 20358 22921 5034 -1341 -2923 -13081
248 -13081 -10465 -2783 -25768 -47347 -13348 23952 -13096 -52565 131 57977 14441 -36658
260 -36658 12302 65754 24951 -20264 11491 37779 2902 -19058 -368 -3269 -28619 -25657
272 -25657 -10566 -20679 -26349 -7319 2 -8598 4928 26516 13973 -1907 21434 42312 16098
285 16098 -11348 6397 27468 4419 -26511 -20562 -3654 -9914 -22712 -21700 -17814 -12620 2270
298 2270 8813 -6236 -8083 22966 34702 3829 -7089 28137 38005 -2797 -17728 14139 16900
$$ packed form
210B8625o0695j3981O1604M455m8332J4055M3376j7698j8014L2485q44m0629K2347
223F754M8028m5575o3376M8282O0008o2685p2173N2574O5039m6399n0748M8849
235a1422N0860k9686k7772L2963K4694k2187j3611J6519K563j7887o375j582j0158
248a3081K616P682k2985k1579L3999L7300l7048l9469N2696N7846m3536n1099
260c6658M8960N3452m0803m5215L1755K6288l4877k1960J8690k901k5350K962
272b5657J5091j0113n670J9030P321q600J3526K1588j2543j5880K3341K0878k6214
285A6098k7446J7745K1071k3049l0930N949J6908o260j2798J012L886N194J4890
298B270O543j5049j847L1049J1736l0873j0918L5226R868m0802j4931L1867K761
$$ plain form
311 16900 -26229 -35547 1835 8105 -29426 -38186 4 21507 -3748 -26297 -2689 34581 28158
324 28158 -9503 -12439 28895 42325 -1529 -29195 3775 30423 -3404 -39758 -17472 17378
336 17378 -691 -35899 -20393 19856 12287 -26024 -16941 29912 31066 -14931 -19466 28955 39507
349 39507 -8078 -28355 8897 29526 -2954 -28970 -10081 12157 2091 -16634 -15445 -508
361 -508 5916 -263 -5969 -2020 5871 7533 3350 638 4643 8375 3795 -3293 750 8014 161
376 161 -12494 -3671 13030 2133 -18967 -10383 11037 6637 -10829 -8734 3453 5133 3646 1286
390 1286 -7458 -4919 15077 13521 -15956 -17620 17741 23315 -13270 -19586 17182 22804 -14044 -20955
404 -20955 12833 16366 -19207 -24123 12284 19008 -17961 -26732 10767 25896 -6079 -22003 4825
$$ packed form
311A6900m3129r318L7382O270l7531q760L8190K1503k5255k2549K3608L7270o423
324B8158l7661k936M1334J3430m3854k7666L2970K6648l3827l6354K2286L4850
336A7378j8069l5208J5506M0249p569l8311R083M6853J154m5997m535M8421J0552
349C9507m7585k0277L7252K0629l2480k6016J8889K2238j0066j8725J189J4937
361e08O424o179n706L949P891J662m183k712M005L732m580p088M043P264p853
376A61j2655Q823J6701j0897k1100Q584K1420m400j7466K095J2187J680j487k360
390A286q744K539J9996j556k9477j664L5361N574l6585o316L6768N622l6848o911
404b0955L3788L533l5573m916L6407O724l6969q771L7499J5129l1975j5924K6828
$$ plain form
417 4825 23428 6058 -9988 -2483 9706 11662 4377 -8409 -9279 8594 11789 -12636 -20945 4362
431 4362 10899 -17525 -22002 10283 13780 -16414 -12938 23013 23126 -9841 -9493 21424 23954 -5083
445 -5083 -13891 2949 9637 -2831 -12315 -9615 -4456 -2430 -3674 -8560 -11781 -3025 8959 4718
459 4718 -7051 21 17103 12400 -3172 4400 18894 6326 -9309 3200 13005 -6899 -20623
472 -20623 -5411 3567 -12049 -20595 -8438 1076 279 -27 488 1876 11847 19247 8948 -3060
486 -3060 5352 17567 8171 -9132 -7286 4697 1189 -12792 -14398 -3748 -2569 -13076 -12722 1597
500 1597 4107 -7835 -5042 14723 17217 372 -678 16796 20060 4450 -4499 -172 4369 916
514 916 -9731 -17785 -11868 -1205 -5095 -15296 -9408 4990 6026 -2131 -431 8599 10022 5426
$$ packed form
417D825J8603j7370j6046P505J2189J956p285j2786q70J7873L195k4425q309K5307
431D362O537k8424m477L2285L497l0194L476L5951J13l2967L48L0917K530k9037
445e083q808J6840O688j2468r484K700N159K026j244m886l221Q756J1984m241
459D718j1769P072J7082m703j5572P572J4494j2568j5635J2509R805j9904j3724
472b0623J5212Q978j5616q546J2157R514p97l06N15J388R971P400j0299j2008
486c060Q412J2215r396j7303J846J1983l508j3981j606J0650J179j0507L54J4319
500A597K510j1942K793J9765K494j6845j050J7474L264j5610q949M327M541l453
514I16j0647q054N917J0663l890j0201N888J4398J036q157J700R030J423m596
$$ plain form
528 5426 4745 8946 9070 1398 -3030 4323 8540 -3792 -14971 -5454 5478 -5505 -20043 -11464
542 -11464 4168 2081 -6726 -4367 5319 9067 7189 3945 3241 8193 10591 3862 -2449 55 1875
557 1875 -4441 -6593 -2194 -2321 -7391 -7319 -1694 628 -2819 -5740 -1410 7173 6596 -3863 -4167 9722
573 9722 13788 1684 -3798 4009 7162 950 -3826 -4218 -3686 -1008 -753 -6252 -9138 -2651 1901 -3046
589 -3046 -3983 3399 4788 -1002 889 8187 5859 -2816 -1177 7005 6657 -2596 -7252 -750 6258 1535
605 1535 -8974 -7135 3599 2431 -8122 -9453 279 4951 1421 -2343 228 4408 5813 2327
619 2327 69 3925 5859 201 -2865 2939 3855 -5997 -9396 749 4875 -5969 -11612 -2011 6278
634 6278 438 -7175 -3693 6155 8356 957 -3733 2743 9251 4964 -1297 233 3869 1118 -2687
$$ packed form
528E426o81M201J24p672m428P353M217j2332j1179R517J0932j0983j4538Q579
542a1464J5632k087q807K359R686L748j878l244p04M952K398o729o311K504J820
557A875o316k152M399j27n070P2N625K322l447k921M330Q583n77j0459l04J3889
573I722M066j2104n482P807L153o212m776l92N32K678K55n499k886O487M552m947
589c046r37P382J389n790J891P298k328q675J639Q182l48r253m656O502P008m723
605A535j0509J839J0734j168j0553j331R732M672l530l764K571M180J405l486
619B327k258L856J934n658l066N804R16r852l399J0145M126j0844n643R601Q289
634F278n840p613L482R848K201p399m690O476O508m287o261J530L636k751l805
$$ plain form
649 -2687 -3077 -2317 -2722 -3719 -5003 -3534 -1551 -3561 -5588 -125 6219 2996 -2419 2655 10360 7575
665 7575 155 -600 4924 6262 661 -6376 -5774 132 717 -5508 -8856 -3455 762 -2876 -5896 -1938
681 -1938 2010 1650 2130 5051 6212 4572 3275 4145 5999 5222 -627 -4282 -368 1518 -6168 -11971
697 -11971 -5810 256 -3439 -8691 -5880 2209 5656 2059 -735 3587 9855 7926 1828 1824 5982 4198
713 4198 -856 -1078 264 -2495 -5797 -5360 -3474 -4658 -7166 -6632 -2251 1405 -45 -2522 1466 9265
729 9265 9418 2383 1238 8042 9341 1814 -3305 -931 893 -2384 -6627 -6833 -4784 -3893 -5342 -4751
745 -4751 -984 87 -755 1547 5042 4319 1757 3402 6613 6923 3428 815 878 2593 1767 -3990 -7758
762 -7758 -4506 -1179 -4687 -9106 -6005 480 1015 -1826 -157 3491 4685 4089 4436 5117 4423 3369
$$ packed form
649b687l90P60m05r97j284J469J983k010k027N463O344l223n415N074P705k785
665G575p420p55N524J338n601p037O02N906N85o225l348N401M217l638l020L958
681a938L948l60M80K921J161j640j297Q70J854p77n849l655L914J886p686n803
697a1971O161O066l695n252K811Q089L447l597k794M322O268j929o098mM158j784
713D198n054k22J342k759l302M37J886j184k508N34M381L656j450k477L988P799
729I265J53p035j145O804J299p527n119K374J824l277m243k06K049Q91j449N91
745d751L767J071q42K302L495p23k562J645L211L10l495k613O3J715q26n757l768
762g758L252L327l508m419L101O485N35k841J669L648J194n96L47O81o94j054
$$ plain form
778 3369 2214 1972 537 -2481 -3902 -2542 -1768 -4305 -6306 -4718 -1654 -596 -2102 -3799 -1266 4455
794 4455 5145 496 390 6994 8258 2532 36 3086 2987 -1356 -2712 -1822 -2960 -5097 -4189 -2728 -3654
811 -3654 -4503 -2472 -10 1205 1444 1373 2139 4267 5556 3744 652 926 4348 4131 -1416 -4426 -595
828 -595 1681 -3270 -7773 -4225 -10 -3046 -5625 -1123 1735 -889 -439 3937 4860 1484 1971 5285
844 5285 4749 2026 822 511 -151 387 -1051 -4952 -5678 -1479 -196 -5132 -6659 -976 3324 -54
860 -54 -3045 869 5376 3829 670 2874 5129 2619 482 2525 3270 -1036 -3487 -954 -627 -4138
876 -4138 -5784 -3681 -2661 -2733 -1378 -907 -1703 1220 5755 3581 -348 2458 7836 5414 -913 -541
892 -541 3313 1847 -2525 -3778 -1968 -1719 -4003 -4009 -2280 -1882 -3183 -2177 310 837 321 1041 3492
$$ packed form
778C369j155k42j435l018j421J360P74k537k001J588L064J058j506j697K533N721
794D455O90m649j06O604J264n726k496L050r9m343j356Q90j138k137R08J461r26
811c654q49K031K462J215K39p1P66K128J289j812l092K74L422k17n547l010L831
828e95K276m951m503L548M215l036k579M502K858k624M50M376R23l376M87L314
844E285n36k723j204l11o62N38j438l901p26M199J283m936j527N683M300l378
860e4k991L914M507j547l159K204K255k510k137K043P45m306k451K533L27l511
876d138j646K103J020p2J355M71p96K923M535k174l929K806N378k422o327L72
892e41L854j466m372j253J810K49k284oJ729L98j301J006K487N27n16P20K451
$$ plain form
909 3492 5177 4506 3489 2379 2641 3483 1821 -3114 -4100 -156 70 -5695 -8041 -2786 589 -2976
925 -2976 -4964 -677 3383 2267 703 2951 5301 3700 1408 2622 4213 2183 -974 -440 1365
940 1365 -360 -4457 -4618 -2698 -2679 -4204 -4822 -3513 -604 2128 1526 -743 1581 6772 6015 973 1289
957 1289 5651 4105 -1380 -1847 865 -1117 -4697 -3821 -1374 -2684 -4737 -2884 -703 -1135 -1733 -310
973 -310 1645 2506 2779 2590 2083 3130 5374 4234 298 -1671 1507 1963 -3623 -6534 -2905 -122 -4113
990 -4113 -6064 -2015 1162 -1343 -1843 2275 4113 1555 1657 4579 4140 1886 1570 2373 1479 22 -1066
1007 -1066 -2443 -3049 -1669 -1528 -4304 -5501 -1479 923 -1889 -3701 231 4431 2785 737 3020
1022 3020 5627 3735 1204 2136 3040 56 -2690 -1829 -882 -3402 -4575 -3063 -1922 -2495 -2749 -1856 -709
$$ packed form
909C492J685o71j017j110K62Q42j662m935r86L944K26n765k346N255L375l565
925b976j988M287M060j116j564K248K350j601k292J214J591k030l157N34J805
940A365j725m097j61J920J9j525o18J309K909K732o02k269K324N191p57n042L16
957A289M362j546n485m67K712j982l580Q76K447j310k053J853K181m32n98J423
973c10J955Q61K73j89n07J047K244j140l936j969L178M56n586k911L629K783l991
990d113j951M049L177k505n00M118J838k558J02K922m39k254l16Q03q94j457j088
1007a066j377o06J380J41k776j197M022K402k812j812L932M200j646k048K283
1022C020K607j892k531R32R04k984k746Q61R47k520j173J512J141n73k54Q93J147
$$ plain form
1039 -709 1429 2178 1448 1170 3831 5194 2772 297 1587 2958 1481 -1061 -1361 -761 -2075 -3955
1055 -3955 -4166 -2811 -2710 -3077 -2293 8 1070 248 1101 3658 4330 3035 2390 3229 3597 1996 141
1072 141 -1105 -729 -679 -2303 -4787 -4447 -1834 -1518 -3299 -2230 91 697 353 1424 2514 2814 3014
1089 3014 3412 2844 2766 2350 1232 54 116 -869 -3152 -3815 -2518 -2395 -4017 -4147 -1846 324 -281 -647
1107 -647 793 3219 3970 2640 1592 2873 4103 1847 -288 57 600 -1216 -2687 -1904 -1449 -3197
1123 -3197 -3910 -2685 -1390 -1231 -1598 -1146 1147 2499 2033 1134 2854 5159 4285 866 559 2320 1560
1140 1560 -1929 -3920 -1815 -1058 -3228 -4074 -2087 -857 -1964 -2311 31 1679 982 1088 2781 3599
1156 3599 2602 1849 1998 1669 1537 1138 -352 -1535 -505 -215 -3153 -5277 -2822 -806 -2713 -3889 -969
$$ packed form
1039g09K138P49p30k78K661J363k422k475J290J371j477k542l00O00j314j880
1055c955k11J355J01l67P84K301J062q22Q53K557O72j295o45Q39L68j601j855
1072A41j246L76N0j624k484L40K613L16j781J069K321O06l44J071J090L00K00
1089C014L98n68p8m16j118j178O2r85k283o63J297J23j622j30K301K170o05l66
1107f47J440K426P51j330j048J281J230k256k135L45N43j816j471P83M55j748
1123c197p13J225J295J59l67M52K293J352m66q99J720K305q74l419l07J761p60
1140A560l489j991K105P57k170q46J987J230j107l47K342J648o97J06J693Q18
1156C599r97p53J49l29j32l99j490j183J030K90k938k124K455K016j907j176K920
$$ plain form
1173 -969 1907 1267 193 2312 3669 2542 2055 2556 2221 1080 555 279 -640 -1780 -1681 -1934 -3230 -3017
1191 -3017 -1246 -1289 -3202 -1786 1484 1086 -2015 230 4865 3751 159 1699 5193 3614 -599 -344
1207 -344 1411 -588 -3228 -2446 -1702 -3260 -3406 -1748 -1537 -1875 -644 953 643 781 2993 3313 1501
1224 1501 1364 3621 3244 -252 -1051 1938 1359 -2638 -3917 -885 -685 -3966 -4489 -1332 -632 -1965 -1286
1241 -1286 1228 1838 1351 2496 3152 2748 2560 3031 2105 675 168 -72 -1482 -3063 -1895 -1331 -3221
1258 -3221 -3930 -1810 -241 -1285 -2388 126 2641 2016 645 1815 3988 3299 1395 1361 1964 670
1274 670 -348 -508 -1112 -2437 -2496 -2238 -3167 -3346 -1944 -1290 -1386 -157 1758 2188 1375 2025 3715 3182 1321
1293 1321 980 2330 1728 -733 -2172 -482 -410 -2993 -4027 -1999 -1479 -2423 -2422 -89 601 -194 623 2314
$$ packed form
1173i69K876o40j074K119J357j127m87N01l35j141n25k76r19j140R9k53j296K13
1191c017J771m3j913J416L270l98l101K245M635j114l592J540L494j579m213K55
1207c44J755j999k640P82P44j558j46J658K11l38J231J597l10J38K212L20j812
1224A501j37K257l77l496p99K989n79l997j279L032K00l281n23L157P00j333O79
1241a286K514O10m87J145O56m04j88M71r26j430n07k40j410j581J168N64j890
1258c221p09K120J569j044j103K514K515o25j371J170K173o89j904l4O03j294
1274F70j018j60o04j325n9K58r29j79J402O54r6J229J915M30q13O50J690n33j861
1293A321l41J350o02k461j439J690P2k583j034K028N20r44JK333O90p95Q17J691
$$ plain form
1311 2314 2311 1645 2516 3205 2324 1758 1341 535 -925 -1009 -1142 -2473 -3626 -2604 -1270 -2366 -2850 -783
1329 -783 1215 687 -124 1304 3194 2816 1558 2193 2946 1177 118 484 359 -1166 -1808 -1293 -1394 -2733
1347 -2733 -2330 -1697 -1979 -2021 -722 269 -11 844 2984 3194 1609 1696 3676 2953 137 -372 794 190
1365 190 -2177 -2586 -1677 -1831 -3089 -2596 -779 -868 -1450 -212 1227 1132 984 1607 2572 1647 1662 2163 1498
1384 1498 701 623 818 -1070 -2498 -1101 -784 -2710 -3520 -1610 -159 -1543 -1884 589 2123 1126 902
1401 902 2363 2871 1759 1083 1492 1608 194 -461 -431 -599 -1229 -1815 -1850 -2059 -2020 -1515 -1225 -1476 -301 962
1421 962 824 201 1314 3122 2306 1253 1814 2517 1436 -315 -193 -114 -1560 -2877 -2438 -1566 -2051 -2138
1439 -2138 -1468 -564 -196 296 619 994 1616 2154 1826 1528 1771 2294 1535 -49 -535 47 -386 -1968 -2652
$$ packed form
1311B314lo66Q71O89q81n66m17q06j460q4j33j331j153J022J334j096m84K067
1329g83J998n28q11J428J890l78j258O35P53j769j059L66j25j525o42N15j01j339
1347b733M03O33k82m2J299R91k80Q55K140K10j585Q7J980p23k816n09J166o04
1365A90k367m09R09j54j258M93J817q9n82J238J439r5j48O23R65r25J5N01o65
1384A498p97p8J95j888j428J397L17j926q10J910J451j384l41K473J534r97k24
1401I02J461N08j112o76M09J16j414o55L0j68o30n86l5k09L9N05K90k51J175J263
1421I62j38o23J113J808q16j053N61P03j081j751J22P9j446j317M39Q72m85q7
1439b138O70R04L68M92L23L75O22N38l28k98K43N23p59j584m86N82m33j582o84
$$ plain form
1458 -2652 -1921 -1583 -2418 -2739 -1074 21 -626 -690 1496 2476 1998 1986 2669 2364 1573 965 772 301 -118
1477 -118 -771 -1862 -2164 -1656 -1572 -2446 -2371 -1057 -119 -1074 -657 870 1960 1842 1567 2105 2541 2102 926
1496 926 888 768 418 -1057 -1867 -1638 -1588 -2567 -2720 -1721 -1487 -1202 -988 87 1011 1786 1903 1851 2283 2907
1516 2907 2038 929 714 1200 221 -1226 -1477 -1375 -1683 -2223 -2548 -2023 -1370 -1032 -831 -309 769 1458 997
1535 997 1505 2501 2543 1827 1499 1693 1141 175 -719 -1345 -1350 -1721 -2539 -2904 -1853 -1050 -1393 -1123 -75 1128
1555 1128 778 758 1791 2172 1942 1636 1663 1255 1224 413 -568 -806 -476 -1334 -2099 -1945 -1345 -1834 -1956 -998
1575 -998 -254 -193 352 936 1419 2042 2255 1820 1661 1801 1296 130 -447 -331 -857 -1674 -1660 -1180 -1854 -1640
1595 -1640 -1471 -1127 -502 134 333 300 1176 1705 1308 1229 1840 1820 1115 699 794 181 -921 -1041 -1312 -1838 -1798
$$ packed form
1458b652P31L38q35l21J665J095o47o4K186R80m78j2O83l05p91o08j93m71m19
1477a18o53j091l02N08Q4q74P5J314R38r55M17J527J090j18k75N38M36m39j176
1496I26l8j20l50j475q10K29N0r79j53R99K34K85K14J075R24P75J17n2M32O24
1516B907q69j109k15M86r79j447k51J02l08n40l25N25O53L38K01N22J078O89m61
1535I97N08R96M2p16l28J94n52r66q94o26nl71q18l65J051Q03l43K70J048J203
1555A128l50k0J033L81k30l06K7m08l1q11r81k38L30q58p65J54O00m89j22R58
1575i98P44O1N45N84M83O23K13m35j59J40n05j166n77J16n26q17J4M80o74K14
1595a640J69L44O25O36J99l3Q76N29l97p9O11k0p05m16R5o13j102j20k71n26M0
$$ plain form
1616 -1798 -1712 -1630 -1634 -492 -334 -497 359 1411 1135 1020 1725 1803 1023 951 1063 507 85 -166 -619 -846 -1029
1637 -1029 -1318 -1940 -1801 -1297 -1231 -1192 -450 478 961 622 1436 1868 1747 1877 1973 1360 1241 675 -197 -791 -1114
1658 -1114 -1391 -1796 -1784 -1499 -1446 -1419 -1072 -482 102 506 742 930 1713 1747 1542 1430 1803 1436 634 -152 -131
1679 -131 -527 -1271 -1717 -1457 -1780 -1596 -1525 -1188 -766 -162 63 690 1261 2027 1883 1790 1859 1724 947 615 110
1700 110 -328 -645 -1196 -1539 -1788 -1486 -1660 -1850 -1413 -646 -155 -229 581 1248 1537 1520 1668 2002 1870 1282 921
1721 921 841 260 -704 -997 -1247 -1596 -1876 -2142 -1876 -1518 -664 -498 51 696 1055 1488 1473 1762 1741 1735 1242 393
1743 393 442 460 -663 -914 -1311 -1479 -1709 -1987 -1659 -918 -876 -644 -329 433 1001 1159 1442 1510 1721 1892 1486
1764 1486 1179 641 505 -353 -1138 -1216 -1396 -1973 -2296 -1837 -1268 -817 -637 16 639 781 887 1233 1612 1450
$$ packed form
1616a798Q6Q2mJ142J58j63Q56J052k76j15P05P8p80p2J12n56m22k51m53k27j83
1637a029k89o22J39N04O6L9P42R28M83l39Q14M32j21J30R6o13j19n66q72n94l23
1658a114k77m05J2K85N3K7L47N90N84M04K36J88P83L4k05j12L73l67q02p86K1
1679a31l96p44m46K60l23J84P1L37M22O04K25O27N71P66j44r3O9j35p77l32n05
1700A10m38l17n51l43k49L02j74j90M37P67M91p4Q10O67K89j7J48L34j32n88l61
1721I21q0n81r64k93k50l49k80k66K66L58Q54J66N49O45L59M33j5K89k1om93q49
1743C93M9J8j123k51l97j68k30k78L28P41M2K32L15P62N68J58K83O8K11J71m06
1764A486l07n38j36q58p85p8j80n77l23M59N69M51J80O53O23J42J06L46L79j62
$$ plain form
1784 1450 1389 1040 1035 834 188 -48 -365 -699 -1028 -1214 -1601 -1604 -1676 -1207 -906 -665 -24 635 811 998 1399 1702
1806 1702 1294 913 1327 1049 213 -231 -394 -551 -945 -1166 -1050 -1198 -1427 -1171 -1021 -592 -323 106 420 804
1826 804 1299 1365 1436 1225 1126 1126 1100 -15 -191 -168 -714 -1326 -1301 -1231 -1398 -1621 -1181 -615 -252 -180 537 1179 1275
1849 1275 1127 1456 1373 1127 988 556 352 99 -168 -503 -1020 -926 -1280 -1245 -1346 -1248 -852 -496 -239 -120 548
1870 548 981 1078 1473 1771 1611 1264 951 762 225 -141 -692 -837 -1302 -1410 -1356 -1379 -1109 -820 -293 -171 -159
1891 -159 150 548 925 1171 1285 1615 1147 1032 860 684 201 -490 -626 -890 -1168 -1628 -1424 -1258 -1312 -1279 -645
1912 -645 64 308 782 1186 1519 1134 1473 1535 889 744 670 378 -220 -342 -727 -853 -1341 -1604 -1328 -1026 -1029
1933 -1029 -824 -249 27 311 826 1053 1283 1366 1476 1428 1148 983 580 141 -612 -742 -1083 -1501 -1511 -1426 -1407
$$ packed form
1784A450o1l49nk01o46k36l17l34l29j86l87lp2M69L01K41O41O59J76J87M01L03
1806A702m08l81M14k78q36m44j63j57l94k21J16j48k29K56J50M29K69M29L14L84
1826H04M95O6P1k11r9%k6j115j76K3n46o12K5P0j67k23M40N66L63P2P17O42R6
1849A275j48L29q3k46j39m32k04k53k67l35n17R4l54L5j01R8L96L56K57J19O68
1870E48M33R7L95K98j60l47l13j89n37l66n51j45m65j08N4k3K70K89N27J22J2
1891a59L09L98L77K46J14L30m68j15j72j76m83o91j36k64k78m60K04J66n4L3O34
1912f45P09K44M74M04L33l85L39O2o46j45p4k92n98j22l85j26m88k63K76L02l
1933a029K05N75K76K84N15K27K30Q3J10m8k80j65m03m39p53j30l41m18j0Q5J9
$$ plain form
1954 -1407 -1216 -815 -312 -90 240 833 1261 1234 1258 1240 1208 1035 593 689 200 -193 -575 -953 -911 -1362 -1489 -1418
1976 -1418 -1192 -900 -625 -286 254 443 870 1242 1369 1449 1421 1199 946 508 328 -24 -506 -921 -818 -1130
1996 -1130 -1465 -1411 -1080 -735 -841 -97 -116 347 575 932 1225 1306 1365 1400 1210 1057 450 310 -160 -761 -1038
2017 -1038 -1151 -1086 -1376 -1407 -991 -755 -706 -155 334 667 761 1239 1538 1432 1104 1086 883 207 -108 -134 -755 -985
2039 -985 -872 -979 -1141 -1191 -961 -887 -658 -340 159 373 675 954 1149 1260 942 1092 1114 833 169 -40 -336
2060 -336 -473 -936 -1200 -846 -1151 -1262 -907 -415 -191 -72 532 611 763 914 1114 1009 636 823 725 493 264
2081 264 -25 -129 -520 -1061 -1086 -1003 -1145 -1066 -970 -447 -399 43 673 835 873 997 1363 1214 1030 964 861 427
2103 427 -356 -601 -403 -999 -1273 -1045 -935 -1188 -836 -421 -445 -280 242 500 662 610 1055 905 1016 770 691
$$ packed form
1954a407J91M01N03K22L30N93M28k7K4j8l2j73m42R6m89l93l82l78M2m51j27P1
1976a418K26K92K75L39N40J89M27L72J27Q0k8k22k53m38j80l52m82m15J03l12
1996a130l35N4L31L45j06P44j9M63K28L57K93Q1N9L5j90j53o07j40m70o01k77
2017a038j13O5k90l1M16K36M9N51M89L33R4M78K99j06l28j8k03o76l15k6o21k30
2039i85J13j07j62n0K30P4K29L18M99K14L02K79J95J11l18J50K2k81o64k09k96
2060c36j37m63k64L54l05j11L55M92K24J19O04P9J52J51K00j05l73J87r8k32k29
2081B64k89j04l91n41k5Q3j42P9R6N23M8M42O30J62L8J24L66j49j84o6j03m34
2103D27p83k45J98n96k74K28J10k53L52M15k4J65N22K58J62n2M45j50J11k46p9
$$ plain form
2124 691 746 390 -269 -578 -512 -985 -1366 -1016 -775 -1054 -943 -491 51 -108 272 870 1266 814 842 1093 793
2145 793 645 318 420 42 -254 -519 -419 -1148 -874 -1041 -887 -948 -718 -371 -135 66 819 787 1075 1085 1208
2166 1208 1152 704 620 416 226 -231 -624 -834 -767 -903 -1172 -951 -736 -859 -424 128 355 314 753 796 758 867
2188 867 1088 872 659 329 481 78 -565 -622 -797 -1125 -1125 -1299 -757 -581 -675 -350 286 94 545 844 1154
2209 1154 1358 878 921 1031 774 297 159 -403 -557 -1003 -794 -984 -1039 -1287 -602 -608 -471 5 210 320 403
2230 403 872 1018 920 1234 1081 878 465 14 45 -367 -627 -1084 -1134 -877 -1067 -1043 -571 -485 -350 134 583 737
2252 737 800 1175 1019 996 608 730 652 215 -146 -200 -581 -798 -906 -842 -943 -1094 -936 -599 -437 -251 180 606
2274 606 723 970 1014 1256 982 797 334 358 22 -208 -279 -494 -856 -996 -1022 -951 -729 -492 -183 100 320 590
$$ packed form
2124F91N5l56o59l09O6m73l81L50K41k79J11M52N42j59L80N98L96m52K8K51l00
2145G93j48l27J02l78k96k65J00p29K74j67J54o1K30L47K36K01P53l2K88J0J23
2166A208n6m48q4k04j90m57l93k10O7j36k69K21K15j23M35N52K27m1M39M3l8J09
2188H67K21k16k13l30J52m03o43n7j75l28%j74N42J76r4L25O36j92M51K99L10
2209A154K04m80M3J10k57m77j38n62j54m46K09j90n5k48O85oJ37M76K05J10Q3
2230D03M69J46r8L14j53k03m13m51L1m12k60m57n0K57j90K4M72Q6J35M84M49J54
2252G37O3L75j56k3l88J22p8m37l61n4l81k17j08O4j01j51J58L37J62J86M31M26
2274F06J17K47M4K42k74j85m63K4l36k30p1k15l62j40k6P1K22K37L09K83K20K70
$$ plain form
2296 590 902 679 1004 1002 974 787 674 772 197 -6 -529 -635 -752 -979 -678 -997 -710 -634 -354 -163 51 410
2318 410 472 905 889 871 1060 822 434 204 -72 46 -352 -710 -524 -778 -711 -769 -724 -635 -695 -416 14 258 418
2341 418 613 1073 1048 1080 885 844 735 356 23 -388 -558 -605 -778 -578 -931 -846 -691 -453 -420 108 127 268
2363 268 496 627 1057 1075 886 502 697 331 283 -91 -163 -638 -448 -846 -837 -850 -943 -790 -513 -526 -194 2 517
2386 517 571 852 943 871 1079 777 546 391 -215 -51 -157 -699 -960 -864 -886 -956 -770 -655 -234 -206 -87 335
2408 335 529 578 685 839 548 784 667 616 285 67 -315 -325 -740 -792 -839 -749 -663 -699 -522 -417 47 300 610
2431 610 691 846 758 781 841 705 494 471 122 -129 -321 -422 -719 -847 -819 -584 -763 -604 -376 105 42 314
2453 314 604 676 767 1028 965 882 546 554 63 -60 -208 -604 -705 -789 -1029 -1085 -699 -730 -433 -90 213 359 627
$$ packed form
2296E90L12k23L25kk8j87j13R8n75k03n23j06j17k27L01l19K87P6K80J91K14L59
2318D10O2M33j6j8J89k38l88k30k76J18l98l58J86k54O7n8M5Q9o0K79M30K44J60
2341D18J95M60k5L2j95m1j09l79l33m11j70m7j73K00l53Q5J55K38L3N28J9J41
2363B68K28J31M30J8j89l84J95l66m8l74p2m75J90l98Rj3r3J53K77j3L32J96N15
2386E17N4K81R1p2K08l02k31j55o06J64j06n42k61R6k2p0J86J15M21K8J19M22
2408C35J94M9J07J54k91K36j17n1l31k18l82j0m15n2m7R0Q6l6J77J05M64K53L10
2431F10Q1J55q8K3O0j36k11k3l49k51j92j01k97j28K8K35j79J59K28M81o3K72
2453C14K90P2R1K61o3q3l36Qm91j23j48l96j01q4k40n6L86l1K97L43L03J46K68
$$ plain form
2476 627 622 778 668 754 893 550 374 177 -6 86 -454 -735 -607 -1015 -909 -939 -796 -753 -450 -84 357 380
2498 380 559 740 879 871 717 729 578 255 -71 -87 -558 -631 -836 -645 -1003 -902 -625 -653 -351 -147 14 220
2520 220 540 742 827 741 1082 908 468 456 363 -189 -413 -482 -755 -912 -868 -808 -868 -633 -317 -143 -112 403 692
2543 692 535 504 752 859 418 686 540 451 -132 -322 -383 -666 -836 -692 -667 -531 -478 -296 -320 -49 104 252
2565 252 397 691 681 653 673 567 532 325 191 -148 -365 -411 -698 -754 -709 -684 -806 -705 -334 -127 -33 362 620
2588 620 525 541 669 685 503 480 363 306 -63 -3 -209 -490 -504 -794 -674 -761 -620 -684 -394 -29 120 428 407
2611 407 655 588 573 725 502 395 452 234 -123 -320 -446 -733 -646 -709 -748 -603 -437 -253 -133 115 225 297
2633 297 321 392 658 573 644 675 366 142 -77 -204 -454 -627 -485 -412 -554 -588 -374 -373 -353 -207 151 399 293
$$ packed form
2476F27nJ56j10Q6J39l43j76j97j83R2n40k81J28m08J06l0J43M3L03L66M41K3
2498C80J79J81J39qj54J2j51l23l26j6m71p3k05J91l58J01K77k8L02K04J61K06
2520B20L20K02Q5q6L41j74m40j2r3n52k24o9k73j57M4O0o0K35L16J74L1N15K89
2543F92j57l1K48J07m41K68j46q9n83j90o1k83j70J44K5J36N3J82k4K71J53J48
2565B52J45K94j0k8K0j06l5k07j34l39k17m6k87n6M5K5j22J01L71K07R4L95K58
2588F20r5J6J28J6j82k3j17n7l69O0k06k81j4k90J20q7J41o4K90L65J49L08k1
2611D07K48o7j5J52k23j07N7k18l57j97j26k87Q7o3l9J45J66J84J20K48J10P2
2633B97K4P1K66q5P1L1l09k24k19j27k50j73J42P3j42l4K14JK0J46L58K48j06
$$ plain form
2656 293 516 578 714 757 731 425 373 145 7 -179 -453 -511 -596 -453 -755 -774 -608 -97 -75 5 297 351 464
2679 464 813 419 739 629 379 474 146 -164 -117 -249 -488 -621 -643 -646 -694 -363 -343 -131 36 293 264 282 632
2702 632 738 776 535 721 394 397 78 -15 -406 -414 -422 -949 -835 -636 -632 -379 -353 156 -13 457 563 612 659 712 643
2727 643 526 596 325 221 -218 -171 -362 -468 -602 -740 -684 -778 -396 -208 -154 -204 398 397 516 586 905 848 780 608
2751 608 395 205 -213 -91 -458 -669 -599 -730 -709 -507 -345 -408 -75 59 135 340 620 422 397 704 579 624
2773 624 415 308 34 -66 -439 -388 -534 -666 -435 -620 -523 -475 -396 -163 208 286 539 449 641 523 551 453 253
2796 253 332 72 -275 -169 -457 -492 -524 -605 -340 -675 -390 -52 -91 33 296 410 461 502 800 538 541 364 255
2819 255 274 -160 -117 -297 -396 -678 -590 -625 -757 -513 -494 -122 146 105 326 338 522 620 684 640 361 559 449 12
$$ packed form
2656B93K23O2J36M3k6l06n2k28j38j86k74n8q5J43l02j9J66N11K2Q0K92N4J13
2679D64L49l94L20j10k50R5l28l10M7j32k39j33k2lm8L31K0K12J67K57k9J8L50
2702F32J06L8k41J86l27Ll19r3l91qqn27J14J99MK53K6N09j69M70J06M9M7N3o9
2727F43j17P0k71j04m39M7j91j06j34j38N6r4L82J88N4n0O02jJ19P0L19n7o8j72
2751F08k13j90m18J22l67k11P0j31K1K02J62o3L33J34P6K05K80j98k5L07j25M5
2773F24k09j07k74j00l73N1j46j32K31j85R7M8P9K33L71P8K53r0J92j18K8r8k00
2796B53P9k60l47J06k88l5l2q1K65l35K85L38l9J24K63J14N1M1K98k62Lj77j09
2819B55J9m34M3j80r9k82Q8l5j32K44J9L72K68m1K21J2J84R8O4m4k79J98j10m37
$$ plain form
2843 12 -255 -201 -286 -404 -659 -459 -509 -517 -106 -424 -125 -87 233 560 335 513 548 639 681 473 352 235 85
2866 85 -79 -200 -468 -548 -679 -639 -707 -582 -305 59 46 202 289 447 648 654 514 628 386 449 319 193 -24
2889 -24 -118 -228 -312 -583 -522 -443 -481 -412 -362 -39 -163 82 228 506 565 680 545 333 604 280 -88 -96 -99 -225
2913 -225 -452 -560 -530 -529 -470 -206 -379 -87 217 211 391 355 490 557 521 411 321 311 212 2 -153 -330 -279 -289 -625
2938 -625 -530 -506 -535 -364 -272 80 422 282 357 330 554 607 371 570 209 213 24 -131 -179 -443 -180 -439 -802
2961 -802 -455 -436 -347 -227 -149 21 377 295 675 377 783 495 562 358 371 168 -36 76 -341 -197 -497 -452
2983 -452 -822 -553 -492 -123 -97 128 176 220 212 572 424 576 505 602 323 262 -71 -154 -27 -328 -344 -576 -460 -668
3007 -668 -537 -648 -318 -142 89 120 363 568 705 690 409 511 306 408 19 -12 -145 -322 -364 -395 -405 -592
$$ packed form
2843A2k67N4q5j18k55K00n0qM11l18K99L8L20L27k25J78L5R1M2k08j21j17j50
2866H5j64j21k68q0j31M0o8J25K77L64j3J56Q7J58K01Oj40J14k42O3j30j26k17
2889b4r4j10q4k71O1P9l8O9N0L23j24K45J46K78N9J15j35k12K71l24l68qlj26
2913b25k27j08L0JN9K64j73K92L04oJ80l6J35O7l6j10r0j0r9k10j55j77N1j0l36
2938f25R5K4k9J71R2L52L42j40P5k7K24N3k36J99l61Mj89j55m8k64K63k59l63
2961h02L47J9Q9J20P8J70L56q2L80k98M06k88O7k04J3k03k04J12m17J44l00M5
2983d52l70K69O1L69K6K25M8M4qL60j48J52p1R7k79o1l33q3J27l01j6k32J16k08
3007f68J31j11L30J76K31L1K43K05J37j5k81J02k05J02l89l1j33j77m2l1j0j87
$$ plain form
3029 -592 -322 -282 -391 -156 53 272 -81 188 368 365 475 480 452 293 217 78 -105 -193 -345 -313 -549 -513 -691
3052 -691 -483 -492 -298 -163 88 196 66 278 472 571 367 422 331 114 -108 33 -218 -168 -465 -280 -443 -496
3074 -496 -469 -529 -108 -304 -97 303 225 259 435 568 447 523 495 339 41 137 -66 -157 -382 -303 -536 -524 -479 -292
3098 -292 -293 -74 8 -3 276 99 459 282 399 279 362 213 127 148 232 -74 -350 -429 -378 -416 -580 -372 -107 -175
3122 -175 -253 -15 133 289 247 568 185 504 441 243 244 157 -27 -71 -126 -259 -505 -436 -439 -384 -493 -251 -38 4
3146 4 185 214 431 313 658 274 606 485 270 329 -143 -110 -296 -328 -300 -387 -522 -548 -407 -337 -277 -146 169 207
3170 207 373 673 681 475 637 577 417 85 232 -129 -193 -329 -299 -595 -522 -421 -283 -453 -578 -76 46 205
3192 205 239 196 515 338 257 735 341 281 207 52 -197 -33 -392 -602 -431 -545 -269 -101 -103 -232 -98 102
$$ packed form
3029e92K70M0j09K35K09K19l53K69J80lJ10Nk8j59p6j39j83q8j52L2k36L6j78
3052f91K08rJ94J35K51J08j30K12J94R9k04N5r1k17k22J41k51N0k97J85j63n3
3074d96K7o0M21j96K07M00p8L4J76J33j21P6k8j56k98R6k03r1k25P9k33J2M5J87
3098b92jK19Q2j1K79j77L60j77J17j20Q3j49q6K1Q4l06k76p9N1l8j64K08K65o8
3122a75p8K38J48J56m2L21l83L19o3j98Jq7j84m4n5j33k46O9lN5j09K42K13M2
3146DJ81K9K17j18L45l84L32j21k15N9m72L3j86l2K8q7j35k6J41P0O0J31L15L8
3170B07J66L00Qk06J62o0j60l32J47l61o4j36L0k96P3J01J38j70j25N02J22J59
3192B05L4m3L19j77q1M78l94o0p4j55k49J64l59k10J71j14K76J68kj29J34K00
$$ plain form
3214 102 138 289 315 498 562 468 499 214 235 -21 47 -159 -305 -350 -239 -242 -313 -335 -413 -37 -119 -58 139 295 365
3239 365 324 465 349 270 294 259 168 -64 -138 -225 -344 -390 -387 -435 -245 -318 -146 -228 8 50 228 336 431 573 367
3264 367 535 254 315 185 101 6 -186 -94 -355 -490 -417 -396 -489 -256 -105 2 -177 158 400 368 320 444 430
3287 430 530 151 234 109 -122 -109 -313 -272 -331 -357 -473 -398 -412 -260 -13 -5 175 147 301 311 520 331 304 206
3311 206 175 121 17 -115 -72 -250 -332 -409 -307 -256 -106 -345 -294 -118 -91 307 149 265 374 482 632 198 226
3334 226 281 -25 123 -291 -121 -452 -452 -285 -230 -367 -280 -368 -64 134 282 179 342 242 101 302 288 471
3356 471 208 122 -46 -122 -105 -209 -279 -432 -394 -246 -426 -338 -144 134 -28 214 247 362 595 353 351 440 402 292
3380 292 298 101 -5 -67 -301 -395 -352 -388 -615 -188 -103 -110 73 127 132 606 471 480 211 222 122 257 98 125 -39
$$ packed form
3214A02L6J51K6J83O4r4L1k85K1k56O8k06j46m5J11lp1k2p8L76q2O1J97J56P0
3239C65m1J41j16p9K4l5r1k32p4q7j19m6Lm8J90p3J72q2K36M2J78J08R5J42k06
3264C67J68k81O1j30q4r5j92R2k61j35P3K1r3K33J51J07j79L35K42l2m8J24j4
3287D30J00l79Q3j25k31J3k04M1n9k6j16P5j4J52K47QJ80k8J54J0K09j89k7r8
3311B06l1n4j04j32M3j78q2p7J02N1J50k39N1J76K7L98j58J16J09J08J50m34K8
3334B26N5l06J48m14J70l31%J67N5j37Q7q8L04J98J48j03J63j00j41K01j4J83
3356D71k63q6j68p6J7j04p0j53L8J48j80Q8J94K78j62K42L3J15K33k42kQ9l8j10
3380B92Oj97j06o2k34r4M3l6k27M27Q5pJ83N4NM74j35Rk69J1j00J35j59K7j64
$$ plain form
3405 -39 -357 -464 -293 -278 -338 -229 -453 -451 157 172 184 236 62 256 395 512 444 245 200 412 51 66 -106 -383
3429 -383 -232 -465 -213 -568 -204 -248 -9 -116 25 -51 374 374 219 319 391 361 231 333 239 157 -180 -86 -298
3452 -298 -345 -503 -260 -346 -325 -214 -185 24 213 252 290 546 426 314 413 402 310 -126 -113 -156 -218 -161 -280 -322 -246
3477 -246 -345 -376 -182 -6 -94 83 109 15 218 318 330 226 316 355 125 291 -227 -51 -204 -358 -284 -113 -353
3500 -353 -196 -155 -350 -100 -27 315 337 408 215 343 211 220 91 130 56 -3 -134 -371 -227 -233 -254 -360 -152 -168
3524 -168 -219 30 -152 76 -73 170 188 42 357 115 200 213 303 77 7 -256 -305 -425 -303 -496 -151 -37
3546 -37 -93 -157 14 -75 35 355 71 387 179 415 450 299 125 43 39 -202 -298 -221 -213 -366 -645 -311 -360 -98
3570 -98 -157 89 -78 1 76 152 175 160 386 328 -74 15 242 -246 -113 -162 -429 -259 -50 -240 -270 -320 -6 -228
$$ packed form
3405c9l18j07J71J5o0J09k24KO08J5J2N2j74J94J39J17o8j99m5K12l61J5j72k77
3429c83J51k33K52l55L64m4K39j07J41p6M25%j55J00P2l0j30J02r4q2l37R4k12
3452b98m7j58K43q6K1J11K9K09J89L9L8K56j20j12R9j1r2m36J3m3o2N7j19m2P6
3477b46r9l1J94J76q8J77K6r4K03J00J2j04R0L9k30J66n18J76j53j54P4J71k40
3500c53J57M1j95K50P3L42K2P1j93J28j32Rj29L9p4n9j31k37J44ok1j06K08j6
3524a68n1K49j82K28j49K43J8j46L15k42Q5J3R0k26p0k63m9j20J22j93L45J14
3546c7n6o4J71q9J10L20k84L16k08K36L5j51j74q2mk41r6P7Qj53k79L34m9K62
3570i8n9K46j67P9P5P6K3j5K26n8m02Q9K27m88J33m9k67J70K09j90l0n0L14k22
$$ plain form
3594 -228 -162 235 145 223 411 453 262 319 99 149 -166 121 -234 -268 -272 -131 -285 -398 -150 -43 -42 -58 198 218
3618 218 262 24 310 216 246 201 230 7 153 -2 -134 -158 -385 -401 -322 -342 -374 -313 33 -170 -148 -1 24 160
3642 160 196 480 432 487 269 369 149 177 15 -155 -203 -190 -252 -106 -248 -161 -207 -352 2 75 -112 164 179 89
3666 89 114 408 199 247 266 -6 -80 -148 -211 -331 -179 -328 -109 -198 -340 -162 -78 86 228 -21 249 108 239
3689 239 334 277 186 186 242 171 110 -25 -156 -11 -281 -409 -392 -167 -256 -125 -127 -25 229 47 103 332 402 277 349
3714 349 340 158 126 112 -199 -250 -257 -245 -427 -164 -261 -310 -175 85 -22 -31 142 139 273 357 304 163 204 153 145 -6 -223
3741 -223 -178 -241 -321 -208 -436 -183 -75 30 -129 6 106 104 401 163 -17 89 169 250 108 3 -236 -138 -154
3764 -154 -239 -123 -154 -305 -30 -177 -305 57 -43 -35 104 24 240 -78 334 226 113 252 185 79 -136 -10
$$ packed form
3594b28O6L97r0P8J88M2j91N7k20N0l15K87l55l4mJ41j54j13K48J07Jj6K56K0
3618B18M4k38K86r4L0m5K9k23J46j55j32k4k27j6P9k0l2O1L46k03K2J47K5J36
3642A60L6K84m8N5k18J00k20K8j62j70m8J3o2J46j42Q7m6j45L54P3j87K76J5r0
3666H9K5K94k09M8J9k72p4o8o3j20J52j49K19q9j42J78Q4J64J42k49K70j41J31
3689B39R5n7r1%N6p1o1j35j31J45k70j28J7K25q9J31kJ02K54j82N6K29P0j25P2
3714C49rj82l2j4l11n1pJ2j82K63r7m9J35K60j07rJ73lJ34Q4n3j41M1n1qj51k17
3741b23M5o3q0J13k28K53J08J05j59J35J00kK97k38j80J06Q0Q1j42j05k39R8j6
3764a54q5J16l1j51K75j47j28L62j00QJ39q0K16l18M12j08j13J39o7j06k15J26
$$ plain form
3786 -10 -181 -72 -173 -160 -276 -262 -285 -322 22 -287 0 64 49 113 145 176 48 359 293 112 68 -67 -54 -70 -238
3811 -238 -259 -154 -339 -180 -280 -192 -9 164 153 43 234 187 121 46 128 233 194 39 -106 -133 -267 -135 -270
3834 -270 -248 115 -203 -211 -200 -47 64 169 92 66 140 13 4 277 256 145 101 46 -148 -166 46 -120 -220 -305 -237
3859 -237 -194 -241 -235 -63 39 155 211 86 395 174 175 -54 179 91 42 49 -36 -334 -57 -196 -207 -232 -285 -73 -177
3884 -177 48 -28 152 141 230 277 371 12 290 309 248 89 129 45 -171 -127 -145 -265 -73 -172 -195 -288 -9 -23 207
3909 207 149 237 -21 177 364 416 219 195 -20 250 -51 -163 -105 -218 -55 -384 -347 -64 113 -182 -98 -97 80
3932 80 120 367 443 231 292 238 172 270 -69 -133 -91 -153 -171 -171 -134 -48 -286 -101 -139 -242 199 96 230 253 48 232
3958 232 85 74 98 206 100 -56 179 -32 92 -322 -379 -277 -251 -167 60 178 -126 85 408 2 255 -114
$$ packed form
3786a0j71J09j01J3j16J4k3l7L44l09K87O4j5O4L2L1j28L11o6j81m4j35J3j6j68
3811b38k1J05j85J59j00Q8J83J73j1j10J91m7o6p5Q2J05l9j55j45k7j34J32j35
3834b70K2L63l18qJ1J53J11J05p7k6P4j27rK73k1j11m4n5j94j8K12j66j00q5O8
3859b37M3m7OJ72J02J16N6j25L09k21Jk29K33q8m9Pq5k98K77j39j1k5n3K12j04
3884a77K25p6J80j1Q9M7R4l59K78J9o1j59M0q4k16M4j8j20J92r9k3r3K79j4K30
3909B07n8Q8k58J98J87N2j97k4k15K70l01j12N8j13J63l29L7K83J77k95Q4JJ77
3932H0M0K47P6k12O1n4o6R8l39o4M2o2j8%L7Q6k38J85l8j03M41j03J34K3k05J84
3958B32j47j1K4J08j06j56K35k11J24m14n7J02K6Q4K27J18l04K11L23m06K53l69
$$ plain form
3980 -114 -76 230 376 74 143 126 -53 -127 -43 -366 -251 -153 -138 -155 -178 -130 -23 -125 170 99 57 132 346 223
4004 223 464 165 182 -83 218 -189 -178 -246 -223 -187 -238 -180 -38 39 -229 17 -15 131 126 177 321 331 247 260 168
4029 168 -132 81 242 54 -55 -225 -165 -212 -106 -91 -65 -204 -167 38 16 43 146 392 176 100 435 120 96
4052 96 204 74 28 -227 -233 -215 -128 -307 -195 -232 -11 -24 27 46 -138 50 245 191 205 297 172 216 189 -105 133
4077 133 -257 -156 -211 -92 -332 -320 -380 -92 -66 -115 88 80 139 155 146 86 400 47 117 173 -101 90 -109 80 -195
4102 -195 -299 -232 -209 -225 -143 -61 0 -103 -75 283 -139 270 88 251 175 -114 65 77 -110 -67 -138 -166 -162 -115 -228
4127 -228 -246 -120 58 -110 -178 -175 166 249 150 36 206 -47 197 -50 29 163 36 -130 -242 -65 -110 -142 -19
4150 -19 -9 -381 69 -18 84 189 134 -12 181 109 25 63 160 -50 242 135 116 -83 45 -11 -201 -137 -138 -199 15
$$ packed form
3980a14L8L06J46l02O9j7j79p4Q4l23J15R8J5j7k3M8J07j02K95p1m2P5K14j23
4004B23K41k99J7k65L01m07J1o8K3L6n1N8J42P7k68K46l2J46nN1J44J0q4J3r2
4029A68l00K13J61j88j09j70O0m7J06J5K6j39L7K05k2K7J03K46k16p6L35l15k4
4052I6J08j30m6k55oJ8Q7j79J12l7K21j3N1J9j84J88J95n4J4R2j25M4k7k94K38
4077A33l90J01n5J19k40J2o0K88K6m9K03qN9J6ro0L14l53P0N6k74J91j99J89k75
4102a95j04O7K3j6Q2Q2O1j03K8L58m22M09j82J63p6k89J79J2j87M3p1k8MM7j13
4127b28j8J26J78j68o8LL41Q3r9j14J70k53K44k47P9J34j27j66j12J77m5l2J23
4150a9J0l72M50q7J02J05n5j46J93p2q4L8R7k10K92j07j9j99J28n6j90O4jo1K14
$$ plain form
4175 15 63 86 184 -2 -20 24 173 325 -7 131 67 124 126 38 -196 -159 -94 -105 -265 -182 -89 -157 19 -8 -216 116
4201 116 -38 221 99 188 40 71 307 -82 26 16 163 -114 -164 -43 -87 -250 -87 -155 -110 -103 164 76 172 -79
4225 -79 57 125 136 185 136 169 291 -26 -91 -156 -92 -299 -131 -242 -47 -104 -191 90 30 25 102 83 272 428 178
4250 178 129 201 273 166 84 -6 4 -225 60 -60 -327 -134 -413 -121 48 -156 -115 157 157 181 231 138 -27 334
4274 334 78 403 100 -71 60 -161 -224 -234 -23 -152 -325 -176 -149 -219 0 -86 90 80 163 -5 316 208
4296 208 182 258 82 -80 -120 -134 -129 -321 -88 -54 -287 -90 0 4 -149 142 -237 272 -29 182 343 -26 28 -56
4320 -56 61 -8 219 -125 -36 -101 -147 -396 -192 -390 -60 28 -38 2 -22 241 148 178 69 109 335 3 239 -46
4344 -46 -97 -7 -163 -176 -17 -8 -282 -88 -306 -193 -202 36 -21 232 333 91 -29 155 212 160 -143 13 29 -16
$$ packed form
4175A5M8K3R8j86j8M4J49J52l32J38o4N7Kq8k34L7O5j1j60Q3R3o8J76k7k08L32
4201A16j54K59j22Q9j48L1K36l89J08j0J47k77n0J21m4j63J63o8M5PK67q8R6k51
4225g9J36O8J1M9m9L3J22l17o5o5O4k07J68j11J95n7q7K81o0nP7j9J89J56k50
4250A78m9P2P2j07q2r0J0k29K85j20k67J93k79K92J69k04M1K72%K4N0r3j65L61
4274C34k56L25l03j71J31k21o3j0K11j29j73J49K7p0K19q6J76j0Q3j68L21j08
4296B08k6P6j76j62m0j4Nj92K33L4k33J97R0Mj53K91l79N09l01K11J61l69N4q4
4320e6J17o9K27l44Q9o5m6k49K04j98L30Q8o6M0k4K63r3L0j09M0K26l32K36k85
4344d6n1R0j56j3J59Rk74J94k18J13rK38n7K53J01k42j20J84N7n2l03J56J6m5
$$ plain form
4368 -16 -79 -15 4 -161 17 -43 66 -201 -163 -192 -129 43 113 200 194 16 132 215 64 -22 62 -148 144 -173 -99
4393 -99 -290 -98 -75 -92 -138 -136 -281 -100 23 -66 100 176 267 98 85 135 221 -84 -63 43 -107 -185 -109 -251 -287
4418 -287 -76 -160 -151 2 42 -114 286 82 191 90 145 113 -212 159 42 -194 -93 16 -195 -275 -47 -147
4440 -147 -258 -152 -101 -90 -118 73 101 -127 -98 209 191 248 236 185 129 14 86 57 57 -152 38 -145 -86 -41 -119 -115
4466 -115 14 12 63 109 212 243 181 197 349 262 141 26 254 247 63 45 -190 -291 -66 35 -110 -76 41 -9
4490 -9 -292 -90 -1 130 245 31 74 109 93 177 53 174 -260 -76 -418 -147 -1 -90 -222 -190 -20 109 9
4513 9 -19 152 -41 211 -20 156 151 129 -8 53 15 -42 -90 -186 -30 -53 -212 -289 11 -255 -162 146 6 36 191
4538 191 273 206 166 164 301 -72 186 -184 -134 -98 -232 -197 91 -205 -301 -280 -285 -165 -31 248 146 55 51 175 267
$$ packed form
4368a6o3O4J9j65J78o0J09k67L8k9O3J72P0Q7oj78J16Q3j51q6Q4k10K92l17P4
4393i9j91J92K3j7m6Kj45J81J23q9J66P6R1j69j3N0Q6l05K1J06j50p8P6j42l6
4418b87K11q4RJ53M0j56M00k04J09j01N5l2l25L71j17k36J01J09k11q0K28j00
4440a47j11J06N1J1k8J91K8k28K9L07j8N7j2n1n6j15P2k9%k09J90j83N9M5p8M
4466a15J29kN1M6J03L1o2J6J52q7j21j15K28pj84j8k35j01K25J01j45L4J17n0
4490ik83K02Q9J31J15k14M3L5j6Q4j24J21m34J84l42K71J46q9j32L2J70J29j00
4513Ik8J71j93K52k31J76nk2j37O1l8n7m8r6J56k3j59p7L00k66R3L08j40L0J55
4538A91Q2o7m0kJ37l73K58l70N0L6j34L5K88k96r6K1nJ20J34K79j02r1mJ24R2
$$ plain form
4563 267 50 94 319 158 -120 -3 174 -194 -147 -172 -69 -142 24 -103 34 -88 -183 140 -43 80 -174 17
4585 17 29 329 222 39 142 -47 29 80 -78 -102 29 -140 -158 -49 12 -20 -70 -129 68 51 31 24 13 250 56
4610 56 -18 -63 140 191 79 -171 -99 -67 63 -11 -106 -242 -221 1 94 -84 298 146 77 223 122 214 120 91 126
4635 126 86 165 -4 -119 -247 -145 -95 -92 -170 128 -9 -306 -34 45 9 56 319 172 157 71 284 68 118 -130
4659 -130 -259 -15 -61 64 -232 -128 -313 11 -271 -27 -64 63 135 159 196 240 127 97 237 179 203 -41 -55
4682 -55 173 -168 -109 -337 -300 -35 -69 5 5 -45 81 27 73 249 192 132 356 217 141 90 130 233 -125 -14 94
4707 94 27 102 -163 -141 -7 -283 -121 175 46 -248 197 173 180 195 65 192 50 -115 -119 5 156 -80 -142 -264
4731 -264 17 92 -43 -177 -31 -10 69 34 44 333 263 131 100 -139 -112 128 -78 -13 93 -178 -158 -344 -227
$$ packed form
4563B67k17M4K25j61k78J17J77l68M7k5J03p3J66j27J37j22r5L23j83J23k54J91
4585A7J2L00j07j83J03j89P6N1j58k4J31j69j8J09O1l2n0n9J97j7k0pj1K37j94
4610E6p4m5K03N1j12k50P2L2J30p4r5j36K1K22R3j78L82j52o9J46j01R2r4k9L5
4635A26m0P9j69j15j28J02N0Lp8K98j37k97K72P9l6M7K63j47j5q6K13k16N0k48
4659a30j29K44m6J25k96J04j85L24k82K44l7J27P2K4L7M4j13l0J40n8K4k44j4
4682e5K28l41N9k28L7K65l4P4%n0J26n4M6J76n7o0K24j39p6n1M0J03l58J11J08
4707I4o7P5k65K2J34k76J62K96j29k94M45k4PJ5j30J27j42j65mJ24J51k36o2j22
4731b64K81P5j35j34J46K1P9l5J0K89p0j32l1k39K7K40k06O5J06k71K0j86J17
$$ plain form
4754 -227 -309 -184 43 -46 -163 -29 123 -24 26 190 73 40 29 -52 213 -59 29 56 9 -77 -159 -96 -123 -194 -181
4779 -181 -132 22 41 -56 247 95 125 110 6 28 113 93 -94 147 -96 78 -78 -187 44 -263 -109 18 -132
4802 -132 -76 -184 38 -78 -44 116 218 185 305 252 69 108 76 -217 -97 -52 -189 -164 -187 -252 -148 -31 -185
4825 -185 -91 35 42 207 -36 -143 95 44 77 103 111 -7 -188 -165 99 8 146 50 -252 -51 -7 -71 -63 -6 -131
4850 -131 338 107 -58 124 113 128 -126 159 40 -9 57 25 -215 -56 -152 -174 132 -240 -104 -65 51 74 -140
4873 -140 189 43 166 318 75 -52 203 8 45 -2 -42 71 -175 -122 -81 -245 -123 10 -37 -1 9 65 45
4896 45 -59 -146 63 -80 7 224 187 45 -30 -3 211 25 -156 -247 -20 -180 -170 -78 -168 -127 -69 45 179 101
4920 101 172 38 227 73 237 105 29 279 -229 -50 -73 10 -128 -237 -201 -170 -214 47 -24 -148 19 433 -74
$$ packed form
4754b27q2J25K27q9j17J34J52j47N0J64j17l3j1q1K65k72Q8K7m7q6q2O3k7p1J3
4779a81M9J54J9r7L03j52L0j5j04K2Q5k0j87K41k43J74j56j09K31l07J54J27j50
4802a32N6j08K22j16L4J60J02l3J20n3j83L9l2k93J20M5j37K5k3o5J04J17j54
4825a85R4J26PJ65k43j07K38n1L3K6Qj18j81K3K64r1J38r6l02K01M4o4QN7j25
4850a31M69k31j65J82j1J5k54K85j19m9O6l2k40J59r6k2L06l72J36L9J16K3k14
4873a40L29j46J23J52k43j27K55j95L7m7m0J13k46N3M1j64J22J33m7L6J0N6k0
4896D5j04q7K09j43Q7K17l7j42p5K7K14j86j81r1K27j60J0R2r0M1N8J14J34p8
4920A01P1j34J89j54J64j32p6K50n08J79k3Q3j38j09L6L1m4K61p1j24J67M14n07
$$ plain form
4943 -74 -202 124 68 -4 97 -80 83 -96 -179 142 -233 -167 -62 -165 16 -139 -48 2 190 91 -18 -20 152
4966 152 361 196 91 124 381 298 68 15 -68 -155 -204 -25 -188 -236 -24 79 -7 -96 58 -51 102 119 90 153
4990 153 -13 254 107 28 51 66 -10 -88 -84 -111 -235 -172 -79 17 74 88 89 125 -30 1 175 346 182 206 177 -30
5016 -30 -29 43 4 28 73 -127 -131 -170 -170 -88 -204 -23 113 -93 5 -63 15 234 -111 10 115 19 -77 -7 135 -155
5042 -155 -10 -105 -192 -6 -112 69 -5 -57 88 -72 79 261 41 171 187 117 129 40 136 -4 -167 1 -59
5065 -59 46 65 -62 -164 23 -52 -152 -114 122 135 191 44 146 151 272 -29 31 101 -34 60 97 -81 -140 16
5089 16 -96 -349 -161 -97 -193 -300 -93 -56 -119 111 176 88 180 288 72 115 -86 -56 -146 -23 16 -129 -214 -120 -222
5114 -222 -179 -96 93 -172 101 76 -1 -95 70 215 308 -18 -4 -23 -109 169 -197 80 9 -48 -176 -126 -90 -141 -158
$$ packed form
4943g4j28L26n6p2J01j77J63j79q3L21l75O6J05j03J81j55R1N0J88r9j09kJ72
4966A52K09j65j05L3K57q3k30n3q3q7m9J79j63m8K12J03q6q9J54j09J53J7k9O3
4990A53j66K67j47p9K3J5p6p8Mk7j24O3R3R6N7J4JL6j55L1J74J71j64K4k9k07
5016c0JP2l9K4M5k00ml9%Q2j16J81J36k06R8o8P8K19l45J21J05r6r6P0J42k90
5042a55J45r5q7J86j06J81p4n2J45j60J51J82k20J30J6p0J2q9R6j40j63J68o0
5065e9J05J9j27j02J87p5j00L8K36J3N6j47J02NJ21l01O0P0j35R4L7j78n9J56
5089A6j12k53J88O4r6j07K07L7o3K30O5q8R2J08k16M3k01L0r0J23L9j45q5R4j02
5114b22M3Q3J89k65K73k5p7r4J65J45R3l26J4j9q6K78l66K77p1n7j28N0L6n1j7
$$ plain form
5139 -158 -12 -116 -200 176 105 74 24 130 262 162 -172 14 -9 174 -37 -112 -70 -162 -77 -157 -8 -236 34
5162 34 131 -218 -111 135 69 78 79 194 62 76 2 62 48 -81 -275 -186 77 -228 -212 106 -43 -44 24 76 33 -3
5188 -3 -66 -84 99 197 150 319 117 93 19 -214 -271 -80 -211 22 56 -101 78 -40 -198 -41 106 128 148 2
5212 2 26 59 16 -61 -63 92 195 7 85 139 -213 -326 17 -285 -172 23 -99 159 159 161 -39 52 62 312 53
5237 53 -25 39 -58 -112 -103 37 -242 -105 -321 -237 21 -29 -15 60 -115 -84 17 93 -156 61 230 -239 211 115 -106
5262 -106 49 176 146 -83 -132 -23 -149 -60 55 104 -118 -161 -8 5 31 112 58 77 85 -20 150 44 115 82 117
5287 117 196 100 -249 -158 16 15 -125 29 -63 -149 1 -152 69 -31 -1 154 189 6 42 -35 200 243 -133 4
5311 4 -277 7 -256 -212 130 -226 -85 -41 -41 160 26 153 197 87 59 51 139 16 93 28 -59 -173 -51 -210 -176
$$ packed form
5139a58J46j04q4L76p1l1n0J06J32j00l34J86k3J83k11p5M2r2Q5q0J49k28K70
5162C4R7l49J07K46o6RJJ15j32J4p4O0j4j29j94Q9K63l05J6L18j49jO8N2m3l6
5188co3j8J83R8m7J69k02k4p4k33n7J91j31K33L4j57J79j18j58J57J47K2K0j46
5212BK4L3m3p7kJ55J03j88P8N4l52j13L43l02J13J95j22K58%Kk00R1J0K50k59
5237E3p8O4r7n4RJ40k79J37k16Q4K58n0J4P5j75L1J01P6k49K17J69m69M50r6k21
5262a06J55J27l0k29m9J09j26Q9J15M9k22m3J53J3K6Q1n4J9Qj05J70j06P1l3L5
5287A17P9r6l49R1J74jj40J54r2q6J50j53K21j00L0J55L5j83L6p7K35M3l76J37
5311Dk81K84k63M4L42l56J41M4%K01j34J27M4j10k8qQ8j23P7o5q7j14J22j59L4
$$ plain form
5336 -176 -149 84 -252 -209 77 -19 106 17 74 -15 271 201 83 102 70 170 25 -6 54 -61 -53 101 -62 -114 -51
5361 -51 -32 -149 -8 44 129 108 293 266 -70 104 60 41 78 -34 51 14 59 -244 -188 -43 -106 -60 -90 3 93 -37
5387 -37 186 240 288 317 169 76 207 17 -104 181 110 73 251 113 -31 73 -80 -106 -74 -81 35 253 -69 70
5411 70 52 -24 87 -99 -23 -10 -41 -105 83 195 -147 -107 -46 -232 -77 -198 50 63 -251 -176 27 50 48 156 -99
5436 -99 212 71 160 43 -38 156 -88 -48 -109 -379 -137 -97 11 105 51 3 -149 -77 70 -148 -24 67 -96 17
5460 17 -21 16 -70 -7 -112 76 102 -101 -17 -166 -289 -277 -71 -287 42 -307 129 -93 53 41 89 66 312 -10
5484 -10 13 8 191 -141 95 55 -187 16 -82 -177 -43 -36 75 -67 -8 0 204 177 285 92 104 37 288 47 -82
5509 -82 31 -130 -60 -17 -100 -115 13 64 46 -106 -177 -109 27 139 88 237 124 -6 107 261 229 -49 44 -93
$$ packed form
5336a76K7K33l36M3K86r6J25q9N7q9K86p0j18J9l2J00j45l1O0j15QJ54j63n2O3
5361e1J9j17J41N2Q5k1J85k7l36J74m4j9L7j12Q5l7M5l03N6J45o3M6l0R3R0j30
5387c7K23N4M8K9j48r3J31j90j21K85p1l7J78j38j44J04j53k6L2pJ16K18l22J39
5411G0j8p6J11j86P6J3l1o4J88J12l42M0O1j86J55j21K48J3l14P5K03K3kJ08k55
5436i9L11j41Q9j17q1J94k44M0o1k70K42M0J08R4n4m8j52P2J47k18J24R1j63J13
5460A7l8L7q6O3j05J88K6k03Q4j49j23J2K06k16L29l49M36k22J46j2M8k3K46l22
5484a0K3nJ83l32K36m0k42K03r8r5J34PJ11j42N9QK04k7J08j93J2o7K51k41j29
5509h2J13j61P0M3q3j5J28N1j8j52p1O8J36J12n1J49j13j30J13J54l2k78R3j37
$$ plain form
5533 -93 93 -42 -219 -32 -116 43 97 -25 88 59 51 -24 245 -86 206 -48 213 293 171 16 -51 19 96 -55
5557 -55 -128 -309 -114 -196 1 -238 -149 -2 253 -38 90 6 -78 5 283 177 -89 126 13 -55 -34 -85 83
5580 83 -181 -202 89 -275 -45 -111 -64 -98 133 117 46 19 -161 170 197 252 3 245 247 -59 27 -26 -21 -39 -209 -147
5606 -147 -146 -33 -154 61 11 12 87 -38 91 74 -97 47 -43 50 176 -95 13 -222 -170 14 40 -150 -275 49
5630 49 -76 51 -49 95 72 -17 248 -40 154 347 44 208 -220 -240 227 36 -25 -29 -199 -31 22 -121 -84
5653 -84 49 -184 61 29 -121 -121 138 94 68 -94 -21 11 258 4 70 3 -224 -32 -256 71 -146 -162 -12 74
5677 74 -39 -93 27 -156 143 32 189 59 222 -96 12 97 -166 -148 -77 -61 -182 -59 16 -16 39 -128 53
$$ packed form
5533i3J86j35j77J87q4J59N4j22J13k9qp5K69l31K92k54K61Q0j22j55o7P0P7j51
5557e5p3j81J95q2J97k39Q9J47K55k91J28q4q4Q3K78j06k66K15j13o8K1n1J68
5580H3k64k1K91l64K30o6M7l4K31j6p1k7j80L31K7N5k49K42Kl06Q6n3Nj8j70O2
5606a47JJ13j21K15n0JP5j25J29j7j71J44r0R3J26k71J08k35N2J84K6j90j25L24
5630D9j25J27j00J44k3q9K65k88J94J93l03J64m28k0M67j91o1mj70J68N3j43L7
5653h4J33k33K45l2j50%K59m4k6j62P3L2K47k54O6o7k27J92k24L27k17j6J50Q6
5677G4j13n4J20j83K99j11J57j30J63l18J08Q5k63J8P1J6j21J23P5l2N5j67J81
$$ [...]
8191A09
##END NTUPLES=NMR FID
##END=
