##TITLE=1H_LR-784-R2-C1MK
 200.13MHz, CDCl3,
 8 sc
 
 21.1.2025
##JCAMPDX= 6.0         $$ Bruker NMR JCAMP-DX V2.0
##DATA TYPE= NMR FID
##DATA CLASS= NTUPLES
##ORIGIN= UXNMR, Bruker Analytische Messtechnik GmbH
##OWNER= pz
$$ XWIN-NMR		Version 3.5
$$ Tue Jan 21 14:15:06 2025 Russian Standard Time (UT+4h)  she@DPX200
##.OBSERVE FREQUENCY= 200.1313
##.OBSERVE NUCLEUS= ^1H
##.DELAY= (6, 6)
##.ACQUISITION MODE= SIMULTANEOUS
##.ACQUISITION SCHEME= undefined
##.AVERAGES= 8
##.DIGITISER RES= 18
##SPECTROMETER/DATA SYSTEM= spect
##.PULSE SEQUENCE= zg30
##.SOLVENT NAME= D2O
##.SHIFT REFERENCE= (INTERNAL, D2O, 0, 14.3821)
##AUDIT TRAIL= $$ (NUMBER, WHEN, WHO, WHERE, WHAT)
$$ ##TITLE= Audit trail, XWIN-NMR		Version 3.5
$$ ##JCAMPDX= 5.01
$$ ##ORIGIN= Bruker BioSpin GmbH
$$ ##OWNER= she
$$ F:/spectra/data/she/nmr/H-C/1/audita.txt
$$ ##AUDIT TRAIL=  $$ (NUMBER, WHEN, WHO, WHERE, WHAT)
(   1,<2025-01-21 14:14:10.62 +0400>,<she>,<DPX200>,
      <created by zg, POWCHK disabled, PULCHK disabled
       configuration hash MD5:
       00 E9 B6 7A A2 85 ED C7 34 08 36 98 17 FE 4E 26
       data hash MD5: 16K
       10 81 6B 02 2B 76 33 FE D4 90 E5 25 4B 4C 3A B9>)
$$ ##END=
$$ 
$$ hash MD5
$$ F1 A5 91 00 0C 20 F7 AA A7 80 19 9F FC F3 13 04
##$RELAX= 
##$RELAX= 
##$RELAX= 
##$RELAX= 
##$RELAX= 
##$RELAX= 
$$ Bruker specific parameters
$$ --------------------------
##$DU= <F:/spectra>
##$EXPNO= 1
##$NAME= <H-C>
##$PROCNO= 1
##$TYPE= <nmr>
##$USER= <she>
##$AMP= (0..31)
100 100 100 100 100 100 100 100 100 100 100 100 100 100 100 100 100 100 
100 100 100 100 100 100 100 100 100 100 100 100 100 100 
##$AQSEQ= 0
##$AQ_mod= 1
##$AUNM= <au_zg>
##$AUTOPOS= <>
##$BF1= 200.13
##$BF2= 200.13
##$BF3= 200.13
##$BF4= 200.13
##$BF5= 200.13
##$BF6= 200.13
##$BF7= 200.13
##$BF8= 200.13
##$BYTORDA= 1
##$CFDGTYP= 0
##$CFRGTYP= 5
##$CHEMSTR= <none>
##$CNST= (0..31)
1 1 145 1 1 1 1 1 1 1 1 1 1 1 1 1 1 1 1 1 1 1 1 1 1 1 1 1 1 1 1 1 
##$CPDPRG= <>
##$CPDPRG1= <>
##$CPDPRG2= <>
##$CPDPRG3= <>
##$CPDPRG4= <mlev>
##$CPDPRG5= <mlev>
##$CPDPRG6= <mlev>
##$CPDPRG7= <mlev>
##$CPDPRG8= <mlev>
##$CPDPRGB= <>
##$CPDPRGT= <>
##$D= (0..31)
0 0.7 0 0 0 0 0 0 0 0 0 0.03 0 0 0 0 0 0 0 0 0 0 0 0 0 0 0 0 0 0 0 0 
##$DATE= 1737454450
##$DBL= (0..7)
120 120 120 120 120 120 120 120 
##$DBP= (0..7)
150 150 150 150 150 150 150 150 
##$DBP07= 0
##$DBPNAM0= <>
##$DBPNAM1= <>
##$DBPNAM2= <>
##$DBPNAM3= <>
##$DBPNAM4= <>
##$DBPNAM5= <>
##$DBPNAM6= <>
##$DBPNAM7= <>
##$DBPOAL= (0..7)
0.5 0.5 0.5 0.5 0.5 0.5 0.5 0.5 
##$DBPOFFS= (0..7)
0 0 0 0 0 0 0 0 
##$DE= 6
##$DECBNUC= <off>
##$DECIM= 32
##$DECNUC= <off>
##$DECSTAT= 4
##$DIGMOD= 1
##$DIGTYP= 9
##$DL= (0..7)
0 120 120 120 120 120 120 120 
##$DP= (0..7)
150 150 150 150 150 150 150 150 
##$DP07= 0
##$DPNAME0= <>
##$DPNAME1= <>
##$DPNAME2= <>
##$DPNAME3= <>
##$DPNAME4= <>
##$DPNAME5= <>
##$DPNAME6= <>
##$DPNAME7= <>
##$DPOAL= (0..7)
0.5 0.5 0.5 0.5 0.5 0.5 0.5 0.5 
##$DPOFFS= (0..7)
0 0 0 0 0 0 0 0 
##$DQDMODE= 0
##$DR= 18
##$DS= 0
##$DSLIST= <SSSSSSSSSSSSSSS>
$$ [...]
##$SUBNAM0= <"">
##$SUBNAM1= <"">
##$SUBNAM2= <"">
##$SUBNAM3= <"">
##$SUBNAM4= <"">
##$SUBNAM5= <"">
##$SUBNAM6= <"">
##$SUBNAM7= <"">
##$SUBNAM8= <"">
##$SUBNAM9= <"">
##$SW= 18.0517328524113
##$SWIBOX= (0..15)
0 0 2 0 0 0 0 0 0 0 0 0 0 0 0 0 
##$SW_h= 3612.71676300578
##$TD= 16384
##$TD0= 1
##$TE= 0
##$TE2= 300
##$TE3= 300
##$TEG= 300
##$TL= (0..7)
0 120 120 120 120 120 120 120 
##$TP= (0..7)
150 150 150 150 150 150 150 150 
##$TP07= 0
##$TPNAME0= <>
##$TPNAME1= <>
##$TPNAME2= <>
##$TPNAME3= <>
##$TPNAME4= <>
##$TPNAME5= <>
##$TPNAME6= <>
##$TPNAME7= <>
##$TPOAL= (0..7)
0.5 0.5 0.5 0.5 0.5 0.5 0.5 0.5 
##$TPOFFS= (0..7)
0 0 0 0 0 0 0 0 
##$TUNHIN= 0
##$TUNHOUT= 0
##$TUNXOUT= 0
##$USERA1= <user>
##$USERA2= <user>
##$USERA3= <user>
##$USERA4= <user>
##$USERA5= <user>
##$V9= 5
##$VALIST= <valist>
##$VCLIST= <CCCCCCCCCCCCCCC>
##$VD= 0
##$VDLIST= <DDDDDDDDDDDDDDD>
##$VPLIST= <PPPPPPPPPPPPPPP>
##$VTLIST= <TTTTTTTTTTTTTTT>
##$WBST= 1024
##$WBSW= 4
##$XGAIN= (0..3)
0 0 0 0 
##$XL= 0
##$YL= 0
##$YMAX_a= 449628
##$YMIN_a= -458414
##$ZGOPTNS= <>
##$ZL1= 120
##$ZL2= 120
##$ZL3= 120
##$ZL4= 120
##$ABSF1= 10
##$ABSF2= 0
##$ABSG= 5
##$ABSL= 3
##$ALPHA= 0
##$AQORDER= 0
##$ASSFAC= 0
##$ASSFACI= 0
##$ASSFACX= 0
##$ASSWID= 0
##$AUNMP= <proc_1d>
##$AZFE= 0.1
##$AZFW= 0.1
##$BCFW= 1
##$BC_mod= 2
##$BYTORDP= 1
##$COROFFS= 0
##$CY= -3
##$DATMOD= 1
##$DC= 2
##$DFILT= <>
##$DTYPP= 0
##$F1P= 0
##$F2P= 0
##$FCOR= 0.5
##$FTSIZE= 0
##$FT_mod= 4
##$GAMMA= 1
##$GB= 0.15
##$INTBC= 1
##$INTSCL= 1
##$ISEN= 128
##$LB= 0.25
##$LEV0= 0
##$LPBIN= 0
##$MAXI= 10000
##$MC2= 0
##$MEAN= 0
##$ME_mod= 0
##$MI= 1.114404
##$NCOEF= 0
##$NC_proc= 0
##$NLEV= 6
##$NOISF1= 3.799351
##$NOISF2= 2.8
##$NSP= 1
##$NTH_PI= 0
##$NZP= 0
##$OFFSET= 14.38212
##$PC= 1
##$PHC0= 252.117
##$PHC1= 12.9922
##$PH_mod= 1
##$PKNL= yes
##$PPARMOD= 0
##$PSCAL= 0
##$PSIGN= 0
##$REVERSE= no
##$SF= 200.129724274929
##$SI= 16384
##$SIGF1= 3
##$SIGF2= 2
##$SINO= 400
##$SIOLD= 16384
##$SREGLST= <1H.CDCl3>
##$SSB= 0
##$STSI= 0
##$STSR= 0
##$SW_p= 3205.1282051282
##$SYMM= 0
##$S_DEV= 0
##$TDeff= 0
##$TDoff= 0
##$TI= <>
##$TILT= no
##$TM1= 0
##$TM2= 0
##$TOPLEV= 0
##$USERP1= <user>
##$USERP2= <user>
##$USERP3= <user>
##$USERP4= <user>
##$USERP5= <user>
##$WDW= 1
##$XDIM= 8192
##$YMAX_p= 0
##$YMIN_p= 0
$$ End of Bruker specific parameters
$$ ---------------------------------
##NTUPLES= NMR FID
##VAR_NAME=  TIME,          FID/REAL,        FID/IMAG
##SYMBOL=    X,             R,               I
##VAR_TYPE=  INDEPENDENT,   DEPENDENT,       DEPENDENT
##VAR_FORM=  AFFN,          ASDF,            ASDF
##VAR_DIM=   8192,          8192,            8192
##UNITS=     SECONDS,       ARBITRARY UNITS, ARBITRARY UNITS
##FACTOR=    0.0002768,     1,               1
##FIRST=     0,             0,               0
##LAST=      2.2672688,     0,               0
##MIN=       0,             -458414,         0
##MAX=       2.2672688,     449628,          0
$$ Real data points
##PAGE= N=1
##DATA TABLE= (X++(R..R)), XYDATA
$$ plain form
0 0 0 0 0 0 0 0 0 0 0 0 0 0 0 0 0 0 5 -8 8 -8 8 -8 13 -16 16 -20 21 -24 29 -32 37 -44 45 -53 57 -65 73 -81 89
39 89 -102 110 -123 136 -151 165 -182 199 -221 242 -268 295 -326 358 -398 441 -493 550 -620 702
59 702 -803 929 -1094 1312 -1619 2074 -2810 4143 -7052 15938 -96471 -458414 -41698 425788
73 425788 116578 -323952 -109128 289609 170656 -170435 -138712 116830 134227 -66348
83 -66348 -142968 -15818 92390 12780 -135153 -100922 101965 136159 -95398 -182052 94998
94 94998 265660 -18472 -266950 -2029 311631 88711 -279891 -140118 225898 156494
104 156494 -183729 -182099 99999 146322 -62466 -137383 -5627 83412 30587 -49489 -45716
115 -45716 42130 87628 -6701 -90135 18995 140690 13782 -159297 -37456 175483 60238
$$ packed form
0@%%%%%%%%%%%%%%%%Nj3J6j6J6j6K1k9L2l6M1m5N3o1O9q1Q9r8J10j22J38j54J70
39H9j91K12k33K59k87L16l47L81m20M63n10N63o21O84p56Q39r34J043j170J322
59G02j505J732k023K406k931L693m884O953j1195K2990j12409l61943M16716M67486
73D25788l09210m40530K14824L98737j18953l41091L1723K55542J7397k00575
83f6348p6620J27150J08208p9610j47933L4231K02887L4194k31557q6654K77050
94I4998J70662k84132k48478K64921L13660k22920l68602J39773L66016o9404
104A56494l40223J630K82098M6323k08788p4917J31756Q9039n2825q0076L773
115d5716Q7846M5498r4329q3434J09130J21695j26908j73079J21841K12939j15245
$$ plain form
126 60238 -203800 -127788 167896 151294 -147274 -190199 90337 198768 -27671 -174538 -12056
137 -12056 155575 65317 -99966 -79192 60514 89159 -22829 -89652 -7051 84443 20456
148 20456 -95154 -46501 94470 59456 -106811 -86270 110095 115931 -103346 -144889 87578
159 87578 178197 -41901 -180828 1178 174964 43290 -153151 -86008 108245 102848 -66822
170 -66822 -108532 25745 99076 6367 -79617 -22564 66270 37255 -52312 -45586 44181 53733
182 53733 -44413 -75223 33179 92262 -21581 -113284 -1074 130161 38499 -124202 -66410
193 -66410 112862 98036 -82629 -113814 45438 115646 -8132 -104761 -26952 75225 38615
204 38615 -56798 -53579 28525 50363 -12977 -45425 7316 51625 7207 -47588 -6017 66295
$$ packed form
126F0238k64038P6012K95684j6602k98568m2925K80536J08431k26439j46867J62482
137a2056J67631r0258j65283K0774J39706K8645j11988o6823Q2601R1494o3987
148B0456j15610M8653J40971l5014j66267K0541J96365N836k19277m1543K32467
159H7578R0619k20098j38927J82006J73786j31674j96441O7143J94253n397j69670
170f6822m1710J34277P3331r2709q5984N7053Q8834k9015q9567O726Q9767R552
182E3733r8146l0810J08402N9083j13843r1703J12210J31235r1662j62701N7792
193f6410J79272j4826j80665l1185J59252P0208j23778r6629P7809J02177l6610
204C8615r5413L219Q2104K1838o3340l2448N2741M4309m4418n4795M1571P2312
$$ plain form
216 66295 28091 -69749 -46194 73077 68479 -73924 -103408 43633 108331 -27421 -122089
227 -122089 -10871 107760 39378 -80171 -51305 57869 68639 -15465 -53037 565 51859
238 51859 22522 -37704 -32345 26041 29672 -34614 -47129 24121 44179 -37767 -68305 28991
250 28991 82903 -16559 -91256 5983 109134 31409 -89333 -42380 81658 67438 -49610
261 -49610 -72979 14986 60204 3496 -56968 -38002 23454 37229 -14604 -47628 -525 48858
273 48858 11545 -41387 -2602 57576 15710 -53720 -9152 71216 25324 -74207 -42238 66424
285 66424 52273 -63726 -78237 28909 72746 -10388 -74209 -21142 57040 45252 -27789 -49584
297 -49584 11415 61585 21268 -46517 -27735 44876 38783 -38339 -44389 30090 37500 -40661 -50214
$$ packed form
216F6295l8204r7840K3555J19271m598j42403k9484J47041O4698j35752r4668
227a22089J11218J18631o8382j19549K8866J09174J0770q4104l7572N3602N1294
238E1859k9337o0226N359N8386L631o4286j2515P1250K0058q1946l0538R7296
250B8991N3912r9462p4697R7239J03151p7725j20742M6953J24038j4220j17048
261d9610k3369Q7965M5218n6708o0464J8966O1456J3775n1833l3024M7103M9383
273D8858l7313n2932L8785O0178m1866o9430M4568Q0368m5892r9531L1969J08662
285F6424j4151j15999j4511J07146M3837q3134o3821N3067P8182j1788p3041k1795
297d9584O0999N0170m0317o7785J8782P2611o093p7122o050P4479P410p8161r553
$$ plain form
310 -50214 34374 49366 -40106 -64444 30550 73993 -13512 -74693 -1529 78786 33489 -56587
322 -56587 -46500 39802 63046 -11502 -66311 -17594 55512 32823 -48449 -51887 27810 50448
334 50448 -21407 -53953 12729 51957 -9227 -49538 13036 58755 -4887 -59405 2248 68527
346 68527 13972 -66006 -29442 56797 43957 -42113 -58897 14252 56848 6770 -54218 -32457
358 -32457 37433 46497 -19456 -52678 3986 53951 12219 -45115 -15049 42696 20336 -36420
370 -36420 -18300 37611 19702 -40295 -25650 39795 31657 -40094 -46237 26610 51311 -13603
382 -13603 -57570 -8666 51111 29169 -35879 -42207 19924 53969 5601 -49178 -19850 45794
394 45794 35255 -33987 -40061 23888 37504 -21993 -39518 15091 32890 -20363 -38872 16904
$$ packed form
310e0214Q4588J4992q9472k4338R4994M3443q7505o1181P3164Q0315m5297r0076
322e6587J0087Q6302K3244p4548n4809M8717P3106k2689q1272l438P9697K2638
334E0448p1855l2546O6682L9228o1184m0311O2574M5719o3642n4518O1653O6279
346F8527n4555p9978L6564Q6239j2840q6070j6784P3149M2596n0078o0988K1761
358c2457O9890R064o5953l3222N6664M9965m1732n7334L0066N7745k2360n6756
370c6420J8120N5911j7909n9997J4645O5445q138p1751o143P2847K4701o4914
382a3603m3967M8904N9777k1942o5048o328O2131L4045m8368n4779K9328O5644
394D5794j0539o9242o074O3949J3616n9497j7525N4609J7799n3253j8509N5776
$$ plain form
406 16904 41649 -13568 -46832 6372 53472 11980 -46257 -22179 42024 40813 -21883 -45532
418 -45532 3308 45708 14223 -42563 -34353 24740 36683 -18461 -44401 3084 38127 1020
430 1020 -33309 471 34946 3868 -28098 4009 37331 4108 -35849 -8311 37459 17606
442 17606 -35170 -33099 19008 35307 -9200 -43495 -14217 34026 25945 -24619 -36069 12681
454 12681 43258 6689 -33791 -9436 34715 20941 -22439 -17652 19236 14533 -21696 -17887 16725
467 16725 11019 -25879 -21940 19129 24263 -16069 -30489 7606 36317 10846 -27210 -17911 25455
480 25455 34848 -6863 -35955 -4980 34680 15981 -30753 -28044 15803 23430 -14238 -27725 3567
493 3567 19083 -4733 -17194 6880 20037 -3574 -16589 9416 27739 1221 -26083 -6012
$$ packed form
406A6904K4745n5217l3264N3204M7100m1492n8237K4078O4203j211o2696k3649
418d5532M8840M2400l1485n6786Q210N9093J1943n5144k5940M7485L5043l7107
430A020l4329L3780L4475l1078l1966L2107L3322l3223l9957K7538M5770j9853
442A7606n2776K071N2107J6299m4507l4295K9278M8243q081n0564j1450M8750
454A2681L0577l6569m0480K4355M4151j3774m3380M787L6888m703l6229L809L4612
467A6725n706l6898L939M1069N134m0332j4420L8095K8711k5471l8056R299M3366
480B5455R393m1711k9092L0975L9660j8699m6734K709M3847P627l7668j3487L1292
493C567J5516k3816j2461K4074J3157k3611j3015K6005J8323k6518k7304K0071
$$ plain form
505 -6012 27270 15761 -23731 -28515 8252 28206 -1008 -34050 -17013 24361 23659 -16902 -28267
518 -28267 8138 30260 3466 -21370 -2757 20974 8675 -11768 -3597 12889 2735 -14763
530 -14763 -5134 14369 4516 -21145 -16345 13701 18379 -11757 -26394 1439 28715 11825 -21683
543 -21683 -17743 17893 28638 -2986 -26059 -4198 24687 12316 -18718 -16367 10010 12638 -9111
556 -9111 -13502 3419 6602 -7930 -8751 7560 9885 -7628 -12893 7651 21065 1818 -19374
569 -19374 -5903 22542 17956 -14403 -23156 5266 24227 2501 -25209 -14824 15231 16057 -11737
582 -11737 -20753 1911 17014 1844 -12276 -1628 10821 3287 -6351 2993 11671 133 -11419
595 -11419 -232 15109 5002 -16425 -13673 11176 16859 -8531 -24798 -3974 21230 9748
$$ packed form
505f012L3282j1509l9492m784L6767J9954k9214l3042J7037M1374p02m0561j1365
518b8267L6405K2122k6794k4836J8613K3731j2299k0443Q171J6486j0154j7498
530a4763R629J9503r853k5661M800L0046M678l0136j4637K7833K7276j6890l3508
543b1683L940L5636J0745l1624k3073K1861K8885j2371l1034K351K6377K628k1749
556i111m391J6921L183j4532q21J6311K325j7513n265K0544J3414j9247k1192
569a9374J3471K8445m586l2359q753K8422J8961k1726k7710J0385L0055Q26k7794
582a1737r016K2664J5103j5170j4120J0648J2449p534r638R344Q678j1538j1552
595a1419J1187J5341j0107k1427K752K4849N683k5390j6267K0824K5204j1482
$$ plain form
607 9748 -18577 -17003 12187 22281 -1078 -17412 -1627 17719 9478 -9578 -7375 7566 6576
620 6576 -6323 -5825 4634 1837 -10576 -7429 8242 7139 -10995 -14527 6454 18801 1439
633 1439 -17406 -5761 19435 17423 -9353 -17643 5091 20626 3591 -18089 -10268 10509 9613
646 9613 -9096 -14107 14 7152 -1936 -7281 1312 6123 -1638 -4605 6707 11969 -1040 -10559
660 -10559 2218 16484 5847 -14429 -12059 9586 14703 -7036 -21361 -4926 15808 7618 -14948
673 -14948 -14483 7742 15106 -749 -11298 663 12362 5683 -4489 -433 6759 1648 -5389 -812
687 -812 6290 -857 -12384 -6857 8498 6442 -11480 -14907 5043 16471 1220 -15371 -5401 15950
701 15950 14844 -6290 -13106 4199 16173 3398 -12086 -6641 7247 4973 -6601 -7590 705
$$ packed form
607I748k8325J574K9190J0094k3359j6334J5785J9346q241j9056K203J4941r90
620F576j2899M98J0459k797j2413L147J5671j103j8134l532K0981J2347j7362
633A439j8845J1645K5196k012k6776q290K2734J5535j7035k1680P821K0777q96
646I613j8709n011J4121P138r088n345Q593M811p761k967J1312N262j3009r519
660a0559J2777J4266j0637k0276K370K1645N117k1739j4325J6435K0734q190k2566
673a4948M65K2225P364j5855j0549J1961J1699o679j0172M056P192n111p037M577
687h12P102p147j1527N527J5355k056j7922l427J9950J1428j5251j6591R970K1351
701A5950j106k1134o816J7305J1974j2775j5484N445J3888k274j1574r89Q295
$$ plain form
714 705 1318 -5347 -4062 4234 2889 -6008 -4736 8159 11488 -2198 -10210 2569 16124 6602 -12250
729 -12250 -10113 8814 12537 -5381 -16472 -3716 10956 4354 -10871 -9867 4400 8153 -1925
742 -1925 -6067 1878 6284 932 -1653 4195 5521 -1881 -4776 3492 8284 -1201 -11332 -4429 8917
757 8917 5686 -10511 -13534 2976 12636 133 -13134 -4940 11593 10457 -4475 -8121 3919
770 3919 10596 2560 -5616 -2011 4595 1464 -3840 -1604 1929 -2019 -6696 -1638 5245 355 -8434
785 -8434 -5366 7117 8969 -3385 -9713 2012 13835 6412 -9049 -6976 8501 11201 -2828
798 -2828 -11054 -1680 7347 1763 -7736 -5973 1748 2106 -2634 -2464 1747 1813 -2205 -282 5562 4728
814 4728 -3195 -4024 5283 9403 -290 -9535 -2908 8934 5650 -8614 -11213 1821 9110 -988
$$ packed form
714G05O13o665J285Q296j345q897J272J2895L329j3686q012J2779J3555r522j8852
729a2250K137J8927L723j7918j1091J2756J4672o602j5225J004J4267L753j0078
742a925m142P945M406n352k585N848J326p402k895Q268M792r485j0131O903J3346
757H917l231j6197l023J6510R660j2503j3267Q194J6533j136j4932l646J2040
770C919O677q036q176L605O606l131n304K236L533l948m677N058O883m890q789
785h434L068J2483J852j2354o328J1725J1823p423j5461K073J5477K700j4029
798b828q226R374R027n584r499J763P721L58m740J70M211O6m018J923N844q34
814D728p923q29R307M120r693r245O627J1842l284j4264k599J3034P289j0098
$$ plain form
828 -988 -11399 -4643 7122 5545 -4267 -4770 3385 5963 1073 -935 2369 3059 -486 -1330 2178 2623
844 2623 -3318 -6668 -818 5321 141 -9462 -6388 5663 7776 -4056 -9799 1079 11508 5039
858 5039 -6803 -4280 7729 8928 -1348 -6153 509 4927 209 -4219 -2517 297 -1689 -3688
872 -3688 -1052 1542 -1192 -4244 -716 5602 4933 -3028 -4539 4868 10358 1248 -8315 -2530 8951
887 8951 6283 -6999 -9179 1737 6763 -1736 -8858 -3807 3844 2210 -3632 -2721 2420 2831 83
902 83 446 3754 3011 -954 -855 3878 4842 -2121 -6615 -814 6328 865 -9259 -7526 4368 6521
918 6521 -3995 -9421 255 9056 3553 -5457 -2923 5730 6454 -389 -2890 1604 3631 -91 -2284
933 -2284 -138 857 -2154 -4171 -649 2222 -1667 -6106 -2549 4722 4518 -3798 -5691 3911 10134 2147
$$ packed form
828i88j0411O756J1765j577r812n03Q155K578m890k008L304O90l545q44L508M45
844B623n941l350N850O139n180r603L074J2051K113j1832n743J0878J0429o469
858E039j1842K523J2009J199j0276m805O662M418m718m428J702K814j986j999
872c688K636K594k734l052L528O318o69p961j511R407N490r110r563N785J1481
887H951k668j3282k180J0916N026q499p122N051P651j634n842R11N141M11k748
902H3L63L308p43l965R9M733R64o963m494N801P142n463j0124J733J1894K153
918F521j0516n426R676Q801n503r010K534Q653P24o843k501M494K027l722k193
933b284K146R95l011k017L522K871l889m439L557P271k04q316j893R602O223p987
$$ plain form
949 2147 -6546 -1796 8351 6382 -4580 -6776 1683 4994 -1450 -6532 -2784 2183 27 -3352 -1966
964 -1966 1299 409 -1396 25 3723 3041 -1451 -1381 4262 6193 -438 -6066 -531 6837 2446 -7859
980 -7859 -7137 3149 5749 -3944 -8959 -955 6167 1856 -4417 -1783 4324 4474 98 -601 2549 2809
996 2809 -5 -911 1273 1756 -1926 -3965 -532 2995 -732 -6794 -4228 4324 4100 -4532 -6569 2548
1012 2548 8509 1540 -5827 -527 7340 5090 -2796 -3475 2361 3435 -716 -3681 -1483 361 -1149
1027 -1149 -2818 -1664 723 -290 -2849 -824 3396 3065 -2570 -2671 4354 6858 -236 -5292 900
1042 900 7398 2508 -6250 -4673 3108 3674 -3261 -6190 -1236 2599 18 -3316 -1607 1792 2047 -54
1058 -54 -469 2266 2739 -35 -469 2727 3525 -1469 -4405 388 4411 -459 -7042 -3685 3836 2944 -5009
$$ packed form
949B147q693M750J0147j969j0962k196Q459L311o444n082L748M967k156l379J386
964a966L265q90j805J421L698o82m492P0N643J931o631n628N535P368m391j0305
980g859P22J0286K600r693n015Q004P122m311o273K634O107J50m376o99L150K60
996B809k814r06K184M83l682k039L433L527l727o062K566Q552k24q632k037R117
1012B548N961o969p367N300P867k250p886o79N836J074m151k965K198J844j510
1027a149j669J154K387j013k559K025M220l31n635j01P025K504p094n056O192
1042I00O498m890q758J577P781N66o935k929M954L835k581l334J709L399K55k101
1058e4m15K735M73k774m34L196P98m994k936M793M023m870o583L357P521q92p953
$$ plain form
1075 -5009 -5919 1956 5554 5 -4034 -558 4613 3494 -701 -1116 2100 3072 419 -1561 -216 845
1091 845 -1095 -3041 -1217 1586 -920 -4685 -2040 3789 2144 -4186 -3221 4499 6190 -627 -4260
1106 -4260 1614 6439 2154 -3790 -2371 2643 2569 -2017 -4003 -1190 1142 -494 -3016 -1991 709
1121 709 738 -1355 -644 2853 2684 -1075 -941 3789 4516 -1136 -3862 1706 5498 -124 -6289 -2861 3323
1138 3323 1308 -4766 -4707 900 2758 -483 -2954 -632 2985 2701 123 -576 1689 3099 653 -1070
1154 -1070 989 2265 -981 -3516 -396 2407 -1204 -5742 -2458 3262 1388 -4949 -3709 3507 4925
1169 4925 -588 -3136 1703 5039 2605 -1508 -842 1878 2544 -600 -2784 -1432 936 -227 -3057
1184 -3057 -2303 639 202 -2692 -1584 2793 2500 -2389 -1662 4044 4767 -1191 -3083 2373 5186 265
$$ packed form
1075e009r10P875L598n549m039L476N171j119m195m15L216R72k653j980J345J061
1091H45j940j946J824K803k506l765K645N829j645o330R65P720J691o817l633
1106d260N874M825m285n944J419N014p4m586j986K813K332j636k522J025K700
1121G09K9k093P11L497j69l759J34M730P27n652k726N568L792n622o165L428O184
1138C323k015o074N9N607J858l241k471K322L617k84k578o99K265J410k446j723
1154a070K059J276l246k535L120K803l611m538L284N720j874o337J240P216J418
1169D925n513k548M839L336k434m113O66K720O66l144k184J352K368j163k830
1184c057P54K942m37k894J108M377k93m889P27N706P23n958j892N456K813m921
$$ plain form
1200 265 -4190 -1371 2767 864 -3318 -3711 -727 1039 -344 -2225 -1580 1474 2208 -21 -1135 1556
1216 1556 3374 390 -1097 2115 3280 -723 -3267 650 3228 -1309 -5073 -1487 3143 427 -4472
1231 -4472 -3304 1752 2653 -1008 -2246 497 3389 2587 -151 -724 1776 3217 500 -1974 -495 1794
1247 1794 -50 -3138 -1604 1325 -618 -4062 -1555 2557 1142 -3285 -1824 3604 3858 -1082 -2135
1262 -2135 2154 4300 898 -2184 -631 2115 1664 -1516 -3054 -1031 902 -316 -2942 -2189 1017
1277 1017 1019 -1683 -1278 2174 2206 -927 -769 3003 3451 -518 -1757 1777 3246 -769 -3793 -1232 1832
1294 1832 449 -3214 -3002 321 1573 -627 -2325 -451 2140 1787 -630 -561 2098 3010 354 -875
1310 -875 1097 2284 -657 -2337 -120 1448 -1399 -3863 -1210 1773 -316 -3227 -1741 2104 2334
$$ packed form
1200B65m455K819M138j903m182l93K984J766j383j881O45L054P34k229j114K691
1216A556J818k984j487L212J165m003k544L917K578m537l764L586M630k716m899
1231d472J168N056R01l661j238K743K892q02k738n73K500J441k717k474J479K289
1247A794j844l088J534K929j943l444K507M112j415m427J461N428K54m940j053
1262b135M289K146l402l082J553K746m51l180j538K023J933j218k626P53L206
1277A017Kk702M05L452L2l133J58L772M48l969j239L534J469m015l024K561L064
1294A832j383l663K12L323J252k200j698J874K591l53k417O9K659R12k656j229
1310h75J972J187k941j680K217J568k847k464K653K983k089k911J486L845K30
$$ plain form
1325 2334 -934 -1512 1687 3416 1633 -940 -166 2310 2064 -607 -2239 -166 1343 -889 -2778 -1573
1341 -1573 733 -535 -2431 -1218 1753 966 -1627 -774 2738 2873 -120 -1042 2111 3519 341 -2013
1357 -2013 -657 1814 371 -2182 -2643 -174 784 -1431 -2695 -1053 1396 1018 -1148 -293 2095 2016
1373 2016 -42 -314 2141 2073 -349 -1260 755 1462 -1051 -2865 -1110 1252 -680 -2772 -2145 583
1389 583 1181 -1009 -1684 592 2711 1345 -683 24 2318 2197 -227 -1044 845 1495 -785 -2187 -562
1406 -562 530 -1369 -2644 -885 1333 -190 -1975 -681 1898 1788 -503 -563 1600 2711 785 -1183
1422 -1183 47 1743 987 -1554 -2060 -318 555 -1311 -2848 -1067 754 -288 -1697 -573 1654 1201
1438 1201 -586 169 2260 2033 -320 -652 1170 1908 -366 -1829 -533 1069 -277 -2201 -1928 -191
$$ packed form
1325B334l268n78L199J729j783k573P74K476k46k671j632K073J509k232j889J205
1341a573K306j268j896J213K971p87k593Q53L512J35k993r22L153J408l178k354
1357b013J356K471j443k553m61K469R58k215j264J642K449l78k166Q55K388p9
1373B016k058k72K455o8k422r11K015P07k513j814J755K362j932k092O27K728
1389E83N98k190o75K276K119j366k028P07K294j21k424q17J889O50k280j402J625
1406e62J092j899j275J759K218j523j785J294K579j10k291o0K163J111j926j968
1422a183J230J696p56k541n06J742Q73j866j537J781J821j042j409J124K227m53
1438A201j787P55K091k27k353l32J822P38k274j463J296J602j346j924K73J737
$$ plain form
1454 -191 773 -1022 -1952 -214 1611 865 -872 -97 2217 1761 -41 -148 1456 1676 -334 -1243 80
1471 80 538 -1113 -2228 -782 401 -571 -2051 -1081 810 1211 -491 -822 1195 2097 990 -439 76
1488 76 1888 1474 -809 -1111 414 962 -1009 -2106 -526 482 -865 -2266 -642 891 107 -926
1504 -926 51 1686 1143 -38 23 1779 1960 448 -793 -60 883 149 -1535 -1656 -184 302 -1155 -1944
1522 -1944 -694 1038 -280 -1283 -158 1493 1229 -127 529 1618 1619 153 -282 800 984 -517 -1311
1539 -1311 -501 191 -663 -1834 -1525 69 474 -656 -1184 235 1793 929 -291 364 2088 1555 -315
1556 -315 -294 1075 1086 -478 -1311 -160 242 -945 -1876 -923 7 -530 -1092 -597 966 785 87 89 1033 1662
1576 1662 754 -140 288 1316 1028 -793 -1287 -17 243 -1147 -1929 -816 268 -708 -1152 -79 701
$$ packed form
1454a91R64j795r30J738J825p46j737P75K314m56j802j07J604K20k010r09J323
1471H0M58j651j115J446J183r72j480R70J891M01j702l31K017R02j107j429N15
1488G6J812m14k283l02J525N48j971j097J580J008j347j401J624J533p84j033
1504i26R77J635n43j181O1J756J81j512j241P33R43p34j684j21J472M86j457p89
1522a944J250J732j318j003J125J651k64j356O56J089Jj466m35J082J84j501p94
1539a311Q10O92q54j171L09J594M05j130n28J419J558q64j220O55J724n33j870
1556c15K1J369J1j564q33J151M02j187r31R53R30n37n62M95J563j81o98KR44O29
1576A662r08q94M28J028k88j821m94J270K60j390p82J113J084r76m44J073P80
$$ plain form
1593 701 658 -157 255 1408 1548 440 -102 907 1027 203 -720 -221 411 -259 -1377 -1410 -49 126 -1098
1612 -1098 -1415 -346 809 164 -416 396 1731 1374 -104 320 1202 934 14 -698 74 303 -743 -1421
1630 -1421 -971 -151 -419 -1215 -807 174 500 -323 -348 581 1705 843 123 482 1223 1119 -244 -459 219
1649 219 672 -933 -1024 -627 -35 -904 -1238 -686 297 -93 -530 20 785 826 336 -40 1035 1110 556 -59
1669 -59 6 877 -92 -950 -985 -211 35 -1071 -1296 -536 320 -256 -855 -6 954 1002 181 330 1025 1087 416
1690 416 162 684 580 25 -642 -414 -302 -514 -1092 -1248 -192 -227 -918 -746 -46 870 207 78 467 1200
1710 1200 1123 54 289 1017 647 -319 -586 -132 190 -769 -1137 -711 -150 -378 -993 -542 158 426 50 133
1730 133 501 1152 535 211 604 995 811 -218 -396 90 45 -808 -1160 -408 -320 -484 -922 -387 340 187
$$ packed form
1593G01m3q15M12J153J40j108n42J009J20q24r23M99O32o70j118l3J361J75j224
1612a098l17J069J155o45n80Q12J335l57j478M24Q82k68r20p12P72K29j046o78
1630a421M50Q20k68p96M08R81L26q23k5R29J124q62p20L59P41j04j363k15O78
1649B19M53j605r1L97N92q69l34N52R83l90m37N50P65M1m90l76J075P5n54o15
1669e9O5Q71r69q58l5P74K46j106k25P60Q56n76n99Q49R60M8q21J49O95O2o71
1690D16k54N22j04n55o67K28J12k12n78j56J056l5o91J72P00R16o63j29L89P33
1710A200p7j069K35P28l70r66k67M54L22r59l68M26N61k28o15M51P00K68l76Q3
1730A33L68O51o17l24L93L91j84j029j78M86m5q53l52P52Q8j64m38N35P27j53
$$ plain form
1750 187 -278 400 792 710 536 416 915 908 711 -121 -225 109 86 -846 -1047 -333 -384 -1020 -1087 -379 191 59
1772 59 -202 281 883 952 477 405 959 799 209 -97 194 120 -238 -851 -554 -233 -584 -895 -820 -365 -102 -255
1794 -255 -198 198 971 620 331 543 1169 808 194 272 376 230 -367 -762 -389 -450 -944 -927 -954 -250 -273 -433
1816 -433 40 418 667 375 330 776 775 667 188 247 441 388 -360 -512 -145 -422 -918 -1025 -313 -276 -329 -426 -43
1839 -43 612 339 283 431 855 975 663 278 494 374 -77 -586 -355 -174 -363 -974 -757 -441 -507 -350 -506
1860 -506 -41 456 235 251 338 592 799 412 355 731 444 -49 -104 -166 -107 -476 -863 -542 -362 -397 -648 -481
1882 -481 -119 178 273 -3 488 845 730 470 524 742 394 81 197 -45 259 -465 -867 -409 -177 -585 -874
1903 -874 -144 -131 -62 -194 166 599 759 330 496 618 639 457 33 77 -16 -306 -436 -577 -462 -483 -645 -499
$$ packed form
1750A87m65O78L92q2j74j20M99pj97q32j04L34k3r32k01P14n1o36o7P08N70j32
1772E9k61M83O02O9m75p2N54j60n90l06K91p4l58o13K97L21l51l11P5M55K63j53
1794b55N7L96P73l51k89K12O26l61o14P8J04j46n97l95L73o1m94J7k7P04k3j60
1816d33M73L78K49k92m5M46jj08m79N9J94n3p48j52L67k77m96j07P12L7n3r7L83
1839d3O55k73n6J48M24J20l12l85K16j20m51n09K31J81j89o11K17L16o6J57j56
1860e06M65M97k21J6Q7K54K07l87n7L76k87m93n5o2N9l69l87L21J80l5k51J67
1882d81L62K97R5k76M91L57j15k60N4K18l48l13J16k42L04p24m02M58K32m08k89
1903h74P30J3O9j32L60M33J60m29J66J22K1j82m24M4r3k90j30j41J15k1j62J46
$$ plain form
1925 -499 -624 -128 -126 121 251 425 589 625 400 819 580 413 129 450 -56 -130 -565 -530 -553 -274 -548 -700
1947 -700 -495 -316 -454 -248 223 151 235 301 663 873 882 479 267 340 187 -8 -513 -433 -635 -778 -767 -390 -642
1970 -642 -174 -295 -70 61 150 310 229 527 667 765 697 374 401 408 -38 -164 -216 -257 -527 -682 -566 -328 -599
1993 -599 -402 -191 -169 26 234 415 678 677 851 399 721 480 135 24 -243 -264 -479 -401 -512 -642 -472 -516
2015 -516 -643 -294 208 121 185 349 623 734 559 573 546 649 251 90 101 -221 -222 -533 -548 -673 -627 -506 -528
2038 -528 -267 47 5 113 385 796 593 370 365 467 368 149 291 -149 -238 -370 -295 -398 -428 -399 -428 -415 -429 -221
2062 -221 43 133 110 528 360 689 562 596 569 427 123 192 100 -488 -302 -736 -450 -493 -459 -540 -418 -229 -233 -17
2086 -17 153 227 448 497 749 587 525 400 512 324 144 -15 -418 -644 -313 -481 -445 -388 -145 -198 -111 143 295
$$ packed form
1925d99j25M96KK47J30J74J64L6k25M19k39j67k84L21n06p4m35L5k3K79k74j52
1947g00K05J79j38K06M71p2Q4O6L62K10Rm03k12P3j53j95n05Q0k02j43J1L77k52
1970f42M68j21K25J31Q9J60q1K98J40R8o8l23K7Pm46j26n2m1k70j55J16K38k71
1993e99J97K11K2J95K08J81K63jJ74m52L22k41l45j11k67k1k15P8j11j30J70m4
2015e16j27L49N02q7O4J64K74J11j75J4k7J03l98j61J1l22jl11j5j25M6J21k2
2038e28K61L14m2J08K72M11k03k23nJ02r9k19J42m40q9j32P5j03l0K9k9J3j4K08
2062b21K64R0k3M18j68L29j27L4k7j42l04O9r2n88J86m34K86m3L4q1J22J89mK16
2086a7J70P4K21M9K52j62o2j25J12j88j80j59m03k26L31j68L6N7K43n3Q7K54J52
$$ plain form
2109 295 487 395 446 474 461 306 413 217 -14 180 9 -66 -322 -469 -555 -398 -297 -339 -288 -390 -147 -64 -53
2132 -53 296 392 379 432 457 266 315 183 174 -226 -143 -256 -379 -459 -307 -415 -542 -235 55 -201 -33 -25 403 358
2156 358 287 377 250 312 338 320 354 27 233 -148 -274 -425 -408 -428 -428 -440 -362 -342 -6 129 -152 350 395 448 655
2181 655 584 234 164 169 113 -243 -167 -227 -323 -584 -613 -278 -141 -267 -258 -9 -56 236 531 468 384 385 523 370 366 293
2207 293 -101 129 29 -439 -326 -495 -477 -535 -577 -571 -207 -270 330 243 -39 401 421 436 525 362 147 329 133
2230 133 -5 -47 -271 -329 -555 -646 -404 -218 -364 -101 -11 -166 -145 185 305 344 421 261 536 536 521 66 75 -14
2254 -14 -5 -357 -385 -273 -615 -459 -265 -277 -188 -73 235 244 173 259 496 477 377 454 260 377 256 180 41 -513
2278 -513 -209 -223 -313 -525 -501 -401 -179 -145 -234 183 198 314 217 543 587 358 76 364 179 7 48 -207 -223
$$ packed form
2109B95J92r2N1K8j3j55J07j96k31J94j71p5k56j47q6J57J01m2N1j02K43Q3J1
2132e3L49R6j3N3K5j91M9j32rm00Q3j13j23q0J52j08j27L07K90k56J68QM28m5
2156C58p1R0j27O2K6j8L4l27K06l81j26j51J7k0%j2P8K0L36J35k81N02M5N3K07
2181F55p1l50p0Nn6l56P6o0r6k61k9L35J37j26RK49m7K92K95o3q4JJ38j53mp3
2207B93l94K30j00m68J13j69J8n8m2OL64o3O00q7k82M40K0J5Q9j63k15J82j96
2230A33j38m2k24n8k26r1K42J86j46K63R0j55K1L30J20L9P7j60K75%j5m55Rq9
2254a4Rl52k8J12l42J56J94j2Q9J15L08Rp1Q6K37j9j00P7j94J17j21p6j39n54
2278e13L04j4r0k12K4J00K22L4q9M17J5J16r7L26M4k29k82K88j85j72M1k55j6
$$ plain form
2301 -223 -387 -286 -628 -490 -120 -78 -72 -70 33 107 150 350 423 461 497 355 188 227 179 78 47 -64 -79 -463 -502
2326 -502 -463 -450 -389 -395 30 24 52 259 352 137 471 448 218 368 316 144 -42 -72 18 77 -345 -500 -248 -378 -290
2351 -290 -218 -131 49 52 124 372 430 229 329 281 264 449 264 -107 1 58 -232 -527 -403 -345 -278 -398 -150 -113
2375 -113 -93 -61 187 206 256 463 212 383 487 382 70 133 -93 -114 -305 -214 -389 -346 -267 -257 -314 51 -11 -210
2399 -210 41 147 210 89 310 300 357 200 96 286 80 -108 -180 -225 -276 -585 -250 -533 -180 -117 -92 -146 -210
2422 -210 131 88 361 321 410 380 552 279 242 308 -98 -28 -164 -307 -259 -463 -324 -145 -333 -349 -168 -128 120
2445 120 171 171 146 214 719 321 473 225 172 -114 -115 -171 -110 -336 -451 -385 -206 -155 -407 -181 74 17 0 273 519
2470 519 254 377 306 293 210 120 237 -97 71 -399 -525 -470 -309 -367 -307 -240 -320 -250 -225 -143 200 138 333 294 429
$$ packed form
2301b23j64J01l42J38L70M2OKJ03P4M3K00P3L8L6j42j67L9m8j01l1j11j5l84l9
2326e02L9J3O1oM25oK8K07R3k15L34k3k30J50n2j72j86l0R0N9m22j55K52j30Q8
2351b90P2Q7J80LP2K48N8k01J00m8j7J85j85l71J08N7k90k95J24N8O7j20K48L7
2375a13K0L2K48J9N0K07k51J71J04j05l12O3k26k1j91R1j75M3P9J0n7L65o2j99
2399b10K51J06O3j21K21j0N7j57j04J90k06j88p2m5n1l09L35k83L53O3K5n4o4
2422b10L41m3K73m0Q9l0J72k73l7O6m06P0j36j43M8k04J39J79j88j6J81M0K48
2445A20N1%k5O8N05l98J52k48n3k86jn6O1k26j15O6J79N1k52K26K55n7j7K73K46
2470E19k65J23p1j3q3r0J17l34J68m70j26N5J61n8O0O7q0P0K5Q2L43o2J95l9J35
$$ plain form
2495 429 574 346 328 200 153 -46 -105 -270 -482 -369 -522 -421 -333 -19 16 32 -139 65 333 454 279 430
2517 430 392 355 108 129 341 64 -427 -267 -109 -186 -197 -535 -357 -219 -154 -10 59 48 159 395 409 452 303
2540 303 319 338 57 -51 -208 -26 125 -475 -187 -335 -273 -363 -245 -309 -22 47 121 194 284 260 486 320 73
2563 73 359 231 84 -65 -89 -133 -36 -171 -356 -327 -206 -255 -360 -244 10 235 61 88 164 211 429 321 216
2586 216 474 26 -26 42 25 -50 3 -318 -445 -304 -308 -235 -157 -207 119 217 278 433 252 488 43 20 103 249 326
2611 326 61 -53 -103 -198 -164 -388 -109 -366 -256 -91 3 16 100 215 212 343 278 115 513 309 231 279 295 121
2635 121 -113 -19 -427 -285 -157 -318 -300 -26 -97 181 -109 36 299 316 350 497 450 313 238 236 90 -116 70
2658 70 -186 -421 -397 -300 -351 -325 -225 -122 -166 -122 -10 309 95 229 361 280 312 107 91 93 61 10 -211 -225 -188
$$ packed form
2495D29J45k28j8j28m7j99n9j65k12J13j53J01Q8L14L5J6j71K04K68J21j75J51
2517D30l8l7k47K1K12k77m91J60J58p7j1l38J78J38O5J44O9j1J11K36J4M3j49
2540C03J6J9k81j08j57J82J51o00K88j48O2r0J18o4K87O9P4P3R0k4K26j66k47
2563G3K86j28j47j49k4m4R7j35j85K9J21m9j05J16K54K25j74K7P6M7K18j08j05
2586B16K58m48n2O8j7p5N3l21j27J41mP3P8n0L26R8O1J55j81K36m45k3Q3J46P7
2611C26k65j14n0r5L4k24K79k57J10J65R4J3Q4J15lJ31o5j63L98k04p8M8J6j74
2635A21k34R4m08J42J28j61J8K74p1K78k90J45K63J7L4J47m7j37p5kj46k06J86
2658G0k56k35K4R7n1K6J00J03m4M4J12L19k14J34J32q1L2k05j6Kl2n1k21j4L7
$$ plain form
2683 -188 -205 -183 -255 -410 -333 -78 -31 22 117 112 271 327 383 296 354 333 150 148 -103 -197 -412 -226 -230 -321 -437 -251 -211
2710 -211 -239 28 -84 197 183 284 339 428 489 327 180 141 31 3 121 -215 -194 -311 -555 -489 -281 -99 -156
2733 -156 -189 60 -73 253 206 154 572 293 266 274 254 264 -405 78 46 -148 -466 -244 -301 -387 -343 -96 -286 -35
2757 -35 -59 -19 109 212 140 261 283 83 178 182 71 56 -103 -40 -345 -253 -214 -386 -242 -53 -64 -82 73 177 121
2782 121 118 321 291 132 177 129 164 48 -66 27 -145 -137 -205 -426 -246 -251 -217 -225 -142 -85 105 265 247 139 391 224
2808 224 384 175 393 -21 -66 48 36 -338 -213 -337 -440 -277 -229 -19 35 -178 104 281 94 296 408
2829 408 302 298 216 19 75 76 291 -242 -27 -261 -359 -127 -24 82 -142 -20 -134 4 191 49 193 67
2851 67 463 327 472 89 180 389 110 -187 -77 -342 -244 -269 -303 -213 -165 -211 -284 70 -61 181 81 387 330
$$ packed form
2683a88j7K2p2j55P7K55M7N3R5nJ59N6N6q7N8k1j83kk51r4k15J86mr1j16J86M0
2710b11k8K67j12K81j4J01N5Q9O1j62j47l9j10k8J18l36K1j17k44O6K08J82n7
2733a56l3K49j33L26m7n2M18k79k7Qk0J0o69M83l2j94l18K22n7q6M4K47j90K51
2757c5k4M0J28J03p2J21K2k00R5Mj11j5j59O3l05R2L9j72J44J89j1j8J55J04n6
2782A21lK03l0j59M5m8L5j16j14R3j72Qo8k21J80nL4qQ3N7J90J60j8j08K52j67
2808B24J60k09K18m14m5J14j2l74J25j24j03J63M8K10N4k13K82J77j87K02J12
2829D08j06mq2j97N6JK15n33K15k34r8K32J03J06k24J22j14J38J87j42J44j26
2851F7L96j36J45l83R1K09k79k97J10k65R8k5l4R0M8m6p3L54j31K42j00L06n7
$$ plain form
2874 330 289 125 149 100 -7 44 56 1 -388 -173 -313 -278 -396 -147 -222 -169 29 34 50 302 170 305 148 335
2898 335 512 203 94 -31 25 106 -176 -101 -223 -399 -250 -154 -118 -149 151 147 77 314 317 177 401 393 234 133
2922 133 270 169 158 -66 -145 -337 -500 -115 -122 -237 -280 -507 69 -47 150 293 439 55 135 265 98 70
2944 70 309 -6 74 -32 12 102 -123 -21 -322 -331 -310 -91 -170 -188 118 67 261 224 156 143 202 207 -1 182 207 38
2970 38 -170 -48 -49 -197 -182 -35 -413 -245 -245 -79 -14 -109 129 5 359 150 236 99 -24 219 75 121 -157
2993 -157 -152 -233 -204 -192 -131 -58 -240 -40 -106 -180 -43 75 301 46 84 176 211 149 99 83 80 80 -127 -282 -294 -199 -187
3020 -187 -270 -90 -176 -93 -28 -26 200 137 180 274 42 94 203 212 15 158 39 32 -168 11 -268 -259 -332 -173 -131 -36
3046 -36 41 -64 29 269 278 301 229 160 351 -26 38 137 186 23 -129 -140 -41 -246 -242 -194 -312 -276 -4 -104 92 -182
$$ packed form
2874C30m1j64K4m9j07N1J2n5l89K15j40L5j18K49p5N3J98NJ6K52j32J35j57J87
2898C35J77l09j09j25N6Q1k82P5j22j76J49R6L6l1L00mp0K37Lj40K24qj59j01
2922A33J37j01j1k24p9j92j63L85pj15m3k27N76j16J97J43J46l84Q0J30j67k8
2944G0K39l15Q0j06M4R0k25J02l01rK1K19p9j8L06n1J94l7o8j3N9Nk08J83K5j69
2970C8k08J22jj48J5J47l78J68%J66O5r5K38j24L54k09Q6j37j23K43j44M6k78
2993a57Nq1K9J2O1P3j82K00o6p4J37J18K26k55L8R2L5o2n0j6l%k07j55j2R5J2
3020a87q3J80q6Q3O5KK26o3M3R4k32N2J09Rj97J43j19pk00J79k79Rp3J59M2R5
3046c6P7j05R3K40RK3p2o9J91l77O4R9M9j63j52j1R9k05MM8j18L6K72j00J96k74
$$ plain form
3072 -182 240 -57 376 273 333 192 151 70 158 -104 -53 -22 -203 -171 -154 -332 -70 -57 44 34 -172 186 130 48
3096 48 140 69 217 123 124 186 -46 8 -13 -156 -106 -195 -178 -10 -107 16 -172 -79 -12 106 13 -59 51 337 356 9
3122 9 214 269 27 65 56 -49 70 -46 -32 -114 -416 -296 -117 -121 -89 144 83 -34 73 301 344 182 16 171
3146 171 -52 -68 179 -79 -111 -79 -132 -287 -238 -212 -143 -234 -7 95 -27 -98 109 69 -32 109 -102 24 113 24
3170 24 -59 -20 -28 -23 23 -164 136 59 -173 -159 75 -46 -61 -13 254 168 210 317 400 255 190 42 -13 -21 -55 -127 -204
3197 -204 -237 -161 -51 -214 37 -94 49 -42 292 17 185 19 220 41 124 289 87 241 -24 -100 -34 54
3219 54 -107 -148 -79 -240 -425 -207 -66 -146 -55 -188 226 75 16 359 222 149 252 44 138 -23 -60 -113 -78 -149
3243 -149 -86 -160 -288 -18 -38 112 -277 121 61 228 185 146 276 231 126 230 79 -151 -47 21 -221 -143 -116
$$ packed form
3072a82M22k97M33j03O0j41m1q1Q8k62N1L1j81L2J7j78K62J3J01j0k06L58n6q2
3096D8R2p1J48r4JO2k32N4k1j43N0q9J7J68r7J23j88R3O7J18r3p2J10K86J9l47
3122IK05N5k42L8rj05J19j16J4q2l02J20J79mL2K33o1j17J07K28M3j62j66J55
3146A71k23j6K47k58l2L2n3j55M9K6O9r1K27J02j22p1K07m0j01J41k11J26Q9q9
3170B4q3L9qNM6j87L00p7k32J4K34j21j5M8K67q6M2J07Q3j45o5j48n5ql4p2p7
3197b04l3P6J10j63K51j31J43r1L34k75J68j66K01j79Q3J65k02J54k65p6O6Q8
3219E4j61m1O9j61j85K18J41q0R1j33M14j51n9L43j37p3J03k08R4j61l7n3L5p1
3243a49O3p4j28K70k0J50l89L98o0J67m3l9J30m5j05J04j51k30J04O8k42P8K7
$$ plain form
3266 -116 -96 -4 -239 -172 -146 -115 143 46 17 74 420 47 109 185 56 128 -148 -51 -31 -30 -371 -78 -228 -290 -114
3291 -114 -189 43 144 100 206 -38 90 186 238 160 59 114 126 92 -12 0 -120 -81 -202 -125 -89 -98 -350 -88 13
3316 13 29 18 0 -60 -31 87 222 258 304 185 47 100 -96 -72 -217 -220 -197 -219 -113 -100 -215 -108 -302 -77 -9
3341 -9 183 242 -23 236 208 66 180 224 131 -88 -210 -287 -173 -240 -245 -30 -126 -405 -238 118 -8 81 -39 28
3365 28 301 160 180 271 58 54 59 -154 -9 -49 -170 -147 -176 -276 -102 -119 -217 -37 128 213 5 -5 75 266 73
3390 73 138 60 72 -18 -227 -150 -131 -72 -306 -74 81 2 -298 -386 29 -53 24 118 148 236 138 194 115 180 209 74 4
3417 4 -209 87 -149 -245 -54 22 -82 -103 -255 -94 78 -7 100 -14 221 222 240 183 358 78 76 169 64 9 -467
3442 -467 -7 -124 -145 -276 19 -75 -261 -232 -46 -146 -23 80 30 108 39 90 251 121 -168 112 19 122 -179
$$ packed form
3266a16K0R2k35O7K6L1K58r7k9N7L46l73O2P6j29P2k76R7K0Jl41K93j50o2J76
3291a14p5K32J01m4J06k44J28R6N2p8j01N5J2l4j04J2j20L9j21P7L6rk52K62J01
3316A3J6j1j8o0K9J18J35L6M6j19j38N3j96K4j45lK3k2J06J3j15J07j94K25O8
3341iJ92N9k65K59k8j42J14M4r3k19j22p7J14o7nK15r6k79J67L56j26Q9j20O7
3365B8K73j41K0R1k13mNk13J45m0j21K3k9j00J74j7r8J80J65Q5k08j0Q0J91j93
3390G3O5p8J2r0k09P7J9N9k34K32J55p9l00q8M15q2P7R4L0Q8r8N6p9O5K9j35p0
3417Dk13K96k36r6J91P6j04k1j52J61J72q5J07j14K35JJ8n7J75k80kR3j05n5m76
3442d67M60j17k1j31K95r4j86K9J86j00J23J03n0P8o9N1J61j30k89K80r3J03l01
$$ plain form
3465 -179 -85 -106 -119 -232 -49 -293 16 -331 111 -6 294 79 76 259 310 261 89 60 86 -23 -189 24 -348
3488 -348 -89 -166 -103 -150 -123 -132 160 1 -102 88 278 -27 247 16 194 131 79 -10 12 -54 -111 140 -260 -213
3512 -213 -10 -375 -97 -193 112 7 -9 -25 -38 -65 107 108 183 271 84 41 62 36 -99 -228 -103 -331 -141 -167
3536 -167 -235 -125 -147 42 201 99 -110 125 98 -148 144 160 11 47 -249 216 -57 103 -133 -259 -187 0
3558 0 -36 -33 -71 70 59 194 25 -2 120 138 -59 366 99 87 -96 81 -17 2 119 66 55 -239 -172 -180 -204 -81
3584 -81 160 8 46 146 29 168 12 82 393 71 199 81 -83 -149 -97 -250 26 -249 -118 -321 -24 -14
3606 -14 30 129 -119 141 71 219 -114 221 366 -56 91 35 149 104 -66 -135 -171 -307 -84 42 -28 -116 -69 -10
3630 -10 -70 447 179 75 73 -38 151 84 86 25 131 -150 -112 -223 82 -87 -136 -164 -346 -256 18 -359 92 196
$$ packed form
3465a79R4k1j3j13J83k44L09l47M42j17L00k15lJ83N1m9j72k9K6j09j66K13l72
3488c48K59p7O3m7K7rK92j59j03J90J90l05K74k31J78o3n2q9K2o6n7K51m00M7
3512b13K03l65K78r6L05j05j6j6j3k7J72JP5Q8j87m3K1k6j35j29J25k28J90k6
3536a67o8J10k2J89J59j02k09K35k7k46K92J6j49L6k96M65k73J60k36j26P2J87
3558@l6Ll8J41j1J35j69k7J22J8j97M25k67j2j83J77r8J9J17n3j1k94O7qk4J23
3584h1K41j52L8J00j17J39j56P0L11l22J28j18j64o6N2j53K76k75J31k03K97J0
3606a4M4R9k48K60p0J48l33L35J45m22J47n6J14m5j70o9l6j36K23J26p0q8M7N9
3630a0o0N17k68j04kj11J89o7Ko1J06k81L8j11L05j69m9k8j82R0K74l77M51J04
$$ plain form
3654 196 144 68 6 136 2 225 308 82 169 190 -220 -77 -118 -89 -180 -87 71 -35 54 47 32 2 -115 186 391
3679 391 45 56 -1 107 18 -46 -21 129 -238 -87 -197 -96 -201 -106 -307 -299 68 -6 118 25 127 -83 -124 130
3703 130 182 -80 72 154 -50 103 -103 23 -116 -11 -157 -20 -287 26 255 42 -183 -32 30 124 279
3724 279 165 87 348 194 59 289 29 143 180 -28 186 -147 -99 -170 -8 -222 43 95 -16 129 63 118
3746 118 -61 125 2 146 -44 -45 6 37 -14 -136 -10 -51 -159 -164 -213 -178 -74 -25 -45 -79 40 186 282 288 -141
3771 -141 209 -63 101 58 -63 -37 -73 -214 115 40 -171 -131 -178 5 143 -2 217 198 73 34 312 176 156
3794 156 171 61 -103 -40 32 -54 24 -110 -124 -156 -65 91 -54 50 58 72 -62 80 104 209 150 -198 19 245
3818 245 -2 127 -149 133 -34 43 40 -215 -2 88 -71 102 35 -14 243 7 67 -4 209 258 1 160 83
$$ packed form
3654A96n2p6o2J30j34K23Q3k26Q7K1m10J43m1K9r1R3J58j06Q9pj5l0j17L01K05
3679C91l46J1n7J08q9o4K5J50l67J51j10J01j05R5k01QL67p4J24r3J02k10m1K54
3703A30N2k62J52Q2k04J53k06J26j39J05j46J37k67L13K29k13k25J51O2R4J55
3724B79j14p8K61j54j35K30k60J14L7k08K14l33M8p1J62k14K65N2j11J45o6N5
3746A18j79J86j23J44j90jN1L1n1j22J26m1j08nm9L5J04M9k0l4J19J46R6Om29
3771a41L50k72J64m3j21K6l6j41L29p5k11M0m7J83J38j45K19j9j25l9K78j36k0
3794A56J5j10j64O3P2q6P8j34j4l2R1J56j45J04QJ4j34J42K4J05n9l48K17K26
3818B45k47J29k76K82j67P7lk55K13R0j59J73o7m9K57k36O0p1K13M9k57J59p7
$$ plain form
3841 83 -179 70 -3 238 -63 -232 -24 -304 23 -159 -79 -133 192 -68 -61 48 92 266 -100 148 123 92 -57
3864 -57 116 202 -46 21 -156 -239 -97 -200 -228 -293 -237 -139 94 -184 -63 8 89 52 150 4 278 -32 -53 -105 -31
3889 -31 -42 -34 59 -53 -92 -50 -115 -44 -27 89 -135 41 34 -46 56 -46 76 113 -41 101 -104 -45 -150 -53 37 -49
3915 -49 54 -180 -529 -53 -38 -73 36 -148 34 124 0 12 44 162 61 232 109 137 -123 -128 -82 -125 -200 4
3939 4 1 -100 -156 54 194 170 -1 -203 -155 221 46 254 134 107 167 138 39 -76 -168 -107 -50 -23 -141 -136 -16 121
3965 121 -9 -36 98 -9 194 114 122 -22 17 -23 -104 53 67 70 103 -108 -191 -108 -165 35 -6 -97 -18 38 -207 -58
3991 -58 0 -72 140 -69 -44 47 -9 -5 -142 220 -52 -27 127 -155 146 -111 -175 -38 -233 -15 72 -53 -109 -28
4015 -28 201 101 148 84 -7 20 130 18 26 -16 -151 91 -229 -140 -119 3 -102 90 -121 181 -81 -132 52 222
$$ packed form
3841H3k62K49p3K41l01j69K08k80L27j82Q0n4L25k60PJ09M4J74l66K48k5l1j49
3864e7J73Q6k48O7j77q3J42j03k8o5N6R8K33k78J21P1Q1l7R8j46K74l10k1n2P4
3889c1j1QR3j12l9M2o5P1J7J16k24J76pq0J02j02J22L7j54J42k05N9j05R7R0q6
3915d9J03k34l49M76J5l5J09j84J82R0j24J2L2J18j01J71j23K8k60nM6m3p5K04
3939Dlj01n6K10J40k4j71k02M8L76j75K08j20k7O0k9r9j15r2O1N7K7j18NJ20J37
3965A21j30k7J34j07K03q0Qj44L9m0q1J57J4LL3k11q3Q3n7K00m1r1P9N6k45J49
3991e8N8p2K12k09K5R1n6Mj37L62k72K5J54k82L01k57o4J37j95K18Q7j25n6Q1
4015b8K29j00M7o4r1K7J10j12Qm2j35K42l20Q9K1J22j05J92k11L02k62n1J84J70
$$ plain form
4039 222 129 97 243 82 156 -55 -45 -35 -175 17 47 -104 -202 -201 -313 85 -71 -14 110 90 21 164 88 278
4063 278 22 29 107 -5 18 -73 57 -232 -183 -37 -52 47 -60 -101 25 200 70 163 -93 153 101 150 -18 -13 38
4088 38 46 -172 -223 7 -107 -93 -81 -197 -115 -237 -82 1 -31 170 61 170 96 114 8 85 224 189 -162 72
4112 72 81 16 185 -190 6 -31 -106 -75 -181 -134 -165 -212 244 39 22 67 -23 88 77 140 -134 -27 18 6 -146 -156
4138 -156 -118 -194 -35 8 39 163 10 -66 -177 54 68 154 183 192 -50 78 99 69 75 9 226 -63 -74 -74 -169 -78 -232
4165 -232 1 121 -62 72 118 75 65 -113 -27 278 89 -17 102 -257 172 -158 -272 12 -17 -106 -121 84
4187 84 -104 48 69 -5 107 137 -40 47 54 -31 159 51 -206 -185 10 -35 -126 -16 -163 -116 -30 -103 -84 41 39 14
4213 14 -59 -44 47 154 68 156 208 52 101 -148 69 -40 122 -90 -199 -73 -173 -146 -44 -125 -106 244 -169 23
$$ packed form
4039B22r3l2J46j61P4k11J0J0j40J92L0j51r8Jj12L98j56N7J24k0o9J43p6J90
4063B78k56PP8j12K3r1J30k89M9J46j5R9j07m1J26J75j30R3k56K46n2M9j68NN1
4088C8Qk18n1K30j14J4J2j16Q2j22J55Q3l2K01j09J09p4J8j06P7J39l5l51K34
4112G2Ro5J69l75J96l7p5L1j06M7l1m7M56k05j7M5r0J11j1O3k74J07M5j2j52j0
4138a56L8p6J59M3L1J24j53p6j11K31J4Q6K9Rk42J28K1l0Oo6K17k89j1%r5R1j54
4165b32K33J20j83J34M6m3j0j78Q6L05j89j06J19l59M29l30j14K84k9q9j5K05
4187H4j88J52K1p4J12L0j77Q7Pq5J90j08k57K1J95m5r1J10j47M7Q6p3J9J25kk5
4213A4p3J5R1J07q6Q8N2j56M9k49K17j09J62k12j09J26j00K7J02q1J9L50m13J92
$$ plain form
4237 23 103 45 51 88 132 69 66 -70 134 148 -92 -146 10 84 34 90 -40 9 82 -190 265 -90 60 74 7 52 -84
4264 -84 190 118 15 -80 -6 -161 -233 33 -44 -284 -19 -88 -86 4 89 160 -26 -117 -53 108 88 60 103 -72 108 107
4290 107 283 -152 -7 -7 -160 -140 42 -14 -198 158 231 183 -9 -62 -15 146 -43 119 59 129 170 100 -59 -264
4314 -264 184 49 217 152 -33 -59 -131 58 45 -257 91 7 41 114 67 49 -37 37 139 -10 103 3 50 2
4338 2 59 27 -95 -141 53 -107 -173 -149 28 90 9 158 94 83 -13 112 55 181 24 -6 103 -127 61 -155 8
4363 8 -109 55 -143 -58 -91 24 130 -48 -33 -16 77 -18 201 157 -16 -19 -119 31 91 39 -188 -19 -94 -238 -27
4388 -27 79 -10 -21 183 -63 43 -103 29 32 222 235 166 221 11 81 -40 -3 -199 -131 -113 173 -153 -82 -147 70
4413 70 42 23 115 -73 -19 72 186 178 93 100 72 -10 -40 11 -166 -48 -44 -354 -113 24 142 -134 -86 -146 -25 97
$$ packed form
4237B3Q0n8OL7M4o3lj36K04J4k40n4J56P4n0N6j30M9P3k72M55l55J50J4o7M5j36
4264h4K74p2j03r5P4j55p2K66p7k40K65o9KR0Q5P1j86r1O4J61k0k8M3j75J80j
4290A07J76m35J45%j53K0J82n6j84L56P3m8j92n3M7J61j89J62o0P0M1p0j59k05
4314b64M48j35J68o5j85k6p2J89j3l02L48q4L4P3m7j8q6P4J02j49J13j00M7m8
4338BN7l2j22m6J94j60o6K4J77O2q1J49o4j1r6J25n7J26j57l0J09k30J88k16J63
4363Hj17J64j98Q5l3J15J06j78J5J7R3r5K19m4j73lj00J50O0n2k27J69p5j44K11
4388b7J06q9j1K04k46J06j46J32LJ90J3o9N5k10P0j21L7j96O8J8K86l26P1o5K17
4413G0k8j9R2j88N4R1J14qq5Pk8q2l0N1j77J18Ml10K41J37J18k76M8o0J21J22
$$ plain form
4439 97 160 47 -6 98 75 76 -58 -85 141 -57 31 145 3 -195 -97 -117 -14 -121 -129 23 39 20 65 27 -1 39
4465 39 131 47 -45 55 296 -104 -167 -53 118 33 -206 -83 -67 78 17 94 16 142 102 160 -132 147 137 -48
4489 -48 -102 59 146 -282 -11 -166 -72 99 41 -201 -41 8 -54 -67 -72 3 202 -40 239 -84 310 -164 224 -125
4513 -125 79 -3 -78 2 65 -217 -91 -14 -194 -52 -25 139 -67 -53 -41 -19 106 10 162 9 195 75 -176
4536 -176 169 87 -180 -58 -39 76 -140 81 138 46 -9 -240 73 51 -115 -44 39 74 234 -11 -29 -161 96
4559 96 170 -232 50 8 -15 17 11 -104 53 11 -99 185 -69 93 176 -38 4 179 62 98 95 148 -37 71 23
4584 23 -27 -175 114 -426 -230 -129 182 235 71 -68 18 142 -98 63 285 -113 67 69 7 82 94 -128 117
4607 117 72 -262 -177 41 -292 -88 -34 62 56 -37 -76 132 102 65 -92 166 -38 253 74 -132 44 -48 -3 19
$$ packed form
4439I7O3j13n3J04k3Jj34k7K26j98Q8J14j42j98R8k0J03j07qJ52J6j9M5l8k8M0
4465C9R2q4r2J00K41m00o3J14J71q5k39J23J6J45o1P7p8J26m0N8k92K79j0j85
4489d8n4J61Q7m28K71j55R4J71n8k42J60M9o2j3nP5J99k42K79l23L94m74L88l49
4513a25K04q2p5Q0O3k82J26P7j80J42K7J64k06J4J2K2J25r6J52j53J86j20k51
4536a76L45q2k67J22J9J15k16K21N7r2n5k31L13k2j66P1Q3L5J60k45j8j32K57
4559I6P4m02K82m2k3L2oj15J57m2j10K84k54J62Q3k14M2J75j17L6lN3j85J08m8
4584B3n0j48K89n40J96J01L11N3j64j39Q6J24k40J61K22l98J80Ko2P5J2k22K45
4607A17m5l34Q5K18l33K04N4R6or3l9K08l0l7j57K58k04K91j79k06J76r2M5K2
$$ plain form
4631 19 -56 -121 -42 105 -127 -28 -66 -119 116 -149 266 -85 114 -4 -50 -68 83 -137 -29 -7 -201 -81 -79 -31
4655 -31 -231 38 52 87 -59 -91 78 109 183 -155 -76 -78 84 29 85 12 -65 35 34 59 -52 167 -6 -28 16 -132
4681 -132 -35 83 133 163 -3 -53 198 131 53 14 66 -112 -43 123 -53 -261 87 -104 -208 46 -120 -100 79
4704 79 28 -26 -74 8 142 -112 27 136 61 -48 -136 80 -208 27 94 -139 -130 16 152 -30 -100 18 -89 43
4728 43 21 129 108 128 111 36 275 229 170 -165 16 -149 -284 -36 -322 -173 -147 -153 73 -117 -54 -16 50 161 -61
4753 -61 277 30 239 126 40 -248 92 124 -5 89 -47 -25 -266 10 20 2 -84 -255 196 136 18 67 -10 -105
4777 -105 -4 65 -149 -20 -156 -76 -62 -243 -86 -121 -123 -237 -44 18 -308 24 -63 57 -12 -58 77 168 0 116
4801 116 -38 30 61 46 207 67 -118 -54 -25 -88 37 6 150 161 -67 -168 80 202 -10 85 4 -144 206
$$ packed form
4631A9p5o5P9J47k32R9l8n3K35k65M15l51J99j18m6j8J51k20J08K2j94J20KM8
4655c1k00K69J4L5j46l2J69L1P4l38P9kJ62n5N6p3p7J00jK5j11K19j73k2M4j48
4681a32R7J18N0L0j66n0K51o7p8l9N2j78O9J66j76k08L48j91j04K54j66K0J79
4704G9n1n4m8Q2J34k54J39J09p5j09q8K16k88K35O7k33RJ46J36j82p0J18j07J32
4728D3k2J08k1K0j7p5K39m6n9l35J81j65j35K48k86J49K6oK26j90O3L8O6J11k22
4753f1L38k47K09j13q6k88L40L2j29R4j36K2k41K76J0j8q6j71M51o0j18M9p7r5
4777a05J01O9k14J29j36Q0J4j81J57l5kj14J93O2l26L32q7J20o9m6J35R1j68J16
4801A16j54O8L1j5J61j40j85O4K9o3J25l1J44J1k28j01K48J22k12R5q1j48L50
$$ plain form
4824 206 236 101 39 232 18 -185 -40 -186 -52 47 -76 -97 152 18 134 126 -63 192 -31 -112 -93 137 72
4847 72 88 144 172 6 -155 -65 146 -93 -21 78 -214 80 88 130 -47 110 68 335 -95 231 75 -85 60 81
4871 81 -188 -72 -40 -51 -190 -83 -170 -167 -34 -151 -158 22 72 70 241 -40 29 -156 36 278 160 23 181 -123
4895 -123 90 32 61 -176 175 -141 -114 -35 99 37 -82 52 -29 123 -65 118 87 -9 -182 -32 155 45 -18
4918 -18 -186 -156 93 111 43 -204 33 -259 43 -104 -106 -28 187 -94 72 126 207 -10 73 217 -208 -277 85 -90
4942 -90 116 -120 60 53 -148 -173 9 -23 169 -58 169 -83 226 89 47 138 -31 85 9 -25 -95 6 -152
4965 -152 -50 -66 65 226 138 -184 -144 134 1 162 -76 71 81 81 125 126 185 33 23 148 58 -74 -61 -177
4989 -177 96 -197 -112 -193 -26 -166 22 63 -29 -65 105 160 -117 158 75 73 -49 -99 -175 -7 55 154 -92 53
$$ packed form
4824B06L0j35o2J93k14k03J45j46J34R9j23k1K49j34J16qj89K55k23q1J9K30o5
4847G2J6N6K8j66j61R0K11k39P2R9k92K94QM2j77J57m2K67m30L26j56j60J45K1
4871H1k69J16L2j1j39J07q7LJ33j17pJ80N0kJ71k81O9j85J92K42j18j37J58l04
4895a23K13n8K9k37L51l16K7P9J34o2j19J34q1J52j88J83l1r6j73J50J87j10o3
4918a8j68L0K49J8o8k47K37k92L02j47kP8K15k81J66N4Q1k17Q3J44m25o9L62j75
4942i0K06k36J80pk01k5J82l2J92k27K27k52L09j37m2R1j69J16p6l4p0J01j58
4965a52J02j6J31J61q8l22M0K78j33J61k38J47J0%M4JN9j52j0J25r0j32J3j16
4989a77K73k93Q5q1J67j40J88M1r2l6J70N5k77K75q3kj22n0p6J68O2R9k46J45
$$ plain form
5013 53 -239 -63 -43 -3 -90 27 173 -100 325 188 30 -3 68 134 31 203 2 12 64 107 79 -230 -248 -106
5037 -106 -14 137 -91 50 151 -71 109 -127 22 210 60 89 -34 -60 85 31 77 76 56 60 58 -55 -71 50
5061 50 50 137 -75 190 255 -31 -17 -53 170 94 63 215 -51 43 133 -28 -479 -14 -230 -16 -65 189 146 123 -233
5086 -233 69 -10 -36 75 75 8 -16 233 97 -93 -80 104 120 77 25 15 -178 55 57 -11 -163 -173 165 40 -68
5111 -68 -52 -197 -109 146 94 6 -96 -93 -76 194 34 -141 -93 64 -33 153 -41 62 -38 -72 30 -47 103 209
5135 209 76 -70 4 -9 -202 26 112 -177 -157 -67 127 -123 89 214 -8 203 -156 -205 -61 156 62 -112
5157 -112 294 2 -55 268 67 -72 126 297 -117 -18 136 -56 -66 -169 3 -97 -255 35 35 148 -143 12
5179 12 219 -88 42 238 97 -97 -7 12 -27 -30 52 174 169 -77 -92 -67 -91 19 172 39 304 101 -76 -54
$$ packed form
5013E3k92J76K0M0q7J17J46k73M25j37j58l3P1O6j03J72k01J0N2M3k8l09j8J42
5037a06R2J51k28J41J01k22J80k36J49J88j50K9j23k6J45n4M6jk0Mkj13j6J21
5061E0%Q7k12K65O5k86J4l6K23p6l1J52k66R4R0j61m51M65k16K14m9K54m3k3l56
5086b33L02p9k6J11%o7k4K49j36j90J3J84J6m3n2j0j93K33Ko8j52j0L38j25j08
5111f8J6j45Q8K55n2q8j02LJ7K70j60j75M8J57r7J86j94J03j00l4J02p7J50J06
5135B09j33j46P4j3j93K28Q6k89K0R0J94k50K12J25k22K11l59m9J44K17r4j74
5157a12M06k92n7L23k01j39J98J71m14R9J54j92j0j03J72j00j58K90%J13k91J55
5179A2K07l07J30J96j41j94R0J9l9lQ2J22nk46j5K5k4J10J53j33K65k03j77K2
$$ plain form
5203 -54 114 43 122 119 58 233 189 -79 90 -174 -225 -4 -199 -112 -49 -137 -37 -44 -52 25 55 -73 146 195 150 27
5229 27 -27 141 140 -118 159 -91 -300 58 -110 -99 -55 123 40 -277 -69 42 285 207 77 165 74 146 59 -69
5253 -69 138 -24 -131 -13 -99 -15 -172 -242 78 50 -87 -49 -19 -12 25 -4 -36 81 -30 -58 105 103 22 -30 -70 -158
5279 -158 -52 -203 -192 -52 67 16 18 -39 -18 2 158 258 -118 1 120 135 -280 60 62 -54 -84 -115 -183 163
5303 163 -51 166 -36 -18 -173 -61 -54 -24 -44 69 127 131 74 -64 -62 -83 48 -186 -100 -103 75 125 -254 -90 61
5328 61 -83 -68 86 242 12 72 82 -103 -6 71 28 1 54 17 -92 98 -204 31 -188 -76 -15 13 -53 70
5352 70 3 29 122 86 62 104 -102 -177 -145 10 173 -228 71 -27 -31 -41 -77 -15 60 -246 -6 106 -164 61 -156
5377 -156 -108 64 90 -67 316 -63 67 36 83 34 19 59 -150 -13 21 -174 -156 -288 -141 -5 24 -101 -191 -21
$$ packed form
5203e4J68p1P9lo1J75m4k68J69k64n1K21j95Q7O3q8J00pqP7L0j28K19M9m5j23
5229B7n4J68jk58K77k50k09L58j68J1M4J78q3l17K08J11K43p8j30Q8r1P2q7j28
5253f9K07j62j07J18q6Q4j57p0L20k8j37L8L0PL7k9l2J17j11k8J63kq1n2m0q8
5279a58J06j51J1J40J19n1Kn7K1K0J56J00l76J19J19J5m15L40Kj16l0l1o8L46
5303A63k14K17k02J8j55J12PL0k0J13N8Mn7j38Kk1J31k34Q6lJ78N0l79J64J51
5328F1j44J5J54J56k30O0J0j85R7P7m3k7N3l7j09J90l02K35k19J12O1K8o6J23
5352G0o7K6R3l6k4M2k06p5L2J55J63m01K99r8mj0l6O2P5l06K40J12k70K25k17
5377a56M8J72K6j57L83l79J30l1M7m9j5M0k09J37L4j95J8j32J47J36K9j25r0J70
$$ plain form
5401 -21 245 331 -162 -62 -112 -61 81 51 -187 67 -75 -165 55 -1 -107 44 -252 -48 7 -66 -125 77 199
5424 199 165 -75 107 156 337 154 -6 -75 36 75 -145 -65 -247 -42 -114 180 15 8 80 -148 87 214 98
5447 98 83 213 -18 220 -65 92 74 -69 -81 16 -141 -81 -55 -29 -8 25 51 -137 28 -117 75 33 316 136
5471 136 66 78 54 63 26 179 -109 -142 -124 -95 -25 82 254 -304 -96 -11 -43 60 17 81 30 75 45 81 74 -53 215
5498 215 -16 -2 22 229 93 7 -52 185 -107 82 -59 -16 -137 -295 299 -15 137 146 75 0 -41 133 232 79
5522 79 -11 -18 -26 -37 -149 -104 -26 -228 -225 15 -148 -27 74 -121 26 -62 230 -115 -6 74 103 -76 56 80 -260
5547 -260 -51 -59 126 -33 109 -14 57 -57 19 256 -58 -4 239 83 33 -13 121 71 -17 -21 -103 -82 -134 -244 -226
5572 -226 32 122 -130 6 -134 -63 131 57 -63 51 144 176 46 -119 31 -116 -25 76 -200 114 118 49 -266
$$ packed form
5401b1K66Q6m93J00n0N1J42l0k38K54j42r0K20n6j06J51k96K04N5p3n9K02J22
5424A99l4k40J82M9J81j83j60o9J11L9k20Q0j82K05p2K94j65pP2k28K35J27j16
5447I8j5J30k31K38k85J57j8j43j2R7j57O0K6K6K1L3K6j88J65j45J92m2K83j80
5471A36p0J2k4Rl7J53k88l3J8K9P0J07J72n58K08Q5l2J03m3O4n1M5l0L6pj27K68
5498B15k31J4K4K07j36q6n9K37k92J89j41M3j21j58N94l14J52Rp1p5m1J74R9j53
5522G9r0pqj1j12M5P8k02LK40j63J21J01j95J47q8K92l45J09Q0K9j79J32K4l40
5547b60K09qJ85j59J42j23P1j14P6K37l14N4K43j56n0m6J34n0q8mq2K1n2j10J8
5572b26K58R0k52J36j40P1J94p4j20J14R3L2j30j65J50j47R1J01k76L14Mo9l15
$$ plain form
5595 -266 -7 -216 -254 -7 -128 175 -101 -38 -6 106 30 80 122 9 88 68 60 -27 -54 -116 -84 -110 -184 -33 45 -214
5621 -214 102 100 -57 68 49 184 56 82 128 70 40 56 258 -93 -13 134 -38 -8 -89 108 -27 -152 35 6
5645 6 60 39 -31 35 108 -59 36 -13 274 235 -99 -135 -103 -215 -17 -134 78 107 -109 88 -84 -39 70 -56 -36
5670 -36 23 77 215 119 32 -100 234 17 -251 7 -16 7 -46 53 -171 -115 33 -198 17 86 -26 92 6 63
5694 63 -9 -43 242 -183 -56 119 60 -244 118 -295 -245 20 -33 -90 -32 177 124 50 108 -60 207 103 -70 166
5718 166 48 141 -115 159 137 42 -34 49 -165 -118 -285 -13 -124 170 -144 6 -16 22 97 97 72 96 -23 47 124
5743 124 -79 -145 -24 -60 -174 -86 -160 -155 -65 169 52 -125 134 213 66 148 -124 190 112 -48 -1 101 172 44
5767 44 -89 -47 -221 -111 152 -96 -267 -133 44 -272 29 10 39 75 -27 61 -214 159 108 78 368 296 88
$$ packed form
5595b66K59k09l8K47j21L03k76O3L2J12p6N0M2j13P9k0qq7k7o2L2k6p4J51P8k59
5621b14L16kj57J25j9J35j28K6M6n8l0J6K02l51Q0J47j72L0q1J97j35j25J87k9
5645FN4k1p0O6P3j67R5m9K87l9l34l6L2j12J98j17K12K9k16J97j72M5J09j26K0
5670c6N9N4J38r6q7j32L34k17k68K58k3K3n3R9k24N6J48k31K15O9j12J18q6N7
5694F3p2l4K85m25J27J75n9l04L62m13N0K65n3n7N8K09n3p4N8j68K67j04j73K36
5718A66j18R3k56K74k2r5p6Q3k14M7j67K72j11K94l14J50k2L8P5%k5K4j19P0P7
5743A24k03o6J21l6j14Q8p4NR0K34j17j77K59P9j47Q2k72L14p8j60M7J02P1j28
5767D4j33M2j74J10K63k48j71J34J77l16L01j9K9L6j02Q8k75L73n1l0K90p2k08
$$ plain form
5790 88 -27 137 -24 -90 40 -68 -220 -128 -31 -13 -24 -26 -106 -78 87 -149 151 60 10 -60 70 -174 -33 33 -38
5815 -38 -165 17 -137 -249 -108 -5 -11 -14 47 24 132 -144 217 47 194 41 -63 -54 232 -67 59 149 71 -161
5839 -161 -79 104 113 -113 52 -112 138 -39 -134 100 28 44 -94 -103 102 78 208 -78 -94 -40 -144 -6 93 -98
5863 -98 146 -19 -9 120 61 49 -14 -21 -111 89 -130 9 113 31 -85 -31 -82 57 -187 -126 -290 -48 -49 -120 45
5888 45 -76 -110 145 -74 -45 -12 -204 13 -136 65 166 -60 197 -88 2 -7 -159 85 -234 64 -208 11
5910 11 27 67 92 116 -10 -33 239 -122 89 -144 85 43 -144 20 -248 -25 -124 -167 121 -2 -35 -82 -114 221
5934 221 -26 -29 59 225 180 100 77 263 171 104 48 -85 32 -65 -103 53 -2 46 42 -101 65 43 -25 27 167 -23
5960 -23 -73 -82 36 -43 -9 205 22 175 -50 72 -183 -30 -146 -243 -93 -11 216 -116 -146 57 136 68 105 277
$$ packed form
5790H8j15J64j61o6J30j08j52R2R7J8j1kq0K8J65k36L00r1n0p0J30k44J41O6p1
5815c8j27J82j54j12J41J03olO1k3J08k76L61j70J47j53j04RK86k99J26R0p8k32
5839a61Q2J83Rk26J65j64K50j77r5K34p2J6j38rK05k4J30k86j6N4j04J38R9j91
5863i8K44j65J0J29n9j2o3pr0K00k19J39J04q2j16N4n1J39k44O1j64K42jp1J65
5888D5j21l4K55k19K9L3j92K17j49K01J01k26K57k85R0rj52K44l19K98k72K19
5910A1J6M0K5K4j26k3K72l61K11k33K29m2j87J64k68K23r9m3K88j23l3m7l2L35
5934B21k47lQ8J66m5q0k3J86r2o7n6j33J17r7l8J56n5M8mj43J66k2o8N2J40j90
5960b3n0rJ18p9L4K14j83J53k25J22k55J53j16r7J50Q2K27l32l0K03P9o8L7J72
$$ plain form
5984 277 81 -27 8 -108 41 -57 221 143 -69 -234 -298 -167 10 -198 -12 -168 52 42 263 -35 212 80
6006 80 128 -4 25 -33 -50 54 -139 230 -54 -17 -161 -289 10 -58 -127 63 -28 -223 -61 16 68 136 354 133
6030 133 15 244 -194 197 11 4 -4 -19 -25 -136 56 -16 -155 -156 103 -28 57 196 52 27 -64 7 104 131 6
6055 6 -216 -69 19 7 -372 111 -243 -154 60 -183 22 -14 70 -149 120 -59 -179 -31 135 -13 86 27 136
6078 136 56 27 -20 -43 61 -200 -107 38 -113 -11 -15 214 -43 91 -90 54 210 -124 173 51 114 39 -142
6101 -142 27 293 21 -85 38 -64 197 -89 -22 -43 -71 -147 55 -110 -3 96 120 -24 21 -108 -210 33
6123 33 106 86 122 -19 -47 -95 76 -231 -220 67 73 31 71 68 30 -103 118 161 -59 -42 61 20 124 -107 -15 -90
6149 -90 -57 -144 -106 53 -151 -71 -262 49 -130 -185 38 77 299 133 60 190 15 127 50 -212 38 8 -86 138
$$ packed form
5984B77j96j08L5j16J49r8K78p8k12j65o4J31J77k08J86j56K20j0K21k98K47j32
6006H0M8j32K9n8j7J04j93L69k84L7j44j28K99o8o9J90r1j95J62P7N2O8K18k21
6030A33j18K29m38L91j86pqj5oj11J92p2j39jK59j31Q5J39j44k5r1P1R7K7j25
6055Fk22J47Q8j2l79M83l54Q9K14k43K05l6Q4k19K69j79j20J48J66j48R9n9J09
6078A36q0k9m7k3J04k61R3J45j51J02mK29k57J34j81J44J56l34K97j22O3p5j81
6101a42J69K66k72j06J23j02K61k86O7k1k8p6K02j65J07R9K4j44M5j29j02K43
6123C3P3k0L6j41k8m8J71l07J1K87Om2M0ll8j33K21M3k20J7J03m1J04k31R2p5
6149i0L3q7L8J59k04Q0j91L11j79n5K23L9K22j66p3J30j75J12p7k62K50l0r4K24
$$ plain form
6173 138 -174 -25 -11 234 -191 -41 -25 23 -48 -33 194 35 13 198 173 49 -35 -68 -8 -38 -33 -57 175 -205 86
6198 86 103 96 100 -29 -123 3 139 -38 -99 -51 0 51 -65 27 97 -286 155 24 -77 -72 -221 -57 155 -85 99
6223 99 -35 46 46 80 103 -49 -112 69 -16 1 -79 -72 -71 -38 -133 -133 -142 -128 -371 61 -87 49 -78 -127 136 6 39 -31
6251 -31 34 -46 -219 159 222 54 -135 27 28 -16 43 -41 -70 -76 89 13 -276 69 -136 59 1 -128 -5 98 -56
6276 -56 195 108 -86 127 189 -121 -160 -76 -160 -157 51 -92 43 -269 113 65 -111 -114 343 -126 144 -79 -111 118
6300 118 1 4 -144 44 120 30 20 -10 -206 -340 -128 -56 -111 -46 63 135 -165 203 214 -54 -107 132 -87 102
6324 102 -6 154 37 70 -73 -39 -215 65 -31 -148 -69 186 87 85 -258 -135 391 -138 70 120 15 -20 17
6347 17 228 39 107 -110 102 -2 54 20 126 -137 -40 -42 62 88 -2 -114 139 178 38 -37 146 -33 -5 287
$$ packed form
6173A38l12J49J4K45m25J50J6M8p1J5K27j59k2J85k5j24q4l3O0l0Nk4K32l80K91
6198H6J7pMj29r4J26J36j77o1M8N1N1j16R2P0l83M41j31j01Nj49J64K12k40J84
6223I9j34Q1%L4K3j52o3J81q5J7q0PJL3r5%rJ4k43M32j48J36j27m9K63j30L3p0
6251c1O5q0j73L78O3j68j89J62Jm4N9q4k9oJ65p6k89L45k05J95n8j29J23J03j54
6276e6K51q7j94K13O2l10l9Q4q4LK08j43J35l12L82m8j76lM57m69K70k23l2K29
6300A18j17Lj48J88P6r0j0l0j96j34K12P2n5O5J09P2l00L68J1k68n3K39k19J89
6324A02j08J60j17L3j43L4j76K80r6j17P9K55r9kl43J23N26n29K08N0j05l5L7
6347A7K11j89O8k17K12j04N6l4J06k63R7kJ04K6r0j12K53L9j40p5J83j79K8K92
$$ plain form
6371 287 -48 76 -76 -98 119 -53 -3 84 -77 86 -54 29 -100 85 123 58 26 126 72 -20 5 77 79 -216
6395 -216 -33 90 -181 -70 123 107 107 5 -9 107 44 -151 170 -223 107 242 39 162 69 5 26 -2 138
6418 138 -115 11 -32 -107 117 -103 -119 197 -28 27 178 -129 84 237 104 54 98 31 80 20 48 -18 36 111
6442 111 40 19 -230 69 -80 -147 -19 -78 85 142 167 18 56 76 75 -46 -16 -60 190 100 58 -90 44 -65 -168
6467 -168 56 -108 95 -91 14 -36 124 71 215 107 -5 262 74 79 -77 56 96 58 246 104 -64 105
6489 105 -217 16 6 -131 -53 -65 -16 -46 -87 -9 11 6 47 -87 185 41 49 47 118 -34 -29 124 60 50 -21 51 29 54
6517 54 -161 -20 186 19 -195 -60 -95 39 -10 156 8 -26 193 -159 -34 3 12 -27 -237 -105 -31 -1 -49 188
6541 188 -24 62 227 121 -17 -41 -128 211 -91 -38 56 57 -29 17 -184 -42 20 11 196 37 -1 -50 156 -117 60
$$ packed form
6371B87l35J24j52k2K17j72N0Q7j61J63j40Q3j29J85L8o5l2J00n4r2K5P2Kk95
6395b16J83J23k71J11J93j6%j02j4J16o3j95L21l93L30J35k03J23r3o4K1k8J40
6418A38k53J26m3p5K24k20j6L16k25N5J51l07K13J53j33n0M4o7M9o0K8o6N4P5
6442A11p1k1k49K99j49o7J28n9J63N7K5j49L8K0jj21L0m4K50r0m2j48J34j09j03
6467a68K24j64K03j86J05n0J60n3J44j08j12K67j88Nj56J33M0l8J88j42j68J69
6489A05l22K33j0j37P8j2M9l0m1P8K0nM1j34K72j44QkP1j52NJ53o4j0p1P2k2K5
6517E4k15J41K06j67k14J35l5J34m9J66j48l4K19l52J25L7Rl9k10J32P4L0m8K37
6541A88k12Q6J65j06j38k4q7L39l02N3R4Jq6M6k01J42O2rJ85j59l8m9K06k73J77
$$ plain form
6566 60 15 -160 244 130 168 25 7 29 -107 36 -99 -33 -132 -23 -173 -1 -151 -84 169 -156 -19 -39 -17
6589 -17 63 -83 229 77 -20 104 102 -9 -147 -112 130 -38 -33 -211 10 -48 64 49 101 61 185 131 37 34 96 -170
6615 -170 41 -22 -37 -125 -185 -38 6 -93 -272 -204 -97 86 89 79 -126 192 159 52 181 148 -317 -60 -5 151
6639 151 74 79 -113 -41 -126 -253 -132 -113 -22 234 79 -164 55 -21 -13 -24 -61 103 -48 -131 80 -30 81 22 -52
6664 -52 121 3 -155 -94 141 25 -153 -104 61 202 -71 34 -6 82 74 180 170 156 203 144 26 -169 2 -28
6688 -28 -27 -159 -177 -168 122 136 41 -183 20 84 46 197 -62 25 65 103 42 -50 70 -18 27 -61 9 -24 -55 -240 -11
6715 -11 -32 -1 -169 -116 106 -21 188 51 -88 54 178 -207 102 -16 -128 65 -131 -17 -142 -228 -43 -65
6737 -65 -90 -43 -109 46 11 160 5 265 -18 31 -254 -146 -28 77 -79 -105 97 -150 -77 84 -195 -60 -113
$$ packed form
6566F0m5j75M04j14L8j43j8K2j36J43j35O6r9J09j50J72j50O7K53l25J37k0K2
6589a7Q0j46L12j52r7J24kj11j38L5K42j68Nj78K21n8J12j5N2m0J24n4r4lO2k66
6615a70K11o3j5q8o0J47M4r9j79O8J07J83Lj0k05L18l3j07J29l3m65K57N5J56
6639A51p7Nj92P2q5j27J21J9R1K56j55k43K19p6Qj1l7J64j51q3K11j10J11n9p4
6664e2J73j18j58O1K35j16j78M9J65J41k73J05m0Q8qJ06j0j4M7n9j18j95J71l0
6688b8Jj32j8RK90J4r5k24K03O4l8J51k59Q7M0L8o1r2J20q8M5q8P0l3l1j85K29
6715a1k1L1j68N3K22j27K09j37j39J42J24l85L09j18j12J93j96J14j25q6J85k2
6737f5k5M7o6J55l5J49j55K60k83M9k85J08J18J05j56k6K02k47P3J61k79J35n3
$$ plain form
6760 -113 -120 -104 24 170 63 -17 -28 20 -65 83 0 43 -32 -88 -14 -98 -58 102 -141 -53 -70 -129 -22 27 63 168
6786 168 -89 -218 21 183 186 130 43 -163 -94 -226 -299 -96 -141 71 -145 88 67 -82 -86 27 123 -114 57 79
6810 79 105 -3 265 75 131 -173 88 -7 -37 -39 -47 -151 32 10 -138 165 141 10 74 90 118 -148 -5 106 88
6835 88 6 20 106 135 -60 63 -71 -155 -158 -114 26 -20 -98 25 -41 -94 -76 60 99 159 152 53 -69 68 115 -41 180
6862 180 70 -107 -131 119 124 -6 -21 -162 -51 39 -43 121 29 -73 41 -73 201 124 132 264 -99 124 35 -28
6886 -28 -168 -62 225 -58 -91 -90 97 -123 -124 -48 -59 -206 203 93 171 -76 -111 60 -133 -12 7 -73 79 118
6910 118 69 -61 -58 -71 142 138 -87 -110 50 -42 1 -7 30 119 -95 304 309 119 -90 40 162 -130 -239 -208 -211 -84
6936 -84 13 44 -128 -137 -11 -126 -123 202 294 108 -112 10 -146 106 9 220 105 -88 -167 36 35 -36 29 -121 -1
$$ packed form
6760a13pJ6J28J46j07q0j1M8q5J48q3M3p5n6P4q4M0J60k43Q8j7n9J07M9L6J05
6786A68k57j29K39J62Ln6q7k06O9j32p3K03m5K12k16K33k1j49mJ13R6k37J71K2
6810G9K6j08K68j90N6l04K61r5l0kqj04J83k2j48L03k4j31O4J6K8k66J43J11j8
6835H8q2J4Q6K9j95J23j34q4lM4J40m6p8J23o6n3J8J36L9O0pr9j22J37M7j56K21
6862A80j10j77k4K50Nj30j5j41J11R0q2J64r2j02J14j14K74p7QJ32l63K23q9o3
6886b8j40J06K87k83l3JJ87k20jP6j1j47M09j10P8k47l5J71j93J21J9q0J52L9
6910A18m9j30Lj3K13mk25k3J60r2M3qL7Q9k14L99Nj90k09J30J22k92j09L1lJ27
6936h4R7L1j72rJ26j15LL25R2j86k20J22j56K52r7K11j15j93p9K03jp1O5j50J20
$$ plain form
6961 -1 -149 -63 101 263 8 55 -30 -56 100 -97 219 -29 56 14 27 85 171 -225 73 44 68 3 -67 -40 -47 63
6987 63 77 62 39 77 33 91 -24 -62 170 -79 -20 -414 76 -179 -7 180 -296 88 -144 112 34 48 97 -139
7011 -139 -245 50 124 -170 216 112 -74 88 -76 -30 -47 -106 121 120 -206 -53 135 60 110 25 102 -61 236
7034 236 20 178 -84 194 125 -56 33 -102 142 -181 -50 1 -97 -116 -116 -100 4 -155 -7 54 154 372 106
7057 106 58 5 104 -18 41 -260 -122 -95 -84 -125 -109 -88 -64 -247 -193 -13 87 27 89 -91 101 77 -41 75 226
7082 226 -152 -76 -94 -99 85 12 188 90 -128 -14 75 -249 -79 -89 -29 -171 42 -207 138 164 242 267 3 -77
7106 -77 185 -48 6 -77 -28 -84 -50 -108 3 69 147 -161 59 186 69 -63 -2 322 18 -173 7 -61 99 136
7130 136 -128 161 -147 -121 -197 88 -45 33 64 -70 44 -104 89 -140 195 -72 88 100 -35 223 136 184
$$ packed form
6961aj48Q6J64J62k55M7q5k6J56j97L16k48Q5m2J3N8Q6l96K98k9K4o5p0K7pJ10
6987F3J4j5k3L8m4N8j15l8K32k49N9l94M90k55J72J87m76L84k32K56p8J4M9k36
7011a39j06K95P4k94L86j04j86J62j64M6j7n9K27jl26J53J88p5N0q5P7j63K97
7034B36k16J58k62K78o9j81Q9j35K44l23J31N1r8j9%J6J04j59J48O1J00K18k66
7057A06m8n3R9j22N9l01J38K7J1m1J6K1K4j83N4J80J00o0O2j80J92k4j18J16J51
7082B26l78P6j8nJ84p3J76r8k18J14Q9l24J70j0O0j42K13k49L45K6P8K5k64q0
7106g7K62k33N4q3M9n6L4n8J11O6P8l08K20J27j17j32O1L24l04j91J80o8J60L7
7130A36k64K89l08K6p6K85j33P8L1j34J14j48J93k29L35k67J60J2j35K58q7M8
$$ plain form
7152 184 213 136 48 -50 128 -153 -81 -79 328 -146 19 -62 14 -118 95 -78 5 -42 -39 19 -175 10 148 112 -53
7177 -53 -146 -102 68 -123 -48 29 -47 38 -84 -102 -57 -98 -143 -28 115 71 117 60 -10 192 19 5 -117 123 -47
7202 -47 89 -244 -44 -240 -25 -93 -44 39 -139 -21 -176 60 10 113 59 72 64 151 66 68 -152 -45 82 21 70
7227 70 -64 -62 18 -125 54 -115 37 52 -143 144 91 102 41 207 123 -57 188 -48 7 -178 241 75 -111
7250 -111 -37 -22 -145 -33 -111 43 -29 -31 161 -65 4 -87 -106 56 -52 151 -23 -14 -294 -234 -41 -158 49 -324
7274 -324 -60 -195 9 45 -75 -24 -45 -14 202 -1 61 234 160 -243 152 33 9 31 -10 151 130 -300 42
7297 42 -131 -16 -86 -97 98 44 74 -25 105 19 -19 35 62 -51 -176 -55 -21 -161 107 -127 119 -97 -48 118
7321 118 80 74 127 168 -49 116 -114 -94 193 190 -67 77 88 -45 52 92 53 16 -82 44 24 -82 89 -9 43 254
$$ packed form
7152A84K9p7q8r8J78k81P2KM07m74J65q1P6j32K13j73Q3m7LN8j94J85J38l6j65
7177e3r3M4J70j91P5P7p6Q5j22j8M5m1m5J15J43m4M6n7p0K02j73j4j22K40j70
7202d7J36l33K00j96K15o8M9Q3j78J18j55K36n0J03n4J3qQ7q5Kk20J07J27o1M9
7227G0j34KQ0j43J79j69J52J5j95K87n3J1o1J66q4j80K45k36N5j85M19j66j86
7250a11P4J5j23J12p8J54p2kJ92k26O9r1j9J62j08K03j74Rk80O0J93j17K07l73
7274c24K64j35K04L6j20N1k1L1K16k03O2J73p4m03L95j19k4K2m1J61k1m30L42
7297D2j73J15p0j1J95n4L0r9J30q6l8N4K7j13j25J21L4j40K68k34K46k16M9J66
7321A18l8oN3M1k17J65k30K0K87lk57J44J1j33R7M0l9l7r8J26k0j06J71r8N2K11
$$ plain form
7347 254 -94 -124 130 64 -40 14 215 -29 -7 -59 -82 -211 -112 -244 -118 -14 -204 4 51 -110 -54 99 -103
7370 -103 -28 -16 -18 69 -125 -3 -79 -8 10 -72 -42 -34 -11 -17 74 63 67 -144 180 -26 -21 256 87 37 87 262 -30 -15
7398 -15 66 124 -60 5 124 -58 -197 25 -157 -47 76 -41 111 48 81 -137 -90 127 -174 24 49 18 131
7421 131 273 -6 152 3 102 -129 -100 -150 -253 -21 71 109 192 45 -208 9 35 103 -78 41 147 -182 -11
7444 -11 67 22 116 -43 -33 118 -214 -31 -151 -48 -179 129 194 -206 -58 24 -86 101 -85 152 -62 -164
7466 -164 84 -121 -166 75 -83 -3 -15 -81 48 20 -186 -116 -30 118 45 2 -17 -134 119 -31 113 131 169 209
7490 209 85 -56 52 -200 -72 -189 -98 49 -79 -288 -184 -4 107 -135 -13 26 -30 129 -25 -71 -75 69
7512 69 -101 -70 120 164 -270 -2 17 -41 15 -93 -82 -44 -222 -56 71 -66 149 232 108 129 -66 -43 112 42
$$ packed form
7347B54l48l0K54o6j04N4K01k44K2n2k3j29R9j32J26J04j90K08M7j61N6J53k02
7370a03P5J2kQ7j94J22p6P1J8q2L0QK3oR1j1Mk11L24k06NK77j69n0N0J75k92J5
7398a5Q1N8j84O5J19j82j39K22j82J10J23j17J52o3L3k18M7K17l01J98K5l1J13
7421A31J42k79J58j49R9k31K9n0j03K32R2L8Q3j47k53K17K6O8j81J19J06l29J71
7444a1P8m5R4j59J0J51l32J83j20J03j31L08O5m00J48Q2j10J87j86K37k14j02
7466a64K48k05m5K41j58Q0j2o6J29k8k06P0Q6J48p3m3j9j17K53j50J44J8L8M0
7490B09j24j41J08k52J28j17R1J47j28k09J04J80J11k42J22L9n6J59j54m6mJ44
7512F9j70L1J90M4m34K68J9n8N6j08J1L8j78J66J27j37K15Q3j24K1j95K3J55p0
$$ plain form
7536 42 90 71 -11 -80 123 -127 -18 228 -98 -126 135 -13 70 9 185 -96 -30 95 114 48 43 152 -209 -101
7560 -101 -8 145 -176 5 63 -186 125 -175 -168 -12 123 -107 37 6 138 109 106 54 52 211 231 -41 167 183
7584 183 63 51 54 51 257 -25 -99 109 -173 172 158 -71 -33 -8 -27 39 176 87 54 0 31 28 -61 -8 -203 -10
7610 -10 52 -80 -128 166 102 23 -95 117 55 154 171 -110 111 50 -75 107 -81 115 -21 -150 -160 -136 -148 -207
7634 -207 41 -58 65 96 215 45 88 78 62 80 37 94 297 -160 -75 80 -132 40 -20 -229 12 150 359
7657 359 -46 -52 -71 239 178 105 73 119 9 102 111 18 68 13 -188 -415 12 -17 -22 107 -129 57 -149 103 123 -9
7683 -9 -54 -71 -24 -140 -64 -62 -31 188 -6 16 144 237 -41 -101 -127 20 -49 -51 8 -49 -6 -78 -36 94 -50 72 -9
7710 -9 186 -29 40 -73 -151 119 -91 54 -33 106 -213 64 -71 -126 162 123 -10 92 84 -86 101 63 -165
$$ packed form
7536D2M8j9q2o9K03k50J09K46l26k8K61j48Q3o1J76k81O6J25J9o6nJ09l61J08
7560a01R3J53l21J81N8k49L11l00PJ56J35k30J44l1J32k9ln2kJ59K0k72K08J6
7584A83j20j2LlK06k82p4K08k82L45j4k29L8K5j9O6J37q9l3n4L1lq9N3j95J93
7610a0O2j32m8K94o4p9j18K12o2R9J7k81K21o1j25J82j88J96j36j29j0K4j2n9
7634b07K48r9J23L1J19j70M3j0j6J8m3N7K03m57Q5J55k12J72o0k09K41J38K09
7657C59m05oj9L10o1p3l2M6j10R3Rr3N0n5k01k27M27k9nJ29k36J86k06K52K0j32
7683im5j7M7j16P6KL1K19j94K2J28R3k78o0k6J47o9kN9n7M3p2M2J30j44J22q1
7710iJ95k15O9j13p8K70k10J45q7J39l19K77j35n5K88l9j33J02qj70J87l8k28
$$ plain form
7733 -165 223 69 34 -25 116 -35 -96 -137 64 -231 -57 86 -48 -26 156 -160 100 -77 -8 83 179 259 241
7756 241 115 380 -36 -196 16 107 -192 46 6 -113 -27 -50 104 -33 69 113 137 80 36 -175 186 60 57
7779 57 63 -181 -130 81 111 -26 -110 82 -96 -304 -115 -42 -105 -62 -37 -73 103 -20 95 118 186 204 24 -131 29
7804 29 6 176 11 -127 -157 -55 106 3 -34 -27 -74 95 130 -76 -26 229 177 26 -4 -61 58 -25 94 -40
7828 -40 7 -106 -131 -259 -175 60 -66 -24 -26 181 145 60 -300 180 -32 37 -194 131 75 -80 -243 1 -116 161
7852 161 44 -108 95 -153 -183 -103 131 -145 110 34 -91 99 166 -118 66 49 71 162 60 39 53 -99 24
7875 24 -100 -104 158 149 4 50 6 -156 12 12 39 270 -169 72 13 215 -101 66 39 -75 36 -85 157 19
7899 19 66 -57 -226 -92 203 25 130 -164 46 57 -88 192 -158 204 -246 -61 226 -30 -16 -259 -68
$$ packed form
7733a65L88j54l5n9J41j51o1m1K01k95J74J43j34K2J82l16K60j77O9R1R6Q0j8
7756B41j26K65m16j60K12R1k99K38m0j19Q6k3J54j37J02M4K4n7m4k11L61j26l
7779E7Ok44N1K11L0j37q4J92j78k08J89P3o3M3K5l6J76j23J15K3O8J8j80j55J60
7804B9k3J70j65j38l0J02J61j03l7Pm7J69L5k06N0K55n2j51l0n7J19q3J19j34
7828d0M7j13k5j28Q4K35j26M2kK07l6q5l60M80k12O9k31L25n6j55j63K44j17K77
7852A61j17j52K03k48l0Q0K34k76K55p6j25J90O7k84J84j7K2R1j02k1J4j52J23
7875B4j24mK62rj45M6m4j62J68%K7K31m39K41n9K02l16J67k7j14J11j21K42j38
7899A9M7j23j69J34K95j78J05k94K10J1j45K80l50L62m50J85K87k56J4k43J91
$$ plain form
7920 -68 73 -33 -137 -34 -147 102 91 49 3 -97 186 -66 -73 40 -113 2 151 40 -11 -61 -121 -37 -137
7943 -137 89 -92 190 204 170 239 -9 -62 154 -27 -11 33 249 -37 0 171 101 33 -77 -105 -219 -150 -97 -182
7967 -182 -12 30 1 -156 98 149 -55 59 86 27 72 -146 -39 32 61 -83 55 -211 -293 -143 37 105 -33
7990 -33 -101 -147 -67 -178 160 -7 -107 166 -118 -2 210 98 45 165 102 -22 38 -91 -9 -99 -40 -114 -55 56
8014 56 -90 -18 -70 36 68 -184 208 14 205 89 -82 101 318 79 -64 67 198 -41 -30 57 13 -162
8036 -162 36 -38 -93 -171 231 172 -92 35 -53 -106 242 167 235 64 -147 -12 28 131 -181 -22 -164 -71 -86 68
8060 68 37 -101 -62 205 45 -202 104 -45 -32 108 -33 -143 15 -2 -27 -32 105 26 203 -59 -54 118 -166 -28
8084 -28 131 -25 69 83 228 38 -96 -122 269 137 -47 -75 -64 -115 48 181 -10 74 -122 72 -42 54 33
$$ packed form
7920f8J41j06j04J03j13K49j1m2m6j00K83k52pJ13j53J15J49j11n1n0o0Q4j00
7943a37K26j81K82J4l4O9k48n3K16j81J6M4K16k86L7J71p0o8j10k8j14O9N3q5
7967a82J70M2k9j57K54N1k04J14K7n9M5k18J07P1K9j44J38k66q2J50J80O8j38
7990c3o8m6Q0j11L38j67j00K73k84J16K12j12n3J20o3j24O0j29Q2r0N9p4N9J11
8014E6j46P2n2J06L2k52L92j94J91j16j71J83K17k39j43J31J31k39J1Q7m4j75
8036a62J98p4n5p8M02n9k64J27q8n3L48p5O8j71k11J35M0J03l12J59j42R3j5J54
8060F8l1j38L9K67j60k47L06j49J3J40j41j10J58j7k5nJ37p9J77k62NJ72k84J38
8084b8J59j56R4J4J45j90j34k6L91j32j84k8J1n1J63J33j91Q4j96J94j14R6k1
$$ plain form
8107 33 78 11 45 179 65 70 83 -118 143 56 39 -75 -245 -119 -252 -247 -59 -208 -30 -101 -91 54 -1 1 20 121
8133 121 -200 45 200 -22 285 121 -85 -78 -60 -25 -21 -160 -2 -252 -47 -101 31 116 -55 -56 57 -15 92 -82
8157 -82 -30 1 92 152 -43 -13 45 42 32 135 -117 197 -52 50 94 -86 107 203 162 -41 64 256 217 125 129 207
8183 207 131 1 127 9 30 41 32 -268
$$ packed form
8107C3M5o7L4J34j14NJ3k01K61q7j7j14j70J26j33NJ88j49J78p1J0J45n5KJ9J01
8133A21l21K45J55k22L07j64k06PJ8L5Mj39J58k50K05n4J32Q5j71jJ13p2J07j74
8157h2N2L1R1O0j95L0N8lj0J03k52L14k49J02M4j80J93R6m1k03J05J92l9r2MP8
8183B07p6j30J26j18K1J1rl00
8191b68
$$ Imaginary data points
##PAGE= N=2
##DATA TABLE= (X++(I..I)), XYDATA
$$ plain form
0 0 0 0 0 0 0 0 0 0 0 0 8 -8 8 -16 16 -24 24 -32 40 -48 56 -64 80 -89 105 -126 145 -169 193 -223 255 -290
32 -290 331 -374 420 -473 532 -597 666 -744 829 -919 1019 -1130 1250 -1381 1524 -1680 1852
49 1852 -2041 2249 -2476 2729 -3012 3327 -3685 4090 -4555 5098 -5737 6502 -7441 8624
63 8624 -10168 12272 -15328 20192 -29135 50993 -221757 -88268 449628 39147 -373900
74 -373900 -131363 323550 147451 -201184 -137777 175455 159316 -60485 -122017 42528 121415
85 121415 18269 -121741 -65424 99601 98648 -125164 -180956 73599 207667 -73513 -274371
96 -274371 9194 301585 58260 -280857 -95806 279011 173558 -185823 -158319 149971
106 149971 167074 -86099 -155421 10951 91979 1516 -82945 -53706 32566 59030 -26179
$$ packed form
0@%%%%%%%%%%Qj6J6k4L2m0M8n6P2q8J04j20J44j69J94k31K71l14L62m16M78n45
32b90O21p05P94q93J005j129J263j410J573j748J938k149K380k631K905l204L532
49A852l893M290m725N205n741O339p012P775q645R653j0835J2239j3943J6065
63H624j8792K2440k7600L5520m9327Q0128k72750J33489N37896m10481m13047
74c73900K42537M54913j76099l48635O3407L13232j6139k19801o1532J64545P8887
85A21415j03146j40010N6317J65025r53k23812n5792K54555J34068k81180k00858
96b74371K83565K92391k43325l39117J85051L74817j05453l59381K7504L08290
106A49971J7103k53173o9322J66372Q1028r0463q4461K9239Q6272K6464q5209
$$ plain form
117 -26179 -85515 19905 125987 9435 -136380 -10792 180798 57375 -185219 -89936
127 -89936 189300 137545 -165790 -181183 110338 186765 -69080 -198506 -737 162158 38398
138 38398 -128025 -71193 85305 93734 -31366 -81085 14679 92753 18162 -88157 -34554
149 -34554 91002 47289 -106463 -78284 103521 96013 -111713 -131711 98292 164717 -63801
160 -63801 -178954 24986 182537 23355 -164518 -65353 132658 96675 -88108 -108952 43775
171 43775 103934 -9457 -90526 -16212 72806 31160 -57190 -40008 49063 50450 -43462 -63404
183 -63404 39345 82475 -30241 -105361 8823 120045 16240 -131506 -54554 119816 84070
194 84070 -97034 -104170 69600 122012 -21463 -107787 -7754 91924 33829 -67732 -50565
$$ packed form
117b6179n9336J05420J06082j16552j45815J25588J91590j23423k42594R5283
127h9936K79236n1755l03335j5393K91521P6427k55845j29426J97769J62895j23760
138C8398j66423N6832J56498Q429j25100m9719R5764P8074p4591j06319N3603
149c4554J25556m3713j53752K8179J81805p508k07726j9998K30003O6425k28518
160f3801j15153K03940J57551j59182j87873R9165J98011l5983j84783k0844J52727
171D3775O0159j13391q1069P4314Q9018m1646q8350J7182Q9071J387r3912j9942
183f3404J02749M3130j12716p5120J14184J11222j03805j47746P6952J74370l5746
194H4070j81104p136J73770N2412j43475q6324J00033R9678n8095j01561J7167
$$ plain form
205 -50565 37393 46992 -25895 -53559 4178 43698 -2759 -49629 -4627 59765 20943 -62256
217 -62256 -29441 79189 63408 -69579 -82524 62319 107314 -38577 -121151 2456 109809
228 109809 18215 -103183 -54317 63542 57548 -37679 -60693 10847 58689 19560 -36217 -19438
240 -19438 39600 38322 -24407 -35290 29451 42696 -36113 -62512 26230 66560 -32867 -95911
252 -95911 5481 97092 10565 -100371 -34204 92229 63043 -58232 -62802 40980 75469
263 75469 818 -55563 -20890 39000 34930 -24538 -50681 -2440 39619 -1665 -51848 -12996
275 -12996 46019 8432 -52946 -7094 69363 24151 -65139 -24995 78846 53247 -62491 -63986
287 -63986 46760 74189 -24530 -80919 -12950 59250 26978 -49581 -53685 16316 55492 6798
$$ packed form
205e0565Q7958R599p2887k7664N7737L9520m6457m6870M5002O4392l8822q3199
217f2256L2815J08630j5781j32987j2945J44843M4995j45891q2574J23607J07353
228A09809r1594j21398M8866J17859n994r5227k3014P1540M7842l9129n5777J6779
240a9438N9038j278o2729j0883O4741J3245p8809k6399Q8742M0330r9427o3044
252i5911J01392R1611q6527j10936O6167J26433k9186j21275m570J03782L4489
263G5469p4651n6381L4673N9890m070n9468k6143M8241M2059m1284n0183L8852
275a2996N9015l7587o1378M5852P6457m5212q9290M0144J03841k5599j15738j495
287f3986J10746K7429r8719n6389O7969P2200l2272p6559m104P0001L9176m8694
$$ plain form
299 6798 -51807 -20935 51341 40529 -34585 -35429 39212 45116 -32457 -42277 36670 46618 -42100
312 -42100 -61913 30498 63656 -28458 -79946 3181 75761 17086 -67699 -38466 52607 60230
324 60230 -21245 -60986 1173 65777 28837 -50500 -42622 37161 50150 -26867 -56166 12333
336 12333 48783 -14573 -53792 8353 52026 -9881 -58968 5597 66575 7969 -65030 -18166
348 -18166 65543 39856 -48224 -50605 29763 59113 -4134 -57719 -21961 44441 38147 -31335
360 -31335 -52972 9390 52280 3186 -50831 -14500 43819 19156 -37635 -17663 38739 21129
372 21129 -36434 -19759 42226 29970 -39576 -38646 34115 48531 -22512 -57347 460 52901
384 52901 16562 -47272 -38593 26494 48140 -7515 -52200 -12275 50204 30656 -37604 -35516
$$ packed form
299F798n8605L0872P2276j0812p5114q44P4641N904p7573r820P8947R948q8718
312d2100j9813R2411L3158r2114n1488Q3127P2580n8675q4785K9233R1073P623
324F0230q1475l9741O2159O4604l6940p9337P878P9783J2989p7017k9299O8499
336A2333L6450o3356l9219O2145M3673o1907m9087O4565O0978n8606p2999M6864
348a8166Q3709k5687q8080k381Q0368K9350o3247n3585L5758O6402o294o9482
360c1335k1637O2362M2890m9094n4017L6331N8319k4663n6791J9972N6402j7610
372B1129n7563J6675O1985j2256o9546R30P2761J4416p1043l4835N7807N2441
384E2901l6339o3834Q679O5087K1646n5655m4685L9925O2479j9548o8260K088
$$ plain form
396 -35516 31588 42161 -20015 -36503 19164 36333 -18150 -37222 16415 36573 -19430 -48408
408 -48408 7012 48029 152 -51807 -17047 46188 34061 -29594 -40574 16765 50643 9464
420 9464 -41796 -22553 35416 36600 -22629 -43124 7276 37959 -4454 -40041 -4811 30471
432 30471 -514 -32568 -176 33411 1767 -33708 -1832 41904 17335 -32908 -22137 30489
444 30489 36300 -13901 -41486 -5008 36168 16403 -34729 -36634 14294 36758 -5405 -40474
456 -40474 -8740 35826 18565 -24890 -15646 25227 20817 -15871 -12384 21473 15390 -21344 -17543
469 -17543 20446 19571 -22499 -32142 7662 29480 -2284 -35065 -16161 27162 28506 -13705 -32264
482 -32264 5617 41202 15921 -29068 -19134 25524 27039 -15633 -27886 5374 19649 -7856
$$ packed form
396c5516O7104J0573o2176j6488N5667J7169n4483j9072N3637K0158n6003k8978
408d8408N5420M1017m7877n1959L4760O3235j2127o3655j0980N7339L3878m1179
420I464n1260J9243N7969J184n9229k0495N0400L0683m2413l5587L5230L5282
432C0471l0985l2054L2392L3587l1644l5475L1876M3736k4569n0243J0771N2626
444C0489N811n0201k7585L6478M1176j9765n1132j905N0928K2464m2163l5069
456d0474L1734M4566j7261m3455R244M0873m410l6688L487L3857o083l6734L801
469a7543L7989q75m2070r643L9804K1818l1764l2781J8904M3323J344m2211j8559
482c2264L7881L5585k5281m4989R934M4658J515m2672j2253L3260J4275k7505
$$ plain form
494 -7856 -22338 1352 14561 -8098 -19820 5903 22578 -3117 -24760 326 30972 14898
506 14898 -22277 -18735 19525 30970 -3965 -32095 -9737 27337 17697 -24859 -30808 8510 26269
519 26269 -5059 -27919 -4509 21424 7635 -13845 -3346 15543 6511 -10242 -431 17107
531 17107 5924 -17248 -10298 17041 16072 -15848 -25704 3769 24938 2204 -28425 -17247 18976
544 18976 23344 -9997 -26857 1275 28472 11723 -18750 -11933 16942 16824 -7768 -12479 5561
557 5561 8833 -7355 -9722 5031 6288 -10497 -13944 6006 15470 -4186 -20718 -2944 22622
570 22622 13612 -16927 -18594 12741 26679 980 -23307 -7328 21052 15925 -14094 -20552 4647
583 4647 16797 -2292 -17563 -4937 9308 950 -9208 -482 9331 -177 -9307 2538 15893
$$ packed form
494g856j4482K3690J3209k2659j1722K5723J6675k5695k1643K5086L0646j6074
506A4898l7175L542L8260J1445l4935k8130K2358L7074r640m2556n949L9318J7759
519B6269l1328k2860K3410K5933j3789k1480J0499J8889r032j6753R811J7538
531A7107j1183k3172O950K7339r69l1920r856K9473K1169k2734l0629J1178L6223
544A8976M368l3341j6860K8132K7197j6749l0473O817K8875j18k4592m711J8040
557E561L272j6188k367J4753J257j6785l447J9950R464j9656j6532J7774K5566
570B2622r010l0539j667L1335J3938k5699k4287J5979K8380n127l0019o458K5199
583D647J2150j9089j5271J2626J4245q358j0158Q726R813r508r130J1845J3355
$$ plain form
596 15893 4782 -13623 -6955 16214 16828 -9718 -21348 1600 22207 5031 -22854 -16703 13059
609 13059 17369 -8927 -21915 -1496 17826 6781 -12073 -6869 10816 9688 -3920 -3511 7677
622 7677 5266 -6488 -3832 9030 5719 -11951 -13431 6105 13717 -5707 -20889 -5624 17513
635 17513 11456 -14207 -16623 9492 22405 2246 -16708 -4854 16960 12220 -8531 -11576 4032
648 4032 9377 -2730 -9745 -1850 3464 -4466 -7751 2166 6464 -4924 -10910 3340 15741 4508
662 4508 -12657 -5842 15458 16313 -6506 -17080 1668 18868 5232 -17787 -14086 8275 12008
675 12008 -7307 -16028 -1354 10482 2284 -7887 -1905 7183 3905 -2607 2167 8809 2329 -7302
689 -7302 -1261 11083 6020 -11354 -12637 6186 12836 -5132 -19496 -6074 13629 9013 -11852
$$ packed form
596A5893j1111j8405O668K3169O14k6546j1630K2948K0607j7176k7885O151K9762
609A3059M310k6296j2988K0419J9322j1045j8854N204J7685j128j3608M09J1188
622G677k411j1754K656J2862l311j7670j480J9536P612j9424j5182J5265K3137
635A7513o057k5663k416K6115J2913k0159j8954J1854K1814m740k0751l045J5608
648D032N345j2107p015P895N314p930l285R917M298j1388n986J4250J2401j1233
662D508j7165O815K1300Q55k2819j0574J8748J7200j3636k3019L701K2361L733
675A2008j9315q721J4674J1836q198j0171N982R088l278o512M774O642o480r631
689g302O041J2344n063j7374j283J8823O650j7968j4364J3422J9703m616k0865
$$ plain form
702 -11852 -14031 6425 17097 2434 -11443 -2273 12684 8535 -5016 -5218 4098 3942 -3969 -4508
716 -4508 2043 472 -8031 -6559 4865 6208 -6766 -11504 2917 14284 3471 -12284 -5932 13459
730 13459 14229 -4962 -12949 2173 14761 4140 -11898 -8978 5608 7097 -5684 -9804 -757
743 -757 4080 -1580 -4770 1278 3949 -1715 -3149 5176 8733 -344 -7639 794 12013 5913 -9832
758 -9832 -10062 6129 11872 -3373 -15378 -5161 10239 5892 -9802 -10762 3491 9736 365 -6850
772 -6850 -390 7150 4066 -1785 349 4529 1025 -3576 528 5458 -144 -8713 -4877 6013 4918
787 4918 -7822 -11567 1433 11279 1992 -11164 -5943 10317 11199 -3452 -9094 2620 11382 3427
801 3427 -6494 -3715 4643 3349 -3538 -4076 59 -237 -4101 -2679 2460 1001 -5386 -4340 5073 8159
$$ packed form
702a1852k179K0456J0672j4663j3877R170J4957m149j3551k02R316j56p911n39
716d508O551j571q503J472J1424J343j2974m738J4421J1367j0813j5755O352J9391
730A3459P70j9191p987J5122J2588j0621j6038K920J4586J489j2781m120R047
743g57M837n660l190O048K671n664j434Q325L557r077p295Q433J1219o100j5745
758i832k30J6191N743j5245j2005J0217J5400m347j5694r60J4253O245r371p215
772f850O460P540l084n851K134M180l504m601M104M930n602q569L836J0890j095
787D918j2740l745J3000R846r287j3156N221J6260Q82j4651n642J1714Q762p955
801C427r921K779Q358j294o887n38M135k96l864J422N139j459o387J046R413L086
$$ plain form
817 8159 -1409 -7556 912 11818 6492 -7231 -7445 6311 10755 -1968 -11639 -3417 7560 3177
831 3177 -8048 -7170 1874 3848 -1839 -3745 598 2977 73 -206 3654 4184 -541 -2658 3111 7252
847 7252 971 -7671 -4251 6270 5044 -7391 -11370 453 8834 -14 -10580 -5404 7379 7664
861 7664 -3011 -5779 2807 7925 2455 -2542 313 3017 1087 -1936 -431 1061 -1980 -4745 -1804
876 -1804 2845 674 -6372 -5892 3295 7343 -1487 -8475 -270 10878 6544 -5634 -5599 6434 9664
891 9664 -769 -7922 -1494 5439 1295 -5579 -4703 459 662 -2952 -2637 806 993 -1808 -712 4334
907 4334 4782 -1010 -3591 2895 8324 2337 -6954 -3900 6869 6511 -5594 -10300 -44 7312 -344
922 -344 -9598 -4969 4556 4680 -3095 -4006 2101 5077 1708 -565 1870 3495 516 -1231 1577 3116
$$ packed form
817H159r568o147Q468J0906n326j3723k14J3756M444j2723r671Q222J0977m383
831C177j1225Q78R044J974n687j906M343K379k904k79L860N30m725k117N769M141
847G252o281q642L420J0521j226j2435l979J1823Q381q848j0566N176J2783K85
861G664j0675k768Q586N118n470m997K855K704j930l023J505J492l041k765K941
876a804M649k171p046M80R187M048q830o988Q205J1148m334j2178L5J2033L230
891I664j0433p153O428O933m144o874Q76N162K03l614L15L443J87k801J096N046
907D334M48n792k581O486N429n987r291L054J0769l58j2105m706J0256P356p656
922c44r254M629R525J24p775r11O107K976l369k273K435J625k979j747K808J539
$$ plain form
938 3116 -1153 -5556 -2099 3804 1481 -6615 -6852 2463 6744 -1508 -8586 -1439 8687 5788 -4719
953 -4719 -4610 5357 8336 134 -4822 -75 4402 1064 -3592 -2742 161 -901 -3539 -2270 675 -52
969 -52 -3555 -2345 3155 4685 -1062 -4491 2013 8493 3627 -5679 -3416 6706 6953 -3789 -8219
984 -8219 282 6048 -481 -7494 -3868 2688 1552 -3223 -3067 1053 2167 -89 -116 2684 3315 454
1000 454 -749 2476 4704 -54 -5002 -2115 4558 2744 -6214 -7606 1732 5850 -2218 -8514 -1742
1015 -1742 6435 3536 -4420 -2938 4014 5426 433 -1909 860 3006 826 -1291 -497 1069 -935
1030 -935 -3223 -1884 1270 -121 -4519 -3831 2697 4265 -2419 -5570 1575 8014 2600 -5089 -1876
1045 -1876 6380 5463 -2427 -4867 907 3862 -217 -4244 -2581 719 91 -2678 -2660 370 1016 -1112
$$ packed form
938C116m269m403L457N903k323q096k37R315M281q252p078P147J0126k899j0507
953d719J09R967K979q202m956M747M477l338m656Q50K903j062k638J269K945p27
969e2l503J210N500J530n747l429O504O480m866r306K263J0122K47j0742m430
984h219Q501N766o529p013L626O556j136m775J56M120J114k256k7K800O31k861
1000D54j203L225K228m758m948K887O673j814q958j392R338M118q068o296O772
1015a742Q177k899p956J482O952J412m993k342K769K146k180k117P94J566k004
1030i35k288J339L154j391m398O88O528J568o684l151P145O439n414p689L213
1045a876Q256r17p890k440N774K955m079m027J663L300o28k769J8L030O46k128
$$ plain form
1061 -1112 -1293 2168 3380 -580 -2233 2661 6288 1060 -4766 -736 6101 3032 -5320 -5500 1998
1076 1998 3984 -2627 -6832 -1788 3332 1432 -3097 -2203 1898 3132 637 -411 1230 2874 1248
1091 1248 -924 850 2635 -220 -3606 -1508 3043 534 -5655 -4234 2930 3538 -3598 -5915 1108
1106 1108 5997 1292 -4005 -716 4850 4400 -533 -2021 1432 3335 787 -2387 -1722 558 -266 -2706
1122 -2706 -2415 470 161 -3012 -2410 2267 3063 -1878 -3056 3051 6410 829 -4399 135 5704 2916
1138 2916 -4087 -3624 2055 2744 -1981 -4636 -1813 1058 240 -2715 -2546 540 2049 204 -995 1555
1154 1555 3191 843 -1052 1934 4257 254 -3780 -561 3897 792 -5635 -4162 2468 2616 -3885
1169 -3885 -5179 366 3855 286 -2912 -831 3042 3405 546 -982 1147 2895 1603 -1166 -948
$$ packed form
1061a112j81L461J212l960j653M894L627n228n826M030O837l069q352j80P498
1076A998J986o611m205N044N120j900m529Q94M101J234k495j048J641J644j626
1091A248k172J774J785k855l386K098M551k509o189J421P164O08p136k317P023
1106A108M889m705n297L289N566m50m933j488L453J903k548l174O65K280q24k440
1122b706K91K885l09l173O02M677P96m941j178O107L359n581n228M534N569k788
1138B916p003M63N679O89m725k655K823K871q18k955J69L086J509j845j199K550
1154A555J636k348j895K986K323m003m034L219M458l105o427J473O630J48o501
1169c885j294N545L489l569l198K081L873L63k859j528K129J748j292k769K18
$$ plain form
1184 -948 1600 549 -2952 -2460 1115 242 -4113 -3420 2177 2792 -2749 -3717 2805 5595 520 -3306
1200 -3306 784 5086 2326 -2037 -1786 1572 2075 -381 -2922 -1884 435 338 -2325 -3087 -157 1371
1216 1371 -926 -2092 1415 3079 -154 -1883 2178 4718 324 -3133 561 4568 1089 -4327 -2951
1231 -2951 1894 1507 -2720 -4029 -899 1748 422 -1914 -1681 1168 2704 660 -1154 773 3535
1246 3535 1460 -1476 204 2929 620 -2910 -1218 2176 14 -4375 -2924 2034 1395 -3557 -3733
1261 -3733 1547 3379 15 -2426 338 3438 2719 -415 -985 1079 2768 533 -2295 -1583 1224 385
1277 385 -2769 -2620 650 512 -2671 -2285 1655 1988 -1604 -1866 2564 3857 87 -2013 1269 3943
1293 3943 1466 -2293 -1443 1651 1603 -1434 -3403 -1434 941 -241 -2695 -2301 703 1485 -606 -1165
$$ packed form
1184i48K548j051l501M92L575q73m355O93N597O15n541r68O522K790n075l826
1200c306M090M302k760m363K51L358N03k456k541J038K319r7k663p62K930J528
1216A371k297j166L507J664l233j729M061K540m394l457L694M007l479n416J376
1231b951M845l87m227j309L130K647j326k336K33K849J536k044j814J927K762
1246C535k075k936J680K725k309l530J692L394k162m389J451M958o39m952j76
1261c733N280J832l364k441K764L100p19l134n70K064J689k235k828P12K807q39
1277C85l154J49L270j38l183L86L940L33l592k62M430J293l770k100L282K674
1293C943k477l759Q50L094m8l037j969J969K375j182k454L94L004P82k091n59
$$ plain form
1309 -1165 1318 2644 724 -1053 1626 2964 237 -1975 325 2657 -197 -3069 -2014 1450 476
1324 476 -2899 -3221 165 1990 -351 -2127 -462 2157 2298 -118 -919 1545 2925 881 -1176 90
1340 90 1880 208 -2202 -1423 372 -650 -3195 -2066 1081 686 -2201 -1854 1624 2896 -177 -1562
1356 -1562 1075 3354 1537 -967 -647 1606 2085 -574 -2428 -863 736 -347 -2581 -1829 541 408
1372 408 -1555 -1340 1088 1534 -492 -333 2099 3038 594 -1172 1209 2556 641 -2185 -1146 1146
1388 1146 452 -2313 -2673 -711 946 -525 -2362 -1070 1315 1646 -595 -542 1696 2656 616 -411
1404 -411 1361 1802 132 -1514 -140 1282 -646 -2686 -1442 707 28 -2195 -2041 728 1735 -244
1420 -244 -1227 600 2672 1826 -385 -497 1550 2097 -96 -1601 -78 883 -240 -2192 -1268 371 -609
$$ packed form
1309a165K483J326j920j777K679J338k727k212K300K332k854k872J055L464r74
1324D76l375l22L386J825k341j776J665K619J41k416q01K464J380k044k057J266
1340I0J790j672k410P79J795j022k545J129L147l95k887L47L478J272l073j385
1356a562K637K279j817k504L20K253M79k659j854J565J599j083k234P52K370j33
1372D08j963K15K428M46k026J59K432R39k444j766K381J347j915k826J039K292
1388A146o94k765l60J962J657j471j837J292K385L31k241N3K238R60k040j027
1404d11J772M41j670j646J374J422j928k040J244K149o79k223J54K769J007j979
1420b44r83J827K072q46k211j12K047N47k193j505J523R61j123j952R24J639r80
$$ plain form
1437 -609 -2159 -1549 809 736 -1029 -625 1605 2071 204 -564 1168 2680 986 -1032 -609 996 931
1454 931 -1174 -2166 -840 695 -357 -2589 -1260 904 647 -1001 -696 1373 1604 68 -205 1497
1470 1497 2027 356 -694 688 1449 -84 -1836 -961 513 155 -1951 -2120 -264 677 -488 -1472 -380
1487 -380 1635 1560 -189 -288 1708 2158 413 -761 696 1486 -39 -1720 -556 551 -763 -2130 -1136
1504 -1136 236 -206 -1605 -1138 848 1268 156 -518 892 1990 1321 -256 -199 1448 1572 -355 -1416
1521 -1416 -357 801 -572 -2098 -1244 248 -225 -1507 -741 702 921 -309 -86 1413 1796 398
1537 398 28 1059 1600 316 -840 -288 591 290 -1487 -1814 -594 212 -904 -1818 -850 874 499 -680
1555 -680 -347 1410 2032 501 -112 1247 1883 584 -638 104 775 -521 -1679 -1187 -173 -557 -1455
$$ packed form
1437f09j550O10K358p3j765M04K230M66j867p68J732J512j694k018M23J605o5
1454I31k105r92J326J535j052k232J329K164k57j648L05K069K31j536k73J702
1470A497N30j671j050J382P61j533j752Q75J474l58k106j69J856R41j165r84J092
1487c80K015p5j749r9J996M50j745j174J457P90j525j681J164J107j314j367R94
1504a136J372m42j399M67J986M20j112o74J410J098o69j577N7J647J24j927j061
1521a416J059J158j373j526Q54J492m73j282P66J443K19j230K23J499L83j398
1537C98l70J031N41j284j156N52Q79l01j777l27J220Q06j116r14R68J724l75j179
1555f80L33J757O22j531o13J359O36j299j222P42O71j296j158M92J014l84q98
$$ plain form
1572 -1455 -1349 10 443 -383 -886 393 1445 1277 -131 -56 1543 1735 341 -491 247 803 -334 -1608
1590 -1608 -979 78 -530 -1905 -917 131 20 -695 -630 714 1047 661 269 1111 1614 964 -127 159
1608 159 782 616 -674 -1311 -709 -177 -947 -1779 -728 286 -51 -1132 -381 804 1016 147 236 929 1726
1627 1726 438 97 633 860 -68 -624 -770 11 -456 -1393 -1398 -587 215 -487 -808 -115 834 592 169 246
1647 246 1196 1308 444 -168 652 1057 -27 -920 -394 315 -394 -1261 -893 -415 -309 -825 -753 191 412 27
1667 27 -63 465 1183 793 175 553 945 858 -96 -769 -193 112 -534 -1529 -884 -312 -450 -980 -847 99 309
1688 309 -162 31 843 1108 544 209 708 1172 741 -251 -88 405 382 -737 -933 -445 -319 -762 -1325 -524
1708 -524 433 -51 -574 -54 956 866 363 237 976 1005 294 7 38 365 -75 -703 -918 -182 -588 -1094 -920
$$ packed form
1572a455J06J359M33q26n03J279J052j68j408P5J599J92j394q32P38N56j137j274
1590a608O29J057o08j375R88J048j11p15O5J344L33l86l92Q42N03o50j091K86
1608A59O23j66j290o37O02N32p70q32J051J014l37j081P51J185K12q69Q9O93P97
1627A726j288l41N36K27r28n56j46P81m67r37nQ11Q02p02l21O93R49k42m23P7
1647B46R50J12q64o12Q20M05j084q93N26P09p09q67L68M78J06n16P2R44K21l85
1667B7r0N28P18l90o18L78L92q7r54o73N76L05o46r95O45N72j38n30J33R46K10
1688C09m71J93Q12K65n64l35M99M64m31r92J63M93k3j119j96M88J26m43n63Q01
1708e24R57m84n23N20J010r0n03j26P39K9p11k87L1L27m40o28k15P36m06n06J74
$$ plain form
1729 -920 -279 172 -486 -532 75 576 862 296 309 1135 941 148 124 614 694 -327 -1138 -304 -384 -768 -1115
1750 -1115 -965 -182 -266 -387 -375 348 478 325 283 666 983 814 273 309 645 454 -272 -575 -101 -135 -873
1771 -873 -1199 -670 -213 -431 -739 -424 383 510 25 309 924 859 975 250 492 732 371 88 -395 -95
1791 -95 -313 -862 -958 -589 -307 -628 -680 -245 328 252 123 351 985 844 455 378 800 575 115 -293 -170 24
1813 24 -180 -885 -648 -330 -570 -694 -660 123 226 -114 -15 256 711 922 457 713 871 776 128 -278 163
1834 163 -152 -706 -880 -854 -331 -371 -698 -489 -70 140 -15 129 448 646 428 582 775 671 550 158 -146
1855 -146 56 149 -429 -647 -671 -558 -636 -956 -531 44 -198 7 -163 378 499 287 427 576 753 490 74
1876 74 221 -167 62 -479 -403 -551 -472 -755 -553 -498 -179 -336 -121 10 204 466 299 571 988 813 206
$$ packed form
1729i20O41M51o58m6O07N01K86n66J3Q26j94p93k4M90Q0j021q11Q34q0l84l47
1750a115J50P83q4j21J2P23J30j53m2L83L17j69n41L6L36j91p26l03M74l4p38
1771h73l26N29M57k18l08L15Q07J27m85K84O15o5J16p25K42K40l61k83m83L00
1791i5k18n49r6L69K82l21n2M35N73p6j29K28O34j41l89p7M22k25m60m08J23J94
1813B4k04p05K37L18k40j24L4P83J03l40R9K71M55K11m65K56J58r5o48m06M41
1834A63l15n54j74K6N23m0l27K09M19K10j55J44L19J98k18J54J93j04j21l92l04
1855a46K02R3n78k18k4J13p8l20M25N75k42K05j70N41J21k12J40J49J77k63m16
1876G4J47l88K29n41P6j48P9k83K02N5L19j57K15J31J94K62j67K72M17j75o07
$$ plain form
1897 206 348 534 491 -234 -135 -363 -389 -514 -814 -734 -579 -375 -562 -367 42 461 300 252 564 607 663 507
1919 507 169 343 337 -67 -143 -152 -435 -368 -421 -653 -657 -511 -431 -204 -4 4 229 317 585 755 618 418 481 517 192
1944 192 181 -106 -245 -253 -320 -928 -614 -275 -660 -451 -374 -170 -48 307 99 526 277 506 770 629 423 227
1966 227 169 242 -160 -381 -505 -514 -523 -446 -766 -467 -249 -235 14 66 172 370 507 541 522 709 603 404 65 391
1990 391 178 -320 -335 -383 -290 -606 -697 -510 -563 -113 13 -113 148 389 211 644 678 661 398 532 288 236 141
2013 141 -261 -316 -224 -698 -334 -700 -861 -377 -312 -421 -31 324 278 478 292 487 556 459 539 359 260 -8 -396
2036 -396 -438 -286 -271 -458 -558 -586 -354 -445 -319 -323 -15 170 220 481 492 663 532 309 397 292 -98 -39 -294
2059 -294 -491 -460 -645 -583 -676 -491 -266 -292 -208 71 198 299 324 558 531 616 709 381 215 234 -116 -205 -370 -474
$$ packed form
1897B06J42J86m3p25R9k28k6j25l00Q0J55K04j87J95M09M19j61m8L12M3N6j56
1919E07l38J74om04p6rk83O7n3k32mJ46Q0K27K00QK25Q8K68J70j37k00O3L6l25
1944A92j1k87j39qo7o08L14L39l85K09P7K04J22L55k08M27k49K29K64j41k06j96
1966B27n8P3m02k21j24rrP7l20K99K18J4K49N2J06J98J37L4j9J87j06j99l39L26
1990C91k13m98j5m8R3l16r1J87n3M50J26j26K61K41j78M33L4j7k63J34k44n2r5
2013A41m02n5R2m74L64l66j61M84O5j09L90L55m6K00j86J95O9r7Q0j80r9k68l88
2036c96m2J52J5j87j00k8K32r1J26mL08J85N0K61J1J71j31k23Q8j05l90N9k55
2059b94j97L1j85O2r3J85K25k6Q4K79J27J01K5K34k7Q5R3l28j66J9l50q9j65j04
$$ plain form
2083 -474 -639 -606 -529 -368 -393 -317 -216 212 199 335 329 591 534 459 596 522 373 104 10 -76 -173 -197 -533 -271 -336
2108 -336 -615 -305 -373 -299 -9 97 353 250 334 494 397 486 624 355 193 117 41 -51 -166 -323 -426 -714 -618
2131 -618 -271 -538 -385 -126 153 -88 358 336 291 183 381 719 293 266 127 -31 -98 136 -186 -311 -596
2152 -596 -609 -384 -377 -314 20 -234 101 338 248 535 556 477 392 570 316 225 93 -141 3 -307 -434 -383 -594
2175 -594 -521 -310 -376 -167 -229 -90 168 149 431 637 401 582 472 424 324 130 133 74 -242 -423 -356 -638 -612
2198 -612 -436 -441 -474 -135 -3 60 160 123 397 595 464 169 392 199 144 8 -75 -96 -563 -518 -453 -445 -602 -364
2222 -364 -315 -226 -115 30 279 234 328 567 383 322 452 234 348 304 -231 -413 -204 -418 -496 -558 -337 -369 -372 -70
2246 -70 -188 76 211 441 296 463 539 692 386 476 331 177 -86 -294 -206 -396 -448 -208 -326 -646 -305 -304
$$ packed form
2083d74j65L3P7J61k5P6J01M28j3J36oK62n7p5J37p4j49k69r4q6r7k4l36K62o5
2108c36k79L10o8P4K90J06K56j03Q4J60r7Q9J38k69j62p6p6r2j15j57j03k88R6
2131f18L47k67J53K59K79k41M46k2m5j08J98L38m26k7j39j58o7K34l22j25k85
2152e96j3K25PO3L34k54L35K37r0K87K1p9q5J78k54r1j32k34J44l10j27N1k11
2175e94P3K11o6K09o2J39K58j9K82K06k36J81j10m8j00j94Ln9l16j81O7k82K6
2198f12J76nl3L39J32O3J00l7K74J98j31k95K23j93n5j36q3k1m67M5O5Qj57K38
2222c64M9Q9J11J45K49m5R4K39j84o1J30k18J14m4n35j82K09k14p8o2K21l2lL02
2246g0j18K64J35K30j45J67P6J53l06R0j45j54k63k08Q8j90n2K40j18l20L41J
$$ plain form
2268 -304 -257 -67 9 234 150 440 664 436 560 357 339 162 108 181 -153 42 -390 -464 -582 -355 -408 -240 -187
2291 -187 -89 -16 107 244 358 384 228 530 403 428 192 -1 59 -86 -251 -376 -555 -574 -475 -417 -211 -254 -20
2314 -20 -15 -12 99 443 365 523 517 476 299 426 176 -29 -169 -88 -209 -145 -288 -397 -582 -177 -87 -115 -28 31 191
2339 191 169 217 515 261 230 385 106 124 24 -35 -155 -286 -355 -516 -604 -462 -332 -229 -180 -245 -4 145 36
2362 36 230 358 251 483 429 262 -30 200 141 -154 -407 -315 -148 -547 -340 -451 -296 -353 -85 -110 -89 289
2384 289 232 404 277 528 213 246 454 83 -41 -161 -176 -27 -344 -426 -439 -296 -402 -482 -124 -59 -207 -158 -4
2407 -4 376 411 314 245 390 455 128 23 -18 -109 -213 -190 -437 -229 -457 -362 -360 -58 2 198 57 -63 209 449
2431 449 199 409 357 511 191 146 247 -133 132 -258 -383 -452 -451 -309 -247 -209 -205 -28 88 240 315 386 370 389
$$ packed form
2268c04M7J90P6K25q4K90K24k28J24k03j8j77n4P3l34J95m32p4j18K27n3J68N3
2291a87R8P3J23J37J14K6j56L02j27K5k36j93O0j45j65j25j79j9R9N8K06m3K34
2314b0NLJ11L44p8J58om1j77J27k50k05j40Q1j21O4j43j09j85M05R0k8Q7N9J60
2339A91k2M8K98k54l1J55k79J8j00n9j20j31o9j61q8J42J30J03M9o5K41J49j09
2362C6J94J28j07K32n4j67k92K30n9k95k53R2J67l99K07j11J55n7K68k5K1L78
2384B89n7J72j27K51l15L3K08l71j24j20j5J49l17q2j3J43j06q0L58O5j48M9J54
2407dL80L5r7o9J45O5l27j05m1r1j04K3k47K08k28R5KL02O0J96j41j20K72K40
2431D49k50K10n2J54l20m5J01l80K65l90j25o9JJ42O2L8MJ77J16J52P5P1j6J9
$$ plain form
2455 389 511 452 149 -2 -7 77 42 -386 -405 -297 -445 -486 -421 -69 -39 -60 -22 250 -6 427 255 348 419 488 282
2480 282 167 30 -62 -35 -264 -211 -417 -386 -290 -379 -394 -171 -255 -71 59 48 250 196 353 362 424 211 425 192
2504 192 156 -135 -256 -312 -345 -243 -370 -405 -350 -381 -284 -204 -120 98 309 585 175 504 312 224 384 582 69
2527 69 -112 29 -226 -167 -463 -398 -307 -497 -386 -146 -24 80 58 86 237 262 377 316 247 418 318 76 -124
2550 -124 44 -208 -379 -237 -390 -364 -413 -210 -230 -10 115 59 78 140 142 185 236 395 437 298 -93 -83 74 6
2574 6 -104 -386 -156 -222 -222 -379 -354 -52 -185 -137 217 334 220 329 426 451 577 212 240 126 160 24 -86 -10
2598 -10 -463 -547 -383 -316 -257 -344 -233 -220 9 180 458 380 240 269 203 211 111 123 43 -11 -298 -211 -362 -378 -341 -226
2624 -226 -58 -320 -130 -120 -87 155 -31 184 378 368 356 342 195 79 180 52 -119 -69 -90 -322 -326 -366 -140
$$ packed form
2455C89J22n9l03j51nQ4l5m28j9J08j48m1O5L52L0k1L8K72k56M33j72R3P1O9k06
2480B82j15j37r2K7k29N3k06L1R6q9j5K23q4J84J30j1K02n4J57RO2k13K14k33
2504A92l6k91j21n6l3J02j27l5N5l1R7Q0Q4K18K11K76m10L29j92q8J60J98n13
2527F9j81J41k55N9k96O5R1j90J11K40J22J04k2K8J51K5J15o1o9J71j00k42k00
2550a24J68k52j71J42j53K6m9K03k0K20J25n6J9O2KM3N1J59M2j39l91J0J57o8
2574Fj10k82K30o6%j57K5L02j33M8L54J17j14J09R7K5J26l65K8j14L4j36j10P6
2598a0m53q4J64O7N9q7J11J3K29J71K78p8j40K9o6Qj00J2q0n4k87Q7j51j6L7J15
2624b26J68k62J90J0L3K42j86K15J94j0j2j4j47j16J01j28j71N0k1k32mm0K26
$$ plain form
2647 -140 -291 -263 -216 190 118 -121 181 501 307 362 254 367 208 206 194 50 26 -209 -467 -293 -325 -280 -252 -245
2671 -245 -196 -147 -41 17 253 255 551 333 239 346 322 50 153 -78 -225 -289 -471 -262 -258 -147 -512 -181 -213 20
2695 20 177 139 22 188 358 257 453 155 313 51 149 207 -52 -38 -169 -313 -423 -238 -277 -173 -24 -138
2717 -138 -55 -53 15 301 283 252 490 403 113 185 250 21 202 -25 -406 -407 -169 -222 -362 -140 -167 -195 4 -65 50
2742 50 290 350 101 178 465 331 111 148 172 -99 -127 -316 -357 -12 -182 -221 -214 -411 -322 -267 -114 100 48 167
2766 167 522 184 264 216 212 261 102 14 -201 -143 -105 -68 -201 -270 -185 -62 -83 -180 -178 142 73 88 151 268 384 223
2792 223 294 358 75 197 121 -164 -152 -231 -278 -189 -184 -372 -179 -37 -75 116 177 194 258 -11 287 220 149 123 -39
2817 -39 167 41 71 -361 -254 -323 -372 -438 -241 -121 -300 -175 -7 -153 -122 40 250 336 325 204 242 201 -84
$$ packed form
2647a40j51K8M7M06p2k39L02L20j94N5j08J13j59kj2j44k4k35k58J74l2M5K8P
2671b45M9M9J06N8K36KK96k18r4J07k4k72J03k31j47o4j82K09MJ11l65L31l2K33
2695B0J57l8j17J66J70j01J96k98J58k62R8N8k59J4j31j44j10J85l9J04J49j14
2717a38Q3KO8K86j8l1K38q7k90P2O5k29J81k27l81jK38n3j40K22k7k8J99o9J15
2742E0K40O0k49P7K87j34k20L7K4k71k8j89m1L45j70l9Pj97Q9N5J53K14n2J19
2766A67L55l38Q0m8mM9j59q8k15N8L8L7j33o9Q5J23k1r7KL20o9J5O3J17J16j61
2792B23P1O4k83J22p6k85J2p9m7Q9Nj88J93J42l8J91O1J7O4k69K98o7p1k6j62
2817c9K06j26L0m32J07o9m9o6J97J20j79J25J68j46L1J62K10Q6j1j21L8m1k85
$$ plain form
2840 -84 -5 194 -20 -154 -144 -351 -172 -303 -312 -129 -67 68 60 -16 272 136 236 346 567 161 -25 26 -130
2863 -130 337 -138 -109 -241 -354 -326 -246 -99 -320 -10 -195 134 219 288 336 210 258 433 214 155 125 49 30 70
2887 70 -190 -307 -187 -96 -70 -428 -269 -282 -1 -64 176 199 178 180 391 329 319 279 138 62 155 -140 -12 -180 -319
2912 -319 -195 -304 -377 -420 -49 8 -152 110 142 219 247 204 362 42 414 146 241 99 -144 3 -138 -248 -275
2935 -275 -344 -396 -168 -415 -214 -308 258 204 117 91 265 312 145 464 306 61 26 -5 -85 60 -240 -195 -208 -162
2959 -162 -232 -97 -344 51 -28 -26 33 255 312 353 313 201 190 269 116 198 -124 -122 -191 -55 -331 -174 -487 -506 -193
2984 -193 -71 131 7 180 -64 67 283 274 153 138 282 -7 90 53 -90 -194 -95 -191 -223 -206 -353 -318 -379 30
3008 30 -222 -65 178 223 290 311 278 207 182 223 161 -19 -12 -123 -310 -53 -258 -424 -313 -235 -345 83 42 -25 -53
$$ packed form
2840h4P9J99k14j34J0k07J79j31rJ83O2J35qp6K88j36J00J10K21m06j86N1j56
2863a30M67m75K9j32j13K8Q0J47k21L10j85L29Q5O9M8j26M8J75k19n9l0p6j9M0
2887G0k60j17J20R1K6l58J59j3K81o3K40K3k1KK11o2j0m0j41p6R3k95J28j68j39
2912c19J24j09p3m3L71N7j60K62L2P7K8m3J58l20L72k68R5j42k43J47j41j10k7
2935b75o9n2K28k47K01r4N66n4q7k6J74M7j67L19j58k45l5l1q0J45l00M5j3M6
2959a62p0J35k47L95p9KN9K22N7M1m0j12j1P9j53Q2l22Ko9J36k76J57l13j9L13
2984a93J22K02j24J73k44J31K16rj21j5J44k89R7l7j43j04R9r6l2J7j47L5o1M09
3008C0k52J57K43M5O7K1l3p1k5M1o2j80Pj11j87K57k05j66J11P8j10M28m1o7k8
$$ plain form
3033 -53 -75 198 250 445 259 133 24 -21 44 96 -84 32 -58 -255 -229 -47 -438 -177 -72 -104 49 51 246 88
$$ packed form
3033e3k2K73N2J95j86j26j09m5O5N2j80J16r0j97K6J82l91K61J05l2J53KJ95j58
$$ [...]
8191a8
##END NTUPLES=NMR FID
##END=
