##TITLE=1H_LR-783-OK1
 CDCl3
 8 sc, 
 4.3.2024
##JCAMPDX= 6.0         $$ Bruker NMR JCAMP-DX V2.0
##DATA TYPE= NMR FID
##DATA CLASS= NTUPLES
##ORIGIN= UXNMR, Bruker Analytische Messtechnik GmbH
##OWNER= root
$$ XWIN-NMR		Version 3.5
$$ Mon Mar  4 14:24:49 2024 Russian Standard Time (UT+4h)  she@DPX200
##.OBSERVE FREQUENCY= 200.1313
##.OBSERVE NUCLEUS= ^1H
##.DELAY= (6, 6)
##.ACQUISITION MODE= SIMULTANEOUS
##.ACQUISITION SCHEME= undefined
##.AVERAGES= 8
##.DIGITISER RES= 18
##SPECTROMETER/DATA SYSTEM= spect
##.PULSE SEQUENCE= zg30
##.SOLVENT NAME= CDCl3
##.SHIFT REFERENCE= (INTERNAL, CDCl3, 0, 15.7039)
##AUDIT TRAIL= $$ (NUMBER, WHEN, WHO, WHERE, WHAT)
$$ ##TITLE= Audit trail, XWIN-NMR		Version 3.5
$$ ##JCAMPDX= 5.01
$$ ##ORIGIN= Bruker BioSpin GmbH
$$ ##OWNER= she
$$ F:/spectra/data/she/nmr/H-F/1/audita.txt
$$ ##AUDIT TRAIL=  $$ (NUMBER, WHEN, WHO, WHERE, WHAT)
(   1,<2024-03-04 14:23:36.85 +0400>,<she>,<DPX200>,
      <created by zg, POWCHK disabled, PULCHK disabled
       configuration hash MD5:
       00 E9 B6 7A A2 85 ED C7 34 08 36 98 17 FE 4E 26
       data hash MD5: 16K
       6F A4 7A 7F 29 0A 6D 48 A2 42 57 97 C6 4A 39 59>)
$$ ##END=
$$ 
$$ hash MD5
$$ 66 33 D7 62 88 E8 9E A0 06 F0 44 10 26 54 C8 A9
##$RELAX= 
##$RELAX= 
##$RELAX= 
##$RELAX= 
##$RELAX= 
##$RELAX= 
$$ Bruker specific parameters
$$ --------------------------
##$DU= <F:/spectra>
##$EXPNO= 1
##$NAME= <H-F>
##$PROCNO= 1
##$TYPE= <nmr>
##$USER= <she>
##$AMP= (0..31)
100 100 100 100 100 100 100 100 100 100 100 100 100 100 100 100 100 100 
100 100 100 100 100 100 100 100 100 100 100 100 100 100 
##$AQSEQ= 0
##$AQ_mod= 1
##$AUNM= <au_zg>
##$AUTOPOS= <>
##$BF1= 200.13
##$BF2= 200.13
##$BF3= 200.13
##$BF4= 200.13
##$BF5= 200.13
##$BF6= 200.13
##$BF7= 200.13
##$BF8= 200.13
##$BYTORDA= 1
##$CFDGTYP= 0
##$CFRGTYP= 5
##$CHEMSTR= <none>
##$CNST= (0..31)
1 1 145 1 1 1 1 1 1 1 1 1 1 1 1 1 1 1 1 1 1 1 1 1 1 1 1 1 1 1 1 1 
##$CPDPRG= <>
##$CPDPRG1= <>
##$CPDPRG2= <>
##$CPDPRG3= <>
##$CPDPRG4= <mlev>
##$CPDPRG5= <mlev>
##$CPDPRG6= <mlev>
##$CPDPRG7= <mlev>
##$CPDPRG8= <mlev>
##$CPDPRGB= <>
##$CPDPRGT= <>
##$D= (0..31)
0 1.2 0 0 0 0 0 0 0 0.06 0 0.03 0 0 0 0 0.0002 0 0 0 0 0 0 0 0 0 0 0 0 
0 0 0 
##$DATE= 1709547816
##$DBL= (0..7)
120 120 120 120 120 120 120 120 
##$DBP= (0..7)
150 150 150 150 150 150 150 150 
##$DBP07= 0
##$DBPNAM0= <>
##$DBPNAM1= <>
##$DBPNAM2= <>
##$DBPNAM3= <>
##$DBPNAM4= <>
##$DBPNAM5= <>
##$DBPNAM6= <>
##$DBPNAM7= <>
##$DBPOAL= (0..7)
0.5 0.5 0.5 0.5 0.5 0.5 0.5 0.5 
##$DBPOFFS= (0..7)
0 0 0 0 0 0 0 0 
##$DE= 6
##$DECBNUC= <off>
##$DECIM= 32
##$DECNUC= <off>
##$DECSTAT= 4
##$DIGMOD= 1
##$DIGTYP= 9
##$DL= (0..7)
0 120 120 120 120 120 120 120 
##$DP= (0..7)
150 150 150 150 150 150 150 150 
##$DP07= 0
##$DPNAME0= <>
##$DPNAME1= <>
##$DPNAME2= <>
##$DPNAME3= <>
##$DPNAME4= <>
##$DPNAME5= <>
##$DPNAME6= <>
##$DPNAME7= <>
##$DPOAL= (0..7)
0.5 0.5 0.5 0.5 0.5 0.5 0.5 0.5 
##$DPOFFS= (0..7)
0 0 0 0 0 0 0 0 
##$DQDMODE= 0
##$DR= 18
##$DS= 0
##$DSLIST= <SSSSSSSSSSSSSSS>
$$ [...]
##$SUBNAM2= <"">
##$SUBNAM3= <"">
##$SUBNAM4= <"">
##$SUBNAM5= <"">
##$SUBNAM6= <"">
##$SUBNAM7= <"">
##$SUBNAM8= <"">
##$SUBNAM9= <"">
##$SW= 18.0517328524113
##$SWIBOX= (0..15)
0 0 2 0 0 0 0 0 0 0 0 0 0 0 0 0 
##$SW_h= 3612.71676300578
##$TD= 16384
##$TD0= 1
##$TE= 0
##$TE2= 300
##$TE3= 300
##$TEG= 300
##$TL= (0..7)
0 120 120 120 120 120 120 120 
##$TP= (0..7)
150 150 150 150 150 150 150 150 
##$TP07= 0
##$TPNAME0= <>
##$TPNAME1= <>
##$TPNAME2= <>
##$TPNAME3= <>
##$TPNAME4= <>
##$TPNAME5= <>
##$TPNAME6= <>
##$TPNAME7= <>
##$TPOAL= (0..7)
0.5 0.5 0.5 0.5 0.5 0.5 0.5 0.5 
##$TPOFFS= (0..7)
0 0 0 0 0 0 0 0 
##$TUNHIN= 0
##$TUNHOUT= 0
##$TUNXOUT= 0
##$USERA1= <user>
##$USERA2= <user>
##$USERA3= <user>
##$USERA4= <user>
##$USERA5= <user>
##$V9= 5
##$VALIST= <valist>
##$VCLIST= <CCCCCCCCCCCCCCC>
##$VD= 0
##$VDLIST= <DDDDDDDDDDDDDDD>
##$VPLIST= <PPPPPPPPPPPPPPP>
##$VTLIST= <TTTTTTTTTTTTTTT>
##$WBST= 1024
##$WBSW= 4
##$XGAIN= (0..3)
0 0 0 0 
##$XL= 0
##$YL= 0
##$YMAX_a= 157301
##$YMIN_a= -165600
##$ZGOPTNS= <>
##$ZL1= 120
##$ZL2= 120
##$ZL3= 120
##$ZL4= 120
##$ABSF1= 10
##$ABSF2= 0
##$ABSG= 5
##$ABSL= 3
##$ALPHA= 0
##$AQORDER= 0
##$ASSFAC= 0
##$ASSFACI= 0
##$ASSFACX= 0
##$ASSWID= 0
##$AUNMP= <proc_1d>
##$AZFE= 0.1
##$AZFW= 0.1
##$BCFW= 1
##$BC_mod= 2
##$BYTORDP= 1
##$COROFFS= 0
##$CY= 11.3945322036743
##$DATMOD= 1
##$DC= 2
##$DFILT= <>
##$DTYPP= 0
##$F1P= 15.7292609196834
##$F2P= 12.9074282941183
##$FCOR= 0.5
##$FTSIZE= 0
##$FT_mod= 4
##$GAMMA= 1
##$GB= 0.15
##$INTBC= 1
##$INTSCL= 1
##$ISEN= 128
##$LB= 0.24
##$LEV0= 0
##$LPBIN= 0
##$MAXI= 10000
##$MC2= 0
##$MEAN= 0
##$ME_mod= 0
##$MI= 1.114404
##$NCOEF= 0
##$NC_proc= 0
##$NLEV= 6
##$NOISF1= 3.799351
##$NOISF2= 2.8
##$NSP= 1
##$NTH_PI= 0
##$NZP= 0
##$OFFSET= 15.70392
##$PC= 1
##$PHC0= -24943.72
##$PHC1= 16.45264
##$PH_mod= 1
##$PKNL= yes
##$PPARMOD= 0
##$PSCAL= 0
##$PSIGN= 0
##$REVERSE= no
##$SF= 200.130013532006
##$SI= 16384
##$SIGF1= 3
##$SIGF2= 2
##$SINO= 400
##$SIOLD= 16384
##$SREGLST= <1H.CDCl3>
##$SSB= 0
##$STSI= 0
##$STSR= 0
##$SW_p= 3612.71676300578
##$SYMM= 0
##$S_DEV= 0
##$TDeff= 0
##$TDoff= 0
##$TI= <>
##$TILT= no
##$TM1= 0
##$TM2= 0
##$TOPLEV= 0
##$USERP1= <user>
##$USERP2= <user>
##$USERP3= <user>
##$USERP4= <user>
##$USERP5= <user>
##$WDW= 1
##$XDIM= 8192
##$YMAX_p= 0
##$YMIN_p= 0
$$ End of Bruker specific parameters
$$ ---------------------------------
##NTUPLES= NMR FID
##VAR_NAME=  TIME,          FID/REAL,        FID/IMAG
##SYMBOL=    X,             R,               I
##VAR_TYPE=  INDEPENDENT,   DEPENDENT,       DEPENDENT
##VAR_FORM=  AFFN,          ASDF,            ASDF
##VAR_DIM=   8192,          8192,            8192
##UNITS=     SECONDS,       ARBITRARY UNITS, ARBITRARY UNITS
##FACTOR=    0.0002768,     1,               1
##FIRST=     0,             0,               0
##LAST=      2.2672688,     0,               0
##MIN=       0,             -165600,         0
##MAX=       2.2672688,     157301,          0
$$ Real data points
##PAGE= N=1
##DATA TABLE= (X++(R..R)), XYDATA
$$ [...]
1775A15j04J48k70J59q9O8K9L0j04J07k68K90j91J95m1j85J98k41k4K64j14q8
1797a16N9J1O8K4R1K3j97l9J9J03N5l55N20k48J77k19j00n5J77j33Q4J49K18j92
1821A24j02J07k87J24k5P3l32L23K58k42M2N9j47J01l5N6k1Q6k12j22M20p1k34
1844e7l8R0M0j10L63l63K75m08K74qj61N52j85j44q3j6j08P3k96L15n7J86l29
1867a95J58PO2N4k46K09J66J39k94O4Jk06J02M11m34j45M34m04J00K04P8l77Q1
1890c1O1m3n9K13j83k92L02LK35j14k18R6j15K8M7K56j72m7J68o4l7o5K7J05Q9
1915A90l47J67r6R2J1j8O3j23P1j30J70p2K18n9l04J57J75n8R2j51L8l7k4L3j21
1940f3n3K07Nj51M4O0J37k55N5J58r4n8K25l24J26r5K03K4j80O9j54N4K48j77
$$ plain form
1775 115 11 159 -111 48 -41 27 56 86 -18 89 -179 111 -80 115 74 -111 87 -154 -178 86 -28 -116
1797 -116 -57 -46 22 46 137 160 -37 -76 -57 46 101 -254 266 18 195 -24 -124 -179 -2 -135 -51 98 316 124
1821 124 22 129 -158 -34 -59 14 -318 5 263 21 63 122 -25 76 41 97 76 162 -50 -172 248 177 -57
1844 -57 -95 -5 35 -75 288 -75 200 -208 66 58 -103 449 264 120 37 21 -87 -14 -310 5 -52 134 -195
1867 -195 -37 -30 32 86 -160 49 215 354 60 124 125 -81 21 432 -2 -147 287 -117 -17 187 265 -112 -31
1890 -31 30 -13 -72 141 -42 -334 -32 -29 206 92 -126 -30 -145 -117 -70 186 14 -33 135 71 34 -31 -4 101 190
1915 190 -157 10 -86 6 17 -1 62 -61 10 -120 50 -22 196 137 -167 -10 165 107 199 48 86 49 25 58 -63
1940 -63 -116 91 96 -55 -11 49 186 -69 -14 144 50 -8 217 -107 19 -76 127 151 -29 40 -114 -60 188 11
1964A1j2K24j98rj12K79k68K03k04p2L55m09Pk1K74K4l05J62M6m2J90q7J29l3
1988A32J3k1j19r8j20K47J40J8k64J4j22K41nM0pj00O4j03K9m0P3j84J75r4k5
2013a16J91Q5j63K54k52J7o4O7Q4k77J19kJ65j60J93j83J13j85J94n5j23j66M31
2036A67k20L15j32j94Oj2O7k8ql9o1J23J46lj20N9j04jP8l68M34j16j79K02j25
2061a13k55K90L4q1J35J36l60J64J49k9j71j36L18k60O4J85j92K61o7q9O3O8J35
2084B49k79J28j21R0k10J05j66L08r5k83K44J34k55K55k30j33K85k26P9K6J30
2105C5J4l6K9o8l7L21k8j06j43J77k29P1k18M49k61K05j41j69K77m71L06K3P5
2128G5J25o4p5k90J29L11k15K6L2J05k72J21k6j40J67K31k26J13j29j99K70j86
$$ plain form
1964 11 -1 223 25 16 -96 183 -85 118 -86 -158 197 -212 -205 -226 48 72 -233 -71 -25 -67 123 36 165 132
1988 132 145 124 5 -93 -213 34 174 192 -72 -58 -180 61 56 96 89 -11 53 -50 -21 -61 12 -172 3 -91 -116
2013 -116 75 160 -3 251 -1 16 -48 19 103 -174 -55 -57 108 -52 141 -42 71 -114 80 25 -98 -264 167
2036 167 -53 262 130 -64 -58 -70 -3 -31 -39 -78 -139 -16 130 127 7 66 -38 -39 39 -329 105 -11 -190 12 -113
2061 -113 -368 -78 -44 -125 10 146 -214 -50 99 70 -101 -237 81 -179 -115 70 -122 139 72 -17 46 114 249
2084 249 -30 98 -23 67 -143 -38 -204 104 9 -274 -30 104 -151 104 -126 -259 26 -200 -121 -95 35
2105 35 49 13 42 -26 -63 258 230 124 -19 158 -71 0 -218 231 -30 175 34 -135 142 -329 -23 0 75
2128 75 200 136 61 -229 -100 211 -4 22 54 159 -113 8 -18 -158 9 240 14 127 -2 -201 69 -117
2150a17Q3K60j75p6L9k78L39l06J07J29j07K90k30M4K19j3p4k40J18q9j3J33N9
2173A02J2o2L1l45M02J65l10J2j70J4K51j08K69j27k56J30n1r7J84K9k81J87j48
2196a67K39k75N8l1N7M29q8k10K8n5J80m29L67j04j38J37j17P7Q8J10q9O0k85
2219a58j5N0j2J86pj06J46n5l5J55l79L75k79M00m77M4J96j3lk7O4Qk00K02j67
2244a07O8J88k72K65l4j99K8K75k63Q9J37k2k68j17L16k9j91n6R5J8N51l76L1
2267A27j84P3r8j31K37J0J72m89M2K21R4k16Q9L2j48L49j00k78L85l13j49J54
2289a21K88j71JJ09p4RJ0j2j12L7L03l08J57m03J37K48k0l13L34J67j72j57kM9
2313a6J32j0r8j59R0j18K04N8l09J40L30l77nJ95m11K39j52K79J25K7l25K5N2
$$ plain form
2150 -117 -34 226 51 -25 14 -264 75 -231 -124 5 -102 188 -42 2 221 208 134 -106 12 -77 -90 43 102
2173 102 114 52 83 -262 140 305 -5 7 -163 -149 102 -6 263 136 -120 10 -41 -138 46 75 -206 -19 -167
2196 -167 72 -203 -145 -176 -119 310 222 12 40 -15 165 -264 103 -1 -139 -2 -119 -42 46 156 67 127 -158
2219 -158 -173 -123 -135 51 44 -62 84 29 -6 149 -230 145 -134 266 -211 -167 29 16 13 -14 50 58 -142 60 -107
2244 -107 -39 149 -123 142 108 -91 -63 212 -51 38 175 153 -115 -232 84 55 -136 -192 -97 -79 472 96 127
2267 127 -57 16 -82 -213 24 34 206 -283 -241 -20 74 -142 -53 -21 -169 180 80 -198 187 -126 -275 -121
2289 -121 167 -4 -3 106 32 41 51 39 -73 -36 267 -41 116 -287 -150 98 78 -235 99 266 94 -63 -65 -16
2313 -16 116 106 8 -151 -61 -179 25 83 -226 -86 244 -133 -138 57 -354 -115 -267 12 137 164 -161 -136 -84
2336h4R7J12j94K3P7j2l4J53j36L0J34j00L1j12j06q1n1M54j59j62n9L1K76k04
2360g6K50J7q0J12L3j28j68M3M2j82K05j31L4J26l6n1J8j29p7L07j94K5l9J40
2384F1m15M36j63R2J2mK7m9R4k19J2O7R0M7l16J43J93K1q0L1Q0j95N2k43k3L79
2410A30k74J07L39j97K31l75q6L09j36k00L41j17l22L31j81k6J32NK18l43J79
2431F5J37l50P1O8j92M14jk36j6kR7k00PK24Q3j41J26n7k23J35l4n9L7k6M7J67
2457A41j73l4L32p4j44L7K2l11K73j98K56l58J37L5l31L50O4K67j57j36J87k38
2479e3J58J35l93rJ93rM9m8k11J91R9P2p3J9j30j88M03l17o2J33J56J1o6j97J91
2504E4l01K29p0J14qln5K79l6l12K42j01J14k24J85M4j69J42Q3r8j92J51K52j60
$$ plain form
2336 -84 13 125 -69 -46 31 19 -15 138 2 32 166 66 97 -15 -121 -202 -253 201 42 -120 -179 -148 128 -76
2360 -76 174 191 111 223 256 128 -40 3 45 -137 68 -63 -29 97 61 10 28 -101 -178 129 -65 -40 -79 61
2384 61 -354 82 -81 11 23 19 46 -3 91 -128 -116 -49 41 88 -228 -85 108 129 49 80 160 -35 17 -226 -249 130
2410 130 -144 -37 302 105 336 -39 -125 184 48 -152 189 72 -250 81 -100 -126 6 11 229 -114 65
2431 65 202 -148 -77 -9 -201 213 212 -24 -40 -42 55 -145 -138 86 169 28 154 97 -126 9 -25 -84 -47 -73 -26 141
2457 141 -32 -66 266 192 48 85 107 -204 69 -129 127 -231 -94 -59 -390 -40 24 291 134 -2 185 -53
2479 -53 105 240 -153 -162 31 22 71 23 -188 3 102 174 101 120 -10 -198 205 -112 -174 -41 115 126 60 -137 54
2504 54 -247 -18 -88 26 18 15 -40 239 203 -109 133 32 146 -78 107 151 -18 124 207 109 -83 68 320 160
2528A60j80J11p7o9j44J58J72q7K8k31j04N27j45O6k50L5J03m94M91k04J62J46
2550A74j40k83L85Lm66L63j92M65n17K15Q9j38n7k4K55jk90K33K1r5L7j31N8J58
2574A22k65K02j18J64j20j07J70K28k92J04j95M8J89l9O9j89R0%jl48K08L04k72
2597d8k3J00O8j56m6K10q1j4L23l30J59k62M6M58k68Mj35%O5k29J9R3K2N1l16
2622b90L08p4J0k77J51K53L92o34K13O8j95L64k13m02L29N2j46L46k60m6P2J22
2644A43o1k36RRL71j23l7n2R4j22j07K60Pp3k3j47O1j12R7q6j46L09J99l53J79
2669F0k12L53j27j79P5K2J37j01J55m6Q2Q4o4l50J63K13J08n05J38lo2j47K83
2692G7m0N2M0k41j8J5K60p4N8j15L30k62r7lO4j2k39L74l71J95n2L0J72k28K74
$$ plain form
2528 160 -20 91 14 -55 -199 -41 131 44 72 -159 -263 264 119 185 -65 -30 73 -421 70 -134 28 174
2550 174 34 -249 136 139 -327 36 -156 309 -208 7 96 -42 -99 -123 132 131 -159 74 95 0 37 -94 -36 122
2574 122 -143 59 -59 105 -15 -122 48 276 -16 88 -107 -59 130 91 160 -29 61 61 60 -288 -80 224 -48
2597 -48 -71 29 97 -59 -105 105 24 10 333 3 162 -100 -54 404 136 140 5 5 70 -159 -140 -47 -25 26 -290
2622 -290 18 -56 -46 -323 -172 81 473 -161 52 120 -75 289 76 -326 3 55 -91 255 -5 -51 21 143
2644 143 82 -154 -145 -136 235 112 75 23 117 -5 -112 148 155 82 59 -88 -27 -139 -42 -128 -274 35 234 -119 60
2669 60 -152 201 74 -105 -30 -8 129 28 183 137 219 303 239 -111 52 265 373 -132 6 3 -59 -206 77
2692 77 37 89 129 -112 -130 -115 145 71 129 14 344 82 -15 -18 46 34 -205 169 -202 -7 -59 -29 143 -85 189
2717A89l32L04N8k09r0J68k16J36J53k03J49oj76J81k88J72j70J64J97p4k6o7
2739A4j25J8M8J22J19m42L44k15K54n04M51k1p3k85L40k19K75r5j98K19J83j90
2761B0N5j88J26l09J37j03L09M6P3j70q1J24L2j34N6n7l8n2j06K30p4J51j34J62
2785G5MN5j14K41r0j97L0p5J81l05K93k30J57L37j15n30L50J32k03J51j30o7j24
2808a74L15l1k21J30j96O6K5M7J19J54j70J9j56k6K01k44J78L3r3N2P3j08K8k
2832A9j94O4N6o6J71K07J17o07L30l0l29K67q0n7N4k1j21K95J0q4J7N0r1L26m92
2857a89K81K02m37Q6j23M71l66J1l8J97J73l98N8N7j18J97l06L31K3o7j64J61
2879D2j56R3J01k12J28k6k27J93J07K08l89Q5j01K21J1k1OP3k93J83J34j32k8
$$ plain form
2717 189 -143 161 219 10 -80 88 -128 8 161 -42 107 101 -75 106 -182 -10 -180 -16 181 107 81 14
2739 14 -111 -93 -45 77 196 -246 98 -117 137 -367 84 63 -10 -295 45 -174 101 6 -192 27 210 20
2761 20 75 -113 13 -296 -159 -262 47 93 166 -4 -85 39 71 -63 -7 -64 -102 -154 -260 -30 -104 47 -87 75
2785 75 79 134 20 261 171 -26 4 -71 110 -195 98 -132 25 362 247 -283 67 199 -4 147 17 -50 -174
2808 -174 141 110 -111 19 -177 -111 -86 -39 80 234 64 83 -73 -99 102 -142 36 69 -24 28 101 -7 21 19
2832 19 -175 -111 -55 -121 50 257 374 -233 97 67 -262 5 -75 -132 -78 -99 -220 75 85 1 18 68 -23 303 -189
2857 -189 92 294 -143 -57 -180 291 -75 -64 -102 95 268 -130 -72 -15 -133 64 -242 89 112 45 -119 42
2879 42 -114 -21 80 -132 -4 -30 -257 -64 43 251 -138 -53 -154 67 78 57 63 136 -157 26 160 28 0
2902@L3k06J34j91O9q1J07J95j47j16M64j69Q0p3k1k95J72R1q6J21l31J61m2J46
2926A5j4r5M10m26J20J55j06L08k19j83P0R0j23P9k28K07k05K91j81J12k58J07
2948g4j7J30j48K57p9j99J86M4j18L43m49Qn2L6r7L16m3p7j4O5M8q6k4R1j32J91
2974A06J88j35k60O3J72m9n5k3j83J96P2k05j93K46nK4L8J00q7rQ3j91l3L47j31
2999G6j53n4oJ49M6p0K7j85J59j21P9K18o7k70l8N9r0L51p4RN0k3j60N9n7Q1J39
3026A34k17J90j82o7K55j04K00j66j82P9J39j09j89L37Pp5l6M1K9Q2j61R3k76
3049a78L47k17M5J68k67m3K9K86j00o6j91J65K1l1m9M2l5R5J81k38j54K31k01
3072a60N9L1M5j50J26K92l31o2k5l5J14k2J03j06R0j47K91q3j20J44k13M06k77
$$ plain form
2902 0 33 -173 -39 -230 -161 -242 -135 60 -87 -203 261 92 172 99 78 -217 -45 46 -40 81 -250 -89 -131 15
2926 15 1 -94 316 -110 10 165 59 367 148 -35 35 125 2 81 -147 60 -145 146 -35 77 -181 -74
2948 -74 -91 39 -109 148 69 -130 56 100 -18 325 -124 -116 -168 -132 -229 87 44 -33 -47 18 66 -20 -44 47 -85 106
2974 106 294 159 -101 -38 134 85 30 7 -176 20 92 -113 -306 -60 -65 -41 -3 97 10 1 84 -107 -140 207 76
2999 76 -77 -131 -137 12 58 -12 15 -170 -11 -132 -53 165 98 -172 -210 -151 -241 110 36 45 95 72 -88 -29 -86 -5 134
3026 134 -83 107 -75 -142 113 9 209 43 -139 -60 79 -30 -219 118 125 50 14 55 84 166 5 98 -178
3049 -178 169 -48 -3 165 -102 -145 -116 170 70 4 -187 -22 -1 -32 -81 -39 -74 21 202 -36 -190 41 -160
3072 -160 -101 -70 -25 -175 -49 243 -88 -150 -175 -210 -96 -118 -15 -121 -31 -178 113 30 -90 54 -159 247 -30
3095c0M3J4r4o4J59M4q4J07j44L67m00M8j01L66m32J96l2K20M1k11R5J81k04r7
3119a2O2l49M77j43l21Q9M8L8K09k4q3j83J88r2n4J43J28j72J21n2p2n2Q7J5J18
3144A14j93P8L83k88k60K89L0j88L14j81k13K31j71L9M5k9N2j83J70k0k87L90
3166A22j38k8K9J25k26o6R4K0l8j58M27m2k39L7K28J40j75j03k24K64J39q7Q2
3189A83k18p0K86l08%K32n6K38j47k26K3K47j35j7l3J20q0q0p5K3K53qk82k37
3213c67K96j4KJ88k24J33O0m8K56m68O9K60j42r9N3j61L73p8K6r3n7J02N1l35
3237b17P5J46k17J12l2N3J36qqJ17l20J06K54l43J01K40K9k72M2L15m64J95R5
3260A35M0j57M5p6Q9l03L09j67J64J5L5q2j52L10p2q8l22J93J61j54Q5J83j12
$$ plain form
3095 -30 13 27 -67 -131 28 72 -12 95 -49 318 -82 -34 -135 231 -201 -5 -37 183 224 13 108 289 85 -12
3119 -12 50 -299 178 35 -286 -197 -149 -111 98 74 -9 -192 -4 -96 -150 -7 121 -51 70 18 -54 -106 -19 -4 114
3144 114 -79 -1 382 94 -166 123 153 -35 279 98 -115 116 -55 -16 29 0 52 -131 39 19 -268 122
3166 122 -16 -44 -15 110 -116 -182 -88 -68 -106 -264 163 121 -118 -81 147 287 112 9 -215 49 188 101 183
3189 183 -35 -105 181 -127 -127 105 49 287 140 -86 -63 184 49 32 -1 119 39 -41 -116 -93 160 152 -130 -367
3213 -367 -71 -85 -83 105 -119 14 74 26 282 -186 -117 143 1 -98 -45 -206 167 89 115 22 -35 67 118 -217
3237 -217 -142 4 -213 -101 -133 -80 56 48 40 157 -163 -57 197 -146 -45 195 224 -48 -6 309 -155 40 135
3260 135 175 18 63 -13 76 -227 82 -85 79 94 129 47 -105 205 133 45 -277 -84 77 -77 8 191 79
3283G9n1J46k37L18l4j73p1J3j77L42j98L5J21q6j36j21M22j58l9k41K79KJ67
3306B02j26j23n6K81k35o5L21J75n08L30m14M5O0N0J36R9r4l0l2O2j8K31k82j88
3330a79J78J10j74J16J82j24P6k22j1M0Q9l3M3j1ok07k7j72K00K56J67k68O9o7
3354B5m4k6LK28N7n3j41k65J39J45j26N5K26k16k64L55M4j91k22J4N3L08j95O6
3378b5J4k2N6J82l31N2j46L87n9k05J67m0k99M26k23j39m7K87J34l47o2P6J83
3401A9J49k17M2j09J26j11J14l12K50R3N2m0n6j58J23po9k4J94k53K2J56q4j13
3425b13K28o1p2J58J20o5j24J27j5K5k11K45k92J74q9L0L02k00N7n1m9k2J28k97
3449a67J4MJ35J17j30Q7R8k6k35L31j90p9J41j75p9K83R3n35L43M0j35J93l3J8
$$ plain form
3283 79 28 174 -63 255 221 48 -23 -10 -187 155 -43 -8 113 27 -109 -230 192 34 -5 -246 33 35 202
3306 202 76 -47 -103 178 -57 -122 199 374 -134 196 -218 -173 -113 -63 73 172 78 48 16 78 60 291 9 -179
3330 -179 -1 109 -65 51 233 109 185 -37 -48 -8 81 48 91 80 74 -133 -160 -332 -132 124 291 23 92 25
3354 25 -19 -45 -42 186 243 190 49 -216 -77 68 -58 -3 223 7 -257 98 142 -49 -271 -257 -204 104 -91 -25
3378 -25 -11 -33 23 205 -126 -74 -220 167 108 -97 70 30 -269 157 -66 -205 -252 35 169 -178 -240 -164 19
3401 19 168 -49 -7 -116 10 -101 13 -299 -49 44 96 56 0 -158 -35 -42 -111 -135 59 -194 -172 -16 -100 -213
3425 -213 15 -46 -118 40 160 95 -29 98 83 108 -103 142 -150 24 -65 -35 267 67 124 73 24 2 130 -167
3449 -167 -153 -149 -14 103 -27 60 158 132 -103 228 38 -41 100 -75 -154 129 222 -313 30 70 -65 128 95 113
3473A13j93L8J21j09o8K53j93J03j30K3pn2K44l43L10l8J01l2o7p6k6L6J94j02
3497A00k89K38J08m41M72k42P8J02j72O8j90L20j44J64m42M40K1r6p9kK67m25
3519a44L2j05J96K12n23L42K5k91K08K71K5m52J40q6K06J81k65J48j87K65m2k90
3541a34J35k17J75J39l4j76K31l81K86N2Kk18K29j47l27L42m7KK11J03r1k1k5
3564H9k9J37k30O5J26j85J68k64q4J23L36m18k39O40m90M43m48K51j97R7J74k36
3586a71L13O0k21%P2k6r6kL99m29L8K03N9k63J87l31J79J45k63K23np1P4K3j02
3611ej8O9J2k26L82l47N6m1Q0n0j6o6K06l63L80j35K24o7k08J1J73l1K15m09K52
3636G8L6k17M07l19p7M9l7J53oj08o2o0J39Qk26L09k39K0L59k75O0q9R1JP5j5
$$ plain form
3473 113 -80 -42 79 -30 -98 155 -38 65 -65 -42 -49 -101 143 -200 110 72 173 141 74 -2 -28 8 202 100
3497 100 -189 49 157 -284 188 -54 24 126 -46 22 -168 152 8 172 -270 170 191 95 16 14 281 -144
3519 -144 -112 -217 -21 191 -332 10 35 -256 -48 223 248 -204 -64 -150 56 237 -28 120 -67 198 156 -134
3541 -134 1 -216 -41 98 64 -112 119 -262 24 76 78 -140 89 -58 -385 -43 -90 -88 123 226 135 114 89
3564 89 60 197 -33 32 158 -27 141 -123 -207 -84 252 -166 -405 235 -255 188 -260 -9 -206 -109 65 -171
3586 -171 142 202 -19 -19 53 27 -69 -71 328 -101 -63 140 199 -64 123 -208 -29 116 -147 76 71 0 74 97 -5
3611 -5 -23 46 58 -168 214 -133 -77 -118 -38 -88 -104 -170 36 -327 53 -82 142 75 -133 -122 51 20 235 -174 78
3636 78 114 -103 304 -15 -92 -43 -80 73 67 -41 -103 -163 -24 -16 -242 67 -172 -152 207 -68 -8 -97 -6 -5 70 55
3662E5j64J81N1k11l7P6J79R8k50j7j34M4L48l46PQ9J22j82J26o7L7J75M1j07
3686A14j36J39j72J09J41j88Nq1J24J60j59K3j63K2m6J43q4P9O2j09M7k0jk0k6
3711c7J86J4k75J08q8j3J88m4j62J10J62j93pK2l9K98k13R4j03J82r3L9m8j55
3735f7J02Q2j89K06p9L1k07J60o0k8P2k90J34K37J44j48j56r9J61k00K85j71J65
3758H5j05j5Q3p7Q7M5K9m40J36K70L8r8o7j3kM7k02N20j97j14j3l3j27K21l7n8
3784c7P8J52k24L32Kl03N7J86k70n8j3qP3J96k58J72J1R0l82L82k18J85M6k04
3808a3L3l5Rj82K46k32J28K85k67J3Jj23J83K21j41k73K03r4O4K3r2Q5l6J5p3
3833e2K99l08o8J4J99QJ27m35P5O0K46k22j21K52k77OR4q7N3J54k11K24K1J36
$$ plain form
3662 55 -109 72 123 -88 -125 -49 130 228 -22 -39 -173 -129 219 -127 -120 -31 91 -91 35 -32 5 180 221 114
3686 114 -22 117 -55 54 195 7 12 -69 55 215 56 79 -84 -62 -108 35 -49 30 92 -17 30 10 9 -11 -37
3711 -37 149 163 -112 -4 -92 -105 83 39 -123 -13 149 -44 -51 -29 -68 230 17 111 8 190 97 136 88 -67
3735 -67 35 117 -72 134 55 86 -121 39 -21 -49 23 -267 -133 104 248 100 -56 -155 6 -194 91 -80 85
3758 85 -20 -35 48 -29 58 103 132 -308 -172 98 136 38 -29 -42 -44 3 -199 321 124 10 -3 -36 -163 58 21 -37
3784 -37 41 193 -31 301 303 0 57 243 -27 -85 -98 -106 -33 163 -95 77 88 178 -204 178 -40 145 191 -13
3808 -13 20 -15 -6 -188 58 -174 -46 239 -28 -15 -14 -137 46 267 126 -147 56 -38 26 49 -43 42 6 21 -52
3833 -52 247 -61 -129 -115 84 92 219 -216 -141 -81 165 -57 -178 74 -203 -197 -103 -190 -137 17 -194 30 51 187
3857A87q1k40L13O0k16N2J16j19j78K73j95J61q2k45L78m68J84J79q9J61k83J2
3879a20M51j95k15J22p7J82l50K4J64K00j28k74K20n2K42k19r8J02j19K69j24
3900Ek40K78M19l54j11j20P8L45m26O8J96l13J08J01m8J15k78J02k5J17K24p3
3922A68RQ9l20o9Q4p4NR5r4o3L35l08L52l89O0J16J92K9k19r4K68J37m24J50m3
3947hj26K77j84K8L2K80l79P2R3Q7j65j33L03j14p9L7m7K55j21l38K57j67o9M7
3971a62K71k95q6L61j36K13k26J27m0J35p1j42k6M7J6j37R9Q6k05L35%l37J49
3994b4J71j73M5M9j48K89n2l95J65L22l72M22l29j27K24K50l00P7k88K71k6q8
4016c7k0m4K78r9J28k25j22J58J4j9k7j4j46o1K97k43K8L4J01o3j63K78J07qk78
$$ plain form
3857 187 106 -134 179 239 23 75 191 72 -106 167 -28 133 51 -194 184 -284 -100 79 -10 151 -132 -120
3879 -120 331 136 -79 43 -34 148 -202 -178 -14 186 58 -216 4 -48 194 -25 -123 -21 -140 129 5
3900 5 -235 43 462 108 -3 -123 -45 300 -126 -58 138 -175 -67 34 -14 101 -177 -75 -100 17 241 168
3922 168 177 266 -54 -123 -39 -113 -108 -13 -107 -170 165 -143 209 -180 -120 -4 188 217 -2 -96 172 309 -115 35 -8
3947 -8 -134 143 -41 -13 19 299 -80 -8 85 172 7 -126 177 63 -16 21 -26 229 108 -230 27 -140 -209 -162
3971 -162 109 -186 -272 89 -47 166 -60 67 27 162 91 -51 -77 -30 -14 -151 -52 34 -171 164 164 -173 -24
3994 -24 147 -26 19 68 -80 209 157 -238 -73 249 -123 299 -30 -157 67 317 17 94 -194 77 51 -37
4016 -37 -57 -101 177 78 206 -19 -141 17 31 12 -15 -29 -175 -236 61 -182 -154 -120 -19 -82 -245 33 140 132 -146
4041a46K38q9r3K02K2k51J02rM1q7K58k53L45k7k72n4J65j1k64J89j02N8P8P3
4065A13j32M6nj75o7M41k80J17K52l30P0p5j20N07l93K7k5L9k30O0K7m3K90J69
4089B83m71J42j01L36k60P1J3m51M61m6O6K0j81O9j38L37Lq1l9q2Q8j50O5n3K52
4114A53k02M1q8j13K91j21k22K77K42N8j26m80K28q7p0J34J17M0k61J44J11j03
4136c7k32M85k58K30r8J12n8q8K8j99L1L5K57k30q1J99k20p4K31k38K58j97K20
4159G6r7J12k03J60l3LP1n5ml99L88j86K65j02j9n7J6j44L91k53N0ROj05N8k19
4185b71L47l05K46p1M6K32l13K41j67p2J98P4m19J16K66j98R8J7j20J23j42Rk03
4208b68o1L75q2J57r2l2P9M6O8j94j04qK01j56j52L68j44K6J17j18k03J45K6L42
$$ plain form
4041 -146 92 3 -90 112 134 -117 -15 -24 17 -70 188 -65 280 253 -19 -73 92 81 -183 6 -96 -38 40 113
4065 113 -19 27 22 -153 -220 221 -59 58 310 -20 50 -25 -145 362 -31 -4 -29 10 -220 -160 -133 -176 114 283
4089 283 -188 -46 -147 189 -71 0 13 -438 23 -23 43 63 -118 -49 -187 150 153 72 33 -49 39 -111 -46 -99 153
4114 153 -49 -8 -96 -209 82 -39 -261 16 258 316 190 -290 -62 -149 -219 -85 32 72 -189 -45 66 -37
4136 -37 -269 216 -42 188 90 202 144 56 84 -115 -84 -49 208 -22 -103 96 -124 -198 33 -205 53 -144 76
4159 76 -21 91 -112 48 15 18 89 34 30 -369 19 -167 98 -4 -23 -80 -64 -208 183 -70 -20 -11 -5 -110 -52 -271
4185 -271 76 -229 17 -54 -8 224 -89 152 -15 -87 111 185 -234 -118 148 -50 48 65 -55 68 -74 -65 -268
4208 -268 -329 46 -36 121 29 -3 76 122 190 -4 -108 -116 85 -71 -223 145 1 27 144 26 -177 -32 -6 336
4232C36l53J2j28l6M8pK70j31J32q1j37J09J84j06P7j38l1R7p6K6j74J1n6K62
4256A10J0j11j46J89m03M09n4k00M05l15K38k32j4J14k32Q2Q8L70m36J43q6j02
4278a73K09l3J61k01Q3r2K47l49R4p7K73k73L41j65m9J8J8J09k04J27l06K92K5
4301G5l3j80J21j23J55k08L90j18k87J37k58J41J65N1Q4k08L33k60k85K11J90
4322I3J02l13L54k24L3j39j29K95r1J53L2k88J79l9J19j26O9p1k39P8K97j67K05
4345A83l04J83M7m1l02K01rL1K42r9j45j8N0K05j29P4j65J31j74J41J29j06q6
4368C9M2j66J58k69J48J52l1m5q3J14l09J84R3K00l09J40k54L28j31k74M09l41
4390b05M9K84l31J75J6o4o7N4mPJ64j10j27K45k14K50j18N2j93j3L84l07M0q3
$$ plain form
4232 336 -17 -5 -133 -169 -121 -128 142 11 143 62 -75 34 218 112 189 51 20 117 41 67 -107 -96 -152 110
4256 110 120 9 -137 52 -351 58 4 -196 209 -106 132 -100 -114 0 -232 -150 -62 308 -128 15 -71 -173
4278 -173 36 3 164 -37 46 -46 201 -148 -54 -131 142 -131 210 45 -4 14 32 141 -63 64 -242 50 75
4301 75 42 -138 -17 -140 15 -193 197 79 -208 -71 -329 -188 -23 28 112 -96 237 -23 -308 -97 93
4322 93 195 -118 236 12 45 -94 -223 72 -19 134 166 -122 57 18 137 11 80 9 -230 -152 145 -22 183
4345 183 -121 62 109 68 -234 -33 -42 -11 231 132 -13 -31 19 224 95 169 4 135 -39 102 231 125 39
4368 39 81 -85 73 -196 -48 104 73 28 -55 59 -250 -66 27 227 -82 58 -196 132 1 -273 136 -205
4390 -205 -156 128 -203 -28 -12 -76 -143 -89 -93 -86 78 -32 -159 86 -128 122 4 56 -137 -150 234 -73 -33 -116
4414a16J61l8k39L50K48l99q8M05m35M18m01J80J13n50O39k4l51J91R6k86K61
4435A35j64p7J24m2P5M0r4k83M21j42n8J45j65L63l93j27M11j12L2p8o7qq6Q3
4459f7J17p2Q6O8l0j0j26K56l44L6J67j57M4M2k27j36L32R4j74M7l0k25L65J02
4483A58k25Q6J22k03K21l83J64J97n9j41R2L6k05J95j13j6J05r3k39M65o8p9J26
4506A43j95M4r8j37L39L7j29k2j6O3P2j22N3M7l2m6j91L54k46k7O9K53l73rQ1
4531h8j82R2K51K1N4k59J17rQ6K02j09K1l04J13R7rp8N1p2J8R3j91J00l7J29n9
4557D8J65NNk39K06j96o5K47m9j34M1l11K37m5P1j67K95q5j34J46O9k33p9J87
4581a5j3K2j5L2L0J20j32l63J69L29j29j97J43J52k03J80M0k62K95j49J04n1j05
$$ plain form
4414 -116 45 7 -232 118 366 -33 -121 284 -151 267 -134 46 159 -391 248 224 -127 64 160 -126 135
4435 135 -29 -106 18 -24 51 91 -3 -286 135 -7 -65 80 -85 278 -115 -242 169 57 89 11 -56 -64 -150 -67
4459 -67 50 -22 64 132 102 92 -34 222 -122 -86 81 -76 -32 10 -217 -353 -21 73 -101 -54 -84 -309 56 158
4483 158 -67 19 141 -62 159 -224 -60 137 78 -63 29 65 -140 55 -58 -74 31 -62 -301 164 96 17 143
4506 143 -52 -8 -106 -243 96 133 4 -18 -34 29 101 -21 32 79 47 1 -190 164 -82 -109 -40 213 -160 -169 -88
4531 -88 -270 -178 73 94 148 -111 6 -3 83 285 176 197 -107 6 103 94 16 67 -5 13 106 -85 15 -22 107 48
4557 48 213 218 223 -16 190 -6 -71 176 127 -7 34 -277 -40 -85 -14 -181 114 29 -105 41 110 -123 -202 -15
4581 -15 -28 -6 -21 11 41 161 29 -334 -165 164 35 -162 -19 133 -70 110 150 -112 183 34 138 87 -18
4604a8NK51n86M89j30l0l6J55k72J77Q6j94J4o2k4J10l8J97k30M0J82nj12J75
4628A44k68L65k22j70K30k88K77k7J1l38K32J39p4j29O1lK71r9pJ09l7j90J0j11
4652a14K89j57J11k07j72L56k63M1J12L8rJ47k19J75j95N3k51O81l54k36NM3K54
4675A28p7j9j11J83j93K11l47J25K16n7J81k21j70L52k83nj3l7j35M13kj73j92
4698b26J58l7o9L76n52L39J3L7j02J93k11J36j15J8j60n5K75Q8j46J24O1j83Q6
4721D8k32L21j37N3O6l10J51l9R7R9k83M0J55J1J8l33O11m88N1J70P7k35J59O3
4745A33n2j11N2o2K44j51r1j4J66K9j80K04n6j63N0J21j51J57j11J47j75o0lR7
4769B0r3K80j72J08q4q6l5J52j16k7K47J48l61j39L70l31j36K48o6K13J25m73
$$ plain form
4604 -18 -13 238 -348 141 11 -19 -55 100 -172 5 91 -103 -89 -151 -175 -65 -103 94 -136 -96 86 81 -31 144
4628 144 -124 241 19 -151 79 -209 68 41 52 -286 -54 85 11 -118 -57 -60 211 112 105 214 177 -13 -3 -114
4652 -114 175 18 129 -78 -250 106 -157 -116 -4 34 25 172 -47 128 -67 -14 -265 416 62 -174 -169 -126 128
4675 128 51 32 -79 104 -89 122 -225 -100 116 59 240 19 -151 201 -82 -87 -100 -137 -272 141 139 -34 -226
4698 -226 -68 -105 -174 202 -350 -11 2 39 -63 130 -81 55 -60 -42 -202 -257 18 106 -40 84 145 -38 48
4721 48 -184 137 0 53 119 -191 -40 -79 18 117 -166 -126 29 40 58 -275 336 -152 -101 69 146 -89 70 133
4745 133 81 -30 22 -40 204 53 -38 -52 114 143 -37 167 111 -52 -2 119 -32 125 14 161 -14 -74 -77 20
4769 20 -73 207 35 143 59 -27 -62 90 -26 -53 194 342 -19 -158 212 -119 -255 -7 -73 140 265 -208
4791b08J18J90p6n1K51r8j3l32L27n4l3K06m13K30j94R1J6K42l66K31K25m57R6
4814g2n5nJ35P4k40K58k97K35l9J22j46K32P7m46lm8R0L1l4J81L21n25M5J65j81
4839a25j41K40J26j48Q8k05K19J48m2k8n0k04J45J6o9Q3k10J33J40j63Rm6Q4J14
4863A14k8j85K38n0k37p5N14k45m4o5J42j26J3r1K27K1o4k71N8J49lO3k9n9p6
4888a09J01M1J1O9k71J16JQ2p1j1K15j86O8k8J34j15J24n3j2j67r8K94k50K28
4912A13k41J52J91l73k4K47%p0J14J3k28Q6K59k29lN9J63j19J65k18J79j62l00
4935b26K34j05P6l10L61L1j73M33n25L80j92n5J25j29K29r3pJ46L4l35K89j74
4957A4j56J81j8n2O5O6K8j95R4j71Q2l3M1J55K87m27K1M5j80K9MJ03Qj13PJ9N2
$$ plain form
4791 -208 -90 100 24 -27 224 126 113 -219 108 54 21 227 -186 44 -150 -59 -43 199 -167 64 289 -168 -72
4814 -72 -127 -132 3 77 -163 95 -202 33 -6 116 -30 202 279 -167 -170 -218 -128 -97 -131 50 371 -154 -109 56 -125
4839 -125 -266 -26 100 -48 40 -165 54 202 160 132 82 -122 23 39 -30 53 -157 -24 116 -47 -38 -84 0 114
4863 114 86 -99 139 89 -148 -223 291 46 2 -63 79 -47 -34 -125 102 123 59 -212 -154 -5 -8 55 26 -33 -109
4888 -109 -8 33 44 113 -158 -42 -41 41 -30 -41 174 -12 56 28 162 47 171 118 106 -61 -159 135 -115 113
4912 113 -128 24 215 -158 -182 65 65 -5 109 122 -106 -20 239 10 7 66 229 110 275 57 236 74 -226
4935 -226 8 -97 -21 -331 30 61 -112 321 -204 176 -16 -71 54 -75 154 61 54 200 234 -101 188 14
4957 14 -142 39 21 -31 34 100 128 -67 27 -144 -62 -95 -54 101 388 -39 -18 27 -153 -124 -120 -17 -9 -122 -115 -96 -44
4984d4N4j62L43j34J13r6k72L41n4j31j7l6k9j6J58k51L37R3j08Qj14J56L6J2
5008A87j65J40k20J49l15L42j29L1J90j65L6k29pk1J96r0KR7O3j14l3J7K55m9
5032A68O5k22k10K68j21r9l5L92l7l52L83l36L13j00j51p6K84k35k03N85m48K86
5054A19k65K41j31K31k19m4O6o4K61k36J05j25K86j99J13m2k48J37P2j08l27N79
5076B02p4k96J20J62N8j07k10J07J99j7k59o1K08j88J49p1J12J57J12l95J90J6
5098A14j96RJ27K07j12l00L12j31j41P3P5l71L27J65o2l62K79q2O3J57o1p6l4
5121b0M8k18L78m30L66j49qQ8RQk8J13k52m8K84j37L6o2P3k44R5J64o2K2l51L29
5147Dk6O0j30mK72l14M83l61K1P8k07o9K75k3k21K69r4l0K2k7J31o5J40j65j49
$$ plain form
4984 -44 10 -152 191 57 170 74 -198 143 89 -42 -59 -95 -124 -140 18 -233 104 197 89 97 -17 139 175 187
5008 187 22 162 -58 91 -224 118 -11 20 210 45 81 -148 -155 -176 20 -70 -68 29 92 -22 -55 -38 217 168
5032 168 233 11 -199 69 -52 -151 -186 206 169 -183 200 -136 177 77 -74 -150 134 -101 -304 281 -167 119
5054 119 -146 95 -36 195 -24 -68 -2 -66 195 -41 64 -61 225 26 139 97 -151 -14 58 -50 -377 202
5076 202 128 -168 -48 114 172 65 -145 -38 161 144 -115 -176 32 -156 -7 -78 34 191 303 -92 98 114
5098 114 -82 -73 54 261 149 -151 161 30 -111 -38 37 -334 -7 158 96 -266 13 -69 -6 151 90 14 -20
5121 -20 28 -190 188 -242 124 -25 -33 55 64 72 44 157 -95 -143 141 4 40 -22 51 -193 -98 66 4 26 -325 4
5147 4 -22 38 -92 -96 176 -138 345 -16 5 83 -124 -193 82 59 -162 107 13 -17 5 -22 109 44 184 19 -130
5172a30O9N3P0j82q0K40j69r5L79k89K59j17j02K25j21Np3k6K26k57R0K60l60
5195a25M5O1j06K31l08K1J27J77o0O6J32m10K00k5Q2k85J01J48J84l81J53J58
5217A86j81J44j21o9L9J43k25L80k88J98k10r3o4J68j76j05K76P4j08J13l19J39
5239i9N68k00j47O1%l93J45kJ45l01K40r4P1Pj24K80j72KO4k19J32n0K19qj89
5264f4j06K13j13m6K62M9k29o8J63r1k8r6K73Ol42K69j42m3K7J67J6j31N0r1R6
5289AL5O9j52M5o3K44j90O8k94K58p9q5K90q5j49%R2L2k8L8j71L74k87PJ04j32
5315e8K47k71J0K2j99O37m58o8n7L58j57k5Q6o6o8k5k7L53j9k13K1r2M60m10K39
5340B20j24L8n1Q8K24m80J86j45N4L1m9N3k7j66K10j85n3J98J00q9n6j68O3O4
$$ plain form
5172 -130 -61 -8 62 -120 -200 40 -129 -224 155 -134 125 8 -94 131 10 15 -58 -84 142 -115 -25 235 -125
5195 -125 -80 -19 -125 106 -202 -181 -54 123 63 129 261 -149 51 26 108 -177 -76 72 256 -125 28 186
5217 186 5 149 28 -41 -2 141 -84 296 8 206 -4 -97 -161 7 -169 -274 2 76 -32 81 -238 -99
5239 -99 469 269 122 183 183 -210 -65 -67 78 -223 17 -77 -6 1 -123 157 -15 -13 51 -168 -36 -86 133 125 -64
5264 -64 -170 43 -70 -116 146 195 -34 -102 61 -30 -58 -154 119 125 -217 52 -90 -133 -106 61 77 -54 -4 -95 1
5289 1 36 105 -47 -2 -65 179 -11 57 -237 21 -58 -143 147 62 -87 -87 5 37 9 47 -124 250 -37 -30 74 -58
5315 -58 189 -82 -72 -50 -249 388 -70 -138 -195 163 6 -19 67 1 -67 -92 -119 234 215 2 23 -69 391 -19 220
5340 220 96 134 83 171 395 -85 101 -44 10 41 -8 45 18 -148 62 -123 -176 22 122 33 -23 -191 -128 -64
5364f4J82j34J7K0q5j17K17o6j48M10m06J66J24k54j42K06J41q1J48l50N0K74
5386A08k51J5k9R4o4PJ10rK6p6J69j58N7P7p4R6k01n9K47o9J07k0J1j88o6K3k7
5413a44K38%j52j16K44L1r2M5L2mj6l12L84k65Q8N1J95k9l07L30p4l9j02j44K46
5438H8j99J12K8j97O9J56j95K00k6k0J79r5j65J14r6j75M27r1j12J88k8j40Q1
5461A03p1J3K3J37p4n27L84k20J03M8J33j08K40r4K52o04M43m37J70o9j16K13
5483e8Q9K01j16k78J59o9J84k2k01j83K37j99M59j64NO1m7N2K1j91J42j64j40
5506b22L10q0J47j73J00k67L20j98m3L39m04J39L8p2k55O71l59L2j52J83j11m9
5528a06K27k98R7J30l46M59j71k5J48j90K9k8j6J38j0o6J82L7j14k8q2J69j95
$$ plain form
5364 -64 118 -16 1 21 -64 -181 36 -30 -178 232 -174 -8 116 -138 -280 -74 67 -14 134 -216 -166 108
5386 108 -143 -128 -157 -63 -127 -120 -10 -19 7 -69 100 -58 -1 76 2 98 -103 -162 85 16 123 103 114 -74 -140 -117 -144
5413 -144 94 94 -58 -174 70 101 9 54 86 82 66 -246 138 -127 -39 12 207 178 -129 201 127 88 -14 -158 88
5438 88 -111 1 29 -168 -99 57 -138 62 36 16 195 100 -65 49 -47 -222 205 114 2 190 162 22 103
5461 103 32 45 68 205 131 -396 -12 -232 -129 -81 52 -56 184 90 342 -262 181 -256 -86 -155 -271 -58
5483 -58 31 232 116 -162 -3 -72 112 90 -111 -294 -57 -256 203 39 44 105 58 110 131 -60 82 -82 -222
5506 -222 88 8 155 -18 82 -185 135 -63 -106 233 -171 -32 6 -66 -321 350 -9 23 -129 54 -57 -106
5528 -106 121 -177 -80 50 -296 163 -8 -33 115 -75 -46 -74 -90 48 38 -28 154 191 77 49 -33 136 -59
5551e9J47k21K76k96K23P2M0k46K48m95K31O4J90j18j05N5j53K70l69J32J2J37
5573C5j43J9K8K65j3k59K4n8j34K00L40r5m23K28j68P9J19O6k31R2J51m4j13k67
5597c02L87r6j87J78q4K86j01j09k52J88J01m6j33L54j90J61n02K97J02l64O3
5618b49K26M2jJ71j58M1k06J05P5P4l01L69nqj22K14k43j60J86jj3k40L23k00
5642h1n4J3l0K49p0k04M28j96J60l63J96k31L11k35K06k2K1j97J80l08J21K8J92
5665A14j30L0k7Q8K67m01L36l40l7Q9M0Mk03L55k98L31L9m01L28j45k13M6J35
5688Gj12j7K52j22o3L11k90j71J17n6K23l1Q8P2J0k00L4k6q6M9k20L60m8n1N8
5713H8m3p6K15j62k31M89n40K44m7N8j38L0M58l02M0M8l3j20j38J27M4K24n5o0
$$ plain form
5551 -59 88 -133 143 -153 70 142 182 -64 184 -311 -80 -16 174 56 -49 6 -147 123 -246 -114 -102 35
5573 35 -108 -89 -61 204 191 -68 -44 -102 -236 -36 304 209 -214 14 -154 -75 44 110 -121 -29 122 78 -35 -302
5597 -302 85 -11 -198 -20 -104 182 81 -28 -280 -92 9 -37 -170 184 -6 155 -347 -50 52 -312 -249
5618 -249 -23 19 18 189 31 72 -134 -29 46 120 -181 188 183 175 53 267 24 -136 50 49 36 -204 119 -81
5642 -81 -135 -122 -152 97 27 -177 251 55 215 -148 48 -183 128 -107 99 77 98 -99 81 -227 -106 -78 114
5665 114 -16 14 -13 75 342 -59 277 -63 -100 -11 29 33 -170 185 -113 218 257 -144 184 39 -174 -128 7
5688 7 -105 -122 130 8 -55 256 -34 -205 -88 -144 79 48 136 208 218 18 52 26 -60 -11 -231 129 81 30 88
5713 88 45 -31 184 22 -209 280 -260 -16 -63 -5 -143 -113 345 43 83 131 98 -22 -160 -33 11 235 180 120
5737A20j80l06K93k02L74j12P4Mj6j07J67m92N11j2k11J18P5k56J45k28J95m0
5759h6j19K25q9J75j73j66K41j28K55q0J05j96j09m8J98j07J45q9J31j8j65M10
5781C12k12J55l0r0k14J01P7j74r8J2L06r1q9m3j38J72O5q6j3K98j48j15j8RJ29
5806G7j33l08O24k63K2Nj54M2J24J22j91J56j30k4K64o0r2l7k61L61j90K71j12
5829A13r8r6m3K2P0j42P9MR2n6p4j27M55k48OO8R0p2m7k6%J02k48K29KJ38l83
5856a90J97l3q4m4P6J12PMq3K04l10o6L56l51J01R0K13J36j92J0j07J6K6o7K26
5881B47l88J64L21l83K42n17P2K78q4Q5Jq7nJ09R3J3k23J66l58L17L1j03P2j02
5905c9q7n0J98J84j81p9J77k37K35j10J7J77k17l16K02K33k6q9L7j1q8j17M4J41
$$ plain form
5737 120 -60 -366 -73 -275 99 -13 61 65 49 -58 109 -383 128 116 -95 23 98 -158 -13 -241 -46 -86
5759 -86 -205 20 -69 106 -67 -233 8 -120 135 55 160 -36 -145 -193 5 -102 43 -46 85 67 -98 312
5781 312 100 255 225 135 -79 22 99 -75 -173 -161 145 54 -35 -78 -216 -44 21 -65 -78 220 72 -43 -61 -52 77
5806 77 -56 -364 260 -3 19 24 -130 -88 36 158 -33 123 -7 -31 233 173 81 44 -217 144 -46 225 113
5829 113 15 -81 -124 -102 -32 -174 -95 -91 1 -55 -129 -256 199 -49 -43 25 115 43 -4 -30 -30 72 -176 53 55 193 -190
5856 -190 7 -26 -110 -154 -78 34 41 45 -38 166 -144 -210 146 -205 -104 -14 199 335 143 153 46 62 88 21 247
5881 247 -141 23 344 -39 203 -314 -242 36 -48 37 38 -49 -54 55 148 161 -62 104 -254 63 94 -9 63 -39
5905 -39 -126 -176 22 206 25 -54 123 -114 121 11 28 205 -12 -328 -126 107 81 -8 29 18 -70 -187 -143 -2
5929bn6J6J86n3J01k53K6N1k50L18j95J16Q8k00J07o6J03j6o2R4j68M8K7O0OM6
5955G2J83k37O1q0J20j83k6J27q4M5M5J6j17J21J53j86k72J1K83Q0m9p5J46j54
5979@p7j22K25K53q4k15J85k31L0j01J95O0J08l5k7O9j62j50Q1j4K1J00j2r7N6
6004E6J25j92m1J0J72k50L3k1L06j46j21L03p9k05j6K95l28j63j14K80K76k30
6026e0n8J07o1q1K34Op9J62k65j1L10J57n28P6J37j10n4J91o4P6M1k0l0m1N1j02
6052fM5k25K62O4m68K56M54l38O8j49j52K55J8q8j0m9N8R5Pk03L70j51l41J81
6076d7J78kr2j61J0k2J04rp2K59j26K81l78p4K46j02J5p0K43q9j86R7J54k82J16
6101ik43M49j64r5J04j70N8Q9L4r2L54m29r9J70R7k3p3R0n0L9j2j9m2Q6K84l29
$$ plain form
5929 -2 -58 -42 144 91 192 -61 -35 16 -234 84 -111 5 93 -107 0 -66 37 21 -41 53 -115 -67 -40 20 26 72
5955 72 255 18 79 -1 119 -64 -90 37 -47 -2 43 59 -58 63 216 30 -242 -231 52 132 83 8 154 0
5979 0 -77 -199 26 279 195 -20 165 -66 -36 -137 58 118 226 191 164 233 71 -79 2 -12 9 109 97 0 56
6004 56 181 -11 -52 -42 130 -120 -87 -108 198 52 -69 234 155 -50 -66 229 -99 -262 -376 -96 180 -50
6026 -50 -108 -1 -62 -143 91 97 18 180 -85 -96 214 371 -157 -81 56 -54 -108 83 19 95 136 116 86 45 96 -6
6052 -6 39 -186 76 140 -328 -72 382 44 112 -37 -189 66 84 -4 -14 -63 -5 90 97 -106 264 113 -228 -47
6076 -47 131 129 37 -124 -114 -136 -32 -41 -113 146 20 301 -77 -151 95 -7 8 -62 181 92 -94 3 157 -125 -9
6101 -9 -252 197 33 -62 42 -128 -70 19 53 -39 315 -114 -213 -43 54 31 -42 48 -2 37 25 6 -36 50 334 5
6127Emr0J00o2L03k08j62j54K94k84M86j00j80L5n7J54j86j73R6J82J98l62J88
6150A9J98m79M49q2m4j67N7J5J4O8n4k7J77k25K59j73j41J56J25J59k53j17J70
6173A04k50J48j53J61l6J10k42P8J03j24J21l8l8p9K01j67K20p2j2P1j89J4K9
6196d0R5l91M40J94k61J08k27J16L3k51J65k16K98j6k29J06L81l22J59j30k7J20
6218A05k08p8J14K30P6k56n9J26m7J14j95L8k4J24j76k4K92O7l05M47j14o06O21
6241B62m02L19j49j02j6J03k38m1J79J48j15L9J75k76J51j05j61L00j87O7K86
6262B37j96O5m30K43k2J34r5KP4p3J22O1j3l16J04K97j23N6m7N3k04K48k31l4
6286h8J44k88J94K35k10N4j40J72K7j07K33l1j39m1J99K3j58j04j05Q3j10K26
$$ plain form
6127 5 1 -89 11 -51 252 44 -118 -272 22 -262 224 124 -56 -21 -78 76 -110 -283 -187 -5 193 -169 19
6150 19 217 -262 187 105 61 -106 -49 -34 -20 48 -6 -33 144 -81 178 5 -136 20 145 304 51 -66 104
6173 104 -146 2 -151 10 -26 84 -158 -80 23 -101 20 -18 -56 -135 66 -101 119 47 35 106 -83 -69 -40
6196 -40 55 -336 104 298 37 145 -82 34 67 -184 -19 -235 63 47 -182 -76 305 -17 142 12 -15 105
6218 105 -103 -181 -67 163 239 -17 -76 50 3 117 -78 -40 -64 60 -116 -140 152 219 -86 361 247 -359 262
6241 262 -140 179 30 -72 -88 15 -223 -264 -85 63 -52 -13 162 -114 37 -68 -229 71 -116 -49 237
6262 237 41 106 -324 -81 -103 31 -64 -62 12 -61 61 122 109 -207 -103 194 71 127 80 133 -71 177 -54 -88
6286 -88 56 -232 -38 197 -13 41 -99 73 100 -7 226 195 56 15 214 237 79 -25 -130 -47 -157 69
6308F9k70J35p3k81M45J13l03m8M00k39Q1qJ4j78J59j03m1J70J52r9j28J5r4k6
6332a38Rn1K39L6j96K57J0l16M06k86K04j34p6k0J37q9m9K37j52j29qQ5J06K78
6356C60m96J72J81j55J29N9q5j33j14J94j26j39J13J94k3k3j11j40K71K5k55l6
6378a38j12N44k68K01k70K31k21j46J11K93k67j78J84K47p4k28K23j27L7k08K56
6399I0n8J67k55J4l5K90k78p9J11J51j08j66N1n2K43o9R5k05L9nK4l03M01m8J97
6424B12M6l72K01l56L45j78O7o1j15M43m34J76j63L2L63k05L13k49P9j27J85k69
6446f7K89m02J39j50L73l4J91r4k78J27j31L3pq9J27l9O8q1O1r8O1N3j27k9N1
6471e3j2k8J25q4J65j29J37j4j05j83K59k28L99l94J11k56M14N6m1k18K00p6J32
$$ plain form
6308 69 -201 -66 -139 -420 25 138 -165 -213 187 -52 29 21 35 -143 16 -87 -128 42 194 95 -33 -18 -112 -138
6332 -138 -129 -180 59 95 -101 156 166 -150 256 -30 174 40 -36 -56 81 -8 -57 180 28 -101 -109 -24 82 360
6356 360 -136 36 217 62 191 250 165 32 -82 112 -14 -153 -40 154 131 108 -3 -143 128 153 -102 -138
6378 -138 -250 294 26 227 -43 188 -33 -179 -68 225 -42 -220 -36 211 137 -91 132 5 42 -166 90
6399 90 32 199 -56 -42 -77 213 -65 -144 -33 118 10 -156 -105 -157 86 17 112 -93 -54 -59 -35 -338 63 15 212
6424 212 258 -114 87 -269 76 -102 -35 -96 -211 232 -202 -26 -189 -157 206 1 314 65 144 17 202 -67
6446 -67 222 -180 -41 -191 182 148 339 245 -33 94 -37 -4 -11 -100 27 -12 56 -25 36 -62 -1 52 -75 -104 -53
6471 -53 -65 -93 32 -52 113 -16 121 107 2 -181 78 -150 249 -145 -34 -290 124 180 139 -79 121 45 177
6494A77J56n00Q9K86q5r3l4j40J17J99L9l1k91j00J66K58m38n1K38K09k11J98
6516A58l09rL3K5L85l91K86k13OoJ87k39M0J38r3o6M7j64J69MpP5K4j07O4M1k7
6543E1Mp1j2K18p2kk65J20j2J94j46L11O4m89L49n53M58k02J67%k46K12n1J56
6567A83j51p3o4J07Jq7j8K51p3K9Q9J9k23L49n51M53l82p0J52m7J46Ok77J33K94
6592A96k83K53kj18J31l0k14K90j83R7j85j36L42j74K61j26oll41M55k31j17p0
6615a94l4N50l50J06k2k46j9J55K46r4l54O6N5O7J32k23L00j67p3M5%j30J26l0
6639h8K39l39L96k21P6o6l1j01J23J59k82k65N74j29K55l50l2J30QP7m7J5k01
6662a00M6j07J87Q0q3l9J4q2j78l1K34J53Q6k11K83k20k31L93j62Q6j92O9j62
$$ plain form
6494 177 333 -167 -78 208 123 30 -4 -144 -27 172 211 180 -111 -211 -45 213 -225 -276 -38 171 -40 158
6516 158 -151 -160 -127 -102 283 -108 178 -35 -29 -35 152 -87 -47 91 -2 -68 -21 -185 -16 -12 -19 56 80 -27 37 78 51
6543 51 55 -16 -28 190 118 116 -149 -29 -41 153 7 318 382 -107 242 -311 147 -55 112 112 -134 78 27 183
6567 183 32 -41 -105 2 3 -84 -102 149 76 105 194 213 -10 339 -212 241 -141 -211 -59 -106 40 46 -231 -98 196
6592 196 -87 166 164 46 177 147 -67 223 40 137 -48 -184 158 -16 245 119 113 110 -231 224 -7 -124 -194
6615 -194 -228 322 -28 78 56 -190 -209 -54 192 98 -256 -190 -135 -68 64 -159 141 -26 -99 -54 -54 -184 -58 -88
6639 -88 151 -188 208 -13 63 -3 -34 -135 -12 147 -135 -400 174 45 300 -50 -82 48 56 133 86 101 -100
6662 -100 -54 -161 26 106 23 -16 -2 -84 -262 -293 -59 94 180 -31 252 32 -199 194 32 118 -74 -5 -167
6685a67L0k10L40j30L57j37o5q3l7J47K9qj86K51l0m7o1r7q9q1K36j27k8Q3K26
6710A16m6k39L06j4j88J99N1l35p2L11P1j34kj62L23r8j1r8J01j09k3K53j14j67
6734h1J19p0m6J86l3j79K96l1l7N8j59k32J37j16L44k3j08m2l6L08m41J63K6P4
6758G7j49J39q1MN6p9m2p6K11j74N9o7J63oj32K96k22J7j83K17L5l79N11j91j76
6783a72K79j31L2j28J73j57J27J16M2l82J42K30k07o7N6J49l42J29K07q1J10k75
6805a50J61j0j65K23M4l46L34n54L04L9K01r7o6mo4K22k84K27o2M2J69l17J02
6828e1jO8M7j46p3kJ17j28K73l51J20J58k5J53j72r5J18L2k51L65rj97L67m59
6852a42k50L94J8J77j3k22K41J44k95jj82L06m1j15Q5K50k85k32K15O2m3l20K50
$$ plain form
6685 -167 -137 -347 -7 -137 220 83 18 -65 -102 45 74 66 -120 131 101 54 -7 -104 -193 -274 -38 -165 -193 -110 116
6710 116 70 -169 137 123 -65 134 185 -150 -222 89 160 26 24 -138 185 87 76 -22 79 -30 -53 200 86 -81
6734 -81 38 -32 -78 108 75 -104 192 161 124 182 23 -209 -72 -188 156 133 25 -17 -53 255 -186 -23 3 77
6758 77 -72 67 -14 -10 46 -33 -75 -151 60 -114 -55 -122 41 35 -97 199 -23 -6 -189 28 63 -316 195 4 -172
6783 -172 107 -24 8 -120 53 -104 23 139 181 -201 -59 171 -36 -103 -47 102 -240 -111 96 15 125 -150
6805 -150 11 1 -164 59 103 -243 91 -463 -159 -120 81 -16 -82 -86 -150 72 -212 15 -47 -5 164 -153 -51
6828 -51 -52 16 63 -83 -156 -158 -41 -169 104 -247 -127 31 6 159 -13 -108 10 42 -209 156 147 -50 317 -142
6852 -142 -392 2 20 197 184 -38 203 347 52 51 -131 175 134 19 104 354 69 -163 52 114 71 -249 1
6875Aj06N3ML5L46m16J04l3j54J78l0K7j68K91j17j65J28K47m4k6j10j7J37k05
6899d0j32J66M0j77RL23j25M2o3j20j47L84m3l58lJ82K17k80J8K93k37Q4j86j59
6923c12J38l3J79L20r3k50j14K40k19K71j2j66R1l7oJ59k5R5m81L43J42m07P6
6946a01p1J41P9P4k97K17j09j24K24j35L16j59J38m81L20k52K51n0KK3J6r2J19
6969D9k1j07m8L07Q2m45K86j07J18l45N07k12J7k8o4j8Q4k52J01p1L51k14J09
6992G9o2J40p9k2K72k03r0n5K3K57l01J61q3K76l82p5R3k12J36Q7Qj52L6K62p6
7017C8q0J39j04j7n6J06j3K3k40K24N0j82mJ45J54j51J88J2l44J83J00k83L88
7040B76l02j45K88j20l9j64J34R7O5o5j66O5K9k25L57q2L53l37j13L04j15l33
$$ plain form
6875 1 -105 -52 -48 -13 333 -83 21 -12 -166 12 -18 9 -159 132 15 -150 -22 225 181 155 45 28 165 -40
6899 -40 -172 -6 34 -143 -134 189 64 106 43 -77 -224 160 117 -241 -244 -62 155 -125 -107 186 -51 33 -153 -312
6923 -312 -174 -207 -28 292 199 -51 -165 75 -144 127 115 -51 40 3 -3 156 131 226 -255 88 230 -177 -101
6946 -101 -172 -31 48 122 -175 42 -67 -191 33 -102 214 55 193 -288 32 -220 31 -19 -17 6 22 -70 49
6969 49 28 -79 -127 180 262 -183 103 -4 114 -231 276 64 81 53 -11 -29 55 -197 -96 -167 184 -30 79
6992 79 17 157 78 56 328 125 35 -20 3 260 -41 120 37 313 -69 -144 -51 -263 -127 -40 -32 -184 -148 114 38
7017 38 -42 97 -7 -24 -80 26 13 36 -204 20 70 -112 -116 29 183 32 220 232 -112 71 171 -112 276
7040 276 -26 -171 117 -3 -42 -206 -72 25 90 25 -141 -76 -47 -272 85 3 356 19 -94 210 95 -238
7062b38k7K65j24J65J0L7m5J42l64K26M1k43K87j39k1K9j38K3L29l49K11o1J48
7085A64l07J71m9n4J4L43k51k3K00l72K58j23P7R6k7l8n4L1j43kn5Q6L1Q8K49
7110C10l75m2J60j84J63K19o01N64j63j2L2m11L39j89l6K93j06J7J1j17K80j28
7132B4J21j4J9j72J92m72N36l57K3O7O1J07k49k4K52j63n6M64j72l23q8O3J07
7155e4J83j01J2J07j16O7O5j24k44K89K57m27J07J25k36K83m45K95P8k76P2P5
7177hN9l99K67p3K12mJ4k79L42n8k2j2jN6J42r2O3l02K0M9L5j25rQ8P6j16J63
7204H6q7j29M1J86q3M4qj57J73r2J92j61k31L71l28Q0l6J41j08p9Q8P8k1j80K86
7229F6No4m1K29j69L41l20l2j84J30J0K8p9P4K39k33q6j22L12J46j13l04K93j37
$$ plain form
7062 -238 -265 0 -124 41 51 88 43 185 -179 47 88 -155 132 -7 -28 1 -137 -114 215 -134 77 16 164
7085 164 -143 28 -21 -75 -61 282 31 8 208 -164 94 -29 48 144 117 79 25 56 -87 -89 -144 -58 -27 61 310
7110 310 -65 -107 53 -131 32 251 -350 214 51 39 71 -340 -1 -190 -226 67 -39 -22 -11 -128 152 24
7132 24 145 131 150 -22 170 -302 234 -123 -100 -33 28 135 -114 -138 114 -49 -105 359 187 -136 -224 -161 -54
7155 -54 129 28 40 147 31 98 163 39 -205 84 341 -86 21 146 -90 193 -252 43 121 -155 -83 -8
7177 -8 51 -348 -81 -154 58 54 68 -211 131 73 51 39 38 94 236 144 207 -95 -75 -26 9 -116 -125 -37 39 -77 86
7204 86 -1 -130 -89 97 14 58 50 -107 66 -26 166 5 -226 145 -183 -103 -139 2 -106 -185 -97 -19 -40 -220 66
7229 66 71 7 -34 195 26 367 47 15 -169 -39 -29 -1 -80 -6 233 0 -86 -208 104 250 137 -167 126 -11
7253a1l4O2Q3k98J88j14J01M24l42J69q9M0j99O2j71P9j17R5J28n1J84j31J28
7276A86l0l7m1l92L59j81j81J75K06j77M30l97K26k33O8q2r1J94K39j98k13K68
7298I8j29j2q9J96o5J30n7O6m9Q6p4p9K7j43J95k41Q8j23L6K16J97l76J73j56
7322h5j12K72j46O5l90M87j26j30J77M2j24q4L75j69j66o2K94P2k15J41k3r6P9
7345G6j38J39Oo6k0j79L32j25q8L4j3LQ6N8j45N0or4o5K69k01j4K14k58K40j13
7371a8J80j63L4p3l2J44J42J33l65Ql7q0J73p2J25j02J64j06m5Q5n2K0kR9q4Q9
7397A65p8j28Q4Q9n3n6j09J98j55J30j08n6j08J19Q1j09J68j87j22L37j24J52
7419A30J19j46k21M44l05%r8J91m2j41j31K56J01k25J16j61K59l52M69k88k12
$$ plain form
7253 -11 -45 17 100 -198 -10 -124 -23 401 59 228 139 179 -20 42 -129 -50 -167 -72 56 5 189 58 186
7276 186 156 119 78 -314 45 -136 -317 -142 64 -113 317 -80 146 -87 -19 -101 -192 2 241 43 -170 98
7298 98 -31 -43 -132 64 -1 129 72 138 89 175 101 22 49 -94 101 -140 -52 -175 -139 77 274 -102 71 -85
7322 -85 -197 75 -71 -6 -396 91 -35 -165 12 54 -70 -154 221 52 -114 -176 118 190 -25 116 93 -3 76
7345 76 -62 77 83 17 -3 -182 150 25 -63 -29 -42 -39 47 105 -40 10 4 -90 -155 114 -87 -101 113 -145 95 -18
7371 -18 162 -1 33 -40 -72 72 214 347 -18 -10 -47 -127 46 -26 99 -3 161 55 10 95 43 63 61 160 76 165
7397 165 87 -41 43 132 79 23 -86 112 -43 87 -21 -77 -185 -66 15 -94 74 -113 -235 102 -22 130
7419 130 249 103 -118 326 21 21 -77 114 72 -69 -200 56 157 -68 48 -113 146 -206 263 -25 -237
7440b37J75J56J10q3j21K0Q0l17L12J54j00j08l4Rl1j83M85k78KP8j27j29K78
7463A11k2J04j56r1nK04n2l21L13k03pJ26j31K60j24R2j80J92l05K50J30j48J24
7486A61j45n1l94L77J80j41r1p3L00j83K22j69L35n63J52R2j16J97m7P4k26j37
7508b46J83n4Q3J36k10J15m1M3K1j70L6M4J49j33L6j96R4J31k12N3j54K57l7J47
7532G5q0p4n7L2j12J66J36k11J10k29M65n2m14M84J5l11K6rM8j15OM4P7O1j68
7557h7M43m74N8P4k31N4K20J42l37J19n1L18j50L5j25j8j68K34K6j44j98j1L08
7580C7m2o5N3K06j47k04N54m03J68l02J34m9j7L05j78j48k7K65j95j97K93L7l2
7603D6J24j06j44L0M7q5k78L10P0K7r4K11k99p4N53l66j15L9J02j63J07K20l56
$$ plain form
7440 -237 -62 94 204 121 0 20 100 -217 95 249 149 41 7 16 -15 -198 287 9 11 89 -38 -167 111
7463 111 89 193 37 -54 -59 145 93 -228 85 -118 -125 1 -130 130 6 98 -82 110 -195 55 185 37 161
7486 161 16 -35 -429 -52 128 -13 -104 -177 123 -60 162 -7 328 -235 -83 9 -107 90 43 117 -109 -246
7508 -246 -63 -117 -34 102 -108 7 -34 9 30 -140 -104 -60 89 -44 -8 -204 -110 21 -191 -138 -292 -35 -72 75
7532 75 -5 -79 -136 -104 -216 -50 86 -125 -15 -244 221 169 -245 239 254 -57 -31 -40 8 -107 -101 -57 20 81 -87
7557 -87 356 -118 -60 14 -217 -163 57 199 -138 -19 -70 248 98 133 8 -10 -178 56 82 -62 -260 -271 37
7580 37 -5 -70 -17 189 42 -162 392 -11 157 -145 -11 -60 -77 228 50 -98 -125 140 -55 -252 41 78 46
7603 46 170 64 -80 -50 -3 -88 -366 -56 14 41 -53 158 -141 -215 338 -28 -143 -104 -2 -165 -58 162 -194
7626a94K17j70K9J44o5k71N54l16n3j8R1J93r5O1l06P2K86m84J38j09K90j07m5
7649a58O6J03J3j76L37j33j19K68j86j42K42o1j43M6K91l29o8M75j51k49J87j48
7671c5J7L1K48m67J71O9K65l49k4j25J7n7L17qp4j3k6J97l65K61L6J12k65L69
7695C02l98n1J86j28K33j46Q0P4k06j4j3L24m55J21J46L1j18L76o31K57j39L25
7717A56p9J61l30J31O1o9j20Pm9L13m24J66J37n3M6j55K85j14j07n6j7J7J12R2
7741A11R8l22K28q4J03k81R4j0K7J33r5M8m2L48l84MK39j79J93l53ML57k56j52
7765a71J91Rj37L79l62K17l14K19Q2J10l31J04O7nk8R1k88P9J95j82L08l80J45
7788bj80K84k10p4K13j35Mj11L95j22j39pJ86l02J00J60l37M98k00Mj22O5K50
$$ plain form
7626 -194 23 -147 -118 26 -39 -310 244 -72 -125 -143 -52 141 46 107 -199 -127 159 -325 -187 -296 -6 -113 -158
7649 -158 -92 11 24 -152 185 52 -67 201 15 -127 115 54 -89 -43 248 -81 -149 326 175 -74 113 -35
7671 -35 -18 13 261 -206 -35 34 299 -50 -74 -199 -182 -239 78 70 -4 -17 -43 154 -211 50 86 198 -67 302
7695 302 -96 -147 39 -89 144 -2 78 152 -54 -68 -81 243 -212 -91 55 86 -32 344 -287 -30 -169 156
7717 156 77 238 -92 39 100 31 -89 -82 -131 182 -242 -76 61 8 54 -101 184 70 -37 -93 -110 -93 19 111
7741 111 209 -113 115 31 134 -147 -53 -63 -36 97 2 50 8 356 -28 -24 215 36 229 -124 -120 237 -19 -171
7765 -171 20 29 -108 271 -91 126 -188 31 113 223 -108 -4 63 58 30 121 -167 -88 107 -75 233 -147 -2
7788 -2 -182 102 -108 -182 31 -104 -100 -211 184 62 -77 -84 102 -200 -100 60 -277 221 21 25 -97 -32 218
7811B18l58K21k09N2L7p3K36m17L35r4J08k72K14K4m4P8k79K09K3m0L1M0l2ln8
7836e3J5rJ01j00JP2Q6l30L85l68L51m09K46j9j18N14m93J56Ol6j37M28l80KK9
7861f0J11l2J90r9J5q8L4Q5n6j03J8j17J41j2p9k8K02k72P1M32o41J28L5j30L99
7886A44q0k8j28J71J7o4q7K11k11K7q5J66P1q3j95L04k45K22j09j71N8J17n9P0
7910C3J9k82L42k67K86j15l3Q3M1m2j3J91j84%k28K95J0p8l0j11R0j34R4J93k31
7935g1Q3r5J70j81K35j19m3L7j88K73j1Kk04J01q6J24oJ20N8m69J94L6j70K44
7959C4k45K7L42m05J67K77k16l2J6K00p8J65j05J40l77K29l93J86P0j33N3J31
7981E3l2K67j94k89J96Q5Lm1K8J12n21M87O8n63K06j56N46k67K42l06j30J09K10
$$ plain form
7811 218 -140 81 -128 -76 -39 -112 124 -293 42 -52 56 -216 -2 22 -22 56 -223 -14 9 -31 0 40 8 5 -53
7836 -53 -38 -47 54 -46 -45 27 113 -217 168 -200 151 -258 -12 -31 -149 365 -128 28 34 -2 -139 289 -91 -89 -60
7861 -60 51 19 209 110 125 37 71 156 100 -3 15 -102 39 27 -52 -80 122 -150 -79 353 -288 -160 -125 -255 144
7886 144 64 36 -92 79 96 32 -55 156 -55 -28 -113 53 124 41 -154 150 -95 127 18 -153 -95 22 -37 33
7910 33 52 -230 112 -155 131 16 -17 66 107 65 52 243 59 59 -169 126 136 58 28 -83 7 -127 -33 160 -71
7935 -71 12 -83 87 -94 141 22 -21 16 -172 101 90 92 -112 -11 -97 27 21 141 199 -270 -76 -40 -210 34
7959 34 -211 -184 158 -247 -80 197 -19 -51 -35 165 87 252 147 287 -90 139 -254 -68 2 -131 -78 53
7981 53 21 288 94 -195 1 86 89 48 76 188 -333 154 222 -341 -135 -291 255 -12 230 -76 -206 -97 113
8004A13j03n3K71j27j38oM2K5o0R0J32l28J80j41j7K15J9k95J55r2j01L59k42
8027a02J74p1K09l14K4Q1J37o9j15J30k08l5J72j33q1J83O8O1l96N32l00K47j50
8050D4n1Q2P1j29O1J09q4j09j42K31j46J64L5l04R1K24L3n7j92J09j39J62l2R1
8074A22r6L47k56L4J53m32L51k38p6O4j10J72J0l12J77J79K1l59J56j7K20P1j45
8097C6K4Nj00J03k22K48N6n2k77K71p9j8J87r1m2o7j02K78k09J12o4l14J09K08
8121@J5k4J58l33K55J52Oj77O1rJ4j19J04j00o0q4k2NK86j86J28k45R4J81j95
8146i5J10j6q3J73Jj29J87q9k15J57j76K82Jj41O4j22R0K25m04J08r8K75k78L78
8170B05j7k04n7PJ68k3J17j47k21K70j78M4K7m0j19R7Q2L62j61j53m07
$$ plain form
8004 113 10 -43 228 101 -37 -43 -1 24 -36 54 186 -142 38 -103 -120 95 114 -181 -26 -118 -219 140 -102
8027 -102 72 1 210 -104 -80 1 138 69 -46 84 -124 -159 13 -120 -201 -18 50 111 -285 247 -53 194 44
8050 44 -7 75 146 17 78 187 103 -6 -148 83 -63 101 136 -168 -77 147 180 123 -69 40 -99 63 31 122
8074 122 26 373 117 151 304 -128 223 -15 -91 -27 -137 35 45 -267 -90 89 110 -249 -93 -110 110 181 36
8097 36 60 65 -35 68 -154 94 150 98 -179 92 13 -5 182 91 49 -18 -120 158 -51 61 -3 -317 -208 0
8121 0 15 -9 149 -184 71 223 229 52 113 104 118 -1 103 3 -57 -141 -163 -158 128 -58 70 -175 -81 100 -95
8146 -95 15 -1 -84 89 90 -39 148 59 -156 1 -175 107 108 -33 31 -91 -1 224 -180 -72 -170 105 -173 205
8170 205 188 -16 -73 -66 102 79 196 49 -172 98 -80 -36 -9 -49 -168 -71 11 373 212 59 -348
8191c48
$$ Imaginary data points
##PAGE= N=2
##DATA TABLE= (X++(I..I)), XYDATA
0@%%%%%%%%%%%qJ6j6J6k4L2l4M2n6O4p2Q8j04J23j47J72j96K25k63L02l44L92
33B08m43N00n65O37p14Q00q94R94j107J230j360J506j665J837k026K233k461K710
51A420k984L290l630M009m434M915n468O106o852P743q824J0170j1903J4226j7520
66i736K2593l1501N1703j84319j4340K14625j54059L6537J21287k0387k7256J04659
78A09806l2761k9205P9862r542j05357N0073J6722j23608j2265Q5730p2897m8871
90i2313O7474l4332p9391O0938L9980k2142L6615K9609j336Q3075M7676p9329
102E6524k1886P1583l0150p6949J9629P178n9433o107j008m4497K2165L9482m0005
115f3474J0172P1660j7130m0897L7344J9985j3973L6969L6644k5615j3518K0613
$$ plain form
0 0 0 0 0 0 0 0 0 0 0 0 0 -8 8 -8 8 -16 16 -18 24 -32 32 -40 48 -56 67 -80 92 -104 121 -142 160 -184 208
33 208 -235 265 -300 337 -377 423 -471 523 -584 646 -714 792 -873 964 -1062 1171 -1290 1420
51 1420 -1564 1726 -1904 2105 -2329 2586 -2882 3224 -3628 4115 -4709 5461 -6442 7784 -9736
66 -9736 12857 -18644 33059 -151260 -165600 49025 -105034 -68497 52790 32403 5147 109806
78 109806 77045 47840 127702 118160 12803 62876 79598 -44010 -56275 29455 -43442 -92313
90 -92313 -24839 -59171 -138562 -77624 -37644 -59786 -23171 6438 5102 88177 135853 56524
102 56524 34638 106221 76071 -878 18751 25929 -33504 -39611 -40619 -85116 -62951 -23469 -63474
115 -63474 -53302 18358 1228 -39669 -2325 17660 3687 40656 77300 51685 38167 58780
127E8780j6514l5910p607j3791j4419J2561j5249l2991J7539J9089j5157J4794
139b8875L9375J0668j04M376k491l017J546k506n267N722Q520j0826j8084p696
153h659r263o206M407k321l005O530J499Q59O647O137J2955J3391K042L340Q71
168B9224j1734r184q074q296J623K786m618k470K717K41o044k066P541M400L626
183c28J0247j091o818N654l51n259R544M220p962l80l230j4237o214K153o05J509
199a3148R577N737m339J417N657m715J590J1507k366m307N706o203r850K509j783
214c011m903M754L345m542l634k48j807q20O434P229N78O593N373o778k036K226
230H753o039j528L996m446l367l85n685m032J995K593K232K784L960N41k243K441
$$ plain form
127 58780 42266 6356 -1251 -15042 -29461 -16900 -32149 -65140 -47601 -28512 -43669 -28875
139 -28875 10500 21168 21064 25440 22949 19932 21478 18972 13705 19427 27947 17121 -963 -8659
153 -8659 -17922 -24128 -19721 -22042 -25047 -18517 -17018 -16159 -9512 -3375 9580 22971 25013 28353 29224
168 29224 17490 8306 232 -8064 -6441 -3655 -8273 -10743 -8026 -7785 -13829 -15895 -8354 -3954 -328
183 -328 9919 8828 2010 7664 7313 2054 11598 15818 7856 7476 4246 -9991 -16205 -14052 -14657 -13148
199 -13148 -3571 2166 -2173 -756 4901 186 1776 13283 10917 6610 12316 6113 -3737 -1228 -3011
214 -3011 -7914 -3160 185 -4357 -7991 -8239 -10046 -10866 -4432 2797 3375 9968 15341 8563 6527 8753
230 8753 2714 1186 5182 736 -2631 -3016 -8701 -12733 -10738 -8145 -5913 -3129 831 1372 -871 1570
246A570J073o81O541M804k503P34k065q196l153k875m481Q43J018j168l27M2J995
263f829K393J656O278M281P73J434k150l745Q74q26j387K182r19j988j798n462
279e233m508q97j540J944L225J324L700K563J197L538K631K173K228j465k128
294H752k444n931l369j368k536J717J484j573J137j32k516Q14P27J256L856K465
310B339K208K353K22O72R37j126M00j040m840l320m948m888j39N85J559M224K768
327b034J588J971l12L83J557K74J632L78q86L90r65j459L23q95j437j30l348k754
345e724j306k230N8J691J661M368L914J834K496R52j156j94j847j662J75j670
361A360k029l88j786r2J99o30R31M95j219j66j268k55J997J841K335L508J499
$$ plain form
246 1570 2643 1962 8503 13307 10804 11538 9473 1277 -1876 -4751 -9232 -8389 -7371 -8539 -8866 -8824 -6829
263 -6829 -4436 -2780 3498 7779 8552 9986 7836 4091 4965 4139 2752 4934 4015 2027 229 -5233
279 -5233 -9741 -10638 -12178 -10234 -7009 -5685 -1985 578 1775 5313 7944 10117 12345 10880 8752
294 8752 6308 377 -2992 -4360 -6896 -5179 -3695 -5268 -4131 -4263 -6779 -5965 -5238 -3982 -126 2339
310 2339 4547 6900 7122 7794 8731 7605 8005 6965 2125 -1195 -6143 -11031 -11170 -10585 -9026 -4802 -2034
327 -2034 -446 1525 1213 1596 3153 3427 5059 5437 4551 4941 3976 2517 2840 1945 508 378 -2970 -5724
345 -5724 -7030 -9260 -9202 -7511 -5850 -1482 2432 4266 6762 7714 6558 6364 4517 2855 3030 1360
361 1360 -669 -1057 -2843 -2935 -2736 -3366 -2435 -1940 -3159 -3325 -4593 -4848 -2851 -1010 1325 4833 6332
378F332R72L20k380j410p92k433j137j573k387O0o97q55K193J543J077K022m87
395C68j80L77m01R49N00O49K337K24j782J094j404k510l7j739k706L30m48j007
413e386P50J504J391J259J900J985l18P65M60k575q64J933k525j005K741j499
429E16j728J476j606k106J237K03j401P43J566l13k34K933P45n92L316J187m029
446A913O62Q28m856o11K219k775p03K891j711j690K690R43j847J386K798j769
462C68q86L462j443j906L900O0l854K374R53m640K57J376l846p2K783j501j234
479c849L490J156j777J679K926k244K59L056k906j895L418k358l308K885l9l918
495c425J908J556l468J46K623j016q98L084J096j953K654J909l011O80K873l333
$$ plain form
378 6332 7304 7624 5244 3834 3042 609 -528 -2101 -4488 -4428 -5125 -5980 -3787 -2244 -1167 855 368
395 368 188 565 164 1113 1613 2262 4599 4823 3041 4135 2731 221 184 -1555 -4261 -3931 -4379 -5386
413 -5386 -4636 -3132 -1741 -482 1418 3403 3085 3850 4310 1735 871 2804 279 -726 2015 516
429 516 -1212 264 -1342 -3448 -2211 -2008 -3409 -2666 -1100 -1413 -1647 1286 2031 1439 4755 5942 1913
446 1913 2575 3403 -1453 -2064 155 -2620 -3323 -432 -2143 -3833 -1143 -200 -2047 -661 2137 368
462 368 -518 2944 1501 -405 3495 3555 -299 2075 3028 -1612 -1355 21 -3825 -3897 -1114 -2615 -3849
479 -3849 -359 797 -980 699 3625 1381 1640 4696 1790 -105 3313 955 -2353 532 493 -3425
495 -3425 -1517 39 -3429 -3283 -660 -1676 -2574 510 1606 -347 2307 4216 1205 1885 4758 1425
511A425j597K184j971k580J395r28j251J200L24q48Q37J345m6L23J775K37l60
528A464J651M05k127J351j52k371K39l91k126K37J74j840J79J321j20K1P07J543
546A65M66N21R55J34m4J221k59j801Q14r18j240m75j290n48K62j359j26J425n83
565b680O30K024l6N32J799M96p80K44P64n78r46L55q20j940R17q67k395J486K95
584a500k419Q80J404p97J573J516m87Q37K424l46j197J114K38j919m62P84k817
601a174m43J481k144j555K834n85j996K590P73j737J961J757j610L78K779p04
617B605r93J416k63k540M50L26l347K31J754k665p10K969j052j130L205J8j014
634g40K336N75j558R37J326j880p11J308m35j972J139N2k648P06Q74k309Q84J617
$$ plain form
511 1425 -172 2012 41 -2539 -1144 -2072 -3323 -2123 -1799 -2647 -1810 -465 -511 -188 1587 1824 1464
528 1464 3115 3520 1393 2744 2592 221 460 69 -2057 -1820 -1646 -3486 -3307 -1986 -2106 -2085 -1378 165
546 165 631 1152 2107 2241 2197 3418 3159 1358 2172 1254 14 -461 -1751 -2299 -2037 -3396 -3522 -2097 -2680
565 -2680 -2050 -26 -62 470 2269 2765 1985 2229 2993 2415 1469 1824 1004 -936 -19 -886 -3281 -1795 -1500
584 -1500 -3919 -3039 -1635 -2432 -859 657 170 1007 3431 3085 1888 3002 3240 1321 859 1643 -1174
601 -1174 -1617 -136 -2280 -3835 -1001 -1586 -3582 -992 -219 -1956 5 1762 152 530 3309 2605
617 2605 1612 3028 2765 225 675 1001 -2346 -2115 -361 -3026 -3736 -767 -1819 -2949 256 274 -740
634 -740 1596 2171 613 1550 2876 996 285 1593 1158 -814 325 377 -2271 -1565 -691 -3000 -2116 -499
652d99r56J46J820j11R8J525J99j246Q71L55j709p03O75j075r15J302o26j357
670b206J636K66j311J336O42q85Q86O41m17M3Q50j29q52K41J0o31k92L19j414
689a267k08P05p73o5J242N1j60J140j6K4O97j24l14o4k44n42n66K58k1q45N71
710e21L78j011M45P57j056O14P34m65Q05K62j00L5M43n24j28n1l29p62k65p4l53
731a166l31N04J04m7Q20O66l78M18K11l86Q44l01k70n9q6o7l88l84J39m58n34
752a149N27q44M1P00p8K56Q83j18L80P50Kj62J28m47j65k90l12k02q46j95L29
773h12m53m9O11j69K87O51k86K77O49j6RN29j42K06k36k27m46l83k30l39o83k87
795a539M96n16M56J48J08N32O79Q6N93K50l88K92q7l07p9j0l51n5p28l53k8m57
$$ plain form
652 -499 -1455 -1309 511 400 498 2023 2222 976 1847 2202 493 -210 465 -610 -1525 -223 -849 -2206
670 -2206 -570 -304 -1615 -279 363 -522 364 1005 588 631 1481 1352 500 741 751 120 -172 147 -1267
689 -1267 -1475 -770 -1543 -1608 -366 -315 -475 665 649 673 1370 1246 932 868 624 82 -484 -226 -247 -1092 -521
710 -521 -143 -1154 -709 48 -1008 -394 340 -125 680 942 842 877 1320 796 668 617 288 -474 -739 -813 -1166
731 -1166 -1497 -993 -889 -936 -116 550 172 590 801 415 1259 958 688 629 543 476 88 -296 -157 -615 -1149
752 -1149 -622 -1466 -1425 -725 -803 -547 336 218 598 1348 1350 1188 1316 869 704 414 102 -100 -946 -1141 -812
773 -812 -1265 -1314 -703 -872 -585 66 -220 57 706 690 699 1228 1086 1292 1056 829 383 0 -230 -569 -1252 -1539
795 -1539 -1043 -1559 -1103 -955 -847 -315 364 450 1043 1293 905 1197 1110 803 724 714 363 308 -420 -773 -801 -1258
817a258K85ol15N66P1K63N67N91q1N05KM1K33n96k94j12n12j95m04k95K18k02
839i28k16M15J46j58N36K1L25J78M02N9K99k81K86pn80j39l98l10k23k53m87M46
861h67M2l1N23j17J30O10j23O26O2k41L37j57k85p1j93l65L69n11k91j46j42j11
883i52pQN13J86O4K92K63oN16j88j23L34j69o30J35k77j55P4l59K87l51K05j53
906d93J37J02K72k90M12K79K9m7L55k42o5J27k92k9m45j83J33j89o6Pj99O20M0
929b7m13K09O63k53M32l42p2J54n7j85J01J7l00n1q3k56J93n4M42j83m68N88o0
952eK6L21m0K5J31k89Qj8l34j68O30j01n13N0N9l8k5J54J36l77J90L95l5P5l8
977B19k42L39L57p14K04j68l12K01ll64K82L35k78j35K93J26o2j73L75k82J02
$$ plain form
817 -1258 -973 -979 -1294 -728 -657 -394 173 764 683 1188 1190 1231 1464 868 574 462 -50 -245 -649 -944 -726 -928
839 -928 -1144 -729 -583 -741 -205 -184 141 319 721 780 1079 798 1084 1077 497 358 -40 -350 -573 -826 -1313 -867
861 -867 -825 -856 -333 -450 -320 290 167 793 855 614 951 794 509 438 245 -120 249 -262 -553 -699 -841 -952
883 -952 -959 -951 -438 -252 -188 104 367 361 877 689 566 900 731 101 236 -41 -196 -122 -481 -194 -545 -340 -493
906 -493 -356 -254 18 -272 140 419 448 401 756 514 449 576 284 255 -190 -373 -240 -429 -495 -488 -687 -67 -27
929 -27 -440 -231 432 179 611 269 197 351 294 109 210 227 -73 -124 -207 -463 -270 -324 118 -65 -533 55 -5
952 -5 21 342 302 327 458 169 177 159 -175 -343 287 186 -327 -277 -218 -256 -281 -127 9 -368 -178 217 182 257 219
977 219 -23 316 673 -41 163 -5 -317 -116 -119 -483 -201 134 -144 -279 14 140 78 -95 280 -2 100
998A00M37m64o4K93j81j63L2k20l74K20O7j33J16RK03K4L37J23k03L6O0m40K95
1021A10L63o17K81J15m49j7L95l24k44L06J35n10M34J51l00J30L81j42o5K78P4
1042D85n37Q5K45m83l8J90o07J40P85p77l8L93Q2j38J91m9K74j5K15l45k9L52
1064C81J21j91J1m52N9n1K0k41j27K70l34M38L8N7k00M10K82j65j5M47n79M9K92
1087E20o62J01K10j98k26L08j80o03M71J30m60lM93k04L32KJ84K15j20K54l69
1108A95j42J38l45J44k2r2j50J32l10K94r5J35O7K8O4O5j64L02J27l08J24J86
1130C73l58J19l4k95L36n04J1L93j31k56L31oq8L24m17J11J92O3j10p3l7J00k39
1153a95J96m1N4K20m75N0J13J23j45%K0K24l80N00p0j80J52k38L17j88J81l27
$$ plain form
998 100 537 73 9 302 121 -42 -10 -230 -604 -384 -317 -450 -334 -325 -122 -98 239 362 159 195 255 -185 110
1021 110 473 -144 137 252 -197 -214 181 -143 -387 -81 54 -456 -22 129 -171 -41 340 198 133 411 485
1042 485 -52 33 278 -205 -243 -53 -660 -520 265 -512 -550 -157 -75 -213 -22 -71 203 188 403 58 29 381
1064 381 502 311 322 -130 -71 -122 -102 -343 -470 -200 -534 -96 -58 -1 -201 209 491 326 311 758 179 228 520
1087 520 -142 -41 169 -29 -255 53 -127 -730 -259 -129 -589 -592 -99 -303 29 31 215 430 310 564 195
1108 195 53 191 -154 -10 -32 -124 -274 -142 -452 -158 -253 -118 -51 -23 41 106 -58 244 371 63 187 373
1130 373 15 134 100 -195 141 -363 -352 41 -90 -346 -15 -21 -109 215 -202 -91 101 164 54 -19 -56 44 -195
1153 -195 1 -40 14 234 -241 -191 -78 45 -100 -100 -80 144 -236 264 194 14 166 -72 245 57 238 -89
1175h9OR0L7k23q2M21k34r6K39j16K03Rj87J27J2j15J67Q5k10J66j41j32J39N8
1199A34k43j75K65r4k60O4L96p6J5j52P3m3J9K2k11K97R2k1l05K12K2K2r6Q3R
1224D9k11L54k18L3o7J05r0JK80j54M5J96k45Rl04L14n5l3J78k45J60j80l37L21
1248i4K91j07j95Q4j92L20k58R1J20M0k4p6K36l43n6P9J82J59l24Q8K0K6J2j35
1272e6n9m0K64N1l3j89l9J30l91L08K69L3n2j6k30M6k9j74m6J91M2k14L37J8K14
1297C35l18J06k4J33Ll15k7K28p8mL8j99J31j44Q5J15p8j4M3P4q7J77m43J96J62
1322I5oj66K12p4j82K85k51j54J90Lp2L08m9J04l02l0oJ54O0l10K07j13J56k8
1346C1K26l60L34j84j29j34N5R0j22J55j81J45J43k9j09K63j67p6J17k57K69K0
$$ plain form
1175 -89 -83 7 44 -179 -261 160 -74 -170 69 -47 156 165 -22 105 117 2 169 254 44 210 69 -63 76 134
1199 134 -109 -284 -19 -113 -373 -309 87 11 26 -126 -53 -96 -77 -55 -266 31 123 102 -203 9 31 53 -43 40 49
1224 49 -162 192 -26 7 -60 45 -45 -44 236 82 127 323 78 87 -217 97 42 9 187 -58 102 -78 -415 -94
1248 -94 197 90 -105 -21 -213 107 -151 -60 60 100 76 0 236 -107 -163 -84 98 257 -67 21 41 67 79 -56
1272 -56 -115 -155 109 160 127 -62 -101 29 -362 -54 215 248 196 180 -50 -4 -33 -207 -253 -62 -20 -234 103 121 335
1297 335 17 123 99 232 235 -80 -107 121 43 39 77 -122 9 -135 -50 65 -13 -27 16 90 3 180 -263 -67 95
1322 95 89 -77 135 61 -121 164 -87 -241 -51 -48 -120 188 139 243 -59 -89 -95 59 119 -191 16 -97 59 31
1346 31 257 -103 231 47 -82 -216 -161 -71 -193 -38 -219 -74 69 40 -69 194 27 -49 68 -189 80 100
1368A00r4p6j00K70j56J33k69K06J4j22M4q8K28k57J14J92j29k21K36j15K03k5
1390H8l3k96K01K9j30K19J07j00k90L94k44mq7O5p5J70r3j23L25q2J19K6q8J07
1414B05j94J5j05J78j20K35j49J51j56q2J41l81J80K9p8P5j2k5m9R2J77o9q3r6
1438a21J46k10K85k26K05J5k6j64K90j41m8L57m32j08J65J00j03k6j73J67p0J55
1460C7j71j2J95N4j37R1j12J21J18j5l29R4J32j41L1k0q1q7J11K70j79o1L73m61
1484a79M05l13J75m4j37MR7k12N0K60j02k20M4M9Q4p6M47k17j08q9k5K78j59K5
1508C7l3Q2j46rp7M23k50k6J31O1l81K3L0j94K12m0L07o5j9j50K96k33L50k73
1532E6r6J05k6j49J76R7l37m0K92rj95p2L32j68l1L60m14J92L9l57K81m4o5L40
$$ plain form
1368 100 6 -70 -170 100 -56 77 -192 14 28 -94 -50 -138 90 -167 -53 139 10 -211 25 -90 113 88
1390 88 55 -241 -40 -11 -141 78 185 85 -205 189 -55 -59 -146 -81 -156 14 -79 -202 123 41 160 186 98 205
1414 205 11 26 -79 99 -21 214 65 216 60 -22 119 -262 -82 -53 -131 -56 -68 -93 -142 -50 127 58 -25 -121
1438 -121 25 -185 100 -126 79 94 68 -96 194 53 5 362 -70 -178 -13 87 -16 -42 -215 -48 -118 37
1460 37 -134 -146 49 103 -34 57 -55 66 184 169 -160 -66 66 -75 -44 -64 -145 -232 -121 149 -30 -91 282 -179
1484 -179 226 -87 88 44 -93 -89 8 -204 -154 106 4 -216 -172 -123 -39 -115 332 115 7 -82 -107 171 12 37
1508 37 4 86 -60 -69 -146 277 27 1 132 193 -188 -165 -135 -329 -117 -157 150 85 66 -84 212 -21 329 56
1532 56 -40 65 39 -110 66 163 -174 -214 78 69 -126 -198 134 -34 -65 295 -119 73 112 -245 36 -8 -73 267
1556B67j81k2M3Q5j99M7J89l65Jl6N2K72j71N5m4r6QK96m51M68k83K92j8j64k79
1581b34J28Kn5p3K05j03l3J85J8l1J32P5j71N6m6J79j14K5k26N4J87j29j52o9
1605a90R6kM3K86m30M57l43J30P1l98N56p5kN2j97l21L53M8k93nK46Q6j21J01
1629A48m19J81j80R5p4J14R3j98N53j81j04N6j30O8J50l10K55k3j95J40l9j22
1651a22K05n8r9K39n18J94J30l9J24j9J75l3o8q8J6K30j63m4J3k02oJ98n0p5J07
1676D7N3J0j00J55j05j49OM2J35K04k11l17J28K33q6l29K80J67k86L56l30j52
1698b49M19k55p9M14k48L03k29J12k37K1j4N5p8P1Ok74K71J23l8L1l42L0K18k49
1722b18L66l48M1Q2L7r7R3R2P1Qk84K50k4k47Q0K24j92L5K76l03J3K01r1k28J75
$$ plain form
1556 267 86 64 107 192 -7 40 229 -136 -135 -171 -119 153 -18 37 -7 -103 -95 201 -250 218 -65 227 209 45 -234
1581 -234 -106 -104 -159 -232 -27 -130 -163 22 40 9 141 216 45 101 55 234 120 145 -81 -27 160 31 -121 -190
1605 -190 -94 -96 -53 233 -197 260 -83 47 118 -280 276 201 199 251 54 -267 86 134 -159 -164 82 168 47 148
1629 148 -271 -90 -270 -175 -249 -135 -42 -240 313 132 28 84 -46 22 172 -138 117 94 -101 39 0 -122
1651 -122 83 25 -74 165 -353 -159 -29 -68 56 37 212 179 111 23 39 269 106 62 75 -127 -133 65 15 -60 47
1676 47 100 110 10 165 60 -89 -83 -41 94 298 87 -230 -102 131 45 -284 -4 163 -123 233 -97 -249
1698 -249 170 -85 -164 250 2 305 76 188 -49 -28 -42 13 -65 6 12 -262 9 132 94 125 -217 -187 31 -218
1722 -218 148 -200 -159 -77 -40 -137 -44 48 119 127 -157 93 69 -178 -98 126 -66 -31 245 -58 -45 156 65 -163 12
1747A2J44k82L32j6l94J99J51Pk35j03K23P1k78L56K2l11N9l9J85k25o4K16J37
1770A67k36K7LK3J5p4J50J73j16Q0J4j84j10l2K13j2Q8j08j4m2n7L53k55r9m4
1795g7n6R3r1K58k37o5L52k63P0J77k83K20l80J43K01l07J49K17l51K74l5J42
1817A51q4O0K3j33K24k25R2j63l4J07jj5k49K84m7j62J44K08l12NL08j87l19K74
1841e1Q7o7j07J01N6j95K00j05K10k79R1j65K03r9QK64M9k00j03k1J75kl27K59
1865a8K62l78J98j50j0K34k10pL63k45k61K45JJ40k15M09m69K27j81L3j86L49
1887A31o1j21n1n5J88j03J73j07J48o6j89L8J81pJ35k42j26L18l69J75K04m7j51
1910dj24r1J79j1k26M77k09o9K31j47q8j29j45J83mj6N4K08k90K21rJ53q4n1r
$$ plain form
1747 12 156 -126 206 190 -204 -5 146 153 -82 -185 38 109 -169 187 209 -102 -43 -82 103 -122 -186 30 167
1770 167 -69 -42 -39 -16 -1 -75 75 248 132 212 226 42 -68 -100 113 101 189 81 67 25 -32 321 66 -33 -77
1795 -77 -133 -40 -131 127 -110 -175 177 -86 -16 161 -122 98 -282 -139 62 -245 -96 121 -230 44 9 151
1817 151 67 127 150 17 241 16 108 -55 -89 18 17 2 -247 37 -10 -172 -28 180 -132 -127 181 -6 -325 -51
1841 -51 36 -31 -138 -37 19 -176 24 -81 129 -150 -59 -224 -21 -120 -112 152 201 1 -102 -123 52 50 -277 -18
1865 -18 244 -134 64 -86 -96 138 -72 -79 284 39 -222 23 24 164 -51 358 -111 116 -65 -32 -218 131
1887 131 70 -51 -102 -157 31 -72 101 -6 142 76 -113 -75 106 99 234 -8 -134 184 -185 -10 194 147 -4
1910 -4 -128 -219 -40 -51 -277 200 -9 -78 153 6 -82 -211 -356 -173 -177 -193 -139 69 -221 0 -9 144 60 9 0
1935@OJ81k71L64m84K81p0k5J22Ol53K61r2K18j78k3P2J81k01RM4J4q2L1j39K25
1961I7l3J13j17pJ40j78j9K54j66k7r9j06K31r0N6p9K20l85M5J67k37K58j8j86
1985a66q0K54j00J55M9k43K73j95Q3j5J31j35q2L8k17L31k11J64j60L18m80L30
2007D2J51n90M57k4k6K8j22Q3P1j71J75J18k61J23l40M24l9o7j61j09L51P3j71
2030A5J53j72oj66K72j16j3M1j24JP1K34P1m87N50j37j72j01J36q8j51L4L21j64
2054Bj34M36k98M2J12k31k6N0j0J99j68L13l01l38L42j04k2J88K39k34pl22J91
2077h1j8J08j2L8M3J1J07l92J96J52q5k79J7L33r0k8o8K4n1J29k88P9J57L5j50
2102a13J12j01j3K72k72O8l70N20l38J42L18k19P9j35K04k06M7J21j34M7o5L56
$$ plain form
1935 0 6 187 -84 280 -204 77 7 -18 104 110 -243 18 -74 144 -34 -57 15 196 -5 4 48 62 -20 11 -128 97
1961 97 64 177 60 53 193 15 -4 250 84 57 -42 -148 83 -7 49 -30 190 -195 -150 17 -220 38 20 -166
1985 -166 -246 8 -92 63 112 -131 142 -53 30 15 146 11 -71 -33 -250 81 -130 34 -126 192 -288 42
2007 42 193 -397 60 36 10 38 -84 -1 70 -101 74 192 -69 54 -286 138 99 32 -129 -238 113 186 15
2030 15 168 -4 -10 -176 96 -20 -33 8 -116 -115 -44 190 261 -226 324 187 15 -86 50 -38 -189 -155 166 2
2054 2 -132 304 6 48 160 -71 -97 -47 -57 142 -26 287 -14 -352 -10 -114 -136 52 291 57 50 -272 -81
2077 -81 -99 9 -3 35 78 89 196 -196 0 152 67 -212 -195 138 48 20 -48 -24 -75 54 -234 -155 2 37 -113
2102 -113 -1 -102 -115 157 -115 -47 -417 103 -235 -93 225 6 85 -50 154 -52 -5 116 -18 29 -36 320
2124C20l09Kj61L7Kn4J22J63j9k8j30O5j1P6O2l01mL49k2j71M9R4Q3r5o0k0nO3
2152I7l25L19Q1r0m1j09K4p9J59j97K81o2r0R6J9j01R0K5p3j37P8J93p7j18p3
2177a10n1J11M24n54J52J13K8O2k70J96k28K45j90K4L8L7j26L03j81n6j92L02
2199G7P6k87L41J2k89j29L79k0l39N43m00J33j72Q7Mk59L79k12M3J90j15k52L12
2222A02rj70N0K32R5n11L35Mj34m7j6O9j06OK43k16nP8N3r6k15L76q2j18K08L4
2248A60J0l00K7K82l92N7J01r3J29K36l40K28o0j85J32J49J12j39k70K20q7K41
2270B18j08k1p6J96k03oJ24l57J33K77k11J79j43P7J8l22R0J58N1k62K64j10J49
2293A15j27J46j23o1L4j5J30j96J43n3l5J19j85L33j74l4k1Mk0N4n5J20j68k70
$$ plain form
2124 320 11 13 -148 -111 -109 -163 -41 122 103 75 -55 10 -1 75 137 -164 -168 181 159 -12 37 131 214 119 59 39 34 97
2152 97 -228 91 172 82 41 -68 -44 -123 36 -161 120 58 -32 64 83 -18 72 97 24 -113 -35 158 81 -37 -110
2177 -110 -161 -50 374 -180 -28 85 113 175 -95 101 -127 118 -72 -48 -10 27 -99 204 23 -33 -225 77
2199 77 153 -134 207 219 -70 -199 180 160 -179 364 -36 97 -75 12 16 -243 136 -76 -33 157 42 -210 102
2222 102 93 -77 -27 205 300 -211 124 128 -6 -53 -69 0 -106 -100 143 -73 -78 0 53 -43 -258 118 36 -82 126 160
2248 160 170 -130 -103 179 -213 -156 -55 -148 -19 217 -123 105 45 -140 -8 141 253 114 -156 64 -23 218
2270 218 110 89 13 209 6 0 124 -233 -100 177 -34 145 2 79 97 -225 -135 23 74 -188 76 -34 115
2293 115 -12 134 11 -50 -16 -31 99 -97 46 -7 -42 77 -108 225 51 17 -4 0 -20 34 -21 99 -69 -339
2317c39K14K33j06j13L50o7l33Lp9L45j98k50L45j45L43M4m39J74j15K6r3%J34
2340f6l3M11l75J22K8N8r3O9k29J12k24M31m46L80m6j73R7l32J73kO1k38K97K47
2364B29l14N1K61j22JK63m25l45K48L51o5j7P3m29J47q1K61j26K6J80r3j96J72
2387E0L0k64J90j3K77k85J62Lm11N60k68j3P8l2k43K82m6k32K09j08J96j7k79
2410a74K6L6K08P1k05k68K08p2K47m5o1Q3j04j8J3M4m9K11k07j21K55J37j63J01
2434A53j95K01J26j18j82J46k79K69k46J30m1%l9J92N0j79J70k46J03N3J6j56
2456g2J41j18P7n0J77j28r5O8J0n5j43J83J1J84j23j53P9l2J85k13J54k65K07
2479B9no7R5j04K51M2j28Qp8J19m03K16N0j03L03m15K05l10J9K41j31K39M4q8
$$ plain form
2317 -339 -125 108 2 -111 239 172 -161 -158 -237 108 -90 -340 5 -140 203 247 -192 -18 -133 -107 -200 -200 -66
2340 -66 -99 312 -63 59 87 145 52 121 -108 4 -220 211 -235 145 99 -74 23 -309 -136 -138 -77 -315 -18 229
2364 229 -85 -34 227 105 106 369 -56 -401 -153 198 133 116 189 -240 -93 -174 87 -39 -13 167 74 -122 50
2387 50 80 -184 6 -7 270 -15 147 150 -261 299 31 18 96 64 -179 103 57 -175 34 -74 122 105 -174
2410 -174 -148 -112 96 167 -38 -306 -98 -170 77 32 -29 54 -50 -68 -55 -11 -60 151 -56 -177 78 215 52 153
2434 153 -42 159 285 167 -15 131 -148 121 -125 5 -36 -36 -75 117 167 -12 158 -88 15 68 84 -72
2456 -72 69 -49 28 -22 155 27 -68 0 10 -45 -188 -5 6 190 67 -86 -7 -39 146 -67 87 -178 29
2479 29 24 -43 52 -52 199 241 113 121 43 162 -241 -25 25 -78 225 -190 15 -295 -276 -35 -166 73 117 29
2503B9k6L5J60l16P4L09k92j57J71J25l05J64j38J83J2j47Q8O8jj99p7K20l1K7
2527b4R8K2M5k01J58j74K92N0l27J06o5j71J82J93Q4l00k9K32k6K9k55k92M45
2550G2r0J18j45K73j98J38l13K35N4j14l5o4J1K05K5jm4l54L24k32K21j69j58
2573b41K56N8j20j11J45J24k13L26o10N75m60K74j4P6pj68J88J07k12K10j47p0
2595c4M3m2J38l13N03l95J57k25J89K3k40L66l08M6qJ58j56J82l39M74k9k83J97
2618A04j16r0J27N8k32P7R4j34K42O7p4J47l41J35N1J04k94J80o4n6K4k94O1J72
2642e2K34o3j85J72j23R1k1k10K21j83n8K61k27p7J9J2K12N0k08J14J55r9O8k50
2666a47L12m42L13mk30J35j00L21j19J95m15N3J53J02M3l71J63O7m6p8R7J14J10
$$ plain form
2503 29 3 38 198 -118 -44 265 -27 -184 -13 112 -193 -29 -167 16 28 -119 -31 37 36 -163 -240 -20 -51 -24
2527 -24 74 96 141 -60 98 -76 216 266 -61 45 -20 -191 -9 184 268 -32 -61 171 145 174 -81 -373 72
2550 72 -18 100 -45 228 30 168 -145 90 144 30 -5 -69 -58 147 172 171 127 -227 97 -135 86 -83 -241
2573 -241 15 73 -47 -158 -13 111 -102 224 -386 189 -271 3 -11 65 58 -110 78 185 -27 183 36 -34
2595 -34 9 -33 105 -208 295 -100 57 -168 21 44 -196 170 -138 -92 -100 58 -98 84 -255 219 190 -93 104
2618 104 -12 -102 25 83 -149 -72 22 -112 130 197 123 270 -71 64 115 219 -75 105 41 -15 9 -285 -224 -52
2642 -52 182 119 -66 106 -17 74 53 -157 64 -119 -177 84 -143 -220 -201 -189 23 73 -135 -21 134 35 103 -147
2666 -147 165 -277 36 32 -198 -63 -163 158 39 234 -181 -128 25 127 170 -201 -38 29 -17 -95 2 116 226
2689B26k22j28K76j30n4k97M54j04K05m22M18m49K37K26r3k81j09L58k90J57J3
2710iK7j55J80j77p0L27N6j30j93R0j65J30J29qq0L5M8J99j71P6l59Q5Q2k64M14
2735I7q3q1J44O4j43j06Q0N1p4%l8K07k40J25j05o0j12L32k4R1j58L46k62o1R4
2760H4J17j00k06J52jRj65K80j02J37l01o4J16j40O8J32j21O9J9j0J6l3N9j59
2784a44P0J73K1j11o5J37j33O8R1q2j01l3K23j63N5q2L5J59l85K72l9j23J61Q8
2808I2k31M5nK48J9j81k97K36M15l64j26J50J33j16k8K8j09J90j35J57k29J70
2830F2J90m93L57k8O0l19K68jP8pk30J07p1J7k17J78Q5q3rl0J74j16k03L94l02
2855a39l2J39oJ49k28N9J28J80l43Q4r4j66K13Q7RJ44m65Q2K33J11q5lL21j00
$$ plain form
2689 226 4 -124 152 22 -32 -329 125 21 226 -196 222 -227 10 236 143 -138 -247 111 -179 -22 -9
2710 -9 18 -137 43 -134 -204 123 179 49 -144 -54 -219 -89 40 32 -48 -13 35 234 63 139 -220 -135 -53 -317 97
2735 97 14 -67 77 141 -2 -108 -28 23 -51 -51 -89 118 -122 3 -102 -162 -274 58 34 125 -33 313 51 -10 84
2760 84 201 101 -105 47 46 55 -110 170 68 205 -96 -160 -44 -184 -116 16 -105 -36 -17 -27 -11 -44 15 -144
2784 -144 -74 99 120 9 -56 81 -52 16 107 25 -76 -109 114 -49 6 -76 -41 118 -267 5 -34 -157 4 92
2808 92 -139 -94 -99 149 168 -13 -310 -74 341 -23 -149 1 134 18 -10 18 -91 99 -36 121 -108 62
2830 62 252 -241 116 88 148 -171 97 96 174 167 -63 44 -27 -10 -227 -49 36 -47 -56 -86 88 -28 -231 163 -139
2855 -139 -171 -32 -38 111 -117 -58 70 250 -93 -9 -103 -269 -56 31 40 184 -281 -199 34 145 60 57 378 278
2879B78j39l7q3L10m29K31k99J97L9Ql15L80n1k74J73O6o1L5R5j35N8N7r8J88
2903A94k45j80K33J15j65L05l50J56j2j13J0K38j76R9n3RK02l55J13O5j36K00
2925A54K47l80n12L78J53o5K16l42K00j37J6j21J25k3j9J24n9K55k70r8K5J61
2947B8m8M1%m3J84k46p8mK30j05j55M33j36k43J35R7l0KO7o2r6J85j03P3l22K96
2973A00l24J11J98N7j64L9o9Q1k55l3L79k53L5J53j19K32k31j5j21J62J46m4O5
2996A30n4j23J7j29J04l3k35J67J23P7o9L7j3k00K28Q7k39R6m6O3J70k19j20J55
3020b6J50k6j63J90j45j34J69k15K13k1rN6RnJ21l44K67l41L58J36k47J11m47
3043c43M89k65P1j70M23j87K35l83Q9K39r9k6O7k50R1j99L49q0k69L53p2k6P4
$$ plain form
2879 278 139 102 19 329 -100 131 -168 29 68 76 -239 141 90 -184 -11 55 -6 29 124 -11 47 104 6 194
2903 194 -51 -231 2 117 -48 257 -93 63 51 -62 -52 186 10 109 56 65 267 -88 25 90 -46 154
2925 154 401 21 -491 -113 40 -25 191 -151 49 -88 -72 -193 -68 -91 -110 14 -45 210 -60 -158 -133 28
2947 28 -20 21 21 -22 162 -84 -162 -166 64 -41 -196 237 101 -142 -7 90 60 62 129 67 -29 156 53 126 -196 100
2973 100 -224 -113 85 142 -22 17 -52 29 -226 -259 120 -133 -98 55 -64 168 -63 -78 -199 -37 109 65 130
2996 130 76 -47 -30 -159 -55 -88 -323 -156 -33 44 -25 12 -1 -201 27 114 -125 -29 -75 -12 158 -61 -181 -26
3020 -26 124 98 -65 125 -20 -154 15 -200 13 -8 -17 39 48 43 164 -180 87 -254 104 240 -7 104 -343
3043 -343 146 -119 -48 -218 205 18 253 -130 -41 198 99 73 140 -110 -19 -218 131 51 -218 135 63 37 111
3066A11j69K5J32j21J39k2K09j86n3O6k40m7p8J98j21L21j17k33J69J74j68m2
3088e3J82j12q9j84J29L3K63j7j91j43K04jm6j34J92j06K61j37N7M2o4j58K14
3111A42m7R3j14Qj05J61n2l4k6j38O6o7K24m4q2K65n19N35l02r8Q3m3M6R4l8L2
3137D0j10J7K25k45Q1K2J7M5j17PM6n2J39j54kN3m1R7P2J8j03%J38%j04K9l9J13
3165A92j20q3j29J22o0J36K35k41j99L04n3l86M35P6k82j06K80j09M5J58N9l22
3187d8K04k32K33r1j26K46k15k5J31j61N4Pq9J37J73l71J51L2j62k7J18R7r8J66
3211A04j15J54l40J24J45J55l09J3o2K38j10K34m06J80N6j4M2k33J54j20J22k9
3233a7n5L7OJ35k11K55j54j66K67k68k9K84j06K42k75J80l67J51K00k76K18n0
$$ plain form
3066 111 -58 -33 99 -22 117 95 304 118 65 131 -109 -156 -234 -36 -157 164 47 -186 -17 157 -11 -53
3088 -53 129 17 -72 -256 -127 -94 169 152 -39 -182 22 21 -25 -159 33 -73 188 51 108 150 86 -72 142
3111 142 95 188 74 82 -23 138 86 52 26 -112 -46 -113 111 67 -15 250 -269 266 -36 -134 -51 -94 -48 46 8 40
3137 40 -70 -53 172 -73 8 30 47 92 -25 -18 28 -24 115 -39 -41 12 -29 68 140 158 55 55 193 193 89 118 79 192
3165 192 72 -11 -140 -18 -78 58 293 52 -147 157 104 -282 153 229 -53 -159 121 12 57 215 274 -48
3187 -48 156 -76 157 66 -60 186 -29 -54 77 -84 -30 -23 -112 25 198 -173 -22 10 -152 -179 -61 36 -62 104
3211 104 -11 143 -197 -73 72 227 -82 -69 -131 107 -3 231 -175 5 61 47 89 -144 10 -110 12 -17
3233 -17 -72 -35 -29 106 -105 150 -4 -170 97 -171 -200 84 -22 220 -55 125 -242 -91 109 -167 51 1
3255Aj01L29k04j21j54L25Rj07%o1J33rj98K88j33j94K28j20j37K75J34m27J59
3278h5k3K65k69K14l4p4O5J05r0m8PR7N0oOk07R7k82Q6K19l41K71m7K1L7l03K75
3305Fk18L18m9j21J64j85J01R0j24P8j33n2P9j00L74j98o0J66O6r4q2kk00L16
3329A40l38M4J34p8p7L18k89O6J42M8q1L9Pj27K91k3k27j13M54m84p4M13j06j88
3353a09Q4p8P6K67k34LJ25k59O9k70L58l1J81k05m6J31n2J52j55J1M3l13L58j35
3377b9N3qj98L28k02K60j85o4k7K41j28j2J60n70L16J58j30RQ5j03k0K10J6k37
3401g7J16J75j52J09r1o7j46n4J66j34M19k71lJ32k7J9j74j53k05M63j43J75L0
3424A07l2J08k23q3m3K80k41J16j6J19L24l03k5k85M81l51lk0K00l33L77j66j
$$ plain form
3255 1 -100 229 25 -96 -250 75 84 -23 -23 -84 49 40 -158 130 -3 -197 31 -89 -226 49 183 -244 -85
3278 -85 -108 157 -112 102 68 -6 59 164 74 26 33 130 180 174 180 -27 70 -212 -126 93 -248 23 -24 -3 34 -269 6
3305 6 -212 106 57 -64 100 -85 16 106 -18 60 -73 -125 -46 -146 228 30 -30 136 202 108 26 24 -176 140
3329 140 -198 -154 -20 -98 -175 143 -146 -80 62 110 29 68 75 -52 239 216 -11 -124 330 -154 -228 185 79 -109
3353 -109 -25 -103 -27 240 6 9 134 -125 -56 -326 32 1 182 -23 -69 62 10 162 7 18 61 -252 106 -29
3377 -29 24 16 -182 146 -56 204 19 -45 -72 169 41 29 189 -381 -65 93 -37 -28 57 -46 -66 144 160 -77
3401 -77 39 214 62 171 80 13 -133 -187 -21 -155 264 -7 -10 122 95 114 -60 -213 -418 45 -98 77 107
3424 107 75 183 -40 -123 -166 114 -127 -11 -27 92 416 113 88 -197 284 -67 -70 -90 110 -223 154 -12 -13
3447a3l1r0j68L46J17j17r1L23Mk44J34k2p9Rj93j52M14q8k03j46L11k93M22j75
3471b5Q3j4q9k4KK03o6j13O2K93k58m7k32K65J23o0k20k11M4M02j45n3J37j11
3495e4J67k22O1q3J51J28j18K28k92J62j68k1M03k64Oj24J16j49K26j60M1j44
3517a10r1J74rj58K62q7K61l83R3J29L9J02j33j23j12J33N8k66R7K86j43P9p7
3540B1p8k3K03k39k7R8o9P7J95m87J52J96K90j30m66M10j49J1j27m1j08L61J13
3563A83k14p1J48J2m1R5k22K51j08j20P4M6J58j74K18j46m3j90J80j46L44j75
3585E9k6J15p6k07Q2k08L49j34j5j11K57n6J54k12m2J63k23K15J6j81Q7k4J58
3608A40L3k68J62j46R8j98J22J73k70R8j02q6L78m01K67j53J01J24o9J9p1k2J08
$$ plain form
3447 -13 -44 -134 -302 44 161 44 -47 276 280 36 170 148 69 78 -115 -267 147 59 -144 -290 21 -272 150 -25
3471 -25 58 44 -45 -69 -67 136 70 -43 19 312 54 7 -225 40 163 103 -117 -328 -284 118 -27 -80 57 -54
3495 -54 113 -109 -48 -131 20 148 30 258 -34 128 -40 -61 342 78 84 -40 76 -73 153 -7 34 -110
3517 -110 -201 -27 -36 -194 68 -19 242 -141 -48 81 120 222 89 -34 -146 -13 45 -221 -124 162 19 98 21
3540 21 -57 -80 123 -116 -143 -45 -114 -37 158 -329 -177 19 309 179 -287 123 -26 -15 -142 -183 -291 70 183
3563 183 -31 -102 46 58 17 112 -110 141 33 -87 -13 33 191 17 235 89 46 -144 36 -110 234 59
3585 59 33 148 72 -135 -53 -261 88 -46 -61 -172 85 29 183 -29 -71 92 -131 84 100 -81 6 -18 140
3608 140 173 -95 67 -79 19 -179 -57 116 -154 -56 -158 -244 134 -267 0 -153 -52 72 3 22 -49 -71 37
3631C7l6j95J89K00o0j68N7j46J40j16J68o4m9m1M92k62j77Q4j18K30l9Rj91P0
3655A4O7J74k00k06K38l03J08J35o0J80k52J18J13k07J04L3k6qj77j1NM22l97
3678a36J36J48j92J04l36L12K22l61L5J00j41J8m1r5M01Ok63r1K02P1r7P3k62
3701a87K13P1k46j10K19L6j87J98N6j25n8P2m7K18M9p6J64l60J10L79m24L8m5
3724d2K23L6k04N3J26k51J41J4j55K38k62K46m4k19O3l8K91l23J42m30L67P4K7
3747G3m03L91n3N4j42j15J25j05J71J1J44k19J17l28M88l99M5O9J68j07j05J13
3769gJ35m09M37j35k0K7p2O6j04J05k00N1J31k28K05J29k04J59j67M16k37r7%
3792a9L1l33N40j44l85K86N4K46l18J06j17j3L35m54lL05j18pK19j41oNn0O3R0
$$ plain form
3631 37 1 -194 -5 195 135 -33 24 -122 18 -98 70 6 -43 -84 408 146 -31 53 -65 165 126 135 -56 14
3655 14 81 255 55 -151 87 -216 -108 27 -33 147 -105 13 126 -81 23 56 30 22 -155 -166 -161 261 -136
3678 -136 0 148 -44 60 -276 36 258 -103 -68 32 -109 -91 -132 -227 174 180 -83 -174 28 99 2 75 -187
3701 -187 26 97 -149 -259 -40 -4 -191 7 63 -62 -120 -48 -95 123 172 96 260 -100 10 389 -35 3 -42
3724 -42 181 217 13 66 192 -59 82 96 -59 179 -83 163 119 -100 -37 -75 216 -107 35 -395 -28 46 73
3747 73 -330 61 8 62 -80 -195 -70 -175 -4 7 151 -68 49 -279 209 -190 -145 -76 92 -15 -120 -7
3769 -7 128 -281 156 21 1 28 -44 22 -82 23 -177 -126 5 -223 -18 111 -93 66 -101 315 78 -19 -19
3792 -19 12 -321 219 75 -310 -24 30 276 -42 64 -53 -66 269 -185 -188 117 -1 -8 211 70 64 69 19 82 172
3817A72p9j80l9J21k6k28L53rQ8l98K56M8q5J2l05M12J2j23k3k43J72O0j06K64
3841A26pl27N31m81K44j20J6n5R2k29Q7K83l37J98q5N9K5q2L20j08m42J22J89
3864A9k37J38k2J39O9k23K40k66J41k15J89o9M5O3J81k52K65k59K10j28p8J91
3886A41k03MO8k61J65J25Nk12K69m7r9Oj89N55m43R8p3K1p6K45l82L11j40K81
3910A69k17K69j90j01K54j28k2O9k17J09O0L5j18j11N1J7K60J01m23K77M0l18
3932a34K25r1QM4k9K46l26K95j17j8j01P6j44J17Pj51O2j8m2J1J13j77M04k63
3956cK46m2k5k62K3j80J04NJ75j83j33N38k44k0J40k6j22j00K65l22l8R9K04Q9
3980A88j09lo9N1J85N1l68q7J39O6j53J52q1M0N7n2j02K2j64M17l85N3K18L4K48
$$ plain form
3817 172 93 -87 -126 -5 -31 -259 94 85 173 -225 31 79 -6 6 -299 113 125 2 -21 -264 -92 -32 -138 126
3841 126 119 -208 323 -158 86 -34 -18 -73 19 -210 -123 160 -177 21 -64 -5 20 -62 258 150 -292 -170 19
3864 19 -218 -80 -102 37 106 -117 123 -143 -2 -217 -28 -97 -52 11 192 -60 205 -54 156 28 -50 141
3886 141 -62 -58 10 -251 -86 39 44 -168 101 54 -45 -39 -228 327 -116 -18 -91 -70 -146 99 -283 28 -112 169
3910 169 -48 221 31 -70 184 56 34 103 -114 -5 55 90 -28 -139 -88 -71 189 290 -133 144 184 -134
3932 -134 91 0 8 52 23 269 -57 238 121 103 2 78 -66 51 58 -93 -31 -49 -91 -80 33 -144 260 -3
3956 -3 243 201 176 -86 -63 -243 -139 -134 41 -142 -275 263 19 -1 139 113 -9 -109 156 -166 -204 -105 99 188
3980 188 79 76 7 58 243 294 -74 -161 -22 44 -109 43 -38 2 59 7 -95 -73 -237 180 -205 -152 66 100 348
4005C48m24K9j44j11K43J80k81%K8m1K48J31l14J32J09k31K81j44J95k96r0PJ71
4028B6K7k65K3K46m4k58J23K41Ok06Q3oj24K57k78Q1J79KQ5l83J61l54J04L86
4052A12o0j08M8J35o9R0J16j94j64M47m63P4j2r2K79J7m40K32J04q0r0K71k6J5
4076A42j30Lj30J63o0J97j08K4j57K17j91J83j79O8r0O2j38O3J35n5q7J11j07
4099f4kOm4J02j29O9J01J10n1j19Q7p0k80K05j17PL02j26K91m02K77Q7k92J7j13
4124a48M15m62O1K36p1K0k05J91o6j20K19M8L6k16J33r9q6j4J85j42J2J01J6J89
4148B33k65K07m44J26J89J17k09n4K07k7k22J18m3J06J75j73q0k4j2K24O6j53
4170F2n2k29K07J50j87P6L7k44K86k21J18J00j9p2J4j66jK08N2o3q6l9J24O6j72
$$ plain form
4005 348 -76 -47 -191 -302 -59 121 -160 -160 -132 -173 75 206 -108 24 133 -98 183 39 234 -62 -152 -145 26
4028 26 53 -212 -189 57 13 -245 -122 119 125 -81 2 -4 -128 129 -149 -68 111 113 198 -185 -24 -378 -274 112
4052 112 52 -56 -8 127 58 148 264 70 -94 353 -110 -36 -48 -140 139 156 -284 -52 52 -28 -118 153 127 142
4076 142 12 15 -115 48 -12 185 77 101 -56 161 -30 153 -26 42 -48 14 -124 -61 74 19 -68 43 -64
4099 -64 -66 -60 -104 -2 -131 -62 39 149 98 -21 66 -4 -284 -79 -196 -189 113 -13 278 -124 153 240 -52 -35 -148
4124 -148 267 -195 -134 102 31 51 -154 37 -29 -149 70 118 154 -62 71 -28 -114 -128 57 -85 -73 28 44 233
4148 233 -32 175 -269 -143 46 163 -46 -100 107 80 -142 -24 -67 39 214 41 -39 -63 -75 149 215 62
4170 62 10 -219 -12 138 -49 27 64 -180 106 -115 3 103 84 12 26 -140 -141 67 119 56 -30 -69 55 121 -51
4195e1Oj90L42j80K87k17J07o7J01q1j27j29K60l51L49J77P2l11K14J27l05k54
4217b21L03K06l93K36m5p9j50K07j1M1j73l9L9N1R1m3J92j06j67K2J54k01K79
4240A93l22J33p8J64j49P4K39m03K38j65n2J96J95k67l3L5K23j44K34n79J01J61
4262fr4K97k76J58R5j74K5Q1k47J38lL9n1o0P1l0j75L15K4j23M2R9j62o0j9J60
4288F4j2n2L19n3Pj49j21j60M1J04k25J57j50K37r5J42j49R9J37j95L98l29k13
4311a98J17K53k66L10j42n21L60R8q4J11q7L9J49k73m7K03j54L79j70j20Q2j91
4333a52J36J60n3M1j59k9L29l97M6j33R8K26J27m46R7j75K69J9M6m38N22R0k42
4356a8k23M2J56l2Q2j29K51q3k62K42Q2J25j91q8l0Q6p3K06j88k99N30k22k10
$$ plain form
4195 -51 -45 -235 107 -73 214 -3 104 37 138 57 -70 -199 61 -290 59 236 308 -3 211 338 33 -221
4217 -221 82 288 -105 131 86 7 -143 64 53 94 -79 -118 -79 -28 63 20 212 106 -61 -39 115 -86 193
4240 193 -129 4 -74 90 -59 15 254 -149 89 -76 -128 68 263 -4 -37 -2 221 77 311 -268 -167 -6
4262 -6 -100 197 -79 79 174 0 25 106 -141 -3 -6 33 -18 -78 -7 -37 -212 103 127 4 46 145 -17 -77 -96 64
4288 64 52 0 319 266 273 124 3 -157 -116 -12 -237 -80 -230 7 -88 54 -95 4 141 -54 344 15 -198
4311 -198 -81 172 -94 216 74 -447 -87 11 -73 38 -49 -10 139 -134 -181 22 -132 247 77 -43 39 -152
4333 -152 -16 144 91 132 -27 -56 273 -124 -78 -211 -113 113 240 -206 -109 -284 -15 4 50 -388 134 224 -18
4356 -18 -241 -199 -43 -75 7 -122 129 46 -216 26 108 233 42 -46 -76 10 -63 143 -45 -344 186 -36 -246
4379b46Q2J58K47j90R1k11J91PJ80j50k43L50j64j72J03j30L19l07q6O8J79p7
4401ak0J41l97L38j42R9j60mq0O6N6L07o8k42J21j47L8l0J18o6j9J38J29j82k8
4426c5L1L5j85j0K20k20k9K96Pk08K97m43O09k49m49L62q5j18lM07J4j11k50J47
4450C0K44l78j8M3Q3Q0j16m6M6K9k01J77r1J68K4j00l0J99m67L18M6M0J06m8k55
4475a17K33j96k6r2J77J80l2p0J4J98k76J20N0N1k27Q0l29M74k71m5j33K52j10
4498i5J97J46l17K26J5j60j16L76k71J48j44k4Q0j01L1J4P7R6k3l48j76L90j6
4521EM6j13j3jj19L45q9K58k46J65j29J7j95K46o4l17M02k41R1l25K94j9K00l90
4545a92K43oo3K56J75k42j80PM5L6j31j87L54o7j84J5K11k1k11P1J68j5o5K32
$$ plain form
4379 -246 -164 -6 241 51 142 -69 122 129 309 159 -84 266 102 -70 33 -97 222 -85 -171 -103 76 -1
4401 -1 -21 120 -277 61 -81 18 -142 -146 -226 -160 -104 203 135 -107 14 -133 -95 -125 -7 -73 -92 46 175 -7 -35
4426 -35 -4 31 -154 -164 56 -164 -193 103 110 -98 199 -244 365 116 -333 29 -56 -174 -177 230 244 133 -117 30
4450 30 274 -104 -122 -79 4 84 -32 -78 -32 -3 -204 -27 -118 50 74 -26 -56 143 -324 -6 40 80 186 138 -117
4475 -117 116 -80 -106 -198 -21 159 127 57 71 269 -7 113 163 214 -13 67 -262 212 -59 -104 -237 15 -95
4498 -95 102 248 -69 157 172 12 -104 272 1 149 5 -19 61 -40 -9 5 82 178 155 -193 -369 21 5
4521 5 51 -62 -75 -76 -195 150 61 319 73 238 109 126 -69 177 113 -204 198 -43 48 -277 17 -2 198 -192
4545 -192 51 45 -18 238 413 171 -9 -2 43 79 -52 -239 115 48 -136 -121 90 69 -142 -71 97 82 17 249
4569B49k46p8L3K39j78k10K15p0K57n5m34L25j0j26J06q8k34M15q0p4K0j19m9
4592a92R5J61M5N2k59J47k17K62N0Q1l18M1m2L0%J8J37P9j09j91k68L88j87r4
4616b91N44k68j28K31p2P5M6k29O8k6N9r2J55J78l32J54k36J89K0r9k01J63J25
4639C3J21p5p9O7j21J45M8q6J60o66N93j99Q6j26K93m68K63M00n88L98j51J2j64
4662a04R5m9J95k81J8J18J01k56J11j28K3P2J35r9K80q4l52K42j23o5j34L77O3
4685A55k5l5j65qK0j50J43l03N84N3p7n8j62Q5j6q7p7P0j0K06r2l1K1p3J79j97
4711e0J15k03N4O4rL3q8L8j40L87k95K23q6q1J09j74O7Ll5J15q7K97j15J28l15
4736d5J53j54Qq4L09j63k04J67j38J88L0L7k0J45n14J75k26L53mM2k44M77l56
$$ plain form
4569 249 3 -75 -42 197 19 -191 24 -46 211 156 -278 47 37 -89 17 -71 -305 110 30 -44 -24 -143 -192
4592 -192 -97 64 109 161 -98 49 -168 94 144 225 -93 -52 -94 -64 -64 -46 91 170 61 -130 -398 -10 -197 -291
4616 -291 253 -15 -143 88 16 91 137 -92 -24 -50 9 -83 72 250 -82 72 -164 25 45 -54 -255 -92 33
4639 33 154 79 0 67 -54 91 139 53 213 -453 140 -59 27 -99 194 -274 -11 389 -199 199 48 60 -104
4662 -104 -9 -58 137 -144 -126 -8 93 -163 -52 -180 -157 -85 50 -49 231 147 -205 37 -86 -151 -285 92 155
4685 155 130 95 -70 -78 -58 -208 -65 -368 216 269 192 134 -28 57 41 -46 -123 -53 -63 143 51 20 41 -32 147 -50
4711 -50 65 -138 -84 -20 -29 4 -84 -46 -186 201 -94 129 43 -38 71 -103 -36 -33 -68 47 -40 257 142 270 -45
4736 -45 108 -46 -38 -122 187 24 -180 -13 -151 37 67 104 84 229 -285 -110 -336 17 13 55 -189 288 -68
4759f8J73O5k73qL85j25o7p6J47m5l9j41R3k06K90r9J35k82K4K08k09J48J94l28
4783a04J11k21J39J40J56l35p0R7q2J92J55l49K66k42k15K82jQ3Q5K5k63M71k94
4806B6k41J98M81m74Ok24J82J46j46k22L41j52o7L4J56M4k36K08J38k93R0J41
4828A36j24J35k67J6r3L96m09J82O5k33J03R1K36k18o3J65k18K95j65j1r5m9j0
4851a35L09l49K69j82J24N9n7M4k72M31k54l3J81k37J41n6k5j60J98L9k56L25
4873A04k54L60j67J6j20j62K00q2Q2j72L16k26J59k08K72l04K4P5n3n4K93J15
4895B14j85k7J6k01M7K38k13J11O8n2L05n29J64J19o7P6j1Q7n7q0m5m7R5J90l75
4920a59J88j85j76L18j11j65L79o1p3k64L38j04N0J43l94L10j00N0q4K11m31M33
$$ plain form
4759 -68 105 170 -103 -111 274 149 82 6 153 108 69 -72 21 -185 105 6 141 -141 -117 91 -118 30 224 -104
4783 -104 7 -214 -75 65 221 -114 -184 -87 -169 23 178 -171 95 -147 -362 -80 -81 2 87 112 -151 320 26
4806 26 -215 -17 464 -10 -4 -228 -46 100 -46 -268 73 -79 -146 -112 44 88 -148 60 198 -95 -5 136
4828 136 12 147 -120 -104 -197 199 -210 -28 37 -196 -93 -2 234 16 -47 118 -100 195 30 19 -76 -125 -135
4851 -135 174 -175 94 -88 36 95 38 82 -190 241 -13 -46 135 -102 39 -17 -42 -202 -4 35 -221 104
4873 104 -150 210 43 59 -61 -223 -23 -105 -23 -195 121 -105 54 -154 118 -186 -162 -87 -140 -194 99 214
4895 214 29 2 18 -183 -136 102 -111 0 68 16 321 -208 -44 75 8 84 73 160 103 23 -22 -69 26 216 -159
4920 -159 29 -156 -332 -14 -125 -290 89 28 -45 -309 29 -75 -25 118 -276 34 -66 -16 -100 111 -320 113
4942A13J72j52k18jq4J15M4rJ99l59N00l68l7N0K96k12j67L18l18K22k5lqk04
4966a36J19L7m1k20K12J35k78Q0J45N6j90L10k31m12L30k5P1J15k33j01M40j70
4988A3q1K66l06LL60k72K32r3j22L02n8j3K1j14l05J89p4K24j94J1N9j25j02K01
5012B2l7l7j06K01O3k10K49o5k40J49n0l8p0J59j28N8P8j32K34J52k64q2J65o3
5036HK50k86Q8p9o2M7j46L75n61L29k3m3J99j90J70j42Q7K3N8j87j9J12l1O3k04
5061a64k19N28j52P4j1J09k55mM5K45l8l77L37OQk76M57l01J44J03j40k32K54
5084A41m9J55j72j12J9rJ69j42k32K56K12j63N9k54N7m1mK76j35p1j51Q4J64j80
5108a23M4j69K38j27K46k48L73l13K02j17rKj02K99j00j19j29K34j50J01l7j57
$$ plain form
4942 113 285 133 -85 -86 -170 -55 -11 -20 179 -180 320 -48 -85 -35 261 49 -118 200 -118 104 79 76 68 -136
4966 -136 -17 20 -21 -241 -29 106 -172 -92 53 109 -81 229 -2 -414 -84 -109 -38 77 -156 -257 183 13
4988 13 -68 198 -108 -105 255 -17 215 122 0 302 244 231 252 138 -167 22 -52 172 -22 -11 48 -77 -179 22
5012 22 -15 -52 -158 43 106 -104 145 80 -160 -11 -61 -99 -169 -10 -138 -80 -2 -134 100 252 -12 -94 71 8
5036 8 258 -28 60 -19 -81 -34 -180 195 -366 -37 -60 -103 96 -94 76 -66 21 44 102 -85 -104 8 -23 40 -164
5061 -164 -383 145 -7 67 56 165 -90 -94 -49 196 158 -219 118 124 132 -144 313 12 156 259 119 -113 141
5084 141 92 247 75 -37 -18 -27 142 0 -232 24 236 73 132 -122 -65 -106 -110 166 31 -40 -191 -107 57 -123
5108 -123 -79 -248 -10 -137 109 -139 234 -79 123 6 -3 -1 -103 196 96 -23 -152 82 -68 33 -4 -161
5130a61J96j78J02m3J20L4j67O5r8J04J25k24J57J88P5p6j32j09L9m8r5o1K22
5153C5p9o5J5L4R8k72L05J2k09K3J63k75K82j56Q0J01qjL1j06K5l02L72k00N9
5178c8K69j70j68K20k19M7j71K08k1J65m07K34R4m0K65k55Q4n0L3Pq4L3j9n2j27
5203a62L6L53k80m3m2L07j17J67k54j6K61k37M6j62p3K43l68M10j16J97k65j12
5225b27P8K15K7k19L76l16N4P0K53l18J54j69nj50K41j59K7K16r6L6l1k09L07
5248A55l07j2M1K05r1O3k78K12K6o7j15L08j1j95K94k86n1p4J21J04l5j06J82
5271H3l8j88o0J42p3J08k64O24l25J65j99j52L10m46M76k24L92k38P2J8j71j15
5293a03K6K41j58J26k52O2kJ56k9m1k01J45K23j84j41J09j76J78K02k31o9J65
$$ plain form
5130 -161 35 -143 -41 -84 36 70 -97 -32 -130 -26 99 -125 32 220 295 219 87 -22 17 -31 -126 -187 35
5153 35 -44 -109 -94 -60 38 -234 71 83 -126 -103 60 -215 67 -89 -9 92 84 83 114 8 33 -269 103 -97 -38
5178 -38 231 61 -107 113 -106 -59 -230 -22 -43 122 -285 -51 43 3 268 13 97 47 80 87 3 36 17 -35 -162
5203 -162 -126 227 -53 -96 -138 169 52 219 -35 -51 210 -27 19 -143 -216 27 -341 69 -47 150 -115 -227
5225 -227 -149 66 93 -126 250 -66 -12 58 311 -7 147 -22 -27 -177 64 -95 -68 148 52 88 57 -152 155
5248 155 -152 -164 -123 82 -9 54 -224 -12 14 -53 -168 140 129 -66 228 -58 -109 -183 -62 42 7 -99 83
5271 83 45 -143 -203 -61 -134 -26 -290 334 9 174 -25 -177 133 -313 163 -61 331 93 165 183 12 -103
5293 -103 -77 164 6 132 -120 -58 -60 96 67 26 -175 -30 193 9 -132 -23 -199 -21 181 -50 -119 46
5315D6j63J39l3k7K8J64j04nK37j75R6l69K85j83L9R5q8j28L56k99L4J30j39L12
5339B48k10p4k27K93M0k00P2m2J13j48j88L49J26j28l3k38M97k06p8q5P9Q1K39
5362B80r4k70k1K69l53K43k26J04J04j61K08p3k4r6k15L40J1R0j82k5J4K78j21
5385H0m6J61l07Q1j32lL82l28R8K9mK66l92K46j65P2j49J78j41M9K2o0J27Q3k55
5410a08m7M52k23n2q6j25P8Q4N9l72L35j43N08m03J80j92J52J19l75J45O2j58
5432a10J04R1j60J25q7K92m27J76j94K72q9J77kl11J2j25k1M66j48j15J92k88
5454a70m6K66P5r9o4m7Q2J16n4j69J8J11J25j28k4m4J61k7k07N3K35j92J74j15
5478C0j09J44J36k11p6j83J80K16j0j3j11J11j59P1l7j20L02l73L9K87j29j78
$$ plain form
5315 46 -117 22 -11 -38 -10 154 50 45 282 107 203 -166 119 -64 -25 70 -18 -146 210 -89 -55 75 -64 248
5339 248 38 -36 -263 30 70 -130 -58 -100 13 -135 -323 26 152 24 -9 -247 250 44 -34 -119 -40 41 280
5362 280 186 -84 -105 164 -189 54 -172 -68 36 -125 83 10 -14 -110 -325 15 26 116 -66 -91 -77 201 80
5385 80 34 195 -112 -31 -163 -166 216 -112 -14 15 11 277 -115 131 -34 38 -111 67 -74 -25 -3 -63 64 147 -108
5410 -108 -155 297 74 22 -64 -189 -111 -27 32 -340 -5 -148 360 -43 137 -55 97 216 -159 -14 48 -110
5432 -110 -6 85 -75 50 -37 255 -172 4 -190 82 -7 170 168 -143 -131 -256 -277 189 41 -74 118 -170
5454 -170 -216 50 125 26 -38 -85 -3 113 59 -110 -92 19 144 16 -8 -52 109 82 -125 -72 163 -29 145 30
5478 30 -79 65 201 -10 -86 -269 -89 127 117 104 -7 104 -55 16 -21 -141 161 -212 -173 114 -15 -193
5500a93P3J4rK63p5j86K55p8n9j00J14Mj32J40m2K5j14J19j71OK0J22J51k15K34
5525A66j86k5J76M8k11J0k98K41N0j19rM3K07j48k5j7p3P5J16p8K05j33k3N7J34
5550A83k48r4J21j41OK07j63J91m6k5K9m2J25l75K47J85m94N11j14nj57rj4J48
5574B6j3J00k23J81k24j56J83K88j71K09k9j04rj72J17J00J3j89pQ9K7l4J89j27
5598F4m4l37M02N8j37R2k22L69n6J03j53p6o8O0j06K04J08k61J61k33J43j3l9
5621A9k4P5R2k27QJ6%J01m4J88k04k02L77M1l62J37J53k4q0j57OK24j72J28j96
5646a27L11j20j86N7j10J85J75k89L17k38Q0o0j57L7m0M05m61K82j38J9J75j03
5668A4P4j40j9J70j84M7J9j68L04r4k19K65L2j13M8J03l6k07q3j2K71J93J7k5
$$ plain form
5500 -193 -120 -106 -115 148 73 -113 142 64 5 -95 19 23 -109 31 -11 14 -100 19 -152 -146 -126 -4 147 -68 166
5525 166 -20 -45 131 179 -32 -22 -320 -79 -29 -148 -157 -114 93 -55 -80 -97 -170 -95 21 -57 148 15 -8 49 183
5550 183 -65 -159 -38 -179 -173 34 -129 62 16 -9 20 -22 103 -272 -25 160 -334 177 63 58 -99 -108 -122 26
5574 26 13 113 -110 71 -153 -309 -126 162 -9 200 171 67 58 -114 3 103 116 -73 -80 9 36 2 191 64
5598 64 20 -317 85 143 6 98 -124 245 189 292 139 63 -5 55 -51 153 261 0 161 -72 71 58 19
5621 19 -5 70 162 -65 -57 -41 -41 60 16 204 0 -202 175 216 -146 -9 144 120 40 -117 -111 113 -59 69 -127
5646 -127 184 64 -122 -65 -175 10 185 -104 213 -25 55 -5 -162 -125 -165 240 -221 61 -77 -58 117 14
5668 14 88 -52 -71 99 -85 -38 -19 -187 117 23 -196 69 101 -12 36 139 103 -104 -187 -199 72 265 282 257
5692B57O0j93K5j98L5j22j21M21o0J57l81L00%l13K01j53J71k28L89l23jM2J16
5715H1l5L2j6k51J43j34K85q8J09k71K47n6j74n9K76Q6l75K26n8O2J40k15l9J18
5739C4l09K73L0O5qj16L49l84J42j72J49m9m0M8q1J50q6P2j95J01mk18O9M28l44
5764i6N5j33K1J13M6k38J24J76j83O9J75N5k34m7K92j25J20k71n8j3O3j28P2K18
5788G3k03PJ31m4O9j20p1K79p9nq1K5O9P6K3k85J87j25n1%N3j32K04n4p1Q3R6
5815E4L3l0l02K73P4K5k99R9n9J49J24j26j0q9j09N9L04j24R0k61J70k3Q4l8o5
5840Cn8l7J57r9o8J6J90j10J65k33NJ38k3j85J48l3j2J05j51r0K46k06m8K89J14
5865B23l09J15j21J89k17J29O2N5j30j81L98l48K05l5J64o6o1j55J65P6m78K35
$$ plain form
5692 257 317 124 149 -49 -14 -136 -257 164 104 261 -120 180 180 -133 68 -85 86 -142 247 -76 -77 -35 81
5715 81 46 78 62 -189 -46 -180 105 17 126 -145 102 46 -128 -187 89 175 -200 26 -32 30 170 -45 -84 34
5739 34 -275 -2 28 93 85 -31 318 -66 76 -96 53 4 -36 12 -69 81 -5 67 -128 -27 -31 -249 -180 248 -96
5764 -96 -41 -174 -153 -40 6 -232 -108 68 -115 -46 129 184 -50 -97 195 70 190 -81 -139 -152 -89 -217 -145 73
5788 73 -130 -123 8 -36 33 -87 -158 121 42 37 -44 -19 50 126 149 -136 51 -74 -125 -125 -72 -204 0 -54 -125 -42 54
5815 54 87 57 -245 28 102 127 -172 -73 -132 17 141 15 5 -84 -193 -134 170 46 136 -125 45 22 106 68 3
5840 3 -55 -92 65 -34 -102 -86 104 -6 159 -74 -69 69 46 -139 9 -24 -36 69 -82 -172 74 -132 -180 109 223
5865 223 -86 29 -92 97 -120 9 71 126 -4 -185 213 -135 70 35 199 133 72 -83 82 158 -320 -85
5887h5j80M34r4L3K64m32l0K3J79j54j77R6Q9J25n4R2j87L5J76P2M3k94J03j03
5911b6K8m2K42j71k9J28k18r2J48Q4j13k44J83J1QN0J07j70L08k36J07L9j04L34
5935C32l37L4Pj34oO2Q4j58O3J30J76r6j06k37L4K09j83lP0K3K49j03Rj08r7K3
5961f3J19P2l74M24k46R9Q2k07P0K86j73j91K62j21k00J92k17K48J7k84K94l93
5983c04M15j5j94q1M01l47J57K5k05pJ17J35j53J54m4K4k94K13r2J40j52J70l08
6006b45qN9J15j7L54j68j65J15K12l48J32l9k1J41L4k56m3J06j61Q6l8N3R8p4
6030g8R5jK92n49M32o3j50k7J85J6k36J84K0j64k1O1J57j51m6J99k69K05k31M13
6054B73j76r6J45J31j06k53p5J69j4r5J90k94L37k98P3lnP7j04l9J19L0Kj38M60
$$ plain form
5887 -85 -265 169 75 108 372 -60 -90 -67 112 -42 -219 -123 -34 91 37 129 -58 -23 153 225 268 -26 77 -26
5911 -26 2 -40 202 31 2 130 -88 -180 -32 52 -61 -305 -122 -111 -103 -53 54 -116 192 -44 63 102 -2 332
5935 332 -5 29 36 -98 -104 -42 42 -116 -53 77 253 157 51 -186 -152 57 -126 -129 -59 -36 213 110 119 11 -86 -63
5961 -63 56 128 -246 178 -68 31 113 -94 -24 262 89 -102 160 39 -161 31 -186 62 79 -205 89 -304
5983 -304 111 96 -98 -179 222 -125 32 57 -148 -155 -38 97 -56 98 54 78 -216 -3 -95 45 -107 63 -245
6006 -245 -253 -194 -79 -96 258 90 -75 40 252 -96 36 -3 -24 117 151 -105 -148 -42 -203 -117 -155 -102 -4 -78
6030 -78 17 16 308 -241 191 128 -22 -49 136 152 -84 100 120 -44 -65 -4 153 2 -44 155 -114 91 -140 273
6054 273 97 1 146 277 171 -82 -157 12 -2 -97 93 -201 136 -162 -89 -92 -97 -20 -124 -163 -44 -14 -12 -150 310
6079C10n22K74j3q9l2NL68n24L09n5J24R7k86J5p6r3J03J6m4J18r3LO6r9J41J08
6105A31J87l58m8J77j5j25K11l13M35l33l6k6l0J52j61P7J33L4j59R2j72L94k41
6128Fj48L57j50L46l29m5r7q1K18r7k05L00r7k86M10k34O9J25J09q7Q3p9j27L21
6152B82k05r5K81j54J9l45J36Q8j97K37rj08J51J32j58k31K54R2k67k98L84K02
6174A91m20K49j35P9J09J86k48k9J11j68k0j10N08o14K45L59m41K03q5j40k5K67
6196G2j60P4O2q6K04k69l8J20O7L8q9K26j38o4J09j79k51J81J03M2k87L19O9l08
6220a83K16j08j09J62j42J07r3J80Q5O1l27K20k9n1l1J93l33J59o1J4L20m47J58
6243c9l8J53kj15J18P7L7m3j25k26K69J1j47J79j70K34j11j68L5j93L94%p4p1
$$ plain form
6079 310 -212 62 49 -40 -72 -67 301 -223 86 31 155 252 -34 -19 -95 -188 -85 -69 -113 5 -88 -85 -19 -118 23 131
6105 131 318 -40 -88 89 74 -51 160 -153 282 -51 -87 -113 -143 9 -152 -75 58 92 -67 25 -147 247 6
6128 6 -142 215 65 411 82 37 -60 -141 77 -20 -225 75 -22 -308 102 -132 -63 62 171 84 167 88 -39 282
6152 282 77 -18 263 109 128 -217 -81 7 -190 47 38 -70 81 213 55 -176 78 170 -97 -395 -11 191
6174 191 -229 20 -115 -36 73 259 11 -18 93 -75 -95 -205 303 -311 -66 293 -148 55 -30 -170 -195 72
6196 72 -88 -14 48 -38 166 -103 -141 -21 46 84 -5 221 83 19 128 -51 -302 -121 -18 24 -263 56 125 -183
6220 -183 33 -75 -184 -22 -164 -57 -150 30 115 176 -151 69 40 -11 -42 151 -182 -23 -84 -70 250 -197 -39
6243 -39 -77 76 74 -41 77 154 191 148 23 -203 66 77 -70 109 -61 173 62 -106 -71 -264 130 130 56 -15
6267a5K0LPJ67k57j00J58J92Rj92j65K20k42K01m5q8K05L3q0J52l6j66l53K29
6291a43K70l72NkM43l69L7j1L2L11k02J57l16L30j06j09n0j60M69j39k30j46L32
6314C1L1lO0j22j63K80L6j83R4q8M7kj27K67j20j91JJ06n6J23J37k92K68j50L23
6339C07k99j36J39k01Q3Q5J08k25L86m04K55j19M4j04j24L57P2k49o8J7J97m0
6361H1k46J88J68j60j01OrO4M8j02j30L19o8k56M42j67m2j88L86l2p5k00O5J30
$$ plain form
6267 -15 5 8 15 182 -75 -175 -17 175 184 -8 -173 47 -195 6 -39 -127 78 111 31 183 147 -19 -372 -143
6291 -143 127 -245 -240 -242 201 -168 -131 -142 -110 201 -1 156 -160 170 64 -45 -95 -255 214 75 -155 -301 31
6314 31 62 59 119 -3 -166 114 150 -33 61 -27 20 18 -109 158 38 -153 -152 -46 -102 21 158 -134 134 -16 307
6339 307 8 -128 11 -190 -107 -22 86 -139 247 -157 98 -21 23 -81 -205 152 224 -25 -93 -76 121 81
6361 81 -165 23 191 31 -70 -64 -73 -9 39 -63 -193 126 58 -198 244 77 35 -153 233 201 126 -74 -9 121
$$ [...]
8191h4
##END NTUPLES=NMR FID
##END=
