##TITLE=1H_LR-780-OM1
 CDCl3
 8 sc, 
 19.12.2023
##JCAMPDX= 6.0         $$ Bruker NMR JCAMP-DX V2.0
##DATA TYPE= NMR FID
##DATA CLASS= NTUPLES
##ORIGIN= UXNMR, Bruker Analytische Messtechnik GmbH
##OWNER= root
$$ XWIN-NMR		Version 3.5
$$ Tue Dec 19 15:28:35 2023 Russian Standard Time (UT+4h)  she@DPX200
##.OBSERVE FREQUENCY= 200.1313
##.OBSERVE NUCLEUS= ^1H
##.DELAY= (6, 6)
##.ACQUISITION MODE= SIMULTANEOUS
##.ACQUISITION SCHEME= undefined
##.AVERAGES= 8
##.DIGITISER RES= 18
##SPECTROMETER/DATA SYSTEM= spect
##.PULSE SEQUENCE= zg30
##.SOLVENT NAME= CDCl3
##.SHIFT REFERENCE= (INTERNAL, CDCl3, 0, 15.7039)
##AUDIT TRAIL= $$ (NUMBER, WHEN, WHO, WHERE, WHAT)
$$ ##TITLE= Audit trail, XWIN-NMR		Version 3.5
$$ ##JCAMPDX= 5.01
$$ ##ORIGIN= Bruker BioSpin GmbH
$$ ##OWNER= she
$$ F:/spectra/data/she/nmr/H-F/1/audita.txt
$$ ##AUDIT TRAIL=  $$ (NUMBER, WHEN, WHO, WHERE, WHAT)
(   1,<2023-12-19 15:27:25.21 +0400>,<she>,<DPX200>,
      <created by zg, POWCHK disabled, PULCHK disabled
       configuration hash MD5:
       00 E9 B6 7A A2 85 ED C7 34 08 36 98 17 FE 4E 26
       data hash MD5: 16K
       51 43 64 4E 8D 08 31 85 30 1A 5D C1 08 CE 2C 19>)
$$ ##END=
$$ 
$$ hash MD5
$$ A5 E5 77 24 D2 98 7E 37 E3 24 69 D8 93 19 AF A9
##$RELAX= 
##$RELAX= 
##$RELAX= 
##$RELAX= 
##$RELAX= 
##$RELAX= 
$$ Bruker specific parameters
$$ --------------------------
##$DU= <F:/spectra>
##$EXPNO= 1
##$NAME= <H-F>
##$PROCNO= 1
##$TYPE= <nmr>
##$USER= <she>
##$AMP= (0..31)
100 100 100 100 100 100 100 100 100 100 100 100 100 100 100 100 100 100 
100 100 100 100 100 100 100 100 100 100 100 100 100 100 
##$AQSEQ= 0
##$AQ_mod= 1
##$AUNM= <au_zg>
##$AUTOPOS= <>
##$BF1= 200.13
##$BF2= 200.13
##$BF3= 200.13
##$BF4= 200.13
##$BF5= 200.13
##$BF6= 200.13
##$BF7= 200.13
##$BF8= 200.13
##$BYTORDA= 1
##$CFDGTYP= 0
##$CFRGTYP= 5
##$CHEMSTR= <none>
##$CNST= (0..31)
1 1 145 1 1 1 1 1 1 1 1 1 1 1 1 1 1 1 1 1 1 1 1 1 1 1 1 1 1 1 1 1 
##$CPDPRG= <>
##$CPDPRG1= <>
##$CPDPRG2= <>
##$CPDPRG3= <>
##$CPDPRG4= <mlev>
##$CPDPRG5= <mlev>
##$CPDPRG6= <mlev>
##$CPDPRG7= <mlev>
##$CPDPRG8= <mlev>
##$CPDPRGB= <>
##$CPDPRGT= <>
##$D= (0..31)
0 1.2 0 0 0 0 0 0 0 0.06 0 0.03 0 0 0 0 0.0002 0 0 0 0 0 0 0 0 0 0 0 0 
0 0 0 
##$DATE= 1702985244
##$DBL= (0..7)
120 120 120 120 120 120 120 120 
##$DBP= (0..7)
150 150 150 150 150 150 150 150 
##$DBP07= 0
##$DBPNAM0= <>
##$DBPNAM1= <>
##$DBPNAM2= <>
##$DBPNAM3= <>
##$DBPNAM4= <>
##$DBPNAM5= <>
##$DBPNAM6= <>
##$DBPNAM7= <>
##$DBPOAL= (0..7)
0.5 0.5 0.5 0.5 0.5 0.5 0.5 0.5 
##$DBPOFFS= (0..7)
0 0 0 0 0 0 0 0 
##$DE= 6
##$DECBNUC= <off>
##$DECIM= 32
##$DECNUC= <off>
##$DECSTAT= 4
##$DIGMOD= 1
##$DIGTYP= 9
##$DL= (0..7)
0 120 120 120 120 120 120 120 
##$DP= (0..7)
150 150 150 150 150 150 150 150 
##$DP07= 0
##$DPNAME0= <>
##$DPNAME1= <>
##$DPNAME2= <>
##$DPNAME3= <>
##$DPNAME4= <>
##$DPNAME5= <>
##$DPNAME6= <>
##$DPNAME7= <>
##$DPOAL= (0..7)
0.5 0.5 0.5 0.5 0.5 0.5 0.5 0.5 
##$DPOFFS= (0..7)
0 0 0 0 0 0 0 0 
##$DQDMODE= 0
##$DR= 18
##$DS= 0
##$DSLIST= <SSSSSSSSSSSSSSS>
$$ [...]
##$SUBNAM2= <"">
##$SUBNAM3= <"">
##$SUBNAM4= <"">
##$SUBNAM5= <"">
##$SUBNAM6= <"">
##$SUBNAM7= <"">
##$SUBNAM8= <"">
##$SUBNAM9= <"">
##$SW= 18.0517328524113
##$SWIBOX= (0..15)
0 0 2 0 0 0 0 0 0 0 0 0 0 0 0 0 
##$SW_h= 3612.71676300578
##$TD= 16384
##$TD0= 1
##$TE= 0
##$TE2= 300
##$TE3= 300
##$TEG= 300
##$TL= (0..7)
0 120 120 120 120 120 120 120 
##$TP= (0..7)
150 150 150 150 150 150 150 150 
##$TP07= 0
##$TPNAME0= <>
##$TPNAME1= <>
##$TPNAME2= <>
##$TPNAME3= <>
##$TPNAME4= <>
##$TPNAME5= <>
##$TPNAME6= <>
##$TPNAME7= <>
##$TPOAL= (0..7)
0.5 0.5 0.5 0.5 0.5 0.5 0.5 0.5 
##$TPOFFS= (0..7)
0 0 0 0 0 0 0 0 
##$TUNHIN= 0
##$TUNHOUT= 0
##$TUNXOUT= 0
##$USERA1= <user>
##$USERA2= <user>
##$USERA3= <user>
##$USERA4= <user>
##$USERA5= <user>
##$V9= 5
##$VALIST= <valist>
##$VCLIST= <CCCCCCCCCCCCCCC>
##$VD= 0
##$VDLIST= <DDDDDDDDDDDDDDD>
##$VPLIST= <PPPPPPPPPPPPPPP>
##$VTLIST= <TTTTTTTTTTTTTTT>
##$WBST= 1024
##$WBSW= 4
##$XGAIN= (0..3)
0 0 0 0 
##$XL= 0
##$YL= 0
##$YMAX_a= 172494
##$YMIN_a= -210131
##$ZGOPTNS= <>
##$ZL1= 120
##$ZL2= 120
##$ZL3= 120
##$ZL4= 120
##$ABSF1= 10
##$ABSF2= 0
##$ABSG= 5
##$ABSL= 3
##$ALPHA= 0
##$AQORDER= 0
##$ASSFAC= 0
##$ASSFACI= 0
##$ASSFACX= 0
##$ASSWID= 0
##$AUNMP= <proc_1d>
##$AZFE= 0.1
##$AZFW= 0.1
##$BCFW= 1
##$BC_mod= 2
##$BYTORDP= 1
##$COROFFS= 0
##$CY= 11.3945322036743
##$DATMOD= 1
##$DC= 2
##$DFILT= <>
##$DTYPP= 0
##$F1P= 15.7292609196834
##$F2P= 12.9074282941183
##$FCOR= 0.5
##$FTSIZE= 0
##$FT_mod= 4
##$GAMMA= 1
##$GB= 0.15
##$INTBC= 1
##$INTSCL= 1
##$ISEN= 128
##$LB= 0.24
##$LEV0= 0
##$LPBIN= 0
##$MAXI= 10000
##$MC2= 0
##$MEAN= 0
##$ME_mod= 0
##$MI= 1.114404
##$NCOEF= 0
##$NC_proc= 0
##$NLEV= 6
##$NOISF1= 3.799351
##$NOISF2= 2.8
##$NSP= 1
##$NTH_PI= 0
##$NZP= 0
##$OFFSET= 15.70392
##$PC= 1
##$PHC0= -24593.88
##$PHC1= 13.85272
##$PH_mod= 1
##$PKNL= yes
##$PPARMOD= 0
##$PSCAL= 0
##$PSIGN= 0
##$REVERSE= no
##$SF= 200.130013532006
##$SI= 16384
##$SIGF1= 3
##$SIGF2= 2
##$SINO= 400
##$SIOLD= 16384
##$SREGLST= <1H.CDCl3>
##$SSB= 0
##$STSI= 0
##$STSR= 0
##$SW_p= 3612.71676300578
##$SYMM= 0
##$S_DEV= 0
##$TDeff= 0
##$TDoff= 0
##$TI= <>
##$TILT= no
##$TM1= 0
##$TM2= 0
##$TOPLEV= 0
##$USERP1= <user>
##$USERP2= <user>
##$USERP3= <user>
##$USERP4= <user>
##$USERP5= <user>
##$WDW= 1
##$XDIM= 8192
##$YMAX_p= 0
##$YMIN_p= 0
$$ End of Bruker specific parameters
$$ ---------------------------------
##NTUPLES= NMR FID
##VAR_NAME=  TIME,          FID/REAL,        FID/IMAG
##SYMBOL=    X,             R,               I
##VAR_TYPE=  INDEPENDENT,   DEPENDENT,       DEPENDENT
##VAR_FORM=  AFFN,          ASDF,            ASDF
##VAR_DIM=   8192,          8192,            8192
##UNITS=     SECONDS,       ARBITRARY UNITS, ARBITRARY UNITS
##FACTOR=    0.0002768,     1,               1
##FIRST=     0,             0,               0
##LAST=      2.2672688,     0,               0
##MIN=       0,             -210131,         0
##MAX=       2.2672688,     172494,          0
$$ Real data points
##PAGE= N=1
##DATA TABLE= (X++(R..R)), XYDATA
0 0 0 0 0 0 0 0 0 0 0 0 0 0 0 0 0 0 8 -8 8 -8 8 -8 16 -16 16 -22 24 -27 32 -35 40 -46 52 -59 67 -75 83 -92
38 -92 105 -114 129 -143 157 -173 190 -212 231 -257 281 -311 343 -377 417 -460 509 -566 631 -707
58 -707 797 -906 1038 -1206 1425 -1722 2149 -2811 3951 -6276 12802 -66460 -210131 56189
72 56189 101014 -73154 35134 172494 39756 -7101 86439 28026 -64667 12644 37001
83 37001 -59751 -62070 -32746 -84736 -65683 -18519 -43668 -1917 59238 9107 10497 69220 33945
96 33945 17368 71539 46084 -8924 10724 10648 -39064 -30560 1910 -25008 -29037 -2720 -52945
109 -52945 -68120 3664 -20932 -50165 57064 65633 -23485 38935 85016 -18119 -8503 88320
121 88320 25703 -44443 28440 22026 -87363 -55461 17317 -54722 -62489 35291 -989 -53197
133 -53197 27764 34145 -22075 31723 60312 4164 14910 42868 -93 -12168 23214 3100
145 3100 -31358 -6196 -7524 -52725 -30957 282 -31182 -15888 24594 -4692 -7082 29357 10202
158 10202 7538 41849 25304 9287 29086 7951 -23417 -4581 -1622 -34923 -21409 9198
170 9198 -27442 -40608 12713 -2723 -39762 21995 39180 -19421 14178 53646 -3884 -7564
182 -7564 42788 11401 -23043 12884 12081 -34694 -20781 8797 -25598 -31611 11354 -7770 -29705
195 -29705 13029 12070 -14288 20650 30715 -8 14936 26006 -1439 -1565 12249 -2638 -13297
208 -13297 -2171 -6523 -23346 -13755 -4475 -19237 -7713 9746 -7055 1193 21541 611 2904
221 2904 27705 6845 -2468 22017 6786 -15224 3328 4994 -20973 -14957 4712 -14081 -25186
234 -25186 5051 2866 -21378 7716 21973 -9042 6312 28380 344 -20 22308 4034 -8196
247 -8196 7162 839 -15849 -8670 -1468 -15118 -14779 2118 -6171 -13009 8340 5857 -6594 13668
261 13668 15175 -1114 12400 14662 -1672 4277 6613 -6191 -5480 -1979 -9199 -12313 -5891 -5339
275 -5339 -11937 -3644 5035 -5958 538 15711 1699 1637 19899 6501 -2302 13515 5034 -8653
289 -8653 897 515 -11874 -9738 -3056 -8500 -12807 -1657 484 -8401 2438 10783 -1462 6233
303 6233 16085 2377 4455 13836 914 -1930 5084 -3367 -8100 -4450 -5860 -9717 -8989 -3857 -4697
318 -4697 -6766 2243 3416 -1356 8919 9624 2088 10733 10097 -32 6103 5164 -5418 -2101 -1613
333 -1613 -8977 -8236 -5584 -6682 -8236 -4990 921 -2528 -1223 8579 4463 2287 12350 7373 1895
348 1895 9561 4286 -2111 2254 -1914 -6633 -4868 -6369 -7816 -7125 -5704 -3122 -4563 -1168 4500
363 4500 845 3730 10205 4452 5471 10288 3265 2624 4638 -1940 -2649 -2354 -6997 -5827 -6311 -7532
379 -7532 -4455 -5041 -3282 38 -727 3946 6062 2568 7542 8245 2428 6197 5503 -1217 1076 -730
395 -730 -5240 -3451 -5410 -6697 -4781 -6190 -4369 -2035 -2956 1864 3331 1587 6806 5946 2974 7575
411 7575 4811 1301 4201 718 -2724 -1574 -4981 -5112 -4300 -6797 -3634 -2998 -5044 483 1067 -748
427 -748 4630 4626 3311 6703 4354 3418 4451 209 1045 505 -4312 -1712 -2824 -7305 -3418 -3432 -5813
444 -5813 -814 -472 -1439 2749 2049 2720 4676 3136 4969 4737 1208 3198 1095 -3143 -16 -2159
460 -2159 -5075 -1545 -3852 -4853 -1909 -3253 -1481 1636 -528 2925 4206 777 3997 4345 939
475 939 3289 2595 73 350 -2233 -2075 -1619 -5194 -1972 -532 -4902 -653 1086 -3334 920 3343
491 3343 434 2814 3865 1977 1875 1106 1794 916 -1934 1165 -191 -5243 -726 -660 -5571 -819 876
508 876 -2606 482 1605 79 1522 1270 2342 2630 46 2230 1837 -2111 116 83 -2683 -375 -971
525 -971 -2687 -99 -1856 -1644 1723 -1339 638 3377 -739 497 3127 -386 525 2037 109 -374
541 -374 -1083 -602 -310 -3369 -366 1720 -3465 124 3182 -2856 -424 3796 -568 268 3176 490
557 490 -410 -113 364 -74 -2404 477 846 -4042 -584 1386 -3412 -527 2585 -1170 926 2203 122
574 122 1650 498 508 1915 -614 -365 1269 -2390 -1614 92 -2351 -1061 -296 -1366 333 -796 -299
591 -299 2731 128 480 4471 -48 -262 3123 -355 -1317 1366 -756 -1685 -1328 -1232 -954 -3163 -931
608 -931 1686 -2458 -501 3849 -907 -47 4678 880 554 3068 470 -141 -333 -590 -405 -2755 -1707
625 -1707 94 -3259 -2348 878 -2220 -906 2012 -154 1204 2640 500 2694 1780 443 2743 178
641 178 -1172 1229 -1776 -2842 -233 -2502 -2310 -1491 -1924 -589 -1097 -582 2606 455 137 4527 1648
658 1648 -380 3938 1439 -860 1713 -308 -1508 -1206 -1929 -1393 -2720 -2735 377 -2217 -2059 2398 -366
675 -366 -489 3720 1442 1030 3500 1399 1030 1424 -33 249 -1147 -2252 -255 -2165 -3230 -624 -2283
692 -2283 -2405 446 -1003 128 1834 25 2058 2532 612 3251 2255 -433 1996 682 -1746 99
708 99 -1289 -2563 -1624 -2261 -1607 -1313 -2256 601 11 -1033 2758 1823 -200 3262 2297 -80 2529 1408
726 1408 -283 567 -1067 -885 -1100 -2619 -649 -1551 -2910 200 -538 -1638 1508 706 16 2717 1065
743 1065 995 2375 462 1349 1217 -1244 409 -59 -2267 -369 -1397 -2506 -354 -1527 -1373 535 -980
760 -980 413 1698 -422 1842 2223 -489 2051 2019 -808 1133 404 -1474 -216 -1177 -1379 -714 -2440
777 -2440 -622 17 -2035 324 736 -1232 1809 1563 -467 2047 1438 80 1555 21 -178 800 -1226
794 -1226 -109 -51 -2194 -124 -201 -2117 299 -12 -1420 1171 -79 -367 1386 -17 426 1814 -423
811 -423 823 1352 -1125 336 198 -1539 136 -398 -1417 403 -956 -594 801 -1167 -9 1343
827 1343 -835 764 1206 -936 821 1030 -614 685 279 -631 1158 -875 -265 730 -1406 -318 698
844 698 -1717 156 772 -1219 680 729 -822 966 270 -764 1166 -173 -125 1365 -734 87 1149
861 1149 -1162 275 637 -1175 153 165 -932 601 -487 -728 888 -757 -792 927 -969 170 1027
878 1027 -765 692 763 -445 1204 109 -451 1216 -298 -428 996 -1026 -600 639 -1622 -489
894 -489 704 -1217 110 305 -582 860 298 -372 1526 77 -205 1343 -613 -217 1261 -1023 -299
911 -299 82 -1487 -74 -416 -1416 573 -615 -981 999 -584 -274 1734 -199 318 1559 -174 787
928 787 932 -390 654 -64 -1171 430 -802 -1398 399 -1400 -866 341 -1322 -267 960 -377
944 -377 899 1187 -329 1516 897 -173 1323 -141 -483 1069 -1155 -907 -38 -1218 -660 -106 -1422
961 -1422 -94 -22 -735 1067 267 -261 1589 370 178 1676 -17 172 1066 -769 178 63 -1694 -262
979 -262 -382 -1751 318 -1027 -1240 903 -501 -271 1345 80 658 1336 76 802 1076 -370 999
996 999 110 -1231 619 -1055 -1629 277 -1088 -1183 140 -972 -280 462 -481 977 999 -29 1620 885
1014 885 -196 1758 279 -586 701 -615 -938 -56 -1264 -885 -491 -1647 -31 -363 -901 1012 354
1031 354 -426 1393 592 209 1726 482 243 928 -515 69 33 -1205 6 -544 -1711 104 -804 -1531
1049 -1531 598 -301 -229 1129 -39 479 1337 16 993 1237 -422 1075 445 -1101 501 -537 -1478
1066 -1478 100 -1022 -781 -188 -1366 -555 186 -759 735 764 -218 1371 981 -117 1096 450 -161 970
1084 970 -383 -219 538 -1279 -379 71 -1676 -222 -90 -1311 449 156 -385 825 254 125 1182
1101 1182 89 489 988 -417 497 412 -973 160 14 -1147 243 -263 -1412 231 -541 -674 392
1118 392 -437 287 1068 -282 906 1190 -425 713 576 -685 612 -56 -930 167 -1031 -746 104
1135 104 -1214 -610 480 -1165 269 540 -680 632 358 -141 951 258 242 950 -126 -52 911 -843
1153 -843 -128 361 -1101 -272 7 -1119 -89 -56 -790 473 -247 -33 924 -216 236 1422 -123 341
1171 341 1049 -486 109 383 -599 46 -81 -683 274 -780 -835 423 -842 -276 701 -745 155 1026 -29
1190 -29 861 699 -237 834 285 -401 538 -685 -562 716 -981 -381 215 -936 -395 -108 -912 377
1208 377 137 -388 932 104 -107 1142 -249 124 1193 -257 -81 244 -708 79 57 -834 131 -549 -956
1227 -956 291 -483 -432 1047 -101 -144 1113 -125 286 847 -263 525 483 -505 374 -243 -724 380 -653
1246 -653 -609 310 -698 -318 277 -823 315 444 -441 497 652 -76 829 723 -186 1015 10 -606 608
1265 608 -614 -388 43 -873 79 -25 -896 105 -442 -865 662 293 -205 1073 181 232 915 250 360
1284 360 722 -391 434 -112 -830 231 -106 -1060 162 -769 -762 456 -526 -234 587 -62 209 584 129
1303 129 510 580 -304 591 266 -655 75 -572 -535 2 -945 -682 448 -1061 -52 241 -678 627 494
1322 494 -279 857 428 58 1022 415 41 560 -118 -84 50 -778 182 -268 -815 19 10 -810 350 -2
1342 -2 -454 764 413 -25 892 51 399 644 -457 329 375 -744 155 -3 -733 -92 -324 -745 11 -665
1362 -665 -432 440 -336 148 723 -94 618 471 -271 1014 479 1 598 -168 -360 52 -488 -470 336 -790
1382 -790 -208 96 -630 225 350 -167 583 354 133 871 254 264 669 -56 443 315 -569 -129 58 -811
1402 -811 -251 -203 -1144 -3 -338 -568 454 -64 -1 701 335 367 654 -207 283 619 -478 407 49 -509
1422 -509 -2 -293 -562 -74 -746 -451 173 -640 38 455 -267 374 592 -218 638 316 111 663 -221 -241
1442 -241 304 -639 -244 -49 -955 -250 141 -633 -170 301 -468 251 -30 107 778 56 290 887 127 193
1462 193 538 -252 128 228 -596 4 -215 -701 184 -354 -751 416 -164 -303 375 -121 151 613 97 513
1482 513 526 -290 466 98 -454 445 -10 -578 137 -505 -395 -95 -619 -147 387 -217 206 156 -282 641 644
1503 644 -107 941 257 -266 599 -300 -405 560 -451 -302 254 -669 -208 -34 -595 222 97 -382 681
1522 681 -38 -134 890 135 338 675 41 125 535 -468 174 -98 -741 -133 -779 -689 106 -458 -5 380
1542 380 -199 238 620 -301 446 861 -24 577 393 -79 409 264 -346 285 -410 -327 184 -645 -272 80
1562 80 -451 132 243 -159 525 236 -198 501 378 -23 763 33 261 534 -269 -134 270 -761 -259 61
1582 61 -664 -94 -102 -567 373 10 22 467 153 120 916 -154 273 293 -258 236 -24 -154 35 -125 -487 -129
1604 -129 -309 -379 190 -104 -119 433 -423 461 560 -244 772 402 -162 387 229 -171 153 156 -140 41 -460
1625 -460 6 -117 -673 -31 133 -440 295 142 -316 477 349 14 725 149 35 509 -191 153 92 -496
1645 -496 9 -204 -488 214 -140 -537 -110 -387 -350 623 -266 -65 520 -27 374 578 -186 216 266 -411 197
1666 197 99 -138 174 -153 -409 -28 -377 -109 256 -302 -26 138 80 478 531 232 537 131 83 517 -22
1687 -22 71 378 -519 -250 -57 -641 -155 -147 -722 142 -113 -569 210 11 -114 555 166 -63 465 -341 30
1708 30 354 -194 11 91 -760 78 -284 -690 -97 -234 -402 80 -147 -38 350 -220 395 389 -112 553 505 -105
1730 -105 375 120 -331 315 -301 -218 -190 -219 -462 154 -393 -142 127 -503 304 298 -129 570 -95 -96 381 33
1752 33 -99 366 -45 -13 109 -397 -97 -310 -523 226 -185 -314 273 -128 -95 296 202 283 585 -50 59 523
1774 523 6 109 268 -541 134 -69 -335 238 -176 -388 249 -222 -127 -64 -227 117 291 -121 391 442 177
1795 177 353 -15 -37 700 26 -443 293 -397 -114 109 -475 110 -94 -260 11 222 -176 358 333 -168 642
1816 642 171 126 207 -267 -127 458 -496 153 119 -443 -63 -130 -645 247 54 -278 352 36 51 517 -120 211
1838 211 360 -187 62 183 -363 190 121 -591 -125 -107 -410 229 -344 -232 151 -268 -168 175 -61 257 507
1859 507 -83 426 137 133 252 148 -141 242 -262 -126 48 -475 -107 -86 -523 68 -100 -273 298 90 -332
1880 -332 440 426 -24 507 103 122 604 -256 153 198 -270 -93 -8 -489 -92 -166 -366 61 -328 -120 286 -37
1902 -37 60 443 -193 214 368 -38 427 114 -171 -31 -88 -119 151 -645 -160 -19 -339 48 165 -26 225
1923 225 269 -225 637 274 -53 380 0 -59 226 -252 -347 403 23 -100 -43 -522 -80 101 -218 150 234 30
1945 30 544 67 152 56 -100 0 543 -216 77 220 40 231 -32 -206 170 -167 -539 -139 -382 -164 100
1966 100 -212 0 95 -269 135 402 -218 226 386 -367 123 -25 -103 229 58 -345 149 -301 -201 -34 -486
1987 -486 227 399 -497 140 317 -15 286 320 -26 456 -238 -16 171 -168 82 -278 -517 -110 -167 -293 27
2008 27 51 -344 182 3 -135 497 123 177 624 -96 281 73 39 115 175 -350 139 -177 -394 155 -299 -217
2030 -217 -125 -256 73 180 -355 130 290 3 239 17 116 353 71 -92 198 -181 -27 244 -326 -39 124
2051 124 -372 -449 -147 -160 106 -181 -265 439 162 -113 177 -305 23 228 -169 161 409 -369 -207 102 -457
2072 -457 89 -198 -311 -103 -55 -337 284 -82 -56 472 105 278 278 -161 390 350 -26 261 -48 -263 73 -151
2094 -151 -420 34 -214 -181 72 -99 202 119 -221 37 87 -126 307 303 62 253 -17 -50 214 -424 -158 41
2116 41 -449 24 -308 -112 130 25 -108 187 -46 -195 409 109 127 251 -60 97 187 11 -6 -95 -200 -138
2138 -138 -461 -266 104 -349 -377 116 26 -124 181 27 153 323 135 170 192 -190 121 98 -167 -42 -83 -492
2160 -492 -46 -363 -482 49 -254 202 -102 -222 50 132 199 92 -58 121 333 -267 113 364 -9 -75 120
2181 120 -100 -119 -35 -433 -156 129 -285 275 119 -111 345 151 69 211 30 41 345 -51 217 267 -471 37
2203 37 29 -88 348 -157 -283 16 5 17 48 99 24 479 -210 365 79 -99 424 -176 -174 128 -167 -168 56 -335
2227 -335 -229 -158 -274 -117 -33 -41 223 6 -166 81 208 24 359 0 104 32 270 -206 58 -215 67 -33
2249 -33 16 117 15 -368 -35 -109 -1 18 -1 -69 41 2 177 245 -153 420 192 -99 209 42 -270 36 -80
2272 -80 -113 129 -156 26 36 -147 -132 331 68 224 -122 91 166 282 -228 257 0 36 205 -85 222 -72
2294 -72 -334 -206 -39 -297 -62 -44 -167 118 49 44 230 248 278 466 -23 -80 249 -113 -166 -165 -369 -33 -153 -420
2318 -420 -210 -133 -233 33 -212 -84 195 14 50 306 121 264 243 10 201 245 -147 -132 -16 -184 344 -206
2340 -206 -182 92 -255 69 53 -113 348 46 -173 225 107 48 547 28 -157 136 80 -205 31 -203 -100
2361 -100 -121 -216 -115 -51 -180 93 -222 -80 -2 50 -150 257 151 -93 194 -243 66 223 -156 -50 -249 -342
2383 -342 -27 -270 -194 -21 -310 119 252 3 -128 8 215 141 131 -110 412 52 -233 413 29 -152 17
2404 17 -121 -386 -96 -131 155 71 -176 -61 -22 -106 74 97 -150 136 162 250 165 -149 122 143 -130 106 39 -119
2428 -119 7 -157 -69 31 -88 -265 -9 51 -97 335 52 96 221 36 192 324 -200 -52 -145 -341 -102
2449 -102 -133 -417 -102 -22 67 33 -49 -145 226 167 16 329 245 266 -29 -91 232 57 -294 114 -80 12 -143 -165
2473 -165 -150 16 -135 -127 -44 -176 65 56 58 449 100 54 196 -142 93 92 -62 29 -27 -399 62 38 -320 -179 -140
2498 -140 -3 -27 7 -70 -4 149 47 237 -52 251 329 6 338 196 -102 -19 -290 -71 266 -98 -396 305
2520 305 62 1 67 111 66 16 235 191 314 87 269 296 -275 -145 171 -8 -8 -356 -128 235 -115 93 -34
2543 -34 -256 57 96 -56 208 -78 64 115 5 128 41 2 -210 251 -142 100 -32 -45 -75 -163 -85 6 -201
2566 -201 -77 116 -42 -50 89 105 176 5 -108 204 -5 93 -14 -102 -284 -28 -48 -114 31 -307 -231 -152 -326
2589 -326 18 -4 -395 101 131 -98 366 -9 -206 215 -53 -158 237 -118 120 126 -67 -30 82 -173 9 74
2611 74 0 -91 -250 -186 -31 -68 -92 218 -22 82 78 132 -82 31 -304 36 -11 -99 48 -20 -78 26 -187 106
2635 106 157 -190 111 252 56 -166 -151 -21 319 66 98 266 -201 -272 153 54 -73 188 -162 66 -246 -139
2657 -139 -163 105 174 -95 -80 78 -56 -42 121 115 -7 26 69 -278 -84 132 -246 -53 -257 -101 -2 17 -251
2680 -251 -70 -130 149 -1 8 105 105 28 308 -33 -207 -22 67 -123 210 -303 -81 89 -203 -64 153 124 8
2703 8 333 144 -17 423 -178 -64 89 -216 125 297 -346 158 -17 -112 10 -250 143 206 -131 -14 170
2724 170 -1 218 218 209 121 104 10 187 82 99 126 -175 111 -43 -59 -194 165 -119 104 189 -281 -71 -287 122
2748 122 112 35 71 -16 44 73 154 -8 -151 -137 43 137 -119 80 -185 -147 -93 196 -231 -99 73 202 30 160
2772 160 -143 -91 108 -14 120 -290 6 140 -138 -43 62 -73 -33 99 -463 -170 48 -267 177 -77 40
2793 40 184 -10 -110 28 326 118 -34 -153 230 114 -47 -43 36 -111 -195 55 -111 -36 -4 -5 232 7 110
2816 110 331 -144 282 171 -7 -72 130 155 186 -7 19 -13 -121 -164 -123 -204 103 -46 176 -82 76 -188 221
2839 221 350 -64 197 -42 73 46 -131 103 -140 -359 -20 33 -202 -138 123 -289 -50 -128 -56 238 -113 49
2861 49 132 -74 -44 -17 166 299 121 -280 -109 168 -213 -34 -42 -17 124 -274 -87 117 -124 -105 202 117 90
2884 90 217 -13 194 121 -93 -11 120 76 359 -427 -38 158 -146 -57 -33 -87 -114 -9 -110 39 -55 -171 19
2907 19 27 -2 186 210 -61 85 -75 -155 -80 -172 21 -32 24 -170 79 -290 -19 137 30 -40 -101 267 5 -113
2931 -113 2 266 48 129 166 -61 61 124 -18 67 -116 -361 -134 -38 123 34 57 -4 32 20 105 -275 71 165
2955 165 31 -206 122 200 -6 -64 -59 -108 -175 -108 -164 2 -183 100 0 -2 50 -78 118 -15 129 -12 178 -25
2979 -25 237 24 -12 -69 -99 -274 -196 -227 218 188 158 200 232 -23 -172 89 73 -11 93 9 -10 -49 -14 34 -115 125
3005 125 10 -43 -53 -266 -198 -15 196 -183 4 399 83 293 117 85 147 125 -27 -123 -200 -62 113 -3 -38
3028 -38 -7 -168 -46 45 -122 -102 235 -61 281 2 120 276 -431 127 173 -262 -204 2 -70 -229 169 -106
3050 -106 138 -14 -61 224 -180 -292 -7 31 -75 119 85 114 56 -134 -30 86 -22 142 -8 -302 28 127
3072 127 90 21 -208 142 233 -165 -62 268 -13 -8 129 -25 22 86 73 118 33 4 -54 245 93 -38 0 -99 117
3097 117 -90 -348 31 -163 -94 -78 -65 321 141 -250 -17 -21 -9 102 -33 -175 234 -123 -69 65 -18 -166 -126
3120 -126 200 75 93 4 175 -151 -131 65 110 403 81 -199 81 112 -8 -189 44 -149 -221 -36 77 -21
3142 -21 -136 -33 -151 127 -189 -114 -32 -10 -223 -7 69 -47 292 116 -148 44 -121 -11 -6 176 52 8 90
3165 90 -45 -47 -149 24 -76 -244 307 253 40 -243 -37 197 54 -125 -51 148 -159 -90 -81 -42 -138 13 30 -117
3189 -117 10 89 -108 39 -51 -120 26 75 -132 199 77 249 140 -143 100 224 -57 37 -115 -145 -155 -272
3211 -272 226 29 41 156 -18 -244 -177 73 60 29 -44 -95 79 -67 64 294 -61 -15 46 -227 177 -124 -157
3234 -157 197 -71 -13 271 -23 184 339 275 -193 -61 126 164 -5 -39 7 121 28 88 90 -169 264 -90 -7
3257 -7 -17 62 87 -102 -13 138 91 -392 115 93 -353 420 -20 -63 -38 -98 99 -252 -17 60 -123 -102 14 44 -73
3282 -73 204 -29 117 -53 109 -15 96 -167 223 34 -229 -101 -52 120 180 277 170 86 46 -365 161 -65
3304 -65 -100 20 -63 -6 284 256 -72 -4 -235 158 74 50 -138 -134 176 -94 152 -115 -79 -202 -152 188 50 -126
3328 -126 -62 -236 -30 158 -102 79 144 -254 -13 40 -359 153 -2 -15 -154 -249 -54 53 -155 112 48 -173
3350 -173 202 69 155 -425 -139 -12 123 -120 -142 174 -119 -88 -72 -212 -194 40 155 43 -2 -13 -210 -328
3372 -328 -327 196 80 223 109 133 -73 -72 -7 -45 -37 -223 -82 -188 -17 236 -35 223 15 14 -34 -30 -148 59 59
3397 59 -141 23 -25 131 144 -40 -41 174 -177 -110 123 18 70 96 34 -31 176 -38 -354 49 410 90 -184
3420 -184 184 88 -96 278 79 -78 115 206 -69 -45 -185 -371 108 2 -168 64 -20 -149 21 167 244 -63
3442 -63 -89 -179 -187 -119 205 -114 -24 49 -321 -22 21 -35 -13 47 -35 153 -76 211 207 -64 119 223 55 -94 53
3467 53 -22 -20 33 -26 58 -176 132 189 -37 -202 -173 -3 127 21 -52 53 42 -166 -37 -192 -59 -76 -4 -81 337
3492 337 178 -217 -9 -72 -15 264 -179 -195 13 -179 49 139 -142 180 211 -3 135 70 -251 332 31 -71
3514 -71 -207 115 98 22 48 -30 -37 62 -71 -150 -210 -54 40 -24 260 -150 -112 -22 -175 -118 -72 253 78 -266 -15
3539 -15 -55 139 -23 -17 -84 -94 273 -179 -82 43 -104 -20 92 213 179 -43 -18 72 -35 -200 74 -9 -70 65
3563 65 -167 -48 -22 41 77 -14 83 85 -30 -173 -54 42 -175 184 57 -90 51 -11 23 178 48 106 -48 -358
3587 -358 0 75 1 -117 -4 13 -113 253 -285 52 -297 -22 -10 -151 104 164 236 -174 -84 -29 2 95 -29
3610 -29 30 49 57 43 -49 -20 211 -94 55 -181 219 -221 -152 -150 138 -57 -57 124 -21 -85 72 166 -196 50 216
3635 216 75 -201 -30 -22 189 -3 83 79 -104 85 -80 191 -262 -16 69 -41 -65 -107 -108 -76 134 -42 -20 9
3659 9 -20 118 -58 38 -148 -85 -48 157 -41 14 -128 -24 -39 76 -198 -201 53 142 159 39 304 -53 -65 -63 15
3684 15 64 -39 105 -50 109 -135 53 -146 -67 -198 85 127 -91 115 55 -25 227 233 -1 224 94 207 62
3707 62 67 75 137 -45 -84 77 124 -15 325 171 -53 -82 -108 -204 31 220 -167 23 81 -389 -195 -6 18 122
3731 122 230 -57 216 40 68 -30 130 -159 -197 202 19 83 -129 238 -20 126 280 2 34 33 39 172 197
3754 197 64 53 -66 38 -7 -282 -36 57 172 11 108 326 61 -4 160 14 187 44 -37 54 -6 39 55
3777 55 3 315 -69 -122 86 203 2 120 113 -163 83 12 -113 82 262 27 -83 330 24 -90 -17 207
3799 207 -46 -118 77 194 15 -129 84 -103 3 244 -48 6 37 -218 -57 -260 23 225 136 165 85 110
3821 110 -133 19 6 -129 -78 17 -4 -99 119 11 214 -56 -57 -91 158 114 -35 -22 53 -162 4 175 52 -114
3845 -114 -179 -112 81 78 85 -99 -108 168 110 -29 -201 22 -20 -53 -156 39 73 23 15 -143 42 -152 -50 44 -201
3870 -201 61 -131 216 -73 -16 -35 128 129 41 233 -90 49 -34 49 158 261 -50 39 -130 211 69 223 8
3893 8 -114 122 160 87 42 52 59 -134 77 137 101 -198 223 114 132 -14 42 25 38 -11 -266 -244 90 136 12 263
3919 263 -348 -205 8 -136 262 138 -171 64 22 -63 -47 -183 138 73 28 -21 -62 -165 99 36 -115 84 45
3942 45 58 -240 -69 -148 -167 -11 36 85 -126 -9 -123 -240 168 24 73 -107 -9 -304 13 149 0 -34 -315
3965 -315 -222 -2 157 15 -168 5 202 162 90 -156 -51 -230 140 -77 -121 -75 66 -5 -247 -69 11 -14 174
3988 174 -9 -71 85 -99 -59 -175 93 201 -197 -14 84 44 -205 -159 -87 -120 50 3 165 -244 126 -54 -40
4011 -40 120 111 46 -115 -79 -55 -30 316 216 -71 61 51 -74 105 -47 -129 73 -27 -160 240 -99 195 -210
4034 -210 81 164 251 -20 -25 182 102 84 156 209 -90 54 27 -212 127 149 -193 161 -82 65 129 98 59 230
4058 230 -305 -342 -69 -20 219 -212 102 -157 -206 159 -124 279 74 -47 41 -51 -263 -83 -80 -142 162 -146 -130
4081 -130 -89 -178 -27 -37 81 -50 -118 117 -67 -264 -185 17 77 -12 -9 -139 102 -48 -182 43 58 28 -74 -41
4105 -41 138 -18 167 -100 30 -64 142 -8 -109 15 126 27 104 -277 -47 -297 -126 -31 145 -11 -212 -36
4127 -36 -56 -53 133 80 -462 -12 210 -86 146 -54 16 76 30 80 -5 -21 -248 -34 25 -165 -188 291 -196 -2
4151 -2 -259 -140 56 -44 -114 175 134 74 92 107 -187 -226 -122 -26 -28 176 -110 132 -115 133 -135 -151 98 197
4175 197 -60 81 -68 18 -130 -48 -168 -210 138 198 41 -75 -61 -32 119 111 -83 -6 258 84 82 92 292 188
4199 188 15 101 154 -237 -2 -221 7 -236 -145 -26 193 32 129 172 189 -139 29 -62 -74 -2 276 -133 -148
4222 -148 42 43 182 222 64 -9 -102 83 132 -128 165 131 -92 105 1 208 21 312 -135 -33 110 -14
4244 -14 -210 -40 50 -109 -10 -75 22 157 1 65 -82 148 -83 75 -130 -122 -18 49 -181 -276 30 42 70 -69
4268 -69 288 96 25 96 82 125 41 -62 -64 60 -20 306 -179 -41 56 59 -22 17 237 134 38 10 25 -108 -116 31
4294 31 65 -254 -203 -185 -82 2 134 -169 167 31 164 -132 -121 78 -132 -76 34 81 -147 37 41 -124 53
4317 53 -136 86 -26 -233 -200 -54 -288 -33 -19 -74 37 -28 79 85 -48 226 -49 350 17 -10 -26 -31 -119 160
4341 160 -87 17 -59 -10 -218 131 79 88 44 -133 29 121 -86 -74 181 321 96 -55 30 -12 199 193 269 -108
4365 -108 155 -121 25 104 173 -182 37 114 -104 29 210 -126 -48 -18 -196 -379 -138 35 -3 -31 -93 228 184
4388 184 44 7 25 -47 -47 218 -200 72 46 159 -45 4 -132 -97 76 -234 182 24 -161 -112 -164 145 59 84
4412 84 -140 -96 15 -76 56 -183 176 -50 184 -119 135 -228 27 135 -88 -70 306 -228 -45 -67 138 42
4434 42 103 17 10 -276 -85 39 -27 -48 15 -144 -23 49 142 -28 -22 108 -194 199 -101 180 96 -315 -137 -125 -193
4459 -193 -92 103 -218 25 21 328 43 -291 50 10 -134 -90 -179 78 -61 -186 -30 46 -172 -26 35 4 132
4482 132 -149 -19 42 116 207 6 -298 217 -181 35 61 -101 -188 -241 16 -187 -75 259 -56 -152 185 -9
4504 -9 -3 90 74 -107 -73 104 -201 -380 -1 -238 20 -139 -132 -202 104 -55 179 120 -124 -33 118 -53 -53 -8 -97
4529 -97 176 12 -38 -42 107 -277 178 -3 16 42 94 88 -26 -26 9 68 17 -98 120 -147 -125 81 185 163 69 121
4555 121 -6 -123 -170 93 120 -170 153 -264 36 -66 48 -26 -91 -95 -67 11 -108 133 51 106 45 -145 -192 -7
4579 -7 17 -146 -56 127 101 10 197 70 113 51 -127 53 -99 -78 -100 40 -389 72 53 219 -23 5 -76 -256
4603 -256 20 -20 120 260 262 -85 139 -227 187 285 -42 -198 49 67 -85 194 -40 -85 221 -112 -85 196
4625 196 171 49 90 -124 -113 -134 1 -125 -184 404 110 -129 139 -74 -77 -7 114 110 -82 -144 -107 124 5 -43
4649 -43 53 -16 -122 -30 125 -85 -28 -171 -33 -113 191 167 105 -20 74 406 69 183 -251 78 55 6 -50 -103
4673 -103 84 -121 -41 -26 -68 -19 -17 -234 139 104 -53 -58 -72 -121 177 162 130 114 -56 -83 -169 -263 157 221 -117 -33
4699 -33 40 49 -63 -29 -71 124 -53 180 8 310 -28 25 -33 -15 -11 8 165 68 -134 58 -171 -60 -4 37 -247
4724 -247 -62 157 -224 56 -15 -220 -179 65 27 17 53 -224 -129 -194 -125 81 142 -223 104 336 -11 -132 -21
4747 -21 110 187 75 1 34 6 -102 72 -30 133 -190 273 -98 -229 -147 11 9 25 -8 -280 27 -154 52
4770 52 -213 -142 114 56 -32 -94 -67 -111 -288 40 -148 130 -118 -283 31 13 -54 -171 -8 -348 -98 357 -72
4793 -72 27 -107 -145 -83 -140 66 -246 178 -12 -130 158 242 58 -35 -78 55 -92 192 79 -251 -57 -117 251
4816 251 164 200 145 35 46 201 114 28 -151 -118 119 -57 2 65 -31 -59 -88 -75 -92 -67 -84 129 211 103 -134 164
4842 164 -148 -19 125 -9 -233 59 -147 -37 -66 -191 73 -39 291 -33 262 -27 2 -109 187 14 142
4863 142 64 -134 -84 -246 18 -23 -48 -191 -40 118 -41 -225 86 160 -184 -65 -39 -87 -21 -255 -188 -231 1
4886 1 -61 28 -75 114 6 -132 -228 -97 -158 -12 118 90 -63 -62 52 -215 -130 -25 -69 -129 195 -187 67 299
4910 299 191 -93 127 -162 -10 91 -140 -26 338 39 53 174 112 -77 101 80 152 146 -77 -2 18 -320 167
4933 167 36 -35 -235 89 144 104 110 -123 -68 -18 90 1 -61 186 -83 47 200 123 -61 128 159 -96 219 -6
4957 -6 -70 2 167 48 -41 91 38 -19 -33 -7 205 -33 43 -84 -146 -104 155 331 65 222 81 130 211 -288 163
4982 163 -38 40 38 57 51 312 -26 -208 -205 -100 227 -144 -76 -84 268 -361 -38 27 -306 66 227 239 45 194
5006 194 208 68 157 21 92 4 160 -13 -348 111 73 53 -65 82 305 -5 306 15 318 204 89 147
5028 147 -167 137 -29 36 10 -7 7 -127 170 5 201 102 54 172 -135 -10 -150 11 169 137 10 -146
5050 -146 -41 10 -43 -84 287 -12 19 -40 202 182 66 141 190 11 -175 -34 -140 -143 180 55 -345 355 37
5073 37 -101 -99 13 -56 -113 -37 -194 -110 34 82 46 282 -34 -115 173 -24 -243 -105 -37 -115 -176 40 -25 -161 8
5098 8 -229 -43 48 -31 236 -299 216 -241 129 -163 73 139 -158 40 15 194 -94 113 -129 -39 -78 105 -197
5121 -197 -71 -145 252 -236 -113 -113 116 -24 -39 -31 20 172 50 -61 36 -195 82 230 249 -66 -47 -62 -69 33
5145 33 177 130 -58 38 51 384 -139 315 206 -126 -169 41 19 67 95 50 72 -153 122 6 -163 -16 -58 -91
5169 -91 -42 -223 20 -41 205 75 131 -63 15 -132 -133 -59 -155 -123 -102 73 -293 -12 -113 -43 193 -65 65 17
5193 17 33 -23 -81 146 15 -74 14 132 147 120 -69 283 -10 -467 74 -136 25 83 -8 -221 -327 213 -43
5216 -43 -62 304 206 288 -91 41 91 -18 47 3 -68 -34 168 -131 143 96 -180 186 -159 29 19 7 -281 30
5240 30 -46 37 131 -28 -10 -101 170 14 -37 -4 -84 -23 -122 -324 110 72 94 53 184 32 97 -59 -182 102 113
5265 113 9 236 221 169 162 -149 242 -231 27 -108 -35 -73 -22 -209 -98 173 104 -139 -128 -87 -72 -134 -116 41
5289 41 51 -30 -68 8 13 -130 3 9 35 13 -314 32 9 0 86 -29 -33 -350 -160 6 -206 -211 -7 63 28 -66 152
5316 152 89 58 -34 -31 36 -41 182 -30 -207 -79 -84 136 -13 81 90 161 165 -263 -30 -217 -111 75 86 111 28 117
5342 117 -305 96 -120 -98 46 -194 -68 -170 40 0 233 252 -232 51 -186 -394 85 71 -55 -304 134
5363 134 71 33 -74 67 8 130 84 -162 -126 -326 -32 -8 -49 5 0 204 -140 -51 124 45 -12 -313 -2 -59 55
5388 55 -63 86 6 87 -32 -89 22 -16 144 -257 17 -98 -156 11 -75 53 -19 88 -105 -166 -197 -126 -90 -90 117
5413 117 -92 -212 -71 75 124 -123 153 123 146 -51 85 299 -66 97 -241 258 103 56 -63 171 100 -73
5435 -73 227 201 167 218 238 200 -132 140 -16 34 30 -239 -30 -270 56 -93 -130 -158 -104 -112 -141 68 -106 205 -38
5460 -38 74 -18 89 -5 341 101 101 -113 29 122 174 253 163 272 8 -13 191 -11 172 9 -16 52 53 -347 125
5485 125 186 -28 -129 -244 -123 -147 -3 72 35 -54 -232 3 -64 237 -237 91 19 -44 159 151 239 -112 -227 9
5509 9 -50 91 113 107 47 -70 -60 42 240 -132 65 -132 81 -147 4 129 -167 32 15 -132 52 -39 58 73
5533 73 79 190 -32 228 89 60 153 201 -139 180 -91 73 -277 14 -163 38 29 -45 5 33 0 -113 322 282
5557 282 -132 -177 175 155 -35 -196 -192 17 -108 60 106 36 -26 62 -159 40 107 118 -29 -125 79 68 263 -62
5581 -62 12 294 1 -62 -281 -25 68 127 139 -22 211 -103 -137 182 -5 -160 -112 262 -109 -121 125 132 -27 -118
5605 -118 31 -89 -14 -35 -231 -82 -167 -57 39 18 -122 -67 55 46 36 -132 -12 -187 214 53 -257 -216 -115
5628 -115 -237 -20 8 35 -32 93 -191 157 180 118 -41 -34 -297 10 -2 -11 -23 126 -208 -230 106 43 82 -103 114
5653 114 17 -437 128 209 -36 150 -132 49 69 -46 125 32 -37 -34 -165 143 -100 86 255 -217 -77 -157 -12
5676 -12 -177 110 220 -86 184 -207 -195 99 -291 131 0 -31 28 202 304 -71 -1 -8 187 167 -22 -77 109
5699 109 -192 -149 4 -249 -34 170 -154 -41 164 42 -43 148 115 -101 167 188 -73 -161 -15 7 -3 -140
5721 -140 0 -134 -141 -49 -72 159 108 120 -32 -159 55 -7 84 271 -32 -44 72 94 -74 -70 -48 -152 -220 131 103
5746 103 198 -147 152 -103 62 186 112 151 -1 6 260 247 -107 -103 135 77 -61 -168 -14 140 118 302 -8
5769 -8 -138 -213 -30 44 14 169 -58 -43 -62 24 145 153 -27 -297 185 151 -93 161 -109 -59 92 4 104 -166
5793 -166 -19 162 -59 207 -32 -40 -49 77 141 55 169 -34 -226 -43 -115 -76 52 80 -90 162 -144 -75 247
5816 247 -152 141 -232 117 -41 -99 -20 -8 -70 23 -252 133 -33 62 -207 62 176 -89 245 -10 -22 94
5838 94 39 -77 -179 28 -152 310 194 134 165 286 -61 234 -26 -115 134 -76 35 -49 6 -161 19 141
5860 141 356 -179 118 -42 181 223 78 -30 -224 61 236 141 -82 46 19 -164 187 159 -87 -84 -218 8
5882 8 -94 -72 48 -153 165 -39 -54 197 228 -39 278 -22 -114 177 -84 -230 -7 149 -28 -126 -134 -25 13
5905 13 -12 119 72 69 121 -253 205 99 -86 45 -146 -129 -48 -191 25 131 100 79 -121 -262 -120 -212 -18 -195
5929 -195 -18 8 10 -98 -22 -187 29 112 -21 -305 80 113 104 113 138 45 -27 44 -229 91 -13 -217 -102 38 -15
5954 -15 91 -78 64 84 72 -26 -242 -66 -21 39 -166 -71 -136 34 26 15 184 -143 37 -32 -123 -103 -37 74 -58
5979 -58 13 -95 -222 -84 -212 204 103 -85 253 13 -67 -270 -67 335 340 -135 -43 -18 -89 -72 -46 -123 76 -11
6003 -11 -5 -158 6 -104 94 -217 -163 24 -243 -31 -110 214 -121 316 -39 -170 -43 -111 -20 67 -94 -152 93
6026 93 44 90 -253 143 33 -88 157 -25 138 -1 3 116 -350 127 -336 -206 18 -239 142 -160 -10 5
6048 5 23 38 5 68 -81 146 -57 59 55 73 -195 -31 -60 -148 77 200 213 -174 10 -76 -63 -166 -12 196 169
6073 169 74 184 26 -44 -157 -54 -104 -17 -92 -270 20 -5 28 257 48 -181 118 -147 148 101 114 51 -112
6096 -112 -140 -96 104 133 85 113 -55 -92 18 -113 171 -71 -32 62 261 -134 -89 -119 -82 161 9 343 74 -14
6120 -14 38 92 -65 -36 -16 52 145 -83 -182 3 33 -91 -139 237 55 -52 21 -296 193 -44 63 -154 -265 -168
6144 -168 -23 -42 40 16 23 -175 72 56 51 -46 285 99 -91 -199 -75 133 106 -198 -253 56 5 -166 40 60
6168 60 -137 -41 -148 -38 8 124 60 268 -156 134 -51 110 -72 136 -4 -169 117 -34 73 -46 180
6189 180 -86 -116 90 -115 -148 -79 67 9 62 93 -79 211 115 117 -58 -155 191 174 -142 -42 110 -34 179 -15
6213 -15 -31 -6 72 76 -231 -17 -189 115 234 137 2 -113 222 -64 -96 -12 3 87 75 -208 96 -96 -85 -23 -142
6238 -142 290 -247 241 -61 -50 92 70 190 -226 3 97 119 52 81 102 -190 124 49 254 124 -53 50 -69
6261 -69 -145 -147 -7 13 -215 69 -81 -176 4 -110 -185 38 219 -82 -254 45 211 191 -274 330 -105 -108 35
6284 35 16 30 -45 -137 -114 179 7 -94 66 131 50 77 -121 -104 -47 187 19 248 220 -136 50 -79 -134 0
6308 0 98 129 254 -83 20 260 101 127 -44 30 -116 126 -21 65 24 72 140 196 -64 -106 -57 -141 -162 -127 -91 223
6334 223 1 83 -26 7 31 -22 -114 -81 66 -66 138 82 103 -123 24 35 -91 16 -73 361 -257 -9 -150
6357 -150 114 196 -70 -161 171 -125 -8 83 -153 120 -22 75 -203 -23 -2 28 236 11 -151 -111 6 17 -16
6380 -16 78 110 13 37 -139 -176 -6 -115 251 190 118 -7 123 140 -196 -22 55 123 -175 11 247 -24 -68 37
6404 37 97 48 214 113 -88 20 11 24 -7 160 -19 193 158 -222 91 159 206 -94 50 -89 31 -69 -63 128
6428 128 -10 -105 -46 -61 207 167 129 -110 -47 -147 233 74 232 129 109 57 -271 -81 -38 100 -206 92 -209
6451 -209 -37 -61 50 40 185 56 -208 34 -43 53 -82 281 121 3 -43 98 -85 101 -158 188 -63 -32
6473 -32 202 175 33 167 289 65 -59 -69 -43 -57 -33 122 -1 126 -79 -28 37 -168 163 -82 62 109 122
6496 122 108 -13 -229 75 -131 -34 74 -152 -129 -162 152 -9 212 -45 -225 -140 4 86 -70 -58 -223 87
6518 87 -143 -17 209 93 -90 -122 -185 71 -53 -137 -2 -7 -23 197 -60 -16 243 33 -87 -38 -118 -45 18 107
6542 107 242 32 25 17 132 -57 -17 145 -99 -70 84 54 42 -353 -113 -154 102 9 -39 69 57 -64 -117 26
6566 26 82 -3 245 161 -12 -130 184 132 37 -184 43 -75 -48 163 264 187 -82 88 -122 121 213 -22 118
6589 118 28 165 15 -57 -88 -107 -21 101 61 24 38 110 167 -145 97 -45 289 154 -122 -91 -46 -116 -58 146 -14
6614 -14 108 22 -29 -92 6 -1 116 -24 -152 16 -4 170 152 101 219 184 -128 -40 13 45 -118 1 63 255 80
6639 80 -56 -123 102 -29 -124 29 -8 -177 40 -137 -36 -81 89 4 -5 -108 -105 177 -89 73 123 -80 -19 2
6663 2 -114 63 -31 -76 3 69 -153 -79 48 5 -134 40 58 -14 211 -69 57 -34 113 -282 -126 -69 -15 15 156
6688 156 -289 155 -10 44 165 -159 -85 -28 80 266 178 -145 38 -2 -53 251 54 -157 -203 -120 -142 -7 161
6711 161 66 271 133 73 11 183 -61 -78 -27 -152 209 51 105 -10 93 -215 -34 35 166 4 69 -48 -444
6734 -444 -143 -137 71 -35 -176 121 65 57 107 104 200 -64 17 100 -5 -11 40 42 166 292 -7 52 -90 288 111 -63
6760 -63 279 -39 -148 86 15 -159 -17 78 -26 -38 -4 205 46 -18 82 -18 -100 97 112 -82 339 -88 -415
6783 -415 123 143 137 -103 22 -138 -30 3 -115 228 44 123 -82 302 136 -27 -293 -48 -117 -90 -120 -85 -84 -202
6807 -202 -155 116 46 229 157 -99 -73 -141 -153 -176 -17 202 -219 -85 114 129 -290 97 21 115 37 16 -200 -80
6831 -80 16 -28 -93 101 44 -121 181 -246 118 73 109 306 24 -63 -170 29 190 -5 68 12 -123 50 -362
6854 -362 -21 63 -120 252 -152 -91 -146 203 -35 27 -246 -55 45 -28 23 -154 125 -262 84 -162 110 -232
6876 -232 -19 -50 -194 215 8 44 -120 -290 -90 69 176 216 83 -51 18 51 102 -160 244 226 -203 -66
6898 -66 -25 -1 264 94 -165 104 366 -5 -46 130 -137 111 126 -38 -9 270 139 68 -31 -133 62 6 -82
6921 -82 188 -327 -167 4 71 -74 -387 -173 -53 -53 37 -26 53 -55 -100 28 -135 132 -40 70 48 28 157
6944 157 79 -218 -187 -65 378 0 -138 382 -62 -79 23 -65 14 -168 60 69 -188 74 -125 188 -103 -49 25
6967 25 -155 -226 -31 -233 164 -73 233 43 -178 8 97 -97 38 70 10 131 115 -123 36 -206 -137 30
6989 30 -35 -72 -181 212 322 71 -232 39 -211 117 484 3 -118 -165 -123 74 -82 356 -86 195 -39 -89
7011 -89 -102 133 379 166 -58 -192 -119 38 30 -196 116 -185 -191 -111 -185 119 239 4 227 -81 71 207 -50
7034 -50 46 -146 -34 -82 116 23 42 75 48 80 143 -92 -201 -134 226 -71 36 11 -114 54 158 24 -25 343
7058 343 108 227 183 84 -142 -287 25 -54 52 8 238 -49 -19 -48 -171 162 120 1 -43 -197 10 -142 94
7081 94 -116 -2 -1 -19 137 117 9 38 174 157 82 32 -17 1 -329 -172 181 135 121 -51 -108 -152 227 142 -175
7106 -175 -50 266 -14 120 310 -33 -22 62 -12 159 251 154 12 256 195 174 44 -31 347 -66 7 209 -126
7129 -126 -154 79 86 -38 231 -15 -115 69 113 212 -18 -45 141 56 -77 114 -64 -170 -87 15 -43 81 -79
7152 -79 128 100 -96 108 1 60 9 -104 5 60 45 88 23 -45 -195 -26 -1 1 117 29 -52 -9 -91 74 -41
7177 -41 1 165 -111 -182 -51 -102 82 200 -46 221 -8 -205 -27 62 6 -72 -141 -16 -37 -5 125 -199 -151 134
7201 134 310 174 120 100 -257 -248 24 -217 -69 65 191 -35 -58 128 90 24 -184 -9 37 -214 -25 120 186
7224 186 -92 -115 -58 -83 -143 -240 -134 -236 -76 16 -18 -94 100 -205 -160 71 113 302 38 30 -73 -22 -162 91
7248 91 40 -87 42 264 108 -276 20 125 -100 45 48 9 73 -112 184 46 -200 75 135 126 -82 280 94
7271 94 151 47 12 14 113 40 -5 -73 -22 156 12 -404 98 33 -94 -89 193 119 -177 42 -268 114 -224 46 31
7296 31 114 -414 -144 59 -143 -220 82 15 -103 155 -126 127 -113 7 -47 -57 -53 64 28 6 -67 85 88 -143
7320 -143 85 123 -71 -235 -69 -90 -149 15 60 -209 -2 -77 105 163 -2 -78 370 -282 -335 93 -28 -63 217
7343 217 -68 248 129 -101 111 -176 1 -133 182 40 -213 94 -202 -191 66 22 -150 -198 77 10 24 154
7365 154 -24 -65 59 -141 -33 235 264 -225 203 -77 -36 -44 106 -57 477 249 -226 283 100 46 23 -103
7387 -103 262 273 -17 72 -135 96 68 120 -87 123 64 36 153 166 145 -130 -32 -34 -220 366 44 -49 65 27
7411 27 36 19 -84 59 -94 -106 58 -134 -171 -174 88 94 4 -125 -97 10 66 -178 102 43 226 -29 90 -138 27
7436 27 -97 -65 68 -12 14 -162 82 -224 -139 82 -12 -169 33 -5 -56 -163 30 85 -39 169 -239 -25 89
7459 89 -113 -241 130 -203 -284 -180 60 -32 -102 121 42 25 -37 105 -239 -110 245 111 -71 178 -92 -290
7481 -290 -11 -38 -39 41 5 194 93 44 47 -12 167 -180 84 -53 11 108 -36 9 -108 149 123 -33 192 54
7505 54 -17 -88 132 -39 97 91 -43 46 146 160 40 -43 9 -30 -75 -56 -127 170 77 -195 22 -118 7 22 -74
7530 -74 110 99 -177 114 -118 118 127 -15 -29 93 -208 282 -22 95 22 -35 -206 -142 213 -225 108 -97 83
7553 83 -225 97 20 -198 -35 -85 28 107 364 -62 -109 115 -260 95 -3 -46 -74 -95 -132 35 0 -182 106 27
7577 27 10 -49 65 267 -53 -149 118 -132 -70 20 36 168 76 -139 -145 119 -129 -82 -126 -205 -111 -124 -123 57 130 222
7603 222 224 -385 21 -79 -37 120 126 67 69 -23 11 119 -122 -67 -133 -72 -217 21 -82 -123 353 60 51 -44 -196 142
7629 142 218 110 43 11 -7 -67 242 240 -44 -97 -99 110 -10 72 -253 26 -40 177 123 -248 -95 83 -291 -121
7653 -121 118 -315 -186 -35 -138 114 -18 -4 -82 4 -60 163 180 82 115 -254 48 73 -70 -217 -103 126 54
7676 54 15 61 57 71 -94 122 73 62 -26 -233 25 -40 28 105 -172 126 -78 -218 80 -20 -88 -5 -107 94 -37
7701 -37 -133 -53 -125 -259 -109 -12 -68 161 138 5 -180 -117 -81 17 30 158 79 -107 95 224 196 166 79 20 71 226
7727 226 -4 -75 -12 -199 -207 -308 90 55 51 92 -69 -123 76 -90 -153 -6 83 82 35 -38 -260 -32 11 467 64
7752 64 151 -135 256 -133 -67 50 -28 8 -31 216 65 61 -11 210 36 353 -64 210 -14 91 15 -371 153
7775 153 47 168 158 45 2 -138 -39 116 161 10 -56 -178 11 302 -35 357 120 158 -92 114 70 -124
7797 -124 -270 -117 -90 -114 193 -184 -101 87 -27 -124 114 -97 149 -7 -151 -205 -28 -141 -65 -149 136 -160
7819 -160 108 -84 303 172 -40 49 -150 62 157 -8 87 -1 -124 92 44 88 240 -10 10 265 262 -95 135
7842 135 117 -127 163 86 323 -302 35 140 22 260 38 -107 80 235 -193 -33 111 1 171 293 33
7863 33 207 -45 -178 104 -50 -56 -67 185 192 182 -40 -277 -129 8 141 271 415 80 62 38 -170 80 18
7886 18 1 -194 34 190 -180 51 69 107 59 -293 -128 -151 8 88 -105 93 102 262 34 79 -26 119 185 -98
7910 -98 -233 48 121 -131 -47 -121 -106 -18 59 -17 -107 -63 264 -178 -5 196 -119 0 -102 -138 46 -245 12 -202
7934 -202 -73 161 -16 101 207 53 30 166 -15 -106 310 349 5 45 94 64 37 82 -230 100 186 -100 -14
7957 -14 -34 186 160 -98 -72 46 127 -230 151 137 268 56 -17 113 47 -16 -116 -30 25 400 97 284 -156 37
7981 37 -190 126 87 108 11 -8 192 118 -71 -39 84 300 -2 122 -81 -136 -45 0 16 66 100 18 -59 23 -114
8006 -114 30 58 -17 -14 92 1 160 -13 -31 -241 7 386 257 -124 102 -112 -83 -148 41 46 -50 -71 -6 130
8030 130 80 90 -144 86 168 157 85 89 49 63 -44 -181 -138 145 -145 -32 -129 -137 298 47 119 -126 -48 -239 -240 -104
8056 -104 -133 101 -65 -96 97 -140 -76 -193 255 -111 6 54 -5 -148 -20 122 -39 88 -199 45 -11 33
8078 33 -54 17 19 -98 -102 -49 -94 15 -29 -76 11 -17 130 -40 -57 -246 177 106 9 43 -306 -44 -239 55 -166 116
8104 116 445 42 77 -89 -94 188 -179 165 -95 116 55 -80 47 -188 -105 148 27 95 -49 38 -72 244
8126 244 -415 -145 -130 120 40 35 -94 138 -88 90 2 208 290 59 35 -137 113 -122 6 -47 100 5 359
8149 359 -21 -311 57 -116 56 -249 77 10 -195 -203 -216 125 -14 -53 29 -222 95 -17 86 -110 -116 62 -126
8172 -126 3 78 156 134 -39 -100 173 -114 21 -98 -45 214 -16 3 68 35 250 113 37
8191C7
$$ Imaginary data points
##PAGE= N=2
##DATA TABLE= (X++(I..I)), XYDATA
0 0 0 0 0 0 0 0 0 0 0 0 0 -8 8 -8 8 -16 16 -24 24 -32 33 -40 49 -61 72 -80 96 -111 128 -145 167 -190 216
33 216 -246 278 -311 351 -391 439 -490 546 -606 672 -745 825 -910 1004 -1107 1220 -1346
50 -1346 1480 -1632 1799 -1986 2194 -2427 2695 -2999 3356 -3775 4278 -4890 5663 -6669 8036
65 8036 -10015 13145 -18873 32809 -145596 -88328 90681 -143484 -54825 108381 13245 -73916
77 -73916 70194 65547 -10806 59962 123640 15947 -6460 39267 -2849 -27417 18186 -23508
89 -23508 -35493 1803 -50507 -84944 -16983 -26979 -49473 14761 26626 -16346 22581 59894
101 59894 31211 36804 75791 44762 8197 17353 -24484 -65310 -10206 -18107 -75254 -5565 20438
114 20438 -78261 -41051 43374 -29583 -32860 85155 55830 -26532 42937 71799 -28660 -16056
126 -16056 71338 7791 -46343 31869 6100 -82669 -23610 7018 -63480 -29258 23840 -26071
138 -26071 -22462 32345 12921 1449 48162 44758 5582 22875 32932 -13042 -11158 21046 -15872
151 -15872 -32243 1593 -27001 -50082 -9977 -13603 -25885 13591 14431 -5370 20526 21888 -2063
164 -2063 20320 37430 7484 6456 32096 -1586 -34192 5246 227 -51428 -12175 18267 -43357
177 -43357 -29978 27817 -14227 -28501 35840 25701 -14013 23826 40409 -4425 -144 34416
189 34416 3214 -21942 12228 -196 -39943 -9188 1687 -34392 -11077 12148 -19046 -9365
201 -9365 17955 -146 -284 25013 17864 5386 16537 15969 -3014 -1136 7708 -9729 -13310 1513
215 1513 -16324 -22239 98 -13153 -19881 10305 2484 -11071 17908 17263 -5067 13897 24955
228 24955 120 -545 18637 1586 -18931 2395 4330 -27188 -11788 9227 -21322 -18151 13803
241 13803 -5909 -13231 18182 10899 -4169 15385 17365 347 5386 14268 559 -7333 4652
254 4652 -2707 -18822 -4621 -2591 -20794 -6211 4061 -12460 -1921 11583 -1731 4076 16268
267 16268 6121 5197 12592 6223 82 3387 1994 -8012 -7365 -1317 -11876 -14074 1301 -7648
281 -7648 -14103 6995 3129 -8120 11025 12920 -1349 9303 15463 2349 1954 8274 1444 -7233
295 -7233 -2708 -679 -12941 -9956 -327 -11709 -10650 4551 -4391 -5047 11089 4761 766 12862
309 12862 9341 2930 8000 6937 448 -1409 -455 -3400 -9598 -5774 -4457 -12604 -6219 -707 -8536
324 -8536 -1136 6046 -1821 4684 11840 3180 6395 11531 4129 2474 4392 646 -3920 -5004 -3276
339 -3276 -7449 -11160 -3678 -5019 -10259 283 1575 -4283 5570 7840 1925 8746 9474 3688 6166
354 6166 5290 1063 -57 -2091 -2961 -6218 -7828 -3882 -7596 -8620 -1234 -3952 -4305 4418 2206 1669
370 1669 8823 5977 5077 8456 4514 3227 3681 -793 -1509 -2579 -5773 -4836 -7548 -6993 -3618 -7035
386 -7035 -3455 1570 -2257 2159 7101 2653 5958 8753 3798 5402 5288 1040 1176 -1303 -3748 -3143
402 -3143 -6320 -5828 -4318 -7407 -3621 -1602 -4548 1025 3677 490 5874 6758 3297 6164 4892 2494
418 2494 3407 31 -752 -931 -5819 -4261 -3542 -7550 -4178 -2179 -4756 -578 508 -207 3627 3058 4187
435 4187 6625 3261 4264 5136 -190 1354 1567 -4055 -2033 -1976 -6395 -3581 -3546 -5045 -1688 -1910 -449
452 -449 2386 492 3086 5084 1424 4728 5301 965 2853 2259 -2260 -601 -2259 -4134 -1763 -4555
468 -4555 -3811 -1189 -4402 -2032 1577 -1025 1412 3937 2003 3278 2801 2198 3800 376 897 2645
484 2645 -2969 -2421 378 -5055 -3888 447 -3591 -2722 609 -1196 -421 1161 2099 3075 1035 3324
500 3324 4106 -1353 1148 3388 -3059 -901 1786 -3514 -2575 -691 -3239 -1902 -693 -499 1034 -533
516 -533 640 3070 -456 1477 4054 -257 1267 1948 -1341 -151 -392 -2137 697 -1689 -2906 1184
532 1184 -2007 -2467 1876 -267 -376 2626 1280 527 981 672 1734 -615 -89 2701 -2021 -2225 1996
549 1996 -2961 -3404 2671 -1427 -2628 1939 451 -889 1029 1353 1637 -78 1196 2788 -2114 -1096
565 -1096 2572 -2461 -2241 2067 -2104 -2371 607 -1688 -426 670 -169 2133 675 192 2607 408
581 408 -194 2531 -408 -908 697 -1607 -1080 -1189 -2492 380 -1145 -2734 1986 -134 -2072 3152
597 3152 1773 -841 3227 2359 118 839 725 573 -1253 -1473 1351 -2656 -3485 1340 -2487 -3644 1955
614 1955 -156 -2149 2342 1325 146 2272 1851 2344 1294 503 2275 -316 -2104 1261 -1696 -3183
630 -3183 376 -2114 -2908 -118 -1680 -561 847 -368 2148 2341 352 2944 2256 -98 2348 1430
646 1430 -605 316 -1068 -1483 -1481 -2899 -736 -1475 -3415 404 37 -2615 2111 2090 -805 3070 3230 877
664 877 2137 1733 898 218 -981 554 -1301 -3503 -239 -1946 -4448 87 -980 -2691 1096 549
680 549 -142 2168 1649 2096 2534 1001 2492 1365 -904 1300 -83 -2204 -539 -1964 -2785 -1108 -2529
697 -2529 -1916 110 -1866 765 2068 -455 2153 2884 109 2419 2954 159 1259 348 -686 -497
713 -497 -2229 -1144 -924 -3390 -1124 -340 -3265 207 1255 -1634 1546 2306 196 2446 1861 1519 1926
730 1926 542 888 979 -1821 -163 -267 -3170 -760 -879 -3051 -335 -466 -1556 1131 263 326 2470
747 2470 382 1624 2485 277 1474 1571 -1032 485 57 -1631 -523 -1700 -2102 -209 -2141 -1354 964
764 964 -1759 198 2005 -499 1271 2108 292 1440 1343 211 954 -201 -480 587 -1563 -866 273
781 273 -2502 -1027 834 -2368 -64 1044 -940 1078 857 225 1728 756 624 1853 -337 516 1436
798 1436 -1280 -360 654 -2256 -188 -294 -1737 123 -555 -1097 1118 -317 -157 1945 -261 378 1692
815 1692 -443 540 872 -569 636 209 -1081 545 -664 -1259 835 -1334 -883 1303 -1111 -379 1257
832 1257 -968 235 1110 -369 1061 416 -434 1234 -421 -729 1377 -929 -531 946 -1293 -526 524
849 524 -1368 57 338 -1203 344 -157 -921 1076 -590 -311 1186 -479 -254 1339 -672 346 935
866 935 -855 781 244 -1084 462 -246 -1171 818 -571 -954 1068 -871 -696 1068 -721 90 564
883 564 -849 852 692 -431 1302 121 -625 1412 -378 -792 1007 -866 -609 593 -1070 -307 -18
900 -18 -1317 496 -54 -1019 1339 -82 -348 1784 186 -107 1473 -326 383 1014 -1029 333 183
917 183 -1245 217 -633 -1712 534 -754 -948 852 -299 -305 1174 -205 693 1276 -105 1214 777
934 777 -312 1139 -151 -874 639 -785 -1487 152 -1342 -1329 182 -1355 -129 551 -629 1039 859
951 859 -257 1728 890 -230 1608 -8 -491 702 -952 -572 163 -1581 -196 -469 -1816 -2 -263
968 -263 -1364 1026 466 -281 1457 503 492 1596 219 753 989 -747 271 54 -1516 206 -509 -1871
986 -1871 12 -646 -1206 465 -600 -98 1145 -368 1063 1580 -69 1367 956 -552 1115 388 -1004
1003 -1004 594 -950 -1393 8 -1177 -861 -142 -1437 14 509 -739 642 1003 -385 1197 1135 77
1020 77 1619 451 -71 828 -562 -511 301 -1555 -454 -147 -1831 -111 -20 -1294 463 159 -355 1138
1038 1138 365 616 1530 28 572 1157 -748 435 415 -1616 53 -372 -1686 -36 -929 -1095 394
1055 394 -747 -317 924 -380 729 1327 -138 704 1546 -569 1002 767 -781 391 -692 -1083 92
1072 92 -1105 -712 105 -1537 -310 535 -1024 332 976 -478 1102 825 48 1423 -3 70 863 -827
1090 -827 -170 563 -1417 -571 -175 -1579 -169 -271 -880 328 -43 -317 978 -212 277 1397 -112
1107 -112 409 1233 -665 137 764 -834 140 -187 -951 -6 -548 -790 591 -984 -499 779 -961 35
1125 35 999 -508 672 876 -277 994 520 -335 722 -181 -329 596 -1027 -876 370 -1237 -659 325
1143 325 -920 97 262 -571 703 224 -191 1278 99 -36 968 80 -23 699 -692 -185 75 -1032
1161 -1032 -131 -367 -881 421 -413 -996 578 -154 -543 1228 88 26 1222 -115 429 666 -347 313
1179 313 181 -587 569 -566 -775 387 -883 -697 455 -749 -266 600 -695 232 662 -47 1003
1196 1003 455 -152 1008 247 -442 801 -576 -576 307 -698 -423 102 -1146 -386 313 -739 546 21
1214 21 -628 899 164 -118 905 -9 60 796 -84 367 318 -430 343 -211 -1077 336 -709 -1200 476
1233 476 -621 -799 650 -316 -336 648 -130 651 511 -328 983 504 -487 546 43 -703 399 -458 -442
1252 -442 83 -810 -411 147 -652 6 567 -759 415 769 105 757 144 327 980 -195 -19 497 -494
1271 -494 -26 35 -1210 -85 -40 -1081 -122 -134 -648 260 169 -262 985 198 439 909 11 569 830 -495
1291 -495 694 92 -911 220 -19 -771 15 -335 -632 202 -570 -221 672 -436 387 978 -60 589
1309 589 730 -247 771 194 -443 314 -201 -674 293 -871 -355 59 -898 -98 361 -643 443 422 -243
1328 -243 906 449 59 1000 -99 142 970 -356 -15 273 -924 -192 -194 -1184 -170 -26 -612 452 102
1347 102 -70 532 -219 237 910 -71 442 624 -184 588 347 -352 -3 -262 -520 81 -649 -823 398 -950
1367 -950 -485 315 -470 135 742 -128 631 704 -112 659 181 -258 561 -222 -445 617 -688 -355 92 -733
1387 -733 -347 160 -742 159 135 -313 588 39 11 784 54 61 685 -369 23 688 -472 -92 -133 -740 -266
1408 -266 -281 -1034 267 -351 -634 373 -92 -195 896 187 365 689 -243 761 627 -246 374 249 -515
1427 -515 449 -471 -753 155 -639 -507 236 -586 -38 217 -424 392 344 -58 615 267 -113 728 -102 -89 579
1448 579 -404 -506 318 -588 -363 41 -736 -39 118 -762 426 191 -358 950 68 387 980 -167 357
1467 357 418 -132 94 200 -525 -184 -18 -664 -223 -488 -590 250 -279 -236 420 -296 492 607 -155 678 608
1488 608 -70 676 168 -318 206 -121 -215 154 -571 -325 -70 -792 -18 199 -574 183 229 -319 674 148 122
1509 122 769 324 -48 761 -94 -141 238 -649 -330 104 -547 -168 -82 -731 -26 -281 -271 694 35 317 628
1530 628 27 223 863 -182 199 469 -541 272 -177 -454 53 -282 -742 30 -627 -276 261 -422 153
1549 153 474 -55 350 419 -127 620 391 -31 515 -93 -275 411 -410 -416 338 -808 -173 129 -521 -254 39
1570 39 -209 535 334 -192 627 252 200 575 -22 235 440 -490 16 94 -550 -60 -284 -644 110 11 -291
1591 -291 130 156 -71 400 -205 559 582 -22 544 366 -425 238 -108 -448 198 -439 -633 23 -285 -488 72
1612 72 -548 -135 383 -223 275 338 -151 355 568 68 500 74 -146 353 -372 -251 361 -366 -221 -5 -546
1633 -546 -145 0 -493 -59 57 -292 511 -3 26 493 124 407 292 -312 166 175 -259 -71 -179 -501 129
1654 129 -345 -502 95 -103 -345 565 -307 277 506 -301 492 442 -278 123 81 -377 191 -28 -235 105 -265
1675 -265 -452 -18 -564 -239 240 -475 43 170 -317 118 247 190 652 -171 -223 644 -157 -126 248 94 -238
1696 -238 289 -541 -268 -103 -647 -143 -17 -139 416 -38 -152 475 48 96 582 15 227 428 -323 396
1716 396 108 -332 -225 -223 -222 243 -553 -298 53 -263 -254 378 -125 263 414 -19 556 351 -245 256 218 -218
1738 -218 430 -528 -397 80 -638 -425 -200 -563 155 158 -454 172 91 -187 495 -1 132 485 24 -156 529
1759 529 -81 13 223 -363 -104 -6 -361 -113 -292 -558 295 -238 -158 685 99 116 727 -203 172 638 86
1780 86 603 369 -389 161 -152 -305 -109 -360 -462 -150 -403 -313 103 -396 231 216 -83 570 509 -43 616
1801 616 -5 75 324 -123 83 303 -371 -176 -26 -793 -3 -160 -406 261 21 -302 215 48 108 357 180
1822 180 168 524 -140 65 140 -187 64 -99 -540 -31 -60 -581 -176 -134 140 518 -296 -23 434 16 272
1843 272 539 -53 294 255 -98 420 -83 -390 121 -395 -164 113 -392 -359 148 -619 7 502 -206 118 501
1864 501 -110 708 72 -39 342 91 -4 231 -310 -419 -154 -655 -63 61 -434 -32 197 -382 327 92
1884 92 -89 538 134 198 369 -438 -36 577 -203 43 160 -87 91 -249 -427 7 -82 -122 -93 -61 -105 262
1906 262 -44 56 400 -178 495 455 24 371 108 -191 61 -174 -349 89 -394 -236 -10 -532 69 21 -354
1927 -354 161 -250 -77 265 187 -276 365 68 52 220 -16 78 70 -315 -283 79 -315 10 -300 -248 95 10 -283
1950 -283 227 -92 -27 287 177 254 430 -275 389 243 -92 14 91 -315 157 -499 -469 41 -188 -77 167
1971 167 -375 -41 357 -254 124 380 -258 220 285 81 63 -182 -60 535 -241 -183 61 -252 12 80 -247
1992 -247 -147 -158 -224 247 21 143 161 -1 -6 351 -19 -95 219 -35 28 113 -393 145 -266 -464 -243 -11 -332
2015 -332 393 -188 -158 85 -69 55 425 -6 191 391 206 200 -96 -276 -24 -316 -483 325 -302 -483 172
2036 172 -342 -77 361 -103 71 274 -142 230 136 -198 447 -99 -141 42 -186 -38 237 -119 -175 -3 -179
2057 -179 95 -107 -449 80 165 -155 174 192 -202 420 10 -10 71 -168 139 11 -328 181 -257 -602 177
2078 177 -289 -257 175 -195 -99 129 -241 -124 242 -131 355 507 -117 279 270 -58 2 81 -11 67 -139 -93 -5
2101 -5 -455 -345 -107 -369 232 366 -354 196 279 -366 250 9 -104 373 79 5 199 -341 -161 40 -324
2122 -324 -101 -70 -240 15 177 -232 327 -10 -161 342 -5 95 292 -67 141 28 -470 181 124 -192 93
2143 93 -11 -224 54 -205 -110 99 -145 -40 339 -27 93 418 -171 254 -46 38 238 -42 -413 217 -182
2164 -182 -140 424 -294 -90 192 -355 -8 -36 -466 -3 172 -131 439 -86 -173 424 -90 -34 205 -194 -90
2185 -90 62 -169 -31 4 -508 2 17 -121 146 -421 84 276 163 -43 122 -84 266 344 78 278 127
2206 127 -191 138 -127 -345 204 -125 -310 137 -142 -68 182 -301 50 208 4 107 -76 -296 287 56
2226 56 21 214 -162 -80 198 -403 28 123 12 -7 282 38 36 193 -125 -23 65 34 436 272 134 241 271
2249 271 239 155 -238 -136 -130 -570 132 90 -204 -26 -300 -158 120 -68 -22 245 141 396 230 -222 222 216 -213
2272 -213 64 55 -142 443 -6 -54 -181 -258 11 276 -343 -15 35 -39 -63 50 118 50 -29 -113 463 171 45 208
2296 208 -248 265 -105 -198 -57 -133 -186 8 -225 -401 197 132 61 146 34 -280 301 86 82 -29 4 36 -13 -332
2320 -332 -201 -210 -330 170 92 -77 -181 -153 87 298 -46 120 307 35 59 197 44 595 57 -382 -9 -85
2342 -85 -29 106 -364 -12 -24 -313 -201 -53 -475 296 -21 -123 221 149 51 158 198 143 19 -288 226 69
2364 69 -246 -120 -141 -193 125 -71 -200 26 77 5 23 235 -113 151 -86 12 257 -6 120 -35 34 243 -315
2387 -315 -257 -123 -177 -496 -64 4 -60 14 -115 3 110 -138 198 157 93 97 151 90 -28 -77 -133 -44 -154 33 10
2412 10 -121 -54 -1 -29 162 182 -118 221 -174 -71 194 230 -85 6 -181 167 48 -100 -140 -19 -193 -138 -39
2435 -39 -195 -208 -165 -35 87 57 -156 226 37 -162 -6 -47 -75 131 40 180 114 -171 334 -212 23 -74 -231
2458 -231 157 -48 -300 -84 102 -82 -27 247 200 76 250 82 380 -145 -45 181 -114 46 241 -103 -185
2479 -185 14 -6 88 -104 3 220 4 90 256 105 8 155 -141 132 322 -127 46 107 -211 75 142 -358
2501 -358 -46 -68 -240 59 -293 112 37 -34 64 395 81 314 170 2 364 78 41 54 -93 -145 -9 -196
2523 -196 -109 183 -244 -89 -59 -165 -66 90 204 43 -45 -37 436 -79 35 553 118 76 257 185 -186 91 -161
2546 -161 -22 45 -190 58 -178 -56 214 -64 -6 523 133 79 355 -245 149 94 -82 96 307 -214 -99
2567 -99 -317 111 166 -266 -208 -284 -72 -229 169 -201 42 24 18 178 177 -364 -18 -84 -161 212 -300 -65 169 -161
2591 -161 -158 72 -90 125 -149 17 144 189 99 256 77 56 -207 126 111 374 29 -213 34 -333 117 -79
2613 -79 -28 76 -231 -60 227 -211 70 -89 -53 73 44 157 -29 278 -213 13 48 -58 20 -257 -127 5
2635 5 163 64 106 -37 241 135 -63 120 88 -76 -73 280 26 74 248 -297 11 -64 -202 -100 -11 329 79
2658 79 -246 -65 153 -64 -339 144 -101 17 229 -43 242 131 21 162 18 179 40 31 -30 -166 -90 58
2680 58 -178 -255 -121 -44 -323 267 26 201 261 93 68 232 111 -62 -12 -428 -64 44 31 -335 -207 4
2702 4 132 107 -181 -188 -96 1 -129 13 73 -29 -51 58 40 43 379 160 36 114 181 -48 -51 141 239 -171 134 -64
2728 -64 -34 69 292 173 -76 -75 166 -152 174 -43 176 133 -85 157 2 -105 143 93 -219 114 -328 11
2750 11 -6 -134 -148 -71 96 -249 -35 -117 256 245 292 251 27 -68 206 -243 -250 378 -343 -42 119 43 224 -77
2774 -77 75 165 32 27 163 9 -91 106 -84 169 175 -82 152 123 -140 83 62 -208 -240 320 -93 238 -77
2797 -77 -39 77 -102 -96 122 -351 88 172 -9 -60 42 -84 -121 -31 -30 -230 -206 -77 -157 -290 -209 139 116 86 -81
2822 -81 -32 48 107 -33 -8 94 -93 48 -112 -95 -73 -183 -54 213 121 95 -168 -92 -174 178 -315 119 97 -173
2846 -173 201 1 8 70 125 4 -147 -212 -63 -97 -36 -96 5 -41 65 22 64 81 -175 71 96 144 44 -76 35
2871 35 210 -174 83 110 338 -201 173 105 30 168 -341 -41 -29 -34 -42 -27 161 77 -119 52 103 83 -227 292
2895 292 -198 -1 142 -80 80 46 -297 -142 -109 -172 -41 183 57 -150 -284 -193 185 131 146 205 46 73 15
2918 15 13 64 -258 -248 -306 -224 -155 104 177 -77 113 71 -200 -57 -157 213 84 52 -62 111 -68 24 -35 -94 287
2943 287 -140 -149 -98 -382 48 -145 -173 185 -79 133 214 -107 -59 -96 239 -91 359 -54 125 132 158 74 -50 -104
2967 -104 240 -55 -26 -128 -38 -219 -181 -124 -269 85 21 -124 63 292 131 477 -96 183 -18 188 178 -263
2989 -263 199 -85 -84 71 9 -204 54 241 -277 -107 -1 -226 103 295 102 -63 162 270 25 174 -123
3010 -123 20 -46 183 48 26 -158 -29 -164 -48 56 -7 -62 105 -80 83 7 -18 50 79 3 141 -49 16
3033 16 -35 149 39 15 -285 111 -115 -240 -44 -98 62 278 5 -7 250 144 120 236 -89 -116 190 -117
3055 -117 8 -91 35 14 -108 -102 6 -172 -169 50 49 307 -66 -112 30 77 82 116 -73 -228 15 221 226 -192 -221
3080 -221 228 136 -131 -108 -131 -220 20 114 -134 27 175 -83 142 110 -187 -19 -117 -116 77 22 42 37 -231 141
3104 141 -80 -208 -20 -12 -84 -25 -205 -42 254 65 28 385 -40 162 -15 8 64 -55 -329 53 -174 32
3126 32 106 -77 53 123 -220 -116 100 -29 213 186 -252 -61 117 -13 240 -54 23 60 -196 89 102 -418
3148 -418 -105 248 -118 31 -113 -3 192 212 -84 251 258 60 131 -184 19 153 35 -214 -10 43 -221 -94
3170 -94 63 -131 220 -102 181 -7 -32 -89 -43 -13 358 12 -101 139 -138 149 -12 3 -120 -278 1 7 -49
3193 -49 -152 241 -100 -35 -117 -52 -154 10 7 294 123 59 -26 99 -84 -130 161 -145 -51 -130 102 -18 -150 204
3217 204 166 -181 96 -4 -23 -29 87 255 78 134 -42 129 -80 -140 97 50 -40 28 -234 -38 20 11 -14 -3 -45
3242 -45 -84 113 -77 -14 -19 122 8 -43 0 -60 214 88 10 -322 -5 274 -37 -80 -24 -183 -415 8 146 162
3266 162 -75 82 -134 -149 162 80 -250 144 -166 -36 13 -140 202 62 -17 -115 -214 40 -76 -239 85 -235
3288 -235 94 -10 -39 142 174 232 -196 30 154 61 264 -175 66 246 -96 -134 34 -24 -183 -210 -182 -11 -142
3311 -142 -17 -68 98 202 -22 28 329 -4 -290 -32 101 -248 -23 -144 -18 79 -123 -47 -224 322 49
3332 49 34 -117 -129 116 -12 -329 -78 206 98 140 47 236 71 -29 -91 -11 243 -223 -204 -36 151 169 -17
3355 -17 114 238 -3 -34 41 299 55 -139 11 -23 -106 383 130 -114 166 -150 129 19 -71 47 -59 -181
3377 -181 147 120 -1 152 -64 -153 217 22 -150 38 33 257 97 9 -248 57 231 -170 -31 -298 -157 -183
3399 -183 143 44 -57 -2 153 -214 101 196 -245 10 127 -104 -179 61 100 -113 -35 27 -15 71 -204 122 150
3422 150 235 -183 77 172 43 164 -76 -226 15 -12 -107 -52 -142 -122 78 -241 -16 -94 -90 87 -237 57 6 304
3446 304 84 14 26 -21 34 -98 -74 -137 74 81 121 239 -138 -94 62 79 155 251 189 340 107 42 79 -56 -204
3471 -204 -96 95 4 -41 -104 -8 46 62 -23 7 60 107 -15 48 38 -189 -25 7 -205 35 -72 -77 116 36 -102
3496 -102 43 -85 -47 -52 -84 101 107 112 -117 -104 43 102 0 144 -163 287 111 -39 43 9 -152 -106 -71 -260 110
3521 110 27 2 24 86 -15 -38 -154 244 -7 127 33 -5 60 159 -21 -10 298 3 -143 97 -35 133 137 -38
3545 -38 375 -323 135 375 -114 105 66 49 -19 86 128 96 -131 -91 -30 -25 -17 -80 174 -165 -91 -173 140 -137 -135 60
3571 60 -76 21 103 -210 -138 99 39 86 24 -77 243 115 24 126 265 287 -214 -83 -44 97 226 -85 -181 -68
3595 -68 -15 -32 -40 -92 -103 92 39 179 -206 50 -47 -186 -167 -63 -312 -44 -146 -39 278 43 12 -96 -281 295
3619 295 331 163 -6 -99 145 105 -107 -182 215 237 74 122 -185 -115 87 -21 -179 0 25 -103 -123 -3 172
3642 172 -219 325 10 194 71 16 -38 197 114 102 -149 -77 154 133 46 -80 29 26 -1 -80 -29 -213 128 -139
3666 -139 -150 19 21 240 44 -182 143 58 -90 235 27 121 -120 66 -93 62 287 91 -76 29 163 -90
3688 -90 -86 17 -91 -52 -149 -199 78 64 -58 -179 -19 253 -70 176 60 -14 20 -111 -125 -172 14 50 -123 -141
3712 -141 -124 -15 -39 -27 145 213 87 234 191 -69 -140 154 -21 -172 -224 0 -117 -37 -10 73 104 118 51 -243
3736 -243 -29 -62 -75 68 50 224 -47 318 88 -12 -207 -105 -26 -155 -128 44 -65 134 -51 64 51 339
3758 339 100 -226 129 -184 117 19 17 177 -179 -136 133 -189 159 80 -95 64 -117 -147 -125 -117 -102 209 -131
3781 -131 -152 144 -74 39 -22 44 119 -33 -432 193 -145 -49 -43 -193 9 -68 94 137 200 143 53 99 102 23 -89
3806 -89 -29 154 74 219 -27 -17 -236 137 117 146 30 32 -55 -69 38 35 72 28 -180 -27 5 117 202 -65 -36 -206
3832 -206 87 35 -305 -196 234 -72 294 34 169 201 -98 -91 17 -154 -74 -130 138 81 64 -91 -152 90 133
3855 133 7 42 -45 -69 -168 107 26 74 -34 -3 79 -277 -31 204 66 -290 -222 -235 -84 -11 -44 22 22 80 16 36
3881 36 3 111 -37 -230 -84 76 103 44 106 172 -49 -60 -179 -36 -127 162 -254 -161 65 10 -51 163 73 102
3905 102 36 41 -178 -53 82 21 218 141 312 -297 59 -105 -88 -175 -22 146 -44 -42 -2 145 337 -105 197
3928 197 -25 -27 -91 175 46 167 -30 24 6 9 -2 127 206 100 113 -18 -116 134 -234 -43 -85 -216 77 -25
3952 -25 283 -83 -48 -35 9 32 -121 -182 0 326 -182 -112 -4 -83 212 173 65 121 142 238 293 106 -12 -14 73
3977 73 196 10 79 -11 -142 49 87 75 -59 8 -204 232 215 -19 -52 -353 -11 37 5 -76 -19 71 105 16 -54
4002 -54 106 5 -20 -96 2 13 -219 114 -105 -22 -91 -76 91 -33 -57 -165 68 -355 126 -71 -74 230 -137 -217
4026 -217 123 -155 139 154 61 -41 -153 89 -144 -145 -48 84 128 85 -42 325 -44 -150 -28 120 13 -104
4048 -104 64 -13 21 -94 96 90 67 144 -65 268 23 214 -156 -57 -177 -14 139 -129 50 -16 331 -45 -40
4071 -40 -63 60 38 144 222 -48 -53 55 128 -69 79 102 -179 18 -254 -147 280 179 85 69 14 166 125 264
4095 264 -32 63 289 -146 -39 165 62 -37 -180 -166 -33 -45 -8 -129 -67 -41 9 -176 47 -21 19 186 122 36
4119 36 73 -40 150 158 367 59 -24 192 -163 81 226 -44 103 -69 -24 -85 -173 -165 -29 200 33 -11 -12 -8 -86
4144 -86 -149 -21 -158 95 68 58 62 -74 119 -138 -51 -103 171 26 -110 -252 -154 263 164 -37 131 -182 233
4167 233 -127 124 -154 -111 79 -11 -220 -174 -15 -149 -193 -102 -202 69 61 -186 183 24 -97 -29 230 -126 27
4190 27 -3 119 50 145 -15 -111 43 -367 78 11 -108 112 345 87 -69 170 14 -304 -82 277 -267 -36
4212 -36 -306 -144 -52 -89 -109 -81 -56 -51 -35 -114 87 -278 44 129 -167 138 -123 -54 2 -8 117 -225 -156 -410 7
4237 7 30 124 -164 -145 -32 12 5 61 114 217 -178 -66 -148 98 -183 124 -21 -77 255 -169 -53 -48 -160 72 42
4262 42 5 -239 114 4 87 153 155 104 281 -5 133 -36 -35 -238 -89 26 30 120 -213 73 -24 -150 -24 30 -78
4287 -78 -60 -127 -356 133 77 -77 -36 2 81 128 183 -71 -51 13 64 48 90 -91 -22 232 83 -71 70 4 -220
4312 -220 -199 -15 -131 -157 121 -188 95 88 7 -186 -107 -54 -146 -9 106 149 15 97 -53 72 173 -162 23
4335 23 -140 -23 71 -29 252 188 116 143 -75 109 -133 76 -19 -281 -42 30 125 70 159 -206 67 -279 -47
4358 -47 357 -69 -82 -202 67 -193 -135 -128 -25 -118 -169 -75 -144 85 121 108 114 -94 179 -159 -120 -59 -39 -221 103
4383 103 82 -14 -344 187 128 -1 260 -29 78 -56 112 103 -9 -47 -87 -203 6 -43 281 -18 88 23 -205
4406 -205 -18 -84 145 89 -293 84 79 318 112 -362 286 17 244 -9 -19 -132 -13 -150 57 -45 20 -32
4428 -32 -302 32 -120 153 -63 -6 -29 -48 23 -49 122 221 -3 0 -195 132 -122 -10 -111 -109 85 20 36 118 -147
4453 -147 278 -229 167 -35 -53 293 79 -57 -118 -107 306 49 -49 156 139 36 66 20 78 161 -56 134 73
4476 73 43 -38 -200 -299 182 -192 103 100 143 94 -63 161 -100 210 -1 8 -71 -241 -134 4 133 137 12 -149
4500 -149 59 -160 4 243 129 100 75 -93 129 -248 -24 -95 123 -136 99 32 161 67 154 -99 -186 23
4522 23 -48 174 -71 54 9 -88 -40 -58 60 240 143 208 210 -87 -27 -54 79 -100 69 -8 143 51 -27 -150 34
4547 34 -60 98 32 -133 -13 -194 3 -136 -10 -222 -96 -62 -9 -45 106 -102 -28 -35 207 -166 145 -169 -181
4570 -181 -265 -171 -23 -23 -108 34 -146 -218 -188 -127 -89 -119 40 177 250 57 77 -213 -81 299 -288 15 -113 216
4594 216 -12 10 178 -31 -177 -1 47 -54 -151 -44 -166 -234 54 35 224 205 -28 121 -128 -216 -29 -237
4616 -237 -29 -6 -13 73 102 -13 -341 0 67 -33 -90 -28 -38 -40 -67 -125 -183 -97 142 92 70 -36 28 142 27 243
4642 243 155 78 -30 20 95 -4 140 10 140 21 -91 107 -4 29 -119 59 -78 -177 -92 -151 -247 208 17
4665 17 -65 -28 98 -200 88 -17 264 -18 43 -20 -13 142 -200 101 -189 114 -23 70 -121 52 220 260 -109
4688 -109 -283 -349 208 187 111 26 -79 -5 -56 -54 -31 90 -199 37 -98 -53 72 8 161 -286 120 72 19 115 -58
4713 -58 -85 89 243 42 13 136 -187 115 -111 79 -145 101 94 -121 166 -97 10 -136 102 122 100 164 -24
4736 -24 131 -42 -30 150 -52 -35 -215 -17 1 15 2 -45 -150 -165 44 -6 92 -240 148 184 -128 55 -141 -81
4760 -81 265 39 132 97 69 -260 359 29 31 18 38 114 62 78 57 99 61 -32 -251 68 -327 -296 -68 -136 54 120
4786 120 -160 71 44 63 9 -180 -169 26 53 -47 -8 122 -48 113 24 -63 -11 -66 -37 82 -238 76 5 -205
4810 -205 6 9 37 -103 10 -53 -233 53 -173 76 -64 -182 -10 205 210 65 40 155 -208 -119 109 -21 -86
4833 -86 -144 25 2 -85 -50 25 -137 78 -84 26 128 90 117 -275 39 -143 184 177 -58 51 -42 352 -158 141
4857 141 -78 -38 185 -162 -29 39 -144 -1 -115 36 -96 229 69 -83 -119 -4 -135 26 -250 45 -55
4878 -55 49 192 -192 -97 -80 -46 219 5 8 -4 -187 154 141 33 -113 208 153 142 -203 -240 38 49 108 63 -107
4903 -107 57 13 -137 -136 138 -6 15 58 74 70 96 -132 59 -20 189 59 104 139 36 54 -213 72 151 -20 -15
4928 -15 118 2 -8 147 24 146 436 -101 -19 -73 172 75 -134 -144 -69 -273 -123 9 346 28 132 37 45
4951 45 139 -81 41 105 -52 -175 -20 87 20 -69 -56 -60 1 -83 222 171 -119 123 75 135 76 -107 15 72 -26
4976 -26 -53 -141 103 45 95 -184 247 -94 184 -111 52 -212 -10 181 -153 -215 -19 -126 -235 69 118 -99
4998 -99 -62 202 95 -89 -99 147 -15 68 -216 108 25 -2 -160 73 20 -178 55 -196 -42 98 148 1 -28
5021 -28 278 -13 45 -61 -57 173 166 266 -87 -92 -16 -13 -64 -121 18 93 206 21 36 -267 -90 -87 80 155 -6 193
5047 193 -14 -120 163 -112 208 114 239 144 181 29 -56 -240 -151 3 60 -26 182 128 86 71 -60 170 255 105
5071 105 -310 -127 -143 -194 72 -76 37 142 -123 13 -23 193 158 65 119 -24 -62 -342 69 -75 -68 -232 78
5094 78 198 -188 73 15 219 -38 63 77 4 -364 -144 -179 -69 -23 -141 -106 -211 -54 -21 -22 -59 75 -306 -16
5118 -16 22 -59 19 -165 205 41 51 -96 -35 78 39 144 6 -96 -3 -206 331 31 -122 -41 16 -115 -147 -5
5142 -5 89 353 -136 304 -245 -165 -3 -25 96 -285 -158 -114 201 132 96 49 -134 -38 239 20 128 6 0 78
5166 78 -103 -9 -29 -139 122 -34 42 9 14 137 86 -22 -81 48 -238 -3 13 -89 -41 -46 34 -106 -25 -131 -11
5191 -11 -87 -302 18 -294 -151 -65 85 -66 23 31 199 7 -109 251 -210 -26 -105 95 356 -39 117 351
5213 351 -213 -85 -72 -225 68 -28 5 92 -60 -77 -119 68 -102 36 31 87 290 -48 -47 -92 -9 -66 88 -150 17
5238 17 -149 96 22 33 119 26 132 181 89 -97 -95 148 123 271 -21 235 60 82 -87 257 192 -6 -350 4
5262 4 -18 56 -305 -221 114 6 -148 50 162 25 62 -162 1 110 -102 64 122 -6 -160 -63 106 66 37
5285 37 -35 -196 -83 20 302 119 -50 113 308 -179 151 121 2 -14 -61 -147 -47 159 8 61 27 -66 0
5308 0 143 -168 -56 153 -80 103 -293 -153 23 -194 -36 -310 196 244 248 84 -177 240 -85 72 134 25
5330 25 -199 -41 -138 82 3 83 17 -86 -67 -12 -111 85 20 114 -217 146 199 268 -26 -174 103 73 15 -62 356
5355 356 79 55 141 -53 32 -249 52 38 109 112 -58 -163 -49 53 -14 7 162 58 205 -204 -105 104 -36
5378 -36 -153 187 -50 -33 -112 139 49 274 -80 -55 161 211 -68 -67 -32 27 17 -62 84 -136 42 48 -125 -88 -102
5403 -102 -188 -107 89 31 36 -9 -215 58 -74 -24 -29 50 -180 -121 -110 -66 -64 -5 -23 -197 -276 155 111 -120 -129 267 7
5430 7 -95 50 127 -117 -183 212 -169 188 -139 105 -331 130 -39 -152 153 -256 41 206 118 -58 126 -105
5452 -105 -269 -164 -208 -21 -42 84 -353 -152 -25 -264 -171 42 -5 -167 20 36 131 50 15 -15 96 -87 -227
5475 -227 -101 0 -89 128 155 -211 219 139 18 -106 -40 13 -110 53 -153 134 31 106 -135 -182 -147 76 -29
5498 -29 -87 -278 174 -45 89 -162 1 -72 -105 -271 -80 -232 -64 193 102 -124 -192 108 8 187 118 -394
5520 -394 56 -75 157 -37 -66 25 -90 149 -93 157 -70 16 -54 -29 125 -104 -128 -248 -103 24 -53 116
5542 116 -36 -45 -71 -5 -103 73 -54 -7 -69 -108 135 -228 75 22 20 192 87 -81 108 188 -11 80 200 252 -5
5567 -5 -236 -83 -152 -298 -30 41 -62 229 -241 29 72 156 -274 24 -45 5 -211 -390 -60 167 -34 -405 -49
5590 -49 63 29 240 -100 12 16 53 23 -72 -67 127 197 100 98 -63 289 -78 -34 30 95 17 -37 -70 -48 -69 -35 -143
5617 -143 -185 -236 -48 200 -191 -352 -15 -56 -83 23 -21 -202 84 -140 -1 94 -200 -45 -103 -92 -65 81 -91
5640 -91 -160 120 38 -64 -74 -192 -79 310 269 -116 -246 28 -134 -80 -76 53 -118 -109 241 -88 122 119 -365 24
5664 24 -100 -78 -27 221 -21 -34 -208 -113 138 -144 133 121 106 -7 5 -107 -72 53 82 -111 -210 210 -4 85
5688 85 77 101 -22 -13 -16 -215 -11 -172 -234 -143 60 -55 83 241 -91 160 -148 244 134 -184 -8 -27 -200 262
5712 262 -229 88 -140 18 25 23 32 -139 -17 167 182 185 39 154 252 -62 67 100 102 -226 124 -47 -34 -106 -118
5737 -118 16 -48 67 5 175 -45 -222 -25 247 -87 -49 -31 205 7 -80 99 -261 7 123 -235 9 -17
5759 -17 -170 -224 30 0 129 63 85 28 -71 -141 31 207 240 151 65 -41 106 -42 -30 -3 -174 -205 128 -150 61
5784 61 23 -45 -300 -47 84 -115 23 -5 -20 -127 24 78 63 63 8 -247 58 -131 69 209 -6 81 66 42
5808 42 9 138 -104 67 -242 18 127 15 -55 258 120 -126 25 81 140 -25 256 108 24 57 62 -131 27
5831 27 -10 -181 72 122 99 -155 -207 34 185 -97 79 22 126 -74 223 135 80 -8 -4 155 -29 -28 -152 122
5855 122 274 28 -205 2 -185 -131 -59 -57 -27 111 352 -22 -195 -308 -32 131 -447 267 -84 14 -86 -44
5877 -44 38 200 0 26 14 96 48 -21 -242 31 -114 -212 -148 -242 50 -204 -58 -34 164 -47 -26 -9 60 -21 -302
5902 -302 83 34 -81 134 -129 52 29 27 -323 -114 -176 -58 -23 245 108 122 236 -35 -164 -89 33 -83 -43
5925 -43 -119 -45 233 148 59 -145 -166 -99 -11 -209 233 76 -54 -159 -83 309 -54 183 -17 -30 -6 226 172 -276
5949 -276 -84 -190 -118 0 -59 -108 209 -28 -332 -20 -164 -30 -49 -124 85 29 247 150 19 57 -134 -188 96
5972 96 -11 -312 -19 -258 -48 -19 -257 176 56 -105 -95 -73 144 -24 90 236 90 310 100 -169 -96 40
5994 40 -168 52 65 -201 -6 190 16 -120 39 -105 53 -9 227 92 -189 150 -18 54 -11 30 -37 103
6016 103 101 41 173 27 286 -21 75 -95 43 135 -50 81 198 125 -196 56 157 57 23 -4 100 -173 8
6039 8 -100 -16 78 -94 -23 189 -222 82 119 -114 -43 104 81 -7 214 -111 -70 -155 205 225 -195 -230 -180 -55 -68
6064 -68 -45 -63 14 -167 -116 -102 120 36 -26 -32 -129 6 -10 -17 -279 -360 -24 265 377 -73 70 -142 -65 56 -70
6089 -70 45 69 60 51 22 -33 145 190 275 14 80 -171 51 -19 34 65 -175 -170 203 -101 -146 173 -34 118 -185 149
6115 149 -123 91 184 -54 166 198 0 260 62 62 -12 -146 135 -14 -328 56 -106 305 -76 88 -42 -13
6137 -13 131 -46 30 1 336 -81 -210 -110 108 168 106 29 30 -42 48 98 34 -146 90 82 -132 37 161 101 -115
6162 -115 148 -183 -41 -129 30 153 138 -218 -68 -207 -75 164 41 128 -212 124 -79 -88 -20 -93 5 68 -280
6185 -280 -243 -114 -47 -155 -188 129 -51 167 -291 -150 -177 0 121 168 45 189 157 -94 -48 -89 -246 -132 -67
6208 -67 36 -63 -6 -42 446 150 -63 -10 68 52 -20 122 112 88 -160 299 133 -92 -214 118 13 85 36 -20
6232 -20 -9 6 -80 148 -109 -319 9 -83 -154 -195 87 193 -36 -7 -108 -69 -196 -10 -107 -207 -4 68 105 -23
6256 -23 18 80 82 -61 30 -63 -141 207 409 -264 -52 13 105 -10 -130 65 -96 82 -27 -123 30 112 -76 291
6280 291 64 -58 -124 -170 143 7 -81 154 -158 133 -176 -179 1 -156 -62 210 6 53 -83 166 -201 98
6302 98 169 69 -59 237 189 15 147 -131 70 107 -105 127 -103 -149 -41 -66 11 37 65 43 -97 -117 -77 166
6326 166 -43 91 108 -123 -43 -13 -67 229 -101 -125 -89 198 -167 -82 307 71 -47 -74 -164 -95 50 -198 -69
6349 -69 -86 -163 181 254 8 63 -30 78 1 110 -18 -115 -68 -65 -241 192 170 -41 -86 5 25 163 -56 -47 -45 63
6375 63 75 2 -156 -13 -38 24 223 24 44 -215 -61 50 -114 135 -204 -72 -153 59 -94 -5 -134 -75 156
6398 156 -190 351 0 -61 144 -36 13 -5 199 -239 102 -124 -8 6 -125 -118 83 -51 -76 -1 67 -47 -45 20
6422 20 19 138 -12 48 -59 -72 27 142 -107 -4 28 269 -38 -62 74 -8 -96 10 -15 -148 -133 -164 -208 -55 111
6447 111 47 21 -127 126 131 -103 345 -266 -86 61 -21 14 -91 2 38 -109 -59 -182 246 -162 -3 -56 15 10
6471 10 113 144 -87 7 -108 -193 187 7 -90 -24 -122 -63 -155 -74 -152 -31 -274 10 -172 -89 20 165 -82 -158
6495 -158 36 -47 5 9 34 -89 -30 87 161 85 132 -176 -130 108 -59 5 -3 44 -13 -21 182 45 -140 163 77 -46
6521 -46 -95 -37 149 75 -264 119 -8 15 35 -245 -162 87 -128 124 97 66 28 -129 307 112 127 172 112 134 -92
6546 -92 81 -83 18 310 -258 -58 81 43 41 89 -55 -254 -218 98 312 132 20 87 94 164 -124 118 13
6569 13 62 0 -19 -55 -13 -77 -1 -312 187 13 -162 86 -19 46 -112 6 -57 -222 -73 53 -186 66 16 98
6593 98 94 116 68 -169 -86 246 32 56 -17 -234 7 42 86 -16 -129 33 -182 63 -190 -39 -231 -188 -52 -107
6617 -107 36 225 -155 245 -62 -121 39 -151 60 191 -164 -155 32 -180 -51 129 -322 -108 -26 2 -201 156
6639 156 143 -83 69 117 -166 99 55 47 7 203 135 -88 -310 -118 -99 -84 206 -19 59 -241 -201 37 -189 -83
6663 -83 -278 -39 -138 -109 46 -69 -11 39 -54 -126 -83 -127 91 -76 -20 -38 -91 -152 -185 -85 324 -248 226 -21 -51
6688 -51 -36 -119 38 -140 -91 -115 37 51 -278 62 35 -172 -70 -37 30 -106 -212 -28 127 22 349 60 -72
6711 -72 138 157 -68 163 105 75 139 -138 -29 150 -188 -156 -197 65 -220 -68 66 117 -19 -89 211 -203 -18
6734 -18 -121 175 24 -141 -92 -18 16 61 85 -130 -84 7 68 168 -13 59 -171 -6 -99 66 -107 -34 -117 -225
6758 -225 -89 -133 43 -40 127 20 -66 45 -10 -80 42 30 119 115 18 183 255 -204 -101 228 -11 102 36 15
6782 15 79 260 60 -149 174 -2 -136 -183 253 -3 -98 -235 73 -49 -37 42 -139 49 -34 -44 130 294 98
6805 98 -217 -65 12 -74 61 -229 77 19 -57 -193 140 104 -229 13 -73 40 -8 106 39 -38 -37 -199 -116 91
6829 91 -6 -96 -341 6 401 -40 345 11 -3 53 -183 -8 -197 173 166 -128 143 -98 52 -43 55 45 121 -49
6853 -49 124 11 -85 -44 -15 -83 139 -100 180 -33 102 20 -44 116 16 44 192 13 47 0 -208 -331 -89
6876 -89 -107 -18 84 14 141 -59 -50 -192 -104 52 -69 -13 -229 216 94 53 -9 -155 37 153 5 -26 -7 66
6900 66 -59 66 16 114 50 -45 34 -8 -14 199 -138 -128 33 -62 4 -75 73 -94 57 -96 -81 -186 69 158 -70
6925 -70 -158 209 203 58 76 189 -88 -33 -44 -65 -179 -75 43 -329 15 -133 139 70 139 85 -61 -120 -180 145
6949 145 -89 139 38 376 70 -340 -93 -28 -30 81 -15 -98 -37 203 121 -45 12 1 41 -83 45 35 -16 131
6973 131 129 -124 246 -108 109 183 -225 172 -158 27 134 -92 -96 -8 56 59 -77 286 130 -119 -106 -129 -189 -236
6997 -236 -1 -203 112 174 -168 258 -176 27 -32 -149 -6 241 -95 136 -67 127 -78 -69 -41 -200 -193 -200 216
7020 216 127 -69 -31 -129 144 1 21 35 73 -196 -117 67 150 -242 91 50 -166 -6 94 97 41 43 52 291 343 -118
7046 -118 150 -117 -93 223 -111 75 153 -229 -91 -44 224 204 61 7 -118 -108 51 -85 -122 -110 -112 -1 -9 -69
7070 -69 -96 -68 42 142 -113 -168 224 194 175 194 -78 267 9 13 -34 99 5 48 -202 -125 -314 -55 75 37 -74
7095 -74 149 -97 -127 -147 18 -12 -16 -59 118 -66 -47 88 -164 12 53 -116 -172 -155 20 -17 -219 -61 -55 5 154
7120 154 -114 -2 -33 9 -266 69 -154 74 -23 161 -26 169 -38 -91 139 81 214 32 108 -278 30 -77
7142 -77 -105 251 68 42 -19 107 39 -40 -4 -138 176 115 256 299 70 -104 -268 116 40 81 30 88 -71 -185
7166 -185 -63 -160 -103 25 153 -112 -10 -13 65 -42 244 59 -26 -157 51 -111 -124 -30 109 90 -316 -116 29
7189 29 -18 -153 94 -128 -23 -2 -8 -31 -86 -144 78 35 48 189 16 234 -213 -142 86 -146 43 18 35 -33 -47
7214 -47 -173 232 -176 -105 -44 93 175 -233 281 -7 -139 88 -121 -74 -75 -118 -29 -71 -113 122 209 62 191 -42
7238 -42 -216 -160 -95 51 218 185 85 -31 -20 -25 -306 42 56 92 -149 36 6 -173 -227 371 -30 -74 30 48
7262 48 48 30 -69 67 -83 -5 -212 -84 -36 -134 -220 27 129 -72 82 -92 283 207 85 314 72 262 151
7285 151 41 124 -72 11 -22 86 -52 217 -12 -208 -37 -82 -353 22 171 190 164 14 243 -112 299 -247
7307 -247 -63 28 -55 192 166 187 -138 63 70 -230 -182 110 12 -232 -127 -38 238 88 121 -83 -32 74 -32 -57
7331 -57 -18 134 -60 74 52 -43 30 10 23 63 -47 -7 -78 -43 -204 -169 150 75 94 258 72 -64 -191 -61 141
7356 141 -8 301 -77 249 21 110 -3 12 -154 54 128 52 83 -186 70 -151 -199 85 48 28 11 -15 -33 -99
7380 -99 56 12 -117 95 378 -150 96 260 -122 173 -180 -99 159 9 -174 -84 -39 -76 120 169 12 53 172
7403 172 -104 0 -42 -109 -27 -47 -5 95 159 65 66 -85 82 -78 256 109 -67 210 -212 -65 129 -162 81
7426 81 -92 52 -271 56 -175 320 363 -32 158 -206 -20 -31 -162 -8 -184 42 -32 -9 55 68 85 -159 334
7449 334 150 -118 -41 90 136 42 30 -21 -51 75 254 86 251 126 -167 -118 30 -55 107 98 63 -106 -216 204
7473 204 -167 -306 6 78 -68 64 20 -158 -268 219 -218 172 -55 132 -17 138 -23 -218 47 -210 19
7494 19 -201 -134 83 -77 -248 9 22 -8 162 -34 -9 -101 -199 -10 -114 0 178 6 19 -134 -375 -123 -131
7517 -131 -90 -97 -38 150 201 -24 16 33 -62 77 26 -61 -122 -185 -1 88 57 -55 -158 -72 -90 -116 174 133 -44 65
7543 65 43 270 244 -46 108 95 -177 -76 -266 -4 4 207 66 -43 -134 6 -110 87 199 38 1 -14 16
7566 16 -108 -71 150 -164 30 -246 7 131 -81 184 -175 218 43 -200 -28 231 112 175 -51 77 -266
7587 -266 79 -35 224 287 133 -110 -31 -29 -73 -30 80 -232 27 171 -183 -5 51 176 -16 269 164 81 -35
7610 -35 -57 -61 -33 90 -26 332 -134 -43 -56 71 -106 -86 65 149 -1 -152 29 -62 103 216 -59 -18 -32 -80
7634 -80 141 -226 -102 -162 -3 157 -144 -63 -80 -55 -400 -20 61 349 129 94 -9 81 61 136 -90 -284 -3
7657 -3 -74 -130 77 99 45 88 -57 156 -193 -5 -285 102 -143 21 -103 -1 71 -51 -35 -49 -65 78 -25 -113
7681 -113 57 -78 70 43 57 282 -168 29 8 208 -5 -163 -4 -43 -249 -10 27 -186 -41 137 -124 153
7703 153 -137 -30 -33 -11 26 -375 -179 -129 -44 -214 -287 -17 -112 -232 -15 -85 -31 -223 -128 18 -70 -177 122 -117
7727 -117 -20 36 -25 174 -70 -189 49 221 -2 19 15 -269 -16 -10 160 98 42 51 -25 103 -28 118 146 54 69
7752 69 99 9 -20 -248 -28 14 -91 -124 -231 86 -354 -26 186 -85 -19 49 60 -133 -189 -171 236 -54 -130 72
7776 72 -112 -85 0 -137 -47 -3 -95 -220 211 -93 129 164 8 75 -160 59 -169 -242 114 -100 -200 41 187
7799 187 90 111 5 -83 -53 -158 -158 -14 -90 134 -168 -10 28 54 -36 57 -67 129 -122 -176 29 -114 -99 128
7823 128 -87 335 -334 -231 48 305 17 86 -21 -238 80 -30 -36 247 110 -115 -17 -208 24 129 298
7844 298 158 99 -222 61 -33 99 210 16 12 -55 -21 -249 -38 75 149 -71 -147 -28 -34 -72 -44 -70 122 -31
7868 -31 48 191 -94 -13 45 -236 -256 -250 -217 -102 48 -63 -137 -11 -164 27 -118 152 -83 -93 -76 -80 -217 80
7892 80 93 231 150 -27 -86 -132 66 -64 -17 1 38 -37 41 -268 -180 -21 -41 -233 175 54 -27 -55 43 -7 57 -305
7918 -305 -73 112 49 31 -78 8 -124 109 167 -102 69 336 -171 221 186 -4 178 232 7 36 260 271 -89
7941 -89 49 -20 -77 -171 57 -62 24 44 -77 182 52 -124 -175 63 209 -37 -34 -89 -166 86 -36 28 -50 -58 -74
7966 -74 -25 -60 284 -114 162 -336 -64 -10 -45 39 19 -41 -30 82 17 -41 -150 -41 220 -67 -105 -21 -100 131 205
7991 205 -105 228 -7 -37 7 -98 39 -25 56 -107 -159 -20 -4 102 109 -262 -14 -104 10 -221 -106 6 -3 -144
8015 -144 18 -102 -175 -50 -2 257 154 -175 35 72 -160 21 208 125 26 0 57 91 -23 -75 -22 -121 61 117
8039 117 165 -30 -20 -46 -55 -80 96 121 -117 -210 45 -23 -185 230 -56 -67 159 -164 -81 -6 36 -97 100 56 -155
8064 -155 -62 -12 -9 -370 -81 53 296 -211 347 -65 -131 242 106 -115 -129 -104 -129 204 44 -128 -43 17 25 110
8088 110 156 -131 86 140 43 -313 73 253 -253 -40 -258 -36 9 37 -7 -226 56 130 -175 -216 68 -177 157
8111 157 -181 -50 -69 -40 -130 -71 -94 -24 -35 203 42 -17 -83 -141 -92 -134 -218 71 -71 -212 -69 115 255 37
8135 37 -94 -76 -76 40 167 93 -87 -45 -232 57 91 85 66 -78 148 -12 57 -63 -66 59 -19 99 -30 25 30 27
8161 27 -93 -20 39 88 -116 57 -164 64 -136 30 -97 -44 -28 -144 173 236 -77 -125 -10 170 -133 92 74
8184 74 -5 75 -13 93 -74 314 -60
8191f0
##END NTUPLES=NMR FID
##END=
