##TITLE=1H_LR-780-B2-M1
 CDCl3
 8 sc, 
 9.1.2024
##JCAMPDX= 6.0         $$ Bruker NMR JCAMP-DX V2.0
##DATA TYPE= NMR FID
##DATA CLASS= NTUPLES
##ORIGIN= UXNMR, Bruker Analytische Messtechnik GmbH
##OWNER= root
$$ XWIN-NMR		Version 3.5
$$ Tue Jan  9 14:31:10 2024 Russian Standard Time (UT+4h)  she@DPX200
##.OBSERVE FREQUENCY= 200.1313
##.OBSERVE NUCLEUS= ^1H
##.DELAY= (6, 6)
##.ACQUISITION MODE= SIMULTANEOUS
##.ACQUISITION SCHEME= undefined
##.AVERAGES= 8
##.DIGITISER RES= 18
##SPECTROMETER/DATA SYSTEM= spect
##.PULSE SEQUENCE= zg30
##.SOLVENT NAME= CDCl3
##.SHIFT REFERENCE= (INTERNAL, CDCl3, 0, 15.7039)
##AUDIT TRAIL= $$ (NUMBER, WHEN, WHO, WHERE, WHAT)
$$ ##TITLE= Audit trail, XWIN-NMR		Version 3.5
$$ ##JCAMPDX= 5.01
$$ ##ORIGIN= Bruker BioSpin GmbH
$$ ##OWNER= she
$$ F:/spectra/data/she/nmr/H-F/1/audita.txt
$$ ##AUDIT TRAIL=  $$ (NUMBER, WHEN, WHO, WHERE, WHAT)
(   1,<2024-01-09 14:29:52.95 +0400>,<she>,<DPX200>,
      <created by zg, POWCHK disabled, PULCHK disabled
       configuration hash MD5:
       00 E9 B6 7A A2 85 ED C7 34 08 36 98 17 FE 4E 26
       data hash MD5: 16K
       88 7D 78 59 35 D1 EC BF 81 E8 4A 64 71 2B CF FE>)
$$ ##END=
$$ 
$$ hash MD5
$$ EA D8 2D 7A 68 91 11 92 71 EB 5C B1 ED B8 A0 FA
##$RELAX= 
##$RELAX= 
##$RELAX= 
##$RELAX= 
##$RELAX= 
##$RELAX= 
$$ Bruker specific parameters
$$ --------------------------
##$DU= <F:/spectra>
##$EXPNO= 1
##$NAME= <H-F>
##$PROCNO= 1
##$TYPE= <nmr>
##$USER= <she>
##$AMP= (0..31)
100 100 100 100 100 100 100 100 100 100 100 100 100 100 100 100 100 100 
100 100 100 100 100 100 100 100 100 100 100 100 100 100 
##$AQSEQ= 0
##$AQ_mod= 1
##$AUNM= <au_zg>
##$AUTOPOS= <>
##$BF1= 200.13
##$BF2= 200.13
##$BF3= 200.13
##$BF4= 200.13
##$BF5= 200.13
##$BF6= 200.13
##$BF7= 200.13
##$BF8= 200.13
##$BYTORDA= 1
##$CFDGTYP= 0
##$CFRGTYP= 5
##$CHEMSTR= <none>
##$CNST= (0..31)
1 1 145 1 1 1 1 1 1 1 1 1 1 1 1 1 1 1 1 1 1 1 1 1 1 1 1 1 1 1 1 1 
##$CPDPRG= <>
##$CPDPRG1= <>
##$CPDPRG2= <>
##$CPDPRG3= <>
##$CPDPRG4= <mlev>
##$CPDPRG5= <mlev>
##$CPDPRG6= <mlev>
##$CPDPRG7= <mlev>
##$CPDPRG8= <mlev>
##$CPDPRGB= <>
##$CPDPRGT= <>
##$D= (0..31)
0 1.2 0 0 0 0 0 0 0 0.06 0 0.03 0 0 0 0 0.0002 0 0 0 0 0 0 0 0 0 0 0 0 
0 0 0 
##$DATE= 1704796192
##$DBL= (0..7)
120 120 120 120 120 120 120 120 
##$DBP= (0..7)
150 150 150 150 150 150 150 150 
##$DBP07= 0
##$DBPNAM0= <>
##$DBPNAM1= <>
##$DBPNAM2= <>
##$DBPNAM3= <>
##$DBPNAM4= <>
##$DBPNAM5= <>
##$DBPNAM6= <>
##$DBPNAM7= <>
##$DBPOAL= (0..7)
0.5 0.5 0.5 0.5 0.5 0.5 0.5 0.5 
##$DBPOFFS= (0..7)
0 0 0 0 0 0 0 0 
##$DE= 6
##$DECBNUC= <off>
##$DECIM= 32
##$DECNUC= <off>
##$DECSTAT= 4
##$DIGMOD= 1
##$DIGTYP= 9
##$DL= (0..7)
0 120 120 120 120 120 120 120 
##$DP= (0..7)
150 150 150 150 150 150 150 150 
##$DP07= 0
##$DPNAME0= <>
##$DPNAME1= <>
##$DPNAME2= <>
##$DPNAME3= <>
##$DPNAME4= <>
##$DPNAME5= <>
##$DPNAME6= <>
##$DPNAME7= <>
##$DPOAL= (0..7)
0.5 0.5 0.5 0.5 0.5 0.5 0.5 0.5 
##$DPOFFS= (0..7)
0 0 0 0 0 0 0 0 
##$DQDMODE= 0
##$DR= 18
##$DS= 0
##$DSLIST= <SSSSSSSSSSSSSSS>
$$ [...]
##$SUBNAM2= <"">
##$SUBNAM3= <"">
##$SUBNAM4= <"">
##$SUBNAM5= <"">
##$SUBNAM6= <"">
##$SUBNAM7= <"">
##$SUBNAM8= <"">
##$SUBNAM9= <"">
##$SW= 18.0517328524113
##$SWIBOX= (0..15)
0 0 2 0 0 0 0 0 0 0 0 0 0 0 0 0 
##$SW_h= 3612.71676300578
##$TD= 16384
##$TD0= 1
##$TE= 0
##$TE2= 300
##$TE3= 300
##$TEG= 300
##$TL= (0..7)
0 120 120 120 120 120 120 120 
##$TP= (0..7)
150 150 150 150 150 150 150 150 
##$TP07= 0
##$TPNAME0= <>
##$TPNAME1= <>
##$TPNAME2= <>
##$TPNAME3= <>
##$TPNAME4= <>
##$TPNAME5= <>
##$TPNAME6= <>
##$TPNAME7= <>
##$TPOAL= (0..7)
0.5 0.5 0.5 0.5 0.5 0.5 0.5 0.5 
##$TPOFFS= (0..7)
0 0 0 0 0 0 0 0 
##$TUNHIN= 0
##$TUNHOUT= 0
##$TUNXOUT= 0
##$USERA1= <user>
##$USERA2= <user>
##$USERA3= <user>
##$USERA4= <user>
##$USERA5= <user>
##$V9= 5
##$VALIST= <valist>
##$VCLIST= <CCCCCCCCCCCCCCC>
##$VD= 0
##$VDLIST= <DDDDDDDDDDDDDDD>
##$VPLIST= <PPPPPPPPPPPPPPP>
##$VTLIST= <TTTTTTTTTTTTTTT>
##$WBST= 1024
##$WBSW= 4
##$XGAIN= (0..3)
0 0 0 0 
##$XL= 0
##$YL= 0
##$YMAX_a= 155610
##$YMIN_a= -232168
##$ZGOPTNS= <>
##$ZL1= 120
##$ZL2= 120
##$ZL3= 120
##$ZL4= 120
##$ABSF1= 10
##$ABSF2= 0
##$ABSG= 5
##$ABSL= 3
##$ALPHA= 0
##$AQORDER= 0
##$ASSFAC= 0
##$ASSFACI= 0
##$ASSFACX= 0
##$ASSWID= 0
##$AUNMP= <proc_1d>
##$AZFE= 0.1
##$AZFW= 0.1
##$BCFW= 1
##$BC_mod= 2
##$BYTORDP= 1
##$COROFFS= 0
##$CY= 11.3945322036743
##$DATMOD= 1
##$DC= 2
##$DFILT= <>
##$DTYPP= 0
##$F1P= 15.7292609196834
##$F2P= 12.9074282941183
##$FCOR= 0.5
##$FTSIZE= 0
##$FT_mod= 4
##$GAMMA= 1
##$GB= 0.15
##$INTBC= 1
##$INTSCL= 1
##$ISEN= 128
##$LB= 0.24
##$LEV0= 0
##$LPBIN= 0
##$MAXI= 10000
##$MC2= 0
##$MEAN= 0
##$ME_mod= 0
##$MI= 1.114404
##$NCOEF= 0
##$NC_proc= 0
##$NLEV= 6
##$NOISF1= 3.799351
##$NOISF2= 2.8
##$NSP= 1
##$NTH_PI= 0
##$NZP= 0
##$OFFSET= 15.70392
##$PC= 1
##$PHC0= -24586.54
##$PHC1= 6.85273
##$PH_mod= 1
##$PKNL= yes
##$PPARMOD= 0
##$PSCAL= 0
##$PSIGN= 0
##$REVERSE= no
##$SF= 200.130013532006
##$SI= 16384
##$SIGF1= 3
##$SIGF2= 2
##$SINO= 400
##$SIOLD= 16384
##$SREGLST= <1H.CDCl3>
##$SSB= 0
##$STSI= 0
##$STSR= 0
##$SW_p= 3612.71676300578
##$SYMM= 0
##$S_DEV= 0
##$TDeff= 0
##$TDoff= 0
##$TI= <>
##$TILT= no
##$TM1= 0
##$TM2= 0
##$TOPLEV= 0
##$USERP1= <user>
##$USERP2= <user>
##$USERP3= <user>
##$USERP4= <user>
##$USERP5= <user>
##$WDW= 1
##$XDIM= 8192
##$YMAX_p= 0
##$YMIN_p= 0
$$ End of Bruker specific parameters
$$ ---------------------------------
##NTUPLES= NMR FID
##VAR_NAME=  TIME,          FID/REAL,        FID/IMAG
##SYMBOL=    X,             R,               I
##VAR_TYPE=  INDEPENDENT,   DEPENDENT,       DEPENDENT
##VAR_FORM=  AFFN,          ASDF,            ASDF
##VAR_DIM=   8192,          8192,            8192
##UNITS=     SECONDS,       ARBITRARY UNITS, ARBITRARY UNITS
##FACTOR=    0.0002768,     1,               1
##FIRST=     0,             0,               0
##LAST=      2.2672688,     0,               0
##MIN=       0,             -232168,         0
##MAX=       2.2672688,     155610,          0
$$ Real data points
##PAGE= N=1
##DATA TABLE= (X++(R..R)), XYDATA
$$ plain form
0 0 0 0 0 0 0 0 0 0 0 0 0 0 0 0 0 0 4 -8 8 -8 8 -8 9 -12 16 -16 20 -24 25 -30 33 -38 44 -49 54 -60 68 -77 85
39 85 -94 106 -115 128 -142 158 -172 189 -208 230 -252 278 -306 339 -374 416 -461 515 -577 650
59 650 -742 855 -996 1182 -1441 1815 -2403 3431 -5577 11759 -62204 -232168 41598 145454
73 145454 -44785 9149 147553 3584 -51999 114003 77928 -97292 -40678 58669 -23661
84 -23661 -74480 -24405 -54783 -99574 -24482 48796 10739 -29338 10727 51172 30293 28558
96 28558 61722 21799 -36663 29461 81885 -22233 -74114 19622 25885 -43641 -3093 6975
108 6975 -97463 -67626 53701 -4806 -78268 25080 58887 -21427 29655 89680 -12627
119 -12627 -34645 80731 60790 -39767 -9673 15292 -55265 -45876 19950 -15320 -59545 -12351
$$ packed form
0@%%%%%%%%%%%%%%%%Mj2J6j6J6j6J7k1K8l2L6m4M9n5O3p1Q2r3J03j14J28j45J62
39H5j79K00k21K43k70L00l30L61l97M38m82N30n84O45p13P90q77R76j092J227
59F50j392J597j851K178k623L256m218N834r008J7336p3963j69964K73766J03856
73A45454j90239N3934J38404j43969n5583J66002l6075j75220N6614R9347q2330
84b3661n0819N0075l0378m4791P5092P3278l8057m0077M0065M0445k0879j735
96B8558L3164l9923n8462O6124N2424j04118n1881R3736O263o9526M0548J0068
108F975j04438K9837J21327n8507p3462J03348L3807q0314N1082O0025j02307
119a2627k2018J15376j9941j00557L0094K4965p0557R389O5826l5270m4225M7194
$$ plain form
131 -12351 20354 -3375 -13312 -5253 1621 15013 25341 29443 21642 -4914 3100 43680 26007
144 26007 -22213 -6267 10437 -30170 -28671 6063 -30506 -55860 7449 22480 -30680 -12871
156 -12871 28450 1891 3581 50948 28388 -14517 11973 27735 -4617 -6961 6417 -11517
168 -11517 -14623 3010 -9283 -27675 -19654 -12353 -5849 4879 -3016 -7853 10274 13038 6663 21779
182 21779 18701 -1640 14240 26354 -5452 -14946 6365 -9295 -25693 885 -1925 -34693 -14377
195 -14377 14556 -9356 -12621 18658 7431 -10119 18401 23729 -5458 2560 23494 6731 -5153
208 -5153 7433 -585 -16739 -6899 -122 -11966 -15227 -8330 -6182 -5362 -4008 -556 6805 6586 5537
223 5537 15605 13779 -1271 5042 15296 -880 -8157 6319 -2019 -17942 -3505 3144 -17315
$$ packed form
131a2351L2705k3729r937Q059O874J3392J0328M102p801k6556Q014M0580j7673
144B6007m8220J5946J6704m0607J499L4734l6569k5354O3309J5031n3160J7809
156a2871M1321k6559J690M7367k2560m2905K6490J5762l2352k344J3378j7934
168a1517l106J7633j2293j8392Q021P301O504J0728p895m837J8127K764o375J5116
182B1779l078k0341J5880J2114l1806r494K1311j5660j6398K6578k810l2768K0316
195a4377K8933k3912l265L1279j1227j7550K8520N328k9187Q018K0934j6763j1884
208e153J2586q018j6154R840O777j1844l261O897K148Q20J354L452P361k19j049
223E537J0068j826j5050O313J0254j6176p277J4476q338j5923J4437O649k0459
$$ plain form
236 -17315 -13174 7187 -4454 -12675 7397 7292 -7132 6708 17771 1982 1486 13967 5244
249 5244 -3177 5345 2332 -9413 -5625 -1870 -9826 -9814 -3664 -5853 -4946 1144 1141 1131 4868 4318 5058
266 5058 8159 4822 2390 6011 2637 -2691 872 55 -7506 -5168 -604 -7591 -9028 -34 -2132
281 -2132 -6744 2049 5477 -1463 3125 9978 3636 1980 8132 3861 -1308 1712 1060 -5082 -4173 -2219
297 -2219 -6019 -5907 -2160 -4114 -3698 885 537 -284 4230 4003 2158 5346 5334 1593 2511 3260 -694
314 -694 -1503 -262 -3277 -4898 -2840 -3437 -5449 -2568 -867 -2690 -332 2931 1453 2019 5404 3684
330 3684 2315 4721 3089 147 817 262 -2659 -3412 -2422 -3906 -4624 -2532 -2136 -2537 -323 1325 653
347 653 2554 3629 2901 3416 3799 2006 1881 1976 135 -1100 -681 -1829 -3841 -2662 -2837 -3921 -3235 -984
$$ packed form
236a7315M141K0361j1641q221K0072j05j4424J3840J1063j5789m96J2481q723
249E244q421Q522l013j1745L788L755p956J2O150k189R07O090lj0L737n50P40
266E058L101l337k432L621l374n328L563q17p561K338M564o987j437Q994k098
281b132m612Q793L428o940M588O853o342j656O152m271n169L020o52o142R09J954
297b219l800J12L747j954M16M583l48q21M514k27j845L188j2l741R18P49l954
314f94q09J241l015j621K058n97k012K881J701j823K358L263j478N66L385j720
330C684j369K406j632k942O70n55k921p53R90j484p18K092L96m01K214J648o72
347F53J901J075p28N15L83j793j25R5j841j235M19j148k012J179j75j084O86K251
$$ plain form
365 -984 -1278 -688 1509 2413 2327 3835 4237 2968 2922 2817 1134 58 -885 -1623 -2797 -3200 -3027 -3201 -3355
384 -3355 -2441 -1092 -911 -59 1130 1776 1928 2753 3839 2778 2091 3005 2118 -6 79 -638 -2722 -2960
402 -2960 -2292 -3336 -4182 -2974 -1353 -1564 -1225 1771 2289 1878 3345 4350 2205 1542 3156 2261 -85
419 -85 -77 -34 -2588 -3790 -1767 -2180 -4910 -2364 -49 -2580 -1846 1503 989 149 3637 4883 1868 1996
437 1996 3922 2080 -154 1483 675 -3156 -2657 -989 -3759 -4857 -1823 -1595 -2389 -566 1241 345
453 345 249 2989 3956 2183 2805 3813 1975 324 948 389 -1858 -1841 -856 -2193 -4403 -3107 -1696 -2955
471 -2955 -1888 1426 345 -432 2562 3475 1586 2349 4554 2354 887 1904 359 -2728 -1648 -734
487 -734 -2672 -2970 -1774 -3082 -3316 -963 -424 -325 1396 1908 1799 2111 2568 2086 1852 2884 1915 375
$$ packed form
365i84k94N90K197R04q6J508M02j269m6j05j683j076r43p38j174m03J73j74j54
384c355R14J349J81Q52J189O46J52Q25J086j061o87R14q87k124Q5p17k084k38
402b960O68j044q46J208J621k11L39K996N18m11J467J005k145o63J614q95k346
419h5QM3k554j202K023m13k730K546K315k531P34L349n14q40L488J246l015J28
437A996J926j842k234J637q08l831M99J668k770j098L034K28p94J823J807q96
453C45r6K740R67j773O22J008j838j651O24n59k247J7R85j337k210J296J411j259
471b955J067L314j081p77K994R13j889P63K205k200j467J017j545l087J080R14
487g34j938k98J196j308k34K353N39R9J721N12j09L12M57m82k34J032r69j540
$$ plain form
505 375 78 -1272 -2790 -1831 -1960 -3058 -2293 -1364 -2291 -1598 -356 126 883 2410 3232 2492 1885 2221 1778
524 1778 578 1316 750 -675 -1709 -1226 -2104 -2929 -2735 -1174 -1294 -1754 -244 544 -1277 594 3658
541 3658 2477 1135 3250 2988 -440 802 2486 -542 -2481 765 -52 -4484 -3063 -268 -3055 -2564
557 -2564 1626 371 -2311 1003 3170 417 457 4067 2656 -185 1904 2436 -1817 -1698 1249 -553
573 -553 -3135 -1263 -745 -3347 -2883 1187 53 -1877 899 2790 -327 187 3437 1819 -75 2704
589 2704 2962 -1085 -1778 1224 -533 -3305 -185 623 -3354 -2529 1166 -1355 -3009 1289 2435 -384
605 -384 630 3371 594 -800 2440 2923 -763 -237 1657 -1083 -2574 202 -281 -2986 -1025 676
621 676 -1130 -2132 425 997 -745 615 2736 555 -436 1836 1438 -439 505 1490 -150 -1385 -138
$$ packed form
505C75k97j350j518R59j29j098P65R29r27O93J242M82P57J527Q22p40o07L36m43
524A778j200P38n66j425j034M83q78q25J94J561j20m60J510P88j821J871L064
541C658j181j342K115k62l428J242J684l028j939L246q17m432J421K795k787M91
557b564M190j255k682L314K167k753M0L610j411k841K089N32m253J19K947j802
573e53k582J872N18k602M64M070j134j930K776J891l117N14L250j618j894K779
589B704K58m047o93L002j757k772L120Q08l977Q25L695k521j654M298J146k819
605c84J014K741k777j394L240M83l686N26J894k740j491K776m83k705J961J701
621F76j806j002K557N72j742J360K121k181r91K272l98j877R44R85j640j235J247
$$ plain form
638 -138 -542 -2287 -1126 115 -1013 -1340 568 -331 -880 755 1406 381 936 1718 617 40 358 673
656 673 -475 -475 386 -680 -1528 -491 -587 -1029 -215 295 148 -13 211 814 349 554 986 639 327 460
676 460 130 -422 -80 286 -168 -115 -574 -794 -566 -357 -45 10 98 297 -91 361 558 7 293 710 316
697 316 -308 517 -147 -480 -331 229 -301 -652 182 -1 -724 -95 642 -334 -182 881 23 -184 274 424
717 424 86 -78 531 63 -365 31 162 -380 -17 401 -71 -156 277 384 -325 -236 287 -69 -372 -83 258
738 258 -425 -604 292 113 -651 193 189 -309 -42 674 216 -74 314 758 -256 -362 522 -216 -607 440
758 440 -15 -636 -240 -32 -271 -537 -4 37 -182 72 505 360 200 706 453 -87 130 1 142 -274 -292
779 -292 0 -480 -713 -212 -480 -581 -315 -18 98 166 450 358 425 603 628 278 147 742 -31 -317 253 -305
$$ packed form
638a38m04j745J161J241j128l27J908q99n49J635O51j025N55P82j101n77L18L15
656F73j148%Q61j066q48J037r6m42Q14N10j47j61K24O03m65K05M32l47l12J33
676D60l30n52L42L66m54N3m59k20K28K09L12N5Q8J99l88M52J97n51K86M17l94
697C16o24Q25o64l33J49N60n30l51Q34j83p23O29P37r76J52J063q58k07M58J50
717D24l38j64O09m68m28L96J31n42L63M18m72q5M33J07p09Q9N23l56l03K89L41
738B58o83j79Q96j79p64Q44mm98K67P16m58k90L88M44j014j06Q84p38l91J047
758D40m55o21L96K08k39k66N33M1k19K54M33j45j60N06k53n40K17j29J41m16j8
779b92K92m80k33N01k68j01K66K97J16O8K84r2O7J78K5l50j31N95p73k86N70n58
$$ plain form
801 -305 -949 -447 -505 -970 -467 -151 -454 -178 243 292 305 427 734 701 312 754 477 -15 422 -269 -334 -424
823 -424 -810 -737 -531 -831 -649 -171 -522 20 162 338 442 445 816 747 657 649 571 180 -234 134 -531 -568 -494 -806
847 -806 -632 -602 -740 -388 -449 -81 169 315 498 673 604 761 934 313 693 226 -289 -230 -107 -881 -604 -436
869 -436 -993 -399 -715 -390 -340 -1 44 308 624 712 903 633 758 394 139 336 85 -493 -552 -582 -968 -572
891 -572 -898 -698 -513 -690 -140 1 2 569 806 693 861 675 980 530 303 335 -249 -388 -94 -494 -1002
912 -1002 -660 -662 -873 -788 -158 -18 -99 340 775 602 669 940 716 428 653 504 -53 -119 -324 -775 -691 -558
934 -558 -660 -980 -699 -298 -55 -223 179 481 105 737 911 736 468 483 398 293 25 -33 -330 -910 -471
955 -471 -576 -842 -678 -404 -708 -196 -134 212 199 674 762 584 427 966 550 369 469 375 -438 -490 -305 -650
$$ packed form
801c05o44N02n8m65N03L16l03K76M21M9J3J22L07l3l89M42k77m92M37o91o5r0
823d24l86P3K06l00J82M78l51N42J42J76J04LL71o9r0qp8l91m14L68o65l7P4l12
847h06J74L0j38L52o1L68K50J46J83J75o9J57J73o21L80m67n15N9J23p74K77J68
869d36n57N94l16L25N0L39M5K64L16Q8J91k70J25l64k55J97k51n78n9l0l86L96
891e72l26K00J85j77N50J41JN67K37j13J68j86L05m50k27L2n84j39K94m00n08
912a002L42kk11Q5O30J40q1M39M35j73O7K71k24k88K25j49n57o6k05m51Q4J33
934e58j02l20K81M01K43j68M02L02l76O32J74j75k68J5q5j05k68n8k97n80M39
955d71j05k66J64K74l04N12O2L46j3M75Q8j78j57N39m16j81J00r4q13n2J85l45
$$ plain form
977 -650 -743 -666 -563 -665 -760 -32 5 -279 197 502 474 456 848 492 541 807 574 -271 -101 -184 -319 -886 -415
1000 -415 -802 -993 -199 -247 -601 111 316 173 160 626 559 564 669 754 541 82 163 23 -185 -252 -318 -631 -756
1023 -756 -423 -544 -477 -295 -217 4 195 482 251 393 945 634 351 464 342 27 -84 14 -227 -265 -707
1044 -707 -499 -400 -482 -152 -43 -169 83 287 -125 286 739 392 254 427 677 226 -73 405 -81 -318 -278
1065 -278 -356 -603 -465 -360 -845 -528 206 -363 34 443 395 90 403 578 407 96 335 132 -154 32 32
1086 32 -107 -95 -166 -311 -427 -254 -250 -77 -129 19 128 21 314 282 218 338 591 480 171 -3 269 -18 -80
1109 -80 116 -257 -402 -15 84 -247 -219 97 -102 193 124 445 251 171 456 299 182 421 371 -233 185 298
1131 298 -455 -149 -475 -368 -423 -276 -145 -341 -553 -83 257 193 435 314 345 346 354 336 216 -232 112 31 -354
$$ packed form
977f50r3P7J03j02r5P28L7k84M76L05k8j8L92l56M9K66k33q45J70q3j35n67M71
1000d15l87j91P94m8l54P12K05j43j3M66o7NJ05Q5k13m59Q1j40k08o7o6l13j25
1023g56L33j21O7J82P8K21J91K87k31J42N52l11k83J13j22l15j11R8k41l8m42
1044g07K08R9q2L30J09j26K52K04m12M11M53l47j38J73K50m51k99M78m86k37M0
1065b78p8k47J38J05m85L17P34n69L97M09m8l05L13J75j71l11K39k03k86J86%
1086C2j39J2p1j45j16J73MJ73n2J48J09j07K93l2o4J20K53j11l09j74K72k87o2
1109h0J96l73j45L87R9l31K8L16j99K95o9L21j94q0K85j57j17K39n0o04M18J13
1131B98p53L06l26J07n5J47J31j96k12M70L40o4K42j21L1JQj8j20m48L44q1l85
$$ plain form
1154 -354 -132 -192 -509 -471 -259 -512 -150 -54 -297 180 18 93 172 208 279 354 -192 247 191 85 338 167 -178
1177 -178 -420 -190 -284 -496 -490 -277 -157 -48 36 252 -54 200 121 74 364 349 210 208 81 206 171 -176 -315
1200 -315 -494 -406 -142 -401 -106 -219 -110 -270 -198 -207 230 178 210 124 290 193 538 45 128 -73 46 -243 -331
1223 -331 -444 -547 -545 -174 -312 -173 -59 -7 101 -112 204 288 286 362 475 209 14 181 -47 -99 -31 -273 -298
1246 -298 -496 -465 -483 -225 -189 -246 -77 -215 97 98 253 411 395 290 205 120 178 -93 -116 -149 -54 -410 -333 -425 -602
1271 -602 -171 -189 -293 -202 -35 307 318 314 517 463 459 323 270 235 211 -57 -156 -304 -267 -465 -472 -140 -178 -306 -123
1296 -123 -230 -121 121 173 21 189 493 134 302 516 6 96 173 -148 -280 -154 -473 -604 -327 -488 -248
1317 -248 -490 -33 -27 124 105 -36 441 447 553 330 318 139 176 196 -150 -324 -136 -407 -538 -315 -729 -397 -231
$$ packed form
1154c54K22o0l17L8K12k53L62R6k43M77j62P5P9L6P1P5n46M39n6j06K53j71l45
1177a78k42K30r4k12OK13J20J09Q4K16l06K54p9m7K90j5j39kj27J25l5l47j39
1200c15j79Q8K64k59K95j13J09j60P2rM37n2L2q6J66r7L45m93Q3k01J19k89q8
1223c31j13j03KL71j38J39J14N2J08k13L16Q4kP6J13k66j95J67k28n2O8k42k5
1246b98j98L1j8K58L6n7J69j38L12JJ55J58j6j05q5q5N8k71k3l3R5l56P7r2j77
1271f02M31j8j04R1J67L42J1mK03n4mj36n3l5k4k68r9j48L7j98pL32l8j28J83
1296a23j07J09K42N2j52J68L04l59J68K14n10R0P7l21j32J26l19j31K77j61K40
1317b48k42M57OJ51j9j41M77OJ06k23j2j79L7K0l46j74J88k71j31K23m14L32J66
$$ plain form
1340 -231 101 -193 18 28 374 557 146 361 195 537 342 -15 161 -309 2 -191 -248 -105 -210 -326 -469
1361 -469 -138 -199 -260 148 357 307 383 153 324 358 345 129 278 97 -16 -127 -400 -443 -298 -450 -173 -303
1383 -303 -113 -93 -62 32 249 268 305 303 231 348 -35 171 70 10 -131 64 -373 -216 -173 -240 -421 -227 -404 -143
1407 -143 -195 84 244 56 401 277 637 368 233 280 233 25 -177 -30 -200 -122 -297 -456 -198 -170 -158 -297
1429 -297 -271 143 45 405 339 347 329 258 377 338 143 215 151 -241 -110 -201 -395 -114 -416 -420 -200 -323 46 -67
1453 -67 -129 262 283 223 156 167 69 402 159 157 347 11 -198 -75 -130 89 41 -326 26 53 -268 -257 176 61
1477 61 99 285 260 147 -29 454 243 180 112 -203 -172 46 -125 -361 -276 -414 -335 -397 -44 27 -221 -66 445
1500 445 -107 367 203 369 380 269 277 100 -116 -264 174 -191 -396 -199 -56 -375 -409 -309 -444 -52 102
$$ packed form
1340b31L32k94K11J0L46J83m11K15j66L42j95l57J76m70L11j93n7J43j05j16j43
1361d69L31o1o1M08K09n0P6k30J71L4j3k16J49j81j13j11k73m3J45j52K77j30
1383c03J90K0L1R4K17J9L7kp2J17l83K06j01o0j41J95m37J57M3o7j81J94j77K61
1407a43n2K79J60j88L45j24L60k69j35M7m7k08k02J47j70P8j75j59K58K8J2j39
1429b97K6M14r8L60o6Qj8p1J19l9j95P2o4l92J31r1j94K81l02mK20j23L69j13
1453f7o2L91K1o0o7J1r8L33k43kJ90l36k09J23n5K19m8l67L52K7l21J1M33j15
1477F1L8J86k5j13j76M83k11o3o8l15L1K18j71k36Q5j38P9o2L53P1k48J55N11
1500D45n52M74j64J66J1j11Qj77k16j48M38l65k05J97J43l19l4J00j35L92J54
$$ plain form
1521 102 -82 168 240 385 227 293 -58 38 145 254 150 59 -31 212 -298 -100 -269 -236 -214 -364 69 -103
1543 -103 0 128 98 -73 220 -96 -14 218 233 -25 -115 58 -383 -196 -308 -328 -187 -205 -89 -228 -234 16 -84
1566 -84 -45 212 124 183 72 287 276 258 45 11 58 -119 -235 -322 -212 -316 -465 -229 -121 -165 25 -32 -95 -31
1590 -31 248 80 228 250 108 159 101 -143 -9 157 87 -97 -140 -254 -273 -222 -175 -140 -82 331 23 84 191 220
1614 220 84 262 519 116 180 -4 95 132 -352 -201 -394 -365 -305 -302 -206 -37 -208 82 -32 170 233 176 303
1637 303 309 312 169 5 59 42 82 -84 -207 -69 -260 -81 -269 -321 -299 -1 -5 -94 119 119 10 122 122 176 339 7
1663 7 278 148 154 130 -87 -128 -84 -518 -337 -218 -123 7 -208 -50 166 111 171 287 159 365 417 -93 125 213
1687 213 -83 -167 -176 -102 -162 -1 -299 -137 -145 -10 -162 -149 -45 197 207 258 286 327 147 175 32 -38 233 -14 -260
$$ packed form
1521A02j84K50P2J45j58O6l51R6J07J09j04r1r0K43n10J98j69L3K2j50M33j72
1543a03J03J28l0j71K93l16Q2K32J5k58r0J73m41J87j12k0J41j8J16j39oK50j00
1566h4L9K57q8N9j11K15j1j8k13l4M7j77j16q7J10j04j49K36J08m4J90n7o3O4
1590c1K79j68J48K2j42N1n8k44J34J66p0j84m3j14j9N1M7L5N8M13l08O1J07K9
1614B20j36J78K57m03O4j84R9L7m84J51j93K9O0LR6J69j71K90j14K02O3n7J27
1637C03OLj43j64N4j7M0j66j23J38j91J79j88n2K2K98mq9K13%j09J12%N4J63l32
1663GK71j30Ok4k17m1M4m34J81J19R5J30k15J58K16n5O0J16j28K06N2n10K18Q8
1687B13k96q4rP4o0J61k98J62qJ35j52J3J04K42J0N1K8M1j80K8j43p0K71k47k46
$$ plain form
1712 -260 104 -278 -326 -331 -313 -56 -486 -160 24 322 209 90 -42 54 177 176 93 301 466 214 -51 42 -150
1735 -150 -274 19 -403 -190 -476 -185 -243 -273 107 -59 257 136 186 324 84 62 259 64 278 23 -366
1756 -366 -186 -243 -116 -172 -392 -179 -41 -290 -46 16 -52 47 128 342 25 37 -5 234 86 57 81 183 4
1779 4 -102 -343 -190 -303 -136 -238 -272 -103 40 243 98 269 143 112 360 107 54 118 186 93 -97 -337 -72
1802 -72 -55 -223 -181 -259 -123 -268 152 93 28 -176 259 116 149 428 201 233 87 146 119 35 -69 -222 -180 -94
1826 -94 -79 0 47 276 -291 -31 -96 79 -10 83 47 409 309 171 579 134 -153 -84 84 131 -84 -86 -89 -297 -157
1851 -157 -297 1 -135 -107 143 221 205 386 187 11 210 80 47 -153 78 -134 -129 -205 -189 -321 -385 -327 -254 -161
1875 -161 125 -89 64 48 4 338 -28 11 141 227 235 325 178 218 -36 13 -150 -144 -125 -125 -125 24 -163 60 56 172
$$ packed form
1712b60L64l82m8nJ8K57m30L26J84K98j13j19j32R6J23jq3K08J65k52k65R3j92
1735a50j24K93m22K13k86K91n8l0L80j66L16j21N0J38k40k2J97j95K14k55l89
1756c66J80n7J27n6k20K13J38k49K44O2o8R9Q1K14l17J2m2K39j48k9K4J02j79
1779Dj06k41J53j13J67j02l4J69J43K03j45J71j26l1K48k53n3O4O8r3j90k40K65
1802g2J7j68M2p8J36j45M20n9o5k04M35j43L3K79k27L2j46N9k7q4j04j53M2Q6
1826i4J5P9M7K29n67K60o5J75q9R3l6L62j00j38M08m45k87O9J68M7k15klk08J40
1851a57j40K98j36K8K50P8j6J81j99j76J99j30l3k00K31k12Np6J6j32o4N8P3R3
1875a61K86k14J53j6m4L34l66L9J30Q6QR0j47M0k54M9j63OJ9%%J49j87K23mJ16
$$ plain form
1901 172 193 4 127 443 273 172 78 99 -22 -189 16 -239 -230 -91 -255 -168 -140 -235 -173 -202 52 86 -19 460
1925 460 150 46 -9 37 -4 187 304 79 -147 120 -231 -43 -84 -235 -251 -146 -279 -98 107 372 -213 -106
1947 -106 159 275 245 189 27 -14 256 90 23 161 -83 -145 -129 -252 -233 -267 -306 -267 69 -76 -78 -30 109 41 277
1972 277 159 331 -13 -30 -197 88 -191 -39 -59 45 -219 48 -340 -241 -151 -152 -11 69 -12 159 30 71 395
1995 395 297 51 127 20 225 -146 76 94 -239 -34 -51 28 -191 89 -233 39 -276 -63 311 78 98 337
2017 337 129 68 475 -31 48 -88 -30 118 -323 -185 -304 -72 -80 -348 -45 -69 -92 -40 -114 189 119 -75 151
2040 151 183 60 -11 -141 -239 30 -303 46 -428 -72 -136 -305 -179 -199 -214 100 40 60 45 150 85 109 147 226
2064 226 127 226 55 -257 -19 11 -14 -109 -227 112 -264 -144 -268 -54 76 27 30 161 287 -59 284 -134 100
$$ packed form
1901A72K1j89J23L16j70j01r4K1j21j67K05k55RJ39j64Q7K8r5O2k9K54L4j05M79
1925D60l10j04n5M6m1J91J17k25k26K67l51J88m1j51j6J05j33J81K05K65n85J07
1947a06K65J16l0n6j62m1K70j66o7J38k44o2J6j23J9l4l9L9L36j45kM8J39o8K36
1972B77j18J72l44j7j67K85k79J52k0J04k64K67l88R9R0jJ41Q0q1J71j29M1L24
1995C95r8k46P6j07K05l71K22J8l33K05j7P9k19K80l22K72l15K13L74k33K0K39
2017C37k08o1M07n06P9j36N8J48m41J38j19K32qk68L03k4k3N2p4L03p0j94K26
2040A51L2j23p1j30r8K69l33L49m74L56o4j69J26k0j5L14o0K0j5J05o5K4L8P9
2064B26r9R9j71l12K38L0k5r5j18L39l76J20j24K14J30m9LJ31J26l46L43m18K34
$$ plain form
2087 100 197 132 70 -13 85 -195 151 -173 -75 90 -281 -75 -61 -163 298 12 125 2 223 448 262 -74
2109 -74 164 8 -21 140 -148 118 -98 -148 -7 -343 16 -3 -47 86 29 -114 120 337 283 -171 233 139 48
2132 48 295 -26 158 173 -214 -356 -111 -230 142 -63 -229 -78 -104 -44 220 183 138 111 68 54 27 164 22
2155 22 76 -199 41 -69 6 67 -258 -123 -239 -207 -380 12 148 112 254 177 133 89 -51 405 213 -62 179
2178 179 156 146 -243 -268 91 -127 -358 96 -76 -287 -133 57 -212 193 130 -7 27 47 103 240 55 -69
2200 -69 1 -116 13 -114 -311 -364 -64 -91 -135 -161 -187 78 138 -92 -118 136 17 194 212 274 39 -101 174 -214
2224 -214 -9 -158 -121 -16 -12 -271 -40 -21 -81 21 163 28 300 -121 71 223 73 140 65 140 124 -286 261
2247 261 165 55 -119 -280 -619 116 -217 237 91 -137 212 4 63 -142 56 373 196 294 18 -166 33
$$ packed form
2087A00R7o5o2q3R8k80L46l24R8J65l71K06J4j02M61k86J13j23K21K25j86l36
2109g4K38j56k9J61k88K66k16n0J41l36L59j9m4J33n7j43K34K17n4m54M04r4r1
2132D8K47l21J84J5l87j42K45j19L72k05j66J51k6O0K64l7m5k7m3j4k7J37j42
2155B2N4k75K40j10P5O1l25J35j16L2j73L92J36l6J42p7m4m4j40M56j92k75K41
2178A79k3j0l89k5L59k18k31M54j72k11J54J90k69M05o3j37L4K0N6J37j85j24
2200f9P0j17J29j27j97n3L00k7m4k6k6K65O0k30k6K54j19J77J8O2k35j40K75l88
2224b14K05j49L7J05Mk59K31J9o0J02J42j35K72m21J92J52j50O7p5P5j6m10N47
2247B61r6j10j74j61l39P35l33M54j46k28L49k08N9k05J98L17j77R8k76j84J99
$$ plain form
2268 33 -132 11 64 31 -521 -77 -58 -157 -62 -14 -144 144 -57 247 255 149 138 184 129 94 -62 26 88 -111 154
2293 154 -260 -258 -82 -169 -118 -124 -106 -104 -14 -145 -184 298 217 -92 113 198 339 96 28 -71 -10 64 207 -83 -32 -151
2319 -151 -53 280 -99 39 140 -47 131 -48 56 50 -136 -209 60 24 -55 74 -325 -191 -65 -262 -165 -191 -80
2342 -80 -7 -209 -281 -61 113 255 -119 67 313 115 11 271 288 -130 -241 -148 -82 140 -148 -48 11 -222
2364 -222 -202 69 209 -76 -69 124 110 75 73 231 411 -48 113 107 104 76 -56 11 -268 110 -251 -42 -48 -245 -79
2389 -79 -18 -60 -138 -79 335 107 34 165 222 164 187 -28 296 10 -78 -74 -82 -156 -9 -322 36 -133 23 -254 -283
2414 -283 -68 165 220 46 -7 83 152 -19 -104 -43 -3 -181 -186 -323 -297 -115 34 -161 -61 -4 -195 -212 -208 -16 320
2439 320 425 91 91 216 -65 339 243 -85 120 -40 -31 -71 -100 -45 -122 -159 92 91 -198 63 61 -58 111 -156 -66
$$ packed form
2268C3j65J43N3l3n52M44J9r9R5M8j30K88k01L04Qj06j1M6n5l5j56Q8O2j99K65
2293A54m14KJ76q7N1oJ8KR0j31l9M82q1l09K05Q5J41k43o8r9O1P4J43k90N1j19
2319a51R8L33l79J38J01j87J78j79J04oj86p3K69l6p9J29l99J34J26j97R7k6J11
2342h0P3k02p2K20J74J42l74J86K46j98j04K60J7m18j11R3O6K22k88J00N9k33
2364b22K0K71J40k85PJ93j4l5kJ58J80m59J61olk8j32O7k79L78l61K09oj97J66
2389g9O1m2p8N9M14k28p3J31N7n8K3k15L24k86q8Mqp4J47l13L58j69J56k77k9
2414b83K15K33N5j74n3R0O9j71q5O1M0j78nj37K6J82J49j95J00N7j91j7MJ92L36
2439C20J05l34%J25k81M04r6l28K05j60Rm0k9N5p7l7K51jk89K61kj19J69k67R0
$$ plain form
2464 -66 57 -52 306 78 37 33 -74 60 -72 -222 -93 -210 -208 -60 135 -85 -43 114 137 -97 159 108 -49
2487 -49 210 -30 82 -40 165 15 -307 -158 161 -34 -293 -136 -220 -230 -77 138 64 249 117 -66 -100 -170
2509 -170 33 -3 -105 137 296 -34 87 -104 -202 -34 -206 -36 -60 -131 -75 103 -26 78 191 -91 241 -33
2531 -33 48 107 -42 -142 -204 -118 -169 -140 -115 -205 -349 -286 132 -34 -2 46 -35 182 9 -31 76 16 73 191 55
2556 55 21 -51 -17 -250 -99 -86 -180 -201 -71 -26 -177 -308 -56 148 132 -63 71 76 161 -41 16 106 -418 -235 -62
2581 -62 28 136 -77 -119 -131 -257 -239 -214 -43 -30 -156 18 81 38 22 338 -96 -115 -66 -57 -45 -11 -330 -37 -100 -21
2607 -21 -134 228 -37 -13 180 -168 150 -157 25 105 154 238 -52 16 -21 3 260 135 -96 168 -249 -150 35
2630 35 -312 -103 -197 16 -30 -68 6 124 29 401 209 -96 222 172 190 93 -163 64 236 -430 45 -13 -207
$$ packed form
2464f6J23j09L58k28m1mj07J34j32j50J29j17KJ48J95k20M2J57K3k34K56n1j57
2487d9K59k40J12j22K05j50l22J49L19j95k59J57q4j0J53K15p4J85j32j83l4p0
2509a70K03l6j02K42J59l30J21j91r8J68j72J70k4p1N6J78j29J04J13k82L32k74
2531c3Q1N9j49j00o2Q6n1K9K5r0j44O3M18j66L2M8q1K17j73m0J07o0N7J18j36
2556E5l4p2L4k33J51J3r4k1J30M5j51j31K52K04j6j95J34NQ5k02N7R0n24J83J73
2581f2R0J08k13m2j2j26J8K5J71J3j26J74O3m3j6L16m34j9M9RJ2L4l19K93o3P9
2607b1j13L62k65K4J93l48L18l07J82Q0M9Q4k90O8l7K4K57j25k31K64m17R9J85
2630C5l47K09r4K13m6l8P4J18r5L72j92l05L18n0J8r7k56K27J72o66M75n8j94
$$ plain form
2653 -207 137 -286 -202 118 166 82 136 21 -58 80 -2 -28 -3 -84 331 -29 -103 155 -73 4 41 -102 -4 -242
2677 -242 -305 -117 63 -132 -196 47 -49 342 -102 23 -243 198 161 115 413 60 -62 -164 -56 -48 -140 -192 17
2700 17 -44 53 92 103 123 145 155 10 -184 368 -137 259 79 7 31 -24 -187 -5 -75 -217 61 -151 10 -115
2724 -115 -55 -40 -176 -45 -33 -142 50 -18 326 152 88 51 131 -79 -16 275 80 -247 173 -189 -87 38 -152
2747 -152 -194 182 33 209 171 -43 -53 -39 77 11 -301 169 -70 222 52 -386 -164 88 21 -10 -61 -160 -265
2770 -265 -85 17 15 1 -228 -76 -107 24 59 112 -167 95 -52 -106 -110 97 50 87 -66 -61 -177 35 -102 29
2794 29 193 -78 201 258 245 176 -13 -85 -72 174 85 104 -101 -262 -80 -186 173 -25 -221 -341 -29 -77 -180
2817 -180 263 -161 57 49 -164 70 309 212 -61 -32 -3 -157 -293 -339 181 -241 -104 -63 -15 104 -45 15 195
$$ packed form
2653b07L44m23Q4L20M8q4N4j15p9J38q2k6K5q1M15l60p4K58k28P7L7j43R8k38
2677b42o3J88J80j95o4K43r6L91m44J25k66M41l7m6K98l53j22j02J08Qr2n2K09
2700A7o1R7L9J1K0K2J0j45j94N52n05L96j80p2K4n5j63J82p0j42K78k12J61j25
2724a15O0J5j36J31J2j09J92o8L44j74o4l7Q0k10O3K91j95l27M20l62J02J25j90
2747a52m2L76j49J76l8k14j0J4J16o6l12M70k39K92j70m38K22K52o7l1n1r9j05
2770b65J80J02kj4k29J52l1J31L5N3k79K62j47n4mK07m7L7j53Nj16K12j37J31
2794B9J64k71K79N7j3o9j89p2J3K46q9J9k05j61J82j06L59j98j96j20L12m8j03
2817a80M43m24K18qk13K34K39r7k73K9K9j54j36m6N20m22J37M1M8J19j49O0J80
$$ plain form
2840 195 140 257 145 -73 -74 136 111 54 11 -95 -163 273 128 -16 96 -156 141 -255 50 -188 -111 123 179
2863 179 280 -33 184 198 79 62 -187 -71 41 -191 0 -91 -29 122 109 160 -89 -13 -152 33 4 104 38
2886 38 200 44 99 107 -19 85 -64 125 5 14 -44 -121 151 -48 -115 36 -130 66 -112 321 -26 31 199
2909 199 -6 -12 -170 -24 46 -342 17 -51 168 173 32 -6 -28 -16 -138 -236 -76 -47 -301 -15 7 -97 209 61
2933 61 132 11 54 -41 -192 52 -96 -365 -132 270 8 -97 26 27 -123 -115 -127 109 -89 13 -32 57 148 153 185
2958 185 134 184 -36 280 117 27 152 -176 -102 43 -120 256 -84 69 260 39 226 216 -30 78 264 0
2980 0 -114 -26 107 83 -136 -113 -207 89 -215 -17 -205 -33 -177 173 -145 190 151 99 268 234 -114 225 -82
3003 -82 -19 -126 -32 -208 217 -139 -138 107 -12 -39 32 407 -133 -42 -137 2 4 46 89 108 -2 -225 -191 203 -126
$$ packed form
2840A95n5J17j12k18jK10k5n7m3j06o8M36j45j44J12k52K97l96L05k38P7K34N6
2863A79J01l13K17J4j19j7k49J16J12k32J91r1O2J51j3N1k49P6j39J85k9J00o6
2886C8J62j56N5Qj26J04j49J89j20Rn8p7K72j99o7J51j66J96j78M33l47N7J68
2909A99k05oj58J46P0l88L59o8K19Nj41l8k2J2j22r8J60K9k54K86K2j04L06j48
2933F1P1j21M3r5j51K44j48k69K33M02k62j05J23Jj50Qj2K36j98J02m5Q9R1NL2
2958A85n1N0k20L16j63r0J25l28P4J45j63L76l40J53J91k21J87j0k46J08J86k64
2980@j14Q8J33k4k19K3r4K96l04J98j88J72j44L50l18L35l9n2J69l4l48L39l07
3003h2O3j07R4j76M25l56JK45j19k7P1L75n40R1r5J39KM2M3J9j10k23L4L94l29
$$ plain form
3028 -126 -190 -221 -149 -208 -362 -222 39 29 14 -169 -24 188 205 -241 -92 -107 107 -48 69 -40 101 58 -67
3051 -67 56 71 161 -209 -37 -239 -7 -188 -89 97 -309 252 -106 85 27 -50 45 -105 53 38 177 62 28
3074 28 -13 -119 -76 -2 285 -31 -56 -78 -72 14 19 143 160 185 118 -121 -72 15 226 -63 -12 -80 -70 -106 41 38 -151
3101 -151 58 -105 -152 114 128 97 73 171 -82 168 291 -32 96 31 -189 137 207 41 117 -3 -37 -130 -97 -80
3125 -80 11 191 106 -162 134 150 10 294 73 155 -61 164 -116 -266 167 58 232 21 -132 27 76 6
3147 6 -3 24 153 -10 -68 211 450 -45 192 77 96 10 405 133 15 -64 55 -150 -18 -178 -143 56 -65
3170 -65 -74 -16 -95 14 9 187 -105 -87 53 -62 95 -47 -115 -152 11 -179 80 43 -167 -109 116 -155 252 131
3194 131 67 92 102 317 -66 111 35 -219 -1 -235 -35 143 100 -13 -355 30 -277 -21 -54 -18 -32 35 83
$$ packed form
3028a26o4l1P2n9j54J40K61j0j5j83J45K12J7m46J49j5K14j55J17j09J41m3j25
3051f7J23J5R0l70J72k02K32j81R9J86m06N61l58J91n8p7R5j50J58j5J39j15l4
3074B8m1j06M3P4K87l16k5k2OQ6NJ24J7K5o7k39M9Q7K11k89N1o8J0l6J47lj89
3101a51K09j63m7K66J4l1k4R8k53K50J23l23J28o5k20L26P0j66P6j20l4r3L3J7
3125h0R1J80q5k68K96J6j40K84k21Q2k16K25k80j50M33j09J74k11j53J59M9p0
3147FrK7J29j63n8K79K39m95K37j15J9q6L95k72j18p9J19k05J32j60L5J99j21
3170f5rN8p9J09nJ78k92J8J40j15J57j42o8l7J63j90K59l7k10N8K25k71M07j21
3194A31o4K5J0K15l83J77p6k54K18k34K00J78m3j13l42L85l07K56l3L6j4O7M8
$$ plain form
3217 83 43 -3 290 301 -186 179 220 13 0 -227 273 39 -45 -493 -272 -66 193 197 -134 -40 209 -254 50
3240 50 -195 101 114 58 51 -29 -11 -82 220 47 13 53 17 111 250 18 -135 -100 -73 -37 -4 -50 -58 91 26 52 -155
3267 -155 56 30 7 35 -57 -108 -76 19 80 90 -58 87 121 62 29 125 -100 -156 -167 -18 -24 -66 97 101 -15 241 57
3294 57 18 77 -121 -133 -93 -66 -100 218 93 -41 -9 -126 -148 -113 176 -79 343 10 -137 -204 166 -49 61 -195
3318 -195 88 -253 -26 82 -2 215 -206 20 80 -84 -83 93 96 -124 89 301 64 -153 3 -22 -145 34
3340 34 -49 -227 -175 2 -245 116 -380 -22 -65 144 -109 99 -3 -15 227 45 -1 -42 50 137 -48 -100 -16 -187
3364 -187 -5 -256 204 36 -357 -106 -70 -60 171 -130 84 -29 86 97 173 -96 123 139 287 134 379 -31
3386 -31 -57 65 -93 -16 -143 -38 28 238 -31 -34 -83 246 -166 108 -260 35 151 127 309 134 10 -108 -26
$$ packed form
3217H3m0m6K93J1m87L65M1k07j3k27N00k34q4m48K21K06K59Ml31R4K49m63L04
3240E0k45K96J3n6pq0J8p1L02j73l4M0l6R4J39k32j53L5K7L6L3m6qJ49o5K6k07
3267a55K11k6k3K8r2n1L2R5O1J0j48J45L4n9l3R6k25n6j1J49om2J63Mj16K56j84
3294E7l9N9j98j2M0K7l4L18j25j34L2j17k2L5K89k55M22l33j47o7L70k15J10k56
3318a95K83l41K27J08q4K17m21K26O0j64JJ76Lk20K13K12k37k17J56k5j23J79
3340C4q3j78N2J77k47L61m96L58m3K09k53K08j02j2K42j82m6m1R2Q7j85n2Q4j71
3364a87J82k51M60j68l93K51L6J0K31l01K14j13J15J1P6k69K19J6J48j53K45m10
3386c1k6J22j58P7j27J05O6K10k69lm9L29m12K74l68K95J16k4J82j75j24j18Q2
$$ plain form
3409 -26 -52 -227 -11 -186 153 38 67 157 -8 -110 -33 226 28 55 -33 -24 -153 47 115 9 -103 -114 45 -42
3433 -42 69 163 212 -12 -267 2 -20 -124 -44 32 -208 -166 -53 126 230 173 -93 225 -131 18 18 195 -143
3456 -143 -212 -50 -347 -19 -151 -290 -117 400 -146 64 -157 120 48 241 210 -31 -22 409 153 -164 -30 249
3478 249 58 -95 -95 134 -184 -246 13 312 -7 47 -64 83 -61 18 162 -30 -43 52 33 73 -16 5 -3 12 -49
3503 -49 96 7 103 379 -44 87 -1 10 64 70 -90 -65 55 12 -39 178 108 -242 -28 21 -96 147 -126 -39 110
3528 110 -105 136 -13 -92 -310 193 -51 92 -6 -74 -167 29 215 180 177 -155 121 -133 -171 -178 -79 0 -22 52 -116
3553 -116 -52 304 -22 291 72 59 -65 -53 64 137 -164 -40 4 5 -30 -208 99 -102 9 -62 18 -274 82
3576 82 -85 -15 -11 -56 106 55 28 60 91 35 165 -179 73 146 158 389 72 -13 77 56 59 44 -35 -92 60 -12 -88
$$ packed form
3409b6k6j75K16j75L39j15K9R0j65j02P7K59j98K7q8Rj29K00O8j06j12j1J59q7
3433d2J11R4M9k24k55K69k2j04Q0P6k40M2J13J79J04n7k66L18l56J49%J77l38
3456a43o9J62k97L28j32j39J73N17n46K10k21K77p2J93l1k41RM31k56l17J34K79
3478B49j91j53%K29l18o2K59K99l19N4j11J47j44P9J44j92j3R5j9M0q9K1qJ5o1
3503d9J45q9R6K76m23J31q8J1N4Oj60K5J20m3n1K17p0l50K14M9j17K43k73Q7J49
3528A10k15K41j49p9k18N03k44J43r8o8r3J96J86l5ll32K76k54l8pR9P9k2P4j68
3553a16O4L56l26L13k19j3j24J2J17P3l01J24M4Jl5j78L07k01J11p1Q0k92L56
3576H2j67P0Mm5J62n1k7L2L1n6J30l44K52P3J2K31l17q5R0k1Lj5p9n7J52p2p6
$$ plain form
3603 -88 -102 -56 -5 -214 -95 66 -262 -82 -108 -37 -70 57 -60 -147 9 -18 355 82 -7 -148 31 166 -84
3626 -84 27 44 225 -54 -155 2 -68 -255 -276 -83 188 40 -146 68 97 244 61 4 -51 215 34 112 230
3649 230 -119 166 95 -146 -158 -125 68 86 36 119 63 1 12 -43 36 -59 127 157 109 51 -9 199 -256 33 -15 27
3675 27 163 -83 -104 -31 79 -140 -38 125 -255 35 61 267 -168 86 -58 88 -59 -12 209 144 43 335
3697 335 11 -80 -141 -65 -93 -21 58 -84 -179 -103 15 65 113 -55 192 -159 -69 267 70 -9 282 -17 201 -90
3721 -90 21 98 -136 45 -16 -5 -238 69 204 -58 -67 16 1 -63 102 -18 200 -129 -109 131 118 -231 -228 28
3745 28 12 7 -290 -336 -250 176 -133 -15 -29 -53 2 5 66 179 -102 204 -106 -40 149 203 -105 -41 140 -60 38
3770 38 -91 51 -390 -57 66 4 -118 97 187 -135 6 -101 -176 150 89 -27 -17 -60 -22 36 201 93 -143
$$ packed form
3603h8j4M6N1k09J19J61l28J80k6P1l3J27j17q7J56k7L73k73q9j41J79J35k50
3626h4J11J7J81k79j01J57p0j87k1J93K71j48j86K14K9J47j83n7n5K66j81P8J18
3649B30l49K85p1k41j2L3J93J8n0Q3n6o2J1n5P9r5J86L0m8n8o0K08m55K89m8M2
3675B7J36k46k1P3J10k19J02J63l80K90K6K06m35K54j44J46j47M7K21o5j01K92
3697C35l24r1o1P6k8P2P9j42r5P6J18N0M8j68K47l51R0L36j97p9K91k99K18k91
3721i0J11P7k34J81o1J1k33L07J35k62rQ3j5o4J65j20K18l29K0K40j3l49LK56
3745B8j6nk97m6Q6M26l09J18j4k4N5LO1J13k81L06l10O6J89N4l08O4J81k00R8
3770C8j29J42m41L33J23o2j22K15R0l22J41j07p5L26o1j16J0m3L8N8J65j08k36
$$ plain form
3793 -143 -103 -32 65 -24 155 142 10 186 156 31 -50 147 -131 91 -142 -79 -46 -119 -175 -46 -59 -254 -26 49
3817 49 41 -51 229 53 -115 40 -14 -219 90 26 48 279 -50 33 105 31 -68 23 -61 -2 170 162 178 -110 -2 -26
3843 -26 97 -2 -97 311 -60 -52 -176 -43 210 177 257 -109 130 -102 26 113 -73 -113 -28 -218 -26 28 -123 -23
3867 -23 224 -113 -153 -81 -14 214 -222 -154 -197 -153 -239 -9 -72 33 154 -177 22 -6 -116 -22 -84 75 -6 -17 -125
3892 -125 52 -1 -9 -64 130 45 -19 -115 15 55 -98 -113 -2 123 -158 65 89 -191 93 -101 8 128 104 11
3916 11 -10 -243 -216 -219 -295 -152 30 -25 -41 -236 46 -89 -39 102 -179 -129 -54 125 52 -73 224 -127 -24 -48
3940 -48 -207 69 11 10 163 144 -35 -33 -4 35 34 -165 31 284 220 163 62 -17 2 -12 311 4 100 -183 -59 20
3966 20 -69 -151 -3 56 122 -61 94 -147 -157 -19 207 167 -128 -226 141 165 41 44 -12 6 -5 86 -137 -1 122
$$ packed form
3793a43M0P1R7q9J79j3j32J76l0j25q1J97k78K22k33O3L3p3n6J29j3j95K28P5
3817D9qr2K80j76j68J55n4k05L09o4K2K31l29Q3P2p4r9R1q4N9J72qJ6k88J08k4
3843b6J23r9r5M08l71Qj24J33K53l3Q0l66K39k32J28Q7j86m0Q5j90J92N4j51J00
3867b3K47l37m0P2O7K28m36O8m3M4q6K30o3J05J21l31J99k8j10R4o2J59q1j1j08
3892a25J77n3qn5J94q5o4r6J30M0j53j5J11J25k81K23K4k80K84j94J09J20k4r3
3916A1k1k33K7lp6J43J82n5j6j95K82j35N0J41k81N0P5J79p3j25K97l51J03k4
3940d8j59K76n8jJ53j9j79KK9L9jj99J96K53o4n7j01p9J9j4L23l07R6k83J24P9
3966B0q9q2J48N9O6j83J55k41j0J38K26m0k95r8L67K4j24Ln6J8j1R1k23J36J23
$$ plain form
3991 122 -7 46 -1 4 216 144 57 54 -101 -65 -37 167 104 92 33 -143 -82 326 10 -104 -65 -104 -97 19 32 126 44
4018 44 -124 29 19 182 -160 102 120 53 1 229 89 30 -266 13 -58 71 -24 -114 130 -73 -219 129 20
4041 20 152 -122 -216 -94 -51 67 -138 -117 76 7 -45 220 -6 47 -91 -25 196 -47 -70 -6 67 -159 44 162
4065 162 -172 -61 -216 4 231 49 -102 -216 147 -101 -188 1 -59 136 -88 12 89 41 137 39 110 234
4087 234 126 -101 39 169 64 -45 -47 -49 15 -2 126 129 74 160 146 -71 -20 -39 113 52 99 -111 171 27 15
4112 15 198 193 190 -310 33 98 -29 -204 -12 -83 -38 22 111 -11 147 162 382 -94 90 -48 -190 161 -43 -55
4136 -55 -140 -12 239 87 164 8 73 -104 -226 -31 4 -70 199 -18 -151 -192 163 41 -52 83 -26 54 33
4159 33 41 93 -8 -35 -81 -56 21 121 -7 207 -189 -99 6 -95 255 -167 -115 236 37 -82 216 -32 -156
$$ packed form
3991A22j29N3m7NK12p2q7lj55L6K8K04o3j2n9j76O1M08l16j14L9l9PJ16J3R4q2
4018D4j68J53j0J63l42K62J8o7n2K28j40n9k96K79p1J29r5r0K44k03j46L48j09
4041B0J32k74r4J22M3J18k05K1J93o9n2K65k26N3j38O6K21k43k3O4P3k26K03J18
4065A62l34J11j55K20K27j82j51j14L63k48q7J89o0J95k24J00P7m8R6r8P1J24
4087B34j08k27J40J30j05j09kkO4j7J28Ln5Q6j4k17N1j9J52o1M7k10K82j44j2
4112A5J83nln00L43O5j27j75J92p1M5O0Q9j22J58J5K20m76J84j38j42L51k04j2
4136e5q5J28K51j52P7j56O5j77j22J95L5p4K69k17j33m1L55j22r3J35j09Q0k1
4159C3QN2j01k7m6K5P7J00j28K14l96R0J05j01L50m22N2L51j99j19K98k48j24
$$ plain form
4182 -156 -78 54 51 -331 -46 49 196 -48 3 73 -196 -116 -37 -14 -189 -115 69 79 70 -65 -78 -75 -95 124 59 -160
4208 -160 27 -141 258 58 -69 -18 -167 -84 6 108 110 50 73 79 296 -36 -13 -136 130 217 460 -31 -135 93
4232 93 91 372 -241 -65 -226 209 -3 -19 319 74 -61 23 114 -287 161 83 -131 -197 108 -69 10 -126 59
4255 59 269 103 -109 -62 -69 -90 7 -11 -2 -159 -20 190 -82 -103 -104 -82 191 -145 -196 29 -161 -46 0 -165 171
4280 171 158 -72 237 168 -131 108 77 -169 79 111 -74 283 -36 103 -28 -34 -52 -23 57 -159 -239 -117 -101 27
4304 27 218 -23 -218 -147 -116 255 -223 -32 -66 -45 291 66 272 -62 78 -19 38 134 89 32 221 16 -96
4327 -96 57 -14 35 -270 -74 53 91 166 105 -145 -275 -164 165 11 304 295 4 143 -255 53 -203 -45 154
4350 154 -136 41 -7 173 127 -143 137 9 -114 -141 287 170 -60 -307 56 361 -37 3 -212 -87 -65 129
$$ packed form
4182a56P8J32ll82K85R5J47k44N1P0k69Q0P9K3j75P4J84J0rj35j3Lk0K19o5k19
4208a60J87j68L99k00j27N1j49Q3R0J02Ko0K3OK17l32K3j23K66Q7K43m91j04K28
4232I3kK81o13J76j61M35k12j6L38k45j35Q4R1m01M48p8k14o6L05j77P9j36J85
4255E9K10j66k12M7pk1R7j8Rj57J39K10k72k1jK2K73l36n1K25j90J15M6j65L36
4280A71j3k30L09o9k99K39l1k46K48L2j85L57l19J39j31oj8K9Q0k16q0J22J6J28
4304B7J91k41j95P1L1L71m78J91l4K1L36k25K06l34J40r7N7R6m5n7J89k05j12
4327i6J53p1M9l05J96J27L8P5o1k50j30J11L29j54K93rk91J39l98L08k56J58J99
4350A54k90J77m8J80m6k70K80j28j23k7M28j17k30k47L63L05l98M0k15J25K2J94
$$ plain form
4372 129 -117 -66 -179 42 63 7 -173 28 116 -296 -250 -114 -98 -306 -28 124 23 38 -223 148 115 -140 -43
4395 -43 -102 73 69 -24 -36 104 105 220 -15 115 113 -10 236 249 -117 -52 -17 -73 -75 -167 206 104 -157 39 -198 -19
4421 -19 -67 -98 -81 63 189 98 -139 -77 39 -72 -1 66 -53 -75 -409 -225 202 5 -182 17 -44 229 -122
4444 -122 -216 45 52 -318 -20 135 64 -265 -83 92 -272 86 -173 162 -161 -5 2 -3 50 90 -121 105 -3
4467 -3 -102 171 -30 -95 82 167 -322 172 89 -289 -115 109 -42 192 61 12 -312 -5 138 265 101 54 80
4490 80 -147 -198 -27 -157 -170 77 61 -200 39 -123 59 106 130 -18 213 -157 26 121 -32 -27 -16 83 140 41
4514 41 142 -136 89 42 -19 -104 -101 -31 128 13 -203 -254 4 18 55 -11 240 2 4 -34 -39 115 -18 -260 -113
4539 -113 117 -193 -218 126 -46 21 -12 -226 164 -118 -188 35 149 -104 -32 386 178 -96 14 -130 372 -137
$$ packed form
4372A29k46N1j13K21K1n6j80K01Q8m12M6J36J6k08K78J52j01J5k61L71l3k55R7
4395d3n9J75mr3j2J40JJ15k35J30kj23K46J3l66O5L5n6kr2L73j02k61J96k37J79
4421a9m8l1J7J44J26r1k37O2J16j11P1O7j19k2l34J84M27j97j87J99o1K73l51
4444a22r4K61Pl70K98J55p1l29J82J75l64L58k59L35l23J56PnN3M0k11K26j08
4467cr9K73k01o5J77Q5m89M94q3l78J74K24j51K34j31m9l24L07J43J27j64m7K6
4490H0k27n1J71j30j3K47j6k61K39j62J82M7K4j48K31l70J83R5j53NJ1R9N7r9
4514D1J01k78K25m7o1q5LP0J59j15k16n1K58J4L7o6K51k38Kl8nJ54j33k42J47
4539a13K30l10k5L44j72O7l3k14L90k82p0K23J14k53P2M18k08k74J10j44N02n09
$$ plain form
4561 -137 46 82 -124 -101 121 -88 -13 -27 -310 -13 -22 101 34 73 -16 89 -40 -262 -152 252 95 -99 -19
4584 -19 -4 -68 92 -8 7 -24 122 -65 19 -64 29 108 -86 -78 297 -39 205 63 100 -31 -12 237 -242 85
4608 85 -229 71 151 -107 -19 403 -92 104 70 -162 212 1 42 47 27 -170 23 68 -16 78 237 -135 5 127
4632 127 -15 -2 49 41 -74 129 -29 233 287 74 -1 8 39 150 108 -208 163 -189 -41 47 -70 -177 -79 -12
4656 -12 -64 -83 -286 -117 -138 -56 -131 164 -15 87 -102 67 175 73 199 131 183 155 -142 155 98 -255 150
4679 150 140 36 -6 -105 49 143 237 -8 27 70 6 -108 -48 20 -52 199 36 203 136 -73 99 82 -30 7 -81
4704 -81 193 -203 -59 -93 -75 -47 -299 75 233 119 412 -93 164 104 -159 254 26 25 212 -115 -36 121 111
4727 111 -214 -107 -89 4 90 -28 -90 -130 -42 20 -31 49 -149 54 80 184 12 175 -6 22 6 93 -111 -103 77
$$ packed form
4561a37J83L6k06K3K22k09P5j4k83K97rJ23o7L9q9J05j29k22J10M04j57j94Q0
4584a9J5o4J60j00J5l1J46j87Q4q3R3P9j94QL75l36K44j42L7j31J9K49m79L27
4608H5l14L00Q0k58Q8M22m95J96l4k32L74k11M1Nk0j97J93M5q4R4J59l72J40J22
4632A27j42J3N1qj15K03j58K62N4k13p5RL1J11m2l16L71l52J48Q8j17j07R8O7
4656a2n2j9k03J69k1Q2p5K95j79J02j89J69J08j02J26o8N2k8k97K97n7l53M05
4679A50j0j04m2r9J54R4R4k45L5M3o4j14O0O8p2K51j63J67o7k09J72j7j12L7q8
4704h1K74l96J44l4J8K8k52L74J58j14K93n05K57o0k63M13k28jJ87l27P9J57j0
4727A11l25J07J8R3Q6j18o2m0Q8O2n1Q0j98K03K6J04j72J63j81K8j6Q7k04QJ80
$$ plain form
4752 77 210 113 -216 -14 202 -38 -89 205 -21 -155 129 -189 71 -11 -265 -34 -274 -224 -118 -227 -34 131
4774 131 8 -255 278 -198 -129 -228 -18 149 6 98 128 159 153 -71 138 -234 59 109 146 -178 44 -54 -141 247
4798 247 -70 93 152 10 -163 -12 9 -147 88 57 -69 68 83 6 -61 -77 -10 -127 -155 -45 -12 -51 127 60
4822 60 96 39 104 241 42 -161 97 -109 51 204 -49 -2 -233 179 74 156 -121 -204 -9 57 19 175 -7
4845 -7 123 -69 71 -201 147 -31 -257 -54 36 200 -97 -20 69 -17 -81 -70 -5 257 -35 3 -41 182 -94 -125
4869 -125 55 130 124 -62 -30 120 -50 -280 -32 -211 80 82 120 37 107 61 -223 121 34 -80 3 -7 -86 -55 -31
4894 -31 -23 -116 -133 -50 45 84 -1 183 91 65 -33 -88 30 175 63 155 -14 70 165 -101 -156 19 129 -101 -110 -160 64
4921 64 117 -113 -53 -20 -1 48 294 -57 264 -62 -130 37 32 119 3 -78 81 24 81 -43 -2 -84 115 44 11 165
$$ packed form
4752G7J33r7l29K02K16k40n1K94k26j34K84l18K60q2k54K31k40N0J06j09J93J65
4774A31j23k63N33m76O9r9K10J67j43R2L0L1ok24K09l72K93N0L7l24K22r8q7L88
4798B47l17J63N9j42j73J51K1j56K35l1j26J37J5p7o7j6O7j17k8J10L3l9J78o7
4822F0L6n7O5J37j99k03K58k06J60J53k53M7k31M12j05Q2k77q3J95O6l8J56j82
4845gJ30j92J40k72L48j78k26K03R0J64k97P7Q9q6o4J1O5K62k92L8m4K23k76l1
4869a25J80P5oj86L2J50j70k30K48j79K91KL8q3P0m6k84L44q7j14Q3j0p9L1K4
4894c1Qr3j7Q3R5L9q5J84r2k6r8n5J18J45j12R2j69Q4R5k66n5J75J10k30rn0K24
4921F4N3k30O0L3J9M9K46l51L21l26o8J67nQ7j16q1J59n7N7j24M1q2J99p1l3J54
$$ plain form
4947 165 -192 56 -139 272 64 10 45 184 2 108 164 20 96 -119 -47 39 18 183 94 268 9 -20 -184
4970 -184 -74 171 -4 56 -219 113 -8 -28 -187 49 163 7 14 -15 130 237 -22 187 131 32 -310 -230 -53
4993 -53 -160 17 89 283 200 -231 -203 176 -1 102 61 102 90 -288 -147 49 66 -168 -29 87 -215 57 -37
5016 -37 -8 62 -158 -171 347 93 194 -308 -85 -77 65 -15 -134 -70 232 54 -60 -197 -157 83 -32 -162 -23
5039 -23 86 -52 -63 -87 51 -8 -139 -152 23 -257 -221 45 -76 50 -62 -27 -68 -21 158 -108 -115 -279 -111 81
5063 81 22 -8 140 -46 139 -136 -48 124 -210 15 -20 23 -22 148 121 -289 -219 179 48 197 -52 2 125
5086 125 -163 130 324 262 -12 -8 19 2 164 145 -134 -88 260 144 -78 35 -175 -20 11 82 -184 200 162
5109 162 3 -179 -33 -252 -8 -35 -36 -249 -162 106 281 -134 -165 59 -17 43 9 -168 -230 -17 -148 -265 -60
$$ packed form
4947A65l57K48j95M11k08n4L5J39j82J06N6j44P6k15P2Q6k1J65q9J74k59k9j64
4970a84J10K45j75O0k75L32j21k0j59K36J14j56Pk9J45J07k59K09n6r9l42Q0J77
4993e3j07J77P2J94q3m31K8L79j77J03m1M1j2l78J41J96J7k34J39J16l02K72r4
5016c7K9P0k20j3N18k54J01n02K23QJ42q0j19O4L02j78j14j37M0K40j15j30J39
5039b3J09j38j1k4J38n9j31j3J75k80L6K66j21J26j12L5m1M7J79k66pj64J68J92
5063H1n9l0J48j86J85k75Q8J72l34K25l5M3m5J70k7m10P0L98j31J49k49N4J23
5086A25k88K93J94o2k74MK7j7J62j9k79M6L48j16k22J13k10J55L1P1k66L84l8
5109A62j59j82J46k19K44k7jk13Q7K68J75m15l1K24p6O0l4j77o2K13j31j17K05
$$ plain form
5132 -60 27 -77 -23 39 93 83 131 65 -96 -84 -270 -4 169 -61 -89 -190 83 -145 15 -174 107 105 -50 -43 112
5157 112 -55 182 -89 -203 -207 -185 -119 166 -225 -139 125 -65 -12 -117 -126 -97 -144 288 152 124 22 -38 30 55 150
5182 150 252 72 116 -13 -17 -46 -16 67 -68 -75 -36 -205 -69 -21 -31 -59 -53 145 -62 37 243 55 -137 113 -114
5207 -114 67 -84 76 -52 151 83 -56 45 31 -87 -65 -11 -74 39 -31 -101 35 150 -24 -165 -107 -37 72
5230 72 -156 68 52 140 8 -2 82 124 -233 31 -81 32 189 -70 -149 -21 -100 45 -184 169 -496 55 -76
5253 -76 112 156 243 185 -65 29 20 -106 -125 -41 -95 13 118 -60 -169 -185 -99 147 113 59 42 -54 -287 285 65
5278 65 -11 7 -39 17 35 121 60 138 124 73 -23 -90 71 -205 0 51 55 76 -113 138 -163 146 -131 -130 -163 -52 -139
5305 -139 -131 65 77 -100 11 83 35 63 115 76 143 -44 165 243 102 35 -79 -25 160 126 23 80 -147 49 55
$$ packed form
5132f0Q7j04N4O2N4j0M8o6j61J2j86K66J73k30k8j01K73k28J60j89K81kj55PJ55
5157A12j67K37k71j14mK2O6K85l91Q6K64j90N3j05rK9m7M32j36k8j02o0O8K5R5
5182A50J02j80M4j29mk9L0Q3j35pL9j69J36M8j0k8OJ98k07R9K06j88j92K50k27
5207a14J81j51J60j28K03o8j39J01j4j18K2N4o3J13p0p0J36J15j74j41N8P0J09
5230G2k28K24j6Q8j32j0Q4M2l57K64j12J13J57k59p9J28p9J45k29L53o65N51j31
5253g6J88M4Q7n8k50R4rj26j9Q4n4J08J05j78j09j6Q6K46l4n4j7r6k33N72k20
5278F5p6J8m6N6J8Q6o1P8j4n1r6o7J61k76K05N1MK1j89K51l01L09k77Jl3J11q7
5305a39QJ96J2j77J11P2m8K8N2l9O7j87K09P8j41o7j14N4J85l4j03N7k27J96O
$$ plain form
5330 55 -95 139 24 -256 306 -6 -7 -119 -163 -191 270 160 233 11 -204 62 -109 -120 -157 85 -94 -11 76
5353 76 16 -14 125 -105 -254 -141 -55 241 13 15 -99 -3 181 -213 195 0 -278 -140 -57 -112 64 142 -16
5376 -16 -234 17 -199 -72 101 -88 41 -180 -7 -35 -93 51 18 79 -100 -62 95 77 -267 -128 -197 70 315
5399 315 208 153 10 64 11 301 79 56 137 119 42 -139 201 50 -106 -108 17 -97 14 113 -204 171 -82
5422 -82 91 -61 -36 25 164 81 49 149 -111 -110 90 -128 33 -105 142 -57 -70 -137 109 -142 -214 28 96 -26
5446 -26 59 127 179 31 -29 81 185 -127 -40 -83 -37 -127 -57 19 -103 -56 40 22 -29 -16 271 -19 9 -407 -298 128
5472 128 113 -282 -122 34 132 -69 -1 9 -108 -76 -5 3 55 -17 -193 -88 255 9 57 0 52 100 -122 43 -198
5497 -198 54 -20 -164 219 -103 41 214 -4 62 -156 -91 -79 10 -74 -141 -164 -121 40 91 113 56 -57 43 74
$$ packed form
5330E5j50K34j15k80N62l12jj12m4k8M61j10P3k22k15K66j71j1l7K42j79Q3Q7
5353G6o0l0J39k30j49J13Q6K96k28Kj14R6J84l94M08j95k78J38Q3n5J76P8j58
5376a6k18K51k16J27J73j89J29k21J73k8n8J44l3O1j79L8J57j8l44J39o9K67K45
5399C15j07n5j43N4n3K90k22k3Q1j8p7j81L40j51j56kJ25j14J11R9l17L75k53
5422h2J73j52K5O1J39q3l2J00k60JK00k18J61j38K47j99j3o7K46k51p2K42O8j22
5446b6Q5O8N2j48o0J10J04l12Q7m3M6r0P0P6j22M7R6j8n1J3K87k90K8m16J09M26
5472A28j5l95J60J56R8k01O8J0j17L2P1QN2p2j76J05L43k46M8n7N2M8k22J65k41
5497a98K52p4j44L83l22J44J73k18O6k18O5J2Q9q4o7k3M3J61N1K2n7j13J00L1
$$ plain form
5521 74 112 -116 172 -13 68 35 222 -134 -187 73 0 90 91 -146 103 296 246 -286 -8 118 -12 24 196 111
5545 111 67 159 -23 134 -34 -72 -122 40 122 -162 -53 1 232 132 121 51 212 112 10 -43 204 89 -4
5568 -4 -134 -83 -105 -102 -70 7 65 133 -89 -59 -291 -173 223 -84 -279 54 39 -181 47 -34 33 -82 14 -50 -182
5593 -182 -116 -213 -105 92 51 -92 -112 -252 216 -192 -267 -109 23 111 -3 -145 -95 63 17 51 149 -221 -161 -132
5617 -132 -82 -150 -126 94 -146 -163 -190 -12 -59 -18 214 -108 -187 139 24 -63 313 45 -141 -76 -76 121 -202 -58
5641 -58 -18 -13 2 -54 -99 -73 109 179 97 69 -182 112 100 69 235 -110 -44 53 32 44 -294 210 27 -248 304 -59
5667 -59 -37 225 -49 -98 61 -207 10 -61 -6 189 -63 -209 -154 -21 -141 88 187 -40 -59 -114 6 -336 -142
5690 -142 176 -222 -178 -51 -193 -39 -167 -45 -97 -15 52 129 -11 -77 41 61 106 -16 -89 -47 101 -42 231
$$ packed form
5521G4L8k28K88j85Q1l3J87l56n3K60p3R0Jk37K49J93n0n32K78J26j30L6J72q5
5545A11m4R2j82J57j68l8n0J62Q2k84J09N4K31j00j1p0J61j00j02n3K47j15r3
5568dj30N1k2LL2P7N8O8k22L0k32J18L96l07j95L33j5k20K28q1O7j15R6o4j32
5593a82O6r7J08J97m1j43k0j40M68m08p5J58J32Q8j14j42N0J58m6L4R8l70O0K9
5617a32N0o8K4K20k40j7k7J78m7M1K32l22p9L26j15q7L76k68j86O5%J97l23J44
5641e8M0NJ5n6m5K6J82P0q2k8k51K94j2l1J66l45O6R7k1J2l38N04j83k75N52l63
5667e9K2K62k74m9J59k68K17p1N5J95k52j46N5J33j20K29R9k27j9n5J20l42J94
5690a42L18l98M4J27j42J54j28J22n2Q2O7P7j40o6J18K0M5j22p3M2J48j43K73
$$ plain form
5713 231 -146 20 0 -318 190 65 -120 -171 99 -30 -61 133 -91 89 -31 85 8 190 84 -129 28
5734 28 33 6 -17 96 3 75 -101 64 81 -203 -51 -86 -206 85 104 -74 37 9 -67 -106 -78 -28 -222 135 -37
5759 -37 -178 68 49 -37 33 -171 21 -111 9 21 -18 -179 -46 -4 -93 -17 53 -6 84 171 -27 -102 146 107 -225
5784 -225 133 43 136 62 -10 -40 271 67 -51 143 57 121 164 -9 66 65 1 72 -208 -204 -124 22 -153 -18 -93 -35
5810 -35 165 -57 -24 -66 -88 117 -107 -13 231 1 128 -61 25 -60 131 67 -221 -48 4 57 289 -11 -114
5833 -114 46 105 206 133 -86 -4 -116 -86 170 -7 -22 -100 -154 -17 42 76 174 125 216 -50 66 202 40 -3
5857 -3 -102 -3 -52 115 -347 200 -192 -126 -330 -71 -68 -257 -147 -74 -389 359 -44 -18 125 -129 69 -89 141
5880 141 41 16 -218 -77 153 36 -189 -46 -57 -113 -98 -97 223 178 28 -84 -44 -134 293 87 6 -103 7
$$ packed form
5713B31l77J66k0l18N08j25j85n1K70j29l1J94k24J80j20J16p7J82j06k13J57
5734B8Nk7k3J13r3P2j76J65J7k84J52l5j20K91J9j78J11k8p6l9K8N0j94L57j72
5759c7j41K46j9q6P0k04J92j32J20J2l9j61J33M2q9P6P0n9R0Q7j98p5K48l9l32
5784b25L58r0R3p4p2l0L11k04j18J94q6O4M3j73P5jo4P1k80MQ0J46j75J35p5N8
5810c5K00k22L3m2k2K05k24R4K44k30J27j89Q6q5J91o4k88J73N2N3K32l00j03
5833a14J60N9J01p3k19Q2j12L0K56j77j5p8n4J37N9L4R8m9R1k66J16J36j62m3
5857cr9R9m9J67m62N47l92O6k04K59Lj89J10P3l15P48m03K6J43k54J98j58K30
5880A41j00k5k34J41K30j17k25J43j1n6J5JL20m5j50j12M0r0M27k06q1j09J10
$$ plain form
5903 7 51 -297 291 -43 -126 -21 -51 -81 57 2 201 -41 -30 -222 15 -16 -55 -187 -94 -249 238 115 -125 248
5927 248 -176 135 144 372 -153 -92 -196 -187 -147 -211 168 -38 -36 98 -122 -13 97 26 83 25 -262 -7 -113 42
5951 42 -34 5 -184 -177 -7 161 -164 -77 -103 59 29 135 152 -9 -40 64 58 -134 -127 -167 34 61 188 24 197
5976 197 38 -5 -187 -268 -307 -11 -192 -163 -88 102 -58 -108 50 -84 -45 -66 -115 -171 34 -19 109 -341 123 -105
6000 -105 134 7 -104 165 10 180 173 153 45 -42 18 93 -36 -73 -79 14 -108 177 -153 31 -152 75 5 23
6024 23 21 -13 144 -5 89 11 73 -159 89 158 161 -19 65 -58 -103 175 -206 77 41 -134 -295 30 90 -76 -62
6049 -62 143 -123 -182 145 129 -30 24 26 -16 94 -233 -170 -82 -221 -161 -188 114 -203 -63 -243 -152 39 -110 46
6073 46 46 -145 39 10 94 158 -27 -327 13 -66 -94 -3 139 254 70 -173 -59 69 -78 -121 216 -62 -3 43
$$ packed form
5903GM4l48N88l34q3J05l0l0J38n5J99k42J1j92K37l1l9j32R3j55M87j23k40L73
5927B48m24L11RK28n25O1j04RM0o4L79k06KJ34k20J09J10p1N7n8k87K55j06J55
5951D2p6L9j89PJ70J68l25Q7k6J62l0J06J7j61l1J04oj92Pm0K01K7J27j64J73
5976A97j59m3j82q1l9K96j81K9P5J90j60n0J58j34L9k1m9n6K05n3J28m50M64k28
6000a05K39j27j11K69j55J70pk0j08q7O0P5j29l7oR3j22K85l30J84j83K27p0J8
6024B3kl4J57j49R4p8O2k32K48O9Lj80Q4j23m5K78l81K83l6j75j61L25O0j66J4
6049f2K05k66n9L27j6j59N4Km2J10l27O3Q8j39O0k7L02l17J40j80R1J91j49J56
6073D6%j91J84k9Q4O4j85l00L40p9k8R1J42J15j84k43J14J28j47m3L37k78N9M6
$$ plain form
6097 43 32 55 -229 119 -19 131 -117 72 92 -45 173 249 -112 51 300 204 -32 48 -233 69 -118 79
6119 79 16 144 -171 -212 -146 -180 -25 -85 28 113 -96 -10 169 72 -300 1 -169 151 34 -39 12 -96 -60 -353
6143 -353 -70 -60 57 -44 -116 5 144 -6 12 29 219 -111 -245 -45 -59 147 -56 43 -194 -93 -106 65
6165 65 66 -79 168 -61 -30 -37 19 24 64 -206 11 -113 182 -123 -192 -184 35 134 -79 33 8 -51 -86 151 -38 -91
6191 -91 -242 233 13 6 78 33 55 103 10 134 148 -17 93 157 122 6 -102 17 -56 8 -151 199 91 51 -12
6216 -12 73 80 -217 -103 -136 -147 -140 77 153 -365 129 -87 -149 -91 -103 -269 -138 -199 73 41 -2 166 -138 89 98 13
6242 13 -232 -190 -102 115 142 111 78 -106 -17 70 -78 -106 27 -82 -73 206 -7 -39 61 -4 70 -106 -93 26 -16
6267 -16 -7 -138 128 14 120 209 209 -63 -84 -44 -138 46 133 -4 134 -192 9 78 -54 -81 -233 12 46 -8 127
$$ packed form
6097D3j1K3k84L48j38J50k48J89K0j37K18P6l61J63K49r6k36Q0k81L02j87J97
6119G9o3J28l15m1O6l4J55o0J13Q5k09Q6J79r7l72L01j70L20j17p3N1j08L6k93
6143c53K83J0J17j01p2J21J39j50J8J7J90l30j34K00j4K06k03R9k37J01j3J71
6165F5Jj45K47k29L1pN6NM0k70K17j24K95l05o9QK19R9k13J12k5n9l5K37j89n3
6191i1j51M75k20pP2m5K2M8r3J24J4j65J10O4l5j16j08J19p3O4j59L50j08m0o3
6216a2Q5Pk97J14l3j1PK17P6n18M94k16o2N8j2j66J31o1K72l2m3J68l04K27Rq5
6242A3k45M2Q8K17K7l1l3j84Q9Q7j48k8J33j09RK79k13l2J00o5P4j76J3J19m2
6267a6Rj31K66j14J06Q9%k72k1M0r4J84Q7j37J38l26K01O9j32k7j52K45L4n4J35
$$ plain form
6292 127 131 175 38 183 -164 116 -49 -44 -159 -56 -85 116 -44 -192 92 206 227 70 -338 34 -92 -14 121
6315 121 -59 211 34 25 -77 -147 -26 92 206 42 -41 78 179 -10 -79 -117 -296 223 0 123 68 57 245
6338 245 -45 71 -166 90 -222 -326 242 74 -97 90 -214 5 25 -106 236 78 48 27 -120 160 168 -186
6360 -186 27 -60 244 -25 -161 255 -76 142 -67 184 -71 114 26 -114 -29 53 178 177 73 215 -145 142
6382 142 -125 102 -187 -72 -18 -123 62 9 578 112 47 86 47 -130 77 -46 232 -27 -84 12 -74 74 121
6405 121 7 -44 229 -4 -197 -108 -85 -173 223 -181 359 191 -227 195 105 -94 -174 -75 -11 -119 -222 -243 -21
6428 -21 -100 174 -68 11 -171 -367 -93 -5 -115 -247 59 -128 99 -49 97 -214 32 110 4 -237 -206 -158
6450 -158 239 105 -88 -25 -15 -90 -83 31 -143 -132 -64 228 29 197 -185 -40 213 -111 -225 135 -171 -368
$$ packed form
6292A27MM4j37J45l47K80j65Nj15J03k9K01j60j48K84J14K1j57m08L72j26P8J35
6315A21j80K70j77rj02p0J21J18J14j64q3J19J01j89o9l8j79N19k23J23n5j1J88
6338B45k90J16k37K56l12j04N68j68j71J87l04K19K0j31L42j58l0k1j47K80Ql54
6360a86K13q7L04k69j36M16l31K18k09K51k55J85q8j40Q5Q2J25jj04J42l60K87
6382A42k67K27k89J15N4j05J85n3N69m66o5L9l9j77K07j23K78k59n7R6q6J48M7
6405A21j14n1K73k33j93Q9K3q8L96m04N40j68m18M22r0j99q0R9O4j08j03k1K22
6428b1p9K74k42P9j82j96K74Q8j10j32L06j87K27j48J46l11K46P8j06k41L1M8
6450a58L97j34j93O3J0p5PJ14j74J1O8K92j99J68l82J45K53l24j14L60l06j97
$$ plain form
6472 -368 -163 -55 -10 157 -167 1 -27 -45 -6 -263 -130 -74 93 -68 -183 138 201 118 -86 -101 -1 40 -73
6495 -73 107 -121 -48 29 -257 83 7 -219 40 81 -301 -41 -172 135 54 -20 -99 136 159 -56 -53 33 -104 24
6519 24 -1 138 -33 -79 -227 197 -133 -184 73 -23 -56 -155 54 -158 -114 -115 66 -76 -32 27 -36 58 146 -31 -94
6544 -94 111 -106 -101 -137 -62 -131 -173 7 -35 64 53 -19 -126 39 194 72 -184 -171 100 118 44 -164 -85 129 -51
6569 -51 77 -30 -235 32 144 -41 96 193 36 50 -152 -214 -234 -3 -67 136 7 -41 68 279 55 -13 150
6592 150 -113 -10 13 272 116 -83 -116 -81 277 57 70 -14 -106 -70 186 55 -133 -86 -335 19 -198 -130 113
6615 113 -79 20 24 -233 -189 -177 30 -38 4 77 -31 1 -87 -91 -46 -20 122 35 67 3 -139 34 -108 -56 -136 99
6641 99 -91 21 200 105 32 -138 -251 176 46 -88 20 -261 -188 -73 212 159 354 172 251 -77 -88 18
$$ packed form
6472c68K05J08M5J67l24J68k8j8L9k57J33N6J67j61j15L21O3q3k04j5J00M1j13
6495g3J80k28P3P7k86L40p6k26K59M1l82K60j31L07q1p4p9K35K3k15LQ6j37J28
6519B4k5J39j71m6j48M24l30n1K57r6l3r9K09k12M4jJ81j42M4N9o3R4Q8j77o3
6544i4K05k17Nl6P5o9m2J80m2R9j1p2j07J65J55j22k56J3K71J8p4k08P9K14j80
6569e1J28j07k05K67J12j85J37R7j57J4k02o2k0K31o4K03j29m8J09K11k24o8J63
6592A50k63J03K3K59j56j99l3L5L58k20J3q4r2L6K56j31j88M7k49L54k17O8K43
6615A13j92R9Mk57M4J2K07o8M2P3j08L2q8mM5K6J42q7L2o4j42J73j42N2q0K35
6641I9j90J12J79r5p3j70j13M27j30j34J08k81P3J15K85n3J95j82P9l28j1J06
$$ plain form
6663 18 156 -258 -146 51 -65 -89 15 -18 19 50 -40 -370 -115 239 -143 59 57 -6 -64 52 107 62 144 -11
6687 -11 -7 7 -434 -40 8 -39 -251 -40 -98 -44 -98 -50 -7 -45 23 -7 48 125 -132 184 -81 5 -128 74 -137 -236
6713 -236 -11 -18 -304 -132 91 -54 153 57 90 -72 -182 -73 26 -38 -147 -25 -79 245 -55 -147 155 151 124 120
6737 120 16 -85 -380 57 -20 -51 -90 -156 -43 12 -111 137 5 422 120 -140 65 -95 -69 226 82 -63
6759 -63 -154 -25 111 -162 53 -132 5 -20 -317 20 85 36 -95 53 -27 15 47 -99 111 243 -207 -304 -65
6782 -65 40 129 -152 58 -328 233 21 -97 -215 28 -141 -126 36 -1 -56 -150 200 -139 -141 160 -108 76 -136
6805 -136 263 -251 28 -9 73 -125 -116 60 105 -94 -112 -82 7 92 -173 49 85 31 -132 158 -55 73 189 -100
6829 -100 -144 51 -267 175 58 -75 137 23 71 -285 -86 23 46 -8 15 -239 114 232 221 44 -87 -56
$$ packed form
6663A8J38m14J12J97j16k4J04l3L7L1r0l30K55L54l82K02ko3n8J16N5m5Q2j55
6687a1MJ4m41L94M8m7k12K11n8N4n4M8M3l8O8l0N5P7k57L16k65Q6j33K02k11r9
6713b36K25pk86J72K23j45K07r6L3j62j10J09R9o4j09J22n4L24l00r2L02mk7m
6737A20j04j01k95M37p7l1l9o6J13N5j23K48j32M17l02k60K05j60K6K95j44j45
6759f3r1J29J36k73K15j85J37k5k97L37O5m9j31J48q0M2L2j46K10J32m50r7K39
6782f5J05Q9k81K10l86N61k12j18j18K43j69J5J62l7n5r4L50l39kL01k68J84k12
6805a36L99n14K79l7Q2j98RJ76M5j99j8L0Q9Q5k65K22L6n4j63K90k13J28J16k89
6829a00m4J95l18M42j17j33K12j14M8l56J99J09K3n4K3k54L53J18j1j77j31L1
$$ plain form
6851 -56 118 82 -67 -154 13 7 -194 83 220 160 -113 148 -48 -21 -68 -297 104 -35 -42 269 161 263 348 -65
6875 -65 -159 -40 29 -233 21 26 -39 23 -14 -83 -144 -359 -114 118 104 80 80 -157 145 21 -178 -121 -187 409 -8
6900 -8 -83 -41 156 -124 -26 132 -2 -14 -54 -13 -184 121 -104 34 97 -245 127 197 -54 -261 57 129 -129 -180
6924 -180 -14 -337 114 146 36 -15 -31 -287 -14 -110 -36 132 -75 -135 -87 223 -132 -104 -51 -158 23 -66 -47 121
6948 121 -98 -151 162 363 -76 37 89 22 160 -146 -308 -179 106 -78 -32 -50 55 34 -101 -90 161 -69
6970 -69 78 -21 132 15 -255 161 -9 -23 186 160 -24 -235 237 162 -178 113 -31 0 -171 184 112 19 -154
6993 -154 -5 277 98 -42 -150 -6 223 276 -32 130 64 -109 -163 149 -1 -132 -96 3 -70 -101 -69 172 -68
7016 -68 187 -40 139 47 15 99 157 101 -130 -6 156 96 -15 -154 32 204 -218 12 -33 58 314 29 206
$$ packed form
6851e6J74l6j49q7J67ok01K77J37o0k73K61j96K7m7k29M01j39pL11j08J02Q5m13
6875f5r4J19O9k62K54No5O2l7o9o1k15K45K32j4k4%k37L02j24j99N7o6N96m17
6900hp5M2J97k80R8J58j34j2m0M1j71L05k25J38O3l42L72P0k51k07L18P2k58n1
6924a80J66l23M51L2j10n1j6k56K73r6P4J68k07o0M8L10l55K8N3j07J81q9J9J68
6948A21k19n3L13K01m39J13N2o7J38l06j62J29K85j84M6j8J05k1j35J1K51k30
6970f9J47r9J53j17k70M16j70j4K09k6j84k11M72p5l40K91j44L1j71L55p2r3j73
6993a54J49K82j79j40j08J44K29N3l08J62o6j73n4L12j50j31L6R9p3l1L2K41k40
7016f8K55k27J79r2l2Q4N8n6k31J24J62o0j11j39J86J72m22K30m5R1K56k85J77
$$ plain form
7039 206 300 -32 148 -233 3 -34 22 36 337 -175 52 -2 -139 215 -32 105 215 154 181 -19 -77 -3 -32
7062 -32 -75 -105 -119 -172 23 -65 197 38 77 210 161 -119 -195 -50 -97 124 -57 -50 -6 -54 14 -18 69 -73 127 -11
7088 -11 221 95 259 -166 -76 -39 28 221 289 86 85 81 109 228 -10 -41 -42 236 -50 -125 -52 -4 203 -107 -270
7113 -270 -165 -118 155 -64 -101 138 61 230 -277 216 151 70 52 -277 197 -81 76 21 15 258 73 105 -72
7136 -72 141 -178 16 232 -36 136 -75 -228 -112 -75 140 -104 -203 -70 -126 -159 -224 59 183 -110 68 -19
7158 -19 79 160 -123 157 -221 -8 148 -98 -89 30 36 -110 -97 256 186 -106 -136 -128 -119 27 -26 242 101 -189 -260
7183 -260 282 -158 -179 -38 190 -142 129 -43 -84 124 -56 77 205 -8 -29 102 -15 -51 158 -247 -82
7204 -82 -93 62 -99 342 210 -118 -178 -60 133 0 -69 -191 -62 26 228 -39 102 75 -267 -67 -84 -10 -113
$$ packed form
7039B06R4l32J80l81K36l7N6J4L01n12K27n4j37L54k47J37J10o1K7k00n8P4k9
7062c2m3l0j4n3J95q8K62j59L9J33m9k80p6J45m7K21j81PM4m8O8l2Q7j42K00j38
7088a1K32j26J64m25R0L7O7J93O8k03jmK8J19k38l1jK78k86p5P3M8K07l10j63
7113b70J05M7K73k19l7K39p7J69n07M93o5q1j8l29M74k78J57n5oK43j85L2j77
7136g2K13l19J94K16k68J72k11j53J16L7K15k44r9J33n6l3o5K83J24k93J78q7
7158a9R8Q1k83K80l78K13J56k46RJ19Oj46J3L53p0k92l0QRJ46n3K68j41k90p1
7183b60N42m40k1J41K28l32K71j72m1K08j80J33J28k13k1J31j17l6K09m05J65
7204h2j1J55j61M41j32l28o0J18J93j33o9j22J29Q8K02k67J41k7l42K00j7P4j03
$$ plain form
7227 -113 81 226 92 82 24 197 279 91 -1 26 53 44 29 -70 -110 -95 70 -20 -70 -128 44 -67 105 210 83
7252 83 46 86 158 -77 -30 -126 -52 -108 100 -13 -213 -102 102 84 452 231 -124 164 -197 62 -447 -30 363
7275 363 -49 254 -68 -11 2 41 -188 88 -82 140 -24 71 72 -46 174 -165 -103 -37 64 -271 206 125 -73
7298 -73 2 275 113 70 -11 -152 -75 -397 -46 25 84 -245 61 150 -138 -2 292 420 -81 182 -280 100 -70
7321 -70 36 -5 170 29 181 421 -75 -21 93 42 -138 46 -134 85 45 66 92 -24 -96 87 -33 -158 -41
7344 -41 100 196 -63 40 -219 130 138 39 -140 -289 127 -183 -114 -30 -63 9 203 -196 76 -35 113 -22 127
7367 127 -23 -155 109 56 5 -85 53 -89 54 15 139 55 -171 24 17 -96 187 -58 81 79 -163 -24 90
7390 90 153 170 323 18 46 -115 110 72 125 83 15 48 116 -82 16 122 -111 -10 -12 -292 62 194 153 -53 65
$$ packed form
7227a13J94J45j34j0n8J73Q2j88r2K7K7rj5r9m0J5J65r0n0n8J72j11J72J05j27
7252H3l7M0P2k35M7r6P4n6K08j13k00J11K04j8L68k21l55K88l61K59n09M17L93
7275C63m12L03l22N7J3L9k29K76j70K22j64R5Jj18K20l39O2O6J01l35M77q1j98
7298g3P5K73j62m3q1j41P7l22L51P1N9l29L06Q9k88J36K94J28n01K63m62L80j70
7321g0J06m1J75j41J52K40m96N4J14n1j80J84j80K19m0K1K6j16p2J83j20j25J17
7344d1J41R6k59J03k59L49Qr9j79j49M16l10O9Q4l3P2J94l99K72j11J48j35J49
7367A27j50j32K64n3n1r0J38j42J43l9J24q4k26J95pj13K83k45J39kk42J39J14
7390I0O3J7J53l05K8j61K25l8N3m2o8L3O8j98R8J06k33J01kk80L54J32m1k06J18
$$ plain form
7415 65 95 -126 52 -134 -26 -111 41 77 -9 82 13 119 76 261 92 92 260 -106 -132 28 25 -15 -189 51 110
7440 110 -142 -98 -1 77 156 222 59 -138 10 21 -41 -12 -45 172 121 169 112 131 -75 128 91 100 -1 289 187
7465 187 124 -49 56 -60 214 -93 -124 114 -202 -4 200 6 -109 -25 -326 -127 46 124 161 31 189 132
7487 132 -325 -265 -112 -8 -80 161 -219 93 -6 55 276 25 -162 10 -4 -34 -197 57 64 58 88 44 -200 57
7511 57 52 -335 9 1 -41 -31 146 -76 96 102 -110 -44 -197 240 -6 88 301 -137 57 147 1 -56 36 -100 -94
7536 -94 80 -48 105 -41 280 -196 91 29 -24 -231 83 -21 183 166 -83 243 68 -140 -58 -129 88 -131
7558 -131 -12 3 27 87 146 -151 95 -36 -191 -176 93 -187 142 33 33 68 -225 -20 37 -190 109 211 54
7581 54 -177 -4 -202 -106 33 -43 107 106 -101 0 -124 172 124 -194 224 181 -3 61 -89 -386 63 -101 -148
$$ packed form
7415F5L0k21J78j86J08q5J52L6q6R1o9J06m3J85j69%J68l66k6J60lm0j74K40N9
7440A10k52M4R7P8P9O6j63j97J48J1o2K9l3K17n1M8n7J9k06K03l7Rj01K90j02
7465A87o3j73J05j16K74l07l1K38l16J98K04j94j15Q4l01J99J73P8L7j30J58n7
7487A32m57O0J53J04p2K41l80L12r9O1K21k51j87J72j4l0j63K54PoL0m4k44K57
7511E7nl87L44qm2J0J77k22J72Ok12O6j53M37k46R4K13m38J94R0j46n7R2j36O
7536i4J74j28J53j46L21m76K87o2n3k07L14j04K04j7k49L26j75k08Q2p1K17k19
7558a31J19J5K4O0N9k97K46j31j55J5K69k80L29j09%L5k93K05N7k27K99J02j57
7581E4k31J73j98R6J39p6J50jk07J01j24K96m8l18M18m3j84O4j50k97M49j64m7
$$ plain form
7604 -148 -185 113 -81 55 295 -90 -86 -264 -111 184 -41 -55 -30 103 -64 -58 20 214 -153 -19 -61 -175 -261
7627 -261 -167 150 -197 211 -134 -198 193 3 309 214 79 186 -88 -159 -117 -49 -103 -118 -126 44 -239 -3 -46 17
7651 17 -3 -120 322 40 225 63 -156 98 138 -74 -150 142 70 68 173 166 10 -31 -157 36 -62 -29 -151 58
7675 58 35 -67 -224 152 227 84 -99 -104 180 -278 -173 -174 97 -51 188 61 97 52 -80 -42 235 -11 -93 -29
7699 -29 -42 -72 63 136 -157 -1 -181 -9 -195 -58 138 42 -68 62 215 -133 -37 -90 -295 26 -55 -184 84
7722 84 -156 -160 247 -162 131 -30 -20 60 -284 110 -30 -80 45 66 -18 -233 -75 -74 -144 118 254 -82 -250 -89
7746 -89 102 -67 -33 -215 -9 85 114 49 35 71 163 6 -83 217 145 -125 16 -161 -38 45 76 -37 -34 90 42
7771 42 36 152 37 -76 -28 52 -14 64 112 -19 -142 85 98 -170 255 -62 265 -72 185 -141 16 -28 -27 102
$$ packed form
7604a48l7K98j94J36K40l85Mj78J53K95k25j4K5J33j67OP8J94l67J34m2j14q6
7627b61R4L17l47M08l45o4L91j90L06r5j35J07k74p1M2O8n4j5qJ70k83K36m3O3
7651A7k0j17M42k82J85j62k19K54M0k12p6K92p2kJ05pj56m1j26J93r8L3j22K09
7675E8k3j02j57L76P5j43j83nK84m58J05jK71j48K39j27L6m5j32L8K77k46q2O4
7699b9j3l0J35P3k93J56j80J72j86J37J96r6j10J30J53l48R6n3k05L21q1j29K68
7722H4k40mM07m09K93j61J0Q0l44L94j40n0J25K1q4k15J58Jp0K62J36l36j68J61
7746h9J91j69L4j82K06R4K9o5j4L6R2j57q9L00p2k70J41j77J23Q3L1j13LJ24m8
7771D2oJ16j15j13M8Q0o6P8M8j31j23K27J3k68M25l17L27l37K57l26J57m4JJ29
$$ plain form
7795 102 -127 -125 12 -96 -96 130 -31 -102 98 -143 103 -18 -149 133 -241 91 -19 -81 -214 36 -155 0
7817 0 228 23 42 -8 74 123 89 97 -58 25 -215 -75 74 -140 25 -93 -118 -11 -17 110 -65 110 -67 190
7841 190 -151 -70 -298 64 208 -50 -107 -114 -255 129 80 353 -238 185 -35 -253 78 -77 266 -122 -158 21
7863 21 -165 111 -149 -29 95 72 125 144 -36 108 -127 -135 197 -79 -7 -14 112 -148 50 -79 -142 28 133
7886 133 -128 87 82 -267 188 -105 -154 1 151 -94 -208 -187 204 199 89 39 117 69 -4 -98 -20 -34 -41 61 -133
7911 -133 -127 -134 135 -43 -132 167 -104 234 5 -51 183 -18 -87 43 56 -28 -39 -334 -229 128 90 36 18 20 -115
7936 -115 323 -52 59 -288 -178 -63 67 -255 -167 -76 197 -84 400 103 -8 -40 -226 -89 39 78 217
7957 217 19 15 133 324 38 95 -59 -399 81 46 106 -12 77 -184 -2 -105 -1 -91 -159 49 110 213 -186
$$ packed form
7795A02k29KJ37j08%K26j61p1K00k41K46j21j31K82l74L32j10o2j33K50j91J55
7817@K28k05J9n0Q2M9l4Qj55Q3k40J40J49k14J65j18k5J07oJ27j75J75j77K57
7841A90l41Q1k28L62J44k58n7pj41L84m9K73n91M23k20k18L31j55L43l88l6J79
7863B1j86K76k60J20J24k3N3J9j80J44k35qL32k76P2pJ26k60J98j29o3J70J05
7886A33k61K15nl49M55k93m9J55J50k45j14K1L91nj10n0P8m8p3r4P8j4pJ02j94
7911a33OpK69j78q9K99k71L38k29n6K34k01o9J30J3q4j1k95J05L57l8n4j8Kj35
7936a15M38l75J11l47J10J15J30l22Q8R1K73k81M84k97j11l2j86J37J28L9J39
7957B17j98mJ18J91k86N7j54l40M80l5O0j18Q9k61J82j03J04r0o8K08O1J03l99
$$ plain form
7980 -186 134 -117 139 -19 147 25 -2 93 -301 -157 -90 -79 85 11 113 -40 216 92 136 -193 24 -52
8002 -52 -139 -140 -77 -173 -208 110 -309 -13 54 1 157 116 35 -104 -134 92 -214 87 -101 65 -72 -185 -148 -167 134
8027 134 137 78 3 -60 163 111 -49 -160 71 -72 -59 249 -504 -5 84 37 46 -141 113 23 65 -234 -204 166 -6
8052 -6 -58 155 -261 271 17 -119 158 -191 -105 -121 -40 -79 51 26 -114 -90 50 -266 -320 -258 62 -100 17 29
8076 29 -28 245 57 -2 196 158 50 -135 283 42 62 87 -12 14 378 -54 -65 163 143 172 -298 129 109 -147
8100 -147 0 -28 -31 -210 -60 83 61 125 -82 -251 -56 74 23 -85 38 3 -132 -62 -173 -308 -31 1 -100
8123 -100 34 93 -107 73 200 -206 -187 -17 8 -30 4 -208 139 -137 -43 -169 15 -43 91 -7 38 323 57
8146 57 85 159 -31 59 15 -47 -147 -239 -86 138 33 174 133 61 -74 131 -37 100 -144 -69 52 -130 -67 258
$$ packed form
7980a86L20k51K56j58J66j22k7R5l94J44O7J1J64p4J02j53K56j24M4l29K17p6
8002e2q7jO3r6l5L18m19K96O7n3J56m1q1j39l0K26l06L01j88J66j37j13L7j9L01
8027A34Ln9p5o3K23n2j60j11K31j43J3L08p53M99Q9m7Rj87K54r0M2k99L0L70j72
8052fn2K13m16N32k54j36K77l49Q6j6Q1l9J30k5j40K4J40l16n4O2L20j62J17J2
8076B9n7K73j88n9J98l8j08j85M18k41K0K5r9K6L64m32j1K28k0K9m70M27k0k56
8100a47J47k8lj79J50J43k2O4k07j69J95J30n1j08J23l5j35P0j11j35K77L2j01
8123a00J34N9k00J80J27m06J9J70K5l8L4k12L47k76R4j26J84n8J34r8M5K85k66
8146E7K8P4j90R0m4o2j00r2J53K24j05J41m1p2j35K05j68J37k44P5J21j82O3L25
$$ plain form
8170 258 71 -109 86 213 -73 198 -15 10 157 -193 -10 -50 -68 34 108 83 11 36 4 193 -88
$$ packed form
8170B58j87j80J95J27k86K71k13K5J47l50J83m0j8J02P4k5p2K5l2J89k81
8191h8
$$ Imaginary data points
##PAGE= N=2
##DATA TABLE= (X++(I..I)), XYDATA
$$ plain form
0 0 0 0 0 0 0 0 0 0 0 0 0 -8 8 -8 8 -16 16 -24 24 -32 40 -48 56 -64 77 -88 104 -120 136 -159 183 -207 233
33 233 -264 301 -337 379 -424 474 -530 590 -656 728 -807 890 -984 1087 -1199 1321 -1456
50 -1456 1602 -1764 1946 -2146 2372 -2626 2915 -3245 3632 -4085 4628 -5296 6135 -7227 8713
65 8713 -10867 14282 -20534 35765 -156125 -87683 155610 -110784 -83519 96780 10244 -93596
77 -93596 106698 108487 -65603 -8985 140547 40799 -34882 25207 14717 -49012 13401 53509
89 53509 -20317 -79217 -41322 -10696 -26859 -37591 -7886 -14276 -36905 23587 90205 17490
101 17490 -33077 62625 95502 2934 594 28512 -54613 -59848 49086 3438 -103186 -23358
113 -23358 38704 -51338 -39407 43276 -24482 -59019 64157 74979 -34797 -8224 59305 5872
$$ packed form
0@%%%%%%%%%%%qJ6j6J6k4L2m0M8n6P2q8J04j20J41j65J92k24K56k95L42l90M40
33B33m97N65o38P16q03Q98j004J120j246J384j535J697j874K071k286K520k777
50a456L058l366L710m092M518m998N541o160O877p717Q713r924J1431j3362J5940
65H713j9580K5149l4816N6299j91890O8442K43293k66394K7265J80299q6536j03840
77i3596K00294J789j74090N6618J49532r9748p5681O0089j0490o3729O2413M0108
89E3509p3826n8900L7895L0626j6163j0732K9705o390k2629O0492O6618p2715
101A7490n0567R5702L2877r2568k340K7918q3125n235J08934m5648j06624P9828
113b3358O2062r0042J1931Q2683o7758l4537J23176J0822j09776K6573O7529n3433
$$ plain form
125 5872 -5552 62071 30854 -37867 -3567 26728 -20825 -48152 -33309 -25012 -17682 -7906 -6724
138 -6724 -9638 -14793 2900 43857 36603 -6187 9438 40384 8760 -4571 27023 1495 -35951
151 -35951 8229 23580 -40485 -42271 6691 -13574 -30119 12552 4626 -36193 -4063 32696
163 32696 7999 3672 29621 20606 10028 23962 12710 -12626 -8195 -453 -5705 -7309 -17774
176 -17774 -27394 -12176 -4984 -13395 -1963 5242 -8213 6080 27075 4735 -5532 23055 18713
189 18713 -3307 14824 17605 -17920 -10632 17372 -9567 -28357 -1335 -6157 -29711 -5458 10028
202 10028 -15313 -8874 21759 12100 -2077 14625 16155 862 8482 17188 1843 -7123 -1572
215 -1572 -2469 -7650 -10107 -10030 -6294 -6621 -9749 -1858 1038 -8941 -1581 15127 6370 -1159 15035 14271
$$ packed form
125E872j1424O7623l1217o8721L4300L0295m7553k7327J4843Q297P330R776J182
138f724k914n155J7693M0957p254m2790J5625L0946l1624j3331L1594k5528l7446
151c5951M4180J5351o4065j786M8962k0265j6545M2671p926m0819L2130L6759
163C2696k4697m327K5949r015j0578J3934j1252k5336M431P742n252j604j0465
176a7774r620J5218P192q411J1432P205j3455J4293K0995k2340j0267K8587m342
189A8713k2020J8131K781l5525P288K8004k6939j8790K7022m822k3554K4253J5486
202A0028k5341O439L0633r659j4177J6702J530j5293P620Q706j5345q966N551
215a572q97n181k457P7L736l27l128P891K896r979P360J6708q757p529J6194p64
$$ plain form
231 14271 -2795 7097 16305 -5320 -10569 7488 -3073 -20032 -4212 -58 -17445 -7760 7761
244 7761 -5387 -7922 9606 7464 -1580 9178 12176 1171 3543 9893 1546 -2848 2302 -1320
258 -1320 -5960 -3414 -5258 -8610 -5907 -4927 -5225 -716 -375 -844 5117 6307 2647 6628 9416 2526
274 2526 2797 7065 -39 -5585 490 -1488 -9661 -4739 -491 -8077 -6538 2138 -1916 -4429 4078
289 4078 4262 -39 5015 7616 2599 2895 6127 1848 -787 1158 -1414 -4883 -2475 -3535 -6719 -3638
305 -3638 -2280 -4559 -1106 1661 -204 1743 5127 3329 3332 6000 3950 1469 2904 1838 -2206 -1961
321 -1961 -1117 -4780 -5113 -2169 -4286 -4614 -791 -703 -1564 1887 3412 1467 3265 5025 2776 2115 3605
338 3605 1600 -103 211 -641 -2978 -2883 -2606 -4364 -3926 -2412 -2805 -1548 768 731 1467 3748 3138 3280
$$ packed form
231A4271j7066R892R208k1625n249J8057j0561j6959J5820M154j7387R685J5521
244G761j3148k535J7528k142r044J0758K998j1005K372O350q347m394N150l622
258a320m640K546j844l352K703R80k98M509L41m69N961J190l660L981K788o890
274B526K71M268p104n546O075j978q173M922M248p586J539Q676m054k513Q507
289D078J84m301N054K601n017K96L232m279k635J945k572l469K408j060l184L081
305c638J358k279L453K767j865J947L384j798LK668k050k481J435j066m044K45
321a961Q44l663l33K944k117l28L823Q8q61L451J525j945J798J760k249o61J490
338C605k005j703L14q52k337R5K77j758M38J514l93J257K316l7P36K281o10J42
$$ plain form
356 3280 4396 3358 1840 1463 1085 -921 -1991 -1490 -2994 -4266 -3106 -2675 -3046 -1679 -372 -893 540
373 540 2060 2389 2621 3068 3381 3110 2244 2035 935 -668 -1006 -1491 -3109 -3613 -3179 -3362 -3184 -2087 -863
392 -863 -439 284 2362 3072 2495 3091 3956 2597 1704 2471 846 -1352 -1195 -912 -2864 -3419 -2411 -2360 -3648
411 -3648 -2503 -428 -1478 -955 2188 2878 1932 2715 4293 2759 1516 3036 2285 -1331 -1197 -52 -2868
428 -2868 -4589 -1922 -2494 -4497 -1571 374 -1854 -1257 2587 2186 751 3665 4509 1506 1844 3689
444 3689 1351 -1226 628 191 -2811 -2847 -1730 -3707 -4448 -1816 -385 -2085 -933 1486 1354 1049 2808
461 2808 4040 2735 2680 3796 2398 -955 -555 436 -1976 -3163 -1166 -2530 -4972 -2514 -466 -2294
477 -2294 -1492 1509 1264 607 2411 3442 1435 2615 4362 2024 225 1291 -421 -2269 -1491 -1447 -2917
$$ packed form
356C280J116j038j518l77l78k006j070N01j504j272J160M31l71J367J307n21J433
373E40J520L29K32M47L13k71q66k09j100j603l38m85j618n04M34j83J78J097J224
392h63M24P23K078P10n77N96Q65j359q93P67j625k198J57K83j952n55J008N1j288
411c648J145K075j050N23L143O90r46P83J578j534j243J520p51l616J34J145k816
428b868j721K667n72k003K926J945k228N97L844m01j435K914Q44l003L38J845
444C689k338k577J854m37l002l6J117j977p41K632J431j700J152K419j32l05J759
461B808J232j305n5J116j398l353M00R91k412j187J997j364k442K458K048j828
477b294Q02L001k45o57J804J031k007J180J747k338j799J066j712j848P78M4j470
$$ plain form
494 -2917 -2768 -2371 -2827 -2179 -913 -777 431 2300 2496 1835 2328 2529 1686 2135 2665 484 -1 -141 -1661
513 -1661 -2862 -2260 -2344 -2708 -1598 -952 -1667 -2132 62 1168 1166 2687 3193 1968 1553 2473 2048 302 223
532 223 716 -465 -2442 -2032 -1856 -3667 -2811 85 -1006 -2290 180 1419 -592 870 3806 2312
548 2312 205 3371 3388 -1327 -312 2355 -717 -2628 398 -910 -4875 -2829 211 -2216 -2403 1350
564 1350 1176 -1672 680 3521 407 358 4018 2964 -389 960 1841 -1315 -2028 774 -601 -3323
580 -3323 -1954 -4 -2603 -3229 823 487 -1544 1317 2845 -177 -380 3453 2450 -260 1942 2912
596 2912 -1674 -2315 1344 -713 -3667 -708 637 -3046 -2517 693 -975 -1958 1337 2676 -226 280
612 280 2875 963 -579 2078 2049 -830 -232 1459 -965 -2417 -627 -34 -1856 -1567 614 -1105 -1761
$$ packed form
494b917J49L97m56O48J266J36J208J869J96o61M93K01q43M49N30k181m85j40j520
513a661j201O02q4l64J110O46p15m65K194J106kJ521N06j225m15R20m25j746p9
532B23M93j181j977M10J76j811Q56K896j091j284K470J239k011J462K936j494
548B312k107L166J7m715J015K667l072j911L026j308l965K046L040k427j87L753
564A350j74k848K352K841l114m9L660j054l353J349Q81l156p13K802j375k722
580c323J369J950k599o26M052l36k031K861J528l022k03L833j003k710K202R70
596B912m586o41L659k057k954K959J345l683N29L210j668r83L295J339k902N06
612B80K595j912j542K657k9k879N98J691k424j452J790N93j822K89K181j719o56
$$ plain form
629 -1761 762 1315 -48 917 2458 925 105 1540 1006 -421 -194 1009 -709 -1499 -358 -1000 -1830
646 -1830 -502 317 -855 -631 185 356 -327 663 1318 582 817 1218 453 -316 197 400 -358 -71 -257
665 -257 -903 -1061 -708 -540 -536 -260 189 243 84 325 229 158 731 651 660 527 -41 134 -7 -92 -578 -232 -264 -405
689 -405 -465 -476 200 -271 -198 587 189 -66 527 702 83 274 609 339 -576 -5 408 -497 -559 520 -82
710 -82 -607 485 -6 -495 284 591 -7 -322 142 -25 -162 -27 266 -155 -433 208 -3 -490 -14 346
730 346 -118 -188 294 101 -213 16 583 -34 -406 393 249 -269 -43 97 -458 -507 142 -160 -516 -46 564
751 564 -332 -28 783 370 -385 337 470 -446 -181 421 -292 -609 -83 -166 -414 -317 -139 -52 -485 302 248 206
773 206 586 481 455 386 388 743 191 61 72 -180 -722 -362 -81 -549 -671 -283 -349 -553 -215 -75 211 208 915
$$ packed form
629a761K523N53j363R65J541j533q20J435n34j427K27J203j718p90J141o42q30
646a830J328Q19j172K24Q16J71o83R90O55p36K35M01p65p69N13K03p58K87j86
665b57o46j58L53J68MK76M49N4j59K41r6p1N73q0Rj33n68J75j41q5m86L46l2j41
689d05o0j1O76m71P3P85l98k55N93J75o19J91L35k70r15N71M13r05o2J079o02
710h2n25J092m91m89P79L07n98l15M64j67j37J35K93m21k78O41k11m87M76L60
730C46m64p0M82j93l14K29N67o17l72P99j44n18K26J40n55m9O49l02l56M70O10
751E64q96L04Q11m13p55P22J33r16K65O02p13l17N26q3k48R7J78Q7m33P87n4m2
773B06L80j05k6o9KL55n52j30J1k52n42L60K81m68j22L88o6k04L38J40K86lP07
$$ plain form
796 915 584 289 741 859 146 172 424 -150 -367 -47 -492 -565 -761 -420 -590 -492 -292 -202 -376 395 373 459
818 459 697 639 508 538 776 169 377 -47 -308 -314 -645 -489 -766 -515 -550 -760 -202 -73 -163 439 748 400
840 400 585 903 577 634 741 312 145 205 -555 -438 -327 -821 -695 -635 -658 -476 -441 -133 97 488 735 692
862 692 843 1062 804 644 748 571 -107 -159 -103 -728 -713 -747 -818 -1065 -576 -650 -368 -189 203 198 522 819 736
885 736 641 932 627 438 414 -12 -250 -336 -776 -763 -710 -855 -703 -842 -382 -160 -34 -72 271 436 790 814 681
908 681 672 769 217 276 310 -721 -472 -379 -785 -881 -818 -656 -814 -693 13 -50 -223 703 777 482 832 1117 664
931 664 703 538 331 15 -105 -446 -486 -880 -659 -674 -980 -740 -167 -322 -236 167 493 530 516 838 833 253 771
954 771 694 142 -16 -41 -757 -908 -561 -760 -699 -482 -248 -472 -231 95 288 -41 506 653 302 693 590
$$ packed form
796I15l31k95M52J18p13K6K52n74k17L20m45p3j96L41j70R8K00R0j74P71k2Q6
818D59K38n8j31L0K38o07K08m24k61ol31J56k77K51l5k10N58J29r0O02L09l48
840D00J85L18l26N7J07m29j67O0p60J17J11m94J26O0k3J82L5L08K30L91K47m3
862F92J51K19k58j60J04j77o78n2N6o25J5l4p1k47M89p4K82J79L92nL24K97q3
885G36r5K91l05j89k4m26k38q6m40J3N3j45J52j39M60K22J26l8L43J65L54K4j33
908F81rR7n52N9L4j031K49R3m06r6O3J62j58J21P06o3j73R26P4k95L50K85m53
931F64L9j65k07l16j20l41m0l94K21j5l06K40N73j55Q6M03L26L7j4L22nn80N18
954G71p7n52j58k5p16j51L47j99O1K17K34k24K41L26J93l29N47J47l51L91j03
$$ plain form
975 590 454 172 421 263 -114 -562 -250 -264 -956 -491 -322 -782 -552 -21 -235 62 452 623 368 634 746
996 746 642 266 421 252 44 -318 -228 -355 -561 -573 -467 -641 -167 -296 -93 -11 84 279 119 528 942 331
1018 331 299 502 169 121 231 -173 -247 -450 -196 -493 -637 -336 -446 -329 -325 264 42 121 575 400 382 729
1040 729 270 418 339 289 -52 -124 -138 -136 -510 -436 91 -545 -619 -8 8 -391 420 32 401 257 666 472 280
1063 280 413 452 -152 -193 402 -271 -289 -76 -637 -472 -569 -456 -362 -354 1 -40 -45 363 582 195 84 722 441
1086 441 89 433 196 -35 -75 -179 -134 -263 -564 -138 -348 -303 -69 -124 -344 134 267 203 38 635 557 57
1108 57 365 280 -260 -158 47 -169 -381 -143 -309 -537 -214 -81 -168 -113 -109 145 -246 -178 756 158 307 559
1130 559 184 128 352 338 160 9 -207 -53 -518 -364 -187 -355 -288 -114 -129 -260 240 103 102 374 294 388 241
$$ packed form
975E90j36k82K49j58l77m48L12j4o92M65J69m60K30N31k14K97L90J71k55K66J12
996G46j04l76J55j69k08l62R0j27k06j2J06j74M74j29K03Q2R5J95j60M09M14o11
1018C31l2K03l33m8J10m04p4k03K54k97j44L01j10J17MN89k22P9M54j75j8L47
1040G29m59J48p9n0l41p2j4Kl74P4N27o36p4O11J6l99Q11l88L69j44M09j94j92
1063B80J33L9o04m1N95o73j8K13n61J65r7J13R4QL55m1nM08K19l87j11O38k81
1086D41l52L44k37k31m0j04M5j29l01M26k10M5K34n5k20M78J33o4j65N97p8n00
1108E7L08q5n40J02K05k16k12K38j66k28L23J33q7N5MK54l91O8R34n98J49K52
1130E59l75n6K24j4j78j51k16J54m65J54J77j68O7J74j5j31N00j37jK72q0R4j47
$$ plain form
1153 241 227 413 276 2 247 -116 -522 -97 -119 -731 -443 -69 -233 -132 -31 107 -220 73 552 208 237
1174 237 206 243 191 411 -11 267 -49 -262 53 -273 -146 -221 -485 -163 -158 -110 -61 -16 100 227 174 149 494 519
1198 519 398 149 348 134 -13 23 -295 -95 -242 -473 -134 -299 -212 78 -25 -84 263 68 339 267 466
1219 466 643 237 113 263 198 37 106 -1 -367 -145 -4 -343 -79 -237 -350 -300 -276 -11 204 349 391 542
1241 542 81 480 251 122 267 311 74 -43 -255 36 -283 -486 -335 -340 -256 -69 -195 -74 241 314 183 507
1263 507 486 488 370 160 339 296 -28 -120 54 -210 -278 -434 -600 -641 -400 -215 -184 -190 -17 149 -27 560 397
1286 397 233 347 12 87 264 21 -151 -171 -277 -261 -292 -271 -503 -348 -634 -302 -130 154 281 177 198 272
1308 272 391 702 419 94 393 15 32 -13 -246 -266 -437 -255 -550 -116 -85 -250 -126 145 34 190 78
$$ packed form
1153B41j4J86j37k74K45l63m06M25k2o12K88L74j64J01J01J38l27K93M79l44K9
1174B37l1L7n2K20m22K78l16k13L15l26J27p5k64L22NM8M9M5J16J27n3k5L45K5
1198E19j21k49J99k14j47L6l18K00j47k31L39j65Q7K90j03n9L47j95K71p2J99
1219D66J77m06j24J50o5j61O9j07l66K22J41l39K64j58j13N0K4K65K15J45M2J51
1241E42m61L99k29j29J45M4k37j17k12K91l19k03J51nQ4J87j26J21L15P3j31L24
1263E07k1Kj18k10J79m3l24r2J74k64o8j56j66m1K41J85L1oJ73J66j76N87j63
1286C97j64J14l35P5J77k43j72k0j06J6l1K1k32J55k86L32J72K84J27j04K1P4
1308B72J19L11k83l25K99l78J7m5k33k0j71J82k95M34L1j65J24K71j11J56j12
$$ plain form
1329 78 264 269 274 -40 186 262 65 1 -401 -233 -222 -180 -504 -278 -17 -299 -262 -3 -153 -215 350 374 477 237
1353 237 188 418 326 254 -40 -68 -398 -67 -337 -236 -282 -473 -217 -295 -66 108 -77 111 153 453 256 381
1375 381 442 205 380 231 32 104 58 -36 -149 -434 -172 -666 -397 -199 -164 -215 118 53 22 336 259 168 -7
1398 -7 664 44 190 133 245 -43 -229 -62 -484 -244 -503 -373 -537 -299 -271 92 178 378 116 352 215 341
1420 341 473 141 122 85 -89 -219 -63 -238 -193 -380 -222 -423 -374 -192 -87 96 39 -36 275 205 258 -71 312
1443 312 319 332 380 146 -115 -182 -337 -280 -311 -239 -261 -253 -234 -244 -231 -127 70 57 96 232 481 609 287 273 44 -134
1469 -134 -12 -73 -372 -291 -101 -269 -186 -326 -184 -178 -236 -42 229 94 70 500 317 257 332 519 108 -57 149
1492 149 296 -10 -247 -91 -49 -282 -297 -9 -238 13 -74 59 -19 -5 -204 375 220 247 275 11 285 255 93
$$ packed form
1329G8J86NNl14K26P6j97o4m02J68J1M2l24K26K61k82L7K59j50o2N65K4J03k40
1353B37m9K30r2p2k94k8l30L31k70J01m6j91K56p8K29J74j85J88M2L00j97J25
1375C81O1k37J75j49j99P2m6r4j13k85K62m94K69J98L5n1L33o5l1L14p7r1j75
1398gO71o20J46n7J12k88j86J67m22K40k59J30j64K38K8L63Q6K00k62K36j37J26
1420C41J32l32j9l7j74j30J56j75M5j87J58k01M9J82J05J83n7p5L11p0N3l29L83
1443C12PJ3M8k34k61o7j55N7l1P2k2QJ9j0J3J04J97j3L9J36K49J28l22j4k29j78
1469a34J22o1k99Q1J90j68Q3j40J42On8J94K71j35k4M30j83o0P5J87m11j65K06
1492A49J47l06k37J56M2k33j5K88k29K51q7J33p8J4j99N79j55K7K8k64K74l0j62
$$ plain form
1515 93 -93 -319 -281 -404 -437 -321 -160 -213 -167 45 -271 193 448 66 313 48 -36 208 161 261 341 224 -60
1538 -60 -156 -227 -280 -236 -216 -364 -143 -65 -168 -44 142 -18 149 37 337 245 308 254 125 144 86 -14 -144 -3
1562 -3 -41 -214 -317 -400 -356 -71 -153 -152 -147 20 -28 174 318 186 179 400 207 -25 139 96 -25 -106 -233 -205 -61
1587 -61 -435 -120 -238 -255 -50 -43 -145 20 144 32 122 422 244 182 164 345 -104 2 -254 63 -139 -184 -218
1610 -218 -339 -176 -155 -204 -223 -118 -261 327 43 -68 254 138 204 80 22 260 57 8 -57 -386 -201 -201 -390
1633 -390 -179 -448 -418 151 47 -2 32 372 360 -29 229 145 201 -103 -93 20 -29 -48 -140 -10 -250 -205 -327 -257
1657 -257 -22 -265 5 66 -80 128 -93 170 312 63 222 64 72 -133 14 -270 -308 -594 -280 -316 70 -208
1679 -208 -144 76 -31 167 137 241 -22 60 332 118 100 163 216 238 57 60 -197 23 -169 -339 -216 -470 -112
$$ packed form
1515I3j86k26L8j23l3J16J61n3M6K12l16M64K55l82K47k65q4K44m7J00Q0j17k84
1538f0r6p1n3M4K0j48K21P8j03J24J86j60J67j12L00r2O3n4j29J9n8j00j30J41
1562cl8j73j03q3M4K85q2JNJ67m8K02J44j32pK21j93k32J64m3j21q1j27K8J44
1587f1l74L15j18j7K05Pj02J65J24j12R0L00j78o2j8J81m49J06k56L17k02m5l4
1610b18j21J63K1m9j9J05j43N88k84j11L22j16O6j24n8K38k03m9o5l29J85%j89
1633c90K11k69L0N69j04m9L4L40j2l89K58q4N6l04J0J13m9j9r2J30k40M5j22P0
1657b57K35k43K70O1j46K08k21K63J42k49J59j58Qk05J47k84l8k86L14l6L86k78
1679b08O4K20j07J98l0J04k63Q2K72k14j8O3N3K2j81Lk57K20j92j70J23k54L58
$$ plain form
1702 -112 151 -19 161 49 98 162 259 193 290 309 8 124 298 -194 167 -232 -38 -470 -235 -163 -243 -46 -101
1725 -101 360 -208 140 204 -83 128 147 291 263 -26 73 82 217 270 -10 -251 -132 -245 -308 99 -195 -7 8
1748 8 -172 -286 -69 -17 149 162 42 52 20 -83 135 160 156 -74 -28 -239 -38 -241 -119 -162 -260 -128 -250 -77
1772 -77 338 614 83 142 132 213 183 -180 229 163 63 70 103 100 -258 -212 -280 -151 -28 -269 150 -119 -2 132
1796 132 61 429 351 177 135 278 -42 -45 8 -316 -152 -20 -262 -251 -239 -160 38 -345 168 -136 -193 33 145
1819 145 356 96 93 168 422 394 -148 98 79 19 110 -26 -315 -76 -248 -198 -326 -84 -232 -282 -110 303 -92
1842 -92 -57 207 156 218 419 3 78 -128 62 58 -33 -95 -175 -301 -133 -146 -339 -79 12 -56 340 178 260 268 524
1867 524 117 166 250 -200 283 -54 -49 -123 175 -387 -28 -358 -76 -34 -5 111 67 110 171 -26 79 322 218
$$ packed form
1702a12K63j70J80j12M9O4R7o6R7J9l01J16J74m92L61l99J94m32K35P2q0J97n5
1725a01M61n68L48O4k87K11J9J44k8k89R9RJ35N3k80k41J19j13o3M07k94J88J5
1748Hj80j14K17N2J66J3j20J0l2j03K18K5mk30M6k11K01k03J22m3r8J32j22J73
1772g7M15K76n31N9j0Q1l0l63M09o6j00PL3ll58M6o8J29J23k41M19k69J17J34
1796A32p1L68p8j74m2J43l20lN3l24J64J32k42J1J2P9J98l83N13l04n7K26J12
1819A45K11k60lP5K54k8n42K46j9o0R1j36k89K39j72N0j28K42j48n0J72M13l95
1842i2L5K64n1O2K01m16P5k06J90mr1o2q0j26J68j3j93K60R1o8L96j62Q2QK56
1867E24m07M9Q4m50M83l37Np4K98n62L59l30K82M2K9J16m4M3O1j97J05K43j04
$$ plain form
1890 218 57 115 264 -107 115 2 55 -184 -178 108 -104 46 -165 170 -19 141 63 99 161 126 198 142 -70
1913 -70 122 281 59 -135 71 -78 -178 -241 -198 -89 -322 -234 37 -80 126 177 -20 39 446 333 76 344
1935 344 377 222 -13 -19 41 -115 185 -80 -206 20 -205 -70 -181 -63 -218 231 50 131 157 69 102 220 189
1958 189 230 -94 -171 169 -46 114 -195 42 -490 22 26 -189 39 -31 -244 150 194 -83 178 130 134 188 -10
1981 -10 -6 61 139 -378 -329 38 -256 -237 -49 -279 -135 8 39 -112 76 183 -33 198 53 120 299 -79 -153
2004 -153 118 -33 -321 -57 -86 93 50 -148 -120 -241 -70 -128 90 -139 103 -55 123 188 430 56 -108 231
2026 231 -41 25 -1 -75 60 24 -214 -280 -187 -368 -92 -148 -33 -37 95 180 -87 26 187 118 293 133 37 250
2050 250 -16 -260 11 -142 -235 -365 -190 25 -41 -270 -195 173 191 -68 -61 -257 140 93 199 68 26 26 31 88
$$ packed form
1890B18j61N8J49l71K22j13N3k39OK86k12J50k11L35j89J60p8L6O2l5P2n6k12
1913g0J92J59k22j94K06j49j00o3M3J09k33Q8K71j17K06N1j97N9M07j13k57K68
1935C44L3j55k35oO0j56L00k65j26K26k25J35j11J18j55M49j81Q1K6q8L3J18l1
1958A89M1l24p7L40k15J60l09K37n32N12Mk15K28p0k13L94M4k77K61m8MN4j98
1981a0MO7P8n17M9L67k94J9J88k30J44J43L1j51J88J07k16K31j45O7J79l78p4
2004a53K71j51k88K64k9J79m3j98K8j21J71n8K18k29K42j58J78O5K42l74j64L39
2026B31k72O6k6p4J35l6k38o6R3j81K76n6J15mJ32Q5k67J13J61o9J75j60r6K13
2050B50k66k44K71j53r3j30J75K15o6k29P5L68J8k59Pj96L97m7J06j31m2%NN7
$$ plain form
2074 88 -92 23 179 216 -266 38 -283 -147 -99 51 46 145 235 216 -37 99 -11 244 64 126 69 -155 -99 38
2098 38 -199 -243 43 -289 -130 -23 -135 -128 44 -3 309 129 198 233 230 51 20 -3 82 11 -111 -6 116 -266
2122 -266 -72 24 -166 -5 32 6 90 -113 -82 226 326 -61 181 232 22 176 85 23 8 -47 -75 -85 -271 -35
2146 -35 -154 -38 -197 -152 12 7 257 -5 220 277 339 327 84 117 142 147 66 -78 119 84 -308 -250 155 -76 23
2171 23 -23 -60 168 -90 319 -115 80 251 -95 237 -30 98 -255 -109 -147 -122 -364 -230 59 -205 -91 -154
2193 -154 -504 -3 56 -181 -122 -26 98 -57 123 191 106 -102 98 48 -58 -163 33 -67 56 290 -74 -174
2215 -174 -181 -178 51 21 37 8 366 95 35 152 440 -43 38 -148 7 256 50 44 -281 -33 -74 13 -89 -161 -102
2240 -102 -99 -94 141 26 206 45 154 21 -86 252 -6 151 -138 -77 27 -76 -212 -227 72 -191 -297 -228
$$ packed form
2074H8j80J15J56L7m82L04l21J36M8J50nR9R0j9k53J36j10K55j80O2n7k24N6J37
2098C8k37m4K86l32J59J07j12PJ72m7L12j80O9L5lj79l1k3Q5p1j22J05J22l82
2122b66J94R6j90J61L7k6Q4k03L1L08J00l87K42N1k10J54r1o2j5n5k8j0j86K36
2146c5j19J16j59M5J64nK50k62K25N7O2j2k43L3K5Nq1j44J97l5l92N8M05k31R9
2171B3m6l7K28k58M09m34J95J71l46L32k67J28l53J46l8K5k42J34K89k64J14o3
2193a54l50N01N9k37N9R6J24j55J80O8q5k08K00n0j06j05J96j00J23K34l64j00
2215a74pLK29l0J6k9L58k71o0J17K88m83Q1j86J55K49k06ol25K48m1Q7j02p2N9
2240a02LNK35j15J80j61J09j33j07L38k58J57k89O1J04j03j36j5K99k63j06O9
$$ plain form
2262 -228 5 -7 244 -112 75 264 -15 91 198 188 108 -97 -66 -104 -204 31 -192 -206 -95 -65 -147 -102 28
2285 28 -30 57 64 170 -31 69 -43 -69 142 -91 -53 156 118 -7 -77 -6 -270 -62 47 -22 -78 -110 -168 23 -98
2310 -98 -46 165 -11 73 408 133 115 74 -110 -308 -140 -179 -125 -207 -178 -41 67 -44 -132 -34 -136 -145 146 -23
2334 -23 23 198 130 136 247 208 121 116 -105 -170 -80 -71 74 -109 -301 17 -211 -13 174 -87 204 120 332 -54 315
2359 315 179 -123 -40 566 35 -355 66 -146 -51 -13 -432 -198 -42 -151 -17 -128 126 -156 291 125 322
2380 322 136 303 175 239 139 -165 15 -67 -142 -192 -144 -211 -189 -309 -172 -284 -14 -13 -158 263 79 150 48
2403 48 -155 234 230 -65 266 67 -99 189 -108 -188 -176 -272 -348 -259 -2 267 -72 -90 147 26 89 70 69 -104
2427 -104 31 124 192 215 -40 -369 -48 -56 186 -141 -152 25 205 93 77 163 129 -19 353 8 -179 200 -15
$$ packed form
2262b28K33j2K51l56J87J89k79J06J07j0q0k05L1l8j00K35k23j4J11L0q2M5J30
2285B8n8Q7PJ06k01J00j12k6K11k33L8K09l8j25p0P1k64K08J09o9n6l2n8J91j21
2310i8N2K11j76Q4L35k75j8m1j84j98J68l9N4q2K9J37J08j11q8R8j02rK91j69
2334b3M6J75o8OJ11l9q7nk21o5R0RJ45j83j92L18k28J98J87k61K91q4K12l86L69
2359C15j36l02Q3O06n31l90M21k12R5L8m19K34J56j09J34j11K54k82M47j66J97
2380C22j86J67j28O4j00l04J80q2p5n0M8o7K2j20J37j12K70Jj45M21j84P1j02
2403D8k03L89mk95L31j99j66K88k97q0J2r6p6Q9K57K69l39j8K37j21O3j9jj73
2427a04J35R3O8K3k55l29L21qK42l27j1J77J80j12j6Q6l4j48L72l45j87L79k15
$$ plain form
2450 -15 -66 -53 -15 -45 -113 -47 -345 -273 -175 -291 -137 24 -179 -252 -36 129 -139 -115 130 -5 113 80 144 68 137
2475 137 -22 -133 130 -9 -307 58 115 -281 -84 -80 -124 261 177 101 89 299 312 -88 31 -27 -35 -55 -76 -302
2499 -302 -211 -64 138 -199 -53 115 96 -60 -149 -186 173 124 165 -6 -126 67 73 71 34 190 118 -142 -32 133
2523 133 -102 208 -103 -192 -108 80 -19 -87 -54 182 248 153 -20 -1 107 170 -29 -24 -48 -57 57 98 19 -79 -4 -150
2549 -150 177 -140 -145 67 13 61 5 174 -126 46 159 178 -109 102 -100 -112 51 -144 -216 58 -1 1 -65 -87
2573 -87 84 38 26 97 135 -27 199 -4 -98 213 -321 -55 211 24 85 -158 -120 -58 -30 -199 -92 -200 -32
2596 -32 -61 208 46 189 149 -31 78 -48 -19 -142 249 215 55 -214 126 135 -91 -47 -84 -33 -174 149 197 -131
2620 -131 40 70 -89 -146 103 -47 280 42 -111 159 158 2 -262 138 -303 -34 -318 -112 -99 -120 23 -108
$$ packed form
2450a5n1J3L8l0o8O6k98P2R8j16J54J61k03p3K16J65k68K4K45j35J18l3O4p6O9
2475A37j59j11K63j39k98L65N7l96J97Mm4L85q4p6j2K10J3m00J19n8qk0k1k26
2499c02R1J47K02l37J46J68j9j56q9l7L59m9M1j71j20J93Okl7J56p2k60J10J65
2523A33k35L10l11q9Q4J88r9o8L3K36O6r5j73J9J08O3j99Nk4rJ14M1p9r8P5j46
2549a50L27l17nK12n4M8n6J69l00J72J13J9k87K11k02j2J63j95p2K74n9Ko6k2
2573h7J71m6j2P1L8j62K26k03r4L11n34K66K66j87O1k43L8O2K8j69J07j08J68
2596c2k9K69j62J43m0j80J09j26K9j23L91l4j60k69L40Rk26M4l7N1j41L23M8l28
2620a31J71L0j59n7K49j50L27k38j53K70jj56k64M00m41K69k84K06J3k1J43j31
$$ plain form
2642 -108 73 -133 133 146 81 138 -96 -125 39 265 156 -47 -224 -150 232 -112 20 94 -233 -225 47 -226 151
2665 151 178 -18 63 167 52 164 105 -146 311 9 325 -130 -215 -256 -26 66 -168 -23 377 152 -74 168
2687 168 30 -147 125 274 340 234 -81 315 116 -99 -193 -97 250 73 -18 -182 -237 -238 184 -198 -178 -7 29
2710 29 -59 -1 73 142 272 230 214 190 43 31 -270 63 -148 -187 -188 -453 -225 17 -67 213 -36 138 11 -203
2734 -203 -33 111 166 -37 28 -39 19 65 -71 -104 -153 -33 -69 -106 -119 -134 -25 62 80 -26 35 126 -48 -5 -116
2759 -116 93 51 138 -36 9 -25 54 -135 -7 -39 -411 -71 -54 -192 -36 -24 -100 -153 -213 77 162 16 99 424
2783 424 -172 -38 122 63 -10 -21 -122 -96 124 -110 -97 -119 7 -9 -66 -110 71 39 159 -162 -101 92 -92 -140
2807 -140 -101 -16 -47 -85 42 93 128 -183 -187 38 122 -108 -2 -37 -217 242 56 -86 339 118 -49 287 173
$$ packed form
2642a08J81k06K66J3o5N7k34k9J64K26j09k03j77P4L82l44J32P4l27QK72k73L77
2665A51K7j96Q1J04j15J12n9k51M57l02L16m55q5m1K30R2k34J45M00k25k26K42
2687A68j38j77K72J49O6j06l15L96j99k15r4R6L47j77r1j64n5jM22l82K0J71L6
2710B9q8N8P4O9J30m2j6k4j47j2l01L33k11l9jk65K28K42q4K80k49J74j27k14
2734b03J70J44N5k03O5o7N8M6j36l3m9J20l6l7j3j5J09Q7J8j06O1R1j74M3j11
2759a16K09m2Q7j74M5l4P9j89J28l2l72L40J7j38J56J2p6n3o0K90Q5j46Q3L25
2783D24n96J34J60n9p3j1j01K6K20k34J3k2J26j6n7m4J81l2J20l21O1J93j84m8
2807a40L9Q5l1l8J27N1L5l11mK25Q4k30J06l5j80M59j86j42M25k21j67L36j14
$$ plain form
2830 173 -84 140 18 -98 -21 7 59 -234 -44 -59 139 74 -24 -139 -61 326 -125 -252 -4 213 32 164
2852 164 191 75 222 29 -243 -158 15 157 -265 -75 -87 -20 -189 86 14 14 55 222 60 275 -55 122 -91
2875 -91 -51 -306 60 38 -145 -82 -319 -357 158 -26 -94 -8 189 140 -112 -32 83 27 -8 -141 35 127 238 214
2899 214 4 -63 -256 -54 49 -20 -50 18 228 -127 -152 -186 288 -81 124 -77 -29 -76 195 -68 138 156 204
2922 204 -24 55 7 -195 163 -75 83 84 53 -115 -10 -48 51 208 -33 81 -5 122 -119 -163 38 -150 214
2945 214 -106 -95 264 126 14 -205 -209 120 -118 -68 85 63 -19 154 -58 -96 98 62 11 -213 -102 67 10
2968 10 -110 -207 17 7 -108 -57 -95 113 -105 110 68 132 -39 -128 -188 24 -55 86 -26 -19 216 -8 -130 -343
2992 -343 -64 -230 -84 -122 -96 -23 16 -237 -114 215 -92 197 229 66 105 -52 112 184 196 289 221 -152 -373
$$ packed form
2830A73k57K24j22j16P7K8N2k93J90j5J98o5r8j15P8L87m51j27K48K17j81J32
2852A64K7j16J47j93k72Q5J73J42m22J90j2O7j69K75p2%M1J67j62K15l30J77k13
2875i1M0k55L66k2j83O3k37l8N15j84o8Q6J97m9k52Q0J15n6l5j33J76R2J11k4
2899B14k10o7j93K02J03o9l0O8K10l55k5l4M74l69K05k01M8m7K71k63K06J8M8
2922B04k28P9m8k02L58k38J58Jl1j68J05l8R9J57k41J14q6J27k41m4K01j88L64
2945B14l20J1L59j38j12k19mL29k38N0J53k2q2J73k12l8J94l6n1k24J11J69n7
2968A0j20r7K24j0j15N1l8K08k18K15m2O4j71q9o0K12p9J41j12PK35k24j22k13
2992c43K79j66J46l8K6P3L9k53J23L29l07K89L2j63L9j57J64P2J2R3o8l73k21
$$ plain form
3015 -373 -57 -68 -208 -209 65 -86 67 -35 182 -58 -43 74 265 160 6 51 -14 -72 96 -169 -32 -143
3037 -143 106 12 99 241 -173 -126 -184 -99 103 72 238 -15 143 95 147 -51 81 137 268 -99 -2 -147 -36
3060 -36 -177 -37 -47 34 25 -84 75 151 233 -57 -269 -78 23 203 92 64 39 -34 -84 -379 193 -233 -222 39
3084 39 -165 -122 -170 122 3 277 390 -82 115 53 120 258 -8 60 -166 -110 13 -100 40 -12 84 -160 -103
3107 -103 -59 114 4 213 45 -11 -164 -191 -3 80 69 214 -143 74 103 -45 148 -329 264 -20 -21 190 -252
3130 -252 90 -3 -161 -114 -3 -97 391 -49 -288 2 -2 -59 35 -263 109 -137 -90 45 -159 -110 -129 -170 -233 -107
3154 -107 37 -163 7 -15 22 -17 61 9 55 -36 79 111 -62 -166 -149 -22 -261 -38 124 -223 165 -2 -210
3177 -210 273 -64 -23 249 8 176 98 152 279 -193 -31 2 101 167 -327 70 -148 -161 179 -148 -146 -23 51
$$ packed form
3015c73L16j1j40jK74j51J53j02K17k40J5J17J91j05j54M5o5n8J68k65J37j11
3037a43K49r4Q7J42m14M7n8Q5K02l1J66k53J58m8N2j98J32N6J31l67R7j45J11
3060c6j41J40j0Q1rj09J59P6Q2k90k12J91J01J80j11k8k5p3n0k95N72m26J1K61
3084C9k04M3m8K92j19K74J13m72J97o2O7J38k66O8k26N6J23j13J40n2R6k44N7
3107a03M4J73j10K09j68n6j53k7J88Q3j1J45l57K17K9j48J93m77N93k84jK11m42
3130b52L42r3j58M7J11r4M88m40k39K90mn7R4k98L72k46M7J35k04M9j9m1o3J26
3154a07J44k00J70k2L7l9P8n2M6r1J15L2j73j04J7J27k39K23J62l47L88j67k08
3177b10M83l37M1K72k41J68p8N4J27m72J62L3R9O6m94L97k18j3L40l27KJ23P4
$$ plain form
3200 51 -72 -149 -85 -72 -84 -129 -141 -80 184 32 -21 -326 -94 48 395 68 30 102 -144 25 -239 156 136 2
3224 2 245 -99 119 120 135 131 -2 340 158 203 92 -146 -330 89 -76 -78 -217 13 -46 -103 -64 53 3 112 81
3249 81 282 0 -179 -125 -4 -7 -16 221 -18 -207 -244 -62 54 -51 -167 -59 89 -112 48 -147 177 136 8
3272 8 -33 24 -120 37 130 139 47 128 56 92 -136 -32 5 -81 -28 11 -116 -158 3 88 122 -190 -77 153 100 -38
3298 -38 -142 -67 59 119 -55 306 -69 1 -70 239 -15 -117 -75 62 -202 200 -87 -37 22 -128 223 148 147 -24
3322 -24 51 37 -77 -71 -149 74 -66 -75 -116 -165 -176 31 16 10 -147 160 242 142 131 49 8 58 122 -34 64 41 112 -150
3350 -150 -2 -41 203 41 -154 51 -106 154 48 86 -123 177 146 14 -74 -263 -44 -33 -113 -14 -95 -112 -202
3373 -202 -259 -11 23 -100 -109 -100 71 309 121 -27 -108 -169 185 153 -196 2 108 330 30 -25 48 -266 69 16
$$ packed form
3200E1j23p7O4J3j2m5j2O1K64j52n3l05K32J42L47l27l8P2k46J69k64L95k0j34
3224BK43l44K18JJ5mj33L42j82M5j11k38j84M19j65kj39K30n9n7L9J17n0J09l1
3249H1K01k82j79N4J21lrK37k39j89l7J82J16j05j16J08J48k01J60j95L24m1j28
3272Hm1N7j44J57R3Rr2Q1p2L6k28J04L7q6N3L9j27m2J61Q5L4l12J13K30n3j38
3298c8j04P5J26O0j74L61l75P0p1L09k54j02M2J37k64M02k87N0N9j50L51p5jj71
3322b4P5j4j14Op8K23j40rm1m9j1K07j5oj57L07Q2j00j1q2m1N0O4j56R8k3P1k62
3350a50J48l9K44j62j95K05j57K60j06L8k09L00l1j32q8j89K19J1q0R9q1j7r0
3373b02n7K48L4j23rRJ71K38j88j48q1o1L54l2l49J98J06K22l00n5P3l14L35n3
$$ plain form
3397 16 322 -56 179 107 20 119 19 364 -42 -139 121 153 75 -5 71 56 -40 -5 297 -96 -51 -124 47 -104 -157
3422 -157 -205 21 -52 18 22 259 106 -46 -35 -66 -129 -301 -49 -66 -208 192 36 -215 -36 -214 -168 -150 -42 -166
3446 -166 -106 36 -196 -39 39 115 -110 -119 -138 -98 27 125 -63 -30 2 106 -80 -123 -72 -16 -212 31 50 67 -50
3471 -50 27 75 -32 264 -84 -147 170 221 106 -86 35 83 -55 -9 -75 3 -187 -51 -42 -339 147 190 -79 224
3495 224 41 -16 52 17 -71 94 -55 -149 23 1 86 -68 -133 -131 111 -180 -117 -26 108 145 -44 208 207 85 121
3520 121 121 34 -341 245 -1 144 98 -78 -165 -22 -149 -60 66 -151 -89 -30 103 -96 145 -130 75 105 28
3543 28 246 75 -154 228 -243 24 -98 -121 128 -27 -145 5 219 -15 195 -12 56 8 -64 130 47 79
3565 79 21 -70 -217 48 94 84 101 68 -3 -102 75 -6 -117 -248 142 107 42 -103 134 -7 -60 99 114 29 -96
$$ packed form
3397A6L06l78K35p2q7R9j00L45m06r7K60L2p8q0P6j5r6L5L02l93M5p3J71j51n3
3422a57m8K26p3P0MK37j53j52J1l1o3j72K52j7j42M00j56k51J79j78M6J8J08j24
3446a66O0J42k32J57P8P6k25rj9M0J25R8j88L3L2J04j86m3N1N6j96K43J9J7j17
3471e0P7M8j07K96l48o3L17N1j15j92J21M8j38M6o6P8j90J36Rk97M86M3k69L03
3495B24j83n7O8l5q8J65j49r4J72k2Q5j54o5KK42k91O3R1J34L7j89K52jj22L6
3520A21%q7l75N86k46J45m6j76q7J43j27Q9J26k17O2N9J33j99K41k75K05L0p7
3543B8K18j71k29L82m71K67j22k3K49j55j18J50K14k34K10k07O8m8p2J94q3L2
3565G9n8r1j47K65M6j0J7l3p1r9J77q1j11j31L90l5o5j45K37j41n3J59J5q5j25
$$ plain form
3590 -96 55 -153 16 -247 171 20 40 38 -50 -45 35 127 34 -17 12 0 -1 112 14 -81 102 109 38 -138 -39 -286 100
3617 100 -183 -88 -75 31 82 113 57 0 58 -194 -42 -41 136 -116 181 76 161 108 -62 -159 -94 163 61 -119
3641 -119 156 138 49 54 118 212 142 -182 -218 -132 -43 231 269 -207 52 81 119 -44 -107 145 75 98 4 -106 -10 -102
3667 -102 -228 -80 -24 -290 32 -131 -44 172 206 304 60 382 -218 -76 66 -22 54 137 214 200 -166 -89 91
3690 91 144 -192 -123 117 -83 25 131 110 92 169 100 -8 -32 -56 -173 170 65 -95 191 -59 -29 -32 53 24 -32
3715 -32 -45 22 -337 -1 211 90 -24 134 43 -30 58 205 -138 -78 -97 -143 -110 -173 -134 57 -186 -153 65 197
3739 197 -41 -71 107 -38 153 -85 -45 -79 64 77 -127 -42 -312 -308 -27 -76 167 -4 -184 -114 24 94 -77
3762 -77 353 25 307 280 -98 15 -77 21 -45 21 -81 -86 -271 -278 26 -177 176 181 -107 -183 -32 18 -167 -78 -18
$$ packed form
3590i6J51k08J69k63M18j51K0kq8NQ0R2r3n1K9j2jJ13r8r5J83Pp1j76R9k47L86
3617A00k83R5J3J06N1L1n6n7N8k52J52JJ77k52K97j05Q5n3j70r7O5K57j02j80
3641a19K75j8q9NO4R4p0l24l6Q6Q9K74L8m76K59K9L8j63o3K52p0K3r4j10R6r2
3667a02j26J48N6k66L22j63Q7K16L4R8k44L22o00J42J42q8P6Q3P7j4l66P7J80
3690I1N3l36O9K40k00J08J06k1j8P7o9j08k4k4j17L43j05j60K86k50L0lQ5k9n6
3715c2j3O7l59L36K12j21j14J58r1p3Q8J47l43O0j9m6L3o3L9J91k43L3K18J32
3739A97k38l0J78j45J91k38M0l4J43J3k04Q5k70MK81m9K43j71j80P0J38P0j71
3762g7M30l28K82k7l78J13r2R8o6O6j02nj85pL04k03L53Nk88p6J51N0j85Q9O0
$$ plain form
3787 -18 62 -56 234 36 -54 -159 170 -56 -20 -6 149 214 219 137 32 -19 132 -65 145 223 -31 80 -101 167
3811 167 -1 40 -176 298 -6 58 -224 -86 -32 -56 -87 111 -302 -29 -2 -125 -63 -271 -256 105 -133 2 42
3834 42 -57 -264 162 -27 18 106 109 130 -112 11 75 253 73 -82 209 -180 13 -79 -4 -266 76 193 142 -183
3858 -183 132 137 20 -62 6 -62 -186 321 -196 138 142 -238 -109 -97 -5 8 129 255 91 170 -108 -233 -56 -220
3882 -220 -151 144 155 -291 -280 -25 142 220 -63 9 75 -229 291 35 -97 144 -6 162 -85 190 135 260
3904 260 167 -96 33 -39 -75 -11 -83 186 -18 168 58 -16 -181 -214 177 -221 -134 133 132 90 -201 48 -43 -74
3928 -74 22 -196 -177 -78 -176 -204 -78 100 -327 8 90 -53 393 -77 -175 123 215 14 0 87 37 107 -110 -276
3952 -276 -15 42 -112 -158 -275 -122 127 125 -9 154 120 -69 -37 -60 -92 38 -146 3 148 -74 180 176 -130
$$ packed form
3787a8Q0j18K90j98r0j05L29k26L6J4J55O5Nq2j05n1J51j97K10P8k54J11j81K68
3811A67j68M1k16M74l04O4k82J38N4k4l1J98m13K73K7j23O2k08J5L61k38J35M0
3834D2r9k07M26j89M5Q8LK1k42J23O4J78j80j55K91l89J93r2P5k62L42J17n1l25
3858a83L15Nj17q2O8o8j24N07n17L34Ml80J29J2R2J3J21J26j64P9k78j25J77j64
3882b20O9K95J1m46J1K55J67P8k83P2O6l04N20k56j32K41j50J68k47K75n5J25
3904B60r3k63J29p2l6O4p2K69k04J86j10p4j65l3L91l98Q7K67jm2k91K49r1l1
3928g4R6k18J9R9r8k8J26J78m27L35Q2j43M46m70r8K98R2k01j4Q7n0P0k17j66
3952b76K61N7j54m6j17J53K49kj34J63l4j89L2k3l2J30j84J49J45k22K54ml06
$$ plain form
3975 -130 29 -183 -195 46 -21 108 -173 -55 -188 -322 32 151 -70 288 133 -33 -2 112 170 203 -49 -122
3997 -122 81 -176 -53 -1 -223 -80 -192 -10 -130 161 -299 29 -200 111 102 -177 -7 29 162 -151 -316
4018 -316 124 66 75 8 98 159 -231 -30 57 179 132 -56 52 -186 203 26 4 92 -24 78 312 -67 242
4041 242 -81 78 171 118 -49 -67 379 -76 33 -59 -69 163 -46 -78 -89 179 20 99 189 159 99 145 -214 -156
4065 -156 137 -2 -182 -58 -229 -8 -73 -41 -155 57 -16 -97 -122 58 57 -86 -67 14 28 -90 14 12 245 -204
4089 -204 -183 -82 -39 -118 -8 -123 1 -57 -160 210 -254 46 -18 -5 138 -86 47 32 -94 -55 51 -177 -22
4112 -22 -56 50 -80 -118 -49 165 -1 -68 197 -114 -150 123 74 145 117 3 -115 67 -2 -149 -131 -29 -68 98
4136 98 -46 -119 84 -61 175 25 94 -30 44 169 -122 88 -139 93 40 -124 -17 -42 -145 24 -18 183
$$ packed form
3975a30J59k12j2K41o7J29k81J18j33j34L54J19k21L58j55j66L1J14N8L3k52p3
3997a22K03k57J23N2k22J43j12J82j20K91m60L28k29L11rk79J70L6J33l13j65
4018c16M40n8Ro7R0O1l90K01Q7J22m7j88J08k38L89j77k2Q8j16J02K34l79L09
4041B42l23J59R3n3j67j8M46m55J09r2j0K32k09l2j1K68j59P9R0l0o0M6l59N8
4065a56K93j39j80J24j71K21o5L2j14K12p3q1k5J80jj43J9Q1J4j18J04kK33m49
4089b04K1J01M3p9J10j15J24n8j03L70m64L00o4J3J43k24J33j5j26L9J06k28J55
4112b2l4J06j30l8O9K14j66o7K65l11l6K73m9P1k8j14j18J82o9j47J8J02l9J66
4136I8j44p3K03j45K36j50O9j24P4J25k91K10k27K32n3j64J07k5j03J69m2K01
$$ plain form
4158 183 370 52 -130 -95 -189 129 -64 78 -83 25 -19 -162 46 51 -36 -71 5 -74 -43 -262 49 207 87
$$ packed form
4158A83J87l18j82L5r4L18j93J42j61J08m4j43K08Nq7l5P6p9L1k19L11J58j20
$$ [...]
8191B26
##END NTUPLES=NMR FID
##END=
