##TITLE=1H_LR-778-R8-RMC3
 CDCl3
 8 sc, 
 1.11.2023
##JCAMPDX= 6.0         $$ Bruker NMR JCAMP-DX V2.0
##DATA TYPE= NMR FID
##DATA CLASS= NTUPLES
##ORIGIN= UXNMR, Bruker Analytische Messtechnik GmbH
##OWNER= root
$$ XWIN-NMR		Version 3.5
$$ Wed Nov  1 15:37:08 2023 Russian Standard Time (UT+4h)  she@DPX200
##.OBSERVE FREQUENCY= 200.13135
##.OBSERVE NUCLEUS= ^1H
##.DELAY= (6, 6)
##.ACQUISITION MODE= SIMULTANEOUS
##.ACQUISITION SCHEME= undefined
##.AVERAGES= 8
##.DIGITISER RES= 18
##SPECTROMETER/DATA SYSTEM= spect
##.PULSE SEQUENCE= zg30
##.SOLVENT NAME= DMSO
##.SHIFT REFERENCE= (INTERNAL, DMSO, 0, 15.7039)
##AUDIT TRAIL= $$ (NUMBER, WHEN, WHO, WHERE, WHAT)
$$ ##TITLE= Audit trail, XWIN-NMR		Version 3.5
$$ ##JCAMPDX= 5.01
$$ ##ORIGIN= Bruker BioSpin GmbH
$$ ##OWNER= she
$$ F:/spectra/data/she/nmr/H-F/1/audita.txt
$$ ##AUDIT TRAIL=  $$ (NUMBER, WHEN, WHO, WHERE, WHAT)
(   1,<2023-11-01 15:35:42.96 +0400>,<she>,<DPX200>,
      <created by zg, POWCHK disabled, PULCHK disabled
       configuration hash MD5:
       00 E9 B6 7A A2 85 ED C7 34 08 36 98 17 FE 4E 26
       data hash MD5: 16K
       5F B3 FA 55 3C 55 03 86 2F 79 E5 BB 39 8C 04 F8>)
$$ ##END=
$$ 
$$ hash MD5
$$ 1D 61 3E D5 A4 98 08 CA 41 E6 9F F5 E6 60 A2 46
##$RELAX= 
##$RELAX= 
##$RELAX= 
##$RELAX= 
##$RELAX= 
##$RELAX= 
$$ Bruker specific parameters
$$ --------------------------
##$DU= <F:/spectra>
##$EXPNO= 1
##$NAME= <H-F>
##$PROCNO= 1
##$TYPE= <nmr>
##$USER= <she>
##$AMP= (0..31)
100 100 100 100 100 100 100 100 100 100 100 100 100 100 100 100 100 100 
100 100 100 100 100 100 100 100 100 100 100 100 100 100 
##$AQSEQ= 0
##$AQ_mod= 1
##$AUNM= <au_zg>
##$AUTOPOS= <>
##$BF1= 200.13
##$BF2= 200.13
##$BF3= 200.13
##$BF4= 200.13
##$BF5= 200.13
##$BF6= 200.13
##$BF7= 200.13
##$BF8= 200.13
##$BYTORDA= 1
##$CFDGTYP= 0
##$CFRGTYP= 5
##$CHEMSTR= <none>
##$CNST= (0..31)
1 1 145 1 1 1 1 1 1 1 1 1 1 1 1 1 1 1 1 1 1 1 1 1 1 1 1 1 1 1 1 1 
##$CPDPRG= <>
##$CPDPRG1= <>
##$CPDPRG2= <>
##$CPDPRG3= <>
##$CPDPRG4= <mlev>
##$CPDPRG5= <mlev>
##$CPDPRG6= <mlev>
##$CPDPRG7= <mlev>
##$CPDPRG8= <mlev>
##$CPDPRGB= <>
##$CPDPRGT= <>
##$D= (0..31)
0 1.2 0 0 0 0 0 0 0 0.06 0 0.03 0 0 0 0 0.0002 0 0 0 0 0 0 0 0 0 0 0 0 
0 0 0 
##$DATE= 1698838542
##$DBL= (0..7)
120 120 120 120 120 120 120 120 
##$DBP= (0..7)
150 150 150 150 150 150 150 150 
##$DBP07= 0
##$DBPNAM0= <>
##$DBPNAM1= <>
##$DBPNAM2= <>
##$DBPNAM3= <>
##$DBPNAM4= <>
##$DBPNAM5= <>
##$DBPNAM6= <>
##$DBPNAM7= <>
##$DBPOAL= (0..7)
0.5 0.5 0.5 0.5 0.5 0.5 0.5 0.5 
##$DBPOFFS= (0..7)
0 0 0 0 0 0 0 0 
##$DE= 6
##$DECBNUC= <off>
##$DECIM= 32
##$DECNUC= <off>
##$DECSTAT= 4
##$DIGMOD= 1
##$DIGTYP= 9
##$DL= (0..7)
0 120 120 120 120 120 120 120 
##$DP= (0..7)
150 150 150 150 150 150 150 150 
##$DP07= 0
##$DPNAME0= <>
##$DPNAME1= <>
##$DPNAME2= <>
##$DPNAME3= <>
##$DPNAME4= <>
##$DPNAME5= <>
##$DPNAME6= <>
##$DPNAME7= <>
##$DPOAL= (0..7)
0.5 0.5 0.5 0.5 0.5 0.5 0.5 0.5 
##$DPOFFS= (0..7)
0 0 0 0 0 0 0 0 
##$DQDMODE= 0
##$DR= 18
##$DS= 0
##$DSLIST= <SSSSSSSSSSSSSSS>
$$ [...]
##$SUBNAM2= <"">
##$SUBNAM3= <"">
##$SUBNAM4= <"">
##$SUBNAM5= <"">
##$SUBNAM6= <"">
##$SUBNAM7= <"">
##$SUBNAM8= <"">
##$SUBNAM9= <"">
##$SW= 18.05172834244
##$SWIBOX= (0..15)
0 0 2 0 0 0 0 0 0 0 0 0 0 0 0 0 
##$SW_h= 3612.71676300578
##$TD= 16384
##$TD0= 1
##$TE= 0
##$TE2= 300
##$TE3= 300
##$TEG= 300
##$TL= (0..7)
0 120 120 120 120 120 120 120 
##$TP= (0..7)
150 150 150 150 150 150 150 150 
##$TP07= 0
##$TPNAME0= <>
##$TPNAME1= <>
##$TPNAME2= <>
##$TPNAME3= <>
##$TPNAME4= <>
##$TPNAME5= <>
##$TPNAME6= <>
##$TPNAME7= <>
##$TPOAL= (0..7)
0.5 0.5 0.5 0.5 0.5 0.5 0.5 0.5 
##$TPOFFS= (0..7)
0 0 0 0 0 0 0 0 
##$TUNHIN= 0
##$TUNHOUT= 0
##$TUNXOUT= 0
##$USERA1= <user>
##$USERA2= <user>
##$USERA3= <user>
##$USERA4= <user>
##$USERA5= <user>
##$V9= 5
##$VALIST= <valist>
##$VCLIST= <CCCCCCCCCCCCCCC>
##$VD= 0
##$VDLIST= <DDDDDDDDDDDDDDD>
##$VPLIST= <PPPPPPPPPPPPPPP>
##$VTLIST= <TTTTTTTTTTTTTTT>
##$WBST= 1024
##$WBSW= 4
##$XGAIN= (0..3)
0 0 0 0 
##$XL= 0
##$YL= 0
##$YMAX_a= 22164
##$YMIN_a= -26288
##$ZGOPTNS= <>
##$ZL1= 120
##$ZL2= 120
##$ZL3= 120
##$ZL4= 120
##$ABSF1= 10
##$ABSF2= 0
##$ABSG= 5
##$ABSL= 3
##$ALPHA= 0
##$AQORDER= 0
##$ASSFAC= 0
##$ASSFACI= 0
##$ASSFACX= 0
##$ASSWID= 0
##$AUNMP= <proc_1d>
##$AZFE= 0.1
##$AZFW= 0.1
##$BCFW= 1
##$BC_mod= 2
##$BYTORDP= 1
##$COROFFS= 0
##$CY= 11.3945322036743
##$DATMOD= 1
##$DC= 2
##$DFILT= <>
##$DTYPP= 0
##$F1P= 15.7292609196834
##$F2P= 12.9074282941183
##$FCOR= 0.5
##$FTSIZE= 0
##$FT_mod= 4
##$GAMMA= 1
##$GB= 0.15
##$INTBC= 1
##$INTSCL= 1
##$ISEN= 128
##$LB= 0.24
##$LEV0= 0
##$LPBIN= 0
##$MAXI= 10000
##$MC2= 0
##$MEAN= 0
##$ME_mod= 0
##$MI= 1.114404
##$NCOEF= 0
##$NC_proc= 0
##$NLEV= 6
##$NOISF1= 3.799351
##$NOISF2= 2.8
##$NSP= 1
##$NTH_PI= 0
##$NZP= 0
##$OFFSET= 15.70392
##$PC= 1
##$PHC0= -23795.79
##$PHC1= 22.6527
##$PH_mod= 1
##$PKNL= yes
##$PPARMOD= 0
##$PSCAL= 0
##$PSIGN= 0
##$REVERSE= no
##$SF= 200.130013532006
##$SI= 16384
##$SIGF1= 3
##$SIGF2= 2
##$SINO= 400
##$SIOLD= 16384
##$SREGLST= <1H.CDCl3>
##$SSB= 0
##$STSI= 0
##$STSR= 0
##$SW_p= 3612.71676300578
##$SYMM= 0
##$S_DEV= 0
##$TDeff= 0
##$TDoff= 0
##$TI= <>
##$TILT= no
##$TM1= 0
##$TM2= 0
##$TOPLEV= 0
##$USERP1= <user>
##$USERP2= <user>
##$USERP3= <user>
##$USERP4= <user>
##$USERP5= <user>
##$WDW= 1
##$XDIM= 8192
##$YMAX_p= 0
##$YMIN_p= 0
$$ End of Bruker specific parameters
$$ ---------------------------------
##NTUPLES= NMR FID
##VAR_NAME=  TIME,          FID/REAL,        FID/IMAG
##SYMBOL=    X,             R,               I
##VAR_TYPE=  INDEPENDENT,   DEPENDENT,       DEPENDENT
##VAR_FORM=  AFFN,          ASDF,            ASDF
##VAR_DIM=   8192,          8192,            8192
##UNITS=     SECONDS,       ARBITRARY UNITS, ARBITRARY UNITS
##FACTOR=    0.0002768,     1,               1
##FIRST=     0,             0,               0
##LAST=      2.2672688,     0,               0
##MIN=       0,             -26288,          0
##MAX=       2.2672688,     22164,           0
$$ Real data points
##PAGE= N=1
##DATA TABLE= (X++(R..R)), XYDATA
0@%%%%%%%%%%%%%%%%%%%%%Qj6J6j6J6j6J6k4L2l2L5m3M8n6O4p0P8q8R6j04J20
42F4j36J52j68J84k00K20k44K69k96L25l59L95m35M83n35N93o62P44q39R53j096
63e88J281j526J869k390L284n232J7480j1332j7817K4138r819K282K0534j2970
77I194k3913J4037O558m100Q676l156j8166N767R969k626J884j073j1078K525
91e502P151O0J656k732p402L695L388r06M807j977r169M397N225m409L848L377
107E507j0263N5R063m243p66O976p883n040J0220l24m625N948l271p203O922L779
123D852m483K267n45o504L712N814l585q18J076m762J411N657k508j908Q37l394
139b881J330M821k734k264J508k187M44M250j940l303J907m8r18L413o22m100
$$ y = [0, 0, 0, 0, 0, 0, 0, 0, 0, 0, 0, 0, 0, 0, 0, 0, 0, 0, 0, 0, 0, 0, 8, -8, 8, -8, 8, -8, 8, -16, 16, -16, 19, -24, 24, -32, 32, -38, 40, -48, 48, -56, 64, -72, 80, -88, 96, -104, 116, -128, 141, -155, 170, -189, 206, -229, 254, -281, 312, -350, 394, -445, 508, -588, 693, -833, 1036, -1354, 1930, -3302, 14178, 2846, -14971, 9167, -652, 1630, 22164, 9194, -14719, -682, 5876, 1776, 10452, 7296, -10870, -5103, 4866, 2240, 4124, 3051, -8027, -5502, 1649, 1709, 3365, 633, -6769, -3074, 314, -592, 4215, 2238, -6931, -2534, 2691, -1718, 2130, 5507, -4756, -4701, 4362, 119, -647, 6329, -1554, -6594, 3626, 3302, -1323, 4625, 1354, -5849, 1073, 4852, 369, 2636, 2091, -4413, -701, 5113, 1528, 710, 1786, -2976, -1565, 4092, 1584, -324, 513, -2881, -1551, 3270, 536, -1728, -220, -2407, -1963, 2287, 347, -2956, -1049, -1097, -2015, 1398, 776, -3324]
155c324K154J777k140K279Q70m234J322L132j901J46J368k525o7K851o78j105
171g5J026j161j051K501L01k069P14lj395J638P30j568L30j78r62J423O48j094
189b45M9M8p75P56J167p10o13L22o12L25J562p19j008O02p24K5J892o04j407L32
209c37k89J4J345Rj340l03J97N8R56O55j488p73Q39N0N13R78j110r59M60L30P84
230E89N55r74p57J05M19P57L16n69r16k68O22O86L16n93j082P2M96L89P94o04
250C53j371K26O50M00P10n03j168kO44O20L56l01r22m73Q92P13k74m3o06p65P09
271a55Q17j04m43o81j71L82N00L05m86o62P1R4M79O28n37o32J35K81K91J87M3
292C42l01m65M12M68j56N9k10m22M09K23j67K8j54k60QJ66K63k12k79K17k85k6
$$ y = [-3324, -1170, 607, -1533, 746, 1616, -2618, -1296, 1836, -65, 81, 1449, -1076, -1143, 1708, 1030, -75, 951, -210, -1261, 1240, 1541, -528, 186, 183, -1212, 426, 1156, -412, -82, -260, -1222, 201, 849, -245, -196, -148, -923, -167, 1000, 290, -323, -1, -613, -288, 1274, 555, -453, 149, -575, -550, 1342, 738, -669, -337, -626, -612, 733, 742, -598, -901, -704, -646, 310, 965, -523, -1296, -457, -407, 106, 1084, -26, -985, -525, -195, 589, 1144, 170, -587, -482, -63, 694, 1010, 441, -475, -743, -121, 565, 881, 288, -794, -722, -226, 163, 957, 353, -1018, -792, -142, 258, 968, 465, -703, -705, -61, 559, 915, 614, -308, -781, 111, 824, 550, 507, -99, -864, -155, 662, 558, 115, -566, -737, -355, 145, 450, -36, -698, -627, -533, -54, 574, 37, -595, -460, -179, 112, 299, 342, 41, -424, -12, 456, 300, 359, 149, -273, 136, 359, 192, 220, 66, -194, -186, -20, 243, 31, -248, -31, -316, -342]
314c42N01j18k07Q7o1j2J78J73n0k42K02J19k15K80j07l35M40J39m04J0O1l1k1
337D5K5K8l75k9L73o7j61q6k96K28M11o7j46k61m9K30K29L76k17o24J86L30O4
360A47L86j31n23j00K21L53J61j69l14l97K17N21n0m4k26o35K66O31P0j35l96
381a47l30K36L65M19q4n84k13O5M56M97k10n36k08k1M82L02q1l71n94P9O74J01
403B97j09l02n86M5N77L07J1m91m83Q9M86N65j79m18j40j96M02P64j83n00j72
424b16j33M20N06j17l21m15o9L50L52Q4m30m86J18K20K52J94m18m10jK36M99L3
446B48n00j27n2J71N32ql07k08j03L31M11M1l37l74J67K41P4L24l48o51K90L12
468A27pJ81k70m86J60K62J21Pj75k88j17M57K80l58J2q7k31M12L12k01j46j99
$$ y = [-342, 159, 41, -166, -79, -140, -152, 26, 199, 149, -93, 109, 228, 13, 293, 186, -149, 291, 430, 26, 36, 97, 66, 45, 70, 98, -277, -306, 67, 0, -161, -247, -543, -315, 96, 29, -117, -378, -427, -197, 32, 408, 191, -433, -247, 83, 147, 533, 402, -121, -221, 0, 353, 514, 345, 31, -366, -149, 372, 322, 278, 52, -583, -317, 314, 384, 249, -147, -477, -241, 124, 543, 459, -125, -338, -273, 183, 680, 470, -66, -274, -295, 187, 489, 408, 37, -557, -478, 196, 297, 188, -114, -700, -655, -78, 229, 240, -251, -734, -645, -159, 406, 227, -191, -331, -527, -125, 639, 456, -44, -216, -349, 71, 577, 460, 139, -276, -345, 5, 357, 441, 11, -475, -357, -137, 115, 309, -109, -519, -520, -284, 215, 248, -252, -379, -431, -260, 272, 264, -43, -251, -354, -23, 388, 429, 92, -282, -115, 126, 200, 524, 176, -475, -185, 127, 120, 301, 31, -455, -295, -33, 88, 95, -80, -368, -485, -28, 252, -106, -94, -181, -412, 0, 312, 111, -35, -234]
490b34O3L78O9o8j97k32J60J91J69j0l87j42J59K01J91k57k22O4n7K48L71l73
512H5l07J24K2K80K30k10l56j1J99J50J56Kn63k08N53N1n2Q3n09k83L84K67J7
535A04j69m10j33K21M12Q5l44k39q1K21O01Pl16k11j07L89M32m2r7l28k76N40
557B59L95j09k45l30p8K90L84k8m13k88m5J14N47M3p14j31R3K2M65J10n51k26
579d36L1K28L55J03l75l68J12L19J40J76j98n66J36L64J52J42l24m03J30K24L10
600B52J31l92l47Q5L25L68l5k93k61j7M15K84o0j62m59O4N60O4j14j28m19K2M31
623C14J48r3l26l27M4K72K57j77l52n4j19J66M56j96l48n8k4K61K67n2j85k06
645c32M5L52J53K5k03k95K14K44Q8Q1k55k66J00K04K23k6l87n9k2J32K88q2k78
$$ y = [-234, -171, 207, 276, 208, 11, -221, -61, 130, 299, 289, -98, -240, -81, 120, 311, 54, -168, -104, -161, 87, 458, 85, -222, -98, -76, 204, 434, 224, -132, -143, 56, 206, 362, 364, -199, -407, 146, 197, 145, 228, -281, -564, -180, 87, 104, -65, -475, -608, -387, 25, 110, -234, -473, -554, -333, 268, 275, -41, -252, -359, 30, 462, 420, 323, -5, -281, 259, 654, 545, 300, -30, -108, 182, 566, 538, 125, -163, -208, -94, 453, 496, -218, -349, -256, -234, 231, 341, -210, -436, -405, -177, 178, 281, -94, -462, -350, -31, 109, 285, 87, -479, -343, 21, 173, 315, -9, -412, -282, -58, 252, 383, -9, -356, -271, 54, 422, 387, 94, -167, -184, 231, 515, 455, 293, -166, -102, 458, 522, 408, 280, -139, -117, 314, 462, 369, 43, -284, -240, 32, 289, 112, -240, -294, -413, -247, 209, 13, -335, -393, -417, -156, 111, 59, -126, -332, -287, 65, 218, 243, 40, -255, -41, 203, 291, 372, 117, -149, -49, 155, 378, 352, -35, -94, -116, 16, 304, 222, -56]
668e6j53l0K20K42j07j96k55J14K58M7P4j14l64J00L30N7Oj75k09J0K07K27j10
691A23j92r4j26K38K93k31j62Mj60K02K74j00j66j38L1K21J01M1j28j88O7J48
713E8J67Q4k51j72Q2J16K28p6k41k1j56J54L48j27k98m6m3R8K27k3k16j61P3J32
737f4J23J37k26k59K25J20J5J89j21k64P4J31J95m9j62j12m9J25K28q9r4j74j19
760b20K05J10oj33k29N6J50L1J81j42l32J61J78M9R9r4j69rJ37J61Jj00n5j76
784a46J94K21j45q0o5j36J29J80k2j39j85M0R9K7J24j16k16J19L2J00J28j48j18
807a23O8P7J33k7k2n3j32J22J76j17l7n2j08J20P1j3k7j66k1P5N7N7j19j19J09
832g1j0K7J05p7q6M5O5Q2l5m6K4p2R6J12j00N0p9j04J51O5j11K1p1j8K8J6N8j44
$$ y = [-56, -209, -239, -19, 223, 116, -80, -335, -221, 37, 84, 158, 44, -320, -220, 110, 167, 173, -2, -211, -201, 6, 233, 123, -69, -163, -289, -51, 242, 11, -151, -147, -307, -105, 169, 69, -97, -235, -204, 17, 118, 159, 31, -157, -90, 58, 225, 309, 58, -114, -32, 84, 312, 236, -5, -26, -182, -28, 320, 193, -105, -151, -194, -96, 131, 108, -108, -269, -196, -64, 59, 196, -30, -289, -64, 56, 71, 260, 139, -125, -51, 80, 275, 226, 64, -48, -97, 28, 256, 167, 73, -101, -220, -15, 95, 89, -44, -273, -217, -67, -36, 145, 3, -329, -168, 10, 59, 158, 64, -105, -114, 23, 184, 185, 85, 30, -146, 48, 269, 124, 44, -21, -157, -28, 152, 130, -9, -194, -154, -55, -28, 96, -20, -236, -117, -85, 15, 143, -5, -123, -55, 22, 155, 128, 106, 53, -79, 43, 219, 102, 65, 13, -95, 25, 96, 83, 56, -110, -131, -56, 1, 58, -61, -180, -71, -81, -54, 51, -26, -112, -67, -2, 80, 45, -1, 23, -49, 47, 159, 59, 109, 30, -74, 77, 142, 31, 52, -19, -37, -9, 7, 65, -79]
860g9p8J38j6K6M8j10rM1K3J07o1o2K9K7J08K4j52M4J6n4J19j6j02l5l6J00K3
887F3j06J7r6JJ02n2J3K2j63M2J46j0J0p4K8K5K3J30J2j58L9L7J7J64r0j07O8
914A03o3P2P1r1m5j02L2J28n2m4j3j48N6J10k1K9j34n5J10L2J01n7j63R8oN6J68
941A72j51j20O6M4N5M7q4j9j11P4J42n7l0q3j19J66Q4p6jn4n1M8R2P5j22j19J16
968a6N7J8R9j05q5L3N0Q2on7q5o1Q7J20j14L4j06j48J72J00p5o8m4l0P4O2K7o0
996d5r2L6N3J40M1j50j2M6PJ09L0j08j2q0J01J52j25p0k5l7O6P7k9r8p1K7L3N0
1024A4M3j58n5J19m1P3J27j70p5J12K6Q7K5j13l3L6O1P7n4k8r6oJ66m6l5Mj26
1051f6RJ23n0O2j01j23Q6P1kJ7p7n1K7P8J12q7o4Ol3J77L6j03rn1p3J94K2j19
$$ y = [-79, -157, -19, -35, -9, 39, -71, -80, -39, -16, 91, 30, -32, -3, 24, 132, 156, 4, 48, 64, 10, 129, 113, 11, -24, -60, 40, 63, -43, -26, -122, -121, -19, -71, -58, -36, -199, -157, -11, -21, -11, -85, -57, -32, -9, 121, 133, -25, 14, 51, 68, 232, 142, 35, 103, 40, 112, 183, 92, 47, -55, -23, 105, 53, 9, -4, -152, -96, 14, -7, 22, -112, -167, -57, -25, 76, 19, -144, -46, -52, 4, 172, 21, -99, -33, 11, 66, 113, 29, 10, -101, -27, 115, 58, 28, -55, -174, -8, 76, 0, -1, -55, -106, -58, 34, 109, -13, -132, -16, 41, 59, 158, 53, -32, 1, 51, 133, 127, 70, -15, -76, 11, 131, 17, 51, -55, -203, -31, 69, -6, -74, -118, -148, -74, -12, 15, -45, -137, -101, -48, 92, 133, -17, -29, 17, 24, 133, 163, 55, 43, -37, 64, 216, 91, 21, -4, -41, 25, 102, 73, -25, -96, -69, -36, 14, 57, -101, -156, -37, -78, -5, 122, -48, -123, -11, 15, 102, 127, 14, -19, 17, 78, 155, 101, 73, -23, -29, 137, 91, 56, 60, -66, -57, 66, 16, 78, -23, -146, -60, 11, 9, 26, -51, -102, -75, 3, 115, 28, -36, -30, -63, 114, 150, 47, 38, -13, -86, 108, 130, 11]
1079A1k3m9JR0J1k0j00j1J3P5R6n9j45L4L2K1J51o5r4J8j6J35P3j05n3j5j2J11
1107A05Qk0n0j29N9Q9Pl8j37l3O8K1P2Oj99oR6M6R1p7p9K6K4J09L9n9m8n6P4J50
1137A59n4j8l5j12P0R9j7lj32l1N5M7L7m1j30J2J9N4J03j04p9j0N2R5L9o7lp1
1165f6K5J45kl8l1p7O4R6l9j6o7m7pQ7L1m5j25N5qL2O2q4j6l4j1J52L5q5m0l2
1195h6N0J13j1rm7p8R9R2k5m3o0J2L5MO5p4j16N2k9O1N0q3p4M6k0O6J7j8m8n8
1225a17P2Q8k6qj2n3O1M6L1j9j11J5O9oQ7n1j11M3k3K1P1p4r0L8K4N6pk2n8l1
1255i7Q8O1m5K4m2m6J19J4l4K3q3qP8LK3l8p4L2J5K0K3m9l4m3kP8Jq9N0q8N7P9
1287A6o1K7j7n4J02N7k4k0k4MK9N2L9o4n5M2n8Q9M0j48KJ6j5O8oj11nMK9N9k7
$$ y = [11, -12, -61, -60, 30, 41, 21, -79, -90, -77, -2, 94, 35, -110, -76, -44, -23, 128, 63, -31, -13, -29, 106, 179, 74, 21, 6, -6, 105, 113, 93, 43, -86, -27, 62, 69, 31, -106, -139, -71, -50, 22, 28, -171, -177, -81, -35, 56, -21, -100, -74, -50, 59, 98, 39, -9, -65, 9, 159, 105, 87, 52, -60, 10, 109, 92, 89, -43, -74, -19, 28, 65, 24, -106, -94, -75, -21, 82, -22, -101, -111, -59, 36, 75, 8, 5, -66, -41, 104, 102, 64, 33, -44, 20, 116, 77, 61, -6, -53, -60, 27, 58, 13, -112, -57, -65, -33, 29, -55, -71, -105, -116, 36, 71, -14, -54, -86, -36, 77, 66, 57, 10, -68, 31, 123, 98, 55, -5, 7, 42, 46, 111, 37, -79, -27, -56, 5, 55, -28, -102, -56, -76, -10, 7, -11, -59, -117, -45, 43, 17, 9, -3, -56, 5, 51, 82, 63, -48, -33, 36, 30, 117, 66, -45, -2, -25, -4, 67, -7, -97, -59, -35, 21, 14, -8, -66, -97, -9, 52, 7, 31, -11, -57, 62, 76, 42, 65, -18, -26, 52, 55, 78, 40, -34, -2, 13, 33, 56, 7, -27, -70, -72, 6, 7, -82, -32, -120, -63, 16, -45, -18, -35, -89, 13, 70, 46, 26, 2, 6, 35, 87, 126, 62, 7, 49, -9, 80, 120, -28, -26, -10, -25, 43, 37, -74, -79, -75, -46, 13, -14]
1318a4l1j6j9N5K2L2j3r9N1Q7JKl0m2M6rM8J0n7n9O0j1O0l5k8n2l4O6K0%l7o5
1350i1j3J11J2n4N3p5OR1K5Nl6n5K4M2K1Po6j8k8K8Q4j3q3Mm7L7O1m9Qp4j8J09
1382HoOk0l9J6K8L7L8p4lM3j5O6%p9RJ6l3Q0l6m0nl2L6M5n6j5m2j1O3j3J0Nl2
1416d5%L0N0J6m4m8K4PN7M0j01M1Pj5L4Qk6k5j6PM8n0Mm1J2L6l5MK2r2K3L0K3
1449a5L6m6j9L9J7J2Oj5J5KK6Nj9l3K0J2k0J3j9J6k0l5L7j7j2rk8J4K3l5M1oo
1482b0J3l1O2o1J9M5Ll1PJ8j4K7qmKm5K1j4M5j3q1N7Ll2L8j5k0J3l7N7M9o7Mk
1516a2j7P3loOn2J6L3k2N1n0l1L3MK6jr3lM6K8l8Om7Oj8K5L8k9mk2K4O9m7L3L0
1551E2p7N0J8Nj1l7oL7L1j1mm6j0kL0J4k5p0J6j4N2J1m9L1m1QN6k0K1kp7N7K8
$$ y = [-14, -45, -61, -80, -25, -3, 29, 16, -83, -32, 55, 56, 58, 28, -14, 32, 23, 71, 81, 24, -35, 25, 14, 74, 39, 11, -41, -75, -9, 11, 11, -26, -91, -104, 7, 19, -35, 18, -57, -51, 40, 65, 70, 34, -21, 3, 45, 66, 73, 7, -11, -39, -11, 73, 60, -23, -19, -66, -29, 32, -17, -9, -83, -101, 8, 2, 8, -12, -51, -35, -7, 30, 68, -6, -9, 34, 19, 85, 85, 6, 15, 31, -2, 78, 42, 2, -3, -35, 1, 46, -10, -25, -67, -78, -15, -28, -18, -13, -45, -45, -15, 35, 51, 7, -41, -17, -10, 47, 87, -14, 27, 34, 19, 53, 61, 35, 10, -6, 1, 49, -1, 3, -38, -26, 10, -25, -21, 1, -91, -68, -38, -15, 21, -25, -44, -5, 12, 24, 30, 15, 30, 32, 58, 63, 44, 11, 31, 43, 23, 36, 17, 33, 13, -22, 15, -2, -14, -23, -51, -37, -14, -49, -8, -14, -20, -7, -38, 24, -37, -18, 27, 30, -1, 6, 24, 10, 37, 29, 25, 27, -18, 3, -11, 34, 21, -60, -3, 0, -32, 6, -9, -29, -16, -53, 4, 53, -14, -10, -12, -29, 44, 41, 35, 41, -11, 5, 38, 16, 67, 17, -14, 19, 23, 49, 48, -45, -48, -2, 26, -12, -6, -53, -47, -65, -40, -2, -31, -35, -57, -33, 36, -11, 22, 52, -25, 25, 43, 48, 37, 0, -6, 31, 62, 51, 47, 1, -9, -11, 19, 33, 8, -62, -46, -60, -8, 3, -46, -15, -56, -48, 8, -12, 9, 7, -70, -13, 15]
1584A5LL1o9ON6J0j0Nm8K1RnM5l9l9j8L4K3ql6m1RMM6m2nK6l8%M9j1j6J7j0M1
1619A5J8Qk4j6K2J2mk6K2k8J7l0L4J3l7qn9L7M6l7J9l3j9P9Jj3Ql4oN8j7L6m2
1652A2kJ4k5L0L1r1L6mJ1Kj3J0k3l5J7K8l0pJ4n2N8J0qKj3J5L4j2RJl1P6k7k0
1686A7L3l1j2J8lL3j4n3mj1M2J5n6K9m1%J8nk5MmL4J1l0M0j8J6K7j6j3M7n1J9
1719A6MoM3k1j5Oj9K6Pn1K7j4l6K9j3j7K6l0K1Rk7J4qK3j3J7K7Qp6L0L3j1MqJ9
1754B4j7J3k6O6n8J4J0k7K6l7j3M3j4k1L0n1K2ql3Q7j9J5j0j0KPNj3J1mK8j7j3
1787A2J8k0j0LPJ0k8j6J3k6L9j0nj9K0nJ0Nj7M1m2L5nJ2K5m2KL6j2rK0j9%Oj2
1822A7Nm2K8j4l8K7j3pJ1pJJ4k8K6K2k5K8k7pM1k0mK8j0K2NQj0Lj0J6k1LJ4l2
$$ y = [15, 18, 49, -20, -14, 42, 52, 42, 47, -1, 20, 29, 24, 69, 30, -9, -27, 7, 30, 22, -14, -55, -46, -42, 4, -38, -43, -17, -55, -55, -6, -17, -33, -16, -26, 15, 33, 41, 17, 1, 23, 35, 31, 5, 27, -1, 16, -14, 20, 33, -4, -12, -71, -34, 12, -25, -6, -39, -58, 21, 22, 9, 17, -17, -23, 35, 18, 54, 12, 10, 24, -1, 29, 60, -31, 5, 1, 12, 14, 1, 11, -12, -47, -30, -2, -32, -39, -25, -77, -19, -9, -17, -15, -28, -13, 21, 9, 18, 19, -12, 64, 37, 17, 50, 19, 7, 25, 22, 55, 41, -12, -16, -27, 15, 30, -26, 3, -38, -38, -20, -25, -50, -46, -50, -16, -5, -35, 5, -13, 3, 30, 14, 1, 48, -3, 16, 20, 14, 57, 36, 21, 27, 8, 34, 41, -10, 17, 3, -33, -4, -17, -34, -8, -38, -17, -8, -35, -21, -29, -6, -19, -2, 25, 33, -43, -13, 20, 9, 13, 5, 24, 7, 20, -6, 60, 2, 16, 26, -1, 25, -12, -25, 18, 4, -17, 13, -38, -16, -24, -57, 30, 11, 26, 16, 6, 8, 15, 20, 7, 18, 14, 42, 25, 12, 30, 10, 0, 3, 10, 20, -8, -24, -11, -37, 2, -8, -13, -32, -12, -17, -7, -2, -19, 22, -20, 15, 10, 22, 47, 5, 7, 43, 31, 22, 42, 23, 23, 29, 17, 22, -20, 8, -6, -44, -17, -30, -37, -26, -33, -32, -18, -46, -20, 2, -23, 5, -22, -29, 12, -8, -12, 16, 6, 28, 33, 41, 31, 34, 24, 40, 19, 22, 36, 4]
1857Dr%Lj6oJ4k3PJ1k2jJ4J7m4O6l1rM4k6jK9k4J3j3K7J5o1M8ljQl5JKJ2k3M1
1894B8m9j4M3k3L0rj9pJ8nK9k1l0K4j5O2lrk0k6L2J1j7J3l9j6M1k8J6Mk7RJ6k8
1928b9J4K3k0k0K1K7J1k1PK0l0M3k3k0L1j1K1oK9m3j6NnJKj6k1K9j8oJ1pk4K0
1962b1k8K0J8pj4j3L2oK8j5M2m3L1J7qj7mj0K4J0j1K6n2%j7J1N5m9j5J6l0k7N6
1995ak9J3pj2L7j6nK7l7OJ8J4%j4K8J9l3JK0rkl3jK5j8NK1JkJ3l8Rm0K8K1Qj1
2032FJ1k2L4nl6J3K5l0J4MJ1J9o9L5k4M9k0j9kj6MkJ0k0JnnN4kl7M3k3ML3l2L5
2068C6o0PM1LkK1n2J4j0L1k5j4K0k1J2oK0l4j9j4J6J7k8MJ7l6N5LNj3k8L4K3R
2102B6lk0KK5J8j6Jk2oK5k0K3ll0JPJJ4m2kk3K4nPJj9JkJ7M0k7Lk4K5MJ9J4l5
$$ y = [4, -5, -5, -2, -18, -24, -10, -33, -26, -15, -37, -38, -24, -7, -51, 15, -16, -25, 19, -7, -8, 21, -3, 10, -3, 24, 39, -22, 26, 23, 22, 30, -5, -4, -2, 10, -13, 28, -21, -35, 8, -15, 15, 6, -13, -20, -2, -7, 22, 1, -29, -5, -20, 42, 39, 30, 10, -16, 16, 27, 10, 23, -16, -32, 9, -19, -3, 1, -26, -17, -1, -29, -15, 8, -12, -32, -11, 16, 27, 6, 13, 33, 3, 46, 23, 3, 34, 23, 44, 38, 67, 24, 8, 13, 8, 9, 11, -5, -26, 3, -15, -21, -10, -17, -41, -21, -49, -29, -11, -18, -32, -45, -13, -19, 9, -6, 36, -7, 24, 41, 33, 16, 12, 2, 26, 36, 25, 51, -1, -1, -18, -7, 48, -1, -16, 0, -30, -57, -1, -30, -17, -24, -36, 1, -15, -20, 7, -30, -24, -6, 8, 8, -6, 22, 41, 8, 9, 29, 20, 18, -15, -16, 9, -9, -4, 17, 18, 16, 29, -9, 0, -40, -12, 9, 17, 6, 17, -5, 29, 24, -12, 1, 26, -4, 10, 14, 25, 44, -25, 10, -14, 35, 15, -4, -6, -22, -18, -20, -10, -30, -29, -34, -39, 15, 13, -24, 19, -4, 0, 33, 1, 36, -24, -17, 24, 27, 25, 46, -6, 8, -2, 29, 4, -10, 10, -11, 1, -5, 15, -19, -38, -52, -36, -19, -47, -43, -26, -62, -7, -4, 1, -12, -40, -6, 17, 26, 23, 3, 5, 30, 48, 32, 33, 11, 5, 30, 10, 33, 30, 0, 1, 8, 9, 23, -19, -21, -44, -20, -25, -18, -17, -36, -35, -37, -20, 20, -7, -4, -28, -3, 1, 20, 34, -1]
2140aLM0l4K9Jl8nPlJ3nJ1Mm2J6J9j0j9k4M4mj0K3plk2QO2l5k2k5L1k1L0Nl7L1
2177A0j7j6L6on7J2L2L0k9l0K6pK6j3J9m1MJ6L1k0J4nj5kM0rK9k7j8J8j6lj2L
2211Ck0NK3k5O%J0l9mK0j5J4NmKK3J2j8k3L9LpM1n0mJ6J3jk1J5j1rJ8K4l1lNj4
2249bJ5m3L0Mn0L3oK4mol0K9nJ7K8n2nK1NROjk1M0j4J4l3LKk5J9K8k5j2J4k8L9
2286A8j4j6KqJ0jkkL5j8j5L9j9J2lj5l2L1%nJ4j8k8L2Nm8O3j6j9J7Okj4JjM1r
2323B1j7k7L0J1JlJ8j1j5Pnoj5L2oMk2j8K6Jn9L9%j7K0k2J1k2L6j1ljJ8J5J3q
2359A5kk5K7J1J2nk1j1mK1J1L9q1K5jJ2j8j7j2J9k2j5K2L1m0JJ7j4lL9l0j5K2
2392a2RJ4kJj4oJ5M1j9j4k7L7pJ0k8J0m2O9l5j2K1j5Oj3K2Mj4Rm0K6LJKJ4l2K8
$$ y = [-1, 2, 42, 8, 37, 38, 0, -5, 2, -1, 12, 7, 18, 22, -20, -4, 15, 5, -14, -38, 6, 2, -8, 15, 8, 5, -17, -9, 53, 18, -4, -29, 2, -19, 11, 16, -21, 10, -7, -23, 13, 7, -50, -38, -6, 24, -5, -35, -9, -16, 10, -3, 16, -25, -21, -5, 26, 6, 20, 15, 0, -2, 38, 29, 58, 31, 13, 31, 15, 12, 0, 3, -17, -12, 11, -14, -8, -8, 2, -37, -41, -21, -36, -22, -17, -21, -19, 4, 16, -2, -25, 14, 17, 10, 51, 1, -3, 13, 26, 25, 4, 19, 8, -1, 17, 41, 10, 7, 12, -2, 13, -30, 0, 4, -46, -13, -19, 5, 1, -5, -35, -6, -11, 6, 34, -18, -23, -2, 3, 12, 18, 17, -4, 36, 22, 36, 3, 6, 8, -17, 2, 30, 5, -7, 7, -21, 18, 4, -12, -10, -18, -8, -9, -11, -13, 22, 4, -11, 28, 9, 21, 18, 3, -29, 2, 2, -3, 11, -7, -35, -3, 2, -46, 17, 1, -18, -1, 5, 3, -11, -10, -11, 30, 21, 4, -23, 7, 18, 19, 16, 34, 23, 8, 15, 10, 4, -11, 21, 15, 19, -3, -21, 5, 6, -53, -14, -14, -31, -11, -33, -22, -44, -8, -19, -22, -23, -5, 10, 23, 15, 13, -12, 15, 26, 38, 33, 12, 1, -3, 18, 29, 68, -13, 12, 11, 23, 5, -12, -24, -5, -27, -42, -20, 11, -29, -28, -11, -25, -28, 11, -19, -34, -12, -3, 11, 9, 10, -4, -10, 5, 46, 27, 13, -14, 23, 16, 26, -2, 8, -34, 35, 0, -12, 9, -6, 0, -13, 9, 13, -1, 8, -32, -6, -3, -2, 0, 14, -18, 10]
2428A0Joj9nJ7nL5j5j4Oj7l3N4l1J4jj4K7Mj6J1k0ML1pJ9%l2%L9Jrk1j2J4pQj1
2466@K0j3m1K6L7k9k1NmJ1Nj7J8j4JJ9mNJ1k0oJ0L4J0k3k7K5J6j7K1k1L7k9nN
2501B5Kkl2JpQomk3KJ7nROj7RnJ9K1rqk0K4j0K7pJk1M0Rj3j1j4rJ1j2L3l7j1K
2541a7J2jJ5Jk1LJJ6J5m7J0Rj5L8k4KkJ7%k4K4oj0k0K5J5Kj5j7K0kJ5Jj9j8kK3
2578DpoQ%j9M0j9MJ3j5lnM2j5k4Qk3J9k8K2J3l6J0rJ4j6Mj1jRK3%Ql1K0K1j7N
2616B%j4J5K5k3K1k7K0j1L3K8r4L7j2oOJ3Orm2J4klQmj7pJ5N7l1oPj9J4J3mml
2654dQJ1Kj6Lj1J3J5kj5K2l2J6J4k6j6%J7k7L0lj2j4J4m4O6Mj4Ql3K2J0mj6L1
2689A7m3K0L6m2RJ0j6L2kPk1j2%POk0J5j6K5j4Rk0J0J3PlJ0J9j9j1j0K8qKlk7
$$ y = [10, 11, 5, -14, -19, -2, -7, 28, 13, -1, 5, -12, -45, 9, -22, -8, -9, -23, 4, 8, -8, 3, -17, -13, 18, 11, 30, 30, -2, -2, 37, 38, 29, 8, -4, 10, 3, 11, 0, 20, 7, -34, -8, 29, 0, -21, -16, -20, -9, -4, -21, -3, -17, -16, 3, -1, 4, 15, -5, -11, -1, 33, 43, 20, -7, 18, 34, 17, 38, 17, 54, 25, 20, 25, 27, 25, -7, -6, -13, -5, -11, -15, -38, -36, -19, -24, -15, -9, -26, -17, -22, -3, 18, 9, 1, -19, 5, -5, 22, 15, 16, -5, 35, 44, 31, 20, 6, -3, 8, -4, 29, -8, -19, -17, -5, -6, 9, 10, -11, -8, -7, 9, 24, -23, -13, -4, -19, 19, -5, -3, -5, 12, 12, -12, 12, 6, -4, -24, 1, 16, 18, 3, -14, 6, 4, 19, 20, 1, -17, -19, 4, -3, -9, -1, -1, -20, 20, 1, 5, 18, 3, 0, -5, 37, 22, -2, 6, -17, 2, -26, -4, 9, -27, -17, -26, -12, -28, -24, -35, -36, -27, -4, -4, 4, -27, -7, 14, -3, 2, 2, -12, 3, 28, 5, 26, -1, 19, 8, 41, 69, -25, 12, 0, -6, 0, 13, 19, 10, -32, -18, -20, -23, -15, -19, -36, -43, -28, 29, -2, -8, -1, -20, -6, 7, 3, -1, -4, 4, 15, 17, 1, 4, -7, 6, 21, 19, 4, 26, -6, 10, 24, -2, -18, -18, -1, -28, 2, -1, -13, -27, -13, -57, 9, 13, -1, 7, -26, -4, 6, 2, -14, 17, -26, -6, 30, -12, -3, 7, -9, 23, 21, 28, 7, -5, -5, 2, 8, -12, 3, -13, 12, -2, 7, -13, -3, 10, 17, 14, 24, 43, 24, 13, 3, 31, 23, 25, 22, -5]
2725emJ4j1J5k2JlMk0L1jj1%K1Lkj3OJ2q%j1RopJ9K7mqjl2L8pjJ5m2MnQj4J1p
2767gpnM8m3pNMk2L6J0lnqOOj6nkML2M%mk0K1Oolk0j6J6J9j6k9K3j4NPNJ6k2j1
2809a8l3O7l8J7J2MpJ4k0J5j3PrlJ7ok0J5RkJ1mm3M6%%Jj1%j5OmK9j6oJ1pL3j
2848C8j9j1j1KKJ3jrk3J0j0M2j5m3N0l9K1K4k7Kj8J1K3Rj6J6m0J3M2j3Jmj4J5
2882B1Rnmk5qL5j9L8m1Lk1K1j7k9K4J8l1RJ1PK4l0j8L0Mj4j4J8JK6kj4M0rn4K9
2918A3rJ7l0J2K3j3Pj4nj7J7j5RrJ6j0j8L8l1K6j8J1J%J2qJpJ1N%RLn3K9qQOk0
2957a1kRqLPJ5Ql1QJ6j1LPj6J1Olj2j1L1l0L2l7KM1j0j2Kj9k1K0PM1k9jl7K0j2
2995b4PJ3J4Jl4K6klJlJ0OJ8l4L6k0J8Ol9K3km1L3Jolnj4JR%j0J9k1RL0k2j2J4
$$ y = [-5, -9, 5, -6, 9, -13, -12, -15, -11, -31, 0, -1, -12, -12, 9, 12, 10, -3, 3, 15, 7, 7, -4, 5, -1, -8, 11, 38, 34, 26, 25, -7, 31, 24, 23, 38, -4, 0, -5, 3, -11, 0, -7, -14, -19, 29, -14, -21, -16, -12, -34, 2, 12, 9, 4, -4, 2, 8, -8, -13, -15, -11, 21, 25, 25, 21, 1, 22, 28, 22, 19, -1, -17, -1, 18, 2, -27, -4, -18, -13, -6, -1, 15, -7, -18, -51, 16, -22, -5, 7, 11, 4, 18, -2, 13, 0, 7, -2, -5, 12, 6, -14, 1, 10, 8, 19, 15, -28, 18, 18, 18, 19, 8, 8, -7, -1, -5, 24, 8, 2, 13, 6, 39, 38, 19, 8, -3, -1, 1, 14, 13, 4, -19, -9, -19, 23, 8, -35, 15, -24, -3, 21, -6, -4, -22, -11, 12, 21, 5, 21, -19, -6, 36, 23, 24, 20, 6, 21, 30, 25, 21, -4, -12, 23, 4, 42, 1, 4, -17, 4, -13, -42, -18, 0, -31, -22, -11, -4, 20, -10, -28, 2, 6, -8, -22, -4, -3, 23, 21, 7, 47, 38, -16, 13, 4, 21, -9, 3, 26, 13, 20, 6, 1, -16, 1, -14, -5, -14, 2, -8, -26, 12, -19, 7, -11, 0, 1, 1, 13, 5, 6, -1, 10, 15, 15, 24, 27, -26, 3, -5, 3, 9, -11, -13, -4, -12, -9, -2, 13, 21, -10, -2, 14, 3, 6, 13, -3, 8, 14, 11, -1, -12, 19, -11, 21, -16, -14, 27, 17, 5, 7, -12, -33, -13, -6, 35, 6, 5, -32, -12, -24, -17, -4, 10, 11, -23, 3, 1, -2, -1, -4, 6, 12, 30, -4, 32, 12, 30, 36, -3, 20, 18, -23, 10, 11, 5, 2, -3, -17, -16, -7, -7, -17, 2, -19, -10, 20, -2, -14, 0]
3034@j7J0oL3k1K0l2L0k0J7mJ3Lj2QQOm7Rk1L6mj7JMoJ1J9l8Jk3L0J3j7M8m7J8
3071Fl4M0j7QQqpj4M7mj9QqJ4knlj2kJ2Ll2%K2jKlK4k6Rj8RQL6l6jlj6J0K0m0
3112b5L1k0j2L1J0k3k2J7K3K0m6%jj8M8j5jlL6j4Rnj9KQk7L5QpK2j5ok0J9jl4
3148a5NJ3j0K2k8mmOMJ4%j2oJ1K4m6M7l8nM9Pl6L2l6jNK4k8K7Ql4J7J2k3J7k6
3184hK4j9K%J2l2k9L7j3K4j8K9k3Oj1N9m4k1jK6Jj4jJ5mK1j3J3rMkj8K2j3j4J7
3220Ek6K3L1jj9k3J7%NPk7J2PqK0m9N1k0oj6L1Pm6L6m7L9q%rMk1J8KK2j4KLRj2
3259aJ3rpK0mKj0Oll0K7RJ2j4Jj2rL3om6RjnNK0k9MQnoJ7MNmJ9nJk0mL5K0Km5
3302cMK6j7J4Lj9J0LJj2K0pNj7pPj9j0J1qjJ9j3qK4j1J1k0J4%kj4L4j5J1oK3m4
$$ y = [0, -17, -7, -13, 20, -1, 19, -13, 17, -3, 14, 10, 23, 26, 14, 22, 30, 36, -11, -2, -23, 13, 9, -8, -7, -3, -9, 2, 21, -17, -16, -39, -9, 4, -13, 35, -12, 6, -28, 12, -5, 3, 11, 3, -4, -18, 29, 25, 6, 14, 6, 20, 18, 13, 10, -2, -4, 8, 11, -21, -21, 1, 0, 2, -1, 23, -3, 6, -12, -3, 5, 41, 5, 4, 1, -15, -5, 15, -25, 6, -14, -26, 5, 15, -8, -30, -13, 10, 30, -16, -16, -17, -35, 13, -2, -3, -6, 30, 16, 25, 20, 1, 3, 11, -16, 19, 27, 20, 42, 27, 21, 1, 20, 19, -15, -10, 3, -7, 15, -13, -17, -21, -15, -11, 3, 3, -9, -15, -4, 20, -26, 21, -17, -22, 27, 34, -2, 30, -6, -7, -2, 22, -6, 21, 29, -5, 12, 24, 1, 18, -8, 16, -3, -1, -1, 11, -21, -50, -13, -26, -2, -20, 9, -14, -8, -19, 40, -4, -25, -26, 0, 1, -13, -14, 1, -3, 18, 5, 18, 9, 13, 11, -7, 15, 2, -12, 5, -21, 2, 33, 32, 13, -10, 7, 7, 12, 19, -8, 4, 11, 3, 23, -26, 25, 5, -1, -17, 14, 21, -25, 11, -36, 3, -5, -5, -14, -10, -31, -13, -11, 11, -3, -1, 2, 11, -1, 12, 3, -4, 16, 12, 14, 4, 10, 7, -23, 4, 13, 25, 11, 12, 0, -9, 24, 18, -28, -19, -20, -25, -20, 0, -29, -25, -17, -22, -28, -11, -7, -2, -6, 13, 8, 9, -11, -15, 20, 40, 42, -3, 1, 27, 10, 24, 27, 8, 18, 21, 22, 10, 30, 23, 28, 11, 4, 11, -8, -18, -7, -15, -16, 3, -10, -18, 6, -5, 6, -14, 0, 0, -2, -16, 18, 3, 14, 8, 31, -13]
3340a3K6j1K5%jMl0rJ9K2j3j7RJ0j4oj8K9J8l3J1j8j7J7j1PL1Kk7k5J9K0j2%j2
3375a8QJ8j9L1l4lPL4j6L1l4nK0J6m3J1J5j6J1k2L2j2Lkj0Nj2K6J8m2j3kK7k7
3409a7K3k7J4j9M5k8olj3M0k5L5m6J4QNjK8j7J0rJ6kj1rKmN6l6Rl3Oj9J5Nkj0
3446fj3J5qkj4K3j8JJ3%J3KrkNpOK9rk9L0j2nK9l0J2%Lk1K2k7L4k9JJ6j1JK2k7
3485b%JQj7J8k9J9J3m9O7k0Po0M5Llj0Pj6J0JlMpL7m0JQK6l2K6nlnrJK1O%j2Q
3526A5mJ5j2J2j1j1Nnjrm%JOj0Rj9J9qK2j2j6J5j3J9k1J9JQNJ8pj8L0qj8nJ1m
3565A4j4lJ6j6KJ4l3J4Rk2NJ5kj9J4P%KnjKl1K1kkKJ5p%K3j9K2Qj4J3k9J5JLP
3605B5m6L3k6L0rk3j2J5J0K7j2nrPoJ0j8j6QK0k0JK6nj7Rj3rM2k0Nj7J7OJ4j6
$$ y = [-13, 13, 2, 27, 27, 26, 30, 0, -9, 10, 32, 19, 2, 11, 21, 7, 1, -17, 12, 30, -3, 8, -10, -27, -10, -21, -14, 17, 19, -8, -33, -14, 6, -6, -6, -18, -10, 8, -11, 20, -14, -17, -10, 24, 8, 39, 5, 0, 20, 36, -7, 4, 19, 3, 14, -8, 24, 12, 15, 13, 3, 8, -4, 22, 40, -2, -15, -17, 10, -17, 6, -21, -7, -26, 19, -9, -15, -18, -31, 9, -16, 19, -27, -13, -5, 0, -1, 27, 10, 20, 11, 27, 25, 14, 5, 7, 3, 59, 23, 32, -1, 5, -14, 1, 6, 4, -6, -19, -4, -12, -14, -28, -5, -23, -22, -9, -9, 4, 6, -3, -5, 0, -7, -1, 28, 19, -10, 20, 8, 3, 32, 2, 14, 14, 17, -4, 18, -9, 25, -4, -3, 13, 2, 3, 25, -2, -2, -1, 7, -10, 8, -21, -2, 11, -38, 29, 9, 16, -44, 1, 4, 1, -9, -2, -18, -8, -7, -10, -6, -13, 24, -16, -15, -7, 19, -13, 13, 8, 5, 0, -9, -8, 13, 19, 19, 7, 15, 11, 26, 14, 26, 15, 4, 9, 4, 3, -6, -10, -10, -9, -3, -13, -4, -23, -4, -12, 10, -2, -18, -3, -16, 3, -18, 1, 2, 10, 15, 33, 26, 8, 38, 30, 12, 7, 18, 14, 0, -3, 13, -3, -1, 13, -20, -6, 3, -19, -14, 1, -1, -20, -6, 1, 1, 3, -2, -3, -1, -32, -11, -13, -15, -13, 2, -5, -5, 18, -1, 21, 29, 15, 28, -1, 14, 15, 18, 25, -21, 12, -14, 16, 7, -16, -28, -13, -3, 24, 12, 7, -2, 5, -1, 9, -9, -25, -17, 3, -17, -16, 10, 5, -12, -3, -16, -25, 17, -3, 2, -15, 2, 8, 22, 6]
3641Fk0NM8l0mK2j6J0j6rOK2k5L1l4JNjJ4l3LJ0J0rjlJ6nkJj0rjJ5K0j2j9J4J8
3680A8Ppj6MnL7Qj1nj4Jj1K9k9K2k8K1okkJ5k1l9L3rJ9oMmpk1KRL5qk8oL3j6K
3720bL5l9olJ7JK3k2K6Ok5K4k0j6L0nj4k1LJ3LQnk3J9l2L6j9K4ll8M2J5m1Pmj1
3757a7M3k5L5k5J3k4jj4lL6qj3M5k4Jj0pj5K3ROl4J7j2MJ7lmj3J6J3k7j4L0pJ
3793Ij0J1j8oK2k4J1J7k8J4Ol1N0j9mkJ7k3k4L9RpOJ2k8K3j2%NJ5j6MNlj1Pml8
3831b6N0k3m0K7P%Qk4J8Rj9kJ6l5K8J3J1j0J0qj4J1lMjJ9%j7JJJ8rJ3l2MrM1l4
3869Cj5J5J%j4Rrj7RJ3lJ3k6K3k5K5j8K5j3jJ4loJ7j7k8L8j4j1K7OpJ4qj0mJK8
3907C2j4pLk9K1j2J0j4J9kk4J3J2Pml7QJ0Kj0k7K8nJ2j2K7k4QQj2K7pj6NKL3j9
$$ y = [6, -14, -9, 39, 9, 5, 27, 11, 21, 5, -4, 2, 24, -1, 30, -4, -3, 2, 1, 15, -18, -15, -5, 5, -4, -5, -8, 8, 3, 1, 2, -8, -17, -18, -3, 17, 5, -14, 0, 18, 25, 18, 2, 6, 1, 38, 46, 35, 30, 16, 17, 6, 35, 6, 28, 0, 21, 15, 13, 11, 26, 5, -34, -1, -10, 9, 3, 7, 3, -4, -25, -23, -14, 21, 13, -15, -21, 12, -4, -2, 33, -6, -12, -15, 2, 3, 26, 4, 30, 36, 11, 35, 15, -1, 29, 24, 10, -11, -8, 5, 8, 16, 11, -12, 7, -25, 11, -8, 16, 13, -25, 17, 32, -9, -2, -6, -17, 26, 1, 36, 11, 24, 0, -1, -15, -18, 18, 10, -3, 42, 18, 19, 9, 2, -13, 10, 19, 25, -9, 8, -4, 0, 17, 14, 10, -3, 13, 26, -1, -15, 15, 8, 9, -1, 10, -8, -14, 8, -16, -5, 12, -16, -2, 4, -27, 23, 4, 0, -2, 15, -8, -32, 7, 16, 9, 15, 27, -1, 22, 10, 10, 15, 30, 14, 18, 23, 20, 9, 16, 12, -26, 24, 1, -39, -12, -5, -5, 3, -21, -3, 6, -13, -15, 1, -34, -6, 7, 18, 8, 18, 10, -4, 7, 4, 8, 7, 26, 26, 9, 10, 11, 29, 20, 33, 1, 5, -4, 37, 3, -12, 3, 4, 4, -10, -1, -10, -27, -18, -5, -8, 5, -21, 2, -23, 2, -16, 9, -4, -5, 9, 6, 0, 17, 0, -28, 10, -4, -15, 12, 18, 11, 25, 17, 7, 3, 4, 32, 18, 11, 14, -15, 6, -6, 4, -10, 9, 7, -17, -4, 8, 15, 11, -26, -18, -8, -6, -16, -43, -15, -20, -8, -20, 7, -17, -9, -1, -13, 14, 7, -9, -4, -2, 31, 12]
3944A2%OlJ4j3rQKlOJk0J5Lj0j4jQk6K4Lj0k3NOj7K4qnK2Nj0NJ8lk1J7K2mj0Q
3985B4k3J4jk3QRkJ8j8nM%j6K9j1j3j1LLj3J4k4J4J1J3j4J7j8J5NJ1j9L1n1oL0
4021Elkj0OmRJ2j3nPQJkOQk2Oj6J9Mk2PJ7j2j2moL6m3L3J7j3l4j3N1Jl5J5L2m2
4061a3rnM0j2J6j9k0J1L9k0Ojj3J3j2J2J2j5Rrk3J0Qlk6K5olJ0jLj3NoJ0j9OP
4099fQk1j1K0J1k6L6J2j5J3l1K4j3J6pkmNqJ8Nl0L5k1Nk0L0m8K2J0kmj4J8j3K3
4135A5j6MQj7J8rRlj0j9J8j9L7k8NJ4nj6L4pJ3k0Lj1Onj3J2J1jNj1%LJ7j7oJ1
4173A0j3J7r%nKljnJ2MQk3qMRk6K5m%%J2j6K4K7m9N7m1j4K0MpOJ6Rm0rK4pJ1j6
4214EMQk1j5J2k6K5J2j4j8L0k0J7j5K1Mj7rNjK4jk7O2l7J3j4J0k0OlK1Kql1K1
$$ y = [12, 12, 18, 15, 29, 16, 7, 15, 17, 14, 20, 21, 1, 16, 19, 9, -5, -6, 2, -24, 0, 3, -7, -30, -25, -19, -36, -12, -20, -25, -3, 2, -8, -3, 15, 12, -9, 8, 30, 26, 16, 24, 1, 15, 14, -9, -1, 8, 6, 24, 6, 1, 5, 5, -11, 18, 7, -6, -17, -14, -11, -24, -10, -34, -20, -9, 4, -10, 7, -11, 4, 9, 20, 1, 32, -19, -25, 5, 2, 0, -10, -4, -8, 1, 13, 0, -5, 2, 10, 11, 9, 15, 23, 1, 7, -9, 10, 14, -8, -1, 16, 4, -8, -12, -18, 18, -25, 8, 25, 12, -22, -35, 16, 17, -18, -3, 29, -13, -22, -27, 13, 1, 17, -2, -22, -11, 28, 8, 14, 13, 0, 13, 1, 13, 25, 10, 19, 10, -13, -3, 5, 2, -24, 1, -5, -8, 2, 1, 4, -9, -4, -10, 0, -19, -13, -6, 2, -19, -30, -10, 1, -25, 11, 23, 8, 21, -10, 14, 1, 17, 10, 8, 4, 9, 1, 19, 24, -6, 29, 8, 13, -7, 23, -25, -3, 7, 5, 1, -13, 5, -8, 15, -1, 3, 11, -6, 12, 3, 12, 9, -1, -20, -2, -21, 16, -12, -7, 7, 2, -14, 20, 13, 26, 6, 9, -2, 4, -1, -14, -2, 9, 8, 13, 2, 2, 5, 22, 5, -1, 10, -3, 14, 5, 5, 0, 2, -1, -2, -7, 5, 9, 17, -6, -14, -10, -1, -27, -2, -6, -6, -6, 6, -10, 14, 41, -8, 49, 8, -6, 14, 18, 11, 17, 33, 42, 2, -7, 17, 10, 21, 5, 9, 17, -4, -19, -7, -33, -8, 4, -10, -28, 2, -18, -1, -16, 5, 9, -8, -17, -12, -13, 11, 10, -17, 45, 8, 21, 7, 17, -3, 3, 0, 21, 23, 15, -16, 5]
4250ERj1qk0L1jj9K0qoNJ2k3rJ9j5L3m3PJ7kKnmK8PpLoJ2l6K9KJj9Qk0qL6Mj0
4291A0k0K7j4MJ7j0l4L4oJ4j6qJ4nj8J7k2K6j7K1NJ7l6npk9K3Kj9P0m6L2j6J1
4325A6j6J3kj0L7j1qj0Pk8L7m7L4mqRk3K3Mkpk8J8K4nk0KnJ9qj4J6j5%jJ2J0J8
4363B7j3Olj2ljQk1M3k5J0k8K5kkj4MJ9k6J2%K4m5j8L0J8k3KKk2J7j2j4L1QNj7
4400a0kJ2rRJ4j6J3olJ0MOk8LJ3QK1n8M1j7j0K0Mmj4j0J2Nj9K6rrPlMoj4KJ0l
4440fj4jL1j3rmNJ3mJJ0j1LnK3l2K5j4Pjj5L3j9J2j4J6k3J4kL8l6ljqlJ0%j4J5
4479Dk3j1J6%j5J8mkJ1QJ3k2%LLLJ6k1JOoK2j4LJ3Jj6Nk0K5rj4mk3K5K5k5Nl1
4518c4K4rRj3K5qqK6L1o1QL5l4j2J9QrpK0j9J4nNJPMj8On%MQj0rOQj8Oj9L0m4
$$ y = [5, 14, 3, -5, -25, 6, 5, -14, 6, -2, -8, -3, 9, -14, -23, -4, -19, 14, -29, -22, -5, -7, -5, -10, -14, 14, 21, 14, 17, 11, 23, -13, 16, 18, 19, 0, 8, -12, -20, 16, 20, 10, -10, 17, 3, 7, 24, 14, -20, 14, 8, 22, 6, -2, 12, 7, -11, 6, -16, 10, -7, 14, 19, 36, 0, -5, -12, -41, -18, -16, -35, 35, -11, 21, 5, 16, 0, 13, 11, 1, 38, 27, 19, 9, 16, -12, 25, -22, 12, 8, 0, 9, -14, 9, 13, 11, 4, -24, -6, 18, 13, -7, -5, -10, 9, 1, -13, 3, -12, -12, -13, -1, 9, 27, 14, 20, 17, 5, 2, 1, 9, -12, 31, 6, 16, -12, 13, 11, 9, -5, -1, 18, -8, 4, 4, 28, -17, -35, -5, 13, -10, -8, -6, -28, -11, -23, -37, -6, 2, 7, -10, -12, 0, -9, 0, 14, -2, 11, 5, 2, 12, 16, 22, -6, -3, 10, 18, 39, -19, 22, 5, -5, 15, 19, 15, 1, -9, 3, 8, -11, 15, 6, -3, 4, 1, 5, -1, -15, -13, -3, -6, -20, -21, 10, -3, -12, -16, -11, 2, -2, -1, 9, -2, 1, -4, 19, -13, 12, -2, 5, 4, -11, 22, 3, 15, 1, 17, -6, 8, 6, 44, 8, 5, 4, -4, -7, 3, 3, -11, 4, -19, -30, -14, -14, -29, -11, -15, -17, -6, 2, 15, -7, -7, -4, -1, 2, 18, -3, -2, 4, -2, 20, 6, 9, 22, 23, 7, 12, -8, 17, 8, -6, -10, -33, -8, 17, -8, -3, -34, -10, -19, -10, -23, 2, -6, -14, 12, 43, -18, -10, 25, -9, -21, -2, 6, -3, -10, 10, -9, 5, 0, 5, 6, 13, 17, -1, 5, 0, 0, 4, 12, 2, -7, -1, 7, -11, -5, -24, 6, -38]
4559c8L3kkNJk0K5Oj1j8K5nPj2mRkJ2j7K3qmJ3k8mJ3pj1M8j9MJ5mj9j1pOMK0j4
4599BK1k3j5K9l4K4j5OJQk5j8N8J6m8J7J7j1j1J0J3j9Rk2K3J0j8K9k4k4J7K5j1
4632A7j3j6LJ0J2lrK0j9lJ4kk8Nj4ML1j5j0kRpOJ0j7J5PNkk0K0j3KM1m1L5j9p
4670FoJ2Rlk6J7%J5kk3J5k0qK6J2pj5qK3J0k5pJ2l9N1m3J4pK5qK2m2K6rmMj1L8
4708B4pK1k4j7K4Qk0J9Jk3K7l6opK2Nl4L0j6J1j3J2k3L7k1jj1KQKJ7j1j8QJ9k7
4744a8J6lj0K2J7k8j0J2Ql0jN0j1Pk1J8Kk3Oo%lK8l3J0Jpk5J7J3j8j3KL5mj6J6
4781@j9K2Lk0jmK5L8n6j2J5K7j6lK6j6Rnj3JJ4KmJ4l5J3k7J2jJ1k2J7mJ8j6Rj1
4818iqL5k1j1K5k2J3pOrrJ5QQj6QNqk5K0k1K8QqnJ2J0mJ7k2jjk7K0k9J3J9j0J7
$$ y = [-38, -5, -7, -9, -4, -3, -23, 2, 8, -3, -21, 4, -1, 6, -6, -10, -1, -3, 9, -8, 15, 7, 3, 16, -12, -16, -3, -10, -21, 27, 8, 12, 27, 23, 4, -7, -14, -8, -4, 16, 2, 23, 0, -15, 14, -20, 4, -11, -5, -4, 4, -21, -39, 19, 35, -13, 4, 21, 10, -1, 9, 22, 3, 12, -10, 13, 23, 5, 34, 10, -14, 3, 28, 17, 4, -12, -9, 1, 13, 10, 1, 21, 2, -1, 13, 11, -17, -12, -26, -22, 9, -6, -16, -18, -9, -16, -10, 0, -17, -2, 5, 10, 8, -12, 8, -5, -3, 38, -3, 32, 13, 6, 0, 12, 21, 18, -8, 9, 9, 24, 22, -1, 14, -6, -14, 12, 24, 17, 2, -6, 17, 27, 2, -5, 7, -32, 19, -24, -10, -17, 8, 0, 22, -20, 6, -3, -7, -3, -14, 24, 17, 38, 14, -3, 21, 29, 9, 28, 29, 6, 33, -3, -9, -16, 6, 11, -23, 7, -9, 2, -11, 1, -22, 15, -6, -7, -18, -16, -8, -6, 11, 0, -18, -10, 9, -18, -2, -5, -15, 7, 24, -4, -14, -2, 6, -24, -25, 25, 14, 21, 0, 18, 20, -3, 3, -3, -3, -6, 22, -11, -1, 0, -7, -32, -15, -2, -20, -33, -31, 4, 0, -16, 0, -19, 3, 6, -14, -15, -19, 6, 44, -12, -24, -9, 18, 2, -1, 25, 9, 18, 13, 0, 1, 15, 17, 13, 27, -8, 5, -22, -10, -11, 0, -22, -5, -9, 9, -7, 2, -9, -17, 18, -3, -14, 11, -11, 2, -5, 1, -8, -17, -2, 6, 14, -2, 6, 11, 3, -22, -2, -23, 5, 13, 5, 0, 12, 22, 18, 35, 13, 12, 11, -16, 4, -25, -12, 7, -3, 14]
4857A4qj2j0K7qKlqmqj3M0j5Nk1K7Nj1jLPJ1K2Lj2Ok8rJ8l1L7k9Pk7K4J8mlj5
4896dKnRJ5l4J3kj0LqLJ7J0ql6L4Ql2K7l8L6MJ2Jj7mlJ8j2MJ1Lnk0K6qMQk0j2
4936a0qOK5k8Jj1M0k4rK0nk4L2j8RMj3NJ2Nl2M4j7j5NJ5k0MJ8j0K2k3jQN%op%
4975aK1qPj7NjNj2J3J8l5Nk7k2K3K3rJ4%OKnjj7POjl0M3pk1R%K2j3J6Jj9J3K6
5015C9l3KRj9J2J8l0K2j4j9j0K7J1l2J1j1J0JMj4J7qlJ7k6pL4j8J4j2K4Mj3J5
5049B2k9J8Qk1K7k2J8Kj4j3K9j9%j2K0j1J0Lk5Mjk4J1lL5j4qJK3j0K0l5kj1QJ3
5085bNj5j2K9PKqJ3omJ0j5oJ0J5j9J1jj8J4j9RMkj6jJ7k9K3rPokK2Pj6ollJ1M
5126BqL1j8j3j5L3j1JNjK9kk1NLrK1j1k5J8%j4j7J3K4k1POm1K3l4K8j0KJ5j2J5
$$ y = [14, 6, -6, -16, 11, 3, 5, 2, -6, -10, -18, -31, 9, -6, -1, -22, 5, 10, -1, -2, 1, 8, 19, 41, 44, 32, 38, 10, 1, 19, -12, 25, -4, 3, -24, 0, 18, 14, 11, -4, -2, -7, 2, 17, -17, -4, -6, -16, -13, -21, -18, -1, 9, 1, -35, -1, 7, -25, 2, -36, 0, 4, 16, 17, 0, -4, -7, 11, -1, 3, 14, 17, 12, -8, 18, 10, 14, 22, 2, -10, -18, -12, 13, -15, -14, -25, 15, -9, -18, 2, -3, -27, 5, -13, -4, 0, -13, -8, 4, 9, -23, 21, 4, -11, -6, 9, -11, -7, 11, 1, 23, 0, -1, 7, 12, 12, 6, -1, -1, 20, 12, 19, 2, 7, 6, 11, -1, 12, 30, -5, 0, -27, -49, -26, -3, -12, 2, 2, 8, 10, 5, 4, -13, -6, 0, -1, -31, 12, 5, -16, -7, -7, 15, 2, 18, 19, 0, 13, 39, 6, 8, 17, -2, 10, 28, -2, 20, 6, -13, -23, 4, 15, -17, -6, -17, -7, -6, -2, -16, 1, -7, -10, 7, -19, -26, 8, -10, 4, -8, 16, 20, 7, 22, -7, 11, 19, -2, 25, 3, 21, 23, 9, -4, 25, 6, 6, -6, 14, 3, 13, 16, -9, -5, -6, -30, -19, -22, 13, -1, -9, -8, 15, 5, 25, -10, -12, -23, -15, -2, 3, -12, -24, 5, 12, 14, 6, 19, 13, 9, 19, 4, -2, 8, 23, 4, 15, 14, -4, 10, -9, 0, 4, 2, -14, -15, 2, -27, -4, -13, -6, -12, -14, 8, 15, -1, -7, -10, -13, -2, 2, -6, 25, 7, -6, -21, 12, 1, 2, 7, 6, 35, 33, 12, 17, 20, 11, 32, 21, -4, 14, 14, 0, -17, -4, 20, -1, 6, 12, -29, -6, -40, -12, -22, -20, -5, -17, -2]
5163bj5mJ2Rj7RL4k6j7OJ2jJ9l1J2PJ5qJ3j2L2j7k9KK4k8k1J3K6j0l0L4j2k0O
5198a5kj0J4J8l8L0JOj0J3Jj1j7J8l1M1J3m0RJ0J7kj6J0j0j9M3k6J9j3NJ8Jk2
5232EK7k5j5J8l5K9rmk3J5L5j4mj3PlLJ3Ql7j4M2j1NolJ3QRpj1Rl0K5J1k0J9r
5270HkK0qj3J4j7KJ3l3K8oOKj7Qj1j0J7Kk7J8j5J2j0J3j5K5J8k6JJ5Nk0LONKJ1
5308B4J7rk1k4NK0NJ1qpk6L0j2K9o0J4J5l0L6j8j5J9%KRl%Pk5L0%oj0j%J0K%J2
5347B2k7K2k5M0j8l1K8K3k3jJ2m0L0J6m9J5J4J8k0Nl6K0o%KJ0oJ3j6J3j0j0kj5
5381c2K5J6Oj3qJ6j3qM7l0kK0j5mKMK3k9J1J9l6oK3k4J8j9RM0k7j9Rjnj9K3j8
5417a7j6J6j7M2rJ9k0K5k0Kmj1J0J4LK3l9j5L3%j0n%J4kk3J7j9K6j2rJ8qnJ4l8
$$ y = [-2, -17, -21, -9, 0, -17, -8, 26, 0, -17, -11, 1, 0, 19, -12, 0, 7, 22, 14, 27, 15, 47, 30, 1, 3, 27, -1, -22, -9, 17, 7, -23, 11, -1, -21, -15, -17, -27, -13, 5, -33, -3, -2, 4, -6, 7, 8, -3, -20, -2, -33, 8, 21, -19, -10, 0, 17, 15, -1, 9, -1, -20, 23, -3, 16, 3, 8, 26, 27, 5, 32, 7, -8, 10, -25, 4, -5, -9, -32, -17, 18, 4, 0, -13, -6, -9, -6, 7, 15, -22, -36, 6, -5, 0, -6, -9, 4, 12, 21, 14, 3, 12, -18, 7, 18, -2, 17, 8, 6, 26, 18, 5, 19, 2, 4, 17, -16, 12, 6, 12, 14, -3, 5, -6, -16, 1, 3, -24, -6, -21, -9, -19, -6, -21, 4, 22, -4, -3, 12, 17, -3, 0, 6, 11, 13, 24, 41, 32, 11, -13, -8, 12, 17, 28, 20, 13, -13, 17, 5, 34, -26, -12, 3, -27, 9, -9, -24, -5, -5, -3, 6, 3, 3, 10, -15, 15, 15, 9, -1, -2, -2, 8, 10, 10, 22, -5, 17, -8, 32, 14, -17, 11, 34, 11, 10, 22, -18, 12, 28, -21, -6, 8, 26, 6, 11, -25, -5, -11, -11, -9, 1, -5, 8, -8, 5, -5, -15, -17, -32, -7, 9, 15, 2, -6, 10, -3, -11, 36, 6, 4, 24, 9, 5, 7, 11, 34, 5, 16, 35, -1, -7, 16, -8, 10, -9, 0, 40, 13, -6, 3, 2, -3, -22, 1, -17, -33, -17, -34, 8, -1, 18, -2, 23, 3, 5, 1, -10, 0, 14, 17, 40, 1, -14, 19, 19, 9, 4, 4, 18, 16, -7, 10, -9, 17, 5, -4, 14, 6, 1, 15, -23]
5453b3L7m4J9K8l9M4nj5k4K0lj7K1MJK0k7m4N5Nj5K9j9j2J6%Nj5mK6koj6k1J6
5488eJ9Nj2Qoj5j8J4J1K8j9mqj9J2J0l0K9k5K8L%Lj1Lj1J5Qj1kONp%J3Ll3K6l1
5527a8K8pR%l5J4lK6k2J7Lj4lK2m1MJ9j1qNjJ6m1L8%OJ3Nk5Qk4M5k9K0Lj7%Nj0
5566c%J2mJ9k0%kJ1Ok4K2l4J2K5l0oj2J5K0j3Ojj0lJ5J7k9j8K5oj0K9k4oM9m5
5602a7M1k8LK1k4L4l2J0k%K5m0K6LJj7Lj4NqnK9pj6K8l3qJ8Km%oJ2j5L7l6K3k1
5640a2J5j3K3j8NJ1k1K6k7J9K0k7j3K6j8NJ3opj1RnnnK7joJ1rk5Rk0QK1Oml7K7
5678iKQ%Mk6L2j9L6k6mOjJ6j6QLj9NJ6k4%J2J3j2j0J5%Kj7j0Lj5J2J8J4k3J1j4
5716ij0j8M5k9jN0n4K5j1K0nJ0k7M5l7J7j0Qj4RJ8rj3OrqL7l2J2NJ3m0L8k5J2
$$ y = [-23, 14, -30, -11, 17, -22, 22, 17, 2, -22, -2, -5, -22, -1, 3, 4, 24, -3, -47, 8, 13, -2, 27, 8, -4, 12, 12, 17, 2, -2, 24, 22, 16, 0, -21, -5, 14, 19, 7, 15, 9, -6, -24, -10, 1, 29, 10, 6, -2, -21, -9, 1, -29, 0, -25, 3, 6, 6, 9, -2, 1, -10, 5, 13, 2, 0, 6, 11, 4, 4, 17, 20, -13, 13, -18, 10, 3, 12, 12, -23, -9, -12, 14, -8, 9, 12, -2, -5, 17, -24, -20, -1, -12, -20, -15, -16, 0, -41, -3, -3, 3, 16, 21, -4, 4, -20, 25, -4, 16, 19, 2, 2, 7, -3, -3, 9, 5, 24, 4, 4, 2, 13, 19, -5, 17, -17, -5, 20, -10, -16, -28, -13, 7, -6, 0, -1, -11, -14, 1, 18, -11, -29, -4, -10, -20, 9, -15, -21, 28, -17, 24, -4, -1, 20, -4, 30, -2, 8, 6, 6, 31, -9, 17, 20, 21, 4, 7, -7, -2, -10, -15, 14, 7, -9, 19, -14, -22, -4, -2, -6, -6, -12, 0, -15, 22, -14, 9, -12, 3, -10, 13, -5, 0, 11, -10, 16, -11, 8, 28, 1, -12, 14, -4, 1, 14, 8, 1, -10, -1, -6, -11, -16, 11, 10, 4, 15, 6, -19, -10, -30, -22, -1, 5, 1, -36, -9, -7, 1, 1, 5, -21, 11, -8, 28, 2, -2, 4, 3, 19, 3, 11, 14, -5, 0, 16, -8, -8, 4, 17, 5, -5, 10, 10, 12, -5, -15, -12, -27, -15, 3, 17, -6, 5, -9, -19, -37, 8, -21, -22, 28, -26, -1, -12, 8, 3, 13, -14, 31, -6, 11, 1, 9, -5, 4, 22, 13, 0, 6, -3, -11, 26, -6, 6, 11, 24, -16, 22, -3, 9]
5751IJ0l3k4K8oJ9Plk5J7j5%jLOK2qj8JPJMOj7J2J5Moj9LM1k9Rk7PJ4Kj4J7k1
5791bpQj0K8k3kMKpoK8j6J9k1J9l8J7pPj2K2j0J5J9l3J5Jj9RpJ0M1m6K1j8Kj3
5828a0J0j3K2k8J3OqJ3j1PrJK0m3j8M4pk6K5j3L8ok3M4l0k0K0J8j2Kl5K8J5rM
5863IjL5k3n0L3oKOp%Qk8K8lkM5m2k3k2N5k0J9k0jRj4L3j5k0J2nLJ3mJ6l5RJJ6
5902A1k4L5l3K0pJ3oj0L2k3NOjk7L4k9jJ8k1L0j7jrj6L1l6pM0m1JJ3%j4J9J8r
5938fj0J3K6n4J1K5j6k4L5Nk4J6JL1J2k8j0J3Jj9%j1J8Ll2K1j3PONkl6K4J3J6
5973A7m3J0j1K3J4kpj8N5j6j1Rl7J5PJ7qk3M0l3L9k0j4mRj4MJOk2J5K5m8M2Jm5
6009b7j7M4J6pl0lK4kj7mL7j9J1j4l2L1kmL0j0Nl0M1j2J4j5lK8lk5NnrOLqK3M
$$ y = [9, 19, -14, -38, -10, -16, 3, 10, 7, -18, -1, -16, -16, -17, -14, -8, 14, 6, -12, -11, -4, -3, 1, 7, -10, 2, 17, 21, 15, -4, -1, 40, 11, 20, -7, 0, 14, 16, 2, 19, -2, -9, -1, -11, 17, -6, -8, -4, -2, -9, -15, 13, -3, 16, -5, 14, -24, -7, -14, -7, -19, 3, -7, 8, 27, -6, 9, 10, -9, 0, -7, 3, 44, -2, 19, 1, 3, -10, 0, -13, 9, -19, -6, 0, -8, 5, -6, 1, -8, -7, 13, -30, -48, -4, -11, -37, -12, -25, 13, 7, -16, 28, -2, -22, -2, 16, 4, 6, -29, -1, 14, 5, 9, 8, 43, 20, -30, 3, -3, -1, 5, -2, -2, 6, -22, 6, 3, 1, 46, 4, -19, -41, 14, -6, 13, -7, -8, 1, -13, 20, 5, -15, -3, -8, -5, 8, 4, 20, -15, -6, -5, 11, -13, 22, -11, 9, 2, 15, 9, -1, 31, 8, 13, 19, 18, -9, 25, -4, -5, 13, -8, 22, 5, 4, -5, -21, 10, -26, -33, 7, -34, -33, -20, -20, -34, -15, 3, -6, -16, -3, 23, -31, -20, 5, -11, -35, 0, 5, -19, -3, -2, 29, 41, 13, 3, 16, 17, -2, -2, -13, 5, 8, -24, -3, -16, -9, -3, 2, 0, -36, -12, 1, 17, -26, -16, -27, -4, 10, 8, 1, -17, 38, 22, 11, 20, -17, -2, 5, 22, 14, -9, 31, -2, 37, 17, 3, -1, 8, -6, -2, -1, 5, -17, -2, 23, -25, 17, 18, -27, -44, 0, 16, 9, -21, -24, 0, -2, -19, -23, 14, -5, 6, -8, -40, -9, -11, -15, 15, 5, 10, -20, 21, 9, 23, 8, 5, 33, 30, 5, 10, 5, -4, 2, 5, -3, 20, 24]
6047B4m1K0Kj4K5pk2J%Mj7KMJ0k1KK4j4K2%J3j7k8K7Lj9J8J5j6MMk3K5Pok4K7
6084A4mMj4K6j5k9jOJ1QK3k1k8mllK3Lj9J0RKj5K0j7j2K7jJ0k0NOj6RJ0k4L1J5
6122B6j8J7nrj7LK5k8oL7j2Mj8OJ2j6j4J6Noj4j2J6jJ5Ol8K0Lj3K2rlK3j7j6K1
6159Ej6jK6J4j0J2l1JJ1j0K4k6k1M2nj2J2k5%J3j0J7Qm5K8qPk4L4l7jL8n1L2K9
6194B0pprLL3m5M5n4K6LrJ5J3l0L6l1K2Nk8OOJ4Jlkk9k2N2l3Lqk0K1kJ8j0rk4
6232d0K6k5N3k2J2j8J2J6j1Rk3J2J1Mrk0mJ8Lj3K5j9J2Mrj3J4j4nJ6j3J2kj1J3
6267Aj1J5kj7K6j9qjnPJ5j6k%J5J0l3K6lPJ7j9J3J3l3j5J8K8l4j1J3%lJ1rKOo
6305dl1J7klJ2Rkl8L5qKj7J7K2k7L0k0%kQj0MPOQlj6l0N2k4K8k1J9j8PJ2M2o7
$$ y = [24, -17, 3, 5, -9, 16, 9, -13, -12, -12, -8, -25, -23, -19, -9, -30, -28, -4, -18, 4, 4, 17, 0, -28, -1, 2, -17, 1, 16, 0, 4, 8, -15, 10, 17, 11, -13, 14, 10, 14, 0, 26, 11, -18, -19, -13, -2, 6, 29, 8, -20, -24, -27, -30, -7, -4, -23, -13, -4, -2, -17, 3, -14, -26, 1, 0, 10, -10, -5, 1, -15, -6, 4, -20, 11, 26, 8, 25, 20, 11, -6, -3, 22, -6, -12, 25, 13, 17, -1, 5, 17, 1, -13, 3, 8, 2, -12, -24, -8, -9, 6, 12, -26, -6, -3, -16, 6, -3, -6, 17, 0, -16, 5, -11, -12, 14, 28, 18, 30, -1, 0, 11, 1, 25, -1, -22, 20, 15, 3, 15, -10, -10, 3, -7, 10, 18, -27, 1, -7, 0, -24, 10, -27, -28, 10, -41, -9, 20, 13, 6, -3, 0, 33, -12, 33, -21, 5, 8, -1, 14, 27, -3, 33, 2, 24, 29, 1, 7, 13, 27, 28, 25, 23, -6, -28, 24, -9, -6, -14, -34, -13, -15, 3, -7, -16, -40, -14, -39, 14, -8, 4, -14, -2, 14, 3, 12, -11, 1, 12, 16, 7, -13, -17, 1, 4, -9, 16, -3, 9, 13, 4, -9, 5, -9, -14, 2, -11, 1, -1, -12, 1, -10, 5, 3, -14, 12, -7, -15, -16, -21, -14, 1, -15, -17, -17, -2, 8, -25, 1, -2, 5, 22, 3, 16, 29, -4, -19, -1, 27, -7, -18, -5, -5, -8, 3, -6, -4, 2, -4, -35, -18, -20, -23, -11, -2, -4, -42, -7, -15, -13, -30, -13, 9, -18, 12, -8, -8, -10, -2, -12, -8, -1, 5, 13, 10, -6, -36, 16, -8, 20, -1, 18, 0, 7, 19, 61, -6]
6343fK1Rk6J3lK7k8k7LK1k5J9k9RJ6J4l6L2Km9O2j5qK9j8k2K0j4RJ9j9K5j9KJ9
6378B7k7QJ8momroqmL1m3K6j0K0j8JMPj7RJ6K3m6pL2j7Pj0mK1Oj5mLj7K0PmK6
6418C2j5n%J7j4j5J1J7k6LKk2j5M5Jj7Pl3M6k3j2J5k9K5J7j5J3qpoj6J5M1l9k
6453a2K5mKOn6N6Oj1Mk6J9j4K1J0Pl9nM2j4ljj3j6OJ2rPjj9QkJ8QJ0n8K7pK0j2
6492hJ5okPJ4m3L6j0J5m6L1r%N1m6Rk4M1l7RJ2J9l0Rj2k2K4j2J3q%POj6kLj3j5
6530d0J3K9N%k2K2Lj8J9rllJ8rK1k3j7L4mj0k1J6rJ7j3J8Pk2J0k3pK3Mkj8Qj1
6567a7K1jj6K2J1l6L0Oj9j5kK4Lk0lJ9k8M0ll7L8rjMK4k9J6j8J4j4Rj9JJ5k9J8
6603aoJ2joj7L6k1Lk5J3Opj1PJ3oJ4j7KN1m1K2J4ok7J6j1j5K2j7OJ8j0LK9k9j4
$$ y = [-6, 15, 24, -2, 11, 8, 35, 7, -20, -17, 4, -21, -2, -31, -22, -6, 8, -28, 4, 6, -43, 19, 4, -4, 25, 7, -15, 5, -9, 0, 19, 0, 25, 6, 8, 27, 0, 8, 26, 22, 16, 12, 3, -3, -11, -15, 16, -27, -1, -11, 9, -9, -8, -4, 3, -14, -5, 11, 34, -12, -19, 13, -4, 3, -7, -11, 10, 16, 1, -3, 0, -17, 3, 10, 6, 32, 17, 12, 12, 29, 15, 0, 11, 28, 2, 5, 7, -15, -30, 15, 16, -1, 6, -27, 19, -4, -16, -1, -30, -5, 12, -3, 10, 2, -5, -11, -27, -12, 29, -10, -12, 13, 9, 11, 17, -39, 17, 23, 12, 16, -10, 9, -5, 16, 26, 33, -6, -11, 31, 17, 14, 13, 0, -16, -10, 2, -7, 0, -1, -20, -12, -14, 4, 12, 22, -36, -9, -16, 4, -8, 7, 1, -1, 6, 20, -23, 13, 3, 18, -28, 3, -6, -6, 45, -1, 8, -16, 25, -12, -3, 9, 28, -2, 7, -5, -27, -3, -15, -2, -10, -10, -3, 3, -13, -15, -12, -25, -40, -27, 2, 7, 7, -15, 7, 10, -8, 11, 2, -1, -4, 14, 5, 26, 3, -14, 20, 16, 6, -15, 1, -8, 9, -4, 14, 21, -1, 9, -14, -21, 2, 6, 4, -14, -6, -17, 4, 3, -13, 9, 20, -16, 14, 20, 1, -14, -16, 8, 11, -9, -12, 7, -21, 19, 16, -21, 17, 8, 7, 11, 35, 6, 22, 4, 18, 4, 13, -6, -5, 10, -19, -1, -7, 5, 4, -2, -19, 17, -4, -1, -26, -13, -7, -14, -25, -18, -5, -11, 3, -14, -12, 39, -2, 20, 34, 28, 1, 17, 6, -9, 13, -4, 2, 20, 10, 13, 42, 13, -1]
6640aK1ok7k0N1pNj2mj6L7j2j2ml%%pK5k3J1JJ3j3RqJ9Pk2j6MK5j8K0Km2K4mj5
6679a8M7l7K4k4L4k8KK4jl2J7J5j4j3J3j6J4ml1M4ok2J6JKk9J7J9JnjJ4j0Qk8
6714gMJ9l5K2mJ4NkRj9KjJ5k4J3J1k1kK0j5Pm0L5j6qJ6L%l2K8j2LJ4J7l6J3J2
6751Hkl7L3j4J2K6l6LL1J9l5J5Km7L4k0%LnK9k7QrJ2lk3N2pk7rL7j0j7ojmJ7J3
6789A5j8J3j7j2L6jj4qlK1Jl2RlL3j8K2k0J0j7J4k3KMJK2j7nomL0j7KK1k8qJ7
6826BRrj9Rjl2K0J4mpK4k0K2k3K2QJ7m2J4mJ3oK2%j4j8J4J2j9%pJ6j6M3l2JKk0
6864ipJ6omOj1lK2Jqqj1M3j7%Nj3j0jJ5nJ7Jjl0K8j7N3l4jj8j4M8j1j6Pj7oK8
6903A2j1pK1ok6L0l0J5j5k1M8j0J2Jk4OK0rKj7J6PrJ3mPm3K0pLJ9k7K1Q%l0lK4
$$ y = [-1, 20, 14, -13, -33, 18, 11, 16, 4, 0, -16, 21, 9, -3, -7, -10, -10, -10, -17, 8, -15, -4, -3, 10, -3, 6, -2, 17, 24, 2, -14, -10, 15, -3, 17, 19, -23, 1, -3, -18, 29, -8, 16, -8, 26, -2, 0, 24, 23, -9, 8, 23, 9, -4, 9, -7, 7, 3, -28, 16, 10, -12, 4, 5, 7, -22, -5, 14, 15, 10, 9, 23, 13, 21, -7, -3, 16, -19, 3, -1, 13, 18, 16, 25, 6, 8, 7, 22, -2, 11, 22, 1, -1, 19, 4, 11, -29, 6, -10, -18, -2, 1, 1, -31, -3, -15, -12, 2, 19, -17, -4, 8, 6, -31, 2, -12, 0, 26, -10, -7, 24, 43, 8, 23, 25, -22, 12, -8, -8, -5, -10, 19, -8, 0, -9, 3, 0, -23, 29, 22, -5, -14, 23, 13, -4, -10, -11, -15, 2, 15, -3, 10, -7, -19, 17, 16, 2, -6, -9, 12, 13, -19, -10, -13, 20, 2, 24, 4, 14, -3, 11, -12, -10, -6, -5, 17, 0, -5, -11, -15, 15, -2, 0, 21, -7, -15, 2, 11, 2, -17, -8, -9, -41, -21, -7, -11, -18, 6, -14, 8, -15, 7, 15, 32, -10, 4, 0, 13, 7, 29, 29, 15, -3, 11, 23, 4, 4, -3, 13, -3, 40, 8, 9, 11, -9, -16, 0, -6, -10, -4, -15, -18, 4, 5, -3, -11, -22, 21, 4, 4, 9, -4, -14, -15, 0, -5, 12, 13, 12, -18, 10, -7, 46, 12, 11, -7, -21, 27, 16, 0, 7, -10, -16, 12, 1, -6, 15, 9, -17, 13, -17, -2, -17, -38, 10, 0, 12, 13, -11, -5, 15, 6, 8, -9, 7, 14, 5, 18, 14, 21, -22, -2, -9, -6, 13, -14, 7, 15, 15, -15, -18, 6]
6941FJ3k8J8J5nj6lK2j3%j1j1nJ0p%J0mj5J1L2l5K2qj8RM7k3Nj6K6j7k3M9j2K
6977B7J2m0rK2oLl0N3k9J0j9J4Jk2nL0j9K3k6J9pj6L2n3LJ2KJ5Nmj3PJ6j4Mjj
7014dJ3J5j9OkMpJ6mj9%j9K3j7K4k1lOrLqK2l2J7oK8J6j7kk0kL5k4LJ4j5l1K6
7052a0pK8pJ7k3K0j8%L2m2K1j6L5k7NoKmJ5MJl1J3kK4l4kK2j7j9M1oj5j5K6J7
7088B2l4nj9K1K1j0K5Ml9J4Kj1MMJ8j0J0LpKRmj7PJ1k9K0k4J2k6OMK0lj6K8m1
7125b8RpM4k9KJ5jk5M1ok0PRk1j1J4K2j7jJ2Rl3KK1J6j0j2OJ1j8%J8k7pmJ6rL
7163iJ4J3rlk1J4rj2L4j8L1j3k4qL5Nl2j0L2k3jJ4k4J1J7JlJ6kj5J2j2k0L1L5
7198D7n0rJ5mjoJ0j0Kkj2rnL9k3K7j6jJ1oJ4l9nJ6oJ8Onj9J0J6j2QnJ8k5QrJ9
$$ y = [6, 19, -9, 9, 24, 19, 3, 0, 22, 9, 9, -2, -13, -18, -8, -15, -15, -5, -9, -24, -13, 19, -16, 6, -2, -20, -11, 36, 13, 18, 2, 28, 11, -12, 37, 25, 27, 39, -1, -10, 12, 6, 9, -21, 32, 3, 13, -6, 8, 9, -13, -18, 12, -7, 16, -10, 9, 2, -14, 18, -35, -32, -20, -18, -3, 2, -2, -15, -8, 8, -6, -2, -3, -4, 9, 24, 5, 11, 9, 13, 6, 22, 18, -1, -1, -20, 3, -14, 10, -11, -14, -8, -17, -14, -22, 0, -32, -15, -21, 7, 23, 6, 4, -16, -18, 17, -7, -4, 10, -5, -36, -10, -17, 11, 4, 21, -2, 18, 0, 0, 32, -10, 11, -5, 30, 3, 8, 2, 4, 0, 15, 19, 20, -11, 2, 0, 24, -10, -12, 10, -7, -26, 15, 9, -6, -21, 5, 22, -12, -17, -36, -15, 6, -4, 21, 25, -14, 0, 2, -9, -5, -1, 17, 7, 17, 20, 13, 15, 24, 20, 3, 10, 21, -8, 12, -12, 0, -26, -20, -16, 4, 1, -15, 13, -28, -19, -26, 18, -11, -9, 6, 5, -20, 21, 15, -5, 2, 11, -10, -21, -7, 15, -2, -3, 9, 18, -15, -13, 8, 24, 14, 2, 8, 19, 1, 1, 19, -8, -15, -19, -3, -12, -9, 5, 18, 9, 6, -15, -1, -10, -22, 12, -6, 25, 12, -12, -20, 15, 20, -12, -22, 10, -13, -14, 0, -24, -13, 4, 5, 2, 18, 16, 1, 13, 1, -19, 12, 47, -3, -12, 3, -1, -2, -8, 2, -8, -6, -8, -20, -29, -34, 5, -18, 9, -7, -8, 3, -3, 11, -28, -33, -17, -23, -5, 1, -4, -23, -13, 3, -9, -1, -6, 12, -13, -5, -14, 5]
7237ElPj3k0J9KmklMj0K0ol2L1kj4MkJ9j6Om%LQRkj9L3j4k5lM5k0MLQlJMrjpJ5
7282A6k0J4Nj6J2k2K2j1Kj9mK0Ljpj2jK6k1K3Nj8j5J5j5M4l3QJ3ljK4k8k1J1Q
7318CMj3J2J2j1Nj6K4qNk9LoJ2MLk8M6m0J5L2n2J7MLoK2k6J5j3mJ6j3oK7k5J1
7355anJ7j4Rj9J4nK0kj5l%K0k7J1k1K1j1OjJ1k3lJ3KJ2K5k1m8L3MLJJJj7PRjQ
7395A1Lj6QK8l6J3jOnmK1j6K7l0oJ2Mj9OloL1pj6pl4K8qJ4J5J1l5J7loj3pK1M
7434BmnlK2J9Jm4K3qJ4pJ6l7L9oj1lj1J5k6L7k2kPk1J4j0Ojk7M3nk4K3j5J5Pj6
7472eK0j4JlNmLK0j6j8L8K5m7rJ9j3qj6M2j7LRKk6NJ2jOpl1mK8jjoK2Kpk2knJ7
7514dk1J1K3k3K6j1PLj5J4k2NK5j0q%Kj8K6k3KK2j1J9m2J%ORj0NK3mk9M7k2j1
$$ y = [5, 2, 9, -4, -24, -5, -3, -7, -9, -12, -8, -18, 2, -4, -36, -5, -7, -21, -17, -19, 0, -16, -10, -14, -14, -11, -3, 6, 4, -15, 18, 4, -21, -24, 21, 1, 5, 8, 16, 13, 14, 18, 9, 8, 1, 16, -4, 10, 15, -1, 11, -11, 11, 0, 2, -17, -21, -1, 2, 1, -6, -18, -19, 7, -14, 9, 14, -4, -19, -4, -19, 25, -8, 0, 13, 10, 9, 33, 5, -16, -5, 3, 7, -6, 6, 18, 7, 12, -4, 20, 12, 17, -12, -9, -15, -3, 1, 4, -24, 22, -18, -3, 29, -23, -6, -2, 1, -5, 17, -9, 6, -7, -11, 5, -8, -14, 13, -12, -1, -6, 11, -3, 6, -13, 1, -4, 16, 14, -1, -4, -4, 16, -11, 0, -21, 0, -11, -5, -6, 5, -18, -21, -8, -6, 6, 31, 10, -38, -5, -1, 2, 3, 4, 5, -12, -5, 4, 3, 11, 14, -2, 6, 34, -2, 11, 10, 16, 11, 7, 28, 12, 39, 9, 3, 15, 19, 0, 6, 3, -3, 28, 21, 5, -2, -36, -8, -16, -2, 13, 24, -11, 6, 3, -3, -16, -23, -2, 2, -2, -7, -10, 12, 31, 32, -12, 11, 3, 17, 10, 26, -11, 28, 22, 11, 8, -3, 12, -14, 23, 1, -1, 6, -15, -1, -11, -5, -6, -33, 10, 5, -19, 4, -11, 4, 11, -5, 15, 1, 2, -1, 4, 0, 3, 23, 7, -11, 27, 52, 5, -4, 15, 2, -6, -22, 20, 3, 6, 15, 17, -9, -4, 8, 7, 13, 6, -25, -29, -1, -2, -3, -9, 13, 15, 8, -14, -16, -21, -4, -25, -14, 9, -14, 12, 1, 8, 11, -4, 10, -12, -7, 18, 8, 0, 0, 2, -16, 10, -13, -11, 11, 0, 19, -23, -22, -22, -16, -7, -17, -12, 11, 7, -22, 25, 3, -8]
7551hJ2Mk9jJ5k5K6k0J5J5mqlJ4j5JJ9lJ5m2L8pj1J8j2OJ4rj8Qk7K6l4K8Pk3J2
7588fqJ0jjj5K8l3J3j1J8JpJ9rj2MNj2J9pPK0%ml8K5k5K1L2l5K2j3qjNrMKk1K1
7628@j5M4nl6NK2oj7k7J0J4kJ7qJRKroJ0pr%J0K9J2j1mj4QjKLkk%pJ1Ol8QMJ7
7671A8k9K9J0m0Pj6jM4o6M8nj8K4L6o0J1l9M1NopKJ5j0jJ4poK6jrlJlJ2l8J3J1
7709BmRk1J3J2j7J9m1J6J0mJ2kk1J3j0j1K2J1Ok4K8j0%lkj%KK7koj7J5j9J1j4
7746aL2l5Oj3L4j7oJ3k1L8m1K5m1J9qJ5%k8M0k0kk6O1l9j3J7rK0%l%j2J8l9O9
7781C3j7k6J6j2J5K3m0jK1K2m1lK3k9J6Pl7M9j4ql8K8qJ6%j4K4mj6k5J1J5NKJ0
7816CoJ0kj3NJ1Oj1J0k2J1pLQJ5j7Pj0J7k0J4pj1QJ2l6jK3j2K3%l5MK4j2k3RM1
$$ y = [-8, 4, 8, -21, -22, -7, -32, -6, -26, -11, 4, 0, -8, -11, 3, -12, -11, 8, 5, 20, -22, 16, 9, -2, 16, 4, 10, 24, 15, -3, 5, -22, 4, -30, -2, 5, -18, -6, -14, -4, -5, -6, -21, 7, -26, -13, -24, -6, -5, -12, 7, -2, -14, -10, -5, -17, 2, -5, 2, 22, 22, 18, -20, 5, -20, 1, 33, -2, 20, 7, -1, -2, 3, -6, -2, 0, -21, 0, -15, 29, 24, -12, -7, 15, 9, -8, -35, -25, -11, -13, 4, -4, -3, 6, 8, -1, -7, 3, -4, -13, -13, -3, 26, 38, 27, 23, 9, 17, 16, 18, 21, 19, 17, 17, 10, 21, 27, -11, -3, 1, 18, -11, 18, 28, -12, -5, -21, -22, 22, -44, 4, -1, -19, 5, 41, -19, -8, -47, -6, -1, -7, -14, -12, 3, -7, -8, 6, -1, -7, 19, 18, 9, 6, 7, 4, 16, -22, -9, 2, -2, 7, -14, -1, 11, -6, 13, -28, -12, -2, -6, 6, 4, -17, -4, -14, -25, -3, 8, 14, -10, 18, 8, 8, 5, 3, 2, 2, 4, 31, 29, 23, 6, 21, 2, 13, -1, 31, -4, 2, -11, 23, 6, 0, 13, -8, 30, -11, 14, -27, -8, -16, -1, -1, -29, 11, -9, -11, -37, 24, -15, -28, -11, -20, 0, 0, -3, -3, -15, 3, -36, 33, 16, -10, 6, -6, 9, 32, -8, -9, 12, 34, -7, -10, 13, -16, 0, 7, -30, 19, 5, -3, -41, -13, -21, -5, -5, -19, 5, 1, -15, -40, -29, -14, -9, -7, 3, -3, 7, 5, -8, -3, 8, 14, 3, 13, -9, 2, -5, -2, 6, 21, 4, 11, 1, 18, -2, 12, 5, -6, 2, 14, -22, -23, 0, -12, 11, 11, -24, -20, 4, -8, -31, -22, 19]
7854A9k1nRj3j0L1k8J9J1k8K9j1K0j6J2k8N3l2nJ8l6Nj7J2PJ2l9L8Qj2Lk9J8j
7888gj5L8qk3J3j6JJ9K2m9K9mJ8oj8j1Kj3L0K9m6RNj3J2J1Rkj8J0j6RL4k9J1q
7924IoPj1j0L1l2rnL0oMlJ6m4OK3JMmj0kJ4jK3l0M6l1Qk4K4j1lrJ2k5QK7Lj4J3
7964A9kl9L7olj6J7%j6k0K2QJj1j6J9J0k5QK3r%rjJJ2j7M7m3J3j3J8Mj0mj1L0
8001A8k1n%J2j0pJ4J1j8L5l2L1%pl0J1l1P%J8j3JJ3j2J2j%rNl5M7j1J6j8Pj3R
8038fJ2j3OmmnL6k5J8oj5Nj6J0RjMj8L2j2j6j2KNkK1k2pK4nk9L0jj0K5j2K%Pj8
8078a1mK6pMJ7l7J9rKL2mj9kJj9J4lJ7m8K7K7k5J6rJj7J2qj0KMK1k7K5m4L1J6
8115A1l2K3k0J6J4lLm1K8j0jMKJ9P%j1qkPk2J9k1j8L2J1Mk4J5k3J3K1m2K0rKj7
$$ y = [19, -2, -7, 2, -11, -21, 10, -18, 1, 12, -16, 13, 2, 22, 6, 18, -10, 43, 11, 6, 24, -12, -7, -24, -12, -5, 7, -32, 6, 14, 2, 5, -24, -6, -7, -22, 16, 8, -15, -2, -18, -17, 2, 24, -25, 4, 0, 18, 12, -6, -17, -15, -28, 2, 31, -15, -6, -1, -14, -2, 9, 18, 16, -2, 8, -8, 1, 35, 6, 17, 9, 3, 10, -1, -11, 20, -12, -21, -26, 4, -2, 2, -1, 15, -29, -23, 0, 1, 5, 1, -9, -11, 3, 2, 25, -5, 41, 10, 18, -6, 18, 7, 4, -5, 7, -18, -10, 17, 20, 6, 19, 17, -22, 15, 9, 6, -10, 7, 7, -9, -29, -7, 1, 2, -9, -25, -6, 4, -21, -13, 10, 1, 1, -8, -9, -8, 4, -13, 34, -9, 4, -9, 9, 13, 3, -1, -12, 18, -3, -8, -8, 4, -6, -13, 1, 12, -6, 29, -3, 28, 28, 21, -9, 2, -29, -22, -22, -4, -17, -16, -3, -15, -3, -4, -4, -13, -8, -43, 4, -7, 9, -9, -2, -15, -6, 6, -7, -1, -5, -9, -14, 22, -3, 15, 9, -6, -1, -17, -7, 2, 1, 5, -13, 19, 7, -9, -21, -19, -14, -16, 5, -17, -24, 0, -5, -34, -4, -5, -15, 10, -2, 0, 0, 7, -11, -15, 11, 4, 8, 25, -12, 7, -2, 0, 32, 28, 9, 7, 8, -11, 3, 0, 17, -31, -4, 23, -2, 14, 5, 6, -11, 1, -7, -17, -15, -11, 10, -17, 8, -36, -5, 11, -21, 2, -18, -2, 12, 9, 12, -29, -1, -11, -12, -8, -6, 13, 20, 20, 9, 1, -1, 6, -16, 3, -18, -36, -4, 7, 11, -13, 2, -21, -8, 13, -29, -9, -18, -16, -33]
8152c3L7j8LN2l4j2Lj0K7j0j0J2k7K0%QJ6k7J7qoNk1J6k3KL8l6K0j4L3qrnJ3k1
8188a0J5l5L
$$ y = [-33, 4, -14, -11, 41, 7, -5, -2, -12, 15, 5, -5, 7, -20, 0, 0, 8, 24, -3, 14, 6, 0, 5, -16, 0, -23, -21, 17, -19, 1, -13, 20, 12, 3, -2, 11, -10, 5, -30, -27]
8191b7
$$ Imaginary data points
##PAGE= N=2
##DATA TABLE= (X++(I..I)), XYDATA
0@%%%%%%%%%%%%%%%%%%%%%%%%%%%jRj6J6j6J6j6J6j6J8k6L2l2L2l5M3m8N0n8O4
47C2o7P5q3R1j00J11j24J37j51J68j88K09k36K70l11L66m38N35o80R21j381K542
69A698j0287j7699L0175K941r230J6192q333k4628J5773J6431r043J496K43j5345
83i616N425J5413m529m362N64q079K119J0107j807l105j710n852L536O182k706
98A580N05o92q103L283Q047m573r04M113p813j865J0749k072n420O078m032o603
114g722J0160K656q160L506N65p124N967O126o291p33K087m813K589O931l940
129A804l641K642k235L75O014k163m251K017r82K60M680k306m004K288o9o23L521
146C327j460m279J944J627j665J796K9m275J372L224k425K44J627l654K53M131
$$ y = [0, 0, 0, 0, 0, 0, 0, 0, 0, 0, 0, 0, 0, 0, 0, 0, 0, 0, 0, 0, 0, 0, 0, 0, 0, 0, 0, 0, -1, 8, -8, 8, -8, 8, -8, 8, -8, 10, -16, 16, -16, 16, -19, 24, -24, 26, -32, 32, -35, 40, -43, 48, -52, 59, -65, 72, -79, 89, -99, 110, -126, 144, -167, 199, -239, 296, -384, 537, -844, 1698, -8589, -26288, 3887, 6828, -2402, 13790, 5457, -19171, -3398, 13033, 3990, 5486, 5729, -9616, -4191, 11222, 6693, 2331, 2895, -5184, -3065, 7042, 5235, 2130, 420, -5432, -1896, 4286, 1580, 2085, 1393, -6710, -3427, 4620, 47, -857, 3256, -4557, -6422, 4327, 2255, -3165, 2913, -1119, -7722, 2438, 5094, -3066, 440, 1005, -6119, -152, 5974, -317, -1050, 1037, -3776, -1187, 5744, 1804, -1837, 805, -1430, -1055, 4959, 2796, -1455, 562, -420, -160, 4520, 2214, -1790, 498, 429, -194, 3327, 1867, -2412, -468, 1159, -506, 1290, 1319, -2956, -1584, 1640, -785, -541, 1086, -2568, -2315, 1816]
162A816j793j586J869j480o42L052k82k054R75J8j037K087Q35k528K49J160j253
179e94J022J137j887k27P83q33R18Q11j483l48N56m50M65J025q45r79N74N9L6
198b60J264n25j444P98J81k60J534l43j831N52O01j59R53q8j522k14P99K59L43
217F38K92j403q88J262M49j95M74r76j122R61O86K26J47j004p12O09P33M45m7
236E75p53o50J50R29N86k23p12q24L45R38J31J24n59j281M51J115P8P6n55j069
256a128L33R88M03q1n84o55n1J035P78n76m84j75l70Q42Q86m74o70l74O0O42L80
277G25j10n72o56K80L97K08K34o26p32L57M49J54k9j92k85k62M05O02l02k24P0
298a09k84L72M34k68q8l8j33J49K22J49k26l52K14l7j12M01r1m26R7j4k9J23K3
$$ y = [1816, 23, -1563, 306, -1174, -1816, 1236, 954, -1100, -125, -107, -1144, 943, 1778, -750, -501, 659, -594, 428, 1565, -322, -549, 234, -599, 319, 1130, -353, -701, -145, -595, -130, 895, 50, -929, -355, -296, -260, 1004, 479, -965, -167, 14, -246, 1288, 945, -886, -334, 267, 108, 1061, 973, -549, -763, 36, 295, 638, 930, -473, -1361, -99, 350, 155, 629, -347, -1469, -508, 178, 404, 551, -453, -1165, -556, 177, 622, 575, -178, -828, -678, 251, 837, 614, -98, -922, -577, 361, 492, 616, 57, -1224, -773, 342, 420, 496, -59, -1128, -795, 193, 596, 515, -69, -724, -775, 260, 1038, 462, -22, -197, -567, 275, 1161, 687, 17, -357, -297, 345, 725, 615, 43, -613, -333, 64, 272, 506, -120, -852, -495, -46, 108, 79, -113, -398, -660, -255, 347, 45, -179, -109, -393, -21, 413, 145, 57, 19, -114, 35, 257, 406, 180, -172, 42, 5, -107, 294, 203, -223, -126, -140, -169, -46, -23]
321b3m8k31J19K55k53J29J30l33L29K99m20k5K58j9L9M0J6k00n7M06k6l75k3r5
345a08J42L70k44l25j71J6L16J11%k15n86J87N71n1N3j28m85Q3M38K72L1k93k73
368b89o5L18N52j39l36j00l43K70P12j02m13l31j48L59L92J13k66n77m2L84M21
389C70K36l67n85N2K85M26K58l32l83k65K16P49N1m68k68l08J61O58J00l72m89
410b75l01L07M56K76l84o14l3J53L12N75l45o87M3J89M06M04k51m20j60J61M73
431B85K80j67m20l16L15M10N3m4l79m04K26L33K22r1o32j34K46J40L07r3n19j29
453e11R3L39L39j61l99k00L18L78j2M9k18m78L24N50j50k9j92l71K55L97j8j92
475A11k05j75K4L99K18m56k16J42j60L15K87l62k19NR3L79j1k21j28j06K03K76
$$ y = [-23, -71, -302, -183, 72, -181, -52, 78, -255, 74, 373, -47, -72, 186, 167, 206, 246, 262, 62, 5, 411, 385, 10, -13, -108, 34, 404, 160, -165, -336, -320, -4, 107, 107, -108, -694, -507, 64, 13, 66, -62, -547, -464, -26, 246, 277, -16, -289, -354, -36, 516, 377, 41, -59, -402, -132, 580, 478, 65, -266, -414, -55, 337, 450, 184, -393, -435, -51, 370, 606, 239, -346, -294, -9, 417, 675, 343, -40, -305, -89, 660, 711, 243, -25, -333, -172, 486, 586, 214, -275, -576, -269, 187, 463, 79, -535, -568, -415, -103, 472, 127, -560, -517, -328, 78, 482, 231, -189, -349, -188, 285, 565, 398, -22, -338, -23, 387, 440, 396, 17, -387, -161, 172, 394, 303, -329, -463, -217, -77, 230, 137, -382, -511, -418, -79, 260, 99, -300, -500, -182, 196, 184, 233, 15, -463, -139, 411, 261, 232, 40, -331, -76, 321, 303, 111, -94, -269, -245, 154, 372, -84, -300, -158, -318, -3, 284, -78, -297, -292, -199, 180, 169, -52, -180, -286, -83, 193]
497A93l0j16k39j11K72K01K7k56k49J85P5Q2L10m32l70K80K03J28J18l04k89J54
519a68L73J45m8j21l30r2N99K02l19K8l18j96N31K34k21k45l15kL17K99j31m85
541b63k48J29J94L73j14n27j50J11L25L70k70k97r5p0N38M04l04l42p2J20M07
562B19K75j33m18j56K52K58L07l8p44j12M48N6K35K4o49k14L01K67J55r8m50k74
584d89K45M15jp2j86m46K13N26J9j21l00l01K55L65J11p3m05l04K93L31K04k20
606E9l99j22J34M32J83k93k36j90J32O43J1l55o9j70J45N42M7k34k40j39K30L36
628D47J24k20m08K8J22J08K98k44m79pJ77J23J50k32k81o6J09K89P8k04k05j73
650d66K28L70k9r8j71j45K38K67J17j01l74K8J96J39J40q6l38l6J24K03J53k76
$$ y = [193, 163, 47, -192, -303, -31, 170, 197, -59, -308, -123, -48, 34, 344, -88, -458, -178, 25, 153, 271, -33, -322, -168, 205, 350, 302, 181, -149, -241, 358, 560, 241, 269, -49, -245, 286, 520, 299, 54, -261, -263, 54, 353, 222, -263, -511, -382, -188, 185, 71, -456, -606, -495, -170, 200, -70, -367, -462, -532, 6, 410, 106, -236, -308, -188, 219, 494, 361, -57, -213, 39, 297, 604, 566, -178, -290, 158, 214, 449, 473, -176, -390, -89, 178, 333, 235, -215, -489, -244, 171, 170, 98, -88, -534, -321, 205, 224, 103, -197, -498, -243, 122, 233, 160, -245, -549, -256, 75, 279, 59, -340, -462, -328, 104, 287, -6, -242, -432, -300, 343, 354, -1, -70, -240, -95, 447, 494, 260, 20, -119, 111, 447, 571, 351, -57, -29, 93, 201, 499, 255, -224, -231, -54, 69, 219, -13, -294, -360, -251, 38, 116, -88, -293, -466, -238, 132, 103, 5, -166, -311, -73, 194, 311, 210, -164, -136, 60, 199, 339, 253, -85, -121, 3, 206, 359, 83]
672H3k18r8J38L27p3j40r0k61J68M32r6j55q0j60J58K59R7j79k21K5L0J63K58
695C67k95k72J60n9R1K58k09k75m1J18K00pq4j62r0J20J87O9jk47j24K05K23R8
719B30p8l09Q2P0N4L29j33l77O6J05O6J81j32k26j31J28J45J7J8k21k76K66J80
742E4q3P5j51k18J50K19Q6l8k05l9Q5J34J90j29j50m3J0J86J52j44j19j64R2J97
766A47m7K1j03l15J29K94p0l8r0j42N3J49J03n5j31m5OJ88K48k57j28Q4q2J14
790C3K25p6k07r7P5J73j6j4j27j82J09J20ON0j74j55J36J19N3m4j26L0j8J01J95
815A89j10j53P3QP0R2m2n1p9LJ38k7Kq2j76J67L0r9J02r1j46N5J01L4q0o2M2m2
843a34R0Q2j11oN6r2J49R8j27l0J5N1M3qJ6n0j13J24M3q0K9j24mP6m5O5k7j17
$$ y = [83, -135, -233, -95, 232, 159, 19, -71, -332, -164, 268, 172, 17, -63, -223, -65, 194, 291, 112, -109, -84, -54, 109, 367, 72, -200, -40, -99, -8, 250, 41, -234, -275, -157, 43, 36, -48, -210, -300, -180, 7, 76, 75, -172, -296, -91, 132, 230, 152, -157, -75, -5, 49, 378, 245, -132, -66, 39, 105, 286, 154, -72, -203, -75, 70, 87, 105, -116, -392, -126, 54, -29, 46, -105, -323, -173, 46, 132, 94, -111, -150, -65, 69, 259, 130, -20, -63, -53, 133, 285, 141, 22, -142, -50, 147, 100, 121, 18, -297, -168, 126, 56, 18, -72, -214, -161, -12, 91, 36, -95, -140, -134, 54, 302, 45, -83, 1, -81, 33, 258, 182, -25, -122, -47, 126, 110, 96, -31, -213, -104, 16, 22, 72, -102, -257, -121, -2, 51, 7, -119, -89, -107, -6, 189, 79, -74, -1, 7, 77, 169, 127, 76, -3, 0, 138, 111, 113, 31, -145, 22, 52, -47, 55, -36, -182, -127, -26, 8, -72, -134, -92, -134, -44, 38, -73, -79, -23, -115, 34, 132, 5, -25, -10, 41, 84, 76, 92, 42, -71, 53, 96, 16, 45, -79, -83, -7, -52, 13, -14, -131]
871a31O2J8Q6K4j73N3Q3j2N0L6j09JL7Q7K0p3l1mj1J45q6o0N2j43NJ60o6p8j2
900g0n2N7PM7m4j25M7Q1K2R0r1r6J01M5N4O3j02m4lQ2J41j05q3M1p7J3J64o4q6
929A3p2KP8K7op8q1K7Q6k0J08o2j83J16J04M5k9o1l9pO8J21n9j16M0r4J29J12
957A69j52l9m3l7J24j1K1r0j38J06R5l4N2l3j84R6J05R1%j16nRP3J43j48j9L7
984G2j41J53J61j44j13k0k8O7N3k0r3j08N3O2M2K9j74l7J12J6M6M8j55J8N8O6
1010B3J17j18n8N0k0N2J18p0q0n4M6R6k7Nj02j23J68J8o4P5j09j36J48O0n5L2
1036hr0n0P3J03M4r8j2l4K1J53Mr1K2q7L0J44n6Mo6j13J44N2n4l4p5m6P6N2O2
1065G0r9o0K6OJ04P4j75QL8m6J59M7j84kkO0P5K2j06p5j7N3Q7lm1j92K7J31m7
$$ y = [-131, -69, -51, 35, 59, -114, -61, 22, 10, 60, 96, -13, -12, 25, 112, 132, 59, 28, 24, 13, 158, 72, 12, 64, -79, -74, 86, 20, -58, -70, -122, -65, -58, -11, -55, -180, -133, -52, -30, 60, -31, -127, -26, 19, 73, 136, 34, -10, -13, 69, 210, 105, 22, 63, -14, -1, 163, 99, 13, -59, -57, 21, 48, 42, -36, -117, -90, -4, -24, 84, 22, -161, -45, 59, 104, 75, 14, -25, -32, 36, 157, 98, -18, 22, -72, 57, 169, 17, -22, -65, -102, 22, 11, 32, -58, -196, -90, 5, -29, 23, -10, -194, -98, 7, 98, 98, -18, -23, -14, 59, 202, 54, 35, 72, -69, 84, 245, 101, -12, -32, -60, 7, 60, 40, -53, -161, -108, -46, -4, 25, -149, -186, -74, -58, -12, 36, -119, -101, -43, 23, 140, 22, -36, 14, -6, 46, 164, 94, 14, -40, 6, 102, 75, 80, -22, -145, 23, 41, -23, 52, -57, -193, -45, 15, -40, -8, -98, -148, -75, 28, 72, -26, -38, -72, -51, 102, 106, 15, 37, -50, -20, 124, 68, 72, 6, -107, 37, 89, 35, 1, -74, -120, -44, 8, 70, -29, -89, -63, -57, 47, 121, -54, -46, -8, -54, 105, 152, -32, -34, -36, 24, 99, 121, 15, -60, -77, -24, 63, 60, 19, -173, -146, -15, -62]
1094f2P5m6j35O2M3Q8N4j53n4R2K6J04Lm4q0KR1J01l5n2n4l0J18K0l6J1j80l9
1122a10J46L8k9o9r6QQ9J7K0r5n5j1P9J16m7r2pk7R5J37k1o0p9k4J43O5o4k8j09
1151g0O1N5QM9r2j22P5J3M8K0q6jk1j0J87m7j41Pj7Q8J05p5l3l9j4P7N7pn0j21
1181i6R6K8J3L3q4j19M6K6P5K9j50l2Q1jJ06n4o5L2r0J23J04o1k8m5J1Q4%P6n8
1210H0j09K0Q5jL0q6r1Q8%L6Nr0n9k0M2J10p5o5M1l2M4O1Nk0o2PR8J6J3k1j04
1241e4R3L8lM4p9r2N9O1j1j3n2j8k4K1P5o5j7l9k9Q5N1q0K5n1j7J35k4o%p0N2
1272eO0K5rn1qKMQ3k3j21K3l4O4L6l4p4J0l2N9P1q0k2j0J4P0J6k3j8o3Q8J6M1
1304G5Or5oM8jL9L5j18k3K1M1M4n5m9k0NN1K6m8k6o2N2J00l5mOp2M7M6K4J8p7
$$ y = [-62, 13, -33, -168, -106, -63, 25, 79, -74, -128, -36, -10, 94, 97, 53, -27, -25, 66, 167, 132, 80, 26, -4, 114, 134, 98, 109, -71, -110, 36, 74, 45, -24, -120, -112, -23, -6, 14, -81, -136, -147, -68, 48, 1, -91, -98, -125, -30, 107, 86, 26, -53, -77, 66, 131, 67, 39, -70, -9, 46, 54, 103, 11, -111, -36, -23, 25, 45, -41, -42, -63, -73, 114, 67, -74, -67, -84, 4, 109, 34, 1, -38, -52, 25, 82, 75, 25, -96, 0, 28, 41, 74, -10, -129, -83, -57, 18, 47, -103, -135, -54, -55, 51, -3, -68, -36, -126, -3, 101, 40, 12, -33, -22, 62, 62, 138, 80, -29, -9, 76, 75, 105, 19, -72, 16, 16, 52, 57, -33, -92, -112, -70, 40, -35, -100, -59, -91, -47, 14, 19, -1, -63, -56, 42, 58, 71, 50, -54, 39, 77, 74, 118, 39, -53, 6, 67, 56, 43, -9, -27, -51, -30, 45, -20, -37, -76, -105, -20, 31, -49, -24, -75, -92, 43, 19, 13, 13, -57, -5, 55, 80, 71, 20, 12, 14, 18, 101, 78, -43, -20, -54, 10, 46, 12, -62, -52, -84, -25, 46, -34, -56, -66, -52, 18, 34, 11, -7, -70, 18, 34, 75, 81, -14, -20, 28, 27, 66, 101, -17, -40, -19, 22, 66, 11, -38, -58, -53, -2, 24, -24, -50, -112, -60, 40, 5, 1, 7, -65, -18, 28, 52, 70, -7]
1336gRL5J6L0k1o7j1J2M3K8m1n1k5j0R4j8p2L4n8k9J05Ok7l5k3N3J4N9Qq6N0l
1368A2K2O8j4r9KK7N2L1m8m8pk4N1J5p2Rl6j6N6ol7Kn7O8K1L9j0p6K4O5l9N3L5
1401F3q0K2J8K5M8l8l0l6QP2l7j5on3pP7j5Jm6k9J3M7JJ2q8K5M2j1N4ol6L1j1
1434A5K6Pl6rk0J1N1j6l3K6n6NL1k5rJk1L0j4mM6m4NJ6j5P6l0m7L6J3L3j9J1J1
1468E2l9OL2n2J6QqK3k9k2J3Nm3M7o4K5nl7N0K5p6M9J0nK6oQNj4M0LJ0Pn5PL3
1504D5jjrn7L9MOk0k9m1K1nM2K5q0M4jj2K1J3jj9J1J6J4oM2p3j0O5J2j5pk6k1
1539a4J4M1K8o4qm6M1K4j8l3ok1jR1l9j6j5m0Q9J4l2K8l0mM0PK4k4p8L3L3L9r
1572D8m5l8knN0J6p3N2m1mM0oj0l6KP1mj%o2N0M4m1J5N1p4PK9K9j1o0J7k2QL3
$$ y = [-7, 2, 37, 53, 83, 62, -5, -16, -4, 39, 67, 26, -25, -50, -60, 34, 16, -56, -22, -80, -109, -4, 2, -25, -60, -83, -30, -16, 43, 51, -35, 15, 12, 34, 102, 88, -11, -9, 18, 70, 101, 53, 5, -2, -26, 25, 40, -32, -23, -59, -75, -19, -25, -62, -60, -117, -49, -28, 11, 1, -75, -51, 14, -25, 28, 63, -17, 5, 23, 48, 96, 58, 28, -8, 0, 72, 35, 20, 14, -39, -46, 31, 16, 17, -29, -58, -45, 2, 3, 15, -73, -48, -6, -17, 37, 31, -5, 26, 15, 41, 48, 12, 3, -17, -6, 45, 29, -4, 22, -34, -29, 2, -23, -32, -31, -52, -22, -36, -40, 6, -38, -33, -17, -32, 44, 14, -33, 3, 16, 49, 30, 41, 52, 13, 19, 51, -1, 15, 23, 15, 38, 9, -13, 0, 5, -38, 9, -55, -30, -35, -72, -22, 3, -73, -24, -14, -19, 7, 1, 9, 14, 0, 40, 43, 53, 60, 5, 12, 45, 44, 43, 34, -23, 16, 20, 26, 6, -23, -64, -43, -48, -6, 19, -61, -17, -18, -30, -9, 4, 3, -16, -5, 11, 25, 19, 61, -12, -22, 43, 55, 40, 33, 7, -14, 0, 41, 69, 5, -3, -49, -8, 16, -2, -35, -41, -62, -63, 28, -11, -27, -42, -82, 7, 21, -11, 17, -13, -17, 23, 30, 54, 30, -48, -15, 18, 57, 48, 3, -35, -37, -42, 8, 24, -49, 3, -38, -42, -2, -8, -18, -54, -52, 19, 15, 14, 14, -48, 2, 46, 5, 20, 71, -3, 4, 33, 62, 51, -9, 8, -14, -6, 27]
1607B7l9Mj6m2QQ6p1%oMjJ7K5J2n2K7L8OK7l4j3J7%jM9n7qJ4L4J2n9k0jl0N0N
1643A2l7j6j4LL1Kj8K1nNjJ0K3prJ9K7j8pj0J8oJ7Lnn0N7l9K1J1p5J8J0j8N1k7
1679cj2Kk9MJ5qK7m4%N6k5L6J4n8N0j3J5nj7j1L4k5J1K6n5J9J7l4j2L2k0Lk0j0
1713d0L3kK7j0m4M8k2K6J0l4J8RRK5m3orlL6j0l7K3k0oL4m1RJ6k5Mj0%JpLP5l4
1750CJ3J7k8J6j7J2NOk7K0OK7k4JJm9QL8k1k3joNk0J6Jk1mK0lKooK6J4jK0j3j2
1789eL0j5K8Ql2RK8l2PJ8n2L0j7Lj6j8J7l1K5j0j8NM1k7J8j2pK9m6M0PpJ2J2l5
1824a3N3m4J5L9n9J6Lk2j6K6j2N4l3k6noPK4Krk3K8okPJ9j5NJ2k3K4kqJ9j5j0
1860DlrJ6l2J1j5KJ2J5o3L5K1k4L5j7R%k5L9J8k5L1k6j8M5k7JRj2L0Rj1k0j8L
$$ y = [27, -12, -8, -24, -66, -58, 28, -43, -43, -49, -45, -46, -29, -4, 8, -44, -17, 21, 27, 54, 20, 7, 24, 24, 23, 72, 15, 7, 21, 55, 67, 8, -12, -13, -43, 7, 12, -25, -41, -55, -52, -21, -19, -37, -16, -21, -16, -17, -7, 16, 9, 0, 19, 46, 28, 21, 11, 29, 23, 40, 43, 38, -12, 45, 6, 27, 38, -37, -19, -9, -27, 24, -3, -15, -13, -42, -38, -23, -31, -4, -48, -48, 8, -17, 19, 33, -25, 25, 12, 27, 22, 5, -6, 28, 3, 14, 40, -15, 4, 21, -13, -25, 7, -13, -10, -30, -40, -7, -9, 18, 8, -36, 12, -10, 16, 26, -8, 10, 19, 28, 53, 10, 4, -5, -8, 28, 18, -19, 4, -16, -22, 12, -29, -20, -4, -29, -25, -35, -35, -34, -41, -38, 37, 3, 16, 33, 5, 21, 4, 16, 21, 27, 0, 20, 26, 53, 29, 30, 31, -18, -10, 28, 7, -16, -17, -23, -18, -38, -22, -21, -42, -46, -26, -29, -27, -33, -39, -13, 1, 0, 20, 7, -5, 25, 10, 38, 46, 14, 23, 51, 19, 26, 44, -8, 22, 5, 8, -8, -26, -9, -40, -15, -25, -43, -38, 3, -24, -6, -18, -25, 4, -42, -2, 5, -2, 10, 22, -13, 40, -4, 11, 50, -9, 7, 10, -12, -28, -2, -14, 40, 7, -19, -24, -30, -23, 1, 3, -6, -29, -1, -7, -9, -2, 17, 2, 7, 19, -4, 20, 18, 10, 29, 14, 4, 1, -8, 8, -24, -13, -28, -26, -14, 1, -62, -27, -6, -30, 5, -12, -3, -3, -28, 11, 29, 4, 35, 9, -9, 36, 9, 10, 19, 7, 37, 46, 35, 15, -3, 0]
1895@L2l5Rln3J8L2j4oj1j6J3J2lJ8m6M1mK1j2J6loj3L6J3k5K7k0j3K0j9J8kk8
1930fJ4Ml3J6%qj0j9J2nQJ9j4mQJ0j2N1k9JJ2l%K6o1M8j6L5k1l5L2l0KL3l8Om
1967a1Mk2J4J1K0j4l1K9oJrJ5rK5j4oJ4j9rJ7L6lm7J8j8K7j1j2J8m0K7K0l7mL2
2002Fl8J9mPk3K5l3M8Mj1M3j8j1LkLJ7k0pnRJpm7J9K0k9Jj3J7oK4J5n5OK7l2K8
2040a9OJ7o%MJ8QQl7K2nk4L0lk2J5oMJ5l8oknL4Rm9OQqMJ1k0K3l4K7J4J1Nm6J6
2080a5K4J8Pk4qjJ6lK7m4j1J4pPL2p3K8j0j1K2M3k8k2k0L4J8l0L5k4qoL9J3j6
2114A6l5J6K5LpK5p0%J2L1nk2K4m8lO2n0J1lk4M1OrK3m1RL3k1N0mo5M2Nj0K7k4
2150B0l3K6lK2l2Prl7K2K9l7l0K2nK2L2l4rl3J5N3RJ4k7%J7K1k2K5l5J3JkJ8k2
$$ y = [0, 32, -3, 6, 3, -50, -32, 0, -14, -20, -31, -47, -34, -22, -25, -7, -53, -12, -16, 5, -7, 9, 6, 0, -13, 23, 36, 11, 38, 18, 5, 25, 6, 24, 22, -6, 8, 12, -21, -5, -5, -13, -23, -42, -30, -35, -27, -8, -22, -26, -18, -8, -20, 31, 2, 3, 15, 12, 12, 38, -23, 25, 9, 44, 23, -12, 20, -10, -8, 25, -13, -7, -11, -7, -29, -15, -4, 16, 2, -29, 0, -6, -5, -14, 1, -8, 17, 3, -3, 11, -8, -17, 0, 36, 33, -14, 4, -14, 13, 2, -10, 8, -32, -5, 15, -22, -26, 6, -32, -13, -17, -10, -33, -8, -41, 7, 11, 0, 43, 25, 14, 17, 15, 18, 35, 15, 8, 3, 12, 13, 6, -41, -22, -2, -31, -30, -43, -26, -32, -8, 7, -48, -42, -15, -47, -19, -13, 4, -2, -2, 2, 20, 28, 36, -1, 21, 16, -8, 22, 19, -3, 12, 6, 10, 25, -13, -19, -21, -26, 8, 17, -32, -26, -18, -26, -22, -11, -31, -8, -42, -15, -1, 10, 15, -31, -15, 9, 27, 34, 10, 2, 1, 17, 14, 41, -3, -14, 0, -7, 0, 32, -41, -13, -23, -34, -12, 31, 3, -19, -39, -5, 13, -17, 18, -6, -14, -20, 19, 32, 16, -19, -3, 22, 25, 18, 43, -27, -27, -15, 16, 11, -11, 13, -35, -38, 24, -26, -15, -18, -42, -1, 5, -4, 19, -22, -13, 20, -1, 49, 45, -20, 22, 27, 17, 44, 20, -13, 13, 10, 32, 0, 7, -2, -39, -17, 12, -25, -55, -33, -38, -16, 16, -18, -27, -60, -45, 8, 17, 31, 4, 4, 21, 42, 20, 45, 10, 23, 24, 22, 40, 18]
2185A8j5j1J1pJ5k5nOj3K2k3kMjJ8mPNJm7M6J1qJ1k2%J9NJ0Jo5M2j2J4j6K2jl3
2223b2nM1j8l5J3MlK6k5L1j0j6j2K4J8lj0k1L3j6J6j6j8L3koJ4k7j4J3J2OKj2
2257el3Jj0O8j9j4J2pK5rMJk5J5QJ1j8j3K9Rj9L6j7k4Kj5j0QOj7j0j1jL6j3m%
2294b3JqNJ4K%LmJK5J7l1K1l9K7J2qj4Nj3K3J3k5J8j9j7L6m2oJ4j6J5j0Ooj3N
2331c1K3plk4M1k0K4K0Kl6KJ2nJ7ll1L1k1j4L9loPk3PRJ3l4j5M3k6rJ4l1J3L3
2367HLOj0j5J7j0nJ5Ll2K0j9J1K3k3L1l5j0K2pJ5n2L4j1J7Ok0%j4L3kK1j0Lj1
2402BJK5j3qRj5J8LOl9J0Rj4mJ8k9J0m6K3J9ML0l3rK4MJk1qL9OLj5Rj6J8NJ5o
2441C5ql4KK2Ok3J5n2mL0J4Lpj8j0lJ7J0k0NJ2KJ5km6L1J6j4L5J6l9J0l0L0K0
$$ y = [18, 3, -8, 3, -4, 11, -14, -19, -13, -26, -4, -27, -29, -25, -26, -8, -12, -5, 0, 1, -46, 0, 11, 3, 14, -8, -8, 11, 16, 26, 27, -38, 4, -8, 6, -10, 12, 11, -22, -27, 14, -4, -39, -26, -22, -25, 1, -24, 7, -3, -19, -31, -7, 11, 8, -2, -23, 10, -6, 10, -6, -24, 9, 7, 1, 15, -12, -26, -13, -1, 5, 7, -5, -38, -37, -47, 21, 2, -12, 0, -7, 18, 9, 13, 14, -11, 4, 12, 23, 5, -8, 21, 30, 11, 47, 30, 6, 8, -7, -17, -9, -3, -20, -30, -41, -42, -6, -19, -23, -23, -22, -30, -25, -11, -9, -9, -6, -10, -9, 16, 33, 2, 23, -16, 11, 23, 15, 1, 6, -7, 16, 29, 4, 22, 3, -14, 22, -20, -26, -12, -28, -13, -23, -17, -23, -36, -31, -8, -15, -18, -42, -1, -21, 3, 23, 25, -11, -9, 3, -2, 15, 12, -19, 12, -9, -23, 16, 13, 7, 14, -9, -2, 7, 20, -14, -29, 14, -12, -21, -7, -38, -25, 8, 11, 17, 7, -8, 9, -1, -6, 9, 12, -20, 0, -19, -8, 15, -8, 23, -12, -22, 0, -7, 8, -44, -10, -21, -4, 2, -18, -18, -32, 1, -1, 20, 10, 13, 2, 3, 28, 15, 7, 16, 1, 19, 22, 28, -11, -1, 8, -6, -10, 8, -21, -11, -57, -34, -15, -11, 19, -14, -23, 1, 5, 6, -15, -23, 16, 22, 25, 10, 19, 3, 21, 26, 41, 35, 27, -7, -5, 17, 23, 0, 15, -37, -41, -11, 3, 6, -1, -19, -29, -32, -15, -5, -25, -20, -8, -6, 9, 7, -39, -8, 8, -6, 29, 45, 6, 16, -14, 16, 36]
2476C6k9j6J0onoJ4mj1lopJ8Jj6K3mLoJ8k4JJ0KK2j2k9K9J9J1k1Nm1rM7j1j1K1
2514A3m1J7J0j4K6l4JK0J5j4J1NqOk3L7K7m5pj6K9K4j8l1J3qK3pql0J9j5JK3O
2549Gj1l7M9rMRo1L8j0jL3J0k7j5j1P3oprl5j0K3NMPj0lL1n6J2J4k6nPKJ1j1N
2587a6k%JJ1K4k6j2MJ1J5%pj7K3J5j2k4OLRkK4k1nJ5l0M3k0k2j1jJ6J9nkj1j1
2624a8K2K7l6Nj5mL5oJ1j7k2J3K6j6J6qk7JM2n1K3J2k1j4L5Pm8K4JJ2Qj5K1j2
2658A1pj5OJJ3J5j6nJJ6m0MMj5J9kk1K2qrJ6K8k0oj3PJ1M0n6J5k6K2K2j8j2K7
2694A1jKK1k8J4Nl0K5k3L0pm7K7l5N5j4rJ0j5j4RK7m0K1l1K8K7k0J4l8L2ll0L9
2728A2%J1J0Kj1k0J5k5pK3Lrj5KJ2JK6m8L6j3pj0OMj8J1Lk0K5Pk1j2K0oNK3nk9
$$ y = [36, 7, -9, 1, -5, -10, -16, -2, -6, -17, -20, -26, -33, -15, -14, -30, -7, -11, -8, -14, 4, -20, -19, -9, -7, 15, 3, -26, 3, 22, 33, 12, 17, -24, -33, 14, 3, -8, 13, -28, -11, -1, -15, 11, -23, -22, -2, 13, -1, 10, 15, 7, 13, -10, 27, 54, 9, 2, -14, 15, 39, 21, -10, 3, -5, 18, 11, 3, -27, -8, -23, -22, 1, 7, -4, -41, 8, -1, 3, 12, -49, -11, -21, -22, 11, 21, -6, -21, -32, 41, 35, 28, 19, -16, -26, -3, 2, 6, 13, 3, 0, 31, -25, -13, 1, -25, -30, -23, -21, -10, -21, -16, -18, -18, -17, -6, 18, -8, -20, -16, -5, 10, 10, 3, -14, 9, 24, 12, -12, -6, -3, 6, 4, 28, 7, 2, 17, -13, 30, 10, -12, -23, -24, -8, 11, 6, 4, -7, -18, 4, 31, -5, 0, -15, -19, 16, 10, 21, 4, -18, -5, 21, 5, 21, 13, -14, -13, 29, -22, 1, 13, -8, -22, 13, 20, -28, -4, -3, 9, 17, 2, 23, 11, 4, -11, -5, -4, 9, 24, 8, 3, 4, 20, -20, -16, -12, -27, -8, -10, -31, -9, -17, -26, -10, 18, -2, -8, -21, -14, -3, 37, -19, -4, -30, -8, 14, -4, -16, 11, 10, 12, 33, 5, 19, 24, -6, 19, -4, 26, 19, -28, -1, -36, 19, 5, -4, 6, -9, -23, -14, 13, -27, -6, -37, -9, 18, -2, 12, -26, 6, 3, -27, 12, 12, 23, 33, 35, 24, 4, 19, -6, -13, 10, 13, 4, -11, -9, 3, 4, 30, -18, 18, 5, -2, -12, -6, -2, -20, -9, -6, -26, -1, 6, -15, -27, -7, -13, -8, 15, 10, -19]
2766a9K9j8K2J7l3kJ6kj2nJ4j7L4j9NqJ5n1M5Rk3J7l1K3j3K5j8L1l5pJ1k8O4k7
2800Inj6J3j2K1l0kLRJlKoL6j6lK2l1Rk2J2K9%J7m0L6k3J2j2j0loJ4%L1m1j8O
2838a7qK7oKk2j3J0J3L3n0rJ5J8K3qmooJ9j4QK4n5N7j5j9K0%j8o%K9l3rK3rML2
2876C0l2rl5J1J9J0Kjj5J5j7M9k2j5j2L2%KJ3n5L7k6L8prk3J2NL6nnokljk1L0
2913B0pmk4J6j1RK0l5J4K2k1n%rJ4RjQn2QkK7KLk7J2J2J6j8k4J7OJ0%nK6k0k0
2951a4K3K6j9Prj8J0K3l1K8m3J6mJ8Jo7K5lK0nJ3m4K9Mj1J2J2j0j2K0J1LKj6J1
2986Hj1%K3Rk5RRLqk5J4k7K9j2K6ok1Pl6L3J1Pj0j0j2MPL0l8KJ0J2oj9pJ7rOK3
3025A7Lk6J4oJL5m3MoJ2J6rj7J3Ol9L3nqQk0oL8Ol4Rj0L6m6K0J3k9L1mk3K5j1
$$ y = [-19, 10, -8, 14, 31, -2, -4, 12, 10, -2, -7, 7, -10, 24, 5, 10, 2, 17, -34, 11, 20, -3, 14, -17, 6, -7, 18, 0, 31, -4, -11, 0, -28, 36, 9, 4, -12, 1, -11, 10, -20, -22, -19, -10, -9, -12, -10, -16, 20, 4, 1, 23, -8, 1, -21, -9, 20, 20, 37, -3, 33, 10, 22, 10, 0, -3, -9, 5, 5, 36, -5, -23, -17, -25, 2, -4, -2, -24, -37, -27, -14, 19, -31, -40, -25, -7, 16, 8, 4, -2, -8, 11, -3, 5, 29, -26, 31, 16, -3, 17, 17, -1, -7, -7, 22, -11, -20, 3, -6, -2, 30, -2, -11, -46, -35, -16, -6, -4, -5, -20, -5, -22, 27, 5, -10, -22, 10, 10, 12, 25, -30, 7, -19, 19, 12, 3, -20, -8, -3, 33, 28, 23, 17, 15, 12, 11, -10, 20, 13, 9, -15, 1, -10, -1, 19, -16, -2, 20, -1, -6, -6, -15, -1, 8, 7, 15, -37, -29, -31, -4, -2, 1, -26, -14, -2, 14, -4, -28, -11, -5, 5, 5, 0, 26, 6, -14, 9, 35, 16, 23, 14, -4, 6, 29, -2, 26, -17, -1, -5, 13, 14, -53, -28, -31, -11, -16, -3, -47, -18, -14, -25, -13, -1, -11, -23, -3, 8, 11, 13, -3, 8, -3, -3, 20, 29, 4, 13, 22, 25, 17, -8, 6, -21, 8, -4, 22, 16, -5, 2, -34, -1, 10, 17, 7, -3, -15, -11, -4, 26, -12, -10, 0, 12, 6, -13, -20, -3, -12, -6, 17, 20, -6, 8, 2, 3, 38, -5, -1, -7, 5, 21, 12, -5, 8, 14, -25, 8, 3, -5, 3, -17, -23, 15, 21, -13, -4, -14, 22, -24, -4, 9, -20, 11, 7, -16, 9, -2]
3062bj5k3J2M2j3J2m0M6j7k3K1Rol2K6K8k9Njj9K9%lOj4Pk0K0J5ll2j9KJ7J2r
3098a1k2L3l4J9jNK0k8oJ9M7m1j4Rj1M9k9kNPk1J7L7n1oJ4k0K3k3k1K4RnmJkj
3135a5lJ8Pk9K1l0NK4Nj0J6mOlj3M3m3J1llpJ4k1k2M7j7J2Mj3kj5L3j0J0jk3J6
3172EmRk4k2K5J0K9l0J5ql8K8NJ4j8J7j7QJj3MJj4k4N6nKmj1j5K8j9J3NNk1K3
3209A6mJ2k6l%NJ3kj2j1jLjKkl3K5L1o1K6K1j1lJ1lNl1L2J1k7K9L0l8j1PmN1l8
3247H%j0J9j7kj4J8k1K5j6oJ5lrJJK9m8KNmnL7lrJ7j6J1R%j3mrmJ7knK8j8J0p
3288Gj1J6k0K8j5mKJnJ6k3K3jrnQpj4J3Mk6OL6k0Rk8L1qj7K3mkpJ6lLk6nK4j8
3328a2K8j8LOqjM4onk9rJ1K3j3k3Pl1M9m0L3Kj3k7K6Rkj7k6M4k2M0k5j5l2L5J6
$$ y = [-2, -17, -40, -28, 14, 1, 13, -27, 19, 2, -21, 0, 9, 3, -29, -3, 25, -4, 1, 0, -19, 10, 10, 7, 13, -1, 6, -14, 6, 21, 18, -14, -33, -31, -14, -2, -11, -33, 0, -34, -15, -16, -11, 9, -19, -25, -6, 41, 0, -14, -5, -16, 33, 4, 2, 7, 14, -7, 10, 47, -4, -10, 4, -16, 7, -16, -37, -13, -4, -9, -13, -12, -14, -15, -18, 0, 7, -22, -1, -31, -26, -2, 3, -7, 9, 5, 11, 8, -5, 38, -5, 6, 3, 0, -7, 7, -14, -36, 11, -6, 6, 10, -3, -5, -20, 13, 3, 13, 12, -11, 5, 1, 10, -14, -36, -11, -1, 28, -2, 13, 5, -33, -5, 0, 14, -4, 13, -4, 4, 5, -8, -4, -3, -17, -41, 15, 10, 12, 8, -3, -18, 10, -9, 4, 9, 14, -7, 16, 12, 24, -2, -5, -5, 0, 13, 11, -1, -12, -13, -10, -11, -9, -11, -44, -19, 12, -49, -23, -2, -13, -16, -5, -8, -3, -34, -2, 9, -18, 11, 41, 3, -8, -1, -5, 46, 8, 8, -2, 17, 0, -2, -16, 2, -19, 6, -10, -16, -1, -4, -13, -12, -11, 18, -30, -28, -23, -27, -32, 5, 2, -7, 10, -6, 5, 14, 14, 1, -3, -12, -16, 1, -1, -6, 22, 4, 14, 7, -4, 12, -8, 20, 5, 1, 3, 4, -1, 15, -8, 15, 14, 5, 0, 8, 1, -13, 0, 4, -22, -16, 20, 0, 9, -19, 12, 4, -13, 10, 6, 4, -3, 13, 10, 13, -13, -18, 6, -12, 16, -2, 1, 7, -1, -2, 42, 36, 31, 2, -7, 4, 27, 14, -9, -2, -33, 16, -24, 9, 11, -2, -29, -3, 6, 4, -13, -39, 5, -17, 23, -2, -17, -49, -14, 2]
3364Bj3L8l8J7k3K6OKk1j7M4k1K7mj9l1M5NKk0j2j6J0K2Oj7kmj5LL5k3j2OROp
3401dK2j4k0J1NK1JKj7rj2J0K5qj4j4J9pK2k6JMj0K8j2k7L0mJ7j9J5Nn4L4j2N
3437fmjRK0Pj8qkj3J5J0J1%m2K4%Kj1M6o5L9oNkk4pJ4NoJ1Rk3PRPj4KK1k2j4K8
3478A3k2J3qnQoOOl5K4J1k4K4K0l5M%J5j1K2om3L7Lmj7K2Nj9J5nl5L0nPkMk1j2
3517b6J9mOJ0J8m5K0J0Ql3lnK4j8L8k7K2Oj8K3l4L5l5J0j0KK2j0J9k2Oj4L2j8
3551Hk5j0L5jPOl2K3j7j2K6j3J2k3%K8J3l3Lk3rN8k7NOJRl4J8nRMOj3K0k7nJ8
3589FLJ2j9K7n2K2nj3L5k2J3j4k0K9J6nj0k6L3m1J6J8j4MK5j1rm3M7j4J4Qj3J9
3623A6rkj5K9k6K6j1OrK2l2L3kKj3j0j5K4j4j6K5oMQNj7k0J3NJ8k1l5J4M2j0j1
$$ y = [2, -11, 27, -11, 6, -17, 9, 15, 17, -4, -21, 23, 2, 29, 25, 6, -25, 20, 25, 27, 7, -5, -21, -11, 11, 17, 0, -2, -6, -21, -18, 17, -6, -18, -12, -3, 3, -4, 18, 4, -16, -5, 0, 21, 22, 24, 7, -2, -14, -4, 21, 13, -1, -15, 4, -3, 19, -7, -6, -2, -12, 16, 4, -23, 7, 3, 20, 1, 16, 21, -33, 1, -11, -6, -10, -11, -2, 18, 25, 7, -1, -3, -16, -1, 9, 20, 20, -22, 2, 2, 4, -7, 39, -26, 13, 7, 12, 10, -14, -21, -7, -2, -8, 3, 12, -11, -4, 5, 12, -2, 0, 21, -1, -15, 13, -9, 4, -4, -9, -1, -7, -1, 5, -30, -6, 5, -19, 5, 25, -10, -6, -6, 9, -2, 20, 14, -29, 8, 11, 7, -10, 12, 17, -2, 13, 8, -27, 3, -2, 5, 3, 7, -14, -26, -7, -11, -5, 5, 23, -22, -2, 8, 16, -17, -20, -25, -1, -19, 19, -8, 14, 20, 2, 25, -9, 26, -9, 1, -9, -7, 15, 5, 24, 2, 8, -6, 26, 8, -17, -27, 8, 7, 14, 20, -12, 11, -6, -18, 8, -5, 7, -16, -16, 12, 25, -8, -5, -28, -37, 21, -6, -1, 5, 6, 15, -19, -1, -6, 3, 7, 13, 0, 20, -7, -12, 6, 9, 21, 2, 29, -23, -1, -6, -19, 16, -6, 7, -7, -27, 2, 18, 13, 3, -23, 10, -31, -15, 3, -11, -7, 18, 7, -2, -45, 2, -12, 2, 10, -3, 16, 7, 5, -10, 19, -7, 19, 8, 14, 5, 27, -5, 28, 26, 28, 15, 5, -10, 14, 0, -16, 9, 3, 7, 15, 20, 3, -17, -4, 1, 19, -2, -37, -23, 19, 9, -2]
3659bpk4M0j0K0j0kKLj1K6j2K0k2j0OJ2k4j0L9j6K5m1mKJ7k2J2j1k3J6j7J9MK
3694a3JK0Pj6K3k6knj1K5k3L0J9l7OomLl%jJ1k2K2nJ2OopJJoQrNnj1j9M9j6J6
3735A2j2k2L3k6kJ7J9m4NK5LK7l0k2J5k1J9J3k2K3J6nj0l1L5pj3J2mMmk9K5K0
3769A9k1J2j7oj2J5J0NkKLj4k7K4k7pM5j2Nj0j3J5J4k0J0J4J0k5MOK0l4K8Npj0
3805Bj0JK0ol0J9jl3J0K4O%lrJ2nkpK2Jjl6LL5j7JJ7k5JOK3l3PRL5m0qM0k8rK9
3846B0m4M0l1JOJ1J9l1M0n2L4j4Klj0J2l6O1j2j2JoJ0j5J3k4J9j2nPJRRpLjL2
3883C5l5JJ1j4K2J2Lm2OJOJ0kj3Rk1J6qpj7K7kLj2qL3jj7K0l2L4l2J1OMj2J6K5
3921C6k1qLLj9N1o2K2JJ1j7%j8J5j2J8J6l6L6k5L3ml5NNrNOoj2J1k3K8nK2k1j3
$$ y = [-2, -9, -33, 7, -3, 17, 7, 5, 7, 10, -1, 25, 13, 33, 11, 1, 7, 19, -5, -15, 24, 8, 33, -8, -12, -10, 7, -15, -3, -14, -37, -21, -38, -19, -15, -13, -12, 8, 15, -1, 22, -4, -6, -11, -22, 3, -20, 10, 29, -8, -2, -8, -12, -9, -12, -12, -13, -2, -24, -2, -7, 5, 11, 5, -2, -1, 0, -6, 2, -7, -2, -7, -18, -37, 12, -4, 12, 0, -22, 11, -15, -17, 0, 19, -25, -20, 5, 8, 35, 5, -17, -2, -23, -4, 9, -13, 10, 26, 21, 11, -20, 15, 8, -5, 7, 3, 7, 3, -26, -1, 19, -2, 10, -7, -13, -25, -10, 0, 5, 3, 5, 8, -6, -33, -9, -36, -43, 2, -10, -5, -15, -28, -13, 1, -19, -9, 5, 15, -10, -6, 0, 20, -14, 14, 19, 12, 2, -8, -7, 13, 7, -23, -4, -5, -38, -28, -4, 2, 2, -1, -10, 2, -3, -5, -12, 10, 11, 10, -26, -23, 12, -5, -4, 13, -12, -11, -5, 18, -15, -8, 1, 36, -4, -12, 28, 0, -9, 20, -24, 16, -15, -14, -8, 3, 22, -9, 31, -21, 13, -1, 1, -2, -12, 0, -36, 25, 13, 1, 2, -4, 6, -9, 4, -20, -1, -13, -18, -11, -10, -1, 8, 1, 4, 3, 35, 0, 1, 12, -2, 20, 32, 35, -7, -1, 0, 6, 16, 14, 1, 10, -11, 5, -3, -10, -27, 0, -2, 1, -11, -19, 14, 13, -4, 16, -16, 18, -14, -3, 3, 7, -5, 11, 36, 15, 7, 10, 13, -6, 45, -17, 5, 6, 17, 0, 0, -18, -3, -15, 3, 19, -17, 19, -6, 27, 23, -12, -7, -2, -11, -6, 0, -6, -18, -7, -30, -2, -7, 15, -6, -19]
3958a9M0j9k0K1j5LL4qk6K1qNJ0K1ml8J1Ojk1Lj0J5LrqJ0pRKQl5J1J2rJ2nQOk9
3998b0PNnlJ7j2JJ4K9m7jL6j3k0J6Qk7M6k0kj7J1j0K6j6J3K8l3k2JMJL2l0LQn
4035Ckk6M0j8NolJ1OMnj2Lj0J1j2J7NkJ0k9LlJ2pK5k7J2Moj9J7L5l2koj6J4K6
4074B0Mn0K2%j0N%J7k0qL9l0J4Koqqj3L1kknL6k9j9RpK4Nnrmj2L6l1K1JqOnk1
4115b0J3NlJ6l9L0kpj3J5l6L2RkKj6lK8J0k2K0Nk3qJ4k6K7J4l1K5mRmk2LK0kl
4153A1k4L5l2qROPj8K9j8k0NJ5l3K9J2rrj1RJ8l4J5J9m1K0K1J4j4lkrkK5Qj2k0
4190a2j0omL4rnPk7K4RoJ0k3k0L8Nj7nK3kj3lK1j0K5j4j7NljQl2K6%L9m7RL6n2
4229a9J3MJ4qRj0qkPmPJ6lj6k6J2J2k0L6%k4LJ1LKk1qJ5Roj8M6m2K3J5n2N2j3
$$ y = [-19, 21, 2, -18, 3, -12, -9, 25, 17, -9, 12, 4, 9, 19, 40, 36, -2, 9, 15, 14, -7, -4, -14, 1, 4, -5, -13, -3, -10, -1, 1, 9, -26, -15, -3, -12, 0, -5, 3, 9, -20, -13, -8, -13, -16, 1, -11, -10, 4, 33, -14, -15, 21, 8, -12, 4, 12, -15, 31, 11, 9, -8, 3, -7, 19, 3, 16, 44, 11, -11, -10, -6, -5, 27, -3, 0, 8, 3, 1, -25, 15, -3, 2, -4, -7, 4, 10, 14, 9, -3, 0, -10, 1, -11, 6, 11, 9, 19, -10, -7, -10, 2, -5, 20, -7, 5, 9, 3, -16, 1, 36, 4, 2, -4, -20, -6, 20, 24, -26, -4, -4, -14, -9, -9, 8, -12, -20, 19, -11, 3, 5, -1, -9, -17, -30, 1, -1, -3, -8, 28, -1, -20, -11, -18, 6, 11, 6, -3, -7, -19, 17, -14, 7, 8, 0, 6, 1, -20, -7, -2, -5, 11, -28, 2, 0, -7, -20, -5, -41, -9, 0, -2, 0, -16, -19, 9, 19, -3, 17, 22, -1, -9, 5, -21, 6, 20, -11, 14, 10, 19, 15, -7, -4, 16, 14, 11, -13, 22, -10, -18, -9, -3, 4, -14, 15, -3, -23, -18, -3, -36, -7, 5, -4, -13, -24, -15, 3, -31, -16, 3, -38, -18, 3, 17, 3, 0, -2, -11, -13, 12, 20, 8, -12, -22, -28, -32, 2, -7, -12, -5, -32, -8, 1, -5, 5, -18, -38, 0, 5, -12, -17, 6, 4, -9, -12, 9, -1, 24, 10, -7, -2, -5, -6, 2, -30, -4, -4, 35, -12, -3, 33, -19, -6, -2, 12, 4, 13, 3, -5, -7, 0, -4, 3, 19, 16, 0, -26, -14, -2, -22, 14, 14, -10, -7, 4, 7, 9, -12, -20, -5, 4, -2, -20, 26, -16, 7, 22, -30, 22, 9]
4267Ik4PJ2Ql6K4oPJ0j4lJ1j0RjMk6K2J4j5LMj6jNk5%K6J4l8M5l9j1L5Jk6K5O
4305A0qoJ7j3NNj6PK4Ok6j1NK4k0lj2NK3l2L9k7j0M1l3J8k5j1K3jj2K7rj0L5l6
4341goK4%mj9J7l2K7Mj9j2J7j7J7L8l0J9o3P1j4l1K3%pRKj7kJK3k4j1L7k2j0L8
4377B0m2j3L8L3k9n0M0LLKOOrj1M3l9j8L6m3L2J0k3J4j8RQOl6K8Rj6J8K0k5k0
4412hK7l8L2Nl7K3K5j7j5lJ5kj4Lj1K1j2oplK8k1J5mk6M6k0J9K3j8j7jJ6k4K4
4447A8k7QjoRk2K6k5J4J2k5nJ3mPj0J3J2k0%Pk%k8L1Jk0RJ9j8LL2l8OPPk2K1k7
4486b5K3j8K2j4lllK8Kk7KJJ1J5l9JLJ5l0J8L8k9j0L2k2QjjL1j9Oqj2J1jJ7rj7
4524gK2pj2nKJ3rj5L3oJ5l6M2k4ornPjlJ8k5K1j8J1k1M0k7rRlK0Kj9K1j4qk1M7
$$ y = [9, -15, -8, 4, 12, -24, 0, -6, 1, 11, -3, -6, 5, -5, 4, 3, 7, -19, 3, 17, 2, 5, 9, -7, -8, -3, -28, -28, -2, 12, -26, 19, -20, -31, 4, 5, -21, 4, 10, 2, -4, 13, 0, 5, 10, -6, 1, 25, 31, 5, -6, -1, 23, 3, 0, -12, -7, 16, -16, 23, -4, -14, 27, -6, 12, -13, -24, -1, -2, -14, 13, 4, -6, 29, -7, -13, 11, 11, 7, -12, 5, -27, 0, 4, -15, -27, -10, -27, -10, 28, -2, 17, -46, 25, 11, -20, 3, 3, -4, 5, 7, -10, -12, -11, 12, -12, -23, 14, -8, -18, 20, -22, -35, 3, 36, 7, -43, -3, 0, 3, 5, 11, 17, 8, -3, 40, 1, -17, 19, -24, 8, 18, -5, 9, -9, 0, 8, 14, -22, 6, 15, -1, 17, 37, 12, -8, 19, -19, 13, 18, -19, 4, 29, 12, -3, -6, 9, 7, -7, -4, -15, 6, -6, -12, -19, -22, 6, -15, 0, -4, -30, 16, -4, 15, 38, 20, 3, 2, 18, -6, 18, -9, -1, -2, -8, 1, -21, 5, -20, -6, 6, -19, -24, -11, -15, -8, -18, -5, 7, -13, -13, -6, -8, -8, -36, -5, -4, -24, -15, 4, -14, -11, 21, -17, -11, -4, 3, -19, 2, -25, -2, -20, 2, -12, -15, -18, -21, 7, 9, -18, -16, -15, -4, 11, -28, -27, -24, -9, -39, -21, 17, -12, -22, 10, -12, -4, -5, -6, 25, 6, 12, 4, -8, 3, 2, 19, 10, -7, 15, 8, -4, -9, -7, 6, -3, -18, 15, 9, 24, -12, 30, 6, 0, -9, -14, -7, -8, -11, 7, -18, 3, -15, -4, -25, 15, -12, -21, -12, -15, 5, 7, -12, 9, -5, -13, -34, 13]
4563A3Klnj7MK3Lj1%J9l0K0k5J4j2J0l2N9n0J8k0J5J3j4QLj9K6oj3J6k9J0j5M0
4598A5j0rK6k5OqLJ2Pl3J5lLOoj0J8j0J4j5J6Pmj5J8m1J0K4j8PLMKj6K8k2J5J0
4636B4k6rJ5k1L0J3j6Pl2K1l0K2J4k3J5MJ1Kk4K5k5K2k6kRNmorJ4J6j5oQoMpL
4674c%j2J5rmKJk0K2K1j5Noj8L4j9NJ1nrJj5J2J0j1K1Mj5Pl2J0J6J7k6J9mj4J8
4712A4Plj6jK9m6KL4o4N7k2K8qj8PJ3j9NJ9J3k6j1L1j7rJ2k0MMK0k3oK9l5K0J2
4748A6j9j5M5k1KNj1nK1l7RMkKkJ2KMnk3J5Kl1K5k6%N3J1l9nK3J0j3nJ5l9L1o
4786Ck7K9j0lP%Pj3L8k9l7K7J2nKj5J6l5K8K8l3J9j3oj6L1%Rl1OjnJ8j4JJ5RM
4824A6k9NK4pjMk2J3nLmJ6l6J7k0L5k2J4oj5KjJ3lJ0j9J8k2J4OJJ3k0OK3j0%k
$$ y = [13, 15, 12, 7, -10, -6, 17, 20, 9, 9, 28, -2, 18, -7, 7, -5, 5, -27, 32, -18, 0, -20, -5, 8, -6, 2, 5, -14, 12, 6, -7, 9, -20, -10, -25, 15, 5, -4, 22, -3, 3, -5, -2, 10, 17, -16, -1, -4, -1, 5, -1, -11, 7, -3, 11, -4, 12, 19, 15, 0, 18, -23, -13, 11, -7, 0, 3, 7, 9, -7, 21, -1, 14, 24, -2, -11, 4, -17, 13, 26, 10, 17, -15, 6, -24, -2, 12, -11, 4, 8, 19, 21, -3, 22, -3, 19, -7, -9, 0, 5, 1, -5, -14, 0, 16, 1, -5, 3, -3, 1, -6, -3, -3, -15, 0, -9, -13, -11, -10, -30, -8, 13, -2, 3, -3, -21, 13, -6, -1, 10, 5, -4, -3, -18, -6, 4, -7, 14, 18, 3, 10, -22, -12, 4, 21, -5, 14, 10, -4, 14, 21, 18, 2, 1, 30, -16, -14, 20, -44, 13, -9, 19, 11, -7, 0, 13, -6, -1, 18, 31, 5, -6, 25, 8, -1, 11, -9, -5, -1, 19, -4, -10, 19, -16, 4, 16, -3, -18, 27, 6, 8, 13, 2, -3, 18, -19, -10, -6, -8, -6, -8, 4, 6, 10, 5, -18, -3, -1, -32, -7, -33, -33, 20, 31, -8, -13, 10, 20, 7, 2, 17, -22, 9, 3, -24, 5, -5, -8, -1, -1, 6, -7, 31, 2, -35, -8, 4, -1, 1, -14, 2, -33, -5, 23, -10, 9, -4, -10, -26, 5, 5, 14, -17, -11, -12, -17, 1, -13, -12, 3, 12, 16, -13, -8, 16, 9, 8, 12, -10, 3, -2, 1, -3, 13, -23, -6, -26, 9, -13, 1, -5, -20, -18, -19, -6, -9, 1, -18, 0, -22, -8, -2, -1, 12, -8, -2, 21, 11, 11, 9]
4862IJ3j5%m0M7J7k3%j8K1nj7J3k0K8Ok8NkN%Jk3K4%J9k6oJ0j2L7k6mPj2KJ8o
4900aqL2l8K7lk8PJ0J0j8LK1j2K6k3jMj2J2l1L9j7pNoJ6j7rqN6m4JJ7k9MJ1lJ9
4938ELj7LOJ3k8QRQj9K3k9J6J5om3K6K5j1L0l3nP%k7J3J0J9j2k0J1J2rk9K2mj1
4975a9JKJ9k1%J0mmQJ6k0J0kj0JK1k0K3k2Qj6J5nJ2J4nk8OJ7lrlK5k0j0QK5k5
5013eJ1lQk4J9Nj5J2omPk0j5K1K2mlJj0K1j9qK1j6NrL3l6K5k1klJ1lK9l8qL1j9
5052iJoK3nOk7J6nRMj4%QKmJ7j5J2%j8L4l1J0noK1j0j3J6OJ5l9JL4j7l4M1j2l0
5091b4J6K2J0pm1L2j0JNk0J4noJ2m8M8K8m9J3K7n2M6k6LK4j9MJ8k2J1koJ2k8J7
5126bj0J8Pk3JML0J7m8jqJ5j2NJ0kl3L2k1Q%Q%J5j6%%K1Kl7LQk0K6KmK2nl3%n
$$ y = [9, 22, 7, 7, -33, 14, 31, 8, 8, -10, 11, 6, -11, 2, -18, 10, 16, -12, -7, -9, -4, -4, -3, -26, -2, -2, 17, -9, -15, -5, -17, 20, -6, -10, -3, -15, -13, 5, -1, -9, 23, -15, 12, 9, -19, -12, -2, 8, -10, -7, 14, 2, 28, 5, 4, 8, -4, 8, -23, 16, -1, -8, -3, -9, 7, -10, -19, -27, 29, -15, -14, 3, -26, -22, -11, -14, 5, 8, -9, -6, 0, 13, -15, -7, 2, 10, -9, 14, -15, 1, 16, 10, -33, -7, 18, 7, 37, 4, -1, 6, 6, -21, -8, 2, 21, 9, -11, 0, 12, 3, -26, -4, -8, -19, -18, -16, 3, -18, -18, -8, -12, -16, -8, 8, -12, -2, -4, -14, -13, 8, -12, 11, -11, -3, -19, -4, -9, 3, 17, 12, -16, -10, 7, 4, -5, -8, 17, -3, -13, -5, 20, -5, 6, 3, 11, -13, 6, 11, -4, 8, 2, -2, 5, -15, -30, -9, 13, 9, 6, 7, -3, 18, -1, -9, 12, -4, 1, -8, 25, -11, 14, -7, -9, -12, -1, -4, 25, -13, -21, 10, -9, -8, -14, 9, 4, 10, -17, -1, -6, 3, 7, -7, -7, 1, 3, -1, 16, 1, 13, 13, -5, 29, -2, 8, 3, -3, 18, 8, -5, 11, 17, 32, -7, -6, 28, 11, -23, 18, 6, -24, -8, 14, 24, 17, -24, 8, -2, -1, 4, -16, -2, -7, -13, -1, -49, -1, 27, -22, -9, 18, -34, 12, -14, -11, 13, -6, -2, 16, -6, 5, 3, -3, 9, -19, -2, -12, 6, 13, -10, -9, -5, 25, 42, -6, -7, -15, 0, -12, -7, 3, 1, -32, 0, -21, -13, -13, -5, -5, 10, -6, -6, -6, 15, 17, -20, -17, -9, -29, -3, -1, -5, 17, 12, -21, -21, -26]
5167b6J4nK4j1OJ3l3L4Nk5QlRJk9K3rK0k1oJ9k6J4J3Jk1LOLk1K9Mk7M2j8k1RK5
5205B3l0j5K0Mj6PJ2POOk4j6J2K3m1OJ1j4OJ2K2l0KPKk3j5K8J8l4PJ9j2j2jL4
5241A1%j8Nk3M2k2J4rRnj6KJ8Poqj6JK1j5pKk3M2k6K2qOomJJ5qj3jk0K3L1knj5
5282dK3l6OJ2k4J2pJ5NJ7j5k4K8ROm3L1J9k9J4Kj9l6L0j1J0J1mJ4rj9M3j7KKp
5318GmMk5J1j2J1jJ9K1n2K3J5jl1K5rj5J5kJ7j6J2oQOk2L8k6k8J1j2K7Oqj5QP
5355Fj6J9k3NpL4j8k6N0m2J1Pj1L1l6J1K0Nm1K6K1qrj6K0j5Ok0L1l0K2l0M0l8
5389b1kK4rK1k2KpK4pQP%m3K0j8K8j5Nj0K8qJ8k9j0j1K8ppK5Mj0J5j0k6J0KnL
5427eL0m1LJML1l1j3K2MMlQk6K5lj4oJ2Lj5J3qJ2JJ3j0oR%Pj2Qk9OL2m6J8j6J4
$$ y = [-26, -12, -17, 7, -4, 2, 15, -18, 16, 21, -4, 4, 1, 10, 11, -18, 5, -4, 16, -5, -11, 8, -18, -4, 9, 10, -11, -8, -2, 1, -20, 9, 13, -14, 28, 10, -11, -2, 23, -7, -22, -2, 2, -14, -7, 5, 12, 18, 24, 0, -16, -4, 19, -22, -16, -5, -19, -13, -1, 21, -9, -7, 0, 2, -21, -36, -8, 10, -24, -17, 2, -10, -22, -23, 11, 11, -7, -2, -25, 17, -5, 9, 0, 9, 4, -12, -10, 8, 15, 9, 1, -15, -14, 7, -8, -15, -13, -36, 6, -20, 2, -6, 0, -6, -10, -9, 6, -2, -15, -16, -36, -13, 18, 16, 11, -4, 19, -17, -11, 1, -23, -11, -18, -3, 2, 19, 4, -20, 8, 17, 23, -20, 11, 30, 1, 15, 17, -2, -38, -8, -19, -9, 2, -2, 12, 3, -16, 27, 10, 12, 14, 7, 3, 7, -18, -7, -19, -8, -9, 10, 31, -21, 2, 17, 16, -15, 10, 1, -14, 1, -1, 16, 0, 12, 6, 14, 20, -2, 36, 10, -18, -7, -19, 8, 14, 6, -9, -1, 6, -10, 9, -14, -9, -16, 18, 0, -26, 24, -18, -7, 0, -11, 20, -16, -5, 15, 20, -21, 5, 26, 18, 9, -7, 13, -2, 4, -16, 15, -15, 7, -23, 17, -21, -23, 1, -8, 13, -9, -7, -14, 10, 3, 11, 18, 18, -25, -5, -23, 5, -10, -5, -15, 13, 5, 23, -6, -16, -27, 1, -6, -13, 12, 16, 6, 21, 11, -15, -5, -3, -8, -5, 25, -16, -13, -12, -8, 23, -8, -21, 1, 5, 9, 6, 14, -12, 13, 10, -4, -10, 2, 5, -10, 3, -5, 7, 8, 21, 11, 5, 14, 14, 21, 9, 17, -12, -6, 26, -20, -2, -18, -4]
5467dj6J8%j3qJ2RMk4J9K3n0L9l0J4lmL2j6j8L2m0K3Jj8MpJ1J1k9L4J9k5Qm0K4
5503hNL2pk2oMK0j5j3j1K8Rj2nJ7ql4M1ql7K4qlL1Jl1J7qlMM0k5mOj4J1j7LkK0
5543A2oj1QJmj4pK5j1jk0mJ4QJ6Qj8Lk0K4k4j4L0kK0k7J3j4RK8l1OKlj1OK1j5
5581cj6L1k6rM1j5k8M7qj6K3n4K5J8l1L0k2K0j6K2j0j3RjJ7Jj6j2J1k1J6LRMq
5616BmRj1kPpJ3l8K5K3Kk3LJ3l5K5l0J9K7l5PK1Jkj6J0K0m0oK5j7Qlj5qRJ4oL8
5655B3j9j5kJ5l4J5rRQJ9Rk7PK2k7Kj7J4Kl9K8QQpK8rj7K6j3k6J5nj7M5k4nJ5
5692Flj2K9j4pk2N0k8Omj1K6m1J3K6k3llJ5J3l8J6jnJK9k7K2l7L1PLj6K0j6Oo
5729BOnmkMj0KJ0J0l3K0j2K2k6J7J6k2kKjJ6klor%rK3j2lK2JJ9l8qM2l4NK0l2
$$ y = [-4, -20, -2, -2, -15, -23, -11, -2, 2, -22, -3, 20, -30, 9, -21, -7, -10, -14, 18, 2, -16, 16, -24, -1, 0, -18, -14, -21, -10, 1, -28, 6, 25, 0, 8, -32, -8, -3, 29, 22, 0, -6, -2, 18, 3, -10, -21, 7, 16, 4, -1, 16, 8, -26, 15, 7, -30, -6, -14, -17, 14, 15, -16, 1, -7, -10, -6, 34, 9, 5, 11, -3, 8, -9, -6, -8, 12, 6, -5, 3, 4, 0, -14, -21, 4, -7, -8, -28, -32, -18, -10, 6, 14, -4, -1, -21, 3, -21, -35, -5, -7, 13, -14, -1, -15, -6, 22, -9, -3, -1, -4, -15, -9, 12, -3, -19, 12, -14, -23, 18, 3, -25, 22, 14, -2, 21, -33, -8, 10, -21, 9, -13, 7, -9, 13, 3, -10, -1, -2, 15, 16, 0, -12, -1, -22, -6, -3, 6, 10, 2, -2, 7, -4, -6, 1, -6, 7, -31, -6, 17, 19, -4, -1, 12, -23, 2, -28, -9, 18, -17, -10, 11, 12, 10, -6, 4, 24, -16, -22, 3, -14, -6, -9, -24, -32, -23, -9, -15, 23, 4, -11, -13, 2, -32, -17, -26, -17, -9, 10, 19, -8, -1, 21, -6, -4, -21, -7, -5, -44, -16, -8, 0, -7, 21, 12, -5, 21, 8, -18, -3, -8, -25, 20, -4, -9, 6, 3, -9, 20, 6, -1, -23, 27, -1, 5, 1, -10, 16, -25, -12, 14, -9, -12, -15, 0, 13, -25, -9, -10, -15, -14, 15, -12, 10, -27, 4, 11, 14, -2, 18, 2, 8, 2, 8, 3, -1, -3, 1, -9, -7, 3, 13, -20, 0, -12, 10, -16, 1, 17, -5, -7, -5, -6, 10, 8, 5, -1, -10, -10, -19, 4, -8, -11, 11, 12, 31, -7, -15, 27, -7, -2, 18, -14]
5769a4L2l7J4j2QRk8J1K3l6K3Lnr%MJ2j3onL1J9k9qJOj3J3jj1NOJ0k0L0mj5%j8
5808b4L2k1J3qJ7k0J4%K2k6j9K5km6O0j1prJ3Nj0Pj7lJ5Qk0j0j2M3k6NJ9k2K2
5843Gk0MjPJ7mj9J8j7K1k9MJ6j2L3m7J6j0L6j9pnMj4JJ2pKOnJ2%rJ7k1J1mRKj4
5883ik1M2k3N3o7J8j3K1qRk1JNK2mJ0l5lK6qJ8j6j3K0nJ1l1K2mqj4J9K9k2KLk3
5920a7J4L5l6j6JL9KlJPk1Nnj2J4NrNpNj4mJ6QJ0j7k9J4LQj3k3L5j3J0jJ1k5K6
5959Ij3pLJ5pj5OqJ8J0m7M6k7nJ4PJ4l2J1QQjk7J8Qk5K0mJ5j3%Mj6K4Ml0J1J6
5997A2l%Kj2roJ0j1QJpJ7mj3J2lJ9m5M4j9J9jKl1JL5k4K5j9K2rj2qK9l8jPOJL
6037@j0rJ8Lj8j3L7j5J3l4M2n5K7J3J5k8J7J1l0pK4Ll5J2L6k0J9j2lJ1j1J4n8
$$ y = [-14, 18, -19, -5, -17, -9, 0, -28, -17, 6, -30, -7, -4, -9, -18, -18, -14, -2, -15, -21, -26, 5, 24, -5, -13, -12, -6, -19, -6, -7, -18, -13, -7, 3, -17, 13, 9, -6, -6, -24, 8, -13, 0, -8, 9, -11, 3, 3, 25, -1, -20, 5, 3, -43, 17, 6, -1, -10, 3, 8, -2, 5, -12, -15, 0, 8, -12, -22, -34, 9, -17, -12, 7, -15, 7, -13, -9, -10, -3, 14, 10, -9, 9, -8, 13, -16, -12, 4, -8, 25, -22, -6, -16, 20, 1, -6, -11, -7, -21, -20, -8, -15, -13, -7, -12, 0, 0, -9, 8, -13, -2, -6, 3, 5, -9, -30, 12, -11, 42, -25, -7, -20, 1, -7, 2, -19, -18, -13, 9, 5, 15, -20, -23, 3, -5, 13, -3, -16, 4, -1, 10, -21, 1, -3, -11, -25, -6, 23, 1, 3, 6, -17, -3, 32, -4, -20, -19, 20, 22, 19, 20, 27, 6, 11, 6, -6, 8, 13, 4, 9, 2, 7, -7, -11, 5, 13, 23, 6, -23, -9, -6, 2, -11, -34, 1, -12, -2, -3, 8, -17, 9, -4, -11, -8, 7, 0, -15, -9, -17, 1, 11, -36, 10, -17, -22, -8, -1, 13, -19, -8, 0, 8, 7, -20, -2, 6, -19, 1, -3, 12, -1, -1, 3, -13, 11, 15, -15, -4, 12, 9, 9, 11, -1, -10, -16, -6, -17, -9, -8, -15, 2, -2, -15, -3, -6, 13, -32, 12, -7, 12, 11, 13, -18, -17, 18, -6, 19, 0, 22, 13, 1, -7, 22, -16, -17, -10, -4, -3, 0, -10, -19, -1, 2, -16, -29, 8, -7, 6, -28, 14, -41, -14, -1, 14, -14, 3, 14, -16, -23, 1, 4, -31, -19, 17, -3, 16, 4, 1, 12, 1, 15, -43]
6070d3L4kJ2J3j1k4RNnK3k9oL9j7qJ2k7K8l2K8j1JL6l5Ojj3K7nrK6ok1oQnK6k2
6108epK1l3N2l0K2ok6J4Ol1J9JJ6Mqk3PRmLk1J6qQj3j7O2k1l5MK9kk0J7J6l7O
6146a5K7mK2l3lj7M4%j8Kk3nkJ9M%lj6J0kJ6k2LK2k5m2O2j0LK4k0nJ0j6K7kk0
6183hoK9j0rJ8l3K9%j8J6Kl7K7k2M1nJ5k7pJ0Pk5Pj0J6k0mL7j4J2ml2K2jMl3J2
6220b1J0j8L1K1l7J9r%j4%J8rj4J0LqJ1Pj4J4k6MK7k7L6Lj4j8L4l4j2K7j3J5n
6255cloNJ3j1lL1l8PL5l5L4k5rJ6j1nJ0rnJ4j1Nj7J8kK3j5kNk9L1j7L6k0J7k3
6292ANj3J2k0J8J3l0nlJ6j2QLL4n2rK2%QK5m3K5j3QRjj4j7K7j1j2N1m1J0k2L7
6328A4k3Mj0L2ok7J3mnJJ1KPJj2J5l2J6Jmj5J3oNQPj3K4omqj3L9k2pOnlj2M0k6
$$ y = [-43, -9, -11, 1, 14, 3, -21, -12, -7, -12, 11, -18, -24, 15, -2, -10, 2, -25, 3, -29, -1, -12, -11, 25, -10, -4, -5, -18, 9, 4, -5, 21, 15, -6, -12, -4, -9, 17, -5, -12, 9, -24, 28, -2, 20, 14, -12, 2, 8, -23, -4, -3, 13, 17, 9, -14, -7, 2, -2, 1, -20, -4, -12, -4, -17, -34, 28, 7, -28, -24, 5, 3, -17, 0, 16, -21, -15, 12, 8, 30, -3, -6, -23, 21, 21, 3, 5, -18, -23, -25, -6, -2, -2, -5, -21, -11, -13, 3, -19, -16, 6, -19, -61, 1, -9, -6, 18, -2, -7, 3, -13, 14, 12, -8, -14, 15, 5, -4, 14, -19, 10, 10, -8, 8, 10, -27, 0, -22, 19, 14, 29, 2, -5, 5, 12, -13, -6, -16, 0, -20, -24, 13, -1, 11, 7, -25, -3, -4, 0, -33, -21, -11, -29, 2, 23, -14, 5, -4, -4, -18, -18, 0, -9, -23, -13, -10, -18, -7, 0, -14, 0, -26, -22, 5, -22, 14, 17, 3, -15, 19, -15, -27, 0, -13, 2, -3, -6, -12, -7, 6, -5, -8, 23, -15, -8, 27, -8, 26, 1, -8, 8, -3, -8, 2, -7, -12, 2, -9, -4, -21, -3, -5, 18, 3, 1, 6, -23, 8, -9, 27, 7, 24, 1, 6, -7, 5, -15, 3, 16, -14, -19, -22, -6, -18, -10, -7, 27, -25, -34, -12, -12, -4, 21, -22, 3, -10, -2, 7, 6, -8, -25, 2, -9, -21, 30, -11, -1, -23, 14, -9, -5, -15, 17, 11, -16, -3, -7, -12, -11, 0, 2, 9, 10, -2, 13, -19, -3, -2, -6, -21, -8, -14, -9, -1, 6, -7, 17, 11, 7, -1, -14, 25, 3, -4, 2, -3, -6, -18, 22, -4]
6369dNK2Pj5j4J2j3j%%lNPk8M3l8K2J7m2NL5l0J8j2K1k3ppNlQPK5l6K7k0Mj1J1
6408ak2J6J2MlPk3K1j1jK0j4Jjj3K4j6Ll9K0PqL2LLj4J3l1K2pj9K4Pk6L9j2oQ
6446A9k4Rj2J3J7l1J0nJ4pJJ1k0jJ3l0J2QJ9rJ9j1l7M5m4K1qJ4j8K3nj9LJ7K%
6482Ik0J3LrnlJ9joJ5l0J7j9K1k2K1Kk2L5j0l4K1J2k4J4j7J9J4mj3j5j3L5j0p
6517a4J4j5J5J0qj1j3L0k6J8j4J5Lk0K5jj4RKl6L6J2k3J7rnL0j8k5K1Jjk1J5k
6552cj6J3MmNj7K1K0o7L6K0l9QK3j3J2j0LPk6nJ5L0k5J5prJ4j8j2K1j1OM2n6M0
6588A7l3Qj4M1k2j4L2k7J6lj3QRj7MJ0kj4j2OMOJ7J4k2QMmk8LK1k0pJ3mL1l4K4
6626Fj2j0J2MJ5l4RPmj1L8k2j3mL0k1J3j5oJ9j6K7l2J1JJ7Qj0j7Qj7RkPMRj5J3
$$ y = [-4, 1, 23, 30, 15, 1, 13, 0, -1, -1, -1, -4, 1, 8, -20, 23, -15, 7, 24, -18, -13, 22, -8, 10, -2, 19, -4, -11, -18, -13, -16, -8, -1, 24, -12, 15, -5, -1, -12, -1, -23, -7, 5, 9, 6, 13, -10, 11, 0, -1, 19, 5, 6, 5, -8, 16, 0, 3, -36, -16, -9, -17, 15, 18, 21, 7, 20, -11, 11, 4, -15, 9, 16, -10, 29, 17, 11, 19, -5, 4, -8, 5, 22, -9, 1, -4, 10, 3, 4, 15, -5, -6, 7, -23, -11, -3, 16, 7, 26, 15, -22, 23, -21, 0, -8, 6, -12, 11, 6, -13, -10, 7, 9, 9, -11, 2, 5, -4, -9, -12, 7, 6, 0, 15, -15, 2, -17, 4, -18, 3, 5, -17, 18, 8, -26, -5, 7, -17, -3, -20, -1, 13, 9, -4, -19, -32, 3, -7, -14, 0, -15, 0, 10, 2, -9, -22, 8, -18, 0, -14, 1, 4, -16, 9, 8, -6, 3, 5, -31, 5, 17, -6, 11, 2, -3, 27, 9, -16, 5, 6, 5, -16, -1, -3, -19, -6, -2, -6, -1, -18, 3, 23, -44, -8, 12, -27, -19, 4, -9, 3, -7, -4, 3, -23, -28, -13, 17, -8, 7, 0, -9, 5, -13, -25, -4, -15, -9, 33, -23, 17, -16, -8, -22, 19, -3, -17, 15, -12, 4, 1, -12, -4, 5, -12, -8, 2, 0, -14, -26, -20, -16, -10, 7, 21, -1, 7, 11, 7, -21, -18, 3, -17, -24, -11, -15, 16, -18, 6, -6, -16, -4, 0, 15, -19, -10, -3, -7, -18, 20, -2, -15, -19, 11, -10, 3, -12, -18, 1, -15, 12, -20, -9, -8, 9, 17, 7, -10, -2, -19, -10, -12, -5, -1, 8, -7, 6]
6664FMk9KJ0RNJ7k6K9m5K8k1mMK5j2Ll9K7lRk1nJL3k9RL3m3K3j3RjNJ0pj7K0p
6703alkj%PNLrKQJk1kO%Pk6%RJ6%J1j9j0K4jK0j8l8J7J6k1J4K6m4L0j9J4J0m2
6743c1J7K0l8J8J7j8qJ7j4ROkJ3nk6k1K5K0Rk2PQpK6k3j6J3k2JL7kkk1j4K8qk9
6780c8K6j1K6%m2J1K1J3oJ1l2L8j8k3L3J1l5l0N9l0K0K7k7nLLj4pJ4j8oMK0Jk
6815ck%k4M8k3kK2k3J1k4J7Kl0J9j1JK8Rj4oJ2k0OK%pRlk5M7j2kk6lK7kj5J0j
6854hk0L4l2rJ2L5j8jQj2nK0l2K8j1K9j3qk5K5J6j6Onk1K7j4J1Nq%KJ2k6K3k2
6890a3K1k4K0lk1PJ1j9lM3j9rj2J0J1j8N0p0M2l3K0pJ8kqJ6lqJ7j9nJ3j3nJ5O
6926Fj4K7l7QK1Kk8L0j4K4n2L0K0m3K1j9K5Kjk6MOK3l8K4KrpjKqJ5lJ4Nl9L0j9
$$ y = [6, 10, -19, -17, -7, 2, 7, 24, -2, 27, -18, 10, -11, -15, -11, 14, 2, 5, -34, -7, -10, -1, -22, -27, -26, 7, -22, -13, 20, -23, 0, -13, -4, -5, 0, 10, 3, -14, 6, -1, -4, -6, -7, -7, 0, 5, 8, -1, 1, 9, 10, -11, -13, -7, -7, 0, -26, -26, -17, -1, -1, 10, -9, -19, 5, 4, 24, 6, -32, -15, 1, -20, -6, 20, -24, 6, -13, 1, 11, -31, -14, 6, -32, -14, 3, -15, -23, -6, -20, -11, -5, -7, 6, 1, -25, -46, -21, -1, 8, -14, -7, 1, -6, 20, -3, -19, -6, -28, -27, 10, 8, 6, -15, -29, -1, -9, -38, -12, -23, 3, 3, -39, -28, -7, 6, 0, 11, -21, 17, -1, -24, 9, 20, -15, -45, 14, -16, 4, 31, 4, -1, 2, 5, -9, -16, -2, -20, -26, -22, -2, -1, -3, -5, -5, -29, 19, -4, -6, 16, -7, 4, -20, -3, -1, -31, -12, -23, -22, 6, 15, 1, -5, 7, -13, -7, -5, -5, -12, -3, -6, -31, 16, 4, 2, -24, -27, 0, -2, -17, -7, -8, -28, 6, -26, -35, -23, 12, -6, -7, 1, -11, -16, 4, -28, 0, -11, 18, 5, -3, -28, -3, 13, -3, 3, -2, -23, 4, -10, 1, 6, -2, -2, 0, 12, -14, 9, -13, 8, -16, 4, 1, -20, -13, -2, -21, -24, 19, 0, -9, -21, -11, 0, -18, 32, -38, 4, -29, -9, -16, 2, 0, -8, 8, 5, -3, 14, -5, -10, 3, -10, -15, 0, 6, -8, 19, -18, -10, 11, 13, -15, 15, 1, 25, -27, 3, 23, -20, 1, -18, 7, 9, 8, -18, -14, -8, 15, -23, 1, 3, -6, -13, -14, -12, -20, -5, -8, 6, 11, -28, 2, -17]
6964a7pL8l5K0j4oJ2j7M1k6J9m6NJ7J7Jj0j8oJ6RJ2%%j3K8l1K8k7nK4j0j0Mqj4
7000b9M9l0J9k4K5j4k0K7j7j9J6nnrK1KokjJ2K7j9j2J2j3J4J9k9J0J0l3%QmRM
7036gjkj4K9%m6M6j5J1jkjRl1K1j4L4j2rlk1L7lKqj4K9lj4K2k1J2j6J7Pl0QNj0
7075iJ2OQm3K2jJ8Roqj7J2%J0nNl8M4k2m7P3m1K9j7J1j3lK3J8k0m4K5j3J5kK0
7111A1l8L3J0k3MLj9j2K8K0p1O6n3K2L7m9K1OL1rj2m2N2j4j5QNOqjrQj5J2J9k3
7147a1QQOmJ2k4K5l0nN0n5L8j8k7J6j3J5OmPJ7k9J5j5rK1pJ8l8K9Jjj8jnRRK2
7185A8j1j9Mj2J9oj0L7k6j4M5k1j3j6L2k8J2JnQ%J3j2rk0L3rK0j4mlK4k1j9L2
7220Fm1L4LQJ%Ql2J5K5m9QJ3K2j8Rk6pJ7j9kJ9lPRk3NK7k2jk6K7Qj2J9K4m9J8
$$ y = [-17, -24, 14, -21, -1, -15, -21, -9, -26, 15, -11, 8, -38, -33, -16, 1, 2, -8, -26, -32, -16, -7, 5, 5, 5, -8, 20, -11, 17, -10, -15, 9, -1, -11, -7, -15, -29, 20, -10, 9, -15, 10, -4, -24, 3, -14, -33, -17, -22, -27, -36, -15, -13, -19, -21, -22, -10, 17, -2, -14, -2, -15, -1, 18, -11, -1, 9, -24, -24, -16, -20, -11, -7, -8, -10, -24, 5, 5, -41, 5, -10, 1, 0, -2, -3, 6, -25, -4, -18, 16, 4, -5, -8, -29, 8, 5, 7, -1, -15, 14, 11, -3, 19, -2, 10, -6, 11, 18, -12, -4, 1, -9, 3, 9, 17, -26, -4, -5, 13, 22, 16, 8, -9, 3, 3, 13, 8, 13, -25, 19, -3, -50, 23, -18, 11, -6, 5, -8, -11, 12, 30, 10, -34, -9, -22, -7, -9, 11, -27, 6, 16, -7, -3, 0, -19, -31, -3, 17, -54, 12, -41, -19, 18, -31, -10, -4, 27, 18, 6, -36, 16, 2, -13, -5, 0, 6, -2, -3, -12, -4, -19, -7, 12, -11, -3, 5, 11, 7, 19, -5, 20, -10, -15, 35, -20, 18, 0, -27, -11, -24, -9, -3, -7, 0, 17, -12, 3, -12, -21, 0, -7, 11, -27, 2, 3, 2, -16, -17, -22, -13, -4, 18, 7, -12, -8, -20, -1, -7, -17, 20, -6, -20, 25, 4, -9, -25, 7, -21, -9, -8, -13, -5, -5, 8, -4, -13, -33, 0, -9, 11, -3, -7, -10, 14, -7, -26, 6, -35, -1, 2, 10, 11, 11, 19, -13, 2, 27, -22, -14, -1, 21, 3, 12, -14, -21, -4, -23, -25, -6, -9, -2, 7, -16, -11, 16, -6, -7, -33, -6, 2, -10, 9, 33, -16, 2]
7258BrqJ0K5j3omJ7l5J8K0j9j0pJ0rJ2j8NmK8qk3K0rJ4Qk7J4K8nk1Rj7kL1k2J5
7296A0k7J3jj4L9k0k7J3J2j9Qj6M0Mk9J1j4OJ0jJ7qJ0j1k5K1l0jK8j0J7qj1J0
7330cj6K3j9k5K6J3Pm5M5jl9K1J5%qj6L1pmj3J4j4qpK8Lj4j7K6mMolJ3Jj1kK0
7368HqLj5pL1K9n0Kj3J3pK2j4k9L7MMrJ8k2OJ7k9J5nJ6j4j2mjK8j7j8J2Qj5j3
7405b9K0j5oK6l5K0QrJ7Jl1K3njK6k3J9j3J5j1jj0L1j3lj4KNN%J5m0L6j1J2j5
7441d%J6k4K5m4K4k1L5Jm3J5nK8l8K5kK2k1k6J8oMJ3oj3OK6j%j7J7nJrrJ5j8K9
7479H%J0l1J3j0PK5k5Ll0L8j2oKpQkj2Pl1K0LK9Nl3L8l3j8K0M2j7l2K7j8J8K4
7515C0k8oJ4l0K0j1j2J6j1qK2K%k8L9lj2Qk0J4jPOj7%K0m9M1j7J7J2jkl9K7jR
$$ y = [2, -7, -15, -5, 20, 7, 1, -3, 14, -21, -3, 17, -2, -12, -19, -9, -18, -6, -24, -19, -23, 5, -3, -26, -6, -15, -1, 7, -20, -6, 22, 17, -4, 5, -12, -14, 17, -5, 10, -17, -4, -5, -19, 20, 0, -27, -14, -2, -21, -13, -29, 11, 15, -14, -3, -17, -11, -1, -2, 15, 7, 17, 6, -19, 2, -28, -29, -1, -11, 6, -2, -13, -3, -19, 4, -15, -40, -14, -1, 6, -39, 6, 5, -34, -13, 2, 2, -6, -22, 9, 2, -2, -15, -1, -15, -23, -30, -2, 1, -13, -30, -4, -8, -4, -10, -13, 0, 1, -10, -12, 8, 0, 3, -12, -19, 12, 41, -9, -7, -20, -7, -14, 8, -6, -35, 2, 6, 10, 1, 19, -3, 3, 20, -9, 6, 1, 17, 3, -9, -13, -14, 14, -3, -21, -9, -1, -16, -29, -9, -24, -30, -4, -39, -19, -11, -20, -3, -2, -33, -10, -15, -16, 10, -13, 6, -7, 8, -3, -4, -14, 17, 4, 1, -13, -11, -6, -1, -1, 14, -26, 10, -1, 11, -4, -4, 12, -12, 13, -31, -7, -28, 7, 8, -35, -20, -25, 3, -35, -10, -12, 10, -11, -37, -19, -25, -21, -8, -14, -27, -21, 5, 4, 4, -13, 4, -1, 0, -9, -18, -3, -21, 8, 8, 18, -13, 0, -10, -3, 22, -3, 0, -30, 8, -4, -10, -8, -15, -7, -9, -21, -14, -45, -25, -22, 7, 12, -21, 17, -16, -34, -14, 28, 11, -21, 6, -12, 6, 30, 2, -4, 10, -20, 0, -11, -23, -7, -18, -26, -4, -2, -2, -30, 9, 6, -6, 2, -18, -4, -5, 2, 8, -9, -9, 11, -38, 3, -14, 3, 15, 14, 12, -27, 0, -1, 8]
7552H%onk9J9j9K0J2J5m0RNmK1J7k4jNj6QjJ0oj0rMK1m1K1pK2k3J3loLmR%K3p
7593Dk2RjOpQJ4k1J3Qk6J9QJk7rJ1J9km6K5K1j0rK9k4mKJ0kJ1l1Lj6M4m0K2OK2
7632A8lpj3MJ0j1nLJ0k6L7l6JqJ4l5M8Ll1N3l6K0Jl7J4JLlJ3nK0m7QKK0JoJ1l0
7671b4JJ9J5K0l7JK8j7%j2rJ0kJ0mj4J6k5RL3J3m9K6K3l8NQ%l0J8QKJ5n4J5K1
7707Aj1QlL1j8nMk5J1jJ4k6K3qj7K9j6j2PjpL9Qm1K7l0K3lJ9k7j4J4kQPKNj1k5
7746b3K7Kk6K2lj5J1J4MPm2qM6k7koRoJ4mklJ2Ooqj0KJ3j%L4k4jJ6Ol8L3l0j2
7786a9J2kKJ4qkK1j6QmLqj2%ONOk4%K3njJ2ok5OKJJ9j5Mlj2K9k8L0Pkj2J4j8p
7828eLl3L1k6O9l0Ol8Mj3M1jj0J1k1J9j0lrK3j4J9m4J2j3RJ2lLJ2J2j6oK2kj9
$$ y = [8, 8, 2, -3, -32, -13, -32, -12, 0, 15, -25, -16, -11, -15, 6, 23, -1, -2, 3, -13, -5, -6, 4, -2, -12, -21, -17, 4, -37, -16, -23, -1, -24, -11, -14, -20, -17, -21, -12, -12, 11, 4, -18, -9, -10, -4, -11, -3, 11, -10, 3, 11, -15, 4, 12, 13, -14, -23, -12, 7, 5, -41, -16, 5, -5, -14, 15, -9, -13, -11, -1, -3, 8, -23, -20, -36, 8, -32, -10, -4, 18, 15, 8, -5, -1, 9, -2, -7, -4, 6, -20, 17, -19, -18, -26, -12, -47, 1, 4, -27, 26, -10, 10, 11, -26, -12, -11, -8, -11, 2, -3, 17, -30, -22, -20, 0, 1, -5, 6, -24, -23, -4, 11, 31, -6, -5, 23, 6, 6, -6, -15, -5, -7, 3, -1, -15, 1, -24, -15, 18, 31, -18, 8, 31, -7, -2, 6, 6, -24, -6, 2, 4, 19, -35, -20, 1, -10, -2, -5, 26, 8, 3, 7, -18, -7, -8, 6, -20, 3, -5, -22, 7, -9, -21, -14, -15, -22, 17, 25, -16, 11, -19, 4, 1, 20, -7, -21, -7, -9, -1, 6, 8, 13, 2, -23, 4, 6, -20, 2, -1, -16, -5, 9, 13, 20, -22, -30, 16, -11, -13, -19, -10, -16, -2, -6, -8, -11, 1, 7, 1, -7, -17, -15, -2, -3, -3, 31, 7, 6, 22, 28, -10, 23, -7, -19, -7, -9, -7, 7, -1, -3, 18, 2, 10, 6, 9, 1, -11, -11, -5, 0, 6, -18, -18, 5, 0, -1, 11, 5, -20, -14, -12, -11, 8, -7, -3, -6, -18, 11, -17, 13, 20, 18, 6, 20, 2, -5, -2, -35, -4, -30, 39, 9, 15, -23, -19, -32, 9, 8, -2, 9, -12, 7, -3, -6, -15, 8, -6, 13, -31, -19, -32, -23, -11, -14, -11, 1, 13, -3, -9, 13, 11, -8]
7864h%JJ7Jpk1L2j2j2JQ%Kk4J6j0K1nkL3n3M0k9kJ0j0NJ8l9L4Lj9PMpj1K2nj2
7903a3qK2j4k0K5j3RNNOm3K4J4lj4onL0ppJrJ2j8K2Oj1JPJ1Nk7PJlJ2jl4K2nj9
7944c3K4J6POrj6LJ1%k1NQk8K2qK4j9QMk0pJ3j3J9J0oJ1j5j6mJ4KLj0NK4j3k6
7982b5J0J0k6N4k0k0kL5j8okk3M7j5J1oJ3jk9J6k0J9Jj7J3j5LKJ6mnj%j3NNMk2
8020b6%K1rJ0QRMm6L0qQj7J7pJ1NKk8K5k1Rk1L4jl4J5JjnK6j4mOJ6k5K%k6L0J
8060cJ9k5L0l3J0kk5K0J2J0m0L7j3j0nQk3K1j3J2KJ0JjK3l7L7m5J5J0orqK8k2
8095a5J0l0M0J0nk5LK7m3J3jKkj2K9l0K8Ok4J4k9J6NMj1L3l0kK7k2kJ5k3jJ0n
8131b0J3kK0k0oJ9prK1l1K1lm1N3j6lJJNPk1L5rNPj5j0rNj4J4J2j3j6K1RqJ1j9
$$ y = [-8, -8, -7, 10, 11, 4, -17, 15, 3, -9, -8, 0, 0, 2, -22, -6, -16, 5, 0, -2, 31, -22, 18, -11, -13, -3, -13, -8, 10, -29, 5, 8, -11, -4, 0, -7, -18, 4, -1, -13, -21, 1, -13, -33, -8, -21, -12, -7, -2, 4, -39, -15, -1, -4, -18, -24, -29, 1, -6, -13, -12, -21, -9, -27, -5, 1, -10, -9, -2, 9, 14, -13, -6, -5, -8, 4, 3, -31, -9, -14, -33, -9, 7, 14, 20, 11, -5, -2, 9, 9, -12, -7, 1, -27, -5, -13, 11, -8, 0, 4, -16, -23, -10, -23, -4, 6, 0, 11, -4, -20, -24, -10, -8, -5, -15, -10, 14, 1, -25, -15, -5, -31, 23, 3, -17, -19, 16, -2, -8, -10, -33, 14, -1, 10, 4, 17, 16, -13, 3, -17, 2, 3, -14, -1, -16, -13, -11, 5, 1, -4, -5, -5, -18, -13, -8, -4, -26, -26, -5, -14, -4, 4, 13, 17, -29, 1, -7, 1, -16, 1, -6, 5, 10, 12, -16, 9, -12, -3, -24, 10, 9, -25, -10, -9, -10, -15, 11, -3, -7, -1, 15, -10, -8, -8, -34, -4, -3, 16, -9, 21, -12, -2, -4, -29, -9, 3, 13, -27, 10, -3, -13, -18, -10, -33, -12, -25, -13, -11, -1, 0, -1, 22, -15, 22, -23, -8, 2, -4, -13, -21, 7, -15, -5, -35, 5, 15, 10, -15, -12, 15, -28, -15, -16, -14, -16, -28, 1, -29, -1, 5, -19, -5, -34, -18, -13, -9, -20, 13, -17, -19, 8, -14, -16, -1, -24, -25, -15, -20, -7, -9, 11, -9, -15, 4, -3, -12, 9, -22, -1, -4, -45, 8, -8, -11, -10, -9, -4, 3, -18, 17, 8, 13, 20, 5, -5, -14, -9, -23, -9, 3, -10, -26, -5, 4, -4, 7, -12]
8170a2mo%J7pkJ8lk3J0K3k4%j2N1k1qlQlr
$$ y = [-12, -16, -22, -22, -5, -12, -14, 4, 1, -22, -12, 11, -13, -13, -25, 26, 5, -3, -6, 2, -1, -10]
8191a0
##END NTUPLES=NMR FID
##END=
