##TITLE=1H_LR-777-R2-B2-KM1
 CDCl3+CD3OD
 8 sc, 
 9.1.2024
##JCAMPDX= 6.0         $$ Bruker NMR JCAMP-DX V2.0
##DATA TYPE= NMR FID
##DATA CLASS= NTUPLES
##ORIGIN= UXNMR, Bruker Analytische Messtechnik GmbH
##OWNER= root
$$ XWIN-NMR		Version 3.5
$$ Tue Jan  9 14:22:18 2024 Russian Standard Time (UT+4h)  she@DPX200
##.OBSERVE FREQUENCY= 200.1313
##.OBSERVE NUCLEUS= ^1H
##.DELAY= (6, 6)
##.ACQUISITION MODE= SIMULTANEOUS
##.ACQUISITION SCHEME= undefined
##.AVERAGES= 8
##.DIGITISER RES= 18
##SPECTROMETER/DATA SYSTEM= spect
##.PULSE SEQUENCE= zg30
##.SOLVENT NAME= CDCl3
##.SHIFT REFERENCE= (INTERNAL, CDCl3, 0, 15.7039)
##AUDIT TRAIL= $$ (NUMBER, WHEN, WHO, WHERE, WHAT)
$$ ##TITLE= Audit trail, XWIN-NMR		Version 3.5
$$ ##JCAMPDX= 5.01
$$ ##ORIGIN= Bruker BioSpin GmbH
$$ ##OWNER= she
$$ F:/spectra/data/she/nmr/H-F/1/audita.txt
$$ ##AUDIT TRAIL=  $$ (NUMBER, WHEN, WHO, WHERE, WHAT)
(   1,<2024-01-09 14:21:04.12 +0400>,<she>,<DPX200>,
      <created by zg, POWCHK disabled, PULCHK disabled
       configuration hash MD5:
       00 E9 B6 7A A2 85 ED C7 34 08 36 98 17 FE 4E 26
       data hash MD5: 16K
       87 79 42 00 72 60 07 AA A7 B7 CF D2 47 C2 54 E9>)
$$ ##END=
$$ 
$$ hash MD5
$$ 25 35 CB 5B 09 47 A5 40 90 4B A5 A9 46 C3 D0 96
##$RELAX= 
##$RELAX= 
##$RELAX= 
##$RELAX= 
##$RELAX= 
##$RELAX= 
$$ Bruker specific parameters
$$ --------------------------
##$DU= <F:/spectra>
##$EXPNO= 1
##$NAME= <H-F>
##$PROCNO= 1
##$TYPE= <nmr>
##$USER= <she>
##$AMP= (0..31)
100 100 100 100 100 100 100 100 100 100 100 100 100 100 100 100 100 100 
100 100 100 100 100 100 100 100 100 100 100 100 100 100 
##$AQSEQ= 0
##$AQ_mod= 1
##$AUNM= <au_zg>
##$AUTOPOS= <>
##$BF1= 200.13
##$BF2= 200.13
##$BF3= 200.13
##$BF4= 200.13
##$BF5= 200.13
##$BF6= 200.13
##$BF7= 200.13
##$BF8= 200.13
##$BYTORDA= 1
##$CFDGTYP= 0
##$CFRGTYP= 5
##$CHEMSTR= <none>
##$CNST= (0..31)
1 1 145 1 1 1 1 1 1 1 1 1 1 1 1 1 1 1 1 1 1 1 1 1 1 1 1 1 1 1 1 1 
##$CPDPRG= <>
##$CPDPRG1= <>
##$CPDPRG2= <>
##$CPDPRG3= <>
##$CPDPRG4= <mlev>
##$CPDPRG5= <mlev>
##$CPDPRG6= <mlev>
##$CPDPRG7= <mlev>
##$CPDPRG8= <mlev>
##$CPDPRGB= <>
##$CPDPRGT= <>
##$D= (0..31)
0 1.2 0 0 0 0 0 0 0 0.06 0 0.03 0 0 0 0 0.0002 0 0 0 0 0 0 0 0 0 0 0 0 
0 0 0 
##$DATE= 1704795663
##$DBL= (0..7)
120 120 120 120 120 120 120 120 
##$DBP= (0..7)
150 150 150 150 150 150 150 150 
##$DBP07= 0
##$DBPNAM0= <>
##$DBPNAM1= <>
##$DBPNAM2= <>
##$DBPNAM3= <>
##$DBPNAM4= <>
##$DBPNAM5= <>
##$DBPNAM6= <>
##$DBPNAM7= <>
##$DBPOAL= (0..7)
0.5 0.5 0.5 0.5 0.5 0.5 0.5 0.5 
##$DBPOFFS= (0..7)
0 0 0 0 0 0 0 0 
##$DE= 6
##$DECBNUC= <off>
##$DECIM= 32
##$DECNUC= <off>
##$DECSTAT= 4
##$DIGMOD= 1
##$DIGTYP= 9
##$DL= (0..7)
0 120 120 120 120 120 120 120 
##$DP= (0..7)
150 150 150 150 150 150 150 150 
##$DP07= 0
##$DPNAME0= <>
##$DPNAME1= <>
##$DPNAME2= <>
##$DPNAME3= <>
##$DPNAME4= <>
##$DPNAME5= <>
##$DPNAME6= <>
##$DPNAME7= <>
##$DPOAL= (0..7)
0.5 0.5 0.5 0.5 0.5 0.5 0.5 0.5 
##$DPOFFS= (0..7)
0 0 0 0 0 0 0 0 
##$DQDMODE= 0
##$DR= 18
##$DS= 0
$$ [...]
##$SUBNAM2= <"">
##$SUBNAM3= <"">
##$SUBNAM4= <"">
##$SUBNAM5= <"">
##$SUBNAM6= <"">
##$SUBNAM7= <"">
##$SUBNAM8= <"">
##$SUBNAM9= <"">
##$SW= 18.0517328524113
##$SWIBOX= (0..15)
0 0 2 0 0 0 0 0 0 0 0 0 0 0 0 0 
##$SW_h= 3612.71676300578
##$TD= 16384
##$TD0= 1
##$TE= 0
##$TE2= 300
##$TE3= 300
##$TEG= 300
##$TL= (0..7)
0 120 120 120 120 120 120 120 
##$TP= (0..7)
150 150 150 150 150 150 150 150 
##$TP07= 0
##$TPNAME0= <>
##$TPNAME1= <>
##$TPNAME2= <>
##$TPNAME3= <>
##$TPNAME4= <>
##$TPNAME5= <>
##$TPNAME6= <>
##$TPNAME7= <>
##$TPOAL= (0..7)
0.5 0.5 0.5 0.5 0.5 0.5 0.5 0.5 
##$TPOFFS= (0..7)
0 0 0 0 0 0 0 0 
##$TUNHIN= 0
##$TUNHOUT= 0
##$TUNXOUT= 0
##$USERA1= <user>
##$USERA2= <user>
##$USERA3= <user>
##$USERA4= <user>
##$USERA5= <user>
##$V9= 5
##$VALIST= <valist>
##$VCLIST= <CCCCCCCCCCCCCCC>
##$VD= 0
##$VDLIST= <DDDDDDDDDDDDDDD>
##$VPLIST= <PPPPPPPPPPPPPPP>
##$VTLIST= <TTTTTTTTTTTTTTT>
##$WBST= 1024
##$WBSW= 4
##$XGAIN= (0..3)
0 0 0 0 
##$XL= 0
##$YL= 0
##$YMAX_a= 80443
##$YMIN_a= -112824
##$ZGOPTNS= <>
##$ZL1= 120
##$ZL2= 120
##$ZL3= 120
##$ZL4= 120
##$ABSF1= 10
##$ABSF2= 0
##$ABSG= 5
##$ABSL= 3
##$ALPHA= 0
##$AQORDER= 0
##$ASSFAC= 0
##$ASSFACI= 0
##$ASSFACX= 0
##$ASSWID= 0
##$AUNMP= <proc_1d>
##$AZFE= 0.1
##$AZFW= 0.1
##$BCFW= 1
##$BC_mod= 2
##$BYTORDP= 1
##$COROFFS= 0
##$CY= 11.3945322036743
##$DATMOD= 1
##$DC= 2
##$DFILT= <>
##$DTYPP= 0
##$F1P= 15.7292609196834
##$F2P= 12.9074282941183
##$FCOR= 0.5
##$FTSIZE= 0
##$FT_mod= 4
##$GAMMA= 1
##$GB= 0.15
##$INTBC= 1
##$INTSCL= 1
##$ISEN= 128
##$LB= 0.24
##$LEV0= 0
##$LPBIN= 0
##$MAXI= 10000
##$MC2= 0
##$MEAN= 0
##$ME_mod= 0
##$MI= 1.114404
##$NCOEF= 0
##$NC_proc= 0
##$NLEV= 6
##$NOISF1= 3.799351
##$NOISF2= 2.8
##$NSP= 1
##$NTH_PI= 0
##$NZP= 0
##$OFFSET= 15.70392
##$PC= 1
##$PHC0= -24587.84
##$PHC1= 9.85273
##$PH_mod= 1
##$PKNL= yes
##$PPARMOD= 0
##$PSCAL= 0
##$PSIGN= 0
##$REVERSE= no
##$SF= 200.130013532006
##$SI= 16384
##$SIGF1= 3
##$SIGF2= 2
##$SINO= 400
##$SIOLD= 16384
##$SREGLST= <1H.CDCl3>
##$SSB= 0
##$STSI= 0
##$STSR= 0
##$SW_p= 3612.71676300578
##$SYMM= 0
##$S_DEV= 0
##$TDeff= 0
##$TDoff= 0
##$TI= <>
##$TILT= no
##$TM1= 0
##$TM2= 0
##$TOPLEV= 0
##$USERP1= <user>
##$USERP2= <user>
##$USERP3= <user>
##$USERP4= <user>
##$USERP5= <user>
##$WDW= 1
##$XDIM= 8192
##$YMAX_p= 0
##$YMIN_p= 0
$$ End of Bruker specific parameters
$$ ---------------------------------
##NTUPLES= NMR FID
##VAR_NAME=  TIME,          FID/REAL,        FID/IMAG
##SYMBOL=    X,             R,               I
##VAR_TYPE=  INDEPENDENT,   DEPENDENT,       DEPENDENT
##VAR_FORM=  AFFN,          ASDF,            ASDF
##VAR_DIM=   8192,          8192,            8192
##UNITS=     SECONDS,       ARBITRARY UNITS, ARBITRARY UNITS
##FACTOR=    0.0002768,     1,               1
##FIRST=     0,             0,               0
##LAST=      2.2672688,     0,               0
##MIN=       0,             -112824,         0
##MAX=       2.2672688,     80443,           0
$$ Real data points
##PAGE= N=1
##DATA TABLE= (X++(R..R)), XYDATA
$$ [...]
1512C20j370Q39J355q27m61L97j168q89J643J193j072j001L03K73n43J934J054
1529A980j527r52Q20L40p07J077O45j727j245Q54N8n58J161Q43j794j181J066
1546h47Q71j84J101K85j994p10J959R27o03K04l4j748l50J545N60j413N8K43j395
1565a525j89J895N87q89j06M41r30pK067N32j575m82L72m83j47J815j28k135k65
1584a152R07l25j24J262l44j715M05J401k74M9J250l71j357R6J213p7n77O51q46
1603G2j471K27J624j45o24P0n68p59P98J908m73r50K25jm89J044J254n65j306
1622a29O8L9n63N40R01p94j404M14L56l11Q82J096q42j242M17R67J07L19M40j155
1642A06q48P13Q67l77k10K72r80q83Q26P11l61m60M34k70p19J132J130n51l11
$$ y = [320, -1050, -211, 1144, 317, -144, 253, -915, -1804, -161, 1032, -40, -1041, -738, -465, -1008, 926, 1980, 453, -499, 321, 661, -46, 1031, 1676, -51, -1296, -442, -384, -942, 219, 1062, -732, -1913, -847, 24, -160, 941, 1226, -768, -1478, 481, 1408, 805, 1009, 975, -773, -1123, 422, 982, -431, -373, -130, -1525, -1714, 181, 768, -121, -227, 214, -716, -723, 1344, 1876, 301, -181, 191, -292, -439, 1376, 1248, -887, -1152, -245, -570, -694, 568, 224, -1491, -1086, 315, 41, 90, 1340, 969, -388, -292, 921, 844, 267, 918, 72, -1399, -1172, 452, 307, -317, -247, -815, -1574, -776, 1132, 659, -291, -66, -67, -556, 488, 1742, 1177, -129, -61, -22, -585, -45, 856, 62, -1342, -928, -572, -883, -1, 1095, 253, -989, -572, 395, 502, 821, 1261, 106, -742, -29, 838, 461, 251, 523, -457, -1340, -514, 197, -164, -624, -190, -460, -1179, -47, 1083, 532, 221]
1661B21K32l63j94Q82L20q32o57K95l08r4O78K30j095l06O79J43M7L74P2m12j90
1682b78O50L17k63K84K5r38j38P71m5l91j39l40o24L25O36M38n03j39K18k42L77
1703AQ88j68l72m12J17M9J94M77l32p54k42J2L1M38R7j51p24L10K52M02K05J91
1725E09m13m07L58M54K59j50k13m44m02L16M66k07j46n45j21k1M26K29J39j50
1745f3k26J80K03N23K52k74n93p5M4M31O9o8n55p04K65K62L33L11l18n61k76L99
1767d41Q87J46J37o07l04j36M98Q02n7m34o31n71m5O96N13j34p18m61k0L49R05
1788C74L25k63n94k50J71O34M45M5n97p01p8L50L90L24k49q08l19J27N25M08J24
1809C83n14m99Q8O81N10J92k14m54l80N9L70L64n5m76m21l88K37O91l6j27l04
$$ y = [221, 453, 90, -104, 778, 1098, 266, -391, -96, -404, -498, 180, 410, -685, -991, -312, -169, -122, 252, 324, -88, -278, 372, 689, 426, 710, 735, -203, -341, 430, 385, -6, -145, -485, -1109, -784, -148, 290, -213, -352, -134, -376, 1, 889, 721, 349, -63, 54, 103, 297, 774, 442, -312, -554, -542, -511, -73, 24, -127, -851, -541, -289, 113, 318, 509, 96, -311, 47, 501, 760, 610, 397, -47, -449, -133, 333, 126, -20, -565, -686, -707, -281, -52, 87, -63, -289, -109, 94, 617, 869, 595, 2, -73, -29, 402, 471, 403, -152, -856, -591, -329, 4, 315, -3, -564, -840, -441, 446, 592, 729, 122, -182, -318, 180, 982, 925, 491, -140, -711, -756, -60, 453, 319, -399, -860, -880, -531, 374, 699, 436, -158, -408, -237, 397, 842, 887, 290, -411, -489, -139, 251, 575, 326, -482, -801, -674, -149, 259, 383, -131, -630, -542, 139, 649, 841, 627, 173, -207, -148, 222, 586, 531, 55, -366, -754, -517, 174, 138, 11, -293]
1830b93m51J04O66M49K28n00m64p8M18N10L97l46q01o20L62M05L48R1o41m73j58
1851h47N36M03L42r8n11m50K54O22M77j02k00m78l89L32M69l9j34l00n71j42M30
1872c96N77J44l31l08j26p0P60N19k43m15j54k08J39O45J72l40q62m4J82J22L79
1893A42K10p61l35M68L06rK22J76n91j8L66K95n9K5k03n35k86P99O5l61k3jl71
1916d79j19R35j09l36j08J56j82J61Q02l9o58n7J59j97P5N64k62p25l23N12O7
1937a63OM81k6q97J53N32k4R4M41l90p59M96N74n2m27K18n16m81N68O61l64o20
1959d95K29N9l79O11L31j91n18M26N0m11M61O25n28n80M25R9m17L10M83n12q86
1980h08N72L26k80K53K83o22n96P98N33l38K9J52n60k44R23J96o11p6J85n69j57
$$ y = [-293, -744, -640, 26, 475, 703, 203, -261, -339, 79, 589, 986, 640, -161, -781, -419, -14, 334, 425, -216, -689, -847, -311, 92, 434, 336, -175, -625, -371, 251, 728, 626, 426, -52, -441, -109, 360, 321, 187, -113, -684, -826, -396, 181, 325, -6, -314, -440, -510, 250, 769, 526, 111, -43, -251, -112, 533, 705, 365, -497, -541, -359, -237, 142, 352, -409, -744, -276, 30, 21, 243, 419, -172, -190, 176, 471, 412, 437, 234, -301, -587, 212, 277, -84, -107, -108, -479, -598, 337, 228, -108, -216, -60, -242, -81, 721, 682, 24, -33, 126, -71, 4, 568, 306, -419, -742, -230, -163, -157, 324, 298, -599, -446, 86, 62, 156, 597, 207, -552, -56, 518, 466, 39, 257, -259, -740, -172, 489, 125, -495, -266, -207, -586, 25, 356, 165, -353, 73, 123, -288, 173, 798, 270, -310, 115, 214, -203, 107, 590, 78, -808, -236, 90, -190, 63, 346, -276, -872, -74, 459, 121, 150, 302, -258, -502, 421, 617, 6, -70, 115, -454, -611]
2001f11J090J11q10k53L50j74p3R36K04j049k28N08l8P6O19M9j110k77O34K20
2021A74j72K83L7r67oQ34l8k73M60K2q64j51R86J42k90J16J3r78J3J087J96n19
2043A05k22N8o52M70R93j62r63j41L58m57O06Q35n09o75O6K53j2J10O43m78q25
2064e99K11N43j67K52M21n88o56L11N05N3j49M82p77n42O36O52k82m16K76n15
2084c49m11N23P02j77n68M05m78m52Q20Q01m29o08J70l88PO90O20q48n18J01J89
2105a98K8N68J67n50p40N20L02r3K60K0o37l62P05L85l68M7K15n72l05O78K35
2126C05l06K19k06l44j96O58K79k38Q1k68k28j32N71M98p17j18J30k12k2N63R1
2147D08n82k14pK03K47J41J15o56j94N64M8O9K41l18l32j32N19R7k64J30k91l22
$$ y = [-611, 479, 590, -220, -473, -123, -297, -370, 566, 770, -279, -507, 1, -37, 39, 658, 707, -403, -680, -46, 174, 2, 285, 322, -645, -651, 183, 145, -128, 332, 354, -510, -661, 325, 467, 177, 293, 306, -672, -659, 428, 624, 105, -117, -59, -711, -241, 752, 590, -373, -514, -156, -613, -7, 828, 319, -356, -290, -37, -49, 61, 704, 226, -599, -388, 155, -12, 240, 661, 73, -583, -272, 233, 286, 137, 619, -158, -700, -64, 588, 306, -110, 166, -349, -760, -237, 465, 288, -280, 125, -353, -805, 15, 816, 387, -221, -51, -439, -432, 258, 878, 30, -488, -387, -198, -170, 398, 565, 15, -725, -205, 97, 4, 264, 284, -353, -715, -10, 375, 7, 54, 269, -303, -608, 70, 305, -1, 218, 12, -332, -528, 130, 409, 171, 252, -16, -244, -376, 195, 693, -24, -142, -12, -224, -246, 317, 408, -174, -388, -395, -192, 55, 196, 311, -345, -539, 25, 73, 142, 383, 65, -267, -399, 120, 217, -47, 83, -208, -530]
2169e30J17P43j85k51J40l8k75QM74Nj56P0J01j83mK83r3l41k9q9r5L64J87j80
2193D3j66j95J7K13L08Q7j60l38M4J65L05Oj56l2m64K06M97j70j83o8j69j39M28
2216G9J05j77j49l09K88K34L1K31j71n8j67N2P9L08l13k38j36R3J42P6j0j6r9
2239a25j70L0L64J3J39j84j99j18J74L91j65J68k93m12J03K71K68o1l28l09mK03
2261b44L47K50m55m9r0L2L44L08j00j81k57J04P5J53ll66k79R6L1J97P2J58j21
2284B2k77J34K28O9L44k01j82j32j11N00j77K47l87k14k90J40K90J91j62j70k71
2305d09K15K49N18j68l60j41m0J46L17L33l02l23k96J3K49K75j47l35k55k2L38
2326a45K82J20Q1n22pK00J96K53j62k5k69J1k45M41j27J50k19k55l09M03K40P8
$$ y = [-530, -413, 330, 145, -106, 34, -4, -279, -271, 203, 208, 52, 122, 223, 40, 36, 319, 226, -115, -144, -233, -328, 36, 223, 43, -123, -318, -301, -88, 220, 307, 147, -191, -147, 18, 323, 329, 173, 141, -323, -117, 380, 210, 27, -41, -210, -349, 79, 184, 7, -142, -451, -163, 71, 102, 333, 162, 104, -63, -11, 68, 376, 63, -175, -311, -218, -76, 0, -10, -26, -125, -295, -265, 99, 112, 251, 67, -132, -250, -76, 315, 150, 318, 25, -387, -284, -13, 255, 194, -134, -443, -447, -244, 103, 353, -102, -151, -241, -209, 135, 443, 343, 162, -95, 9, 84, 237, 234, -132, -411, -315, -284, -87, -15, 143, 22, -255, -121, 107, 176, 520, 319, 137, 5, -106, 394, 217, 464, 77, -137, -427, -287, 3, 194, 32, -138, -409, -194, 55, 573, 405, 45, -96, -136, 10, 327, 660, 358, 35, -261, -248, 1, 276, 129, -206, -461, -483, -145, 137, 257, 338, -184, -191, 9, 205, 458, 296, 271, 2, 13, -232, 209, 82, 232, 13, -242, -551, -148, 92, 170]
2348A70j88P8k93j19O39O4Qj28l17j40L76K64J25m14l56N5JJ83L54j94m49j88
2370d69J11L32R9M3O9l86ML22J70J54j34k73j01Q7q9J88j73M0j46k62%M10J69
2393A65k75J33j02j77l3P37l7k93k0k47r9K75M00p5l88j91P3j55L92J88k04m19
2415c52j05K84O3J70N02m53m93L73K92J05l36J60k61l13L76K38l00j25K05k43
2435b13l13L70K63k26o5K65O7k40K83K27k82k14J87K0j51J97J55n77j76K77p8
2456b24j66M98n1j58q4J51K06j5n2J62m52p7L96J29l45J00o1j01j35L46m4j92
2478a69k52K24j38J79M85j00m83J35J83J63j65M65l08m73J74L40m79J29K56J7
2498A83n68P9L07k02K86J05j62m26J83L67O8o2J47l02k14K52K89p8l66L0j0m58
$$ y = [170, -18, 60, -233, -352, 287, 351, 359, 231, -86, -226, 150, 414, 539, 125, -231, -176, -175, 8, 362, 168, -281, -469, -358, -26, 73, 116, 185, -201, -197, 125, 295, 449, 315, 42, -59, 28, -61, 127, -46, -6, -152, -414, -414, -4, 165, -110, 23, -79, -256, -289, 448, 411, 118, 98, -149, -248, 27, 427, 352, -36, -227, -154, -309, 83, 271, 67, -352, -457, -173, -110, 60, 562, 109, -384, -11, 281, 386, 50, 210, -51, -364, 12, 250, -50, -175, 30, -213, -526, -156, 107, -119, -184, 81, 148, -92, 191, 418, 136, -78, 109, 129, -22, 175, 330, -247, -423, -146, -224, -390, 108, 57, -101, -185, -34, 172, 157, 105, 267, -185, -262, 134, 263, -82, 18, -43, -144, -279, 67, 23, -169, -421, -197, -335, -156, 329, 229, -254, -119, 64, 227, 62, 527, 219, -254, -80, 260, -219, -90, 166, 183, -385, -306, 1, -201, 85, 190, 28, -398, -215, 152, 220, 158, 305, 3, -211, 41, 330, 252, -114, -84, -94, -552]
2520e52K01O37m59k45L00j16L4K26L88k90l00R8J48k26N37J01l50n20L44j4oR6
2542C2J29l84k26L14J05l3J58P0k45k55L42K13q8J26O5m77j79N52K25k37j59j65
2564a17k88l1M53K39m04k1J24l39J86N90P4l78l24L48%OK29r0m84k4K49O3j08
2587d7N2M1l39k4K80J56j87L09j6n32rO59l0m6j45O8l43o4N02j50j76K5pm64M2
2612d45O17k9k12j01J07o1K01K66q6m88j5K41j64K91K70k91k61pK1K9O3K58j92
2635A2l60K7L55J74p2K4k8k88J50J96j06P0O8k62J1j08L05k42OO7j26k61K91L28
2659B31k54m0R2j15J6J51K08k18j6J2p8p7L08j00j27k43J0n3L34j09R4p3j60J31
2683g6K52O3o5j12j04Q6LO7j71J61j11p8j16L54j63j15KK0N3j3K03l2j36l5J43
$$ y = [-552, -351, 286, -173, -418, -118, -234, -200, 26, 414, 124, -176, -78, 70, -156, 381, 482, 132, -388, -44, -58, -64, 32, 161, -223, -449, -135, -30, -63, 95, 165, -80, -335, 7, 220, 132, 258, 323, -154, -333, 219, 444, 207, 48, -117, -405, -436, 17, 256, -148, -169, -45, -384, -198, 392, 466, 88, -236, 112, 112, 118, 347, 257, -227, -251, -2, 61, -47, 5, 46, -293, -317, -37, 119, -68, 241, 225, -307, -316, 343, 313, 267, 122, 190, -153, -217, 285, 135, -41, -16, -23, -487, -445, 172, 143, -69, -170, -63, -124, 77, 343, 257, -231, -246, -5, -169, 122, 392, 101, -160, -167, -146, -117, -54, 204, 12, -348, -321, 34, 208, 136, 160, 132, -156, -6, 190, 84, 154, 222, -40, -29, -137, 168, -74, -68, -1, -127, -388, -97, 231, -23, -63, 29, -86, -70, 81, 289, 71, 55, 67, -11, -88, 220, 120, -7, -250, -240, -293, 41, -68, 26, -47, -207, -76, 176, 239, 174, 62, -42, 44, 47, 114, -57, 104, -7, -85, -201, 153, -10, -125, -123, -103, -50, -63, 140, 108, -28, -63, 80]
2708H0l0r3K22j28K5j46j68J69m6J40j66o9JN1K99q8R1k94K2J47J16K2M1j51j03
2733e6j14J66J56Q1k28j67q0J15J01J35j31J7j74M5R8K03J34r7l01RJ72J06j15
2756G5Q3k78n0M2L5RJ24p7r6j42J42J89j6J57m02M8m0L30l1J45j60j38L9p4K24
2781A38Q1k05j12q5o8J48J28J40j14j63p8J04K54m0M3l6l02N2P6L11J01k77j91
2804i5K6j07J01K31l6k30q6LJ10J30O9Kk26J08NQ8K39j96Q3l28j2J41K7K20j72
2829I5k50j09K28K9K31j05r9j16M3r4Q3K57M8l55M1jmL12Pk16j96o4J06J39M2
2854E2J15l24J26k7J84j0k06Q6K4j14j32K16J39j1o8k15n7L03j71K65k41J35r9
2877c0M2J22L0k7j87R1jl1RK14k33K1j08M5PK75j15lk95P2J24r1L32k14q9k37
$$ y = [80, 50, -43, 179, 51, 76, -70, -238, -69, -115, 25, -141, -210, -209, -158, 141, 53, 144, -150, -128, 19, 135, 157, 198, 47, -56, -170, -4, 152, 233, 5, -162, -242, -127, -26, 109, -22, -5, -179, -134, -36, 167, 301, 204, -97, -88, 84, 190, 75, 158, -120, -170, -128, -93, -84, 40, -37, -133, -275, -133, 56, 40, 197, -205, -157, -197, 133, 102, 247, 87, -51, -12, -86, 138, 219, 14, -98, -183, -251, -103, 25, 165, 51, -112, -190, -86, 168, 128, 171, 135, -167, -115, -39, 272, 373, 96, -95, -69, -176, -75, 156, 120, -110, -196, -193, -83, 47, 116, 118, -108, 0, 5, 93, 332, 136, 219, -109, -121, 20, 47, 267, 95, -155, -264, -36, -7, 224, 119, 20, -96, -53, -147, -64, 193, 241, -114, -73, -74, -78, 234, 241, 25, -171, -235, -129, 10, 52, 167, -157, -31, -58, 126, 116, -90, -4, 20, -94, -226, -10, 129, 118, 50, -165, -222, 81, -90, 175, -66, 69, -30, 12, 134, 164, 137, -50, 41, 40, 9, 18, 232, -1, 20, -88, -43, -36, 239, 124, 121, -174, -102, 22, -69, 263, 49, -40, -277]
2903b77L58J99k91Q0j80O7j92J61M1J47r2Lk51J50K18kj08p6J25j85N9J68p2R8
2927A48j89J3J1M8k8J73j33j37L08l45J98PO0j60j9J68j89J04j4o5p8J36J62j19
2951F0r9R9N8k97j7M23j62o0k8O4l17L41J17K9m27K07k0l5K53l1j50j66O2MN7
2976c5o5L27k23j59K4J54L3K07j37k05k40K14L35ol21K27j79j09M2K15j19p7J14
2999A7K8l08K60K55k03j9J6r8JK08J08k09k80J97o7N2J63n3m8j62R8J94k43K55
3023A62Kk54k20L46J4j2K10k24n4N9LJ53j15l5j00r0K5L25m9j75o0K05l40Q1L01
3048A58J46k29K4m3op7K04Q1n03O2J93m6qK51p1m17K58n5R2k4J50Qk94J08J56
3073A18kq7j6l6k53O5K54rj63J17j21j32K62J04o6L8lj68j30K32K51j46j22M0
$$ y = [-277, 81, 280, -11, 69, -111, -44, -236, -75, -34, 113, 21, 24, -227, -77, 141, 139, 31, -45, 80, -105, -46, 122, 50, 148, -41, -28, -17, 31, 3, 176, 43, -94, 214, -131, 67, 74, 134, -26, -45, 123, -66, 38, 24, -41, -119, 17, 179, 60, -39, 60, 118, -179, -196, 227, 65, 5, -23, 41, -276, 65, 182, 211, -216, -9, -29, -64, 189, 158, 8, -158, -96, -92, -35, -100, 227, 4, -155, -131, 23, 56, 263, 126, -79, -319, -105, 230, 224, -97, 130, -49, -158, -116, 99, -20, -97, 17, 45, -263, -3, 252, 49, 30, 46, -52, -51, 157, 265, 56, -224, -27, -94, -42, 121, 68, 20, -142, -44, 150, -93, 162, 164, -90, -310, 36, 50, 38, 248, 24, -30, 29, 32, 185, 70, 35, -65, -155, -130, 195, 146, -29, -89, 116, -224, -143, 158, 304, 75, 99, 56, 50, -27, 177, 258, -245, -183, 10, -36, -44, 207, 136, -281, -23, -78, 14, -10, 140, 148, -146, -38, 118, 116, 29, 13, -23, -276, -211, 43, 34, -129, -12, -133, -265, -3, 101, 35, 73, 70, -98, -228, 4, 255, 109, -13, 27]
3097B7L2j56L8L34l01k01J34M1k07K17J54j28k42J63k9J50NJ9q9o7K30L4k38L32
3121B52l21r8l9Q1M6j5J44j03j54n5J90J32J2j74J63p2K4K5K23j51j49J57j07
3144A1j14J96O0m22j44M02J28j28j28L67k12o0JlJ21m2L9R0n8q9R1J9o8K8l39
3169b54n4K21K68l39Q2m0Q2O8M7K1j31Q7m4r9K2M6p9O0Nk7o8J26O8q1j62R3LL9
3197d0N7J29k90J58j02J19K25k28L3L4P4j86K42k88n3m0K6m2K17j11p7J77r5J39
3221G8k46N8K99m9j84M9J57j66R7j55J57l12J19N4J89j19r9N2l8j62L78j56M6
3244D7j11J09N0m4J85L8k14K1k04J21J61o9k1j43J21l27Q3K40p0m6l9N8J54K8
3268A28n8J01j08j79NK70m0Ko2j69J66k58J48rM1k51J34N8m4K3J56j00J1j36J44
$$ y = [27, 59, -97, -59, 275, -26, -227, -93, -52, -259, -42, 112, -16, -258, -95, -124, 26, 31, 50, -39, -106, 124, 158, -80, 252, -69, -167, -206, -125, -79, -94, 50, -53, -207, -262, -72, 60, 72, -102, 61, -11, 13, 38, 261, 110, -39, 118, 11, -103, 93, 153, -269, -413, -11, 117, -11, -139, 228, 16, -44, -43, -46, 75, 33, 72, 162, 104, 15, 106, 125, 57, 85, -254, -308, -87, 181, -158, -76, -116, -34, 34, 81, 102, -29, 58, 14, -85, -63, -17, -96, -36, -31, -58, -126, 0, 68, -13, -175, -82, -79, -40, 17, 146, -144, 14, -88, 31, 256, 28, 61, 95, 169, -17, 225, -63, -116, -156, -130, -172, 45, -66, -143, 34, -61, 78, -168, -110, 189, 140, -44, 5, 162, -4, 93, -62, 95, -217, -98, -44, 145, 26, -73, -21, -59, -221, 157, 1, 47, -64, 45, 95, 51, 236, 274, 60, 81, -123, -2, 159, 90, 69, -74, 47, -280, -197, 43, -27, -73, -112, -54, 100, 128, 70, 171, 63, -116, -111, 159, 119, 121, 59, -110, 56, -202, -54, -63, -22, -273, -139, -81, -125, -102, 54, -46, -35, -171, -27]
3293b7R6K8n0r6J68k53O3Q4K1p1O0q3o7J17J2J32k8l5q1j06J71Q1p7q0J51o5j42
3320g7J04J7l3k61K4J17K78r2j83R6k28J47J19M1J1j6k0k7j19J54J00m2j01j03
3344i4M2L1J18k89P3J20l12J22Q1J96j40J15j20J06r9M7J49k17M7N5M1n7p0j5
3368g0j87K92j64J50Ok02J48j30N4J14J08J10j71K6N4j41j5J97q1J8j96k6J5O2
3392b9Jql3l1l1J66P5P8j84K5L0l3m9J79J27k08k90K01J10n5J0q7j23R2J06nn0
3419a6J77j74j26J24l8K02k44o2K07n1j16J00Q0k78J23J52j48k5K05n7K5j7j31
3442h8K32p1k4M5q7m1m5P8L9J58l55M6J66j25Q7p4K4j53o6L39m4k18K83O2r6j41
3468f9J48R1j66l5o4N8m1J55o8r2J33j73K1K8L46l05j03K1R9K1n3J32j59O3M5
$$ y = [-27, 69, 97, 47, -49, 119, -134, -71, 13, 34, -37, 23, -60, -127, -10, 2, 134, 106, 71, -10, -116, 55, 136, 59, -21, 130, 65, -77, 27, 44, 11, -250, -226, -109, 169, 77, -106, -10, -238, -91, 28, 69, 80, 64, 44, 17, -102, 52, 152, 110, 9, -94, -52, -21, 97, -192, -119, 1, -311, -189, -108, 88, -52, 63, -57, 49, -50, -3, 146, -71, -24, 31, 72, 15, -55, -70, -257, 35, -129, 21, 27, -175, -27, -157, -103, 11, 119, 229, 58, 84, 138, -3, -18, 179, 98, 116, -80, -106, -91, -29, -28, -36, -69, -100, -131, 35, 110, 188, 4, 29, 59, 26, -23, 156, 283, 75, -215, -14, 96, 41, 51, -36, -159, -67, 39, 34, -16, 161, -13, -139, -15, -53, 149, -95, -157, 50, -1, -117, -17, 63, -215, -92, 60, -88, -113, 92, 35, 60, 43, -88, 144, 73, 49, 94, 7, -34, -79, -1, 38, 196, -159, -113, 53, -72, 15, -59, -35, -188, -254, 85, 41, -177, 106, 168, 72, -69, 79, 170, 4, -31, -95, -37, -78, 77, 9, -83, 50, -123, -102, -74, 272, -33, -136, -115, -16, 5, -48, 84, -75, -12, 33]
3493C3j48K39j26K1J7O6k99P4J65j17rQj42J56K05o5j00p6K20k00p3L02K9k82
3517a02M2J73l19K12Q3j14q1J86k03N1J78k7k1j40J16j21J47j50K33m3j86j14
3539b00L25k11J86j12K3k09K9K24j0k37L33j79j34J61K69k9q2J5r5j94N6L17k20
3562B6j22r2L64k82K8J60j25k6p6J91j31L03j7k93N4J13j64J05l6J83j88j76K69
3585F8l3j22K29l3j39j24L07k25j1J33kj05k5J80j34J42m9J12k15M8p6K05k09
3608g8Q8R5l57J32L06j67J01j75Mo6K9R8K66l05j43J88k6R5L3O7k17R0q4OjJ02
3634H1J46l42J05j37K48k4j13l0LQ3J35j69P9k1r8J27j51N7P1J4j02J42j08j03
3658a07K52r5J3n0j15L0J34l3j06O5q0O9n9J38P0j85l7K99j70J03k05K6J07k17
$$ y = [33, -115, 124, -2, 19, 36, 102, -197, -123, 42, -75, -84, -76, -218, -62, 143, 78, -22, -98, 122, -78, -151, 151, 180, -102, -60, 113, -206, 6, 89, -25, -106, 80, -123, -72, 106, 79, 58, -82, 34, -87, 60, -90, 143, 100, -86, -200, 125, -86, 100, -12, 11, -198, -169, 55, 45, -192, 141, -38, -172, -11, 258, 229, 147, 162, 67, -127, -71, 246, 26, -96, -188, 176, -106, -78, 82, -43, -69, -145, 46, -85, 218, 201, -92, -38, 75, -89, 16, -20, 163, -25, -201, 68, 35, -87, 142, 109, -30, -154, 153, -72, -83, 50, 48, -57, -82, 98, -36, 106, 57, 169, -46, 2, -74, 131, -78, 10, 105, -252, -120, 186, 19, 120, -55, -51, -117, -88, 10, 276, -29, -172, 16, -10, 85, 118, 185, -32, 58, -26, -20, -21, 81, 227, -115, -10, -147, 101, 77, -36, -66, -63, 20, 155, -14, 65, 44, -54, 73, -78, -21, 50, 64, -38, 104, -4, -107, 145, 50, 63, 13, -102, -72, 62, 29, -77, -12, -92, -23, -82, 56, 126, -59, -96, 203, 33, 136, -69, -43, 64, -153]
3682a53L3K49j16Nl3N0k06J79r5P2k4J88j09j80J77nR5j00l6J7o9kJ86lj95k24
3708b99K88j5j43J49j23N2P3J40k84L82j87k8J4K7PK8j78J9KN5j8K0J78j23J43
3733A79l03L5J07K1R2p3o9j08J40o8J31k13p7J82r0k3K42j26J18l1Lj59J17n5
3757b8k0J93j91LO4pO9j34O7R0m1l7o6J49k56O2k0L9NK00l2j33m9P7P3j12k9Q1
3785A7j65P2J80j29P1m7k4m6J4K97k81J5M3j19M6L1L9J69k22M5q6K71j15J5q4
3810GL0q3J72n4m4J72j87k6j69J13K92ol36L3q0L3M0O3J52j95j1O1L4o4J40m0
3836D7j80R8q5J1R2J65k32k7J06m3q5J94N0l07J6J24KJ7P8P6k39o1K38J8m7Ok6
3863Fj74J86N1r2k5R4m3r3J37N6p3Q0k23N4L0l6N2J04j69l9J67l1j31K24p9j27
$$ y = [-153, -120, 129, 13, 18, -15, 35, -171, 8, -87, -15, -39, 149, 40, -140, 37, 32, 127, 27, -9, 8, -61, -63, 123, 120, -75, -299, -11, -26, -169, -20, -143, -91, -18, 122, -162, 220, 33, 5, 19, 46, 53, 81, -97, -78, -76, -21, -39, -19, 159, 36, 179, -124, -89, 18, 39, 131, 58, -11, -119, 21, -47, 84, -129, -206, -24, -114, -137, 105, -21, 97, 66, 69, -90, 27, -28, -48, 145, -46, -43, 21, 14, 83, -51, 16, 106, 65, 28, -38, 111, -145, -83, -103, -64, -59, 141, 109, -24, -73, 4, 77, -35, -64, 17, -148, -76, 104, -25, 46, -1, -25, -71, -57, 240, -41, -26, 17, -102, -56, -25, 14, 183, -39, 6, -80, 191, 76, 91, 7, 37, -46, 126, 72, 28, 200, 13, -13, -182, -69, 223, 217, -119, -86, -166, -133, -93, -30, 122, -73, -84, -23, 11, -53, 87, 47, -133, -35, -120, -109, -17, 148, -84, -111, -5, -48, -133, 61, 111, -196, -180, -56, -54, -37, 41, 117, -122, -183, 55, 73, 26, 32, 6, -168, 18, 69, -23, -48, 46, 3, -90, 47, 103, 30, 110, -113, -59, -29, -65, -13, 91, -78, -117, 50, 19, -112, 112, 33, -94]
3889i4M1L7j5J0J06j10J11n7J1O6j05M4n7n9J35r4J16k70K87p3n7m3M6O4n9K3
3915Dp3J7J64n6M9r9jj81K87k2o0o7K5rj51J50M4J26j52K5o2J57rm1j0o2O6j09
3943e0J33j93J45l1O7j7j30J24O1p6j48J23k8o3L9o7J19k4j7R4l3R0j29J32o8
3968E3k62J70P8p7j32K17k9J4m0o6L5N4o3J43j89Q0J12jj23J64j61J02m6j03K59
3993A89l15L8J72Q5l07n5Q4J64q3lO9j97J04K13j87J50j35J85k13Q6J77m27K26
4016B0r9J53o0k11J72n4J63r8J06l52J70J90JQ3k07N4o6o1J69k03J95J23j98L7
4040B7K01k75J00j08MM9rJ11j99J19p1J12K6p4R0j54o4J66m1m9J00j95Q3R1j88
4065a48J41q0p3K03j14p2J02J41Q0j58MP0O3k21K25j35j97K58j91l9Q4RP6m7j8
$$ y = [-94, -53, -16, -31, -21, 85, -25, 86, 29, 40, 106, 1, 45, -12, -71, 64, -30, 86, -184, 103, 30, -27, -70, -24, 40, -19, 4, -69, -52, 112, 56, 105, 6, 5, -176, 111, 89, 29, -38, -13, -22, -173, -23, 21, 147, -5, 20, -42, 115, 106, 65, 55, -7, 59, -50, 83, -110, 35, 4, 71, 54, -76, 48, 109, 33, -115, 8, -20, -83, -44, -111, 8, -16, -33, 61, 28, 118, -11, 121, 53, -209, -39, 39, -38, -170, 47, 18, 32, -8, -74, -39, 15, -48, 95, -94, -14, 98, 97, -26, 138, -23, 79, 33, -70, 189, -126, -88, 84, 169, -138, -193, -109, 55, -28, -31, 38, -159, -55, 158, -29, 121, -14, 171, -42, 44, 221, -206, 20, -79, 74, 14, -197, -25, -79, 84, -14, 92, -260, -90, 100, 101, 184, -23, 31, -35, -96, 73, -130, 65, 188, -10, 27, 228, -47, 53, -55, -51, -2, -11, 100, -99, 20, -51, 61, 87, 13, 103, -51, -115, 51, 10, -39, 61, -134, -51, 40, -148, -7, -87, -160, 43, -71, -143, -41, 100, 180, 22, 26, 96, 159, -62, 163, 28, -169, 89, -102, -141, -57, -48, 28, -19, -37]
4090c7J16j15K8K8j36K34j70Kj8J70r7J41j98L6J48j13L9k8Q9q9j40K06j30N0
4114A6MK5k55K41j7p6K10j79J48j44j09R8J13j30p2rK4Q3k9P5jO3L2n4j16J02
4140D3Q3k08J4R7q3J24nj50L0K5P9j19K84j17l55K24k3J00n2Q6L3j7k30K48j06
4165ERk06L49K2j80k9J54j60l1O3m5j36J44k3p4J9n5K46Nj30L3j4Q7O1p5L9j69
4192i1J39j49L4k9L15k12J2k4JmN6J19n7n2j99J05K2L5Qj02m2K72j44j29J38k4
4218bN5j53m7J26M8j45J21J39k08R6K3pJ1P1l2k82J31R5J6K9J0j84O7Nj40Q7j20
4245a90M08j51m9o5O6rj43K21k04Q1mK5R0j00j25J99k05O8m9J99j65K67j37p5
4269d7Q3l4J9l2O2q0J74r7P5j04Oj74J32J24j84j75J97P1MJ69q0j21K8pK43k66
$$ y = [-37, 79, -36, -8, 20, -116, 118, -52, -50, -68, 102, 5, 146, -52, -16, 132, 19, 58, 30, 119, 30, -110, 96, -34, 16, 20, 45, -210, 31, 14, -62, 148, -31, 117, -27, -136, -38, 75, -55, -127, -136, -112, -29, -58, 17, 16, 79, 111, 57, -59, 43, 126, -82, -68, 29, -54, 70, 65, -85, -55, -30, 49, -70, 214, 97, -258, -34, -57, 43, -9, 77, 110, 93, -137, 111, 5, 14, -192, 157, 179, -1, -30, 124, -36, -67, -4, -49, -185, -41, -64, -138, -119, -174, 72, 77, -53, -20, -34, 53, 114, 39, 78, -91, 48, -101, -67, -96, 219, 7, 19, -5, -4, -8, 48, 167, 110, 58, -141, -36, -14, 21, 29, -73, -115, 157, 13, -116, 22, -2, 53, -100, -147, -21, 27, -118, 3, 142, -66, 30, 53, 46, 57, 128, 96, -186, -55, 40, 56, 85, 95, -89, -22, -17, -157, -70, -190, 218, 67, 18, -47, 19, 10, -133, 88, -116, -35, -39, -14, 76, -24, -149, 50, -155, -87, -136, 63, -102, 165, 28, -47, 36, 2, 21, -11, 51, -29, 145, 48, 123, 19, 25, -149, -17, 107, -77, -252, -55, 16, 20, 189, 109, -12, 16, 9, 252, -14]
4295a4j8j98J89J47k06J30K2o8M3j02Q9l7J70m2k30K28k20J75j58J07J8RQ3j61
4319d4J60j36J40q7j1q2M5L2p2J3J3j2q9N1k9R6J84k10m5J61n9J97k06q1J14j57
4345a14J24j1L5Qk14J33K4J35m5j10l2K06j73KJ37j40n3J74k61K36Mq8Rr7J18
4370GM1l5o3J11J3L1j01pM4L1j43j39K13j64J78J9P9j47K3K43k98n4J52N0k37
4395a53R3j19K6L11kj98J6J85k52N7k7J58k09M3O6L7J25k19N1J60l51J22M6J32
4419I8j65L4J6Q7n8l8k9P2nK0q9Q0Nm7J07j35OR7M5M2p0k55K18j06jP6RJ75k49
4448f0J2o7J02P5p7pJ08j98R6lL4n7K6J69j44K1n0L7p1J7L0J11q3p4O3k3qP9K5
4477H3L2k67J4J97j02P1j09M2K01O6l44J03o9m8O8J19k2j56K02N2n6k44J33O1
$$ y = [-14, -32, -230, -41, 106, -100, 30, 52, -16, 27, -75, 14, -23, 147, 105, -125, 103, -117, 58, -100, 7, 25, 34, 117, -44, 116, -20, 120, 33, 22, -60, -15, 17, -55, -42, -29, -41, -130, -79, -108, -12, 172, -38, -83, 78, 19, 216, 10, -71, 43, -114, 10, -1, 34, 42, -172, -39, -15, 120, 75, -35, -67, 139, -34, -32, 105, -35, -88, 86, -175, 61, 65, -23, -14, -111, 7, 48, 13, -50, 61, 74, 105, 4, -3, 41, 72, -71, -210, 3, -161, 17, 36, 115, -32, -9, 234, -64, -118, 34, 84, -153, -60, -179, -153, 158, 156, -42, -26, 159, -93, -36, -63, 95, -114, -71, -5, 32, 157, -62, -11, 149, -202, -80, -34, 98, -67, -33, -17, 70, 12, -26, -55, 17, 12, 32, -57, 23, 28, -19, 88, -47, -41, 56, 101, 143, 73, -182, 36, -70, -71, 5, 14, 189, -60, -48, -115, -13, 62, -15, -22, 86, -112, -16, -19, 15, -42, -16, 153, 9, 30, -20, 17, -54, -37, -7, 104, 21, -53, 10, -13, -21, 58, 83, 115, -152, -138, 59, -43, 28, -81, -39, 162, 228, -116, -13, -82, -130, -62, 57, 35, -121, 81, 133, 77, -167, -34, 27]
4501B7Q4j33n6J72j41O9K3k9J19p2j04J67k69K30m5Q4k81K63J19j80N4Qk21m6
4525a58L05o3r1j08nJ56O5j97k1K26j86K2K3J60j27n2Q6n1J96l52K82j46J22j54
4549f8p2K00k35K12p1nqJ86j47J02m0Pn5O6n6k8J55r3Q3rl19J18Q9Nj06J27O2
4576A00k05K02j97K76j99j37J39k4O4p6R3l3K15k60J69j26j04J78k94K38K3n2
4598a0k51J83N7J12j31q7J52j76L02r4k09J30J07k18J55O2r3j06Q6O1j20P7J1
4621@JK0J49j16N4j40L0j20L9q7K64N5O3j64j3mo8J78q7j03Q7j21l1R8Q3n6K63
4648B74k80L5m9L9j00Q4oJ16j81R5K6l6k04J66L7r0J37L5j48L5K3j12N4K3qO3
4674B8oJ01j58J47k0k50K48q8J42j07n0L6k9L3n7R6o2Q5j80J25m0j2J13k12J06
$$ y = [27, 111, -22, -78, 94, -47, 22, 45, 16, 135, 63, -41, 126, -143, 87, 42, 126, -155, 108, 227, 47, 101, 109, -112, -158, 147, 84, -7, -115, -120, 36, 101, -96, -117, 109, -77, -55, -32, 128, 1, -51, 35, -16, 180, -172, 110, -36, 86, -68, -140, 60, -175, 37, -34, -39, -47, 139, -8, 94, 54, 61, 6, 72, 16, -12, 143, 50, 133, 124, -195, -77, 12, 17, -89, 38, 100, -105, 97, -100, 176, -23, -160, -21, -45, 19, -57, 36, 3, 218, -42, 127, 1, -103, 75, -219, 19, 42, -10, -261, -78, -21, 91, -40, -127, 25, -151, 151, 57, -152, -22, 85, -133, 22, 84, -9, -115, -29, 32, -88, -11, 0, 1, 21, 170, 54, 108, -32, -2, -122, -83, -170, 94, 149, 212, 48, 35, 31, -37, 141, 54, -49, 38, -83, -114, -16, 67, 11, 274, -6, 29, -20, 19, -81, 3, -3, 113, -68, 27, 53, 17, -187, -21, 16, -74, 63, 98, -50, -15, 8, -104, -50, -27, -35, 28, 22, 123, -35, 112, 92, -158, 90, 2, 144, 37, -13, 23, -6, 27, -30, 66, 4, 89, -91, 34, -6, -18, 95, -117, -11]
4699a1N3n0j2J97o5j86Q3MJ20k07J37jm3L5p6J26K6k10J40k05N5J09Jn5J01j72
4725a06J15J18j06J59k94K24p5J5j56J97k13J64o7L2J8L1rj74O1R7N8n5n9k3K18
4750A70k18M1K2r1l8R5N0j50J00J05k21J78J24j25j0j50m4J79J06j53M6k57R5
4773a46L39k15N2j47J86r1Q0l6l4J42j72R2M7j16P0k5l6j45K10r5M6P7q4J06j46
4798d1o5J78j54k4R2Jp4o6Q3Q9n1l7K53j00j11L7M2K0q3Q3l5j61J76J10k15M5
4824ho5R9l8Q0j30kQ4j8M2M4Q7j37L0k8J09j24r1j7K00N2j21l4ro8J06q0J34n4
4852D3J36j00p6j04l0l5K93j05m7N0j56q9J63n6J79j42J7K3J40j35j75K36P7k39
4876a32J50L2j01J05op5l3L7K7N1Rj43NJ34j73QJ20j04q2J25K05k35QJ96M3j16
$$ y = [-11, 42, -8, -20, 177, 112, -74, 9, 13, 133, -74, 63, 62, 19, 54, -22, 104, 130, -80, 60, -145, -90, 19, 20, -35, 66, -106, 9, 127, 21, 180, -114, 110, 35, 50, -106, 91, -122, 42, -25, 7, 25, 56, 47, -127, -66, 31, 89, 34, -25, -48, 170, -48, -7, 15, -76, -114, -19, 31, -119, -19, 86, -135, 43, 167, 42, 32, -118, -162, 17, 123, -30, 16, -241, -146, 193, -22, 30, -117, 69, -22, 58, 22, -12, 130, -42, 50, 97, -19, 51, 26, -10, -155, 55, -40, 6, 83, -1, 105, -41, -106, 72, -82, -106, -14, -13, -87, -153, -70, 19, -32, -69, 184, 84, -27, 10, 52, 72, -11, 72, 37, -124, 52, 162, -53, -8, -73, 26, -12, 68, -62, -64, 20, 2, 44, 88, 175, 38, 68, 40, 149, 25, -66, -83, 117, 169, 48, 14, 5, -63, 43, -37, 97, 43, 179, 79, 3, -101, -131, -166, 127, 22, -25, 25, -131, -220, -57, -113, 66, -76, -59, -36, 104, -31, -206, 30, 107, -132, 18, 50, -51, 54, 48, -27, -60, -23, 4, 55, 64, -79, -74, 60, -113, -105, 15, -89, -171, -46, 159, -76, -68, 128, 171, 55]
4902E5l6N3R9k02l9j04o6J02K41p7n5j0J7K59l05J70j18l8P0o6J30K5j17M4j30
4927i8P5j16J01K6J2Lk37K71j5K30k84O3J6n1j54L14k20r1M8P6K22j75Lq1J29
4952F7p0j39K81m4j2p0j45P7N8j5j6O5O6%k25L9J07j51J39J04q3J3j55n2J66j12
4978a07K74j87j21J57p3%Q2k2o8J53j68J3R1J00j40kk1J38j13O4l1l9K99k86m5
5003e2K0J42j22j27J92j22J56j4j08P8o5O8o2R5k13Q2m8j5K33p2n1Q7r8j3M4j22
5029a07l5L91k30J7M4J35j14j12QL5rO4j18N2j19J28l6o3R3m9L4N6q7l0J2J06
5055F6j13l2J4J07k5m3N7n4j14J30M0k00J52m9M3Q2j06l0J5r8J18K2p0J8N8O6
5081E4M2j70j14R5J66j76m2J24P9J00r4j07L1O9%j76J39J8J7n1r6j37J27K8k3
$$ y = [55, 19, 72, 171, -31, -70, -174, -240, -138, 103, 26, -29, -39, -22, 237, -68, 102, -16, -54, 16, -50, 80, 105, -12, 32, -98, -23, -139, -38, -12, 0, 3, -234, 37, 22, 252, -32, 31, 47, -4, -158, 156, -64, -155, -107, -31, 191, 16, 19, -62, 67, -3, -142, 139, 95, 83, 13, -132, -55, 3, -12, -28, 37, 103, 103, -122, -83, 24, -127, 12, 116, 33, 46, -109, -161, 5, -107, 167, -20, -141, 16, -57, -57, 25, 3, -65, 88, -80, -67, 24, 124, -16, -18, -39, 99, -14, 50, 19, -20, 279, -7, -52, -32, 110, -12, -139, 53, -69, 87, 73, -35, 43, -22, 46, -16, 79, -134, -52, -100, -115, 118, 46, -5, 82, -16, -29, 15, -107, -142, 249, 19, 36, 80, 215, 101, -11, -3, 32, 23, 87, -31, 21, -98, 30, -6, -69, 24, -25, 9, 65, -22, -52, -40, 66, -47, -79, -65, 42, 17, -26, 31, -23, -137, -7, 33, -167, -15, -64, -21, 61, -45, -75, -60, -158, -40, -18, -88, -70, -12, 54, 96, -74, -188, -93, 73, -103, -145, -21, 58, 158, 64, -43, -12, 57, 57, -119, 20, 38, 55, 4, -92, -229, -102, -74, -97]
5106i7J27P3o1L2o4j23Q9K9j5J76j55j65K62M4j81P9q1l5J43j15J90k03J04O7
5130A20j30r2K7K67j83m4K6r8K41j18j9k63K59o4J3R6N2J12j98O3j86j0J86k08
5154a51K36k11J68N5k4J80o9k35j8K21jj52j6q1J56j02J22l4pn1J40j20N7qj17
5179f2O6j55K26j95K13j78K47k27J00j36M6J60j00j20R8J83k68P3j85K67J5N6
5201A24l4J4j13k5No1K96j0l8k28J80j24k8M8m1m3J34j8l06K16M7Jm0J24k1j03
5227d4J7N5r2J1m2M8Q1o6j33K41j39j04J36o8J63j17Q6J03l02L19j05m3l3J68
5251A40L2k32K86k47J20j89J59N9k26Q3m1J01p8K5K9l7J30j61J43j2n2k02J57
5274a3J64k32K86j91n7K35j18m6n5K1K9j9N9N1J8j46j14J41K1QJ30j49L0k58L71
$$ y = [-97, 30, 103, 42, 74, 10, -113, -24, 5, -10, 166, 11, -154, 108, 152, -29, 50, -31, -66, 77, -38, 152, -51, 53, 120, -10, -102, -75, 192, 9, -35, -9, -107, 134, 16, -3, -266, -7, -71, -58, 38, 90, 202, 4, 67, -119, -129, 57, -151, 85, -126, 42, 97, 73, 253, 184, -51, -69, 152, 151, -1, -17, -98, 58, -44, 78, 44, 37, -14, 126, 6, 63, 55, -62, 4, -151, 75, -120, 93, -85, 162, -65, 35, -101, -55, 105, 5, -115, -17, 166, -102, -29, -214, 53, 68, 124, 90, 104, -9, -34, -29, -90, 206, 196, 158, -70, 110, -14, -42, 6, -35, -78, 56, 38, -268, -52, -5, -4, -44, 80, 59, -44, -27, 28, -64, -53, -95, -47, 34, -32, -165, 76, -63, -167, -31, -99, 64, -53, 33, 136, -166, 153, 48, 5, -28, 140, 172, -60, 226, -21, 99, -90, 69, 128, -98, -15, -56, 45, -33, -8, 21, -16, 114, -47, 96, 84, 32, -170, -13, 151, -81, 205, 14, -43, 192, 74, 28, -27, -6, 23, 4, 63, 114, 132, -14, -128, 13, 34, 42, 172, 23, 53, -205, 166]
5299A66j79p5L9J53j05N7j31N9j6Pj26M7R2P5j52J23j4J53m3m9j13J20j2j56j06
5324a86K22Q0j56M1m8J58q9o3J79j32J07p1p4L3O0Jm4K2N8n5m5j8J93k27kn3K48
5351A39n2k68K33q3k3J29k60K92k17J71nk51O8Q2J34k00Q4J0J02K6j48l3O6J18
5375A14j65R7j80J66m3m2K2J1p2K32r0k48K68j61J88j28P7j49L5O6L8l4Oj8J83
5400A73k83j9J86p3J6J55k14ML6k1j4k8L4J03j14n6J49k7N3q1r9P4lp8J13l7m6
5427i7k1J1J29O9k3k94K62j3m0p2j2J28J61k20j17O1K5L9J82k10J60m0J2N9n6
5452H3j15J36l4J99k50R0j6q3l6L8M0j1j54J59j1j36J87n8l3jp4O9K8M7O3j90
5478f3J33j2j01K7k8J14o2J51l73J11K13o9r3N4l7J59j29n1M3J00k08J68l9Q4
$$ y = [166, -13, -88, -49, 104, -1, 56, -75, -16, -32, -25, -151, -104, -12, 63, -89, 34, 20, 173, 130, 81, -32, 88, 76, -80, -186, 36, 116, -40, 1, -47, 111, 22, -41, 138, 6, 113, 42, -32, 1, 61, 62, 18, 40, 98, 43, -2, -20, 173, -54, -56, -109, 139, 87, -181, 52, -31, -54, 75, -185, 107, -110, 61, 56, -195, -127, -45, 89, -111, -27, -17, 85, 111, -37, -70, -4, 114, -51, 46, -134, 32, -11, -53, -31, -20, -92, 140, 50, -198, 70, -91, 97, -31, 46, -103, -68, -2, 36, 2, 8, -10, 173, -110, -129, 57, -16, 0, 155, -59, -55, -19, -40, -54, -82, -48, 55, -59, -115, 34, 7, 60, -21, -120, -46, -49, -127, -14, -51, -97, -118, -107, 22, 91, 68, -226, 36, 23, -17, -89, -101, 27, 188, -32, -149, -88, -63, -24, 158, -52, 108, 68, 80, 139, 83, -32, 104, 70, 269, 19, 109, 93, 10, -26, 12, 52, 41, -113, 46, 35, -101, 86, 28, -5, -6, -80, -11, 17, 64, 127, -63, 70, 58, -43, -16, -44, 70, 8, 159, -214, -103, 110, 41, -52, 2, -35, 124, -5, -56, -13, 87, -121, 47, 8, 92]
5502I2q8J0%R2J6j74p6O4r1K70j51l1J51q6m0Pm1k2J12j38J90j22O5Nj02J74J05
5529A91l14J32J06k20j57K37K4o0J79j3j26n9R1l3k7OqO7k42L81p3m4Qj16M8J02
5555H0L7o3m3j71K85j30J2o8q9K23j31J74k4q2J33j16J0N9L1j63L7l6JK0L4n1
5581c1J14j05P9m5J36j92o0J48QJ4O8k8o5Rm7qJ07j55N6lj64R0R8n0n5J12J0J11
5609A52p3j07J6J01o9k8PJ40k12L6K7N4oo8j0P0L4k65J52K5L1J8p3R3J9j13K6
5636b3J6M1L4Lp2r6J88k34K02j29p7J21N8J3p3o8J08K6O9m7p2K1r3J21Q5j99K0
5663e7N3L4J73j46j41J46o2K4r7J59q1J62j60j59L20k44P6J3J8k26J79J1jM0j42
5688a08J80r9n1N7K6L3J00j41N3j41J70q9J36j3K1j11p1L8R9J04k90J05J69j91
$$ y = [92, 4, 14, 14, 106, 122, -52, -128, -64, -155, 115, -36, -67, 84, -2, -42, -35, -76, -98, 14, -124, 66, -56, 9, 14, -88, 86, 191, -123, 9, 115, -105, -262, -25, -1, -61, 118, 105, -21, -80, 11, -22, -49, -43, -51, 16, -226, 155, 82, 38, 46, -70, -22, 80, 117, 54, 11, -160, 125, -5, 7, -61, -150, 73, -58, 116, 92, 10, 143, 27, 37, 96, 127, -36, 1, -35, -34, -14, 20, -31, 83, -22, 57, 12, 148, -44, -104, 44, 52, 66, 134, 106, 41, 50, 3, -5, 102, -53, 3, 0, -164, -74, 24, -26, -81, 31, 41, 152, 79, -28, -12, 89, 20, -8, -1, 139, -73, -37, -10, 44, 38, -30, -40, 30, 64, -201, -49, -24, 7, 25, -48, 45, 64, -49, -23, -7, 34, 68, 71, -1, -97, 91, -143, 59, -70, -147, -26, 32, 45, -28, -96, 12, 38, 107, 60, -12, 9, -84, 37, 122, -77, -57, -4, 30, 203, 57, -84, 62, 0, 24, -73, 86, 5, 167, 7, -152, 168, -76, 0, 13, 31, -195, -16, -5, -6, 34, -108, 72, -27, -78, -21, 5, 38, 138, -3, 50, -91, 79, -10, 126, 113, 134, 23, -48, -10, 89, 193, -97, 8, 177, -14]
5712a4M7n4LP0q5J0q1J27J1M6j47n7J46lk6M1p7J61K4j44rk4R1k76J14oK83k02
5740c1pO4j32L6J61lj83K27j52Pk1N4l8k5J73k48K01r2J03k25r6L42k1o4j1M5
5766F4n8PO6J2l39K00QJ75j86O2M8m4k21K80j46Q8J61q8j93K9J44r4l5J28p7N7
5792D8j33k5p1K00K03k01J24j33J02r7R4j81n4o7J58j11J01P6m1Rj8M0J39j70
5816hP6n5J84k06OQ5k45R0O1k6J53j24O3j05J2l2J1J28l3N8k40J64j02J97j05
5841GO0p2J4J81j48J1j62R0R5j61M2P2N1j35j1K29k54j05J88l0rQ7n8J5j34J45
5867HL3J06j41O9K1m6r2r9J68r7J03o4Q0o5K1K3k7ol9R3K0M7j11pJ29j25R1k1
5895G2r8J7j1l2Q7j28M1p1P5J3O6j67j00L49k6j6L4r9J40j98r6J89P0k7j54K84
$$ y = [-14, 33, -21, -18, 52, -33, -23, -104, 23, 34, 80, -67, -124, 22, 19, -7, 34, -43, 118, 142, -2, -11, -35, 56, -220, -106, -112, 171, -31, -38, 26, -106, -70, 91, 88, -95, 132, -20, -13, -34, 20, -18, -43, 130, -118, 83, -9, 94, -131, -227, 115, 94, 30, 19, 64, 6, 13, 79, 91, -248, -48, -40, 135, -51, 11, 59, 15, -206, 74, -72, 16, 177, 89, -104, -75, 69, -25, -60, 68, -9, 48, -85, -110, -181, 19, 222, 21, 145, 12, 114, 17, 111, -70, -124, -191, -33, -144, -43, 33, -8, 1, -17, 23, 162, -8, 68, 13, 197, -9, -3, 82, -163, -73, -12, -38, 115, -9, 54, -51, -39, -71, -60, 68, 35, 93, -147, 17, -85, 112, 7, 67, -5, 9, 190, 42, 53, -109, -19, 76, -85, -43, 29, 80, -55, -66, 163, -91, -196, -8, -38, -47, 40, -18, -3, -137, 8, 41, 147, 6, 75, 96, 50, -42, -141, 27, -70, 33, -31, 49, -16, 5, 28, 1, -5, -44, 49, 69, 116, 5, -2, 127, 2, 93, 72, -26, -9, -20, -52, 35, -93, -52, -123, -48, -35, 31, -136, -236, 113, 87, 71, 105, 6, 146, -52, -148, 41, 111, 84, -70, 214]
5921B14j66j3k5J37k57k8M7J32R3j2j59r8K10Q9q8p9M7j36K8J21l5K2mj17J55
5946G8J4k36J98j00N7O8j5r3KL7J82k27M3M5o3Q1j31J17Q1k46M6N5K5o8O6J4l6
5973fm4J11K5j37MJ2L3K0J42j18n0L8J05k26QO4N1J7o9O4j38J49N3L7j26mMj43
6001a24P5R8O5j11J81k23K9J67j62MJ3l0j0J31j00Q1l5q9Pn7J42N1j83%n7J44
6027GK11k97J18R9k43J25Rn3n0N4q2m2K5O2n5L9J24r2J02j62J41q4O1k2J87k02
6053b0J37j41J50n7j08l8J27K6K4J4m1j33K81k21J8J8n7O5j37J64r6N2o5J67k53
6078a24J40n9J36k6j56M4M8j19l7J93n8K8OP3j18R4k4K8r2q1pP8J34p9jpk3M9
6106D0j8l2J0l7O7Q6l23NK83o9L7q4M7O9k08J40M0j78l6K7R5q6K01j1L1k8K5k18
$$ y = [214, 48, 35, 10, 147, -110, -138, -91, 41, 134, 122, -37, -135, 75, 164, 76, -3, 44, -92, -64, 57, 22, 44, 40, -77, 78, 92, -144, 54, -46, 11, 79, 64, -29, -27, 10, 192, -35, 8, 53, -10, 71, -60, 57, 138, -108, -62, -7, 18, -50, 16, 30, -6, -50, 61, 86, -51, -47, -35, -2, 18, 160, 42, -8, 30, 135, -91, -83, -19, 32, 49, -20, 44, -94, 55, 108, 145, 19, 15, 19, -124, -49, 49, 114, 3, 184, -39, -10, 157, -5, -1, 12, -18, -28, 103, 3, 84, 49, -40, -33, -90, 52, 103, -80, -80, -137, 7, 218, -79, 39, 138, -105, 20, 29, -24, -74, -20, -102, -144, -119, -57, -112, -73, 51, -41, 61, -101, 40, -44, 17, -5, 182, -20, 117, -24, 126, 69, -39, -77, 50, 76, 100, 114, 73, -60, 221, 0, 18, 36, -21, 44, -93, 71, -25, 27, -38, 129, -124, 16, -43, 93, 67, -89, -45, 3, -116, -153, 40, -18, 10, 16, 89, -29, 65, 41, 69, -23, -104, -111, -33, 101, 22, 21, 14, -9, 40, 22, -10, 0, -37, 30, 116, -207, -202, 81, 12, 49, -35, 12, 81, -127, 13, 53, -125, -161, -134, -39, -125, 76, 65, 96, 68, 93, -125]
6134a25J15R4n8p0MJ40j22jm6J22o9J8O5Mj95K62j04n3l0jL7N5J39j12j24qN5
6161hJ84k44r4J35Q4j20K3k0J05k00K03ok20J46M3P9m2k07K15o5K6L9K2j06L0
6186Bp7J39k04J03Q3j48k3Q8m2J44oQM0n7Mj6o8R8Lk4l3p5J73j25l0N0J33n7l5
6215D8Kj8j02Q1J61o4j6j06l8J31Mj5j64M2J31n7O3p2j15n1J42R0m7Rq4J57j82
6242g0P5J58k14J13p7K13k11j39J64J39j29oN2p6k19L17r1j13P3M0L0R2j34J05
6266I2M4j98J35j4k6o8J22N5j30P4n6m6j20m1J60n4J48j12L9qP4K3j82J22mj01
6292g2J94n9q4N2p3K1J31j83J97P4j30j40L1n3J46q8K1l3L12j04j78l4K8J58j21
6317A3j29l3L53k50Q3k4p4l0J83l33K50Q5n3q2o3q9O1J34M1m2J01j34M5j56J01
$$ y = [-125, -10, 84, 26, -44, -40, 100, -22, -23, -69, 53, -16, 2, 67, 71, -124, 138, 34, -19, -49, -50, -13, 42, 181, 69, -55, -63, -8, 176, -68, -162, -27, 57, -63, -40, -60, 45, -155, 48, 42, -178, -32, 11, 90, 48, -159, 56, -9, 17, 56, 78, -28, 2, -75, 64, -140, -37, 46, -102, -125, -37, -79, 65, 59, 67, 107, 50, 54, 38, -30, 68, 71, 47, 14, -61, 112, -13, -43, 7, 140, 83, 48, 50, 32, -70, 11, 172, 108, 92, -14, -52, 79, 83, 68, -96, -54, 77, 20, 83, 11, -104, -155, -13, 77, 30, 39, -45, 112, -70, 5, 163, -51, 62, -15, 198, -13, -152, 12, 151, 22, 16, 68, -8, -227, 90, -1, -114, -41, -1, 29, 121, -13, 92, 136, -62, 73, 59, 33, -35, 87, 142, 12, 86, 30, -16, -136, -177, -17, -71, 77, -35, 4, -4, 70, 93, -89, 33, 29, -72, 122, 63, -21, 31, -42, -21, 110, -73, 124, 198, 68, -72, -41, -94, 52, -36, -15, -48, 264, 160, -18, -52, -24, 134, 13, -116, -149, 204, -46, 37, 13, -61, -91, 92, -241, 9, 94, 41, -41, -104, -193, -132, 2, 43, 1, 102, -32, 13, -143, -42]
6342d2p0R7n9N3O9N6j55J42j09P9N8k4m5q1O1j12L9K2l1J18q3r7J35J03j93jq
6369g8J34j02Rj11J23J4O2o1J30L0n4j53N7l2J8R0o1j5L3jJ10j07J2j2J6j58R8
6396iJ59r2M4j28O4R3p3m3P3k6j03rQ7j20J93j82mL2lJ42j77J90j31m3j39K79
6422G4j08J99k94J56r4n9R3J13o3R4k20j45K58n8P3Nj49J64k06J58j14J29L5J62
6446B03j81Q8n6J2r5p2O9K8J0m9Q9j96L50l07K04j1k5q8J26ljl3qj16l6J39m3
6473bo0J46j56k3K15p8NJ28j68o5J83l2q7K4qo0mJ13l4M2k4M0Ol0m4n6k9J21o2
6502An4KL1J62O5j36k9p8jJ02o6ljP8j02R3q6J33n7M6P1l18K02kLo4J00j46J4
6531d0j8k1K31k50K05r5j07K53j00j50J25j69J21M4Q2q5%l6ll5P1jQO6j0L4j08
$$ y = [-42, -112, -15, -74, -21, 48, 104, -51, 91, -18, 61, 119, 95, 50, -31, 30, -82, -43, -21, -52, 66, -17, -114, 21, 124, -69, -70, -78, 56, -46, -37, -148, -25, -11, 51, -10, 120, 150, 96, -57, 0, -32, -14, 76, 15, 0, 33, 32, 142, 35, 47, 35, 51, -107, -9, 150, 58, 102, -26, 38, 131, 58, 15, 88, 62, -41, -50, 37, -83, 110, -72, -76, -44, -47, 95, -82, 108, -23, -66, -205, 74, -34, 165, -129, 27, -67, -126, -33, 80, 17, 111, -109, -254, 4, -54, 19, 24, -125, 39, -167, -9, -123, 6, 41, 203, 22, 110, 54, 66, -29, -101, -32, -4, 6, -43, 46, -150, 200, -107, 97, 86, 61, -27, 99, 96, 95, 62, 54, -62, -98, 41, -2, -62, 84, -72, -95, 120, 42, 47, 175, 7, -58, 125, 93, 6, 30, 22, -38, -42, 71, 37, 79, 55, 95, 101, 71, 27, -29, -58, 63, 1, -53, -51, -20, 142, 207, 71, 42, -36, -37, 65, -1, -4, -5, 73, -29, 64, -22, 111, 54, 100, 171, -147, 55, 53, 56, -8, 92, -54, -40, -58, -79, 152, -98, 107, 12, -95, 158, 58, -92, 33, -136, -15, 29, 111, 26, 26, -10, -13, -48, 23, 22, 30, 96, 86, 120, 12]
6558A2L8MN7k0p1n4J8OR6n0M5k06j60L05k24K28k20J23J12m6J5LJj22J43o9J30
6585I4o7q8J30l2j27J71q8O1jJ3P1j34J29j54n3J5O8m8J15l5oo3nQ6J44j59j0
6612B7m4j81J87o8K3P3k0J2NJ23o5j24J45L4l1j78J19j40qK44l35K21r8Q8J11
6637A20m3n0J9o7j18K61j43P8j14J27K1j02q9L9K6j52J33N8L5J04j90J15q1n8
6661g1M3q9QK37o8j08j08K13L3j13r3J30j03J80j23J61j97Q1j9N1J0j21Q5p3J3
6686d1J7M0J33K0j79l6K3K1nr4l2K38j36K0L9k53L4K71r8o5OJ15J19l05K01j38
6712h5J30o0J1j4J07j33O3rl5KR3l21J88P5K5o0J34L7l71J00J39M0l4j54J28k2
6738b6L3R4j00K3M3j45J25lo4J08j27oK22k70R9j15O2j28J16K68k38K73l51J35
$$ y = [12, 50, 54, 111, 91, 20, -34, -16, -10, 86, 36, 81, -125, -285, 20, -204, 24, -196, -73, 39, -7, 8, 11, 12, -110, 33, -36, 94, 27, -61, 69, 37, -90, 81, -7, 54, 53, 66, 137, 3, 132, -22, -75, -60, 8, -40, 75, 40, 34, -29, -34, 52, 196, 37, 27, -17, -198, -11, -79, -56, 17, -3, 9, 14, 137, 72, -52, 93, 127, 96, -82, 37, -103, -111, 133, -202, 19, -79, 9, 120, 77, 27, 46, -21, -139, 122, -21, 57, -57, 70, 91, -11, -100, -61, -35, -187, -54, 4, 39, 143, -47, 68, -13, -71, -28, -117, -109, 128, 60, -48, -156, 57, 90, -23, -116, 14, -89, 91, -32, 129, -68, 13, -6, 45, 55, -66, 19, -54, -41, -24, 16, 149, 169, -10, -46, -23, -2, -7, -101, -133, 105, -31, -11, 28, -225, -191, 80, -18, -83, -77, 38, 157, -148, 53, -85, 45, -15, -4, -18, 89, -44, 19, 10, -25, -23, 70, -251, -63, 12, 37, -23, 111, 148, -223, -123, 16, 56, 22, -132, -4, -26, 7, 101, 1, 24, 67, -78, 47, 44, -20, 88, -39, -45, 177, -93, 6, -109, -47, -175, -59, 209, -29, 244, -107, 28]
6762B8k12K89j69j4J2J74j61J13j9J8q6N3q8l6Q0m0j1N3J9J11JPj22j2n5L4K30
6789A97k00j61K12l1Pkr2K11k05J25q0M7K4j75J96j51K23k56J51n1J72k78OK29
6813A18j81K21n1j26J10j69OJ42k24K25j46K19j40o3P4n1J3L0k8K6L3q8n9J63
6837E4q3KK64k32k66K03Q2r5J55j74N5j46N0L3K84j62k46K93k3j18J21k2J01m8
6861H2l8qn0K5r4O7j51J61J2j60K01j04J5M4J3m9J4L0k1N5kk8N2p4Q7n8K8r3J03
6890E9j71K02n0PL2j16J22L0j40O3Nj14n6Q5n8R4k15L01n6Pq4P5k2j85K18j02
6916f9K10j67Q6r4K5j5O8j08k4k4O7J3p1K40q0J90j84Jj66k4K03r6M4j12K23n0
6942H6k27J43Jr0M6J45K5M5j48m7q4J20j7N1J3L9k19J37l5O0N5j6r2K3m8Q1M3
$$ y = [28, -184, 105, -64, -78, -66, 108, -53, 60, 41, 59, -27, 26, -62, -98, -18, -58, -69, -16, 3, 114, 115, 122, 0, -12, -67, -33, 197, -3, -164, 48, 17, 24, 22, -70, 141, -64, 61, -19, 28, 52, -123, 73, -78, 145, -111, 40, -11, 161, -117, -111, 118, -63, 158, 107, -19, 91, -78, -72, 70, -154, 71, -75, 144, 4, -59, 15, -36, -23, 7, -21, 5, 38, -50, -109, 54, -29, -27, 237, 5, -261, -58, 24, -71, 84, -90, -35, -181, -131, -98, 186, 24, -222, 71, 48, -70, 51, 29, 130, 82, 44, 36, -14, 11, -83, -16, -167, -6, 6, -154, 47, -57, -42, 2, 15, -34, -20, 10, -11, 44, 42, 14, 66, -8, 79, 21, 49, -44, 59, -112, 90, 40, 47, 79, -37, 85, 115, -25, 38, 43, -71, -127, -42, -100, -6, -221, 80, 24, 31, -53, 22, 0, -185, 33, -69, 141, -26, 60, -34, -9, -24, 44, -64, -88, -112, -45, -32, -103, 137, 57, 247, 63, 64, -102, -126, 77, -19, 25, -87, 136, 86, -141, 2, 3, -87, -41, 104, 129, 174, 26, -21, -105, 15, -2, 49, 62, 101, -118, 19, -16, 44, 99, 83, -9, 14, -34, 47, 90]
6969I0p7oM1j67O1k1K5N0q6j4K36k43K53r9l8j39P4L8N3q4J26K1j11J36k10J08
6995A7qJ71l05M4o3K21l9K5j4l4p8N0R3L5j66Ok29L01l2m8K6j54K34j03l8nJ86
7022I3L2p3J12k39J25K1j45J91q9j51N1J37K5j50K9J4J4l0P3m3N2j5np5L6n3K8
7049c5N2o4j25J2J23J0j15J50j93K40o0l3J17p1j16K73k59k9K08j40J60j01J57
7072A61j22j7J12k96J66j07O1q9J99j8J1k8ro4J29n8m1j41J80m1J24m9q1Q0o0
7097Bk5k15K51O0j41M5r6O7M0P3m6J07j44pJ89o2k17K05p4nn9J97k62J8K84k40
7123e5Q5kJ44j73q1K50l29k1N3R1N3O2Q4k58J30nq5J09Kj86J30J1j34R0n4O4K2
7150cl5J67j48K8J16p3q5m7L9n6J06qr0J5o9J06M7j36J88no0j6J6l2J53j15P0
$$ y = [90, 13, 7, 48, -119, -58, -79, -54, -4, -90, -104, 132, -111, 142, 43, 5, -134, -60, -22, 31, -53, 73, 94, -17, 119, -91, 17, 9, 180, -125, -81, -144, 77, 38, 63, 49, 15, -63, -13, 80, 115, -51, -45, -274, 27, -5, -53, -27, -181, 53, -50, -88, -93, 93, 125, 52, 164, -75, 50, 71, -74, 117, 28, -123, -72, 65, 90, -60, -31, -17, -3, -33, 40, -3, 49, 34, 29, -46, -10, -63, -35, 17, -47, -172, -160, -37, -27, -142, 8, -185, 55, -5, -38, 79, 8, -108, 165, -94, -123, 85, -55, 105, 4, 161, 39, 22, 134, -162, 4, -103, -42, -131, 68, 50, 61, 33, 24, -40, 89, 31, -10, -151, 29, -12, 112, 63, -18, 62, 2, -23, -238, 13, 73, -68, -23, -119, -52, -12, 61, 15, 122, -22, -29, 160, 98, -119, 86, 12, 7, -52, 145, -117, -99, 185, -55, 30, 28, 172, -1, -82, 168, -161, -182, -129, -38, 15, 77, 161, -97, 33, 28, -57, 52, 54, -132, -2, 9, -125, -35, -89, -25, -3, -38, 129, -19, 9, 125, 52, -33, -80, -41, -97, 9, 1, -89, -74, -143, -37, 10, -126, 62, 57, -3, -19, -3, -35, 118, 3, 73]
7177G3l31L00M7j72J55m6lJ0P8p2O1k34K56r2j13Q5j1o6J38r4R4n8J17j24j12
7202a14K8N4Q6j95j2J24P6j00J36M4K0j60J33j17j0P6Ok60J86J26j68K1nJ21j74
7227g8O3J4l5j41K29j02P6nQlj4n8m4q8K94j19J0p2M7l5k2l6R9R5M9j39j08K12
7255I7r3m0K8Q2k25J68k9P2j53j0M4O6J17l62L34q3J09j52P2n5O0K4j43J49j44
7280f7p0p5K48J18k17N1j21J43J4n0R6r6Q1m8J75k54J2L0L8P0k5ro5j6n0J16o3
7307c4K13k91N1Q3j18J29j42n5K25j38j52J78J63J3j44M6J17j12oK2p9LM8L4J39
7332A93j35j9j83J67m5q1J02J02l2j8l0JJ9M6M1j75j16N3j6Q4N0J03k09%O5J29
7358I6j26o4R1L4j18R2Q6J08j97j26J13r3R9m1o6J65j58L4K54k30J7J14Or9l8
$$ y = [73, -258, 42, 89, -83, 72, 26, 23, 33, 111, 39, 100, -134, 122, 30, -83, 2, -9, -75, 63, -31, 63, 5, 122, -2, -114, -86, -32, 54, -141, -153, -29, 47, -53, 83, 127, 147, -13, 120, 3, -7, 69, 75, -185, 1, 127, -41, -20, -25, 96, -78, -15, -1, -36, -177, 52, -50, 26, 21, 29, 26, 12, -46, -90, -178, 116, -3, 7, -65, -18, -53, -75, -111, -12, 83, 132, -7, -115, 97, 4, -36, -8, 74, -151, 17, -12, 60, -93, -103, -59, 7, 124, -238, 96, 13, 122, -30, 42, -13, 47, 71, -72, 77, -67, -137, -212, 36, 154, -63, -12, -133, 10, 24, -26, 70, -26, 55, 7, 182, -72, -60, -30, 8, 78, 53, 44, -21, -37, -87, 29, -34, 179, -112, -61, 22, -96, 33, -109, -164, 61, -77, -229, -51, 112, 125, -19, 27, 144, 32, 26, 48, -31, -28, 20, 54, 193, 58, 39, -144, 23, -22, -103, -1, 101, 69, 51, 21, 22, 41, 87, 128, -47, -163, -110, -126, -42, 8, 111, -98, -98, -33, 96, -30, -94, -3, 31, -87, 5, 91, 199, 2, -124, -11, -104, -5, -46, -112, 53, -105, -71, 183, -47, -30, 84, 90, -9, -47]
7383d7Q3j10J63j96K43m2m1J02k29Q0QLJ2j64J22LNJ09j62K3M8l0J45k22J07P0
7409H3l4N7p7qQ8m2k7j07J05l3j3K06r8j86O0q5J17m3O4J7n0J10j91L02j35o8
7435A2n4J0Q9j32K6m2L6K3Q6j02q1P1P5O4%r9j0N8J00j27j7k5l6O6m6O1j37j4
7463a45J45N5m2m7K3N6k1j07Q5J7j76O7O6J52j05K0r0L1l1J51n6j01R3r4QJ39
7489I3r9q9o8J13J12P2j81J0J79k74J77Q3j11O2j40l1N6p0P0Q4n3j74K87j63J62
7514A07j3j87J44n5j27J32j11J98J5j86O2n5J71o8Mk0j23o2L03Q9j31q6J9M7j68
7539a01J12k19K33k7O4o8o5K07q2N1q6l3J43J4k26P7N1j41J65j15O4L9j19P3j01
7564i0J24L0n2R5j9r0J21O2k07k1R8j04J68j09n7J46Oj21p1q1J48%J17j5n2j4
$$ y = [-47, 36, -74, 89, -107, 136, 94, 53, 155, -74, 6, 14, 17, 29, -135, -13, -10, -5, 104, -58, -35, 13, -17, 128, -94, 13, 83, 49, 106, 29, 21, 109, 67, 40, -67, 38, 5, -8, 198, 100, -86, -26, -111, 6, -37, 27, 44, -6, 104, -87, 215, 80, 12, -42, -32, 57, -75, -49, -91, -55, -32, 54, -48, -129, -58, 17, 81, 81, -18, -28, 30, 130, 3, -14, -39, -75, -9, -55, 6, -131, -145, 0, 55, 13, -34, -11, 45, 24, -83, 2, 19, -157, -90, -24, 128, 23, 43, -47, -16, -47, 104, 48, -53, 40, -54, -46, 93, -6, -95, -163, -50, 62, 134, -47, -37, 142, -132, 45, 128, 17, 79, -61, -92, -36, -106, -36, 48, -5, -179, 108, -55, 107, 94, -93, 51, -4, -131, 1, -110, 88, 103, -83, -21, -76, 95, 27, 31, 11, -112, -174, 129, 218, 87, 1, 20, 67, -101, 11, -208, 25, -2, 62, -6, -71, 136, 54, 105, 19, -14, 129, 143, -83, -6, 45, -96, 69, -46, 18, 57, -62, 11, -90, 34, 64, 12, 107, 88, -2, 119, 181, -26, -47, 51, -53, 115, 6, -51, 95, 101, -20, -91, -172, -24, -24, 93, 78, 26, 12]
7590A2J0Q4k31K76j29Kq2Q1j6P0k6K8j15n1m9J9j4M1J79j10J12j43J25j84J0J33
7616C2n6J3J36j12L9p1O0j29J18j4j34K3K10K3l2n9o9J05qjk05J80n6R8q8N6j59
7643a00J82j43Q4O6M6k88J79K9l8l4q2J30%r8J52n6R2K3j39j16J55j17J56k47
7667a64M8Q3N0k8p6K25j66j84R5o3K34Q6k02J37P3j95N4p0Q9j79J01J07N3m4j88
7692a24K71j59m4l4K55k96J79p7K35l16J26Q0m07M60j02k90K29P1j00J89j21l5
7714a0m3K8PP5p1M6N7L9p3J08j80P3J70k62J63m2j8rl4N6N0k34M4J4M5l9R5k8
7742B7j26J74j49J03j28J36j2L3Pn4L2l5Q5j15oJ6j3J0J08j47J20J21k53J87j21
7767@j53J99q4O0KK2k9K00q1o1lm2N9q2j8J0Q1n3m2J07p4m8%rP1l0O9J0j37o0
$$ y = [12, 22, 106, -125, 151, 22, 24, -58, 23, 7, 77, 51, 79, -36, -87, -136, -117, -131, -90, 89, -21, 91, -52, 73, -111, -101, 32, -24, -11, 125, 13, 52, -19, 41, -88, 30, 16, -118, -95, 115, 138, 106, 47, -22, 83, 75, 74, -131, 49, -7, 91, 3, 59, -100, 82, -61, 23, 89, 135, -153, 26, 55, 17, -17, -99, 31, 31, -67, 85, 29, 121, 144, 5, -111, 44, -73, 83, -164, -116, -33, 17, -11, -87, 138, -28, -212, -117, -180, 54, 140, -62, 75, 148, -47, 7, -63, 26, -153, -52, 55, 108, 64, -124, 147, -12, -56, -90, 165, -131, 48, -29, 206, -110, 16, 96, -311, 149, 47, -243, -14, 57, -43, 146, 25, -10, -53, -25, -18, 57, -14, 32, 89, 128, 55, 163, -17, 56, 226, -36, 127, 85, 67, 58, 24, 80, 130, -104, -60, -46, -1, -40, 55, 27, -99, 75, -74, 29, -99, 37, 25, 58, 65, 11, 43, 8, 93, -22, -28, -12, -25, -15, 93, -54, 66, 187, -66, 121, 0, -153, 46, -38, 22, 24, 46, 17, 217, 136, 75, 72, 30, 89, 7, -11, -1, 80, 27, -15, 92, 18, -30, -30, -39, 32, 2, 71, 81, -56, -116]
7797a16J17J26j07r0J09k1r0M8J9R0p1O1j41j00K39K6pJ05j38q1j10P9K9Q7kn3
7823Hq0l9K33j39m0j56J49J69j43q9Q7l1K3P9N1j17k9J6m9J25R3j56jq3J71l29
7849b77L37m5j67N8J46l9l8L2n6j8l5Q1j47K15q6J07q5K8o9J20n9L5J7l2J55k04
7875b6Lp2J20ll5P9m4k3R8k09J04k9J65o8L9j3o4p4P5m5k2P3pp0o9O4J33k25J26
7904a9q6O1K25J02k93j30J92J9n7l4m0L6R0j13J50J0p5N1j39J74m4N3j96J8L9
7929fj16K20J30l07Q2j2R0k28J86j83L07j26J99k87%k6J78j84J28j88J95n1m1
7952d0R8n0q3L3M1J37j26L8k22K05J21k42J58o4m7K2Q9p8J01j46R9Ol7M0K3ql17
7979b49K32O2K2Kp7R4j89RQ0O9n7j9M2j22J12N2P8j70J02k25J64O5q0j08qJ43
$$ y = [-116, 1, 127, 20, -70, 39, 18, -72, -24, -5, 85, 14, 75, -66, -166, 73, 99, 92, 197, 59, -22, -132, -53, -24, 63, 61, 8, -72, -111, 122, -17, -57, -213, -64, 105, -38, -127, -40, -71, -48, 31, 82, -35, -64, -48, -97, 28, 121, -35, -36, -119, 52, -277, 60, 15, -152, -94, 52, 13, -25, 7, -49, -67, -102, -21, -168, 47, -39, 68, -17, 11, -58, 62, 3, 38, 55, 23, 178, -26, -23, -95, 25, 22, -13, 66, 22, -1, 97, -112, -8, -37, 128, 60, 99, 86, 22, -52, 23, -22, -44, 29, 22, -48, -117, -53, 80, -145, -19, -105, -44, 181, 283, -10, -140, 52, 71, 14, -20, -60, -24, 66, -47, 103, 113, 38, 89, -50, 124, 80, 133, -63, -45, -6, -122, 98, 228, -79, 3, -9, 81, -147, 39, -144, 163, 37, 236, -51, -51, -77, 101, -83, 45, -143, 52, 1, -40, 58, 8, -75, -42, -1, 136, 10, 48, -174, 31, 152, -90, 68, 4, -43, -21, 68, -10, 91, -55, 44, 50, 13, 53, 76, 68, -249, -17, 45, 67, 69, -8, 86, -103, -94, -14, 55, -2, -21, 21, -101, 11, 63, 141, -29, 73, -152, 12, 77, -3, -111, -119, 24]
8005B4J2j62J17pK2J59j60j40J28o6MM3r0k0M8Q9K5j15J05K9o5l9J03j74J12j1
8031b9Q2r6R4J9o7K6J26j41N7J0q9k8R2j14l1J73n3k33K32j44J5R3R0j09k5j68
8057b18K63J09j46J1j68J63j06j1J91j39Q6j1p3K11k09P9k2j31J44k51J41P1J8
8080BM6L3n9m4mm4M9K9R5l23K47LO1j0Nj06J78j12q7K06k59L9J6k1O8J4m1K1M6
8109D8j29nK3l2J04p5M1J05q1QR7k02J99r7m2n2n3K98p7j04k7J56j01K04k66J49
8135H9j01j07o9J81LL9q1R9P2l2k58J64J9K9k6j55K15j40J16k2o2l6j9J6J47j15
8161c4K50k72N4j02P9O0k2M6J3n1j03Q2K4o2O6lj61M7O1K3J3m1LJ06k57K12q0
8188d9J61n9L9
$$ y = [24, 36, -126, -9, -16, 6, 165, 5, -135, -7, -73, -69, -26, -116, -136, -88, 1, 26, -89, 16, 45, -20, -59, 44, -130, -18, -29, 53, -43, 51, 70, 3, 29, 155, 14, 71, 81, -8, -36, 56, -58, -89, 84, 31, -202, 30, -114, -99, -6, 84, -25, -50, -218, 45, 154, 8, 19, -149, 14, -92, -103, 88, -51, 35, 24, -49, 162, -47, 32, 10, -121, 23, -228, -87, -16, 2, 48, 81, 22, -22, -26, -70, -21, 8, 103, -220, 27, 30, 91, 81, 86, -20, 158, 46, -41, 165, -94, -55, -39, -60, 8, 22, -19, 2, 48, -81, -86, -63, -95, 9, -66, -25, 80, -1, 7, 104, -98, 101, 4, -38, -90, -143, 155, 78, -26, -53, 103, 2, 206, -60, 89, -12, -119, -188, -7, -4, 35, -46, 53, 125, 93, -165, -1, 18, 47, 21, -134, 81, -59, 57, 35, -27, -63, -82, -66, 81, -34, 216, -56, -2, -104, -25, 35, 13, 59, 72, 21, -82, 0, 24, -38, 28, 25, -136, -89, -28, -5, 8, -33, -30, 76, -181, 31, -49, 112, 53, 92]
8191I2
$$ Imaginary data points
##PAGE= N=2
##DATA TABLE= (X++(I..I)), XYDATA
0@%%%%%%%%%%%%%%Qj6J6j6J6k4L2l2M0m8N6o7P5q8J04j20J36j55J79k03K27k56
36a36K88l23L62m06M53n04N59o18O87p60Q38r24J018j121J234j359J497j652J825
55I58k019K239k490K781l122L525m017M632n420O476p976J0288j4354K3616q6088
70g0971M44J31909k6510k7792k0004k6106r685P9901M9257l0842m5428j2380k3691
83c1898J4229O0120J6741n6878k7676R124o642J851L7409o649n2086n709L7132
96a0932J089K099M2603M870n3561n38N9533J2865l9821j8609o906j4251J5194
109f365K7591j9016l2387N534Q574n406K1812K3471k8011l0507K0524K2782m830
122C766J2337J9657j9515k2396J9097J3839j9031l256J1810k3409l2795J0678
$$ y = [0, 0, 0, 0, 0, 0, 0, 0, 0, 0, 0, 0, 0, 0, 0, 8, -8, 8, -8, 8, -16, 16, -16, 24, -24, 32, -35, 40, -48, 56, -64, 72, -83, 96, -107, 120, -136, 152, -171, 191, -215, 238, -266, 293, -325, 362, -398, 440, -484, 534, -587, 647, -712, 785, -867, 958, -1061, 1178, -1312, 1469, -1653, 1872, -2145, 2487, -2933, 3543, -4433, 5855, -8499, 15117, -70971, -70527, 61382, 34872, 7080, -12924, -39030, -48715, 31186, 80443, 49601, 4173, -8207, -31898, -17669, 42451, 59192, 2314, -25362, -16238, -22880, -21029, 16380, 9731, -42355, -48064, -10932, -9843, -7744, 34859, 39729, -13832, -14370, 45163, 58028, 18207, -402, -7308, -21559, -6365, 21226, 2210, -30177, -24643, -16069, -21475, 337, 23808, -4203, -34710, -14186, 8596, 3766, 16103, 35760, 16245, -6151, 12946, 26785, 7754, 4498, 16308, -7101, -39896, -29218]
134b9218K4403l483o680N563l179M53K1423P843j7605j027J7502j398q633Q160
148A4124j669j9014M258K3860m391k4639q572j998o563J0903J8616q746k0547
161b4378M650J7291Q265J0220J1569p889j7868j585P316J722L878J496j6894j8482
175b0689N491J4740J751k537j692j1512r886J1683J7096L14n451K135J920K256
189E619J0893P026r059j0713M45n06n602k100j634p876l488O704N498K24J362
204c207J439l866P2R467P197k326m019j585j907L498J0462L580j0560j2911n200
219i866l19L328N565k123j1380n901O829J0858Q701N879j560p921k981O776N938
234A1823Ll198n327o975j566N675L397k892m553m077l840M01N175K507k175j49
$$ y = [-29218, -4815, -8298, -14978, -9415, -12594, -12141, 9282, 17125, -480, -1507, 15995, 14597, 5964, 14124, 12455, -6559, -2301, 21559, 17168, -7471, -16043, -18041, -24604, -13701, 4915, -3831, -24378, -19728, -2437, 5828, 16048, 27617, 19728, 1860, 275, 7591, 9313, 13191, 14687, -2207, -20689, -15198, -458, 1293, -1244, -2936, -14448, -24334, -12651, 4445, 4759, -692, 1443, 3363, 5619, 16512, 23538, 14479, 3766, 4211, 3705, -1897, -3997, -5631, -13507, -16995, -10291, -4793, -4569, -3207, -1768, -5634, -5562, 3905, 11102, 8776, 4757, 3172, 1265, 4763, 15225, 18805, 8245, -4666, -9866, -10185, -6857, -1292, -3415, -14795, -20696, -13867, -3009, 5692, 11571, 10011, 2090, -891, 5885, 11823, 11826, 8628, 3301, -3674, -5240, 435, 3832, 940, -3613, -7690, -11530, -11129, -5954, -3447, -5622, -5771]
250e771M052L578M090N264J424l616j952J06j725l411k468l020m251p60K804J355
266d301j97N82m56j357J207M354K709K49j25p4o9L225N180J246l850n208m794
283a679k931k00J735p23m223l221K74L666N691O067J838k742k611k50K097L332
299F120K581j034m662m049n69K016K445O01l467o042n305n61M042M984K654m85
315g31k024J35M450O652M048r55n586n590k594J839L298o4l948m735k086J702
331f189M078K637j217l774k594J691M256M158J950o30j682P03L040K620q91l829
347D327m982l781j052J754J249j424k513j068J649L994M825J619k174l154n03
362a234K015L152L428j36m006m009m7K463K032j48l796o467m124J503M686L740
$$ y = [-5771, -1719, 1859, 5949, 11213, 12637, 9021, 7069, 7175, 5450, 2039, -429, -3449, -7700, -8460, -5656, -4301, -4498, -3916, -4372, -5729, -4522, -168, 2541, 2790, 2665, 2591, 2522, 5747, 10927, 12173, 8323, 3115, -1679, -4610, -4810, -3075, -3798, -8021, -11242, -10968, -7302, -1611, 4456, 6294, 3552, 941, 691, 2788, 6120, 8701, 7667, 3005, -1044, -1613, 403, 2848, 3449, -18, -6060, -11365, -11926, -7884, -2900, -246, -731, -2755, -2620, 1830, 8482, 12530, 11575, 5989, 399, -2195, -356, 2942, 2878, -1070, -5805, -7891, -6189, -2111, 526, -691, -4465, -7059, -5368, -1112, 3046, 4996, 4366, 2684, 3387, 6427, 9047, 8156, 4327, -655, -4436, -5488, -3734, -2485, -3909, -6422, -7490, -5841, -1847, 2978, 4597, 2423, -731, -1234, 781, 3933, 7361, 7225, 3219, -790, -837, 1626, 3658, 3510, -286, -6753, -10877, -9374, -4688, -948]
378i48J456j370k646L73N595N551J195k186m141m093l18L337K259j769k950k441
394c096k106L93L307J601k330k272p3K59J560M027L374k98q71P70j98O8J402o19
412D898m849l646M33N95j163O26L93j829L09L807J430j630N51J567j375J36M052
429D305J303k784p03J222j977r29K670r81n469k773K33n0J992M814r0n158%N438
447A063K683J150J709k353n942Q1M988q9k131J023j130n713j96M316j33k448K111
464a011p25n472R33P238L141j251J242j214m032K565P051j607p123r93J68l221
480d311J707M845l125n526K837L635k719j07N368j263m455K923L886k318N22N153
496G052k570o677J970M557k847k108R92n359n376O785P202m444l541L003k87j611
$$ y = [-948, 508, -862, -3508, -3135, 2460, 8011, 9206, 7020, 2879, -1214, -1532, 1805, 4064, 2295, -655, -3096, -5202, -4809, -1502, 99, -2231, -4503, -4576, -4317, -2757, 1270, 4644, 4346, 3475, 4245, 4047, 4115, 5517, 4898, 49, -3597, -3164, -2569, -3732, -3106, -2713, -4542, -4233, -426, 1004, -626, -75, 1492, 117, 253, 4305, 5608, 2824, 2121, 3343, 1366, 437, 3107, 2126, -3343, -6116, -5883, -5933, -3941, 873, 783, -4375, -4375, 1063, 3746, 4896, 6605, 4252, -1690, -1609, 3379, 3290, 1159, 2182, 1052, -4661, -4857, -541, -674, -3122, -1011, -1736, -7208, -6275, 963, 4104, 2853, 4095, 2881, -1151, 1414, 8465, 6858, -265, -1258, -1090, -4311, -2604, 2241, -884, -6410, -3573, 62, -2657, -2764, 2604, 1341, -3114, -191, 3695, 1377, 1899, 7052, 4482, -2195, -225, 4332, 1485, -623, 369, -4990, -10366, -3581, 3621, -823, -4364, -1361, -1648, -3259]
512c259P425M799p109m462M819J6l826M501L852n967m355K907j935l302N913M882
528D899p569o519M057L015R59O934K930r561m878Q167M259l070J094j07q656l353
544g399Q141J953n332J786K539o567l088P438K714l311K629J838p733j062J0514
559E060M007n529j188L48n712j83Q463n24r651j151M127k340N7O643k50o420K317
576a926N069l060j498O479M92o855K26M279k530m54N619k840r517P35O882j030
592G1k348J838k797n085N157R006j651m352K174j40l402L572N179m045m944K199
608D32p94m486K680O023k671m965Q58m19k245M814O902l852o495K050L095K02
624A129L790L409n745o061K898K698k692J94K407m461m240L356K704j561J962
$$ y = [-3259, 4166, 8965, 1856, -2606, 2213, 2229, -1597, 2904, 6756, 789, -3566, -659, -2594, -5896, 17, 4899, -2670, -9189, -5132, -2117, -1158, 5776, 8706, -855, -5733, 2434, 6693, 3623, 4717, 4610, -4046, -7399, 742, 2695, -2637, -851, 1688, -4879, -7967, -529, 2185, -1126, 1503, 3341, -4392, -5454, 5060, 9067, 3538, 2350, 2698, -3014, -3197, 5266, 4742, -4909, -6060, -1933, -4273, -4216, 2427, 2177, -4243, -1926, 3143, 83, -1415, 5064, 5556, -1299, -1073, 3206, 676, 222, 5841, 3001, -6516, -5781, 1101, 71, -2277, -439, -3236, -8321, -3164, 5842, 4191, -161, 2013, 1873, -1529, 2043, 7222, 3177, -1767, 432, -362, -4848, -2168, 3855, 1184, -3781, -2923, -3342, -5587, -773, 6129, 2277, -4218, -2168, 927, 1129, 4919, 8328, 2583, -3478, -580, 2118, -574, -380, 2027, -2434, -6674, -3318, -614, -2175, -213]
639b13L502l459m207L893L863j013O96J238m004l093M246L174l184k352M46j996
655b463j964L288J520l830n76L452J45r33K922J708k410l52K782o78k134J838
671B315O16l879j227K224o1j466R80n99l159j51M233J293j561J87M72j441J667
688D43M189Q6k914o04J5j678J98K130r18l471o42M09o33R48L192k03k452j22J380
707f47Q08J621K221j061k660r7J639K94k41J06k191k443J72J319j20r31N68n57
725b200p29J785J991M31k35L34N8j42J060R99j298j774n56j44j85O89J88k084
743a812j753K84J337J181J006n2j686j59J631K336J369J00j354k153p99J096J616
760B188q4j684k294k081J4J970K199J12j297j401n03J475K899J939k77k013j532
$$ y = [-213, 3289, -170, -4377, -484, 3379, 2366, 3062, 4300, 296, -2797, 1449, 4623, 1439, -913, -467, -2463, -4427, -1139, 381, -3449, -4025, -573, -428, -1361, 1561, 3269, 859, 507, 3289, 2611, 477, 2315, 2931, -948, -2175, 49, -12, -1478, -498, -1097, -4256, -4407, -174, 1119, -442, -255, 217, -1224, 443, 4632, 4718, 1804, 1200, 1215, -463, -265, 1865, 947, -2524, -3166, -2757, -3390, -2442, 750, 547, -1905, -2027, -647, 161, 1782, 4003, 2942, 282, 185, 1824, 2118, 1877, 1983, -208, -2651, -2479, -1160, -1280, -2211, -1643, -2200, -2929, -1144, 847, 1278, 1043, 1377, 1435, 1293, 2353, 3352, 2054, 280, -276, -420, -605, 84, 272, -1812, -3565, -3281, -1944, -763, 243, 191, -1495, -1654, -23, 2313, 3682, 3782, 2428, 275, -524, 572, 2188, 2104, 420, -1874, -3955, -3941, -1971, 228, 340, -957, -2358, -2861, -1386, 1513, 3452, 3175, 1162, -370]
777c70P4J729J889L72k048k856j862M55J324J500l51k002j691J85K042K639J420
794B449n79j544p86Q64K148J205m87j894j896r07O22J321K64j430k129p95M21
811c153J913J503L9j077n70N07J812K398M80j201j907r81M13J379P16j094k464
828a287j854j34J341J781O23j195j918n94J562K540K308J23j759j955N8J811J777
845C228N88j441l333k125L58J839J248k84j507k059n53K192K566J233n3j258j400
862g61p0K468K005j66j390j741j715k6J705J208j527j762j212o06R58K643J106
879A117j467q07M48Q40J457J592m0j818r52K68K72j65K54p63k273p64J374L54
897a073j64N07n17j315O47K595J123l64j63j79j014J016K159l39k205j102m31
$$ y = [-370, -296, 1433, 3322, 3694, 1646, -1210, -3072, -2617, -1293, 207, -144, -2146, -3837, -3652, -1610, 1029, 2449, 1870, 326, -460, 404, 2552, 3757, 3270, 1376, -520, -1427, -805, 516, 780, -650, -2779, -3574, -3153, -1240, 263, 302, -775, -1345, -838, 974, 3372, 3852, 2651, 744, -237, 176, 1555, 2271, 1177, -1287, -3141, -3275, -1934, -153, 470, -725, -2643, -3237, -1675, 865, 3173, 3296, 1537, -418, -360, 1451, 3228, 3816, 2375, -958, -3083, -2725, -886, 362, 78, -1429, -3488, -4041, -1849, 717, 1950, 1897, 639, -761, -831, 1637, 3642, 3476, 2086, 345, -1370, -1396, 309, 1517, -10, -1772, -2984, -3590, -2632, 11, 1117, -350, -1157, -709, 131, 1588, 3180, 3140, 1322, 370, 638, 910, 745, 999, 236, -2037, -2801, -1427, -1073, -1237, -730, -1247, -2562, -1915, 680, 1803, 1439, 1276, 1097, 83, 1099, 3258, 2919, 714, -388, -819]
914h19q72P46J614j023k184j79O78K68J073K278k79j968J0J554J51J198J201j162
932B285l070j41J469L3j95N60k336k560J198K325j04n80Q75k75j189J659K717
949B671p56p59Q91k79j953O39J768j424j599L83p13j582J634J842j861j822J491
966a429J140m24J516J414k200j384L004J631j566m65M68j902j378K105P06k415
982a179o95J338j953j056K989J942j784k21J164j379l55L708K077l130j644M93
998C15q38P3L286l2m506j823K029J21l58K378J67l269j77K755K81m91K978N60
1016C449l483j032K669j05j011J877o94m447p62L730L91j584L62k05k832J322
1032b355M392k33k710J095J153j769J013K767j081k763R77Q11k611J06K887j246
$$ y = [-819, -1691, -945, 669, -354, -2538, -2717, -2039, -1771, -698, 1580, 1301, -667, -657, 897, 1048, 2246, 3447, 2285, -785, -926, 543, 576, 381, 941, -1395, -3955, -2757, -432, -536, -1116, -241, -516, -1705, -46, 2671, 1915, 1156, 2047, 1768, -185, 454, 2222, 798, -801, -418, -1131, -2713, -1079, 763, -1098, -2920, -1429, -289, -713, 803, 2217, 17, -1367, 1637, 3268, 1702, 1237, 1705, -197, -1575, 530, 1236, -1179, -1874, -536, -2489, -3545, -556, 1386, -398, -619, 545, -834, -1189, 2519, 4596, 1466, -178, 315, -523, -450, 2836, 2804, -1702, -3525, -1496, -1375, -1733, 645, 812, -2457, -2634, 121, 402, -89, 2889, 3449, -34, -1066, 1603, 1498, 487, 2364, 1670, -2777, -3539, 191, 582, -1002, -640, -845, -3677, -2355, 2037, 1804, -906, 189, 1342, -427, 586, 3353, 2272, -491, 486, 1297, -1314, -1208, 1679, 433]
1048D33l205N20J229j077J365L273j932l337J258L083j82L47J322k341l303K436
1064a11K947j577j292O44j956k500K222K739j638p41J322j369k001K930L409j112
1080A916j115O35j809j618L526K755k582k973K46n18q74K729K110l462k018J672
1096a380M70p33K355J880k236j580J873K55p62K127J162l047k399J657N42o63
1112d79R44K12l039j276L059J405j245L01O21j675O0K996M33j924l3J122j461
1129B1n51J943k8k493j54Q46j098j05J952L07k444j25J570J02M45K267m73k819
1147h37N5K135J99n30O74j244k305L76J952l61q00N99o53j815P07K333J09l18
1165B76L57l45j268J048K246j78j276n02l96j215R48J475p71j727R8J65m90R85
$$ y = [433, -2772, -2252, -1023, -2100, -735, 2538, 606, -2731, -1473, 1610, 1428, 1775, 3097, 756, -2547, -111, 2836, 1259, -33, 611, -1345, -3845, -1623, 1116, -522, -1263, 59, -1310, -3311, -381, 3028, 1916, 801, 1436, -373, -1991, 1535, 4290, 1708, -1265, -1019, -1537, -2411, 318, 2428, -1034, -3052, -1380, -910, -1643, 712, 2592, 356, -1224, 649, 904, 142, 2269, 3431, 384, -2015, -358, 184, -479, 465, 677, -2362, -3638, -579, 826, -419, -118, 503, -1172, -1112, 1884, 2317, 393, 360, 1482, 21, -530, 1413, 1385, -1108, -1262, -416, -1514, -1619, 333, 640, -1804, -1929, -359, -257, 188, 2455, 1982, -837, -782, 1353, 1552, 1022, 1696, 452, -1853, -1477, 475, 114, -686, -87, -740, -2555, -1848, 485, 594, 276, 633, 288, -980, 68, 2314, 2136, 860, 358, -38, -1253, -305, 1170, 399, -1328, -1230, -1065, -1555, -570]
1183e70J564j065r61O97Q88n35P05R66p97r53N56M05n72OK62j301p46P81M97o22
1203g95p5K06l87K01J218J052p82n57K12k49M74Q12N5j224q79K64nL83O66l68
1223B22j403o56M99Q96O30N00k14j222n4R06J045N26j02q71j401l08J161P00k08
1242F46m36j165q06M60J114P78l01o66l88k69O93J456N06p57n89k09j52O04Q31
1261A350l26j297r12m6L86P90L97l74r68p4N87Q62O69j03o69o80J99O54P26k8
1281A143r59p41m65L85R04N06p16j072o24P0R59J270L12q00q51j56P55J282Q66
1300B068o51j229j237q2Q72J211K61j294j023n81M97J209R84k02j012j093J12
1317a190R05J348O65m07j376q66M54R88Q00o3j195j207n09P39J007M60k52n67
$$ y = [-570, 994, -71, -1032, -335, 553, 18, 723, 1689, 892, -61, 495, 900, 328, 334, 596, -705, -1451, -670, -173, -795, -870, -664, -1051, -850, 368, 1420, 638, 81, 293, 44, 518, 1330, 1385, 161, -718, -454, -459, -76, 590, 222, -1181, -1837, -1338, -442, 188, 688, 474, -748, -802, 104, 1149, 1675, 1573, 702, -699, -1007, 154, 854, 646, 210, -955, -1761, -1301, -187, 591, 290, -376, -764, -1033, -340, 1116, 1622, 865, 276, 67, -85, 519, 1350, 1024, -273, -1185, -1231, -845, -55, 342, -32, -1000, -1074, -487, 375, 1044, 941, 272, -408, -209, 445, 1171, 1143, 184, -557, -1022, -637, 267, 773, 57, -1015, -1639, -1569, -610, 660, 972, 172, -679, -835, -80, 1202, 2068, 1417, 188, -1049, -1131, -259, 952, 1213, -81, -1104, -1685, -1188, 21, 1005, 803, -209, -1302, -1190, -285, 1063, 1728, 1321, -55, -921, -467, 521, 1321, 1258, 63, -1144, -1653, -914, 93, 553, 301, -266]
1335b66j134K79J312R89O9o25p52n07M22R49O94o20q24q22j56P75P15K6r51q20
1355a247J01M40Q39P77q9r03n02M79O17N89M02r29j295k21O17N30J87p7q96r44
1375a525L86J169M17m9l38o38l42J012J054K29n39m34n49n25Q87R21l67r80o95
1394i06l35oR87J084o09q54j3J9M36R13Q32q38j119Q4N81J66L43K75q59j298K31
1415h86O51k48L70L30r99q33J030R22p0J92K81m89o78J069Q08q11n58J24m92m02
1435f89J011K16j065p15P91M7j37P69K9r15j26J115K19m12P73M35j312o38J088
1454D84J21n15K41k82j474m08J686M57p46J37kq40M26J863j41r58J14L92q63L06
1474bJ359k23j295j55M97j108J5J553m67j358J13O21r4M51J355k59j676J51J513
$$ y = [-266, -1400, -1121, 191, 1180, 1249, 624, -128, -635, -213, 736, 1430, 810, -14, -836, -992, -217, 498, 524, -427, -1247, -1146, -706, 133, 910, 821, -82, -584, -105, 512, 1101, 1503, 574, -721, -942, -325, 205, 392, 315, -581, -1525, -1139, 30, 447, 398, 60, -578, -920, 92, 1146, 1375, 836, 402, -147, -672, 215, 1136, 769, -211, -906, -1241, -1247, -260, 824, 215, -639, -652, -633, -197, 716, 1548, 710, -409, -325, 256, 422, 765, 1040, 181, -1117, -886, -235, -483, -113, 217, -782, -1615, -585, 337, 267, 459, 740, 251, -427, 642, 1450, 639, 81, 205, -287, -689, 322, 538, -527, -1242, -451, -404, -541, 228, 257, -658, -784, 331, 550, 138, 911, 1346, 34, -604, 484, 605, 90, 331, 49, -1425, -1833, -147, 310, -436, -299, -301, -1141, -715, 1148, 1007, 49, 163, 555, -308, -2, 1357, 1134, -161, -316, 181, -927, -912, 641, 174, -1184, -1071, -450, -544, -93, 1262, 1003, -673, -522, 991]
1493I91j99m06R50r62j565Q56J144p84o17N78l38j174P83J421o95q34J024k56
1511h3r20J213J506n59j238O48k99p71Q79J286j625j571O34L97l72J010R01j811
1529g75j096J381R84n94O18P32j303r26J360P76q38P06J74j738j328J602Q15p24
1547a74O8p7j574l71K187J375q20o86K64q33Q0K003M99j686l81L42o03m66J518
1566F65L41j494n14M41n59m8J693N21j670l52R11L26J8J393j83k097k89J672j70
1585F05m74K64l27j525L02J513l64n83L79J16j298M54J761k34l61J40O1r69M17
1604a23J712l36j393o9K9p09O74J116p90j661L64O13N4N31J192o25j426P90N10
1623D53k18N16P72j019j317M58P50k34Q7J45r54j352Q56J161l54J24L39q60l54
$$ y = [991, 792, 386, 1336, 374, -1191, -335, 809, 25, -592, -14, -352, -1526, -743, 678, -17, -851, 173, -83, -1003, 210, 1716, 1157, -81, 567, 268, -503, 376, 1662, 37, -1534, -900, -503, -875, 135, 1036, -775, -1871, -490, 494, -100, 518, 1250, -53, -979, 381, 1157, 319, 1025, 1199, -539, -1867, -265, 550, -174, -106, -183, -1757, -2128, 59, 1434, 614, -72, 192, -641, -561, 1442, 1941, 255, -126, 216, -387, -853, 665, 1006, -488, -1002, -561, -1120, -1168, 525, 1046, -624, -976, -65, 261, 279, 1672, 1489, -608, -897, 775, 605, 131, 395, 68, -1457, -1155, 358, -6, -589, -210, -94, -1392, -938, 823, 589, 228, 368, 429, -540, -123, 1589, 1253, -140, -209, -180, -889, -215, 901, 111, -1550, -1186, -573, -519, 12, 1204, 579, -847, -57, 453, 235, 751, 1523, 504, -813, -355, 395, 161, 248, 393, -561, -1913, -1057, 104, -250, -126, 213, -647, -1001]
1642a001J033J300o28j65mn55k80Q18O71q78n49J37l59n78Q16O97p49o52L42J28
1662d56j15J061N40j050l16O22L46k55M86rr27m92O50n6l09K00k28m56k50Q85
1682a29L31k62qQ6j78J5R32J98o98o7n2j12J03M43j96p71k51rK2L53M88j50q22
1705g34j19O88L38L88L05m98m63j28N18L71k46q7l59p23L33L66K01k45l59k61
1725g14r6K72O76K75k56j09k43L24K88M93j01m30l11j79J24K64j9m95m87J02J80
1746d42L38L47n5m04m82M13N06K98J12j26m50k06K78L24K04j57p89n06m2N28K77
1767c4J13j62m89q7K55Q58M31k14n57l42k9N21N61M8l86q58j52J49N52L63k59
1788B82o51m64j76N28O84L00j39n85k39K75P10M62j68m65o21l59M48O32j16j92
$$ y = [-1001, 32, 1332, 704, 539, 535, -20, -300, 518, 1189, 311, -238, -101, -460, -1038, -222, 475, -274, -926, -584, -456, -571, 490, 1030, -20, -336, 286, 632, 377, 863, 854, -73, -565, 85, 29, -280, -80, -308, -764, -1014, -129, 202, -60, -68, 18, -160, -145, 787, 985, 287, 220, 168, 56, 159, 602, 406, -365, -616, -625, -603, -250, 238, 88, -734, -853, -165, 173, 561, 866, 368, -95, -223, 295, 666, 420, 333, -26, -749, -416, -50, 151, -94, -453, -714, -810, -538, 138, 413, 157, 48, -195, 129, 417, 910, 809, 379, 68, -111, 13, 277, 258, -237, -724, -622, -442, -104, 243, 188, -216, -698, -285, 221, 519, 631, 505, 55, -151, 127, 451, 655, 498, -291, -797, -839, -311, -34, 79, -83, -572, -659, -404, 454, 885, 671, 114, -228, -257, 264, 825, 873, 487, -371, -523, -374, 178, 541, 282, -369, -833, -1009, -481, 203, 503, 364, -221, -460, -185, 525, 987, 819, 354, -267, -626, -178, 454, 338, 146]
1808A46m17o07Q0Q25L30k41j85m94O4L12O70K71j76n50k47k2N73M76r7o89o66
1829f44l6L51L56L19l59n14k56K41N34N00P2l58p24K03N62K50K51l80n44n07L31
1850c52N30L29j98l72n86l54K87R86J36k15l44l3k80P81M95j44m20l38j58p1N55
1871B34M96n55n19j98R3O8O38K60p52l00J21K43R3O89J59o69m33Q5M85K63P0j17
1893D54p81l63N23L23j62n7K2n24M3N05M07k66k89J54q7J11M82Q9m03m2Mk77j24
1916b58O51j14p19P6K41j90J71M98k6o54k03N41J47N0M21k92p50J43O20O7k80
1937A40J95l89m40j33Q07O9m35J02j16m82M64P22J08n25j5O9m74N38O57n21p46
1958d05J23L41l42K59M99o94l38K61M93m62K04M76m86m95P23L69n71J37N27n32
$$ y = [146, -271, -878, -798, 27, 357, 116, -69, -563, -499, -187, 483, 754, 578, 28, -219, -241, 332, 808, 711, 22, -644, -680, -329, 27, 346, -13, -527, -783, -542, -8, 492, 564, 206, -518, -315, 247, 497, 748, 368, -176, -683, -352, 178, 507, 309, -63, -649, -1003, -716, 270, 406, 191, -153, -186, -466, 315, 810, 666, 246, -92, -250, -321, 234, 730, 175, -344, -542, -449, -381, 257, 517, -235, -535, -414, -171, -78, 611, 770, 101, -332, -247, 238, 501, 571, 454, -327, -690, -167, 156, -6, -63, -41, -565, -522, -17, 390, 124, -165, -11, -98, 13, 495, 584, 181, 139, 143, -134, -258, 393, 279, -440, -364, -123, -313, -142, 356, 330, -324, -527, 14, 161, 211, 632, 340, -410, -267, 353, 420, 140, 335, -54, -494, -627, 180, 249, -186, -84, -200, -682, -218, 504, 612, 87, 72, 141, -333, 205, 862, 341, -405, -282, 59, -283, -24, 475, -219, -557, -296, 197, -265, -61, 415, -71, -566, 157, 526, -45, 92, 619, 87]
1978H7n27M01M55l46r4K84o17l09N90P98q56k59K97k48p3R64L19q55m33N06j6
1999F8j53N05L76q93n44P14l09R5O94j35j036l76R01K06j92M80o0r12j78J236
2019D87J24o20J39J09p79LQ74K94q51J89J53p12N4P61J03l77n6J83o54K04J079
2040G07n8q09j56K70l29K93Q86l21j151K10M50m9P5Q47p90q85M26N62q8j04O05
2061E91n46o82L38O35j86N2L10o25p72N89Q62j98m92K30l12m99O62P91k98q38
2081c88L81j10l12M87N66l41n16m7L4j47M82O26m67r68M32m4R2O06K79n69r48
2102h72M62P09k41M27p2p47m71N72P45l36l0K02n47l60O49L14k79N9k3j97n05
2123e41P32M60o32KP3m83l9O53K57o85n0K66l55j36Q42J11p31j32L19ro5N57N5
$$ y = [87, -440, -39, 416, 70, -24, 260, -357, -666, -76, 722, -134, -393, -96, -344, -417, 547, 866, 11, -422, 84, 68, -85, 420, 796, -97, -641, 73, -236, -141, 553, 418, -618, -994, -93, 113, -79, 401, 341, -571, -749, 487, 611, -9, 130, 239, -540, -537, 337, 631, -220, -31, 122, -590, -536, 225, 328, -49, -105, 78, -576, -372, 707, 649, -160, -316, -46, -375, -82, 804, 483, -668, -458, -8, -57, 18, 865, 75, -810, -384, 178, 90, -14, 591, 45, -637, -299, 336, 150, 202, 512, -113, -885, -296, 566, 368, -124, 106, -206, -705, -43, 748, 450, -388, -7, -117, -429, 58, 624, 283, -233, -280, -246, -393, 89, 715, 248, -720, -288, -332, -240, 366, 645, 76, -872, -410, 299, 58, 485, 413, -334, -805, -233, 512, 176, 146, 348, -199, -559, 90, 404, 125, 184, 161, -36, -541, 191, 651, 19, 21, 94, -389, -428, 225, 482, -203, -253, 13, -342, -478, 364, 475, -256, -388, -69, -78, -143, 414, 469]
2146D69o82k08N55j70Q9L99k47p74J25O05J62k69J22l22j78J22P36O0o02m7q7
2167a42p2J33M47j88k82k2r3j01J34L53k23k12k9P8K2J27M43k33k13j55J60R0
2189B2J77K00m74k73J38P5R9K34j37j89k46L16K85j41p0l5k47p9M49L9P4l06M7
2212d2Rj52L83Q3m37j20l2K05J74l0l7k32l1J99K34l8K1j52pk12L14J25P6k48
2236E3k28mp6J06K69L5j11j43k53J4L35L01k2l50q5L0J11K18M10m07l21k08m7
2259c73L27M22k25l42k77L4K17K57L00k58m06kK91K88K5J03m73o6m6L19P2J45
2281C32k86k13j53%K66M0l6J4k30Q9J91J73J77J0k93j48j0N2N68k18l40k84j67
2304d66J60M09K65k71m43k33K50K14M73j4l46m19K76L30K27M5j86l03k51J68J69
$$ y = [469, -213, -421, 134, -36, 53, 452, 205, -569, -444, 161, 323, 54, 176, -146, -324, -202, 534, 594, -8, -55, -142, -214, -81, 366, 178, -104, -126, -219, -320, -186, 167, -56, -268, -297, -219, -197, -70, 373, 140, -73, -228, -68, 22, 199, 399, -75, -348, -210, -135, -36, 198, 61, -128, -374, -58, 227, 86, 16, -19, -266, -345, 104, 143, 217, -89, -42, -33, -185, 198, 281, -156, -276, -308, -103, 71, 41, 4, -228, -259, -60, 174, 136, 157, 5, -2, -214, 100, 225, 301, 53, -175, -179, -255, -149, 120, 155, 44, -99, -352, -338, -3, 298, 276, -74, -159, -129, -18, 200, 610, 203, -118, -326, -373, -46, 376, 151, -191, -468, -434, -217, 40, 340, 82, -324, -326, -35, 253, 278, 381, -92, -158, -204, 115, 187, 332, 46, -167, -320, -320, -54, -14, -50, -36, -266, -177, 14, 187, 364, 374, 81, -67, -77, -25, 543, 325, -15, -299, -466, -306, 103, 368, 97, -346, -579, -329, -115, 358, 344, -2, -421, -145, 185, 412, 457, 271, -32, -283, -115, 54]
2325E4J63j6k84l35l5M51J65Pj68k08Q9j66M83J72m1l43J6l83L09K41J02j18m10
2348b55j53NJ43K36L86k84l94p8J66L66L84j02m45l27M02J80J59n2k32l56q8M17
2370G8PL1j74j02k52J2N21k5n1q0O9J0n7L80J89l82j14J04p0j67K79M8m93M3k5
2395b21o2O0L62m5k51o6J46n0M29K02j31m64P2J9J35L3J22l25k72j52N74j9k28
2418a32J41l54k50M74N07k27k7j21L4o8L10l9j37qN9k68j08J77J96l00o6J02K1
2441h4j92K47L56k15l21K10J67q7Q2L45l69l79L07K40k27J2l6k56l66M30J52K8
2463D4k29K16l46J00N15R7l37Q5n8q1j0M24J8n96k3K7J01p2M64k53o71J66M30
2486A1j36M8O3J73m10Q8N45k55q3K42k2m34q5M38r0k21K1M4l94J8N62pj88o3P7
$$ y = [54, 217, 201, -83, -418, -453, -2, 163, 170, 2, -206, -117, -283, 200, 372, 331, -12, 4, -379, -70, 171, 273, 155, -255, -408, -403, -260, -24, 362, 78, -316, -394, -228, 138, 522, 420, -25, -352, 50, 230, 389, 337, 105, -251, -339, 78, 85, 116, -58, -160, -412, -400, 121, 96, 45, -35, 34, 44, -13, 367, 556, 174, 60, 164, 94, -73, 206, 254, -239, -196, -221, -283, -223, 139, 94, -157, -223, -77, -127, 302, 504, 373, -91, -19, 0, 135, 168, 290, -35, -307, -459, 115, 96, -132, 9, -345, -595, -121, 386, 159, 132, 11, 45, -23, 287, 248, 111, 103, 162, -106, -214, -37, 159, -141, -207, -105, -84, -276, -29, 327, 112, -209, 1, 168, 81, 163, 508, 139, -240, 67, 307, 80, 92, 56, -200, -566, -136, 16, 44, -185, 31, -315, -215, 300, 397, 60, 145, 87, 6, -4, 420, 438, -158, -181, -154, -53, -125, 339, 86, -585, -419, 11, -125, -77, -14, 159, -251, -163, 382, 127, 44, 286, 264, -170, -255, 183, 93, -128, -107, -63, -457, -439, 123, 116, -72, -135, -58]
2511e8l25M96M05l21k86P3J4j04L52M01l70o24J58J33j08N9J89k08l84J91M48
2532A31k10L4N67o04j90L94L71l45O4R3k07k09P2L63j42j91J3j70l87N41K49k32
2554Ej62M50n61L9M44J48N3m52L5j18q3N50O3l73n25K85pj14N65m1n81j70N78
2577B8J46R9O8n4j74k85L16O7k41K65k0l00k57L87K68l58j18J03l71Q6M18R6k05
2600c6N6j1m6j0L22K05m50nR5m35M4M07J5m14J39j19R5N5N59m81k68O0N8K28K40
2625C03R9k06l72P3M23J9k18R2l72k16J6M60p6o0k0n8r4J70J09l1j2M9j06k09
2649b37L86L1mj08j41j1k05L01L4Qk90m8J70n2K82N7k05k50N00j34pK03O5k59
2673H6k21J38J42Lo3r3j83k7J63l4J40l46K20k9l9K68J58j59j38q1N2J23N5P0
$$ y = [-58, -383, 113, 518, 197, -89, -16, -2, -106, 246, 647, 277, -347, -189, -56, -164, -105, 84, -124, -508, -317, 131, -79, -45, 522, -82, -272, 122, 493, 148, 212, 305, 98, -111, -39, 324, 182, -9, 4, -166, -553, -12, 237, 5, -157, 293, -268, -229, 215, 363, 416, -36, -1, -119, -202, 348, 411, 38, -487, -202, -209, -323, 242, 201, -380, -550, 28, 174, 273, 341, 287, 113, -172, 144, 211, -30, 235, 215, -85, -342, 45, 313, -45, -163, -60, -431, -345, 73, 169, -36, 20, 9, -37, -47, 275, 480, 30, 25, 120, -315, -271, 136, 151, -263, -124, -243, -148, -93, 466, -15, -283, -223, -165, 63, 303, 402, 196, -176, -103, 320, 339, 121, 213, -159, -375, -359, 101, 25, -35, -55, -113, -207, -37, 72, 41, 29, 78, -28, -237, 149, 180, 176, 68, -73, -84, -289, 12, 46, 54, -236, -284, -114, -166, 116, 173, -32, -282, 218, 84, 77, 280, 345, 86, -135, 3, 145, 148, 85, -8, -191, -218, -55, -89, 51, -295, -75, -104, -143, 125, 283, 124, -14, -95, -43, 80, 135, 205]
2697B05l32K5lR7j47J71K7j56L6j55L15j33L78j70k32P2O3p8J09K1k00J30o9R1
2721F5K71k26n3k09j13J27J77n5r3j3K6K6KL09j7j78k42K70j16J38J63j89oj16
2745e2k3k5K79q2j12k04P3Q8K17m7Pq6j62J67J48nj46R3k68lNJ58R2r3q8m0n4
2772a63MM13j42k36q2P0J94K09P2k04j86o1QJ16K29r2l08r1R4K16L6N8k02j66
2796b14R5P8O5J88q7j32k8j25R8J22J17j1k69j05J17J36Q8N8k58j24MJ75J09J24
2820B21j25p2k42J50J03J89l7j32r0L3Q3j7l2J75k74k75K59J41n6o7J53k88J5
2843a85R4L66j22n4l34R8j1K62J62j33p5j87j56K84N9L3J08l58k3R8p7L78o2j27
2867C8O3j75j32K91P5j37j28p2J77j57M0K05N7k09j86J91J26K5O9l82M2K38j42
$$ y = [205, -127, -102, -105, -8, -155, 16, 43, -113, -77, -232, 83, -50, 328, 158, -74, -2, 61, -17, 92, 113, -87, 43, -26, 65, 336, 110, 57, -152, -265, -138, 39, -16, -109, -122, -96, -70, -68, 241, 224, 46, -196, 74, -42, 96, 259, 70, 64, -52, -75, -100, 179, 97, -15, -219, -146, -58, 159, 112, 119, 33, -129, 38, 186, 181, 35, 128, -140, -143, -138, 20, 112, 19, -69, -109, -163, -159, 254, 112, -124, -206, -136, 58, 267, 339, 135, -51, -112, -104, 12, 241, 149, -159, -250, -156, 60, 96, 154, -48, -214, -119, -41, 24, 212, 125, -7, -35, -160, -62, 60, 177, 166, -103, -208, -91, 45, 133, 191, -67, -191, -187, -12, 97, 221, 96, 24, -218, -68, 35, 224, 187, 55, -35, -2, 81, 64, 32, 207, -67, -342, -83, 58, 2, -65, 88, -200, -185, -91, 275, 153, 99, -235, -137, -148, 114, 276, 143, 68, -119, -275, 9, 68, 101, 209, -149, -172, -74, -151, 227, 165, 38, 101, -74, -206, 85, 160, 23, -105, -177, 0, -157, -117, 88, 145, -64, -250, -59, 67, 92, 161, -221, -179, 59, -83]
2890h3J69J52j09k54j94M13K4j86P0j58Q6j72Q9L03Q5l29J67m6n9J53j8J47k88
2913c8N7k9j13K02M4j79k4K6J04n4J21n3j67O6R2l9J13k08K03k64N5K17n8j35
2937f1P2l6L4j71L07r6m5k6P9j07j29L98o3k31k8J45j82O7L04k34r7J33q4m1Q8
2962dK17j37k16J77Jn2m5K54j51n5L2J33k04p4J5K34n12N77J70m20m5J20p0j07
2986a62J28R4p8j27J82j23j37J11L00j47r4m3r5J76MK35l16q9N4L18l27K39P0
3009A73j73l2Q1J60k44J84j3j74j97L26j83N2n9J66k61N6K73J0k75K04pj86P5
3032d4J72J01k27J11j28J5QJ24k4j89l0O7M1pJ9J17k10n3K1J28J03J52o7l07o5
3057a72L42j66J08l8j12j43m2L96j49k05J86K3j07j40M82m7j67J49k26r1K16J07
$$ y = [-83, 86, 238, 129, -125, -319, 94, 118, -68, 2, -156, -70, -242, -153, 150, 235, -94, 73, 27, -32, 121, 103, 250, -38, 19, -10, -123, 79, 123, -56, -80, -54, 50, -4, 117, 64, -103, -37, 55, 16, 129, -79, 124, -140, -85, 132, 74, -61, 11, -25, 9, -162, 145, 49, 4, -22, 57, -50, -179, 219, 156, -75, -103, 42, -140, -73, 231, -3, -100, 33, -51, -92, -4, 213, 76, -140, 37, 38, -14, -59, 195, 44, -11, 21, 154, -50, -124, -109, 125, -387, 190, 360, -60, -105, 15, -55, -162, -34, 60, -18, -145, 37, -86, -223, -112, 188, 41, -53, -96, -191, -15, -11, 224, -92, -181, -127, 191, -136, 103, 173, 0, -32, 49, 209, -35, 149, 136, -38, -235, 91, -92, -40, -99, 67, -194, -138, 135, 145, -130, 74, 67, -119, -44, 128, 229, 2, 113, -15, 0, 8, 132, 108, -81, -111, -44, -3, -10, 9, 126, -84, -137, -116, 12, 115, 267, 200, -107, -172, 170, 4, 112, 74, -38, -181, -223, 173, 24, -181, 5, 28, -79, -219, 263, 216, 49, 198, -28, -119, 97, 204]
3079B04j23j55j68J76j22K07jj3q7lL2m4k8L59r3l95J39K45j55N7J17m4k27O6
3103e6Q7k0J13j02L1j60K6K5J83k01J23l02J64K41P7k18K30j14j60j03K92M0o7
3126A29j51j04J80j85N8Q4L1j20kJ06j47K93N8l15M8L4J76o7P0r2j47j9L7K16
3150A71k19R7j97J8j6j04L20j55J35j44j2NJ68J15j45J72j29r0J58p2N3p9qj22
3174h0mJ48p4Q9k42K0Q5o1K8L58k98j2K4j4J07l9K3M2m5n0M5j5m4o3J13j20kJ43
3202F2j66J47o2k7k8M2K20j68j33J36J05k82K67j18k2q5R3j19J15j69J96j49J60
3225A5k47K31rJ02K7No7j05O7K5l7O0k07p8J97M1R0j9j94J29r3Q2J35r4J45l34
3251a33J25J3QK48q6j45k5kj5M2m7o2j74K41k1J39j51m4J60k51J23N5K67o1j09
$$ y = [204, 81, -74, -242, -66, -188, 19, 18, 5, -82, -85, -53, -97, -125, 234, 141, -254, -115, 130, -25, 32, 149, 105, -122, -56, 31, 11, 124, 22, 53, -107, -81, -56, 127, -74, 49, -253, -89, 152, 229, 11, 241, 127, -33, -136, 156, 196, 129, -22, -126, 54, -131, -73, 11, 42, -78, -80, 26, -121, 172, 230, -85, -37, -3, 173, 106, 176, 84, -63, -82, -45, 171, -48, 49, -148, -130, -146, -250, 70, -85, 50, -94, -106, -101, 67, 182, 37, 209, 80, -10, 148, 76, 129, 50, 42, -80, -84, 64, -10, 79, -163, -143, -58, -119, -91, 267, -31, -43, -19, -33, 74, 35, 58, 100, 55, 5, 50, 35, -9, -72, 41, -79, -81, 62, -104, 43, -19, -46, -74, -32, 188, 20, -113, 23, 128, -154, 113, -5, -27, -112, -19, -138, -23, -192, 4, -145, 15, -232, -1, -10, 92, 119, 124, 57, -48, 19, 44, 7, 67, -140, -218, -21, 20, 110, 91, -103, 26, -67, 15, 150, 56, 201, -133, -8, 5, 13, 261, 175, 30, 5, 3, -12, 30, -17, -79, -253, -12, -33, 106, -45, -89, 71, -180, -57, -2, 265, 204, 95]
3276I5j55n0J48k4J06k01J4r7OJ95n9J62j26r8k2M3j8K99k70K0K8l3K40P6j51
3301A28M4k08J6N2M1n8j85J79q4j4m6K49j50p9J96l5n3N0K44l8k31N0kq2p6J59
3327F7l7k06kK0J55Q7k52K00k04JL65j33J29k23pj4j71M8K91q4r1n0rQ4Q0j02
3353e8L3q9K8P5Q5l1M4K3o0j00oO4J00j18l7JP4j74J51k6J8j88J37O8L8J41j31
3380F2m4j1J17q2J14l3m4j05n8J9J07K23j92r8n0J53k63J78M9j51J72n1l8q8K19
3405A05k8k20k8L18Qj53J23j46r4J50l9m4m4J76J3j59l9J00n9J38R1j67p3J19
3429D8L3oM3l2j20j66J12K64j46k39J04K04j36p0K05j83m3J23J03k37J99J8j79
3452a01P1O0J63k06j46K98p0m7L5j02oKJ5j25Q6K12j45Pl9J07j06Q8r3P1j0J25
$$ y = [95, -60, -110, 38, 14, 120, -81, -67, -164, -158, 37, -22, 140, 14, -84, -106, -63, -81, 218, -52, -32, -4, -37, 203, 279, 128, 172, -36, -20, 32, 73, 15, -170, 9, -75, -89, -135, 114, -36, -115, 81, 46, -7, 43, 287, 249, 18, 68, 66, -16, -92, 67, 30, -176, -178, -158, -3, 84, -168, 32, -172, -171, 194, 61, 190, -33, -40, -54, -225, -177, 114, 30, -61, -111, -120, -36, 44, -58, -25, -114, -86, -11, 74, 43, 87, 110, 50, -50, -56, 8, 108, -10, -47, -46, 28, -146, 5, -21, -3, -191, -54, 14, 52, 193, 62, 18, 7, 124, 42, 156, 123, 79, -26, -84, -65, 42, 265, 73, -25, -75, 78, -185, -7, 42, -109, 63, 12, -26, -114, 105, 77, -143, -171, 147, 155, 2, 125, -21, -115, 35, -4, -48, -92, 84, 97, -62, -101, -1, -60, 78, 169, 2, -71, 48, 81, 75, 118, 86, -34, -200, -88, 176, 30, -209, -105, 99, -37, -107, 98, -85, -128, -5, 98, -139, 60, 78, -101, -30, 30, 193, -13, -159, 139, 69, 22, 57, -45, -51, -49, -34, -159, -73, 139, -6, 1, -38, 69, -37, 51, -42, 29, 19, 144]
3478A44k32K14n3j59J36j96J74l6j84J22J6r7Q3K9N6Q1j0j41R5j43L1M3R6Q8j67
3503a0M9n9p4K06O1l64O1J36j95J29O6J08k48J19j14J42m2P5m1q0K1L2Q4J09K2
3528A93k12j34k0J11L7l7R0Q7l19K72j23PK4J23j41N3J8lO1p9J37k87m1J88pk5
3554b7j27J21j31K9K22J01p4o2j24J32j4O3Lk16k4J17o4Q5J55o4j02j85J68J5
3578cQ4k27K36k28n6R8J00O1l7j74R3j01K50j43J16Jm8j78Q7J3L7J37k51J91k05
3603a47J48N9q3k2J1M6j39M8K7J13q3r3J95k26J55p7J60r8l6M0ml3R6r7o4J12
3629HOK8j45K75l88J77P6n1J11k5j63M7j36K11N9j98K03j79J68l6o0M6n6j5m8
3654h5J87k27N5J98m4j67K34k04l8J95KO8j50j6j30R9k4J87j70J4J3K3k8K4k2
$$ y = [144, -88, 126, 73, -86, 50, -146, 28, -8, -192, -70, -54, -151, -68, -39, 17, 98, 88, -53, 42, -101, -70, -27, 69, 157, -10, 39, -20, -94, 112, 173, -191, -130, 6, -189, -60, 6, 114, -134, -15, -129, 13, -29, 46, 5, -75, -54, -22, 62, 171, 193, -19, -153, -173, -62, -25, -62, 28, 115, -204, 68, -55, -48, -24, 99, -42, 11, 29, 26, 87, 8, 145, -142, -183, 5, -2, -27, -154, -33, -164, -135, 87, 188, 114, 52, -72, 60, 46, 109, 112, -104, -128, -11, -75, 10, 165, 101, -1, -186, -18, -3, 81, -146, 90, -138, -194, -96, 4, 65, 28, -146, -53, -154, 96, -47, 69, 70, 22, -156, -69, -56, -19, 118, -133, 58, -147, 1, 60, -23, -45, -34, 12, -127, -79, -52, 61, -22, -115, 80, -146, 9, -68, 92, -6, -42, -2, -6, -39, 57, -40, -104, 8, 14, 42, -103, 172, -216, -39, 37, -14, 97, 72, -91, -44, -180, 31, 90, -108, 95, -84, 84, 48, -12, 34, -22, -37, -85, 102, -125, -70, 128, 84, -83, 151, -53, -91, 104, 106, 174, 24, 8, -122, -23, -47, 140, -30, -16, -3, 20, -8, 16, -6]
3679fN0j33O3P1j44Q0m2m3O2J06P0k18j1l8J73J7nkM3l8p4P0M4L5J39l30k8M5
3707d4L2j93K06L2p3j6j8lJ68q3Qpp2Q9p7p0K76l01J60P2J16j89p8J9lP9k0J2
3735B2K8r4n9J45k05L13q5q8l2J35p6P0j64M2J92m3M3j76j53K73j50j6l8R1p7
3760a02J48N1j21r2N0K4ql1l0K02m4j9j1jn5M9Qn0m7J16K10j84l4k63K21Q4j07
3787c6Q3k0q0l0J28Q7r8Q6j82J9K22j37J9K7p4j02J23N4J2j67j44K48oq8m4J92
3813I2M6j65n2O2P9l5R4p4J1l4k17L07o7m8J45k38L1J53j5K6p5k09R1K9k3Q1K4
3840A9J40j24j57J02O2j03N5j39K05j02O3p9J42j13j35J84j01J68Q3j33r7j10
3862a70J24J28L0r9J17k41J97j52M2J0M2o2mp3rJ96No0r7O6J35j09J8J13j85j6
$$ y = [-6, 44, -89, -26, 45, -99, -19, -61, -104, -42, 64, 134, -84, -95, -133, 40, 57, 52, 50, 93, 55, -19, 51, 95, 130, 269, -61, -89, -44, -12, -205, 1, 33, -40, -56, -74, -77, 91, 8, 16, 9, -63, 26, -51, -121, 155, -146, 14, 86, 202, 13, -65, -46, -49, 30, 10, 22, 50, -44, -103, 42, -163, 150, 65, -23, -55, 80, 4, 74, -90, -48, 144, 101, 144, -32, -185, 88, -62, -78, -116, -25, -102, 46, 97, -24, -116, -66, -42, -50, -81, -111, 91, 47, 28, 17, 16, -39, 10, 18, -32, -79, 37, 247, 63, 29, -234, -13, 71, -36, 47, 27, -53, -83, 45, 132, 34, 120, -62, -43, 179, 42, 61, 88, 14, -88, 35, 89, 101, -66, -210, 38, 32, -56, -100, 92, 138, -27, -79, -17, 62, 27, 121, 47, 58, 24, -193, 114, 47, -1, 144, -94, -63, 90, 75, 101, 26, -183, -92, -63, -86, -5, 19, 159, 35, -122, -20, 42, -61, -6, -145, 60, -42, 21, -58, 84, -29, -164, 20, -81, 87, 170, 37, -60, -170, -46, 82, 112, 13, 130, -111, 86, -66, -24, -14, 28, -34, -38, -111, -120, 76, 81, 21, -76, -10, 125, 16, 34, 147, -38, -54]
3888e4j1J09j06L6j7M0m4O2L2j14j70K68j5m2lJ56j28LJ61k99J00p5L8j08L61
3913A80j53k43K32n8N1j58J42j52J84oq4J23l9O5R4j92RJ17p2l7%l8j14N0l1J76
3939D6n3j14J85J04o1j9j03l0M3P5P1k84J87p1r0M9J55Rl06K52j26o3k9K73q0
3964B0q8J76j52mJ18p6N3n2r2P9j49J73rM9j99K28o9L1L3r4oQ9Km7K34j06j31
3991A1l6j05N9p5L23j06k4j32j74L36k12O9j9j19J07Q2K00k64j24K69M3J25j85
4014D9jN2j20j73J48J90k40N8J6K4r0J31n4J18n8k0j3J6mJ45k44m3j9J73O0O5
4040A66k40J63q6j24J85k60K15k2M4j31O5j31N6J82R1j48l6O3K4k8J3j40J63r8
4064a4LN4P3j13K3k65J35J05O3j76N2Qj77P7J68q9J06l2k4J50j33RN0j7N6j31
$$ y = [-54, -65, 44, -62, -26, -43, -3, -47, 15, 47, -67, -237, 31, 16, -26, -29, 127, -1, 2, 163, -136, -36, -111, -73, -181, 180, 27, -216, 16, -42, 9, -149, -7, -159, 25, 19, -65, 58, 19, 84, 178, -14, -5, 112, 40, 3, 3, -35, -149, -99, -130, 46, -7, -121, 64, 168, 107, 88, -15, -45, -2, 73, 144, -140, 47, -24, -114, -65, 90, 99, -207, 45, -81, -144, -173, 100, 20, -68, 108, -44, -48, 70, -6, 47, -5, -97, -18, -167, 6, -3, 46, -153, 75, 6, 37, 70, -24, -30, 59, 61, 14, 248, 142, 11, -25, -130, -71, -146, 177, 71, 47, -85, -259, 77, -135, -66, -85, -204, -97, -15, 185, -79, -203, 66, 109, 234, 49, 48, 100, -20, -193, -45, 145, -95, -37, -21, 3, -87, 44, -10, 108, 50, 30, 17, 33, 29, 174, -70, -113, -132, 41, 101, 166, -74, 89, 3, -121, 64, -196, 19, -3, 41, -90, -25, -156, -100, 82, 173, 25, -11, 52, 76, 48, 61, -79, 84, -14, -11, 43, 116, 3, 26, -239, -104, 1, 64, -112, -60, -52, -229, -152, 16, -73, 33, 1, -23, 127, -6, 3, 53, 36, 92, -39]
4090c9J91j08l6r2n7NJ61q4Q8J4M3j51N1J03n2M9P5j48l5k2RQ0j65R8j2M0j74
4117a68J53J91k29M9l9L2j08M4J79j48o1N1O9o8O8J15j07j47J15K6q9Q0J5j0J0
4142B3j22J67j6j54K15lr9O4o8p6J06j52K8j38K78l8j13M4m3N0J53j22qJ29l15
4167b10J24J74J00m3j4j37l1p0K03n2q0o0P9N8r1P0m0l9j3nn5K85j05p4m5l7J13
4194EO7J51r9k45P6J25j71R9O1j2j23j6j0K25p4j90K1OJ49r2J64j36pO9j15Q2
4220A0j50J23p9N9k3Q0j3O4j39O1R7j69O5J26KK5n4m0J9m5R0j92K4K7j24R2o8
4247a32J71j1kn%J8j4M9O7k41K09l6j0j39L6M0j73K3k4Q5R4r2J6R2j3Opm7J9R8
4277G7J0n1J65j51M1l6j10MlL6p2K60j77j71R9j36J32o4J31j01qJ69k0oQJ2P5
$$ y = [-39, 152, 44, 8, -84, -141, -136, 25, -59, 29, 43, 86, -65, -14, 89, 37, 86, 161, 13, -22, -44, -35, 45, -120, -22, -34, 6, -168, -15, 176, -53, -4, -43, -11, -119, -75, 104, -44, -105, -54, 15, -53, 15, 130, 23, -124, -9, 17, -72, 8, 23, 13, 23, -99, 68, 52, -102, 113, 110, 11, 75, 7, -69, 37, -115, -87, -225, 53, 15, -98, -54, -97, -47, 106, -16, -24, 105, -210, -86, 88, 188, 145, 131, -6, -37, -107, 96, 44, -36, -96, -17, 41, -50, 20, -20, -59, -72, -77, -132, 153, 48, -26, -71, -108, 5, 72, 223, 124, -121, -45, 80, -91, 8, 69, 57, -66, -82, -92, 133, 59, -131, -110, -104, 45, -47, 117, -19, -26, 43, -72, 10, -140, -17, -96, -37, -60, 20, 7, 71, -68, -7, 90, -79, -14, 112, 114, 139, 85, 45, 64, 19, 109, -83, -59, -32, -156, -64, -132, 39, 28, 26, 21, 21, 39, 25, 74, 141, -100, 109, 73, 63, -76, -40, 0, -173, -150, -174, -89, 5, -87, -71, 21, 8, 14, 7, -40, -21, 77, 87, 36, 201, 50, 91, 55, -55, -51, -54, -18, -90, 170, -7, -178, -79, -215, -83, -147, -16, -117, -125, 44, 24, 18, 26, 38, 113]
4304A13j08L3j68J87j25N2L6KJ06j02N3l2j43O8M0j45K84j83lJ6Q4l8L5r0K05
4329A77j91m2p3K35k0l7j30K4mN8J71j72o0j02K28J39k69J37k4n1l6J06q6J10
4353H8k41J70j02J76k14LJ19K1J31j31R1j44O3j0j16K0r8K06r4mK2J5q3p1K37
4378E4j57K4J75k7j68N6L1lo4n6J82j02K19j01j43m7J83k01J30m3J00J9l0j22
4402i1K96k70l0K13j92L6J47j47K8J01QJ9m3J0N3j15J4n6O8j68J88j88J38q2j25
4427a88K01n7K00o5j33JP9j8m7R2O8rj03Q2Mj37J08J47k02l5n7O7P6n4k9o7J03
4454B7k33J70J39K2j20j47L28j56O0q7k9J51j74l6Q5j55O8J48Oj60J90j23P1j48
4478a03j52J49m2J27Jm4J33n5r3m5J95j80O0J80O2j66j20k8J38j52OK1P6p2J38
$$ y = [113, 5, 38, -130, 57, -68, -16, 20, 22, 128, 26, 79, 47, -96, -28, 12, -133, 151, -32, -35, -19, 65, 27, 62, -28, 177, -14, -56, -129, 106, 86, 49, -81, -57, -61, -3, 168, -4, -64, -166, 62, 201, -68, 69, 45, -6, -42, 64, -22, 88, -153, 17, -85, 91, -123, -120, -1, 20, 151, 20, 111, -33, 30, 20, -96, -76, -174, 32, -62, -66, -44, -29, -112, -183, 54, -103, -79, 96, 69, -99, -43, -12, -15, -79, -135, 47, -55, 164, 63, -80, -127, 56, -145, -15, -58, 42, 61, 31, -91, 205, -65, -95, 118, -74, -38, 109, -38, -10, 91, 99, 118, 75, 85, 138, 23, 37, -19, 49, -119, 69, -119, 19, -63, -188, 13, -44, 156, 91, -42, -41, 38, 20, -27, 65, 133, 124, 21, 103, 107, -30, 78, 225, 23, -12, -69, -2, 74, 20, -9, -76, 27, -206, -36, 103, 125, 5, -142, 186, 30, 90, 3, -26, 125, -49, -85, 0, -155, -87, 61, 67, -93, 97, -26, 45, -103, -255, -106, -148, -21, -20, -64, 69, 14, -79, -124, 71, -109, -49, 131, 193, 27, -93, -121, 17, -135, -129, -108, -32, -104, 34]
4503C4j24r6Q1K4K16j21j15k2l3P2O2R9pK4j00Q7j8rM4j11N2j3j8J71k77L3om9
4531a20rq3K17j4J23J8j76K06j30k8K0j08o5J22J78j86j14J81n0q3J17P8l4k5
4555C5k3j9j6J92k76PJ97r2q7Q0J3Q6k14K15Q8j82J40m8r6n8L2q8J28j05M0L5
4581a6Q7j43J19K3PO5j79Q1j41K93k58J18k04M5K18j69o9J16J8J9j66J57j48J00
4605b7K06k28n2j4J29j32J60n5K3OK05k89m4J00k3nNJ00j4K4l7m0k5J32m3j10
4631d8K3Q2jr0N0Rq7K4R6K5j49Q2J46j99J28J8k63O8P3M7loP1m0j5j63P0J33O2
4660A43j13pR9J15k98J79Q8k88Q6j37J52p6K41j42L5k6r6K09q7j59N7O4M0J1j27
4685c7K08l2j2j07j68O5N9RJ31K2j67j7J1j69K31K0p3J7r1J15J1k49L33j86J50
$$ y = [34, -90, -186, -105, -81, 135, 14, -101, -123, -156, -84, -22, 77, 70, 94, -6, 81, 63, 54, 98, -13, 39, 26, 8, 179, -98, -65, -71, -120, -129, -212, 5, -9, 114, 132, -44, 162, 32, 4, 24, -84, -149, -27, 151, -35, -149, 32, -18, -101, 16, 94, 60, 35, 12, -7, -23, 169, -107, -100, 97, 5, -82, -2, 11, 97, -117, 98, 186, 4, 144, 96, 0, -58, -26, -114, 14, -91, -51, -16, 71, -72, 47, 70, 77, 142, -37, 44, -97, 196, -62, 56, -148, -103, 115, -54, -123, -7, 11, 30, -136, 21, -127, -27, 179, -49, -101, -115, 14, -118, 42, -13, 10, 16, 221, -68, -112, -12, -35, -40, -35, 65, 51, 75, 38, -2, -27, 105, 62, -48, -25, 57, 56, -34, 16, 25, -62, -38, 58, 83, -66, 16, 162, -37, 91, 109, -154, -86, -13, 34, 31, 25, 96, 56, 41, -122, -52, 81, 143, 30, 23, 122, 237, -61, 118, 206, -82, 4, -133, 19, -57, 184, 42, 77, 51, -45, 164, 77, -82, -25, 39, 79, 90, -37, 171, 139, 127, 20, -148, -83, -24, -15, 116, 138, -29, -46, -35, -204, 27, 47, -26, -9, -100, 15, 26, -223, 110, -76, 74]
4710G4K2p4n0l4m1R3M1j22lJ34j40K30j09O0q4j20J15NJ12j29Nn8N1j09jL55j99
4737B4J35l12L92k75P8o1n1J14k72L92j83K24k69j0J18LK4ok45K23j2n7J77q9
4761F2p3%j71O0J03J14j39N1M8p6j27J37O9q1J75m3j97K25j04o7L9m7j00J19p
4786c0j27Q6J77j36L6n2j42K09j88K82j5k00Q9J2l1J14o6o1OM4N1K6q9j28L9O7
4812b7J14j93J26q3j3J22j32MK01q1M2r5J22j85J37qq5k7P0kR7q3p8K1O2J8O8
4839A12j57J65j9k53%J75L8l33J05K25j81J14K6k2p3o0ML9P0J51k6j54J59JO5
4864A71r4J12j20p9J2K0JR5k3j25Qn4K65k16R1P5j13j36O0J01r3o2J88j36R3N5
4890I6N4o1M1q9j59L17k0j60Q7n1j48K2j0k0J37q0N1O3j82J39j20l8J29j0m9N0
$$ y = [74, 96, 22, -28, -62, -103, -10, 31, -91, -94, 40, -100, 130, 21, 81, -3, -123, -8, -3, 109, -20, -15, -73, -22, -131, -132, 223, 24, 159, -153, 239, -36, 42, -19, -70, 44, -228, 164, -19, 205, -64, -74, 44, 47, 71, 65, -180, 43, 31, -26, 151, 62, -11, -11, -182, -122, -19, 95, -44, 7, 55, -21, -148, -11, 58, -23, 152, 109, -88, 137, 33, -34, 5, -42, -142, -23, -30, -157, -71, 106, -30, 6, -46, -188, 21, -167, 115, 100, -100, -11, 1, -30, 84, 18, -43, -37, 7, 58, 84, -5, -133, -94, -27, 87, -106, 20, -63, -76, 46, -86, -82, 119, 38, 80, -15, 107, -78, 59, 51, -34, -61, 9, 7, 104, 21, -57, -36, 26, 44, 112, -45, 120, 101, -152, -152, 23, 61, -272, -167, 58, -123, -9, 17, -5, -78, -138, -134, -95, -25, 126, 100, -54, 105, 106, 171, 77, 189, 69, -10, 2, 22, 23, 118, 95, -30, -22, -76, 189, -27, 64, 139, 26, -110, -50, 51, -42, -104, 84, -52, 41, 96, 150, 89, 130, 41, -118, 199, 179, 19, 106, 55, -93, -71, -81, -101, 36, -44, 7, 70, -112, 27, -93, -131, -2, -12, -61, -11]
4916a1L6l9J8n2Q4k2k20K53J4p3N5j0p9R1K31k44n9j2QP0j0j09L1K08j21k3k9
4943a4o2N4q2J16K0pq6K02r0R9n1k02K16q4j42L82l15j02m1K35j85K99r1o7K1
4968B3j15J4M5R6k50L98k16k4J57o1k01p6L68j78o5j06K25o3J15n5j41J14k7r8
4992a21R5p5K15l6j63J89j07r7O9K73k71QN8j53J78k70K74p8l2Q4o2K18l51K56
5016A01k07K0J46r1m2J84r6j56J51j1K9j30K70k41n2N5q6R4J08j6R8j97J55N4
5040A40l7O9l9j3j19j4P3j15J29j35j4N5kj5J20M8j89o5J37j18J23p%On5LJ4O1
5068D1R5r8q9J3N3R1j64J51p0MM8m0K6m1j0j9J9RK9q5J71k06k2K7K39j27r0r8
5096a43j11J97O8m1J36q2J6L9k3q4Q4L3j34M9l0j83K13R3r2N1K1j97J19o7O0J37
$$ y = [-11, 25, -14, 4, -48, 36, 14, -206, 47, 61, -12, 43, 33, -46, 45, 276, 32, -27, -39, -31, 39, 29, -80, -49, 159, 38, 15, -14, -76, -22, -104, 12, 32, 25, -61, 141, 51, 150, 99, -103, 113, 29, -113, 269, -46, -148, -189, 46, -139, 160, 69, 2, 23, -92, -78, -33, 63, -187, 211, -5, -29, 128, 67, -134, -210, 158, -20, -85, -191, 34, -29, 86, 31, -110, 4, -23, -121, -26, -101, 114, 78, -85, 104, -3, -100, -31, 242, -29, -21, 37, -116, 62, -208, 66, -12, -44, 40, -22, 196, -155, 101, -106, -86, 60, -31, -73, 111, 15, -141, 10, -1, 28, -102, 168, -73, -125, -70, -156, -62, 46, 30, 128, -69, 86, 140, 103, 172, 133, 120, 1, -13, 60, -55, 74, -61, -75, -20, -22, -37, 83, 131, -58, -123, 14, -104, 19, 12, 12, 18, -37, -34, -20, 41, 136, 38, -51, -38, 15, 106, -58, 93, 23, 27, 75, 35, 61, 20, 10, -9, 10, 19, 48, -37, 134, -72, -94, -67, 172, 45, -45, -143, -254, -57, 11, -30, 106, 24, 40, 79, 56, -28, 56, 89, -45, 4, -26, -209, 4, 97, 5, 56, 77, -120, -1, -68, -8, 129]
5122A29n6l1o8M4p5R7j84J87R8j10j48J4Q0k0J39O8l00P9lJ7N7r8rJ22o2J21n6
5149C2Lk6J01r0n9oJ26j28Q2j02n1J45k4J55k22L6Lo6N6O0j32R3o5M4L9o8n4R8
5177b0J25o2l7P6j19r2K08j06L3Pj54Q2q3J20j25J98Rq4o2J24Q1j87J26o3J17
5202A12j86m5J68p4J77j07j00kJ38o1Q1j25L7n2L5p8J71j79L5j3J11j25J2r3K82
5227A19l0k10L26j20o3j28L9J69m2k06P9k7J03j03J48m9qL9r6O3K6j29Q3l0lL6
5253a4NJ58j69J13j43J5J24Oj12l9L2l3J09j85J02KP2j76J71k5K9j40J81j42J08
5278D9p6l2J84k99P0K6oJ13oN3j05Q3j18J01j33j01K15k1K1j22J12j90J87kJ6
5303A9q7R0k3l6o2K62j11r8K11j26j91J45J23j07o4M2q4J97n6j82N9K12j97K28
$$ y = [129, 73, 42, -26, 18, -57, 40, -144, 43, 141, 31, -117, -103, -23, -43, 96, 164, -136, -57, -60, -43, 14, -84, -93, 29, -33, 88, 32, 35, 9, 110, 20, -39, -45, 81, -47, 35, -67, -118, 27, 3, 158, -64, -28, -25, -91, -35, 25, -107, -14, -79, -35, 4, -64, -118, -20, 105, 43, 6, 82, -37, -129, 79, -27, 6, 13, -141, -59, -142, -22, -147, 51, 60, -24, -86, 38, 119, -68, 58, -5, 112, -74, -119, 49, -25, 152, 45, -55, -57, 81, 20, 101, -24, 13, -39, -4, -82, 89, -90, -55, -68, 43, -82, -70, -163, 119, 89, -121, 205, 85, 22, -106, -67, 102, 60, -146, -67, -94, 9, -94, 54, 5, -3, 36, -60, 3, 29, -100, -17, -47, -50, -14, -9, 149, -20, 93, -50, -35, 89, 95, -17, -56, -24, -57, 52, -133, -31, -29, 43, -133, 38, 13, 42, -98, 83, -59, 49, -27, -59, 125, -174, -104, -78, -84, 29, 23, 76, -29, 54, -64, 37, -96, -197, 18, -3, 18, -104, 8, -182, 5, 3, 19, -68, 22, -1, -37, -99, 163, 52, -46, 165, 39, -152, -7, 116, 9, -55, -13, -97, 100, 44, -138, -79, 133, -64, 164]
5327A64k69K59j44o0K56j72l4Rk82K40Q4o1J18j15OK4J41j57o3q0J51n4n3J09
5351A7N7j41l7K8K08j45m2O6k5J52j71j4J49k73K30J3p8J59k22L0J6j68J75P7
5375F1m1k9N5k60K40K7kj06J5J11j89l2J13j72J61J51j09N6l5LO1j18N2j26J28
5400A5j42M6M0j23K1K04n8P3j26j06L35k64J70N8j07j59J25n3K31j90L3j0nK5
5424C3l9N8J95l13N8QL3r2j12M5Q7J48r0J00k44L7%P6j56L08k26N4q3L09j66M5
5450G3L0j17j23P2K05r9o2R5j5j45J03m5K48k18J10j38MJ56k20P3P3j72J95k31
5474a48K15j59R6J9p8R3j51N4N2k5Q5p0J35l8j52J83q5m0Q3j55j12J32J25N1j01
5499Il3L6J6l3qj23K03j0j2j24P4J57p6k8m7j21nN0Q2o1K0J40j53J71j97J83k06
$$ y = [164, -105, 154, 10, -50, 206, 34, 0, 9, -273, -33, 51, -10, 108, -7, -1, 23, 164, 7, -56, -136, 15, -39, -92, 17, 74, -67, -104, -76, 132, -13, -55, 11, -14, 138, -33, -47, 102, -171, 59, 72, -6, 153, -69, -39, -23, -191, -16, 61, 20, -9, 46, -214, 26, 53, 51, -55, -40, 71, -118, -150, -37, -209, -48, 103, -6, 50, 15, 18, 79, -39, 13, -113, 15, -127, -81, -41, -164, -143, 61, 3, 76, -50, -156, 179, -85, 85, 143, 36, -123, 2, -51, 180, -10, 23, 13, 8, 33, -6, 52, 247, -66, -8, 0, 33, -59, -171, -126, -39, 109, 19, 119, -125, -88, -88, -12, -168, 140, -86, -32, -115, 194, 28, 73, 103, -14, -137, -65, 140, 41, -21, 74, 59, -86, 17, -28, 220, 2, 112, -26, -22, 134, -86, -13, 60, -112, 83, -148, 67, -92, 4, 23, -55, 38, -113, -59, -7, -32, 53, -17, 118, 80, -72, 111, 26, -14, 69, -86, -198, -66, 59, 110, 9, -24, 12, 28, -5, -13, -136, 67, 57, 45, -79, -5, 152, 76, 48, 1, -120, -125, -75, 7, -54, -34, 106, -47, 124, -73, 110, -96]
5526i6P2j02J46J8K5P5j77J13J9k22J54m7J44j78%J66n5j57K12j20O2K4j32K07
5550A51j90J08m6p3K69j89n7J3J4J06j89J32J0o4O5o2M3O6r0k8q9K35r8r3k6L9
5576d3J31m4n7l7k3K59r4j65n4J72kj39J0P6OL5q2K2PJ8j07J47J00k3Q4j60m6
5603im3J10j72Q5Rm3J21r0m3J39q6O4l2J5J5k9Q0J2o0l1K2m6m9J81J9p9m7p8J
5632f4R2l4J14j16OJ01j2j87J88l44L30j80K12p1k18K12n0Jk1J9Q1Pk28J83r4
5657g3L4mJ90r1J52P9k01K1r4k4M4N5m0j01Q1J02lj23J15j1k63J29m7J99j33O2
5683E5j9q5L5j25J09J11R9j40o8m9J77j01K2j07J45j59Q3L9J07j9l4k33K71j09
5707EP4o6j45L3O3L9l5N0J8P2n7k2l0M8k29J82P2o6ll5r8P5r6J08l3J68j49q7
$$ y = [-96, -24, -126, 20, 38, 63, 138, -39, 74, 93, -129, 25, -22, 122, -56, -56, 110, 55, -102, 110, -10, 52, 76, -56, 151, -39, 69, 23, -50, 219, 30, -27, -14, 0, 106, -83, 49, 59, -5, 60, -2, 41, 107, 17, -11, -100, 135, 37, -56, -82, -43, 88, 44, -13, -50, -73, 186, 92, -73, -127, 45, 43, -96, -86, -10, -4, 31, -51, -29, -22, -4, -111, 36, 136, 113, 197, 37, -9, -52, 58, -114, -29, -20, -63, 58, -32, -75, 64, -22, 42, 10, 25, 40, 11, 91, 103, 43, 12, 34, -12, -61, 120, 139, 60, 13, -65, -64, 28, -6, 108, -8, -2, 99, 87, -100, 88, -256, 74, -106, 106, 35, -183, 29, -21, -20, -41, -22, 59, 66, -162, 21, -73, -39, -43, 147, 56, 208, 287, 86, 107, 13, -11, 33, 88, 48, -53, 28, 130, 127, 4, 119, 108, -155, -26, -73, 126, -7, 55, 36, -49, -14, -139, -30, 81, 180, 40, -28, -77, 100, -1, 21, -86, 59, -100, -17, 22, 129, 110, 76, -157, 114, 5, 79, 13, -132, -99, -36, 3, -32, 18, 36, 108, 51, 29, -1, 47, -182, 0, 72, 6, 3, -32, -130, -55, -151, -43, -76, 92, -57, -144]
5735a44k5K55j89N6J99k70J40o1l8J54m5m3N9n9RJ31r0m8K8q1K26j07o2J07k82
5760a80J67J6l5J58k4j74J14O7j27j10J64j45K52j25o3O6j7j86K61j21j09J23
5782b8lK02j15k59L83k56J2R6k5O8p3J11k81K16n8m8MJ60l4j0J88j67P9j57Q1
5807H6j15Ol3k7J19J27j83j8Q5m9R9J7r1k88K54M5l7j92K45j44P0o2L5r2L4J08
5833ap3O5J63j2j79M7l9Rr5J11M5j2J17j07n3n4m4R3J70q6K0j90l1K32j39KR0
5860D9qj51J13m0K27j72PJ1j22J41k18K63r0q7J04M7Q6O5j38j05j36K00j04J48
5884I0k46nL21j49j17oM9J08j27L5P4m3K5M2L0j69L9M3q7J12p8O1J2j40n4J68
5910a2M7j08l8K21j10J42k09K0p5J38m1K16k02k6K9L4p5j29K73k82J44l7J39n8
$$ y = [-144, -169, 86, -103, -47, 152, -118, 22, -39, -77, 77, 32, -11, 48, -11, -2, 129, 39, -9, 19, -62, 164, 57, -5, 102, -180, -13, 3, -32, 126, 102, -72, 42, 109, -18, -128, 36, -109, 143, 18, -45, 21, 4, -182, 79, -42, -151, -28, -31, 171, 56, -203, 180, -76, -64, 32, 7, 75, 2, 113, -168, 48, -10, -58, -54, 106, 72, 62, 250, 83, 162, 5, 86, -29, -23, -56, -83, 36, 163, -20, -38, 47, -2, 97, 114, 23, -265, -11, 34, -3, -195, 50, -94, -24, -86, -51, -143, -109, -1, -74, -9, 154, 142, -37, 10, -29, -20, -115, -4, 41, 29, 146, 39, -14, -68, -112, -19, 151, 65, 85, -105, -136, 96, -43, -41, 49, 41, -110, 3, -37, 190, 18, 25, 36, -86, 55, -163, 100, 10, -77, 27, 74, 160, 225, 87, -18, -154, 46, -58, 90, -156, -161, 160, 11, -106, -112, -63, 45, -82, -47, 27, -16, 9, 51, 81, -88, -49, -6, -93, 19, -59, 2, 14, -126, -180, -12, 35, -73, -111, 110, 0, 142, -67, -47, -122, 16, -25, 191, -11, -37, -8, 26, -49, -178, 95, -187, -43, -80, 59, 1]
5934Aj21J30rj52J04R0k9o4J66l77K04P7j28k3J22k3K20k03Q3M6j59L0k4q8K60
5959A33j11J34k34L5pJ46J3k12P9pP8J5j44K27j9p8n8j11O2R3n2J14k0r4n1J26
5985E7N8k03P2J08k15r2j9J53J77p4R0k27oK35k07J11Q2k0L0k85J21j3K75l31
6009a23P1J25j34J46k08J52M5j6j69K12r3j01P7j09K50p6Q0j46k7p8j2P7J2j01
6033a46K18j12k03K29J31k74J2J61jj16J15L8p2o1J70r2N4r6M5P6q2ro2O8J42
6058A33q3JJ5p8K2O4J6p5j56J62L3k03J00Qn6l7P8Ol7m3J01k8M5L9K5j28J63k9
6086E8j61m4J49L8J56j93m4j8L5O9j2j9m2k1J12l2j00K1N9N7j68N5J27Rj09m5
6112f3l9J44Q0j51J1pJ00M2k87J36M1O7k6n5J38k27l8K13Q5j55j79K92j99K04
$$ y = [1, -120, 10, 1, -151, -47, 43, 14, -50, 116, -261, -57, 20, -108, -131, -9, -32, 188, -15, 68, 114, -45, -15, -39, -127, 133, 22, 156, -78, -43, -50, 96, 109, -103, -24, -31, 47, 62, -82, 145, 126, 48, -10, -121, -59, 34, -18, 96, 76, -18, -69, 57, 115, -88, -16, 92, -123, -215, -234, -81, 96, 22, 112, -115, -121, 114, -93, 18, 100, 80, 110, -175, -54, -67, 208, -123, -52, 73, -61, 85, -123, 29, 74, 58, -111, 101, 8, -93, -16, -125, 125, 49, 129, -17, -44, -122, -134, -57, -45, -146, 72, -40, -243, -14, 117, -157, -145, 16, 15, -101, 14, 52, -20, -81, 89, -3, 51, -45, 0, 76, -6, -15, -77, -9, 133, 50, 51, 66, -12, 10, 74, 90, 15, -141, 21, 54, -149, -49, -41, -97, -134, -56, -50, -87, -130, -29, -57, -12, 27, 52, -76, 87, 58, -103, -147, 2, 40, 196, 3, -41, -59, -24, 45, 33, 14, -28, -49, 63, 31, -69, -48, 11, 68, -100, -45, 82, 91, -18, -63, -102, 42, 122, -29, -18, -25, 75, 117, -170, -34, 7, 74, 48, -7, 131, -96, -134, 79, 164, 9, -170, 122, -77, 127]
6136A27j05j23L7l0Q5R8K4KNl08K23l1M2q1j3J56J0q9m8m3Q5j43J18K60k02n2
6162Dj21O2J20m7k2N1J6n4nj05J07q1n4J17L6R5k26J40r9lM1K22k18L3k0N1q1
6189d1q3K18o6m3j4Jj20K10r3J12k1k39J90O6k15J73qM7K4j29n1O3R6o9Ol2N5
$$ y = [127, 22, -101, -64, -94, -9, 89, 113, 115, 120, -188, 35, 4, 46, -35, -48, 108, 118, 29, -19, -62, 23, -120, -2, 258, 56, 4, -117, -55, 65, 18, -4, 47, 63, 9, 4, -101, 6, -75, -129, -12, 24, 119, -107, 33, -66, -69, -28, 194, -24, 9, -11, 40, -41, -124, 94, 28, -15, -29, -28, -148, 62, -31, 81, 60, -179, 11, 77, -138, 35, 27, 74, 98, -31, -82, -19, 77, 8, 14, -18, 37]
$$ [...]
8191i
##END NTUPLES=NMR FID
##END=
