##TITLE=1H_LR-776-BK
 CDCl3
 8 sc, 
 20.11.2023
##JCAMPDX= 6.0         $$ Bruker NMR JCAMP-DX V2.0
##DATA TYPE= NMR FID
##DATA CLASS= NTUPLES
##ORIGIN= UXNMR, Bruker Analytische Messtechnik GmbH
##OWNER= root
$$ XWIN-NMR		Version 3.5
$$ Mon Nov 20 16:03:54 2023 Russian Standard Time (UT+4h)  she@DPX200
##.OBSERVE FREQUENCY= 200.1313
##.OBSERVE NUCLEUS= ^1H
##.DELAY= (6, 6)
##.ACQUISITION MODE= SIMULTANEOUS
##.ACQUISITION SCHEME= undefined
##.AVERAGES= 8
##.DIGITISER RES= 18
##SPECTROMETER/DATA SYSTEM= spect
##.PULSE SEQUENCE= zg30
##.SOLVENT NAME= CDCl3
##.SHIFT REFERENCE= (INTERNAL, CDCl3, 0, 15.7039)
##AUDIT TRAIL= $$ (NUMBER, WHEN, WHO, WHERE, WHAT)
$$ ##TITLE= Audit trail, XWIN-NMR		Version 3.5
$$ ##JCAMPDX= 5.01
$$ ##ORIGIN= Bruker BioSpin GmbH
$$ ##OWNER= she
$$ F:/spectra/data/she/nmr/H-F/1/audita.txt
$$ ##AUDIT TRAIL=  $$ (NUMBER, WHEN, WHO, WHERE, WHAT)
(   1,<2023-11-20 16:02:43.68 +0400>,<she>,<DPX200>,
      <created by zg, POWCHK disabled, PULCHK disabled
       configuration hash MD5:
       00 E9 B6 7A A2 85 ED C7 34 08 36 98 17 FE 4E 26
       data hash MD5: 16K
       D6 2E AF 2A E8 66 96 21 A8 0E 8C DC 4A E4 91 4C>)
$$ ##END=
$$ 
$$ hash MD5
$$ C9 C9 57 6C C1 6E 1B 5F 14 0A 0B E1 92 52 DB 4F
##$RELAX= 
##$RELAX= 
##$RELAX= 
##$RELAX= 
##$RELAX= 
##$RELAX= 
$$ Bruker specific parameters
$$ --------------------------
##$DU= <F:/spectra>
##$EXPNO= 1
##$NAME= <H-F>
##$PROCNO= 1
##$TYPE= <nmr>
##$USER= <she>
##$AMP= (0..31)
100 100 100 100 100 100 100 100 100 100 100 100 100 100 100 100 100 100 
100 100 100 100 100 100 100 100 100 100 100 100 100 100 
##$AQSEQ= 0
##$AQ_mod= 1
##$AUNM= <au_zg>
##$AUTOPOS= <>
##$BF1= 200.13
##$BF2= 200.13
##$BF3= 200.13
##$BF4= 200.13
##$BF5= 200.13
##$BF6= 200.13
##$BF7= 200.13
##$BF8= 200.13
##$BYTORDA= 1
##$CFDGTYP= 0
##$CFRGTYP= 5
##$CHEMSTR= <none>
##$CNST= (0..31)
1 1 145 1 1 1 1 1 1 1 1 1 1 1 1 1 1 1 1 1 1 1 1 1 1 1 1 1 1 1 1 1 
##$CPDPRG= <>
##$CPDPRG1= <>
##$CPDPRG2= <>
##$CPDPRG3= <>
##$CPDPRG4= <mlev>
##$CPDPRG5= <mlev>
##$CPDPRG6= <mlev>
##$CPDPRG7= <mlev>
##$CPDPRG8= <mlev>
##$CPDPRGB= <>
##$CPDPRGT= <>
##$D= (0..31)
0 1.2 0 0 0 0 0 0 0 0.06 0 0.03 0 0 0 0 0.0002 0 0 0 0 0 0 0 0 0 0 0 0 
0 0 0 
##$DATE= 1700481763
##$DBL= (0..7)
120 120 120 120 120 120 120 120 
##$DBP= (0..7)
150 150 150 150 150 150 150 150 
##$DBP07= 0
##$DBPNAM0= <>
##$DBPNAM1= <>
##$DBPNAM2= <>
##$DBPNAM3= <>
##$DBPNAM4= <>
##$DBPNAM5= <>
##$DBPNAM6= <>
##$DBPNAM7= <>
##$DBPOAL= (0..7)
0.5 0.5 0.5 0.5 0.5 0.5 0.5 0.5 
##$DBPOFFS= (0..7)
0 0 0 0 0 0 0 0 
##$DE= 6
##$DECBNUC= <off>
##$DECIM= 32
##$DECNUC= <off>
##$DECSTAT= 4
##$DIGMOD= 1
##$DIGTYP= 9
##$DL= (0..7)
0 120 120 120 120 120 120 120 
##$DP= (0..7)
150 150 150 150 150 150 150 150 
##$DP07= 0
##$DPNAME0= <>
##$DPNAME1= <>
##$DPNAME2= <>
##$DPNAME3= <>
##$DPNAME4= <>
##$DPNAME5= <>
##$DPNAME6= <>
##$DPNAME7= <>
##$DPOAL= (0..7)
0.5 0.5 0.5 0.5 0.5 0.5 0.5 0.5 
##$DPOFFS= (0..7)
0 0 0 0 0 0 0 0 
##$DQDMODE= 0
##$DR= 18
##$DS= 0
##$DSLIST= <SSSSSSSSSSSSSSS>
$$ [...]
##$SUBNAM2= <"">
##$SUBNAM3= <"">
##$SUBNAM4= <"">
##$SUBNAM5= <"">
##$SUBNAM6= <"">
##$SUBNAM7= <"">
##$SUBNAM8= <"">
##$SUBNAM9= <"">
##$SW= 18.0517328524113
##$SWIBOX= (0..15)
0 0 2 0 0 0 0 0 0 0 0 0 0 0 0 0 
##$SW_h= 3612.71676300578
##$TD= 16384
##$TD0= 1
##$TE= 0
##$TE2= 300
##$TE3= 300
##$TEG= 300
##$TL= (0..7)
0 120 120 120 120 120 120 120 
##$TP= (0..7)
150 150 150 150 150 150 150 150 
##$TP07= 0
##$TPNAME0= <>
##$TPNAME1= <>
##$TPNAME2= <>
##$TPNAME3= <>
##$TPNAME4= <>
##$TPNAME5= <>
##$TPNAME6= <>
##$TPNAME7= <>
##$TPOAL= (0..7)
0.5 0.5 0.5 0.5 0.5 0.5 0.5 0.5 
##$TPOFFS= (0..7)
0 0 0 0 0 0 0 0 
##$TUNHIN= 0
##$TUNHOUT= 0
##$TUNXOUT= 0
##$USERA1= <user>
##$USERA2= <user>
##$USERA3= <user>
##$USERA4= <user>
##$USERA5= <user>
##$V9= 5
##$VALIST= <valist>
##$VCLIST= <CCCCCCCCCCCCCCC>
##$VD= 0
##$VDLIST= <DDDDDDDDDDDDDDD>
##$VPLIST= <PPPPPPPPPPPPPPP>
##$VTLIST= <TTTTTTTTTTTTTTT>
##$WBST= 1024
##$WBSW= 4
##$XGAIN= (0..3)
0 0 0 0 
##$XL= 0
##$YL= 0
##$YMAX_a= 101672
##$YMIN_a= -92151
##$ZGOPTNS= <>
##$ZL1= 120
##$ZL2= 120
##$ZL3= 120
##$ZL4= 120
##$ABSF1= 10
##$ABSF2= 0
##$ABSG= 5
##$ABSL= 3
##$ALPHA= 0
##$AQORDER= 0
##$ASSFAC= 0
##$ASSFACI= 0
##$ASSFACX= 0
##$ASSWID= 0
##$AUNMP= <proc_1d>
##$AZFE= 0.1
##$AZFW= 0.1
##$BCFW= 1
##$BC_mod= 2
##$BYTORDP= 1
##$COROFFS= 0
##$CY= 11.3945322036743
##$DATMOD= 1
##$DC= 2
##$DFILT= <>
##$DTYPP= 0
##$F1P= 15.7292609196834
##$F2P= 12.9074282941183
##$FCOR= 0.5
##$FTSIZE= 0
##$FT_mod= 4
##$GAMMA= 1
##$GB= 0.15
##$INTBC= 1
##$INTSCL= 1
##$ISEN= 128
##$LB= 0.24
##$LEV0= 0
##$LPBIN= 0
##$MAXI= 10000
##$MC2= 0
##$MEAN= 0
##$ME_mod= 0
##$MI= 1.114404
##$NCOEF= 0
##$NC_proc= 0
##$NLEV= 6
##$NOISF1= 3.799351
##$NOISF2= 2.8
##$NSP= 1
##$NTH_PI= 0
##$NZP= 0
##$OFFSET= 15.70392
##$PC= 1
##$PHC0= -23868.3
##$PHC1= 9.452692
##$PH_mod= 1
##$PKNL= yes
##$PPARMOD= 0
##$PSCAL= 0
##$PSIGN= 0
##$REVERSE= no
##$SF= 200.130013532006
##$SI= 16384
##$SIGF1= 3
##$SIGF2= 2
##$SINO= 400
##$SIOLD= 16384
##$SREGLST= <1H.CDCl3>
##$SSB= 0
##$STSI= 0
##$STSR= 0
##$SW_p= 3612.71676300578
##$SYMM= 0
##$S_DEV= 0
##$TDeff= 0
##$TDoff= 0
##$TI= <>
##$TILT= no
##$TM1= 0
##$TM2= 0
##$TOPLEV= 0
##$USERP1= <user>
##$USERP2= <user>
##$USERP3= <user>
##$USERP4= <user>
##$USERP5= <user>
##$WDW= 1
##$XDIM= 8192
##$YMAX_p= 0
##$YMIN_p= 0
$$ End of Bruker specific parameters
$$ ---------------------------------
##NTUPLES= NMR FID
##VAR_NAME=  TIME,          FID/REAL,        FID/IMAG
##SYMBOL=    X,             R,               I
##VAR_TYPE=  INDEPENDENT,   DEPENDENT,       DEPENDENT
##VAR_FORM=  AFFN,          ASDF,            ASDF
##VAR_DIM=   8192,          8192,            8192
##UNITS=     SECONDS,       ARBITRARY UNITS, ARBITRARY UNITS
##FACTOR=    0.0002768,     1,               1
##FIRST=     0,             0,               0
##LAST=      2.2672688,     0,               0
##MIN=       0,             -92151,          0
##MAX=       2.2672688,     101672,          0
$$ Real data points
##PAGE= N=1
##DATA TABLE= (X++(R..R)), XYDATA
$$ [...]
$$ plain form
1811 152 -175 -276 -177 76 246 218 -82 123 -148 130 139 -154 -157 -337 29 74 156 79 -189 174 112 287 236 -165
1835 -165 -211 -358 290 504 -10 -526 -253 -151 191 -21 -112 -326 -309 158 97 -120 -45 -478 60 306 224 163
1857 163 -340 -82 139 443 101 38 -90 -203 58 360 -87 -380 -328 136 146 131 -200 -297 -97 135 478 -186
1879 -186 -82 -181 85 36 400 78 -352 -324 -34 24 108 -308 -273 -11 188 168 43 -87 -33 -48 163 156 183 -114
1903 -114 125 215 425 68 -276 -36 -42 198 169 -78 -282 -149 32 221 201 -86 -40 8 36 195 190 -13 -138
1926 -138 23 399 303 8 -333 -161 250 48 38 -489 -226 -167 -188 -99 -136 -134 -278 19 291 442 -115 -166 -157 225
1950 225 -41 -222 -248 -201 -209 133 27 -155 -167 -39 337 171 11 -111 -378 -163 -46 86 -7 -245 -319 292
1972 292 238 302 -53 -63 69 -55 60 159 -259 -305 -149 324 182 63 -216 -79 77 96 152 -145 -320 140
$$ packed form
1811A52l27j01R9K53J70k8l00K05k71K78Rk93lj80L66M5Q2p7k68L63o2J75n1m01
1835a65m6j47O48K14n14n16K73J02L42k12r1k14J7M67o1k17P5m33N38K46q2o1
1857A63n03K58K21L04l42o3j28j13K61L02m47k93N2M64J0j5l31r7K00K32L43o64
1879a86J04r9K66m9L64l22m30K8K90N8Q4m16L5K62J99k0j25j30N4j5K11pK7k97
1903a14K39R0K10l57l44K40oK40k9k47k04J33J81J89k0k87M6M8K8J59nk03j25
1926a38J61L76r6k95l41J72M11k02j0n27K63N9k1Q9l7Kj44K97K72J51n57n1RL82
1950B25k66j81k6M7qL42j06j82j2J28L76j66j60j22k67K15J17J32r3k38p4O11
1972B92n4O4l55j0J32j24J15R9m18m6J56M73j42j19k79J37J56J9N6k97j75M60
$$ plain form
1994 140 366 28 112 60 128 177 315 115 -51 -322 -146 -42 103 -136 -80 -273 -127 303 67 119 -171 -139
2016 -139 227 421 244 -403 -300 75 -310 322 -149 -396 -550 -158 325 337 -380 -51 64 120 73 51 -83
2037 -83 -123 -46 39 170 188 121 -167 -39 48 -51 -28 -389 -13 -86 237 283 -65 20 34 55 191 -229 -182 -98 82
2062 82 87 59 -222 -468 -96 102 -103 -182 31 -179 171 143 -38 -271 -301 -73 75 294 -114 -302 73 -52
2084 -52 -83 88 36 -119 -211 153 -99 66 -193 126 52 81 328 -21 -175 -30 79 309 207 -162 -211 99
2106 99 504 79 9 -14 -200 228 407 248 -61 -163 190 8 -56 -56 -41 -469 18 15 28 176 -224 -318 -143 183
2130 183 -44 -283 -166 -343 -89 33 -12 -164 -65 -133 130 284 -50 -28 -66 -134 86 110 -281 -50 -66 22 21 -5
2154 -5 38 -109 153 208 168 10 -259 -242 147 165 -171 -204 -118 -45 52 489 26 -135 -207 169 345 -107 175 -48
$$ packed form
1994A40K26l38Q4n2O8M9J38k00j66k71J76J04J45k39N6j93J46M30k36N2k90L2
2016a39L66J94j77o47J03L75l85O32m71k47j54L92M83J2p17L29J15N6m7k2j34
2037h3m0P7Q5J31J8o7k88J28Q7r9K3l61L76p3L23M6l48Q5J4K1J36m20M7Q4J80
2062H2Nk8k81k46L72J98k05p9K13k10L50k8j81k33l0K28J48K19m08j88L75j25
2084e2l1J71n2j55r2L64k52J65k59L19p4K9K47l49j54J45J09K30j02l69m9L10
2106I9M05m25p0k3j86M28J79j59l09j02L53j82o4%J5m28M87lJ3J48m00r4J75L26
2130A83k27k39J17j77K54J22m5j52R9o8K63J54l34K2l8o8K20K4l91K31j6Q8jk6
2154eM3j47K62N5m0j58k69J7L89J8l36l3Q6P3R7M37m63j61p2L76J76m52K82k23
$$ plain form
2178 -48 -260 65 312 230 -231 -149 -211 15 -38 -103 -353 -83 96 213 76 -142 -128 164 293 -9 131 5
2200 5 -241 197 -156 -301 -88 -244 18 1 43 129 -82 -115 284 253 102 30 -131 4 47 52 -256 -170 -126 -4
2224 -4 145 198 167 -315 6 -72 168 -42 -37 -149 144 193 287 318 197 106 -224 -68 135 56 -257 -325 -31 117
2248 117 -112 -174 -39 229 120 104 -130 -145 -38 -108 78 102 -225 -196 -203 -61 -100 8 -162 -400 111 -15 -44
2271 -44 123 -6 -56 218 242 220 -33 -135 123 344 317 148 99 23 -95 76 -16 -17 -133 37 124 243 103 -284
2295 -284 -107 10 -87 192 53 -196 109 56 153 11 -42 41 34 221 235 184 100 -3 2 261 314 63 -156 -248 -77
2320 -77 153 163 -51 -352 141 112 86 249 -58 -239 128 5 -196 -212 119 -221 -143 82 -187 140 -150 -193
2342 -193 -186 237 -129 -69 -285 -135 67 -101 -148 160 -64 60 135 -1 6 -44 105 -78 115 53 -251 -80 112
$$ packed form
2178d8k12L25K47q2m61Q2o2K26n3o5k50K70J79J17j37k18J4K92J29l02J40j26
2200Ek46M38l53j45K13j56K62j7M2Q6k11l3L99l1j51p2j61J35M3Nl08Q6M4J22
2224dJ49N3l1m82L21p8K40k10Nj12K93M9R4L1j21r1l30J56K03p9l13o8K94J48
2248A17k29o2J35K68j09j6k34j5J07p0J86K4l27K9pJ42l9J08j70k38N11j26k9
2271d4J67j29n0K74K4k2k53j02K58K21k7j69m9p6j18J71r2jj16J70Q7J19j40l87
2295b84J77J17r7K79j39k49L05n3R7j42n3Q3pJ87J4n1q4j03NK59N3k51k19r2J71
2320g7K30J0k14l01M93k9k6J63l07j81L67j23k01j6L31l40P8K25k69L27k90m3
2342a93PM23l66O0k16J50K02j68m7L08k24J24P5j36Pn0J49j83J93o2l04J71J92
$$ plain form
2365 112 118 -117 13 -37 -122 -31 30 6 -167 -74 184 285 94 12 -218 -63 43 226 -16 35 28 195 -154 238
2389 238 -201 -64 -34 272 174 161 -306 -242 -20 -186 115 -55 -264 -28 80 30 -81 133 -82 125 345 213
2411 213 -12 -120 -23 132 241 -119 -174 -217 -105 77 144 -110 -147 -229 -8 -7 -153 -99 -183 -77 167 84 191 195
2435 195 -83 92 323 -1 35 203 -298 -30 199 18 114 -284 132 -299 44 21 -203 -380 109 5 88
2456 88 138 -82 179 -148 -69 128 16 7 224 57 28 -65 -115 -205 -214 -65 88 29 -365 -111 -46 25 17 109 118 -35
2482 -35 -79 141 138 90 -161 -106 62 265 7 -109 237 57 229 49 -172 -175 -57 -141 319 -42 -69 -64 -28 126
2506 126 38 162 185 -13 10 94 54 -140 110 -121 246 -47 210 82 -179 90 20 -66 -97 -16 42 76 116 -15
2530 -15 158 45 126 -53 564 -91 -221 132 276 -387 124 0 -209 127 3 204 85 -321 102 -64 -5
$$ packed form
2365A12Ok35J30n0q5R1O1k4j73R3K58J01j91q2k30J55J06J83k42N1pJ67l49L92
2389B38m39J37L0L06r8j3m67O4K22j66L01j70k09K36J08n0j11K14k15K07K20j32
2411B13k25j08R7J55J09l60n5m3J12J82O7k54l7q2K21Jj46N4q4J06K44q3J07M
2435A95k78J75K31l24L6J68n01K68K29j81R6l98M16m31L43k3k24j77M89j04Q3
2456H8N0k20K61l27P9J97j12rK17j67k9r3n0r0rJ49J53n9l94K54O5P1qR2Rj53
2482c5m4K20lm8k51N5J68K03k58j16L46j80J72j80k21lJ18q4M60l61k7NL6J54
2506A26q8J24K3j98K3Q4m0j94K50k31L67k93K57j28k61K69p0q6l1Q1N8L4M0j31
2530a5J73j13Q1j79O17o55j30L53J44o63N11j24k09L36j24K01j19m06M23j66N9
$$ plain form
2551 -5 189 151 -206 -145 45 437 -237 -35 -45 -257 96 -170 -17 -215 -177 -146 228 200 -47 223 -37 28 371
2574 371 244 -70 234 114 68 -8 -23 -407 -58 -38 -272 -11 -163 238 -73 12 153 -18 14 174 117 43 162
2597 162 -19 -90 -94 -49 -36 34 -31 -178 -170 128 -44 -68 -266 -140 66 142 -67 118 -62 6 232 -37 -81 224
2621 224 33 204 50 105 -152 -365 258 -179 -50 -167 -16 -38 -130 215 86 -224 181 85 -16 160 118 48
2643 48 -36 -286 -123 65 39 -69 -309 -106 138 291 -241 -242 11 125 -183 171 148 133 105 104 -370 72 114 -142
2667 -142 194 43 -114 -111 -220 -50 28 61 -108 -109 -58 -89 37 -77 152 81 -216 58 -99 -140 -59 38 152 72
2691 72 203 122 -278 112 175 -32 218 -220 16 5 -150 33 -247 -252 -139 -10 115 173 29 87 -173 9 104
2714 104 -89 -195 27 -289 -90 19 67 137 -318 -65 -39 115 -23 169 14 32 -96 -151 -132 23 -159 -90
$$ packed form
2551eJ94l8l57O1J90L92o74K02j0k12L53k66J53j98L8L1L74k8k47K70k60O5L43
2574C71j27l14L04j20m6p6j5l84L49K0k34K61j52M01l11Q5J41j71L2J60n7p4J19
2597A62j81p1mM5J3P0o5j47QK98j72k4j98J26K06P6k09J85j80O8K26k69m4L05
2621B24j91J71j54N5k57k13O23m37J29j17J51k2r2L45j29l10M05r6j01J76m2p0
2643D8q4k50J63J88k6j08k40K03K44J53n32jK53J14l08L54k3j5k8jm74M42M2k56
2667a42L36j51j57Lj09J70P8L3j69jN1l1J26j14K29p1k97K74j57m1Q1R7J14q0
2691G2J31q1m00L90O3k07K50m38K36j1j55J83k80nJ13J29J25N8j44N8k60J82R5
2714A04j93j06K22l16J99J09M8P0m55K53K6J54j38J92j55J8j28n5J9J55j82O9
$$ plain form
2736 -90 48 -22 -95 -214 130 -48 34 -159 128 107 -53 -156 59 -122 -7 19 -7 108 -18 121 -64 115
2758 115 -42 -240 99 -239 20 -86 -44 -176 -33 346 114 126 -117 223 27 -13 43 101 173 -185 -204 105
2780 105 135 46 -187 109 -94 25 69 -22 58 212 32 27 96 143 -104 -259 -76 198 188 228 110 129 -262 51
2804 51 175 162 -177 -75 -13 78 38 -13 -193 -134 -11 -102 190 10 -120 -11 62 -218 -232 45 119 -98 -173 106
2828 106 14 2 -46 274 225 105 -38 -264 -120 -11 51 -208 -76 99 324 179 -50 -81 -67 43 144 -84
2850 -84 8 -206 -40 59 292 100 -176 -184 -315 -75 2 -77 122 -25 -14 426 134 -127 -47 323 86 -175 42
2873 42 -16 -158 69 126 5 -260 -126 269 292 84 -279 -141 94 259 -110 115 23 -69 -178 -159 -135 -73 -145
2896 -145 -46 -3 -26 129 -172 84 183 64 -32 -19 -45 11 113 176 15 179 -192 -19 84 -107 -93 -36 204 -65
$$ packed form
2736i0J38p0p3j19L44j78Q2j93K87k1j60j03K15j81J15K6k6J15j26J39j85J79
2758A15j57j98L39l38K59j06M2j32J43L79k32J2k43L40j96m0N6N8P2l58j9L09
2780A05L0q9k33K96k03J19M4r1Q0J54j80nO9M7k47j55J83K74j0M0j18J9l91L13
2804E1J24j3l39J02O2R1m0n1j80N9J23r1K92j80j30J09P3k80j4K77P4k17p5K79
2828A06r2j2m8L20m9j20j43k26J44J09O2k59J32J75K25j45k29l1J4J10J01k28
2850h4R2k14J66R9K33j92k76qj31K40P7p9J99j47J1M40k92k61Q0L70k37k61K17
2873D2n8j42K27N7j21k65J34L95K3k08l63J38K35J65l69K25r2r2j09J9K4O2p2
2896a45R9M3k3J55l01K56R9j19r6J3k6N6J02O3j61J64l71J73J03j91J4N7K40k69
$$ plain form
2920 -65 147 -46 54 -395 -313 106 32 -198 364 55 -75 -90 -42 469 12 45 97 127 112 179 -213 238 -302
2943 -302 72 -47 -148 78 -98 216 118 179 -74 -117 207 124 321 -213 -22 343 -132 -73 76 -216 -63 -34
2965 -34 -109 -154 -27 183 268 126 -55 22 -158 -101 164 -86 308 11 58 10 26 179 -65 -111 -9 46 -24 -44
2989 -44 -135 110 -198 -92 129 -62 121 -4 -55 -124 145 107 -351 -36 80 73 -44 -139 88 -158 203 222 91
3012 91 -178 30 -37 -61 -65 -113 -303 -25 252 23 67 199 -72 76 157 111 -108 -101 -92 48 230 47 64 -38 31
3037 31 148 148 160 37 -85 190 -65 110 -69 19 -173 134 155 -111 64 -445 -161 -36 -53 5 146 -388 58
3060 58 -52 -149 36 160 -175 -210 121 -89 203 -67 -36 51 365 -144 98 -124 -24 -57 105 119 19 -6 61
3083 61 260 226 235 61 82 23 -112 7 -86 -176 25 -1 -216 79 -157 -61 27 108 92 119 -308 -91 108 56 -12
$$ packed form
2920f5K12j93J00m49Q2M19p4k30N62l09j30j5M8N11m57L3N2L0j5O7l92M51n40
2943c02L74j19j01K26j76L14r8O1k53m3L24q3J97n34J91L65m75N9J49k92J53K9
2965c4p5m5J27K10Q5j42j81P7j80N7K65k50L94k97M7m8J6J53k44m6J02N5p0k0
2989d4r1K45l08J06K21j91J83j25n1o9K69l8m58L15J16pj17r5K27k46L61J9j31
3012I1k69K08o7k4mm8j90K78K77k29M4J32k71J48Q1m6k19PRJ40J82j83J7j02O9
3037C1J17%J2j23j22K75k55J75j79Q8j92L07K1k66J75n09K84J25j7N8J41n34M46
3060E8j10r7J85J24l35l5L31k10K92k70L1Q7L14n09K42k22J00l3J62J4j00k5O7
3083F1J99l4Rj74K1n9j35J19r3r0K01k6k15K95k36R6Q8Q1j6K7m27K17J99n2o8
$$ plain form
3108 -12 -156 -62 -175 44 -38 252 -66 74 -241 -72 -231 -274 -34 -33 -60 50 3 59 61 -237 63 -28 118 102
3132 102 -41 74 189 166 -133 154 -55 118 -185 110 -154 -111 -98 -92 -58 -116 -127 -226 -99 -113 -89 40 13 -54
3156 -54 137 141 25 -178 15 -271 -29 52 -103 -52 94 -36 -399 153 -21 -63 65 52 -21 78 255 57 0
3179 0 -165 -89 -92 -172 239 -227 34 30 6 135 -69 -28 -129 -65 -48 -37 100 -178 93 220 -209 -270 -174 -66 -47
3204 -47 66 57 -176 -74 290 -103 -46 -73 -160 275 18 -223 194 111 11 -78 -131 178 197 60 94 84 -72 246
3228 246 -89 -76 55 45 -87 171 -36 67 -143 -17 148 162 49 -59 95 -214 113 -85 -185 133 69
3249 69 -199 79 61 -211 103 -22 -306 136 -249 8 -53 231 -149 182 123 -23 76 306 -30 -182 -131 -213
3271 -213 101 -205 254 53 61 -48 -152 -49 55 131 -67 4 94 -34 104 -171 182 32 46 14 200 -175
$$ packed form
3108a2j44R4j13K19q2K90l18J40l15J69j59m3K40Jk7J10m7N6Kk98L00r1J46j6
3132A02j43J15J15k3k99K87k09J73l03K95k64M3J3OL4n8j1r9J27j4K4J29k7o7
3156e4J91Mj16k03J93k86K42Q1j55N1J46j30l63N52j74m2J28j3p3R9J77j98n7
3179@j65P6lq0M11m66K61mk4J29k04M1j01O4J7J1J37k78K71J27m29o1R6J08J9
3204d7J13rk33J02L64l93N7k7q7M35k57k41M17q3j00q9n3L09J9j37L4j0j56L18
3228B46l35J3J31j0j32K58k07J03k10J26J65J4j13j08J54l09L27j98j00L18o4
3249F9k68K78j8k72L14j25k84M42l85K57o1K84l80L31n9j46R9K30l36j52N1q2
3271b13L14l06M59k01Qj09j04J03J04P6j98P1R0j28J38k75L53j50J4l2J86l75
$$ plain form
3293 -175 -61 -44 60 174 51 11 -255 116 -49 -137 -53 70 91 -19 7 -64 44 159 198 57 -187 183 -96
3316 -96 25 -139 -231 90 -64 -83 189 -49 -46 -52 192 32 107 38 -172 123 -119 137 -134 109 67 -26 42 -70
3340 -70 -69 -51 159 -123 -137 140 213 -177 -15 -29 15 11 148 -81 393 115 57 102 146 34 51 -135 -76 -83 311 220
3366 220 -102 247 -161 44 -45 12 81 18 95 -199 151 -136 -27 83 -128 -185 77 111 79 -144 -23 -5 -293
3389 -293 98 -12 275 -219 27 191 114 -132 71 -69 -145 -48 -124 -141 172 82 -43 39 -43 -96 85 108 -115
3412 -115 -103 98 30 16 20 -243 48 113 12 -4 18 77 -36 316 14 -60 126 26 205 79 -5 147 110 -263
3436 -263 76 -60 271 130 -28 -45 -79 214 8 -72 -57 17 33 -4 -251 210 -132 -161 -136 -16 -164 59 180
3459 180 93 238 13 140 -221 208 56 66 194 -19 151 -181 -13 -40 84 13 -78 213 59 -89 -68 -16
$$ packed form
3293a75J14J7J04J14j23m0k66L71j65q8Q4J23K1j10K6p1J08J15L9j41k44L70k79
3316i6J21j64r2L21j54j9K72k38LoK44j60P5o9k10K95k42K56k71K43m2r3O8j12
3340g0JJ8K10k82j4K77P3l90J62j4M4mJ37k29M74k78n8M5M4j12J7j86N9pL94r1
3366B20l22L49m08K05q9N7O9o3P7k94L50k87J09J10k11n7K62L4l2k23J21J8k88
3389b93L91j10K87m94K46J64p7k46K03j40p6R7p6j7L13r0j25Q2q2n3J81K3k23
3412a15J2K01o8j4Mk63K91O5j01j6K2N9j13L52l02p4J86j00J79j26q4J52l7l73
3436b63L39j36L31j41j58j7l4K93k06q0J5P4J6l7k47M61l42k9K5J20j48K23J21
3459A80q7J45k25J27l61M29j52J0J28k13J70l32J68k7J24p1r1K91j54j48K1N2
$$ plain form
3481 -16 -205 -72 -109 92 -113 -124 54 104 -89 -113 -135 -194 -106 -174 24 99 27 280 8 5 164 -149 -110 -124 144
3506 144 -84 75 25 -199 41 99 217 -22 -76 -56 -183 -83 -232 -93 43 174 122 -129 -15 -381 -50 -2
3528 -2 -27 -20 -60 -46 -52 -85 84 388 -129 -105 123 -33 0 28 -142 18 -50 43 66 19 41 -75 -70 166 -93 -380 -188
3555 -188 128 -65 -175 -233 45 -76 34 -17 -151 121 -81 -394 -93 319 34 334 -51 -18 -319 -242 94
3576 94 -120 -360 300 110 87 -148 32 9 135 -21 -16 124 -198 -292 -253 279 -109 47 -248 -33 54 -269 179
3599 179 47 -31 -155 -261 -30 -133 -12 -56 210 -224 -168 -157 -118 -48 76 -183 48 10 165 37 93 97 34 137
3623 137 175 196 -6 67 -150 185 112 -102 99 73 111 -52 -59 -42 -243 362 -12 74 13 119 7 53 338 -107
3647 -107 157 -111 -70 -202 209 -167 -136 -20 -90 -140 151 -76 303 288 55 38 11 199 142 98 203 -52 13
$$ packed form
3481a6j89J33l7K01k05j1J78N0j93k4k2n9Q8o8J98P5p2K53k72lJ59l13L9j4K68
3506A44k28J59n0k24K40N8J18k39n4K0j27J00j49J39J36J31n2k51J14l66L31M8
3528bk5Pm0J4ol3J69L04n17K4K28j56L3K8j70J60o8R3K3m7K2j16NK36k59k87J92
3555a88L16j93j10n8K78j21J10n1j34K72k02l13L01M12k85L00l85L3l01P7L36
3576I4k14k40O60j90k3k35J80k3J26j56NJ40l22r4L9N32l88J56k95K15Q7l23M48
3599A79j32p8j24j06K31j03J21m4K66m34N6J1L9P0J24k59K31l8J55j28N6Mo3J03
3623A37L8K1k02P3k17L35p3k14K01k6L8j63pJ7k01O05l74Q6o1J06j12M6K85m45
3647a07K64k68M1j32M11l76L1J16p0n0K91k27L79j5k33j7k7J88n7m4J05k55O5
$$ plain form
3670 13 219 -136 -120 25 116 -155 83 -50 79 41 -291 196 -54 55 118 -298 19 24 76 -7 -112 9 -28
3693 -28 158 -34 -114 3 -161 188 148 -12 -166 -108 -182 191 400 -78 141 38 -24 -27 138 94 -97 90 -86
3716 -86 203 64 188 -85 -102 -91 -57 122 29 59 -265 46 -10 -13 -76 -221 97 -244 339 -134 182 -86 122
3739 122 -38 212 -95 -270 229 -46 -58 82 -16 -174 -21 -73 157 275 28 17 -161 192 64 -20 48 6
3761 6 -24 -26 -75 -22 -14 -23 135 178 -362 -8 254 -2 -32 -22 -54 -64 -166 185 -147 -219 -59 -271 9 -201 10 -143
3787 -143 -15 42 -178 -40 102 -323 -175 310 341 29 -94 26 18 -16 345 -56 -8 -33 101 94 93 -1 -80 -123 31
3812 31 74 7 -285 47 -56 -26 23 -200 215 38 -19 111 41 40 184 152 -122 -3 68 71 32 11 3 103 -60 40
3838 40 72 1 83 36 -147 -61 169 -111 167 -3 52 81 -9 -171 -59 32 -178 -157 -65 35 -144 57 213 65
$$ packed form
3670A3K06l55J6J45R1k71K38j33J29l8l32M87k50J09O3m16L17NN2q3j05J21l7
3693b8J86j92q0J17j64L49m0j60j54N8p4L73K09m78K19j03o2lJ65m4j91J87j76
3716h6K89j39J24k73j7J1L4J79r3L0l24L11n6lo3j45L18l41N83m73L16k68K08
3739A22j60K50l07j75M99k75j2J40r8j58J53n2K30J18k47j1j78L53j28q4O8m2
3761Fl0km9N3QrJ58M3n40L54K62k56l0J0l2j0j02L51l32p2J60k12K80k10K11j53
3787a43J28N7k20J38J42m25J48M85L1l12j23J20ql4L61m01M8k5J34pjr4p9m3J54
3812C1M3o7k92L32j03L0M9k23M15j77n7J30p0jJ44l2k74J19P1Ll9k1qJ00j63J00
3838D0L2p1Q2m7j83Q6K30k80K78j70N5K9r0j62J12R1k10K1R2J00j79K01J56j48
$$ plain form
3862 65 -23 155 -8 42 -88 -218 51 217 -104 56 -194 21 58 201 169 -70 -184 6 110 -130 -154 -65
3884 -65 143 -50 -111 -47 137 -78 33 183 -7 30 -121 61 56 44 35 14 -113 -179 129 108 -31 -10 298 -151
3908 -151 252 -72 28 397 -221 170 54 213 -334 -80 -100 -14 -13 246 -19 -19 -111 43 58 34 -98 118 26
3931 26 112 -41 137 -15 300 47 82 -113 -205 142 -115 -153 187 161 -200 237 121 211 125 89 -177 -16 -281
3954 -281 -31 68 208 37 -112 28 -160 146 209 15 143 -131 12 15 -64 -342 -42 65 -124 -45 -191 3
3976 3 56 -157 -175 -70 12 8 -103 -188 186 -33 179 66 86 103 162 32 3 142 -118 43 122 12 -8 108 90
4001 90 49 -5 -45 -22 -116 -69 -154 15 -52 -49 -36 470 201 -181 39 146 -71 25 72 -29 -87 33 -6 129 -86
4026 -86 -13 -207 58 -218 130 183 -10 -159 -179 -122 54 -43 -34 -94 -194 -168 61 65 249 302 -83 106 1 12 -118
$$ packed form
3862F5q8J78j63N0j30j30K69J66l21J60k50K15L7J43l2k39j14J90J04k40k4Q9
3884f5K08j93o1O4J84k15J11J50j90L7j51J82nj2rk1j27o6L08k1j39K1L08m49
3908a51M03l24J00L69o18L91j16J59n47K54k0Q6JK59k65%r2J54J5k4j32K16r2
3931B6Q6j53J78j52L15k53L5j95r2L47k57l8L40k6l61M37j16R0q6l6k66J61k65
3954b81K50R9J40j71j49J40j88L06O3j94J28k74J43Lp9k78L00J07j89P9j46J94
3976CN3k13j8J05Q2mj11q5L74k19K12j13K0J7N9j30k9J39k60J61P9j10k0J16j8
4001I0m1n4m0K3r4M7q5J69o7LJ3N06k69l82K20J07k17R6M7j01n8J20l9J35k15
4026h6P3j94K65k76L48N3j93j49k0N7J76r7Ro0j00K6K29MJ84N3l85J89j05J1j30
$$ plain form
4051 -118 -19 -74 122 -73 110 -186 -82 15 238 -110 -50 -69 28 -20 97 126 -155 -177 -69 -162 156 38 -100
4074 -100 -9 184 -61 -130 168 -462 -137 157 -159 -74 -113 21 -110 -84 -75 -229 -114 43 73 9 16 -213 -59 -55
4098 -55 -75 249 -55 -68 54 -123 76 53 -126 27 -239 -37 -13 -368 71 -74 2 116 91 -103 -48 358 -74
4121 -74 -91 97 6 117 35 -72 -16 -89 -65 -103 -4 -127 142 96 -158 60 247 16 95 48 79 -19 148 37 -70
4146 -70 -113 -350 -114 -128 -229 -223 75 -75 109 -73 -268 149 -146 2 258 175 99 -111 135 -110 -187 -198 129
4169 129 89 -66 42 -110 145 -147 -131 5 128 -29 -105 -131 8 -150 -78 -80 231 7 -129 -161 -64 21 -138
4192 -138 -17 73 2 35 -235 -37 60 -116 -247 115 76 -34 126 200 16 -80 178 -87 -106 -24 -16 -5 -175 -79
4216 -79 181 167 63 9 13 40 -174 175 278 -180 50 36 -7 -5 -87 183 -312 -152 -85 22 -33 -76 -342 66 -85
$$ packed form
4051a18R9n5J96j95J83k96J04R7K23l48O0j9R7m8J17K9k81k2J08r3L18j18j38
4074a00R1J93k45o9K98o30L25K94l16Q5l9J34j31K6Rj54J15J57L0o4Pk29J54M
4098e5k0L24l04j3J22j77J99k3j79J53k66K02K4l55M39j45P6J14k5j94N5M06m32
4121g4j7J88r1J11q2j07N6p3K4l8R9j23K69m6k54K18J87k31P9m7L1r8J67j11j07
4146g0m3k37K36j4j01OK98j50J84j82j95M17k95J48K56q3p6k10K46k45p7j1L27
4169A29m0j55J08j52K55k92J6J36J23j57p6k6J39j58P2kL11k24j36l2R7Q5j59
4192a38J21R0p1L3k70J98R7j76j31L62l9j10J60P4j84r6K58k65j9Q2QJ1j70R6
4216g9K60j4j04n4MK7k14L49J03m58K30j4m3Kq2K70m95J60O7J07n5m3k66M08j51
$$ plain form
4241 -85 216 106 90 194 146 -58 1 70 427 -123 -154 119 17 -83 -248 36 48 -10 88 209 -157 110 85
4264 85 -27 100 94 -191 -13 -26 56 76 96 -42 -167 -242 -70 -283 -60 58 53 205 159 -5 112 -184 3 141
4288 141 28 -67 59 -58 -55 -59 189 11 78 49 -171 -56 -148 -20 207 -5 -106 4 -20 236 -232 -58 30
4311 30 8 -126 4 -115 -55 -40 53 137 240 187 -114 -269 -153 -281 -33 -37 -33 40 -223 58 145 77 367 -26 -115
4336 -115 86 -253 -100 89 -90 199 68 123 -270 -74 23 -178 4 -154 -79 142 228 -105 -266 235 105
4357 105 93 0 28 -90 13 121 -63 43 -222 -24 159 -129 -44 -187 48 -18 -122 61 44 70 73 274 -62
4380 -62 158 131 1 -23 -2 121 -57 71 -16 53 34 -141 24 83 -180 -212 56 88 -174 -80 -35 -221 51 -120
4404 -120 -234 -10 75 -94 6 102 -206 76 -17 -456 38 50 75 -8 -44 170 -179 37 -121 -397 -157 -91 22
$$ packed form
4241h5L01j10j6J04m8k04N9O9L57n50l1K73j02j00j65K84J2n8R8J21l66K67k5
4264H5j12J27ok85J78j3Q2K0K0j38j25p5J72k13K23J18nJ52m6j64J17k96J87J38
4288A41j13r5J26j17LmK48j78O7k9k20J15r2J28K27k12j01J10k4K56m68J74Q8
4311C0k2j34J30j19O0J5R3Q4J03n3l01j55J16j28K48mMP3k63K81Q7o8K90l93q9
4336a15K01l39J53J89j79K89j31N5l93J96R7k01J82j58P5K21Q6l33j61N01j30
4357A05j2r3K8j18J03J08j84J06k65J98J83k88Q5j43K35o6j04J83j7K6LK01l36
4380f2K20k7j30k4K1J23j78J28q7O9j9j75J65N9k63l2K68L2k62R4M5j86K72j71
4404a20j14K24Q5j69J00R6l08K82r3m39M94J2K5q3l6K14l49K16j58k76K40O6J13
$$ plain form
4427 22 38 195 110 -383 -74 19 79 -62 -168 273 256 23 -278 -307 -202 11 -236 -42 -47 94 78 54 -127 195
4451 195 -323 -26 -77 128 -365 -356 67 19 -111 51 -204 -5 -1 100 89 -154 27 244 -40 258 12 -100
4473 -100 162 51 29 -82 -3 140 65 53 -213 -90 -38 -52 22 -107 -49 134 285 80 -20 -119 23 -104 104
4496 104 123 49 -84 -89 -2 -260 -58 203 -35 19 21 -40 132 94 59 -286 199 29 66 -127 -1 126 -40 17
4520 17 -220 -173 -54 -64 -30 49 -22 94 171 42 73 -82 107 110 172 -70 -151 30 -128 104 -75 70 -236 -98
4544 -98 83 305 0 339 387 58 149 282 -140 136 -106 -82 -145 -193 -4 182 114 6 -38 -162 7 110 69
4567 69 37 -39 -119 -74 24 -120 29 -36 -223 -254 -42 -19 -28 -199 199 97 -23 -128 -84 139 -72 -53 112 43 167
4592 167 197 -25 50 -266 44 28 -42 125 23 -42 220 121 49 -123 -163 285 87 -50 -55 -175 57 -227 -16
$$ packed form
4427B2J6J57q5m93L09R3O0j41j06M41j7k33l01k9J05K13k47J94nJ41j6k4j81L22
4451A95n18K97n1K05m93RM23m8j30J62k55J99MJ01j1k43J81K17k84K98k46j12
4473a00K62j11k2j11P9J43p5j2k66J23N2j4P4j29N8J83J51k05j00r9J42j27K08
4496A04J9p4j33nQ7k58K02K61k38N4Ko1J72l8l5l45M85j70L7j93J26J27j66N7
4520A7k37M7J19j0L4P9p1J16P7j29L1j55J89LO2k42q1J81j58K32j79J45l06J38
4544i8J81K22l05L39M8l29R1J33m22K76k42K4o3m8J89J86o8j08m4j24J69J03m1
4567F9l2p6q0M5R8j44J49o5j87l1K12K3rj71L98j02j20j05M4K23k11J9J65o9J24
4592A67L0k22P5l16L10j6p0J67j02o5K62r9p2j72m0M48j98j37nj20K32k84K11
$$ plain form
4615 -16 211 -234 90 75 -22 154 -37 -168 50 -53 -56 -262 42 -100 112 175 -94 -146 102 -156 -52 -21 -171
4638 -171 -163 -109 171 64 93 146 -103 -101 96 29 -45 -234 77 -121 354 40 5 -252 -20 38 -86 -433 98 -26
4662 -26 142 126 66 5 -88 215 123 156 -26 93 85 361 -105 138 233 -62 -15 101 68 -31 87 252 112 -7
4686 -7 -124 -118 133 139 -62 -122 79 -10 -193 -13 238 99 129 -72 -230 107 -182 202 -96 208 -149 184 -72
4709 -72 21 136 -52 54 70 42 -81 73 197 46 -106 -163 136 -44 277 174 26 -191 85 53 197 212
4731 212 -82 -254 -114 248 -368 43 -146 85 -104 44 193 -134 303 -30 237 -129 7 223 -74 28
4751 28 -265 102 -50 -43 -149 46 41 -1 186 263 -2 79 -16 -55 -60 -134 -192 -51 -80 -87 -173 124 135 -60 182 189 -91
4778 -91 170 24 110 -194 139 8 -48 57 36 -14 125 184 -154 110 -134 169 -79 -143 17 61 17 138 -177
$$ packed form
4615a6K27m45L24j5r7J76j91j31K18j03lk06L04j42K12O3k69n2K48k58J04L1j50
4638a71QN4K80j07K9N3k49KJ97o7p4j89L11j98M75l14l5k57K32N8j24l47N31j24
4662b6J68j6o0o1r3L03r2L3j82J19qK76m66K43R5k95M7J16l3r9J18J65j40j19
4686gj17OK51Ok01o0K01q9j83J80K51j39L0k01j58L37k89L84k98L04l57L33k56
4709g2R3J15j88J06J6k8j23J54J24j51j52n7K99j80L21j03j48k17K76l2J44J5
4731B12k94j72J40L62o16M11j89K31j89J48J49l27M37l33K67l66J36K16k97J02
4751B8k93L67j52Pj06J95nm2J87P7k65Q1r5l9np4n8J41k9pq6K97J1j95K42Pk80
4778i1K61j46Q6l04L33j31n6J05k1n0J39N9l38K64k44L03k48o4J60M4m4J21l15
$$ plain form
4801 -177 91 77 70 -25 -157 168 -211 -22 66 95 -7 96 -67 296 192 52 -39 -44 47 141 28 107 199 -26
4825 -26 109 134 -94 -197 -58 -319 109 -109 -126 -4 12 -123 50 100 -31 11 -158 72 -78 -9 176 -70
4847 -70 -29 212 18 -144 -53 -59 -122 138 16 -137 -73 -25 85 -170 74 -305 144 8 110 -94 62 100 184
4870 184 40 -69 -203 -23 -6 169 -25 206 341 -220 -77 -191 -154 227 171 135 139 66 -30 -23 -9 -76 -78 -56 -116
4895 -116 -44 126 -385 -50 -32 26 186 30 131 -186 -141 101 82 -48 -113 36 -82 195 159 183 120 -177 -29
4918 -29 15 -130 160 -77 -153 69 -183 186 -16 -373 7 -103 -93 60 32 12 223 66 -5 100 -82 307
4940 307 56 89 180 17 -184 -102 -94 109 56 59 -30 149 99 -58 199 21 -32 88 82 38 36 -195 -92 33 -147
4965 -147 -45 -39 259 -136 26 123 70 120 28 157 -300 -7 -122 -60 150 162 -73 -1 -31 -268 77 -1 -32 129
$$ packed form
4801a77K68j4pr5j32L25l79J89Q8K9j02J03j63L63j04j40r1nR1R4j13P9R2k25
4825b6J35K5k28j03J39k61M28k18j7J22J6j35J73N0j31M2j69K30j50O9J85k46
4847g0M1K41j94j62R1oo3K60j22j53O4M8J10k55K44l79M49j36J02k04J56L8Q4
4870A84j44j09j34J80J7J75j94K31J35n61J43j14L7L81n6l6Mp3r6PJ4o7kK2o0
4895a16P2J70n11L35J8N8J60j56J01l17M5K42j9j30o5J49j18K77l6K4o3k97J48
4918b9M4j45K90k37p6K22k52L69k02l57L80j10J0J53k8k0K11j57p1J05j82L89
4940C07k51L3R1j63k01Q2QK03n3Lq9J79n0j57K57j78n3J20om4kk31J03J25j80
4965a47J02OK98l95J62R7n3N0r2J29m57K93j15O2K10J2k35P2l0k37L45p8l1J61
$$ plain form
4989 129 -70 -78 -117 -144 -99 -157 -73 -83 -170 4 120 216 135 -183 47 99 152 90 -226 -60 154 -140 109 5 52
5014 52 130 -111 -36 61 -89 179 -20 -89 -48 13 21 -136 -77 90 246 147 -23 -42 -45 -68 -121 8 -155 -61 38 127
5040 127 25 52 87 11 -27 -98 325 9 26 -8 -32 -90 94 63 -160 177 -260 -152 110 120 83 226 -180 -57
5064 -57 36 -124 48 62 63 -65 -135 -79 19 111 -216 4 1 -142 -119 40 -14 9 164 -120 -158 -60 -49 288 80 -144
5090 -144 73 -15 -19 8 -104 -103 16 -28 67 102 258 -82 153 268 204 -118 -74 26 -173 -62 -54 -110 -35 237 -121
5115 -121 -123 -28 3 -37 17 177 135 54 -33 244 95 136 43 156 -44 88 238 125 73 14 -109 26 124 57 12
5140 12 58 -223 -125 36 -12 143 -20 -138 62 -100 -119 -30 38 -100 103 -81 -176 2 -69 96 -108 139 -10
5163 -10 -260 -231 -65 -156 -243 64 -156 113 -203 95 206 -239 -4 -141 22 146 189 103 -133 43 -6 -75 43
$$ packed form
4989A29j99ql9k7M5n8Q4j0q7J74J16R6q1l18K30N2N3o2l16J66K14k94K49j04M7
5014E2P8k41P5R7j50K68j99o9M1O1Qj57N9J67J56r9j70j9lk3n3J29j63R4R9Q9
5040A27j02K7L5p6l8p1M23l16J7l4k4n8J84l1k23L37m37J08K62J0l7J43m06J23
5064e7R3j60J72J4Jj28p0N6R8R2l27K20lj43K3J59n4K3J55k84l8R8J1L37k08k24
5090a44K17q8mK7j12JJ19m4R5L5J56l40K35J15o4l22M4J00j99J11Qn6P5K72l58
5115a21kR5L1m0N4J60m2q1q7K77j49M1r3J13k00J32J50j13n2n9j23J35R8o7m5
5140A2M6k81R8J61m8J55j63j18K00j62j9Q9O8j38K03j84r5J78p1J65k04K47j49
5163a0k50K9J66r1q7L07k20K69l16K98J11m45K35j37J63J24M3q6k36J76m9o9J18
$$ plain form
5186 43 -45 265 12 133 104 325 116 11 62 20 -128 -14 -26 244 -119 -155 61 62 -158 46 6 17 -66 -120
5210 -120 -69 147 6 -75 -246 -12 -65 -65 59 -49 27 -163 115 58 80 10 53 96 207 21 24 66 294 178 -59
5235 -59 1 -287 -29 332 12 -79 68 69 -107 -61 -79 74 -126 55 35 259 50 154 88 243 225 18 -92
5258 -92 141 -148 59 -223 146 150 -83 388 -8 47 -172 59 26 -66 -195 239 2 -259 4 90 44 -56 29
5281 29 -193 302 -241 -79 -103 -208 56 -41 23 -92 147 -72 -118 -49 193 315 68 -79 173 -131 -38 26 -381
5304 -381 -487 185 2 66 -106 55 155 -23 19 -127 265 345 -24 267 -134 -269 270 -44 97 -1 -41 12
5326 12 -55 107 -108 -124 79 62 18 -163 71 -116 -332 196 171 36 308 -170 100 -121 -68 118 -15 84 135
5349 135 -149 126 70 -55 -106 -67 -19 -149 -262 -60 56 -226 -9 236 -124 40 26 121 109 -109 50 -63
$$ packed form
5186D3q8L10k53J21k9K21k09j05N1m2j48J14j2K70l63l6K16Jk20K04m0J1q3n4
5210a20N1K16j41q1j71K34n3%J24j08P6j90K78n7K2p0M3M3J11j86LM2K28j16k37
5235e9O0k88K58L61l20r1J47Jj76M6j8J53k00J81k0K24k09J04o6J55j8k07j10
5258i2K33k89K07k82L69Mk33M71l96N5k19K31l3r2j29M34k37k61K63Q6m6j00Q5
5281B9k22M95n43J62k4j05K64r7O4j15K39k19m6O9K42J22k47j47K52l04R3O4m07
5304c81j06O72j83O4j72J61J00j78M2j46L92Q0l69K91m01j35N39l14J41r8m0N3
5326A2o7J62k15j6K03j7m4j81K34j87k16N28k5j35K72m78K70k21N3J86j33R9N1
5349A35k84K75n6j25n1L9M8j30j13K02J16k82K17K45l60J64j4R5j2k18J59j13
$$ plain form
5371 -63 135 152 106 118 -169 221 20 239 -74 0 64 173 76 38 95 149 -226 87 -56 -130 -21 164 143 134 -87
5396 -87 214 -5 -113 -157 -19 -127 -324 -151 -133 -96 -208 -143 -4 140 54 2 68 -111 294 74 -58 65 -121
5419 -121 -355 -150 -52 -20 4 62 -112 101 -95 -90 123 -32 -103 -49 -101 202 236 166 105 -252 1 -63 -152 -107 219
5444 219 21 -52 -61 19 91 0 -146 -17 81 -52 -134 42 -38 207 42 11 141 -219 110 -42 128 -70 45
5467 45 94 72 130 -4 -25 -3 -132 84 -29 7 62 261 166 -384 -22 -169 24 174 165 162 41 110 -290 74 -213
5492 -213 -10 -41 170 90 6 138 -7 -16 -199 -154 55 6 -236 60 -18 61 235 -124 150 11 94 14 -183 192
5516 192 -93 207 -38 -300 -64 -343 247 91 -6 52 50 -444 -10 143 -91 7 -41 187 -48 -48 -234 124 130
5539 130 50 43 -211 109 -17 -17 -134 152 -148 -50 -88 39 -139 -169 35 132 5 -57 232 -159 -8 1 -142 199
$$ packed form
5371f3J98J7m6J2k87L90k01K19l13P4O4J09r7l8N7N4l75L13j43p4J09J85k1rk21
5396h7L01k19j08m4J38j08j97J73J8L7j12O5J39J44q6n2O6j79M05k20j32J23j86
5419a21k34K05R8L2K4N8j74K13j96NK13j55p1N4n2L03L4p0o1l57K53o4q9M5L26
5444B19j98p3rQ0P2r1j46J29R8j33q2J76q0K45j65l1J30l60L29j52J70j98J15
5467D5M9k2N8j34k1K2j29K16j13L6N5J99r5n50L62j47J93J50rlj21O9m00L64k87
5492b13K03l1K11q0q4J32j45rj83M5K09m9k42K96p8P9J74l59K74j39Q3q0j97L75
5516A92k85L00k45k62K36k79N90j56r7N8km94M34J53k34R8m8K28k35%j86L58O
5539A30q0pk54L20j26%j17K86l00R8l8J27j78l0K04R7j27o2K89l91J51Rj43L41
$$ plain form
5563 199 -53 192 18 250 87 -44 -399 -127 119 150 3 116 -119 142 -142 -64 -252 -297 21 -107 -20
5584 -20 87 -118 2 -28 -212 71 133 140 6 41 21 -72 111 229 -131 81 -73 -74 121 -30 315 -6 -219
5607 -219 50 131 -343 502 -6 71 401 -81 -144 10 316 -155 -171 -86 -33 31 -162 -137 57 156 -88 186 57
5630 57 17 353 103 177 -24 142 -154 -69 -190 -47 29 -179 -186 92 -161 185 17 80 29 88 78 -175 62 48
5654 48 170 -89 -6 -210 -73 95 87 245 -209 -375 -155 290 184 -70 164 41 0 112 20 -102 -127 122
5676 122 153 -76 -127 -135 42 -74 57 -183 2 22 73 91 6 80 315 -125 25 146 -39 45 -291 -231 102 54
5700 54 -64 -143 -178 -122 72 201 -84 187 -57 -183 41 68 -128 141 -376 -34 70 68 -131 9 191 164 -49
5723 -49 -90 161 -66 -77 2 -46 -19 -157 -202 35 233 14 -219 -199 -281 -29 -300 -254 206 21 -80 -37 135 341
$$ packed form
5563A99k52K45j74K32j63j31l55K72K46L1j47J13k35K61k84P8j88m5L18j28Q7
5584b0J07k05J20l0j84K83O2Pj34L5k0r3J83J18l60K12j54jJ95j51L45l21k13
5607b19K69Q1m74Q45n08P7L30m82o3J54L06m71j6Q5N3O4j93K5J94R9k44K74j29
5630E7m0L36k50P4k01J66k96Q5j21J43P6k08pK78k53L46j68O3n1N9j0k53K37j4
5654D8J22k59Q3k04J37J68qJ58m54j66K20M45j06k54K34j23m1J12r2j22k5K49
5676A22L1k29n1qJ77j16J31k40J85K0N1J8q5P4K35m40J50J21j85Q4l36O0L33m8
5700E4j18p9l5N6J94J29k85K71k44j26K24K7j96K69n17L42J04kj99J40J82k7k13
5723d9m1K51k27j1P9m8K7j38m5K37J98k19k33K0q2K52k71M6M60j85j01M3J72K06
$$ plain form
5747 341 119 -142 400 -54 139 48 16 56 116 -14 208 -60 12 -171 -64 -20 27 71 188 32 199 -320 155
5770 155 -59 -78 -27 -111 160 -70 -155 339 104 101 -62 57 -15 -53 -28 22 -178 104 -23 218 30 59 83 -14
5794 -14 7 -117 121 389 -89 51 83 -2 -107 -375 -33 -100 39 -10 -82 60 -47 106 -48 6 -158 279 -74
5817 -74 -136 182 -8 11 -72 -268 291 -125 71 -93 38 14 -175 -35 12 43 171 -22 94 189 137 279 26
5840 26 176 98 164 18 -51 -246 342 9 -54 126 -80 -254 61 161 -94 76 167 48 -191 -121 82 89 135
5863 135 -207 30 -257 32 -17 0 -67 117 203 -195 41 0 55 -3 76 -139 184 145 29 243 125 109 74 -77
5887 -77 -1 293 51 36 121 70 69 42 195 -54 -171 -318 155 -294 83 -3 -104 -128 -34 139 135 105 110 264 -102
5912 -102 70 69 114 -113 189 -17 -133 196 98 -41 14 29 71 -76 -167 31 68 224 -159 32 -207 177 8
$$ packed form
5747C41k22k61N42m54J93r1l2M0O0j30K22k68P2j83J07M4M7M4J17j56J67n19M75
5770A55k14j9N1q4K71k30q5M94k35lj63J19p2l8K5N0k00K82j27K41j88K9K4r7
5794a4K1j24K38K68m78J40L2q5j05k68L42o7J39m9p2J42j07J53j54N4j64M37l53
5817g4o2L18j90J9q3j96N59m16J96j64J31k4j89J40M7L1J28j93J16R5n2J42k53
5840B6J50p8O6j46o9j95N88l33o3J80k06j74L15J00k55J70R1j19k39P0K03PM6
5863A35l42K37k87K89m9J7o7J84Q6l98K36m1N5n8P9k15L23l9j16K14j18j6l5j51
5887g7P6K94k42j5Q5n1jk7J53k49j17j47M73m49L77q6j01k4R4J73ml0NJ54l66
5912a02J72jM5k27L02k06j16L29r8j39N5J5M2j47r1J98L7J56l83J91k39L84j69
$$ plain form
5935 8 -220 -138 -60 -54 237 143 -291 70 -306 -54 152 125 105 -58 -118 72 -25 122 185 -68 -141 56 -192 -39
5959 -39 -207 77 100 -342 80 257 18 59 21 -200 137 -55 155 121 0 -249 -1 150 -96 -17 -36 -137
5981 -137 136 60 100 225 55 -30 -184 -56 76 -25 2 -49 -220 222 -16 -129 -76 46 112 180 -15 -8 30 -71
6005 -71 61 -15 57 104 12 85 -184 130 -116 218 128 -148 -189 -83 183 -27 161 -242 86 -83 -141 155 -171
6028 -171 10 207 -50 226 -85 -267 -41 -125 -16 -249 -115 -229 -15 72 124 -118 -223 181 117 172 80 225
6050 225 187 -50 -31 15 98 95 82 91 -17 -9 34 -8 192 332 276 -19 100 -105 56 -208 91 -143 -61 146 100
6075 100 -170 -2 26 -275 152 107 131 14 76 111 -16 -144 57 130 -39 178 248 -155 282 -291 -192 94 -69
6098 -69 -256 29 73 4 27 5 244 80 -147 69 -176 -82 -11 42 83 -266 -53 -60 209 24 -157 -75 85 -218
$$ packed form
5935Hk28Q2P8OK91r4m34L61l76K52K06k7k0j63o0J90r7J47O3k53p3J97k48J53
5959c9j68K84K3m42M22J77k39M1l8k21L37j92K10l4j21k49K48J51k46P9j9j01
5981a37K73p6M0J25j70q5j54J28J32j01K7n1j71M42k38j13N3J22O6O8j95PL8j01
6005g1J32p6P2M7r2P3k69L14k46L34r0k76m1J06K66k10J88m03L28j69n8K96l26
6028a71J81J97k57K76l11j82K26q4J09k33J34j14K14Q7N2k42j05M04o4N5r2J45
6050B25l8k37J9M6Q3lj3Rj08QM3m2K00J40n6k95J19k05J61k64K99k34Q2K07m6
6075A00k70J68K8l01M27m5K4j17O2L5j27j28K01P3j69K17P0m03M37n73R9K86j63
6098f9j87K85M4o9K3k2K39j64k27K16k45R4P1N3M1l49K13pK69j85j81Q2J60l03
$$ plain form
6122 -218 148 47 -28 132 -40 178 35 61 241 -106 -234 192 -124 -166 -122 -76 -147 -167 98 226 -52 51
6144 51 90 187 83 81 -515 -209 -227 -40 -76 131 -193 -88 173 -200 -134 -84 104 -128 -199 73 36 -54 60 -61
6168 -61 87 123 3 126 -90 -13 92 402 95 -27 -177 -41 77 39 -217 31 56 -38 257 -89 49 195
6190 195 290 145 310 -122 -125 -50 -108 -93 103 -222 -55 -208 4 184 9 -108 -75 -122 -101 93 -21 -35 195
6213 195 -56 -5 135 221 126 86 -33 -10 3 -3 -146 -2 -121 65 67 66 -266 23 17 -63 105 31 154 -159 -291
6238 -291 111 139 -107 30 -65 11 118 -139 -58 -60 118 148 205 87 -58 179 -147 -156 88 -156 -66 -25 -144 65
6262 65 135 -103 -219 -6 127 -10 77 -102 201 -132 -37 54 72 -183 -14 113 -71 90 -90 -73 -52 -121 154
6285 154 -124 5 -155 -45 -346 -39 170 -140 -79 -84 -156 -88 -78 3 255 -159 -44 -86 11 139 119 -132 -228 52
$$ packed form
6122b18L66j01p5J60j72K18j43K6J80l47j28M26l16m2M4M6p1k0K65J28k78J03
6144E1L9R7j04kn96L06j8J87l6K07l24J05K61l73O6N0J88k32p1K72l7r0J14j21
6168f1J48L6j20J23k16P7J05L10l07j22j50J36J18l8k56K48K5r4K95l46J38J46
6190A95R5j45J65m32lP5n8J5J96l25J67j53K12J80j75j17L3m7K1J94j14j4K30
6213A95k51N1J40Q6r5m0j19K3J3oj43J44j19J86Kjl32K89oq0J68p4J23l13j32
6238b91M02K8k46J37r5P6J07k57Q1kJ78L0N7j18j45K37l26rK44k44R0M1j19K09
6262F5P0k38j16K13J33j37Q7j79L03l33R5R1J8k55J69J27j84J61j80J7K1o9K75
6285A54k78J29j60J10l01L07K09l10O1np2O8J0Q1K52m14J15m2R7J28k0k51r6K80
$$ plain form
6309 52 -65 -35 94 140 19 11 -71 -182 32 -107 -194 21 3 -205 -17 -339 5 40 183 -60 -150 -5 -283
6332 -283 -67 91 45 70 90 -147 -25 -123 -92 147 -75 -135 116 -148 44 -318 -178 29 -233 67 88 202
6354 202 113 -8 232 -135 33 4 3 7 -43 394 -174 31 -239 -195 -232 -161 301 -104 27 262 -178 97 -108
6377 -108 77 -2 -83 -60 218 8 158 224 -154 166 -14 38 74 101 43 -210 154 214 40 -29 -137 -36 112
6400 112 19 -62 -73 85 67 182 -122 55 106 35 219 132 218 126 -232 -94 -217 -13 44 -91 -109 181 -153 114
6424 114 47 177 197 95 48 76 121 156 -7 -36 194 -189 -106 -93 -155 -152 -34 43 -143 -35 67 -125 53 -98
6448 -98 -177 63 78 -256 -40 -145 25 75 -112 23 -96 68 192 -213 33 -66 135 -67 -277 -21 -161 -56
6470 -56 123 161 -4 51 138 -85 162 -58 195 -101 -23 76 -9 -218 -206 -13 107 337 -109 283 218 33 -25
$$ packed form
6309E2j17L0J29M6j21qq2j11K14j39q7K15j8k08J88l22L44L5J43k43r0J45k78
6332b83K16J58m6K5K0k37J22r8L1K39k22o0K51k64J92l62J40K07k62L00K1J14
6354B02q9j21K40l67J68k9jMn0M37n68K05k70M4l7P1M62m05J31K35m40K75k05
6377a08J85p9q1K3K78k10J50O6l78L20j80N2L6K7n8k53L64O0j74o9j08J01J48
6400A12r3q1j1J58j8J15l04J77N1p1J84q7Q6r2l58J38j23K04N7j35j8K90l34K67
6424A14o7J30K0j02m7K8M5L5j63k9K30l83Q3J3o2LJ18P7j86J08J02j92J78j51
6448i8p9K40J5l34K16j05J70N0j87J35j19J64J24m05K46r9K01k02k10K56j40J05
6470e6J79L8j65N5Q7k23K47k20K53k96P8R9q5k09J2J93J20K30m46L92o5j85n8
$$ plain form
6493 -25 74 281 194 111 -35 189 -87 89 -136 -184 32 26 -38 58 -379 205 -97 -170 -460 304 -195 -2 115
6516 115 -23 207 -245 -31 16 28 65 -86 -140 97 -13 73 -10 -108 95 -13 -207 -53 -161 -90 -165 -194 301
6539 301 -37 118 134 -5 -237 14 16 200 -125 -110 47 -92 30 -27 82 98 9 69 118 216 109 -2 -160
6562 -160 -10 -61 14 7 204 -12 -144 -89 -74 97 -74 -105 -162 -6 209 156 171 -185 107 -36 202 -25 -19 -152
6586 -152 -81 151 -16 -261 -147 1 103 -124 99 61 110 81 192 357 -59 252 -173 210 -28 -96 41 -59
6608 -59 89 12 -52 135 96 27 -254 88 177 59 -102 -60 -55 178 -20 313 -171 239 52 21 157 209 64 107
6632 107 -53 -115 179 -77 67 -111 39 79 -19 -78 248 -247 -30 -82 135 -19 13 33 28 8 -149 66 43 -91
6656 -91 -41 -22 80 54 -122 125 -47 -47 104 -30 14 182 161 48 -92 -182 -12 73 5 164 262 376 -154 -176
$$ packed form
6493b5R9K07q7q3j46K24k76J76k25m8K16oo4R6m37N84l02p3k90P64m99J93J17
6516A15j38K30m52K14M7J2L7j51n4K37j10Q6q3r8K03j08j94J54j08P1p5k9M95
6539C01l38J55J6j39k32K51KJ84l25J5J57j39J22n7J09J6q9O0M9R8j07j11j58
6562a60J50n1P5pJ97k16j32N5J5J71j71l1n7J56K15n3J5l56K92j43K38k27Oj33
6586a52P1K32j67k45J14J48J02k27K23l8M9k9J11J65m16L11m25L83k38o8J37j00
6608e9J48p7o4J87l9o9k81L42Q9j18j61M2NK33j98L33m84M10j87l1J36N2j45M3
6632A07j60o2K94k56J44j78J50M0r8n9L26m95K17n2K17j54L2K0nk0j57K15k3j34
6656i1N0J9J02k6j76K47j72%J51j34M4J68k1j13j40r0J70Q5o8J59R8J14n30k2
$$ plain form
6680 -176 38 -301 -4 -28 -74 -367 57 -68 116 -113 -107 95 -75 -13 83 79 5 73 30 -89 -119 131 77 64 -18
6705 -18 -207 118 -52 -6 5 47 111 -93 -181 -169 166 227 -115 124 -191 187 -50 -28 19 -168 -64 -212 290
6728 290 -84 178 -72 -223 133 187 -73 -87 24 1 262 -100 -347 185 -11 -128 41 -106 -95 -57 167 -9
6750 -9 -21 -125 -23 -12 293 -180 -64 -248 70 221 136 1 -77 -68 -72 -155 179 124 -6 -71 169 -153 -38 26 172
6775 172 -34 -23 15 -121 -43 103 -25 -71 127 43 81 76 28 -45 -196 -15 22 -21 142 190 -165 44 118 -40 -46
6800 -46 -147 94 -96 4 -147 94 14 171 -5 339 185 -56 85 435 166 -94 59 -113 111 -274 -161
6821 -161 -28 -127 183 -54 -38 43 104 38 -22 -110 -62 71 93 189 -100 72 61 -191 -57 110 16 231 312 -188
6845 -188 189 147 40 46 115 57 -194 254 -52 -67 107 311 8 -187 30 28 106 68 65 28 154 105 -35 -72 -157
$$ packed form
6680a76K14l39K97k4m6k93M24j25J84k29OK02j70O2R6mp4O8m3j19l0K50n4j3q2
6705a8j89L25j70M6J1M2O4k04q8J2L35O1l42K39l15L78k37K2M7j87J04j48N02
6728B90l74K62k50j51L56N4k60j4J11k3K61l62k47N32j96j17J69j47J1L8K24j76
6750ij2j04J02J1L05m73J16j84L18J51q5j35p8Rmq3L34n5j30o5K40l22J15O4J46
6775A72k06J1L8j36P8J46j28m6J98q4L8nm8p3j51J81L7m3J63M8l55K09P4j58o
6800d6j01K41j90J00j51K41q0J57j76L44j54k41J41L50k69k60J53j72K24l85J13
6821a61J33r9L10k37J6Q1O1o6o0q8M8J33K2R6k89J72j1k52J34J67r4K15Q1n00
6845a88L77m2j07OO9n8k51M48l06j5J74K04l03j95K17kP8l8ll7J26m9j40l7q5
$$ plain form
6870 -157 110 -284 -28 51 -141 -28 -54 -36 -47 -89 -79 79 98 -70 -132 -287 -249 64 114 224 -40 -173 7
6893 7 123 296 140 -114 -99 -6 7 -227 -222 -16 29 23 -137 -24 -24 -190 67 -21 45 -67 137 -50 282 -40 121
6918 121 65 69 -317 -25 -68 -32 160 -154 125 149 -9 -37 -113 41 220 150 271 -39 325 -50 -88 65 146 -1
6942 -1 77 71 -52 -17 -167 -183 27 60 47 -31 -54 -188 -194 175 -32 -96 -77 186 50 33 -95 64 114 0 56 122
6968 122 214 34 5 29 23 -28 -229 177 94 -194 128 -55 82 -25 71 138 -129 -292 -66 -66 73 -44 -10 -83
6992 -83 25 220 -160 -77 152 -186 102 262 156 -116 -110 -17 -127 26 -4 148 21 -240 -51 66 -121 -82
7014 -82 -65 248 214 44 114 -55 105 44 107 25 101 -104 -361 -196 -32 -164 -246 -124 -70 -73 152 65 59 19 -100
7039 -100 20 -175 -201 -83 -91 -181 175 17 110 79 145 19 65 -365 90 -25 -32 22 -92 -104 -355 -17 18 -147
$$ packed form
6870a57K67l94K56P9j92J13k6J8j1m2J0J58J9j68o2j55L8L13N0J10k64j33J80
6893GJ16J73j56k54J5R3J3k34NK06M5oj60J13%j66K57q8O6j12K04j87L32l22J61
6918A21n6Ml86K92m3L6J92l14K79K4j58k8p6J54J79p0J21l10L64l75l8J53Q1j47
6942aP8oj23L5j50j6K10L3j3p8k3j34oL69k07o4J9K63j36j7j28J59N0j14N6O6
6968A22R2j80k9K4on1k01M06q3k88L22j83J37j07R6O7k67j63K26%J39j17L4p3
6992h3J08J95l80Q3K29l38K88J60j06k72OR3j10J53l0J52j27k61J89J17j87L9
7014h2J7L13l4j70P0j69J60o1O3q2P6k05k57J65J64j32q2J22N4lK25q7om0j19
7039a00J20j95k6J18qr0L56j58R3l1O6j26M6m30M55j15pN4j14j2k51L38L5j65
$$ plain form
7063 -147 16 97 -263 20 143 -22 -94 309 273 -193 72 -32 183 180 -81 -163 -251 286 225 -25 29 -35 -72 54
7087 54 183 26 -157 -250 -148 160 -149 128 265 78 -160 -196 -149 -49 15 118 -76 -59 -146 -52 221 -87 -157
7110 -157 155 309 -136 -66 -132 -1 -73 -297 88 -224 -123 -243 186 -155 51 -85 -227 90 -27 -43 -39 -106
7132 -106 183 40 -7 143 -162 -8 78 132 54 33 123 70 111 -223 97 100 -99 0 -260 -173 114 -169 -71 -143 -16
7157 -16 -32 -171 -74 266 427 -87 -34 10 90 -128 -107 -226 116 -47 131 133 98 -193 94 66 -426 28 -38 46
7181 46 171 254 -128 17 58 -162 -114 115 43 -65 36 143 130 49 -153 -304 -103 24 -26 -61 -78 47 -121
7204 -121 -364 -105 25 86 -157 38 -76 -76 -256 -91 -184 -188 -95 -6 129 -197 -267 179 311 -107 35 -215 117
7227 117 132 -182 -155 75 16 -6 90 -284 74 -158 -78 -346 -12 4 -110 137 -42 265 -64 82 -80 143
$$ packed form
7063a47J63Q1l60K83J23j65p2M03l6m66K65j04K15lk61q2q8N37o1k50N4o4l7J26
7087E4J29j57j83r3J02L08l09K77J37j87k38l6M7J00O4J03j94J7q7R4K73l08p0
7110a57L12J54m45P0o6J31p2k24L85l12J01j20M29l41K06j36j42L17j17j6Mo7
7132a06K89j43m7J50l05J54Q6N4p8k1R0n3M1l34L20Lj99R9k60Q7K87k83R8p2J27
7157a6j6j39R7L40J61n14N3M4Q0k18K1j19L42j63J78Kl5k91K87k8m92M54o6Q4
7181D6J25Q3l82J45M1k20M8K29p2j08J01J07j3q1k02j51K01J27n0l5j7J25j68
7204a21k43K59J30O1k43J95j14%j80J65r3mR3Q9J35l26p0M46J32m18J42k50L32
7227A17J5l14K7K30n9k2R6l74L58k32Q0k68L34J6j14K47j79L07l29J46j62K23
$$ plain form
7249 143 49 -160 -31 -30 46 -126 96 -26 -114 73 -159 43 71 -81 -21 -239 -24 180 8 -99 -162 -3 -318
7272 -318 375 29 263 -190 -22 173 -70 -12 39 -231 19 -4 -64 24 124 -113 -69 -17 -78 -89 -99 104 -87
7295 -87 -9 -258 -64 169 -125 -68 -148 66 -147 175 277 7 103 -132 -283 -176 -102 92 -41 -81 126 -201
7317 -201 -224 -124 -59 107 -274 -125 -85 73 -374 70 37 95 175 43 63 -42 68 132 -15 138 -34 241 41
7340 41 93 -30 -122 -67 24 102 -28 -345 -99 182 -15 111 -246 43 45 155 -3 -60 23 -163 -114 -45 -16 82 195
7365 195 156 -19 -98 -90 -70 -287 -161 162 -87 283 68 262 127 12 71 73 -16 -154 -11 162 -39 108 -52
7388 -52 74 2 -65 154 -168 151 281 -12 -121 186 127 -120 127 256 -38 -101 -160 -175 118 48 -92 -147 121
7411 121 -266 -43 167 -138 255 29 108 193 161 -47 123 91 -46 49 -206 -281 64 -103 26 -112 -37 -161
$$ packed form
7249A43r4k09J29JP6j72K22j22q8J87k32K02K8j52O0k18K15K04j72j07o3J59l15
7272c18O93l46K34m53J68J95k43N8N1k70K50k3o0Q8J00k37M4N2o1j1j0K03j91
7295h7P8k49J94K33k94N7q0K14k13L22J02k70R6k35j51J07P4J94j33m0K07l27
7317b01k3J00O5J66l81J49M0J58m47M44l3N8Q0j32K0j05J10O4j47J53j72K75k00
7340D1N2j23r2N5R1P8j30l17K46K81j97J26l57K89KJ10j58n7Q3j86M9O9K9R8J13
7365A95l9j75p9QK0k17J26L23k49L70k15J94j35j15N9Kq9j38J43J73k01J47j60
7388e2J26p2o7K19l22L19J30k93j09L07n9k47K47J29k94o3n9j5K93p0j40n5K68
7411A21l87K23K10l05L93k26P9Q5l2k08J70l2j37R5k55p5L45j67J29j38P5j24
$$ plain form
7433 -161 -54 94 178 -95 -177 138 -266 -70 -47 143 142 82 132 252 -131 141 -50 -56 339 -5 -1 -242 18 95
7457 95 -95 -9 -27 83 -124 132 -62 -203 -55 -270 240 132 146 -230 -175 -130 -72 -66 -63 -277 -110 -60 10 -51 -144
7482 -144 -33 127 139 -238 -90 -294 -354 -119 56 -3 142 -108 -235 -104 92 159 2 -18 -36 59 -223 138
7504 138 173 30 250 -112 -83 -64 -147 -48 -237 50 140 212 109 -101 -18 133 -128 -163 -130 18 -50 394 245 157
7528 157 -252 -65 -23 -165 -184 61 305 -163 104 71 132 -114 18 161 88 -225 48 -16 176 32 -150 56
7550 56 -5 51 -74 -21 99 213 -55 96 -15 -9 149 -23 19 -66 -75 -140 105 -71 -113 171 -34 36 144 47 -43
7575 -43 -64 -21 -54 -103 -1 -52 24 67 -3 123 -30 49 28 -130 -165 98 74 39 104 -38 -97 -297 133 18 195
7600 195 161 18 88 129 192 -224 -41 181 74 -197 132 65 143 -85 235 -449 68 -267 -40 -5 -78 13 100
$$ packed form
7433a61J07J48Q4k73q2L15m04J96K3J90jo0N0J20l83K72j91oL95l44Mk41K60P7
7457I5j90Q6j8J10k07K56j94j41J48k15N10j08J4l76N5M5N8OLk14J67N0P0o1r3
7482a44J11J60J2l77J48k04o0K35J75n9J45k50j27J31J96O7j57k0j8R5k82L61
7504A38L5j43K20l62K9J9q3R9j89K87R0P2j03k10Q3J51k61l5L3J48o8M44j49q8
7528A57m09J87M2j42j9K45K44m68K67l3O1k46J32J43p3l13K73o4J92j44j82K06
7550E6o1N6j25N3J20J14k68J51j11OJ58j72M2q5ro5K45j76m2K84k05P0J08r7r0
7575d3k1M3l3m9J02n1P6M3p0J26j53P9k1j58l5K63k4l5O5j42n9k00M30j15J77
7600A95l4j43P0M1O3m16J83K22j07k71L29o7P8k28L20o84N17l35K27L5p3R1Q7
$$ plain form
7623 100 -48 -26 -194 24 215 181 -131 22 -310 -181 257 -51 -12 231 -113 -20 178 -98 -75 58 -194 -79
7645 -79 265 -67 -139 -153 -55 17 100 77 -119 161 -2 132 -193 102 -101 -24 -49 91 -11 155 -77 -21 -82 -158
7669 -158 104 29 -214 -59 -47 130 95 -184 -40 334 -150 -156 134 -82 -28 -26 -43 230 -159 -287 -143 -8 176
7692 176 266 -109 41 -1 -62 163 12 65 -224 -166 189 -11 26 94 133 185 -48 -202 38 118 -125 119 -153
7715 -153 11 276 59 105 101 -96 -82 130 56 -36 176 70 -95 -7 162 103 295 -118 64 29 -276 66 -22
7738 -22 -7 466 163 -83 408 -75 -247 -78 214 -176 -206 -176 -279 -154 -389 -2 108 -19 -226 -41 -4 -8
7760 -8 118 47 -85 -219 -3 114 112 -174 -218 102 34 -27 -299 -12 52 -154 127 126 -242 -42 -28 -207 33 -111
7784 -111 73 -152 144 -159 -19 -34 99 -372 126 27 -77 -176 -347 -111 -57 73 -87 190 164 39 -194 -150
$$ packed form
7623A00j48K2j68K18J91l4l12J53l32J29M38l08L9K43l44R3J98k76K3J33k52J15
7645g9L44l32p2j4R8P2Q3k3j96K80j63J34l25K95k03P7k5J40j02J66k32N6o1p6
7669a58K62p5k43J55J2J77l5k79J44L74m84oK90k16N4Kj7K73l89j28J44J35J84
7692A76R0l75J50m2o1K25j51N3k89N8L55k00L7O8L9N2k33j54K40Q0k43K44k72
7715a53J64K65k17M6mj97J4K12p4r2K12j06j65Q8J69n9J92m13J82l5l05L42q8
7738b2J5M73l03k46M91m83j72J69K92l90l0L0j03J25k35L87J10j27k07J85L7m
7760hJ26p1j32j34K16J17kk86m4L20o8o1k72K87O4k06K81jl68K00J4j79K40j44
7784a11J84k25K96l03J40j5J33m71M98r9j04r9j71K36N4J30j60K77k6j25k33M4
$$ plain form
7806 -150 -183 160 85 -11 -144 165 133 -41 225 -29 74 -45 90 26 -15 132 -50 136 164 -86 53 -267
7828 -267 -123 145 86 71 125 -60 -20 212 54 -117 -93 -104 62 187 60 -123 59 -87 -137 313 195 174 -197
7851 -197 -36 105 94 -304 -130 45 78 -66 63 44 17 -64 150 5 108 -13 59 -219 -137 107 -109 -163 -150
7874 -150 5 12 34 -254 -21 -22 126 45 -42 70 277 -110 -222 -24 62 -39 -70 107 -106 97 9 79 34 307
7898 307 137 109 -68 -155 34 -218 -88 141 167 94 61 -114 -74 162 -161 -99 14 -124 -63 328 -34 -268 131
7921 131 -242 -82 -137 17 -98 -76 181 -60 32 127 -209 236 -252 -13 -39 -38 -21 -128 -208 160 -228 19 -28
7944 -28 -217 134 18 -9 -46 -104 48 -243 -41 -94 -414 -3 -198 297 -53 3 1 -72 -17 15 153 0 -101 -15
7968 -15 240 -131 -92 204 249 51 193 -35 -41 224 129 -235 -169 176 -119 -300 45 -225 39 -242 -115 41
$$ packed form
7806a50l3L43p5r6j33L09l2j74K66k54J03j19J35o4m1J47j82J86K8k50J39l20
7828b67J44K68n9j5N4j85M0K32j58j71K4j1J66J25j27j83J82j46n0M50j18k1l71
7851a97J61J41j1l98J74J75L3j44J29j9k7q1K14j45J03j21P2k78Q2K44k16n4J3
7874a50J55PK2k88K33jJ48q1q7J12K07l87j12J98Q6j01l1J77k13K03q8P0m5K73
7898C07j70k8j77q7J89k52J30K29K6p3l3j75M0K36l23O2J13j38O1L91l62k34L99
7921A31l73J60n5J54j15K2K57k41R2R5l36M45m88K39k6JJ7j07q0L68l88K47m7
7944b8j89L51j16k7l7n8J52k91K02n3l20M11j95M95l50N6kp3N5L2J38j53j01Q6
7968a5K55l71L9K96M5j98J42k28oK65r5l64O6L45k95j81L45k70K64k81J27J56
$$ plain form
7990 41 211 27 -104 -2 -13 -236 245 -158 -131 -24 -152 48 -153 8 -66 40 82 -40 -55 104 -139 24
8012 24 -221 80 -13 86 -47 151 10 256 -20 -97 39 39 -109 -65 72 -121 -415 5 279 -16 128 50 159
8035 159 -27 154 150 -4 -55 -10 8 -126 -8 -37 -175 -29 81 -175 -53 134 -130 76 96 -329 -84 -75 141
8058 141 83 -37 48 -212 -20 -333 117 139 -82 -60 -143 -155 -93 -277 18 -90 -200 236 -88 -214 33 -64 152
8081 152 -149 -229 -97 -135 56 -126 235 -27 -169 -13 70 -8 -216 34 228 -173 -25 62 -51 276 139 104
8103 104 57 -101 -72 84 -90 -102 68 -66 289 -50 112 157 -87 70 22 105 -164 -61 -37 60 128 -349 41
8126 41 -113 -81 149 47 208 287 156 -30 -201 107 -89 -217 141 78 125 29 85 53 -125 -126 17 151 -146
8149 -146 251 -7 -354 -133 -44 -66 -201 121 -58 171 -352 100 30 34 -90 -65 24 -111 -68 -56 264 -142 101
$$ packed form
7990D1J70j84j31J02j1k23M81m03K7J07j28K00k01J61p4J06M2j22j5J59k43J63
8012B4k45L01r3R9j33J98j41K46k76p7J36%j48M4J37j93k94M20K74k95J44p8J09
8035A59j86J81mj54n1M5J8j34J18k9j38J46J10k56J22J87k64K06K0m25K45RK16
8058A41n8j20Q5k60J92l13M50K2k21K2q3j2O2j84K95j08j10M36l24j26K47r7K16
8081A52l01q0J32l8J91j82L61k62j42J56Q3p8k08K50J94m01J48Q7j13L27j37l5
8103A04m7j58K9J56j74j2J70j34L55l39J62M5k44J57m8Q3k69J03K4R7O8m77L90
8126D1j54L2K30j02J61P9j31j86j71L08j96j28L58o3M7r6N6l2j78jJ43J34k97
8149a46L97k58l47K21Q9k2j35L22j79K29n23M52p0Mj24K5Q9j35M3J2L20m06K43
$$ plain form
8172 101 -145 -102 -130 -41 64 10 -110 -65 -147 162 146 -50 63 -95 95 -84 146 55 20
$$ packed form
8172A01k46M3k8Q9J05n4j20M5q2L09j6j96J13j58J90j79K30r1l5
8191B0
$$ Imaginary data points
##PAGE= N=2
##DATA TABLE= (X++(I..I)), XYDATA
$$ plain form
0 0 0 0 0 0 0 0 0 0 0 0 0 0 0 -8 8 -8 8 -8 16 -16 16 -24 29 -32 40 -47 53 -62 71 -80 92 -104 119 -135 151
35 151 -172 191 -215 241 -268 299 -332 368 -408 451 -497 550 -606 668 -735 811 -893 984
53 984 -1087 1200 -1330 1475 -1643 1839 -2071 2346 -2686 3116 -3674 4440 -5554 7334 -10646
68 -10646 18933 -89825 -90464 62024 19824 1616 -20993 -53650 -17018 94861 80612 5645
80 5645 -16457 -13043 -2479 66810 58825 -53336 -92151 -15454 25212 23047 7695 -46533 -81429
93 -81429 -18951 44394 38238 4898 -34023 -50820 23719 101672 55600 -34706 -37464 9208 46755
106 46755 55286 -871 -77854 -68808 -476 25638 8805 -23001 -59820 -37432 47154 78129
118 78129 22609 -20928 -12266 15598 47981 51451 -4235 -59123 -42445 6766 27456 11110
$$ packed form
0@%%%%%%%%%%%%%qJ6j6J6j6K4l2L2m0N3o1P2q7J00j15J33j51J72j96K23k54K86
35A51l23L63m06M56n09N67o31P00p76Q59r48J047j156J274j403J546j704J877
53I84k071K287k530K805l118L482l910M417n032N802o790Q114r994J2888j7980
68a0646K9579j08758o39J52488m2200j8208k2609l2657L6632J11879j4249p4967
80E645k2102L414J0564O9289p985j12161l8815P6697M0666k165j5352n4228l4896
93h1429O2478O3345o156l3340l8921j6797P4539P7953m6072r0306k758M6672L7547
106D6755Q531n6157p6983R046O8332K6114j6833l1806l6819K2388Q4586L0975
118G8129n5520m3537Q662K7864L2383L470n5686n4888J6678M9211K0690j6346
$$ plain form
130 11110 -27888 -55485 -28237 33680 53725 11444 -35654 -32832 13925 53099 41738 -8945
142 -8945 -43839 -23095 27434 45057 10815 -36055 -48951 -17275 26014 29802 -13894 -49154
154 -49154 -32341 15083 45444 33282 -9194 -31477 -1662 41533 43414 7983 -29879 -42328
166 -42328 -13610 25346 17972 -27987 -49968 -28135 11599 38774 24896 -18943 -31033 8389
178 8389 42644 38171 8217 -25174 -31585 5422 36648 14271 -27578 -40389 -23095 9287 29748
191 29748 5759 -35964 -33338 6313 33690 30735 5580 -22606 -16141 25777 44242 16994 -18037
204 -18037 -30465 -16068 14642 23268 -10760 -43970 -33179 1402 24207 21800 -5227 -26688
216 -26688 -6942 32279 40514 15196 -12907 -22762 -4100 25520 23224 -13156 -36744 -25465 1371
$$ packed form
130A1110l8998k7597K7248O1917K0045m2281m7098K822M6757L9174j1361n0683
142h945l4894K0744N0529J7623l4242m6870j2896L1676M3289L788m3696l5260
154d9154J6813M7424L0361j2162m2476k2283K9815M3195J881l5431l7862j2449
166d2328K8718L8956p374m5959k1981K1833L9734K7175j3878m3839j2090L9422
178H389L4255m473k9954l3391o411L7007L1226k2377m1849j2811J7294L2382K0461
191B9748k3989m1723K626L9651K7377k955k5155k8186O465M1918J8465k7248l5031
204a8037j2428J4397L0710Q626l4028l3210J0791L4581K2805k407k7027k1461
216b6688J9746L9221Q235k5318k8103r855J8662K9620k296l6380k3588J1279K6836
$$ plain form
229 1371 19854 11525 -19444 -33990 -8629 24520 28488 8142 -14431 -17426 9056 36165 26915
242 26915 -6803 -24736 -14707 8500 20953 3251 -30142 -37462 -10884 15822 17320 -2087
254 -2087 -20895 -14727 16544 37078 23696 -4601 -16942 -5379 17313 24106 847 -27732 -28893
267 -28893 -5493 14866 12543 -9456 -26738 -16388 12923 26660 12174 -10956 -18293 -1335
279 -1335 23853 26799 3270 -18824 -15327 6524 21461 12162 -14142 -29831 -16472 7956 15125
292 15125 -189 -19886 -20881 1228 24730 24123 2654 -13385 -6634 14146 24443 10460 -15595
305 -15595 -26658 -11973 9165 12676 -4540 -22200 -18683 3783 22492 17480 -3552 -15632 -5718
318 -5718 14810 21725 6371 -15678 -20272 -2893 15932 15330 -4153 -19962 -14618 5778 18138
$$ packed form
229A371J8483q329l0969j4546K5361L3149L968k0346k2573k995K6482K7109r250
242B6915l3718j7933J0029K3207J2453j7702l3393p320K6578K6706J498j9407
254b087j8808O168L1271K0534j3382k8297j2341J1563K2692O793k3259k8579j161
267b8893K3400K0359k323k1999j7282J0350K9311J3737j4486k3130p337J6958
279a335K5188K946k3529k2094L497K1851J4937r299k6304j5689J3359K4428P169
292A5125j5314j9697r95K2109K3502o07k1469j6039O751K0780J0297j3983k6055
305a5595j1063J4685K1138L511j7216j7660L517K2466J8709n012k1032j2080R914
318e718K0528O915j5354k2049m594J7379J8825o02j9483j5809N344K0396J2360
$$ plain form
331 18138 8608 -12028 -19965 -6145 14337 18726 3820 -13014 -12274 5971 21187 15727 -5048
344 -5048 -18892 -12694 4858 12770 1061 -17779 -20772 -4354 14735 17439 2945 -10718 -7141
357 -7141 11361 22316 13072 -6910 -18286 -10342 6596 11829 -2418 -19103 -18593 -1590 14306
370 14306 13338 -2349 -14376 -6885 11222 18737 8442 -7825 -14171 -2822 13521 15415 -210
383 -210 -14724 -13400 890 12604 7001 -10695 -19737 -9788 7072 12903 4068 -8780 -10366 3882
397 3882 19700 18052 1767 -10772 -7839 5298 12893 3301 -14842 -20660 -8600 6339 9645
410 9645 -162 -11510 -9813 5293 17916 13822 -1074 -10107 -4769 8957 14661 4399 -11922
423 -11922 -14368 -1846 9561 8687 -3329 -14615 -12295 2832 12307 6011 -6983 -11829 -3589 11172
$$ packed form
331A8138r530k0636p937J3820K0482M389j4906j6834P40J8245J5216n460k0775
344e048j3844O198J7552P912j1709j8840k993J6418J9089K704j4494j3663L577
357g141J8502J0955r244j9982j1376P944J6938N233j4247j6685N10J7003J5896
370A4306r68j5687j2027P491J8107P515j0295j6267o346J1349J6343J894j5625
383b10j4514J324J4290J1714n603j7696r042R949J6860N831q835j2848j586J4248
397C882J5818j648j6285j2539K933J3137P595r592j8143n818J2060J4939L306
410I645r807j1348J697J5106J2623m094j4896r033N338J3726N704j0262j6321
423a1922k446J2522J1407q74j2016j1286K320J5127R475o296j2994m846Q240J4761
$$ plain form
437 11172 16339 5277 -8594 -7660 4419 12524 8711 -4992 -15970 -11443 2415 8721 1055 -9959
451 -9959 -12903 -3174 11710 14874 1888 -8794 -5125 6477 12991 8206 -5361 -14376 -6726 6528
465 6528 8919 237 -10214 -12527 -1957 11167 9645 -3874 -11450 -5199 6011 11989 6858 -5852
479 -5852 -9996 -473 10477 10099 452 -9984 -10571 -1128 9075 5219 -7669 -12550 -5109 5497
493 5497 11140 5804 -5665 -8579 2645 12350 9618 -312 -9782 -9619 2191 10851 3497 -9444
507 -9444 -11313 -3055 6400 10286 2308 -9589 -7706 4547 9987 6085 -1782 -9070 -6134 6892
521 6892 11068 1238 -6920 -6819 -3290 4924 9058 -1348 -12118 -7153 3117 6970 6748 -813 -10420
536 -10420 -3675 11418 11257 484 -5752 -8143 -3225 8132 7577 -7279 -13067 -4511 3666 7416
$$ packed form
437A1172N167j1062j3871R34J2079Q105l813j3703j0978M527J3858O306p666j1014
451i959k944R729J4884L164j2986j0682L669J1602O514m785j3567r015P650J3254
465F528K391q682j0451k313J0570J3124j522j3519p576O251J1210N978n131j2710
479e852m144R523J0950l78r647j0436n87R443J0203l856j2888m881P441J0606
493E497N643n336j1469k914J1224R705k732r930r470J63J1810Q660p354j2941
507i444j869Q258R455L886p978j1897J883J2253N440l902p867p288K936J3026
521F892M176r830q158J01L529Q214M134j0406j0770M965J0270L853k22p561r607
536a0420O745J5093j61j0773o236k391M918J1357n55j4856n788Q556Q177L750
$$ plain form
550 7416 5703 -4960 -9218 2157 10695 6326 72 -4990 -7581 72 8779 3701 -5903 -7739 -4332
565 -4332 2458 8715 3617 -8621 -8907 1210 6233 5765 939 -7558 -6947 5856 12187 4120 -4251
580 -4251 -6197 -3144 5806 8864 -2603 -12504 -7841 1309 4925 3216 -2460 -7447 -2358 7724 9934
595 9934 3471 -2841 -5160 -881 6586 6079 -2464 -9215 -6666 1197 5976 3156 -4577 -7609 -2570
610 -2570 5271 7708 1756 -6271 -6811 1273 8111 6204 -1922 -6843 -3028 5733 8000 1884 -5661
625 -5661 -7139 -2305 4026 4130 -2391 -7605 -5707 1750 7952 5764 -2238 -5240 -118 6241 6804 1816
641 1816 -5377 -7397 -863 5250 3029 -3020 -6556 -4579 2631 7891 3951 -4714 -5939 247 5028
656 5028 5260 546 -6173 -5287 2269 6959 3621 -2014 -5236 -3143 3966 6497 603 -6643 -6422 -492
$$ packed form
550G416j713j0663m258J1375Q538m369o254n062k591P653Q707n078r604j836L407
565d332O790O257n098j2238k86J0117N023m68m826q497O11J2803O331q067q371
580d251j946L053Q950L058j1467r901M663R150L616j709n676m987N089J0082K210
595I934o463o312k319M279P467n07q543o751K549P863M779k820p733l032N039
610b570P841K437n952q027n40Q084O838j907q126m921L815Q761K267o116p545
625e661j478M834O331J04o521n214J898P457O202k188q002l002N122O359N63m988
641A816p193k020O534O113k221o049l536J977P210N260l940q665j225O186M781
656E028K32m714o719Q86P556M690l338n635l222K093P109K531n894p246K21N930
$$ plain form
672 -492 4521 4518 -1093 -6168 -3089 3915 7045 3488 -2389 -5920 -2014 4515 5078 -1343 -6400 -5494 119
689 119 5405 4298 -2348 -5417 -1297 3845 5764 2302 -4086 -6131 -1253 4482 4041 -1547 -5572 -4120
705 -4120 1943 6218 3480 -3313 -5457 -1350 3602 4998 738 -5110 -5172 741 5582 4166 -1293 -4828
721 -4828 -2695 3338 5420 1593 -4572 -5449 -938 3771 4090 -621 -4533 -3193 2501 5876 3962 -1603
737 -1603 -4578 -1907 3459 4134 -331 -5019 -5201 -119 4463 3807 -1357 -4446 -2228 3127 5609 2576
753 2576 -2902 -4859 -1050 4154 4011 -694 -4631 -3804 1287 4768 2750 -2621 -4714 -2206 2555 4049
769 4049 531 -3881 -4359 642 4660 4355 -43 -3371 -2510 2593 4686 1656 -3331 -5125 -2073 2230
785 2230 3179 -852 -4410 -3387 1203 4602 3567 -1001 -3932 -1825 3173 4579 1184 -3439 -4035 -432
$$ packed form
672d92N013ln611n075L079P004L130l557n877l531L906O529N63o421n057R06N613
689A19N286j107o646l069M120N142J919l462o388k045M878N735m41n588m025J452
705d120O063M275k738o793k144M107M952J396m260n848o2N913M841j416n459l535
721d828K133O033K082l827o165q77M511M709L19m711l912J340N694L375j914n565
737a603k975K671N366O75m465m688j82N082M582o56n164l089K218N355K482l033
753B576n478j957L809N204j43m705l937Q27N091L481k018n371k093K508M761J494
769D049l518m412m78N001M018l05m398l328Q61N103K093l030m987j794L052M303
785B230R49m031l558J023M590L399j035m568k931K107M998J406l395m623n96L603
$$ plain form
801 -432 3701 3464 -951 -4278 -2507 1060 3513 1455 -2878 -4581 -1401 3156 4004 560 -3111 -2536
817 -2536 1600 5005 3618 -780 -3781 -2240 1436 3100 471 -3746 -4419 -1045 2577 3356 -204 -3243
833 -3243 -2333 2040 4420 2570 -1783 -3533 -1317 2755 3400 502 -3001 -3185 339 3415 2827 -1345
849 -1345 -3850 -2465 1337 2954 861 -2655 -3551 -450 3388 3535 494 -2323 -2083 1485 3827 2207
865 2207 -1882 -4071 -1753 1629 2865 272 -3069 -3030 578 3343 3009 -270 -3122 -1820 1193 3156
881 3156 1054 -2530 -3247 -804 2641 3064 464 -2595 -2240 1235 3182 1823 -1517 -3311 -2009 1567
897 1567 2801 569 -2521 -2567 48 3205 2932 4 -3131 -2196 1302 2689 958 -1792 -3072 -1156
913 -1156 2234 3091 -34 -2296 -2245 678 2581 1854 -1206 -3384 -1774 1052 2314 934 -1944 -2649
$$ packed form
801d32M133k37m415l327J771L567K453k058m333j703L180M557Q48l444l671N75
817b536M136L405j387m398l001J541L676J664k629m217o73L374L622P79l560l039
833c243R10M373K380j850m353j750K216M072O45k898l503j84L524L076n88m172
849a345k505J385L802J617k093l516q96L101L838J47l041k817K40L568K342j620
865B207m089k189K318L382J236k593l341L9L608K765l34l279k852J302L013J963
881C156k102l584p17K443L445M23k600l059L55L475J947j359l340j794J302L576
897A567J234k232l090m6K615L157k73k928l135R35L498J387j731k750j280J916
913a156L390Q57l125k262N1K923J903p27l060k178J610K826J262j380k878p05
$$ plain form
929 -2649 -45 3235 3101 -128 -2449 -2021 639 2867 1379 -2256 -3014 -830 1539 2269 618 -2382
945 -2382 -2324 525 2715 1637 -795 -2610 -1625 1295 2954 779 -1836 -2237 -9 2257 2684 102
961 102 -2842 -2431 579 1845 1017 -1314 -2927 -1291 1637 2756 628 -1417 -1444 894 2790 2117 -813
978 -813 -2750 -1441 947 1984 995 -1552 -2616 -346 1889 2187 -201 -1952 -1541 638 2179 1202
994 1202 -1017 -2167 -755 1753 2264 704 -1436 -1809 -21 1843 1726 -939 -2494 -1921 177 1235
1010 1235 959 -1277 -2717 -112 2138 2393 778 -1130 -1689 236 2360 1275 -1510 -2416 -1296 702
1026 702 1992 853 -2020 -1889 291 1808 1172 -74 -1631 -1918 604 2413 946 -882 -1450 -568
1042 -568 1505 2471 308 -1790 -1516 303 924 1071 -674 -3003 -1707 1438 1908 194 -675 -1203 -287
$$ packed form
929b649K604L280j34l229k321M28K660K228j488l635p58K184K369P30j651l000
945b382N8K849K190j078k432j815R85K920J659k175k615m01K228K266M27k582
961A02k944M11L010J266q28k331j613J636K928J119k128k045k7K338J896o73k930
978h13j937J309K388J037r89k547j064K270K235K98k388j751M11K179J541r77
994A202k219j150J412K508N11j560k140l73J788J864j17k665j555N73K098J058
1010A235k76k236j440K605K250K55j615j908n59J925K124j085k785r06J120J998
1026G02J290j139k873J31K180J517o36j246j557k87K522J809j467j828n68Q82
1042e68K073R66k163k098K74J819O21J47j745k329J296L145M70j714q69n28R16
$$ plain form
1059 -287 2046 2293 -480 -2007 -1052 228 1327 1159 -1211 -2450 -245 1539 1529 324 -1268 -1497 -207
1076 -207 1724 1210 -1068 -1654 -1034 457 1936 1148 -942 -1392 89 1719 1144 383 -1782 -1732 511
1093 511 1608 392 -868 -1281 -773 1286 1781 323 -1673 -1278 120 1277 991 -173 -1634 -1046 1000
1110 1000 1686 914 -563 -1359 -484 1320 1771 -403 -1788 -1498 -78 1164 559 -805 -1641 -598 1206
1127 1206 1858 605 -1044 -1356 232 1259 1084 -457 -1743 -890 505 1460 749 -773 -1424 -339 1049
1144 1049 1168 -223 -1202 -1383 87 1188 889 -693 -1064 -291 1360 1786 779 -871 -1161 -501 991
1161 991 693 -427 -1672 -1607 356 1102 598 -910 -844 -32 1365 1227 594 -1199 -1003 226 1367 826
1179 826 -340 -1257 -860 552 1213 401 -1015 -1380 -37 851 792 -306 -1494 -827 452 1214 763 -129
$$ packed form
1059b87K333K47k773j527R55J280J099j68k370j239K205J784j0j205j592k29J290
1076b07J931n14k278n86O20J491J479p88k090m50J481J630n75p61k165N0K243
1093E11J097j216j260m13N08K059M95j458j996L95J398J157k86j164j461N88K046
1110A000O86p72j477p96Q75J804M51k174j385K90J420J242o05j364q36J043J804
1127A206O52j253j649l12J588J027j75j541j286Q53J395R55p11j522o51J085J388
1144A049J19j391r79j81J470J101k99j582l71P73J651M26j007j650k90O60J492
1161I91k98j120j245O5J963P46n04j508O6Q12J397j38o33j793J96J229J141n41
1179H26j166r17L97J412O61q12j416l65J343Q88n9j098j188O67J279P62m51q92
$$ plain form
1197 -129 -896 107 1046 1209 -14 -1155 -1383 -93 577 569 -672 -1210 -767 574 1189 527 -598 -1044
1215 -1044 40 1019 1052 55 -1097 -991 398 994 691 -650 -1310 -532 641 815 17 -1045 -1336 -87
1233 -87 886 631 -254 -942 -419 783 1305 586 -377 -606 28 633 672 21 -1303 -1009 218 925 955 -239
1253 -239 -998 -220 693 872 -43 -582 -794 -77 766 737 -82 -1099 -318 350 907 525 -493 -1156 -497 887
1273 887 405 -369 -1134 -1027 -71 724 772 -279 -615 -314 709 1128 345 -731 -969 83 841 551 8
1292 8 -706 -549 335 863 703 -445 -676 -376 240 298 155 -895 -1131 115 787 868 -33 -428 -376 615 653
1313 653 228 -736 -814 -250 448 422 -370 -934 -587 358 902 313 -277 -656 -199 636 605 -6 -894 -858 55
1334 55 758 717 -140 -779 -570 495 574 87 -739 -1208 -653 498 347 -147 -706 -303 333 1268 633 -38
$$ packed form
1197a29p67J003R39J63j223j141k28J290O70qj241n38M43J341O15o62j125m46
1215a044J084R79L3r97j152J06J389N96l03j341o60P78J173J74p98j062k91J249
1233h7R73k55q85o88N23J202N22p19r63k29O34O05L9o51j324K94J227P07L0j194
1253b39p59P78R13J79r15n39k12P17Q43k9q19j017P81O68N57l82j018o63O59J384
1273H87m82p74p65J07R56P95M8j051l36L01J023M19p83j076k38J052P58k90n43
1292Hp14J57Q84N28j60j148k31L00O16N8j43j050k36J246O72Q1r01l95N2R91L8
1313F53m25r64p8N64O98k6p92n64L47R45N44n89n90l79M57Q35l1o11q88L6R13
1334E5P03m1q57o39K09J065P9m87q26m69N55J151j51m94n59M03O36R35o35o71
$$ plain form
1354 -38 -550 -428 758 532 143 -634 -609 139 546 615 -69 -819 -477 218 997 94 -596 -663 -134 420 580
1375 580 314 -485 -466 261 735 593 -140 -724 -369 205 420 -45 -696 -741 -238 704 494 69 -455 -251 508
1396 508 869 530 -380 -972 -241 530 585 -35 -817 -464 164 321 386 -149 -771 -297 547 314 -257 -352 -540
1417 -540 74 557 879 176 -422 -152 165 590 371 -501 -955 -256 465 475 -143 -385 -292 143 685 399 -249
1438 -249 -420 -20 530 781 246 -253 -414 -144 661 458 -161 -345 -574 146 365 343 -163 -793 -305 246
1458 246 464 -58 -523 -540 176 603 443 47 -655 -665 274 351 125 -578 -805 47 653 430 9 -700 -427
1479 -427 187 690 369 -304 -498 -199 113 534 357 -494 -258 162 648 240 -81 -447 -502 48 448 91
1499 91 -583 -667 -74 473 415 156 -473 -251 329 795 294 -147 -776 -200 477 462 -250 -365 -294 -231 145 612
$$ packed form
1354c8n12J22J186k26l89p77K5P48M07O9o84p50L42O95P79r03o90o7N29N54J60
1375E80k66p99J9P27M74j42p33n84L55N74K15m65o51m5N03R42k10m25n24K04P59
1396E08L61l39r10n92P31P71N5o20p82L53O28J57O5n35o22M74Q44k33n71r5j88
1417e40O14M83L22p03n98K70L17M25k19q72m54O99P21J0o18k42R3M35N42k86o48
1438b49j71M00N50K51n35m99j61K70Q05k03o19j84k29P20K19k2n06o30M88N51
1458B46K18n22m65j7P16M27j60l96p02j0R39P7k26p03k27Q52O06k23m21p09K73
1479d27O14N03l21o73j94K99L12M21j77q51K36M20M86m08l21l66n5N50M00l57
1499I1o74q4N93N47n8k59o29K22N80M66n01m41o29N76O77j5p12j15P1O3L76M67
$$ plain form
1521 612 -37 -401 -321 -23 285 240 -216 -752 65 637 351 148 -310 -394 151 712 211 -456 -302 -157 261
1542 261 292 191 -683 -608 294 473 507 323 -312 -248 546 472 339 -33 -533 -5 164 305 103 -902 -489
1563 -489 89 207 562 -217 -454 -357 402 270 374 -260 -296 -67 726 359 -59 -459 -121 155 149 243 -230 -503
1585 -503 22 335 406 127 -29 -358 237 288 246 -83 -331 14 153 492 -38 -444 -522 -9 101 228 -53
1606 -53 -553 -396 -169 425 25 -255 -460 -274 145 402 42 -239 56 196 514 164 -154 -477 -240 -114
1626 -114 547 107 -150 -439 -202 385 409 120 -297 -254 72 256 347 -457 -295 -186 591 316 151 -338 -483
1647 -483 4 204 283 -77 -551 -237 0 81 179 -406 -358 75 415 463 -42 -381 -318 -33 260 51 -16 -366
1669 -366 -203 252 578 -149 -65 -296 -237 318 103 -72 -248 -349 99 584 206 -282 139 -3 449 174 -22
$$ packed form
1521F12o49l64Q0K98L08m5m56n36Q17N72k86k03m58q4N45N61n01o67J54J45M18
1542B61L1j01q74P5R02J79L4j84o35O4P94p4j33l72n00N28J69J41k02j005M13
1563d89N78J18L55p79k37R7P59j32J04o34l6K29P93l67m18m00L38K76oR4m73k73
1585e03N25L13P1k79j56l29N95N1m2l29k48L45J39L39n30m06p8N13J10J27k81
1606e3n00J57K27N94m00k80k05J86M19K57l60k81K95J40L18l50l18l23K37J26
1626a14O61m40k57k89K37N87K4k89m17M3L26J84R1q04J62J09P77k75j65m89j45
1647d83M87K00P9l60m74L14K37Q1R8n85M8M33L40M8n05l39O3K85K93k09o7l50
1669c66J63M55L26p27Q4k31N9N55k15j75j76j01M48M85l78m88M21j42M52k75j96
$$ plain form
1690 -22 -305 -133 11 110 -44 -315 -617 -82 305 317 -68 -244 -212 45 374 506 225 -52 -36 111 317 -44
1712 -44 -86 -109 -173 282 162 -146 -508 -161 -185 265 12 -90 -269 -180 46 319 46 238 -313 96 552 147
1734 147 171 -370 -209 259 321 205 -267 -407 -278 164 235 -24 -198 -319 189 266 187 -160 -276 -147 350 408
1756 408 158 -443 -288 -127 176 334 -39 -535 -210 12 111 179 176 -531 -165 257 218 8 86 -345 438 377
1778 377 361 104 -281 -177 188 107 103 11 -306 -11 103 411 -109 -131 132 -33 436 198 21 -258 -162 82
1800 82 92 -41 -311 -298 150 -43 -36 73 -468 -397 -78 331 221 -363 -301 33 188 274 -52 -121 -376 215 243
1823 243 338 -41 -380 -120 268 69 -203 -203 -391 -175 50 189 143 -247 -394 193 364 309 -331 -121 181 440
1845 440 317 -43 53 -133 -86 -29 -53 -211 -380 -242 157 301 -36 -226 -128 147 171 112 -169 -27 -100 315 422
$$ packed form
1690b2k83J72J44R9j54k71l02N35L87J2l85j76L2K57L29J32k81k77J6J47K06l61
1712d4m2k3o4M55j20l08l62L47k4M50k53j02j79Q9K26K73k73J92n51M09M56m05
1734A47K4n41J61M68O2j16m72j40J29M42P1k59j74j21N08P7p9l47j16J29M97N8
1756D08k50o01J55J61L03J58l73m96L25K22R9O8lp07L66M22l9k10P8m31P83o1
1778C77j6k57l85J04L65q1mr2l17K95J14L08n20k2K63j65M69k38j77k79R6K44
1800H2J0j33k70J3M48j93PJ09n41P1L19M09j10n84O2L34J55Q6l26o9k55N91K8
1823B43R5l79l39K60L88j99k72%j88K16K25J39m6l90j47N87J71n5o40K10L02K59
1845D40j23l60R6j86M7N7k4j58j69J38L99J44l37j90R8K75K4n9k81J42p3M15J07
$$ plain form
1868 422 318 -104 -236 -149 120 287 -111 -299 -145 -49 265 -11 -176 -281 -180 73 291 367 -127 -311 166
1889 166 142 244 94 -413 -213 -47 257 153 -158 -426 -97 209 260 200 -321 -139 -145 174 348 171 -107 -58
1911 -58 320 243 142 -57 -71 7 225 57 24 -270 -209 135 -30 -115 -176 -124 -68 138 31 167 -385 -20 -126
1934 -126 11 -76 -89 -191 46 202 266 49 -390 -283 -57 6 280 -173 -30 -170 39 268 53 135 -157 -155
1956 -155 133 163 178 -81 -386 -113 80 57 -225 47 -118 316 179 20 -102 -106 -84 12 173 60 -197 -104 -199
1979 -199 296 91 -161 -199 -28 153 220 20 -250 -52 -62 238 102 -226 -62 -38 27 405 145 -95 73 372
2001 372 255 132 -78 16 -295 -66 282 22 -39 -260 -444 -25 174 -244 137 -8 105 54 363 -197 -278
2022 -278 36 164 331 44 -58 -700 -16 278 62 70 -80 -479 -110 209 126 -343 -86 -10 303 217 71 28
$$ packed form
1868D22j04m22j32Q7K69J67l98j88J54R6L14k76j65j05J01K53K18P6m94j84M77
1889A66k4J02j50n07K00J66L04j04l11k68L29L06N1o0n21J82oL19J74j77k78M9
1911e8L78p7j01j99j4P8K18j68l3k94O1L44j65q5o1N2N6K06j07J36n52L65j06
1934a26J37q7j3j02K37J56O4k17m39J07K26O3K74m53J43j40K09K29k15Q2k92K
1956a55K88L0J5k59l05K73J93k3k82K72j65M34j37j59j22mK2R6J61j13k57R3r5
1979a99M95k05k52l8J71J81O7k00k70J98j0L00j36l28J64K4O5L78k60k40J68K99
2001C72j17j23k10R4l11K29L48k60o1k21j84M19J99m18L81j45J13n1L09n60q1
2022b78L14J28J67k87j02o42O84K94k16Qj50l99L69L19q3m69K57P6L13q6j46m3
$$ plain form
2044 28 170 121 170 -118 32 -45 -222 4 189 16 -151 -212 108 43 179 162 -399 -58 -168 55 257 32
2066 32 -166 -105 132 40 193 -325 -150 -152 -38 -17 -44 -103 -283 -55 434 72 100 10 381 108 80 -85 -81 -56 -101
2091 -101 19 177 -29 -182 -235 -18 89 70 34 -198 174 -82 188 106 -50 -69 210 304 311 -215 26 -158 25
2114 25 105 -194 -307 -97 234 13 221 -67 -157 -67 -127 161 135 -58 -324 116 245 434 -88 -330 -265 30
2136 30 -63 287 -21 -122 -242 -21 25 -80 -174 -171 -55 247 215 99 -82 89 -160 80 174 13 -17 93 267
2159 267 330 90 -321 -170 -136 200 109 -179 -121 -32 8 187 83 -71 -183 30 59 343 -79 -211 -54 10 135
2182 135 141 -15 -164 -334 64 101 -52 -335 -118 -229 58 -160 -67 9 28 210 -39 50 -234 102 -47 170
2204 170 147 -104 -19 -326 -138 181 98 -101 -316 38 -11 195 107 -288 -170 -36 223 321 131 60 15 -141 -1
$$ packed form
2044B8J42m9M9k88J50p7j77K26J85j73j67o1L20o5J36j7n61L41j10K23K02k25
2066C2j98O1K37r2J53n18J75kJ14K1k7n9j80K28M89l62K8r0L71k73k8j65MK5m5
2091a01J20J58k06j53n3K17J07j9l6k32L72k56K70q2j56j9K79R4Pn26K41j84J83
2114B5Q0k99j13K10L31k21K08k88r0R0o0K88k6j93k66M40J29J89n22k42O5K95
2136C0r3L50l08j01j20K21M6j05r4LJ16L02l2j16j81J71k49K40R4j61l0J10J74
2159B67O3k40m11J51L4L36r1k88N8Q9M0J79j04j54j12K13K9K84m22j32J57O4J25
2182A35Oj56j49j70L98L7j53k83K17j11K87k18R3P6J9J82k49Q9k84L36j49K17
2204A70k3k51Q5l07J88L19q3j99k15L54m9K06q8l95J18J34K59R8j90p1m5j56J40
$$ plain form
2227 -1 119 -192 -365 53 -48 -198 -126 -156 -196 230 317 343 138 -131 46 -208 125 126 -192 -116 -157 178 188 -13
2251 -13 -188 215 -152 -184 197 167 -233 -22 -174 17 10 -223 81 260 387 57 20 -221 -261 -3 194 -144
2273 -144 -116 56 -383 -130 -4 -166 -197 19 88 49 116 -93 -175 86 296 -43 -34 -217 113 33 -209 200 -302
2296 -302 -208 -206 86 100 -32 132 50 -59 286 180 -61 -91 -216 296 161 5 36 -162 -195 -43 47 48 -221 -207
2320 -207 -221 32 11 -202 -82 101 79 55 -113 -5 -179 -69 138 59 8 -190 -219 -126 -10 63 -191 -300 214
2343 214 -76 -10 -1 -34 -104 149 109 -30 -302 -119 -105 15 -113 64 -125 -202 -102 60 118 -208 -97 -35 45 183
2367 183 -34 143 -405 141 -41 338 133 139 55 -201 340 170 215 -194 -23 68 43 -216 -54 -340 -175 -164
2389 -164 13 16 -118 4 184 88 199 110 41 65 48 237 8 -142 -107 3 74 217 -191 -154 -129 102 -158 -86
$$ packed form
2227aJ20l11j73M18j01j50P2l0m0M26Q7K6k05k69J77k54L33Jl18P6m1L35J0k01
2251a3j75M03l67l2L81l0m00K11j52J91pk33L04J79J27l30l7k41m0K58J97l38
2273a44K8J72m39K53J26j62l1K16O9l9O7k09q2K61K10l39Rj83L30q0k42M09n02
2296c02R4KK92J4j32J64q2j09L45j06k41l0j25N12j35j56L1j98l3J52R0Jk69J4
2320b07j4K53k1k13J20J83k2k4j68J08j74J10K07p9n1j98k9R3J16P3k54j09N14
2343B14k90O6Rl3p0K53m0j39k72J83J4J20j28J77j89p7J00J62N8l26J11O2Q0J38
2367A83k17J77n48N46j82L79k05Oq4k56N41j70M5m09J71R1k5k59J62k86J65J1
2389a64J77Lj34J22J80r6J11q9o9K4j7J89k29j50L5J10P1J43m08L7K5K31k60P2
$$ plain form
2413 -86 52 -240 -21 154 128 -51 -178 -60 -147 249 215 -76 -49 -28 358 -176 -20 -273 -317 -5 137 89 -131
2436 -131 100 -258 296 -100 68 -36 183 208 17 240 30 -74 70 7 132 -3 -125 84 -320 -10 82
2457 82 54 -43 -91 -63 -2 75 55 209 -111 -147 198 -20 81 -142 -272 -39 169 -110 -167 -215 -30 0 72 -90
2481 -90 -135 -128 240 -27 -54 39 -12 70 -56 88 243 48 -15 -79 -316 13 -72 -281 123 67 184 181 126 -46 71
2506 71 195 159 77 -13 -33 62 214 -99 -24 -202 -170 -208 378 -62 -65 -10 -4 13 15 -168 -248 85 -29 203 272 134
2532 134 -297 -24 345 226 -83 23 -126 -12 88 -25 132 -111 263 -262 -187 -41 -202 25 11 142 79
2553 79 -49 33 215 304 7 245 -150 -5 -101 41 106 121 55 -33 -15 279 5 -46 75 121 27 20 80 39 174
2578 174 -3 -14 125 90 -51 -284 -74 277 -85 -15 -177 16 50 11 -60 32 -211 98 203 125 -72 -149 46
$$ packed form
2413h6J38k92K19J75k6j79j27J18q7L96l4k91K7K1L86n34J56k53m4L12J42m8k20
2436a31K31l58N54l96J68j04K19K5j91K23k10j04J44o3J25j35j22K09m04L10R2
2457H2k8r7m8K8O1P7k0J54l20l6L45k18J01k23j30K33K08k79n7m8J85L0P2j62
2481i0m5PL68k67k7R3n1Q2j26J44J55j95o3o4k37L29q5k09M04n6J17ln5j72J17
2506G1J24l6q2r0k0R5J52l13P5j78L2l8N86m40lN5OJ7Kj83q0L33j14K32O9j38
2532A34m31K73L69j19l09J06j49J14J00j13J57k43L74n25P5J46j61K27j4J31o3
2553G9j28Q2J82Q9k97K38l95J45r6J42O5J5o6q8J8K94k74n1J21M6r4pO0m1J35
2578A74j77j1J39l5j41k33K10L51l62P0j62J93L4l9p1R2k43L09J05p8j97p7J95
$$ plain form
2601 46 78 177 -30 -55 32 -261 -154 -201 154 -1 -247 -8 106 17 141 -104 -99 -95 -30 265 -248 45 7 -21 185
2626 185 -72 -168 35 -222 126 -132 -64 -122 -127 55 -24 2 -277 -142 236 551 -242 -103 -26 -210 172 74 89
2649 89 114 286 -16 -56 66 -92 235 -339 -123 -110 -95 19 -50 -205 172 165 193 -132 58 247 182 -80 121
2672 121 -83 -208 -7 -47 132 0 -218 -217 63 30 -19 -45 -108 63 73 17 -33 -237 -61 20 53 -86 -56 -116 27
2697 27 -38 -269 36 -16 34 127 5 -81 -78 -36 -61 189 118 133 135 -118 77 -210 112 92 -204 -22 -6 14 215 -354
2723 -354 -162 -176 121 52 -43 -100 117 8 110 252 -141 -23 -84 -69 158 217 -51 -59 -203 -165 5 50 1 -45
2747 -45 -88 -348 34 -19 -100 -40 -49 -146 133 154 -11 107 209 67 -39 19 58 129 -155 -49 -84 115 -77 -3 -103
2772 -103 -310 56 143 -140 -71 214 134 -84 195 0 -107 386 -281 -177 108 -171 -234 -107 -182 -279 -196 -36
$$ packed form
2601D6L2R9k07k5Q7k93J07m7L55j55k46K39J14q9J24k45NMO5K95n13K93l8k8K06
2626A85k57r6K03k57L48k58O8n8nJ82p9K6k79J35L78L15p93J39P7j84L82r8J5
2649H9K5J72l02m0J22j58L27n74K16J3J5J14o9j55L77pK8l25J90J89o5k62K01
2672A21k04j25K01m0J79j32k18JK80l3m9k6o3J71J0n6n0k04J76Q1L3j39L0o0J43
2697B7o5k31L05n2N0R3j22q6LM2k5K50p1J5Kk53J95k87L22k0k96J82J6K0K01n69
2723c54J92j4K97o9r5n7K17j09J02J42l93J18o1J5K27N9k68qj44L8J70M5m9m6
2747d5m3k60L82n3q1O0rr7K79K1j65J18J02j42j06N8L9P1k84J06l5J99j92P4j00
2772a03k07L66Q7k83O9K85q0k18K79j95j07M93o67J04K85k79o3J27p5r7Q3J60
$$ plain form
2794 -36 107 91 -351 18 37 68 81 70 200 -89 98 -2 -395 95 7 139 253 36 -91 -104 -154 103 168
2817 168 -65 138 2 156 255 -9 1 -46 -85 -172 -122 -44 177 -139 -30 -268 -30 -208 15 -103 206 211 305
2840 305 52 22 252 77 244 -10 425 -85 79 25 -166 -54 -262 110 109 7 198 94 -93 74 271
2861 271 13 274 11 -142 169 -279 148 -41 10 -248 -143 -124 159 -22 -131 -56 -119 -2 126 -242 -43
2882 -43 43 -18 98 90 -227 118 -19 29 -49 -197 182 137 -28 22 118 189 125 -150 90 39 -35 -61 16 41 43 -69
2908 -69 -216 7 237 81 -190 100 -188 92 169 217 -161 157 -119 45 67 -9 82 2 -68 33 -20 13 -29 235
2932 235 -125 -21 95 117 38 26 294 119 -124 90 -159 -82 -26 -210 -240 -187 199 -177 74 74 -37 -81 -169 76
2956 76 -47 268 -1 251 35 -13 -178 -206 121 19 123 -51 -244 -188 -85 -47 79 17 172 93 -78 -84 66
$$ packed form
2794c6J43j6m42L69J9L1J3j1J30k89J87j00l93M90q8J32J14k17j27j3n0K57O5
2817A68k33K03j36J54R9k64J0m7l9q7N0P8K21l16J09k38K38j78K23j18L09NR4
2840C05k53l0K30j75J67k54M35n10J64n4j91J12k08L72jj02J91j04j87J67J97
2861B71k58K61k63j53L11m48M27j89N1k58J05J9K83j81j09P5o3J17J28l68J99
2882d3Q6o1J16ql17L45j37M8p8j48L79m5j65N0R6P1o4k75K40n1p4k6P7K5Kj12
2908f9j47K23K30j56k71K90k88K80P7M8l78L18k76J64K2p6R1q0p0J01n3L3m2K64
2932B35l60J04J16K2p9j2K68j75k43K14k49P7N6j84l0N3L86l76K51%j11m4q8K45
2956G6j23L15k69K52k16m8j65k8L27j02J04j74j93N6J03L8J26o2J55p9j71oJ50
$$ plain form
2979 66 143 -185 80 -292 96 -156 158 -62 -67 -144 67 -47 37 -43 69 -139 -23 33 8 -4 28 151 225 -108
3003 -108 -115 151 -10 -18 32 9 -104 105 230 30 -259 323 -110 -91 -2 101 -223 -6 25 196 196 35 134 -5
3027 -5 -39 -47 134 -64 -158 -53 31 1 -252 -28 -328 -125 -159 -134 -13 249 102 63 -40 -272 -135 -87 -14 133
3051 133 186 -168 206 142 -60 -100 -242 17 -88 60 29 75 -4 -59 -88 103 123 -69 -289 184 -47 75 -31
3074 -31 145 35 184 112 22 -70 -31 361 -56 -14 -68 37 28 -165 -110 257 79 120 9 -67 158 6 324 40
3098 40 2 -130 -258 -31 52 -111 31 -74 126 118 101 237 -109 -38 -109 -28 81 -8 -104 -10 205 -191 -79 155
3122 155 -143 -26 104 -193 7 -58 32 -170 289 4 -87 -36 34 -135 259 166 92 220 74 273 -115 76
3144 76 -108 -20 153 120 -147 -212 60 44 118 -93 57 17 121 141 -187 76 -64 -110 -111 120 -64 104 -54 -21
$$ packed form
2979F6P7l28K65l72L88k52L14k20np7K11j14Q4q0J12k08J16N6k5j2L2J23P4l33
3003a08pK66j61qN0k3j13K09J25k00k89N82m33J9Q9J03l24K17L1J71%j61R9j39
3027el4qJ81j98r4J05Q4l0k53K24l00K03l4K5J21K62j47l9j03k32J37M8P3J47
3051A33N3l54L74o4k02m0j42K59j05J48l1M6p9n5k9J91K0j92k20M73k31J22j06
3074c1J76j10J49p2r0r2L9L92m17M2n4J05rj93N5L67j78M1j11p6K25j52L18k84
3098D0l8j32j28K27Q3j63J42j05K00qj7J36l46P1p1Q1J09q9r6R4K15l96J12K34
3122A55k98J17J30k97K00o5R0k02M59k85r1N1P0j69L94r3p4J28j46J99l88J91
3144G6j84Q8J73l3k67o5K72j6P4k11J50m0J04K0l28K63j40m6jK31j84J68j58L3
$$ plain form
3168 -21 174 152 -86 10 -57 39 208 -17 94 -46 -99 165 -16 57 -69 -13 103 -159 -146 93 -180 2 -7 157
3192 157 65 -103 71 -236 47 -71 -207 143 46 -151 -108 293 92 -42 157 -141 15 -141 -38 -109 60
3213 60 -177 -337 -279 135 -6 -304 141 -11 -128 161 -23 -100 6 13 7 156 -247 52 -244 85 -159 194
3235 194 3 -74 16 -272 -48 -259 -105 -272 -47 -269 24 -222 -188 159 -36 95 -68 207 -366 -75 -225
3256 -225 -14 -119 -134 310 -140 -16 -63 85 -14 -136 114 9 -32 236 -61 126 -176 204 2 -74 -168 40
3278 40 5 -147 -56 -46 57 -47 42 -75 -5 -118 44 178 -4 -5 -173 183 -94 -9 68 -71 16 -121 -45 62
3302 62 152 137 -69 -160 262 55 28 -52 263 -26 197 -9 303 40 -124 207 106 28 -132 -155 156 194 -150
3325 -150 149 -211 -40 -74 262 168 197 332 13 105 129 128 -26 -47 226 2 91 -309 77 220 -228 25 262
$$ packed form
3168b1J95k2k38R6o7R6J69k25J11j40n3K64j81P3j26N6J16k62J3K39k73J82rJ64
3192A57r2j68J74l07K83j18j36L50r7j97M3M01k01j34J99k98J56j56J03p1J69
3213F0k37j60N8M14j41k98M45j52j17K89j84p7J06PoJ49m03K99k96L29k44L53
3235A94j91p7R0k88K24k11J54j67K25k22K93k46L4L47j95J31j63K75n73K91j50
3256b25K11j05j5M44m50J24m7J48r9j22K50j05m1K68k97J87l02L80k02p6r4K08
3278D0l5j52R1J0J03j04Q9j17P0j13J62J34j82jj68L56k77Q5P7j39Q7j37P6J07
3302F2R0j5k06r1M22k07k7q0L15k89K23k06L12k63j64L31j01p8j60k3L11L8l44
3325a50K99l60J71l4L36r4K9J35l19R2K4jj54k1K73k24Q9m00L86J43m48K53K37
$$ plain form
3348 262 211 -224 -76 -170 -147 -48 95 -42 91 -21 2 38 -170 10 -88 -30 42 95 -112 209 47 33 19 -120
3372 -120 -160 -181 11 151 -205 125 5 -27 205 -105 274 45 -204 111 15 242 -183 -10 260 148 177 234
3394 234 206 -190 -27 -24 -65 -17 101 26 24 70 223 -70 -198 79 194 -138 84 60 -82 42 70 -101 64 19
3418 19 -78 -209 -215 219 147 -14 218 109 82 143 109 -5 -45 -155 -131 -126 -11 199 -2 114 -114 -64 -59 -91 -94 32
3444 32 17 102 -30 -44 -80 46 80 208 96 -203 75 83 179 64 113 19 -117 -121 71 225 -90 -17 -388 -86 202
3469 202 -81 77 238 6 -20 -273 -204 -132 5 5 -168 -64 1 75 149 -42 -167 -215 276 -23 -140 167 326
3492 326 -9 48 142 -118 -8 61 202 -195 101 270 102 247 37 -202 180 -26 -37 170 -210 154 146 20
3514 20 -160 -74 49 30 88 -97 -146 203 -177 -68 71 56 162 -17 106 -116 -82 -265 17 111 45 -193 -268
$$ packed form
3348B62n1m35J48r4K3R9J43j37J33j12K3L6k08J80r8N8P2N3k07L21j62j4j4j39
3372a20m0k1J92J40l56L30j20l2K32l10L79k29k49L15r6K27m25J73K70j12K9N7
3394B34k8l96J63Lm1M8J18p5kM6J53k93j28K77J15l32K22k4j42J24K8j71J65m5
3418A9r7j31oM34p2j61K32j09k7O1l4j14m0j10K4NJ15K10k01J16k28N0Nl2lJ26
3444C2j5Q5j32j4l6J26L4J28j12k99K78QR6j15M9r4j36mJ92J54l15P3l71L02K88
3469B02k83J58J61k32k6k53O9P2J37%j73J04O5P4P4j91j25m8M91k99j17L07J59
3492C26l35N7R4k60J10O9J41l97K96J69j68J45k10k39L82k06j1K07l80L64qj26
3514B0j80Q6J23j9N8j85m9L49l80J09J39j5J06j79J23k22L4j83K82R4o6k38p5
$$ plain form
3537 -268 168 60 -105 34 -202 -165 64 -274 101 -3 -131 -44 -57 131 210 85 251 89 -26 -295 -111
3558 -111 68 -175 147 125 -12 138 51 -189 -43 -187 144 -161 84 -18 4 -105 -111 -118 148 -52 -97 -96 -99 105
3582 105 -22 -46 -28 -174 70 -490 -176 90 -140 28 -70 203 103 60 -17 4 -149 356 -24 -30 150 -157 10
3605 10 -224 164 -13 -176 -166 116 238 321 108 -107 -57 -84 -179 -3 80 95 95 106 -93 32 -150 219 52 109
3629 109 119 72 -115 -317 -141 116 -158 -47 -152 -380 31 -9 83 189 43 -160 -156 0 93 165 -117 -102 -120
3652 -120 125 190 7 -67 -55 -159 82 38 -177 -125 -226 -54 -8 -3 -53 -108 28 64 -105 -128 204 -21 -51 152
3676 152 181 -40 5 229 165 40 25 27 -435 109 29 209 93 -57 -190 75 -17 -107 189 -78 80 338 223
3699 223 33 -138 -240 -29 -15 -8 -101 -40 202 -51 177 -306 9 134 111 -2 -122 -77 243 218 101 48 -23
$$ packed form
3537b68M36j08j65J39k36L7K29l38L75j04j28Q7j3J88P9j25J66j62j15k69J84
3558a11J79k43L22k2j37J50q7k40J46j44L31l05K45j02K2j09opK66k00m5JlK04
3582A05j27k4J8j46K44n60L14K66k30J68r8K73j00m3p7K1j53N05l80oJ80l07J67
3605A0k34L88j77j63J0K82J22Q3k13k15N0k7r5J76Q3J5%J1j99J25j82L69j67N7
3629A09J0m7j87k02J76K57k74J11j05k28M11m0R2J06j46k03MJ56R3P2k82J5j8
3652a20K45O5j83p4J2j04K41m4k15N2j01J72M6Nn0n5J36L6j69k3L32k25l0K03
3676A52K9k21M5K24o4j25j5Km62N44q0J80j16j50j33K65r2r0K96k67J58K58j15
3699B23j90j71j02K11J4Pr3O1K42k53K28m83L15J25k3j13j20M5L20k5j17n3p1
$$ plain form
3722 -23 -9 -40 155 -12 -3 -122 -20 -104 98 158 -39 -108 -67 -7 -102 -173 -13 -175 -184 93 -353 35 38 -36 126 -195
3748 -195 -1 -198 -106 -275 -11 -6 -195 85 36 -364 126 20 26 -59 -47 127 -63 66 214 -58 -171 126 254
3771 254 -30 187 111 141 -177 -21 -5 61 7 20 -192 142 -152 -92 102 -2 176 124 171 16 -13 -91 -6 267
3795 267 67 -34 142 -188 10 127 -72 -213 -86 -78 172 209 27 46 286 -7 -252 -9 94 -61 -48 3
3817 3 94 165 177 149 166 136 147 -131 121 -55 38 -67 90 -32 -5 -131 13 181 -38 6 -293 71 138 16
3841 16 -51 26 -18 -14 -66 189 -183 171 90 165 -57 21 31 122 57 -57 -88 -125 63 138 106 -59 -20 -54 -94 -49 72
3868 72 -59 25 94 12 114 189 -185 -30 174 -67 -48 5 212 192 218 259 -70 -88 -15 -147 123 -245 -98 121
3892 121 -293 -45 -4 66 20 37 3 43 21 -13 -247 168 218 170 40 -134 35 -92 -150 -146 -81 17 116 -103 -66 96
$$ packed form
3722b3J4l1J95j67Rj19J02q4K02O0j97o9M1O0r5p1J60j62rK77m46L88Lp4J62l21
3748a95J94j97R2j69K64Nj89K80m9m00M90j06Oq5J2J74j90J29J48k72j13K97J28
3771B54k84K17p6L0l18J56J6O6n4J3k12L34k94O0J94j04J78n2M7j55k9p8Q5K73
3795B67k00j01J76l30J98J17j99j41J27QK50L7j82J9K40k93k45K43J03j55J3N1
3817CR1P1J2k8J7l0J1k78K52j76R3j05J57j22K7j26J44J68k19M4k99L64O7j22
3841A6o7P7m4Mn2K55l72L54q1P5k22P8J0R1o5j14l1l7J88P5l2j65L9l4m0M5J21
3868G2j31Q4O9q2J02P5l74J55K04k41J9N3K07k0K6M1l29j8P3j32K70l68J47K19
3892A21m14K48M1P0m6J7l4M0k2l4k34M15N0m8j30j74J69j27n8MO5R8R9k19L7J62
$$ plain form
3918 96 -92 23 44 59 -343 -135 41 -145 1 -70 57 -152 59 66 -32 -176 -45 -134 60 118 5 91 -43
3941 -43 3 43 -110 -202 -79 202 -36 -102 -44 109 126 -252 -67 -162 259 -35 -199 -20 3 161 -258 67 58 -12
3965 -12 102 -30 19 -118 56 -86 108 -27 52 -167 -37 17 45 -242 -127 143 -31 37 136 -82 -64 333 98
3988 98 26 271 -82 -110 105 190 -46 114 111 158 -35 -40 204 144 222 -58 -134 194 304 83 29 219 -134 -139 144
4013 144 165 -35 155 115 -63 -305 -125 -35 125 28 -81 27 -17 -151 -27 176 66 -101 100 -253 -100 98
4035 98 102 95 131 -47 -190 33 112 433 53 -94 82 -179 -226 -77 44 -15 -3 41 31 190 -6 185 -81 61
4059 61 -54 65 -132 167 -71 23 16 -376 28 -64 -27 -94 -24 -156 169 131 36 -29 103 -194 282 100 -112 61
4083 61 87 106 104 169 78 -124 22 171 91 -22 -26 9 35 76 72 -28 27 50 -197 21 56 92 -30 70 321 -180
$$ packed form
3918I6j88J15K1J5m02K08J76j86J46p1J27k09K11Pr8j44J31q9J94N8j13Q6j34
3941d3M6M0j53r2J23K81k38o6N8J53J7l78J85r5M21k94j64J79K3J58m19L25rp0
3965a2J14j32M9j37J74j42J94j35P9k19J30N4K8k87J15K70j74O8R9k18J8L97k35
3988I8p2K45l53k8K15Q5k36J60lM7j93nK44o0P8k80p6L28J10k21n4J90l53nK83
4013A44K1k00J90m0j78k42J80R0J60r7j09J08m4j34J24K03j10j67K01l53J53J98
4035I8MpL6j78j43K23P9L21l80j47J76k61m7J49J21n9J2M4j0J59j96J91k66J42
4059F1j15J19j97K99k38R4pl92M04r2L7o7P0j32L25l8r5o5J32k97M76j82k12J73
4083F1K6J9kO5r1k02J46J49q0j13mL5K6M1mj00N5K3k47K18L5L6j22J00K51n01
$$ plain form
4109 -180 -5 71 169 -52 100 -170 -95 157 -7 -53 -78 -164 -135 102 28 -111 -68 -221 268 0 -28 -276 95
4132 95 195 -194 71 349 209 213 105 54 153 208 -82 -198 -43 -101 75 124 -243 25 -37 153 218 132 -103 -100
4156 -100 36 221 -4 -186 96 -47 -10 30 115 -263 147 -49 328 4 -62 127 144 226 87 190 149 -209
4178 -209 62 -97 98 260 46 117 -7 -168 -24 20 94 177 -62 74 -14 176 31 104 -138 180 -183 -102
4200 -102 159 -110 368 8 -53 207 -36 22 -80 288 -247 75 -331 -129 -56 85 -67 107 121 47 119 37
4222 37 -84 100 -263 88 31 -76 211 -207 0 -212 -35 -118 176 125 -31 143 -276 -86 -138 -109 32 57
4244 57 -91 -85 -42 -205 -42 -118 -50 189 26 4 -118 14 12 131 67 135 100 -48 -214 32 -70 92 -163 -17
4268 -17 243 -47 158 -211 153 225 -129 -305 98 183 -182 -28 309 -29 194 -106 -4 187 -169 121 81
$$ packed form
4109a80J75P6R8k21J52k70P5K52j64m6k5q6K9K37p4j39M3j53M89k68k8k48L71
4132I5J00l89K65K78j40Mj08n1R9N5k90j16J55n8J76M9l67K68o2J90O5q6k35L
4156a00J36J85k25j82K82j43L7M0Q5l78M10j96L77l24o6J89J7Q2j39J03m1l58
4178b09K71j59J95J62k14P1j24j61J44M4P4Q3k39J36q8J90j45P3k42L18l63Q1
4200a02K61k69M78l60o1K60k43N8j02L68n35L22m06K02P3J41j52J74J4p4P2q2
4222C7j21J84l63L51n7j07K87m18K07k12J77q3K94n1j56J74m19J90n2K9J41K5
4244E7j48OM3j63J63p6O8K39j63k2j22J32kJ19o4O8l5j48j66K46j02J62k55J46
4268a7K60k90K05l69L64P2l54j76M03Q5l65J54L37l38K23l00J02J91l56K90m0
$$ plain form
4289 81 -113 225 104 204 -54 -4 166 -174 -206 97 -173 60 15 80 -43 29 140 -73 51 89 162 -51 -24
4312 -24 139 271 -165 44 -74 234 -13 -57 28 -96 -46 -103 47 5 -166 -179 69 -79 -121 51 -483 276 -103
4335 -103 -151 10 -262 138 328 -73 92 134 44 -38 24 150 323 111 -32 137 -2 -103 -151 -94 35 67 -206
4358 -206 -139 -70 -44 26 296 -53 -15 -202 45 -26 -185 -12 -171 -125 -78 119 -1 -149 5 -42 -63 59 306
4381 306 -306 19 -273 -112 -116 -141 120 47 -187 2 22 197 258 38 83 -45 -25 -358 -32 -203 9 92 122
4404 122 51 93 385 164 -61 161 18 -9 211 -99 -123 -37 14 94 5 -11 25 -169 165 84 153 -119 212 -12
4428 -12 -13 -23 245 -6 17 -127 40 82 14 271 -64 -100 146 155 -115 91 -117 -228 117 -40 -77 152 -179 -149
4452 -149 115 -49 61 107 24 -146 -159 129 94 -53 36 81 102 41 249 -213 -207 375 -233 36 106 -396 65 84
$$ packed form
4289H1j94L38j21J00k58N0J70l40l2L03k70K33m5O5j23P2J11k13J24L8P3k13K7
4312b4J63J32m36K09j18L08k47m4Q5j24N0n7J50m2j71j3K48j48m2J72n34P59l79
4335a03m8J61k72M00J90m01J65M2r0q2O2J26J73k12j43J69j39j01m8N7J29L2k73
4358b06O7O9K6P0K70l49L8j87K47p1j59J73j59M6M7J97j20j48J54m7k1J22K47
4381C06o12L25k92J61mk5K61p3k34J89K0J75O1k20M5j28K0l33L26j71K12Q3L0
4404A22p1M2K92k21k25K22j43k7K20l10k4Q6N1Q0q9j6L6j94L34q1O9k72L31k24
4428a2jj0K68k51K3j44J67M2o8K57l35l6K46Rk70K06k08j11L45j57l7K29l31L0
4452a49K64j64J10M6q3j70j3K88l5j47Q9M5K1o1K08m62ON82o08K69P0n02M61J9
$$ plain form
4476 84 -106 -58 -244 122 -41 -147 60 53 -127 42 -103 41 -93 53 26 -231 -108 6 -11 145 -164 -63
4498 -63 -76 141 197 -79 -214 -119 151 162 29 290 110 -75 -43 195 20 -66 169 335 37 90 -36 54 132
4521 132 60 28 138 64 307 -130 -123 13 312 -134 -218 -193 -30 86 -77 2 -51 25 -10 -64 -102 191 -122 -63 -120
4546 -120 -80 -237 -75 -101 -21 69 250 -43 24 287 58 -185 87 -192 -116 99 158 311 -114 3 127 -78
4568 -78 388 -21 224 188 -8 -300 -60 68 142 -292 -204 -137 -132 -48 152 -232 -268 144 -94 108 -161 2 207
4591 207 -156 124 11 213 244 110 130 -259 145 1 11 -64 132 -36 -307 -231 -100 -16 1 -1 138 377 -32
4614 -32 -149 50 -104 -7 173 -164 -75 -183 -27 -43 96 19 -44 91 -7 158 12 -135 -212 -149 327 39 388
4637 388 -28 -78 122 155 181 -65 -27 137 64 52 -85 41 -20 -51 178 181 33 -83 -137 77 36 50 -35 33 26 104
$$ packed form
4476H4j90M8j86L66j63j06K07pj80J69j45J44j34J46k7k57J23J14j7J56l09J01
4498f3j3K17N6k76j35R5K70J1j33K61j80j85L2K38j75q6K35J66k98N3j26R0P8
4521A32p2l2J10p4K43m37PJ36K99m46q4K5J63J16j63P9n3P6l5n4l8K93l13N9n7
4546a20M0j57J62k6Q0R0J81k93O7K63k29k43K72k79P6K15N9J53m25J17J24k05
4568g8M66m09K45l6j96k92K40J28P4m34Q8O7NQ4K00l84l6M12k38K02k69J63K05
4591B07l63K80j13K02L1j34K0l89M04j44J0p5J96j68k71P6J31Q4J7kJ39K39m09
4614c2j17J99j54R7J80l37Q9j08J56j6J39p7o3J35r8J65j46j47p7O3M76k88L49
4637C88m16n0K00L3K6k46L8J64p3j2j37J26o1l1K29Lj48j16n4K14m1J4q5O8pP8
$$ plain form
4663 104 164 10 11 58 -320 -125 232 -60 -85 12 -46 -6 -24 -261 40 229 25 -205 -17 185 -37 -167 82
4686 82 107 153 -26 -217 101 127 122 -104 -33 248 159 28 14 -9 77 124 -86 -91 12 -38 -153 -120 54 -256 -37
4711 -37 -192 -34 -118 -65 -55 45 14 -181 -208 -1 36 -120 -150 -144 -7 -54 -120 203 162 -147 32 -314 50 -2 -66
4736 -66 45 -106 25 -11 -39 205 -74 45 -20 -167 -57 28 80 -117 13 -65 -185 249 28 6 155 -36 73
4759 73 83 -143 -39 -25 -49 53 -291 222 -25 -27 -120 156 13 -44 223 110 -77 -15 -8 -38 257 130 25 -246
4783 -246 54 1 -115 -108 -228 -308 -124 259 -114 131 -169 -98 -19 91 -47 -9 -94 227 135 -118 89 -75 81
4806 81 -50 66 -51 -6 59 21 123 10 39 137 -13 13 122 -99 175 82 -6 -131 150 3 -178 -144 139
4829 139 196 130 185 231 109 32 159 -8 162 -162 127 61 -243 269 169 -93 9 -67 147 -19 41 -140 195
$$ packed form
4663A04O0j54JM7l78J95L57k92k5R7n8M0j8k37L01J89k04k30J88K02k22j30K49
4686H2K5M6j79j91L18K6nk26P1K81q9j31j4k3Q6M7k10nJ03n0j15L3J74l10K19
4711c7j55J58q4N3J0J00l1j95k7K07L7j56l0OJ37m7o6L23m1l09J79l46L64n2o4
4736f6J11j51J31l6k8K44k79J19o5j47J10Q5N2j97J30p8j20M34k21k2J49j91J09
4759G3J0k26J04J4k4J02l44N13k47kr3K76j43n7K67j13j87O2Pl0K95j27j05k71
4783b46L00n3j16Pj20q0J84L83l73K45l00P1P9J10j38L8q5L21r2k53K07j64J56
4806H1j31J16j17M5O5l8J02j13K9R8j50K6J09k21K74r3q8j25K81j47j81L4K83
4829A39N7o6N5M6j22p7J27j67J70l24K89o6l04N12j00k62J02p6K14j66O0j81L35
$$ plain form
4852 195 -35 93 34 -54 -54 -8 410 -51 221 -70 110 58 270 38 21 55 -212 -84 -10 85 112 -100 -97 -101 -30
4877 -30 105 101 -136 -27 -172 -168 115 -108 -42 -20 -10 23 122 108 -10 36 14 129 46 -111 120 -121 -149 -3 268
4902 268 -155 107 118 -77 25 254 -168 -196 139 -171 -109 -209 -21 317 4 -117 263 32 -14 -190 -41
4923 -41 126 -88 -264 -2 -178 147 44 -136 60 -34 -308 62 -10 -49 190 234 11 -80 -13 82 -22 22 59
4946 59 -94 30 -264 -196 64 14 118 -277 -211 -51 -54 72 9 1 151 -74 31 -30 -90 136 -61 31 -77 209
4970 209 95 120 24 -6 7 -81 60 -136 73 33 -197 220 -119 134 32 -56 -14 -79 47 -109 27 43 -105
4993 -105 -5 -155 47 -114 -124 -107 -8 -29 -46 -150 -72 -326 -78 59 184 2 192 -13 -231 68 -49 -22
5015 -22 169 105 39 -165 -62 162 -121 -102 68 -6 126 123 -35 281 25 53 -181 93 -82 -60 -135 178 253 50
$$ packed form
4852A95k30J28n9q8%M6M18m61K72k91J80n2K12k32j7L4k67J28P4R5K7k12LmP1
4877c0J35mk37J09j45MK83k23O6K2J0L3R9j4j18M6k2J15q3j57K31k41k8J46K71
4902B68m23K62J1j95J02K29m22k8L35l10O2j00J88L38l13j21L80k31m6j76J49
4923d1J67k14j76K62j76L25j03j80J96r4k74L70p2l9K39M4k23r1O7R5j04M4L7
4946E9j53J24k94O8K60n0J04l95O6J60lJ26o3qJ50k25J05o1o0K26j97R2j08K86
4970B09j14K5r6l0J3q8J41j96K09m0k30M17l39K53j02q8M2o5J26j56J36J6j48
4993a05J00j50K02j61j0J7R9k1j7j04P8k54K48J37J25j82J90k05k18K99j17K7
5015b2J91o4o6k04J03K24k83J9J70p4J32lj58L16k56K8k34K74j75K2p5L13P5k03
$$ plain form
5039 50 -82 -185 -113 -280 -65 -246 102 139 -78 41 -190 57 250 -17 -76 146 -177 -21 120 156 42 -42
5061 -42 -61 -6 -132 -80 -107 -159 -94 245 -176 13 -174 218 128 -5 255 32 102 41 280 129 132 228 -166 138
5085 138 -52 -211 84 32 -96 8 -239 9 91 -66 -84 80 -125 34 -22 -207 127 338 -50 -46 -145 246
5107 246 70 290 82 108 135 59 -141 -28 98 6 -260 -89 -154 10 97 221 -89 -115 -148 197 -242 11 101
5130 101 284 -98 141 181 -45 23 35 67 84 -38 -10 49 105 -100 167 -55 0 -136 -173 122 64 89 -185 -125
5154 -125 -183 122 255 76 84 29 -181 -109 -42 74 406 -87 165 107 134 -52 34 -5 -291 156 161 -23 -128 133
5178 133 -185 -198 -28 -47 77 -21 -269 312 194 -68 -191 -185 -10 112 -211 -38 125 -46 49 19 -43 -288 -90
5201 -90 63 58 82 123 -128 -221 339 51 -225 -186 -174 -122 -92 -12 -27 -44 193 -12 45 112 140 87 31 135 -252 191
$$ packed form
5039E0j32j03P2j67K15j81L48L7k17J19k31K47J93k67n9K22l23J56J41L6j14q4
5061d2j9N5j26N2k7n2O5L39m21J89j87L92r0j33K60k23P0o1K39j51LR6l94L04
5085A38j90j59K95n2j28J04k47K48Q2j57j8J64k05J59n6j85L34K11l88Mr9L91
5107B46j76K20k08K6K7p6k00J13J26r2k66J71o5J64Q7J24l10k6l3L45m39K53R0
5130A01J83l82K39M0k26O8J2L2J7j22K8N9N6k05K67k22N5j36l7K95n8K5k74O0
5154a25n8L05J33j79Qn5k10P2O7J16L32m93K52n8K7j86Q6l9k86M47Nj84j05K61
5178A33l18j3J70j9J24r8k48N81j18k62j23OJ75J22l23J73J63j71R5l0o2k45J98
5201i0J53nK4M1k51r3N60k88k76L9J2N2L0Q0j5j7K37k05N7O7K8n3n6J04l87M43
$$ plain form
5227 191 17 95 172 42 61 -130 -71 151 -27 -248 49 113 -159 -171 -39 170 -91 49 -75 85 226 103
5249 103 -205 12 -41 -389 -240 -61 20 -45 87 94 142 -88 -51 -21 117 -31 -155 -73 108 236 30 8 17 86
5273 86 131 117 -42 -167 239 275 139 -306 6 -44 173 -107 -13 40 -173 -18 -75 5 -6 121 -197 -91 -224
5296 -224 -168 89 129 237 -8 109 -36 -88 -35 43 -156 -83 -80 -99 52 199 71 -60 60 -100 -28 57 79 -63
5320 -63 309 -60 -59 60 -271 -91 38 -141 -152 -285 -86 -82 103 -119 -18 -388 -108 113 -81 -74 47 18 127
5343 127 49 135 210 -4 -264 -38 206 -358 -46 348 4 -81 -26 282 20 92 390 82 -154 3 107 49
5365 49 165 426 -274 -84 -118 -46 -181 -80 59 -97 -92 -49 -42 256 -128 179 116 271 -65 311 -155 -122 -66 95
5389 95 3 -289 -319 139 161 280 5 50 172 98 -60 -141 -22 111 52 -204 -58 -57 115 -103 -95 -61 86 145 201
$$ packed form
5227A91j74P8P7j30J9j91N9K22j78k21K97O4k72j2J32K09k61J40j24J60J41j23
5249A03l08K17n3l48J49J79Q1o5J32PM8k30L7L0J38j48j24Q2J81J28k06k2RO9
5273H6M5j4j59j25M06L6j36m45L12n0K17k80R4N3k13J55n7Q0j1J27l18J06j33
5296b24N6K57M0J08k45J17j45n2N3P8j99P3Lj9J51J47j28j31J20j60P2Q5K2j42
5320f3L72l69JJ19l31J80J29j79j1j33J99MJ85k22J01l70K80K21j94PJ21k9J09
5343A27p8Q6P5k14k60K26K44n64L12L94l44q5N5L08k62P2K98l08k36J57J04n8
5365D9J16K61p00J90l4P2j35J01J39j56NM3PK98l84L07o3J55l36L76m66L3N6J61
5389I5r2k92l0M58K2J19k75M5J22p4j58q1J19J33n9k56J46JJ72k18QL4J47N9N6
$$ plain form
5414 201 -137 -245 -29 -55 10 -115 -232 -20 60 -176 44 271 49 156 187 8 2 -58 -80 3 -204 20 83
5437 83 -189 -113 -86 -55 -251 51 138 -9 -31 -26 -47 -158 -135 -132 -180 251 54 -57 -348 103 -134 -58 39 60 -140
5462 -140 -72 -209 188 22 21 10 30 93 30 -201 -214 190 95 88 38 -112 -251 51 287 264 -68 63 20 196 -265
5487 -265 169 -9 -177 101 54 118 106 9 71 32 131 20 -24 82 30 -114 -19 10 -107 85 -67 38 11 45
5511 45 -79 -26 -109 98 -153 -47 -204 102 -79 27 67 106 -109 -195 98 67 181 68 113 -263 -116 129 184
5534 184 -113 -65 41 190 -79 210 -3 2 -23 -192 85 151 81 93 -118 43 164 -99 250 -89 -91 -65 -180
5557 -180 -3 104 -20 82 171 -53 -68 155 68 -18 1 108 -6 -64 105 36 -220 -43 93 -167 -26 31 30
5580 30 -16 291 341 23 -110 -182 113 107 191 101 -41 25 -256 -126 -461 -178 9 -3 141 -159 -179 5 349 4
$$ packed form
5414B01l38j08K16k6O5j25j17K12Q0k36K20K27k22J07L1j79oo0k2Q3k07K24O3
5437H3k72P6K7L1j96L02Q7j47k2Nk1j11K3Lm8M31j97j11k91M51k37P6R7K1k00
5462a40O8j37L97j66jj1K0O3o3k31j3M04r5pn0j50j39L02K36k3l32J31m3J76m61
5487b65M34j78j68K78m7O4j2r7O2l9R9j11m4J06n2j44R5K9j17J92j52J05k7L4
5511D5j24N3q3K07k51J06j57L06j81J06M0L9k15q6K93l1J14j13M5l76J47K45N5
5534A84k97M8J06J49k69K89k13Nk5j69K77O6p0J2k11J61J21k63L49l39kK6j15
5557a80J77J07j24J02Q9k24j5K23q7q6J9J07j14n8J69o9k56J77J36k60J41N7j
5580C0m6L07N0l18j33p2K95oQ4r0j42O6k81J30l35K83J87j2J44l00k0J84L44l45
$$ plain form
5604 4 -139 64 -37 123 105 -101 3 195 -108 73 272 113 -113 217 118 114 496 110 134 68 64 36 186 73
5628 73 -5 -73 -51 -125 -108 -174 -33 -19 -40 -150 176 -73 -103 -114 -91 -46 98 18 -355 32 -317 27 37 -161 7
5653 7 -416 119 -21 114 -52 -130 -284 -348 -182 -198 -153 31 8 -68 61 -283 -89 -110 156 -85 -215 -26 197
5676 197 196 -145 -251 266 -28 -122 63 -154 35 10 -9 -24 -32 117 -81 57 244 166 34 119 39 243 -41 84
5700 84 13 112 290 221 91 65 -176 -70 -5 -90 88 185 88 75 -55 -64 123 -4 92 -96 -181 -11 -56 96 99 70
5726 70 68 -26 -24 -57 20 -84 51 -41 -20 -195 -17 31 107 -244 -139 -41 -184 59 -153 -47 -91 63 21 -95 119
5751 119 -232 -138 -99 -44 367 123 89 -152 30 192 -79 -133 -244 -93 82 218 -225 34 -171 2 -127 152
5773 152 -40 169 172 119 -99 101 49 -17 18 -133 -102 21 -86 116 180 -191 -76 31 -130 162 4 66 -202
$$ packed form
5604Dj43K03j01J60j8k06J04J92l03J81J99j59k26L30r9mL82l86K4o6mk8J50j13
5628G3p8o8K2p4J7o6J41J4k1j10L26k49l0j1K3M5J44q0l73L87l49L44J0j98J68
5653Gm23N35j40J35j66p8j54o4J66j6M5J84k3p6J29l44J94k1K66k41j30J89K23
5676A97jl41j06N17k94r4J85k17J89k5j9j5qJ49j98J38J87p8j32Q5q0K04k84J25
5700H4p1R9J78o9j30k6k41J06O5q5J78R7r7j3j30rJ87j27R6j88q5J70m5J52Lk9
5726G0kr4Kl3P7j04J35r2K1j75J78M8P6l51J05R8j43K43k12J06m4J54m2j16K14
5751A19l51R4L9N5M11k44l4k41J82J62k71n4j11J51J75J36m43K59k05J73j29K79
5773A52j92K09Ln3k18K00n2o6L5j51L1J23j07K02O4l71J15J07j61K92j58O2k68
$$ plain form
5796 -202 -189 99 -20 5 -210 136 261 239 37 10 37 -30 0 93 150 -126 -142 17 -81 -80 150 27 127 -18
5820 -18 271 27 269 61 139 -13 78 119 -13 185 217 2 -15 101 155 17 -8 -90 181 -157 -120 97 31 28
5844 28 81 -9 -157 0 59 -61 95 81 71 77 -110 -93 59 218 -98 134 116 -151 -98 0 155 124 129 42 39 -75
5870 -75 84 75 -85 -163 -67 -110 191 180 148 -90 29 -15 114 101 -124 -140 11 -264 21 -13 -170 -278 -108 -244
5894 -244 -169 56 261 9 40 -123 1 -12 -165 -23 17 -99 197 -98 45 6 108 -24 -277 69 -384 -232
5916 -232 -4 -83 279 0 -158 -71 -189 32 -106 111 97 -255 169 -25 -175 75 106 119 19 -105 -65 -79
5938 -79 -72 -166 191 -203 -98 29 171 -205 208 49 78 6 138 229 -91 -177 -157 -173 26 -323 -101 27 -231
5961 -231 5 52 157 81 82 113 -82 289 52 -96 52 -179 -78 60 13 179 -270 -274 33 94 19 -29 -250 -237
$$ packed form
5796b02J3K88j19K5k15L46J25k2k02k7K7o7L0R3N7k76j6J59r8JK30j23J00j45
5820a8K89k44K42k08P8j52R1M1j32J98L2k15j7J16N4j38k5q2K71l38L7K17o6l
5844B8N3r0j48J57N9j20J56j4j0Oj87J7J52J59l16K32j8k67N3R8J55l1Nq7lj14
5870g5J59rj60p8R6m3L01j1l2k38J19m4J29j3k25j6J51k75K85l4j57j08J70j36
5894b44P5K25K05k52L1j63J24j3j53J42M0j16K96k95J43l9J02j32k53L46m53J52
5916b32K28p9L62k79j58Q7j18K21j38K17j4l52M24j94j50K50L1J3j00j24M0j4
5938g9Pr4L57l94J05J27J42l76M13j59K9p2J32R1l20q6K0j6J99l49K22J28k58
5961b31K36M7J05p6JL1j95L71k37j48J48k31J01J38m7J66m49mL07O1p5m8k21J3
$$ [...]
8191C0
##END NTUPLES=NMR FID
##END=
