##TITLE=1H_LR-775-C1M
 CDCl3
 8 sc, 
 1.11.2023
##JCAMPDX= 6.0         $$ Bruker NMR JCAMP-DX V2.0
##DATA TYPE= NMR FID
##DATA CLASS= NTUPLES
##ORIGIN= UXNMR, Bruker Analytische Messtechnik GmbH
##OWNER= root
$$ XWIN-NMR		Version 3.5
$$ Wed Nov  1 14:55:03 2023 Russian Standard Time (UT+4h)  she@DPX200
##.OBSERVE FREQUENCY= 200.13135
##.OBSERVE NUCLEUS= ^1H
##.DELAY= (6, 6)
##.ACQUISITION MODE= SIMULTANEOUS
##.ACQUISITION SCHEME= undefined
##.AVERAGES= 8
##.DIGITISER RES= 18
##SPECTROMETER/DATA SYSTEM= spect
##.PULSE SEQUENCE= zg30
##.SOLVENT NAME= DMSO
##.SHIFT REFERENCE= (INTERNAL, DMSO, 0, 15.7039)
##AUDIT TRAIL= $$ (NUMBER, WHEN, WHO, WHERE, WHAT)
$$ ##TITLE= Audit trail, XWIN-NMR		Version 3.5
$$ ##JCAMPDX= 5.01
$$ ##ORIGIN= Bruker BioSpin GmbH
$$ ##OWNER= she
$$ F:/spectra/data/she/nmr/H-F/1/audita.txt
$$ ##AUDIT TRAIL=  $$ (NUMBER, WHEN, WHO, WHERE, WHAT)
(   1,<2023-11-01 14:53:47.26 +0400>,<she>,<DPX200>,
      <created by zg, POWCHK disabled, PULCHK disabled
       configuration hash MD5:
       00 E9 B6 7A A2 85 ED C7 34 08 36 98 17 FE 4E 26
       data hash MD5: 16K
       B2 6B 3E 45 FA 49 79 58 27 56 02 51 12 92 C5 98>)
$$ ##END=
$$ 
$$ hash MD5
$$ 27 91 9C 51 25 DD 69 80 86 A9 14 8B 56 7D 9A B3
##$RELAX= 
##$RELAX= 
##$RELAX= 
##$RELAX= 
##$RELAX= 
##$RELAX= 
$$ Bruker specific parameters
$$ --------------------------
##$DU= <F:/spectra>
##$EXPNO= 1
##$NAME= <H-F>
##$PROCNO= 1
##$TYPE= <nmr>
##$USER= <she>
##$AMP= (0..31)
100 100 100 100 100 100 100 100 100 100 100 100 100 100 100 100 100 100 
100 100 100 100 100 100 100 100 100 100 100 100 100 100 
##$AQSEQ= 0
##$AQ_mod= 1
##$AUNM= <au_zg>
##$AUTOPOS= <>
##$BF1= 200.13
##$BF2= 200.13
##$BF3= 200.13
##$BF4= 200.13
##$BF5= 200.13
##$BF6= 200.13
##$BF7= 200.13
##$BF8= 200.13
##$BYTORDA= 1
##$CFDGTYP= 0
##$CFRGTYP= 5
##$CHEMSTR= <none>
##$CNST= (0..31)
1 1 145 1 1 1 1 1 1 1 1 1 1 1 1 1 1 1 1 1 1 1 1 1 1 1 1 1 1 1 1 1 
##$CPDPRG= <>
##$CPDPRG1= <>
##$CPDPRG2= <>
##$CPDPRG3= <>
##$CPDPRG4= <mlev>
##$CPDPRG5= <mlev>
##$CPDPRG6= <mlev>
##$CPDPRG7= <mlev>
##$CPDPRG8= <mlev>
##$CPDPRGB= <>
##$CPDPRGT= <>
##$D= (0..31)
0 1.2 0 0 0 0 0 0 0 0.06 0 0.03 0 0 0 0 0.0002 0 0 0 0 0 0 0 0 0 0 0 0 
0 0 0 
##$DATE= 1698836026
##$DBL= (0..7)
120 120 120 120 120 120 120 120 
##$DBP= (0..7)
150 150 150 150 150 150 150 150 
##$DBP07= 0
##$DBPNAM0= <>
##$DBPNAM1= <>
##$DBPNAM2= <>
##$DBPNAM3= <>
##$DBPNAM4= <>
##$DBPNAM5= <>
##$DBPNAM6= <>
##$DBPNAM7= <>
##$DBPOAL= (0..7)
0.5 0.5 0.5 0.5 0.5 0.5 0.5 0.5 
##$DBPOFFS= (0..7)
0 0 0 0 0 0 0 0 
##$DE= 6
##$DECBNUC= <off>
##$DECIM= 32
##$DECNUC= <off>
##$DECSTAT= 4
##$DIGMOD= 1
##$DIGTYP= 9
##$DL= (0..7)
0 120 120 120 120 120 120 120 
##$DP= (0..7)
150 150 150 150 150 150 150 150 
##$DP07= 0
##$DPNAME0= <>
##$DPNAME1= <>
##$DPNAME2= <>
##$DPNAME3= <>
##$DPNAME4= <>
##$DPNAME5= <>
##$DPNAME6= <>
##$DPNAME7= <>
##$DPOAL= (0..7)
0.5 0.5 0.5 0.5 0.5 0.5 0.5 0.5 
##$DPOFFS= (0..7)
0 0 0 0 0 0 0 0 
##$DQDMODE= 0
##$DR= 18
##$DS= 0
##$DSLIST= <SSSSSSSSSSSSSSS>
$$ [...]
##$SUBNAM2= <"">
##$SUBNAM3= <"">
##$SUBNAM4= <"">
##$SUBNAM5= <"">
##$SUBNAM6= <"">
##$SUBNAM7= <"">
##$SUBNAM8= <"">
##$SUBNAM9= <"">
##$SW= 18.05172834244
##$SWIBOX= (0..15)
0 0 2 0 0 0 0 0 0 0 0 0 0 0 0 0 
##$SW_h= 3612.71676300578
##$TD= 16384
##$TD0= 1
##$TE= 0
##$TE2= 300
##$TE3= 300
##$TEG= 300
##$TL= (0..7)
0 120 120 120 120 120 120 120 
##$TP= (0..7)
150 150 150 150 150 150 150 150 
##$TP07= 0
##$TPNAME0= <>
##$TPNAME1= <>
##$TPNAME2= <>
##$TPNAME3= <>
##$TPNAME4= <>
##$TPNAME5= <>
##$TPNAME6= <>
##$TPNAME7= <>
##$TPOAL= (0..7)
0.5 0.5 0.5 0.5 0.5 0.5 0.5 0.5 
##$TPOFFS= (0..7)
0 0 0 0 0 0 0 0 
##$TUNHIN= 0
##$TUNHOUT= 0
##$TUNXOUT= 0
##$USERA1= <user>
##$USERA2= <user>
##$USERA3= <user>
##$USERA4= <user>
##$USERA5= <user>
##$V9= 5
##$VALIST= <valist>
##$VCLIST= <CCCCCCCCCCCCCCC>
##$VD= 0
##$VDLIST= <DDDDDDDDDDDDDDD>
##$VPLIST= <PPPPPPPPPPPPPPP>
##$VTLIST= <TTTTTTTTTTTTTTT>
##$WBST= 1024
##$WBSW= 4
##$XGAIN= (0..3)
0 0 0 0 
##$XL= 0
##$YL= 0
##$YMAX_a= 288807
##$YMIN_a= -450475
##$ZGOPTNS= <>
##$ZL1= 120
##$ZL2= 120
##$ZL3= 120
##$ZL4= 120
##$ABSF1= 10
##$ABSF2= 0
##$ABSG= 5
##$ABSL= 3
##$ALPHA= 0
##$AQORDER= 0
##$ASSFAC= 0
##$ASSFACI= 0
##$ASSFACX= 0
##$ASSWID= 0
##$AUNMP= <proc_1d>
##$AZFE= 0.1
##$AZFW= 0.1
##$BCFW= 1
##$BC_mod= 2
##$BYTORDP= 1
##$COROFFS= 0
##$CY= 11.3945322036743
##$DATMOD= 1
##$DC= 2
##$DFILT= <>
##$DTYPP= 0
##$F1P= 15.7292609196834
##$F2P= 12.9074282941183
##$FCOR= 0.5
##$FTSIZE= 0
##$FT_mod= 4
##$GAMMA= 1
##$GB= 0.15
##$INTBC= 1
##$INTSCL= 1
##$ISEN= 128
##$LB= 0.24
##$LEV0= 0
##$LPBIN= 0
##$MAXI= 10000
##$MC2= 0
##$MEAN= 0
##$ME_mod= 0
##$MI= 1.114404
##$NCOEF= 0
##$NC_proc= 0
##$NLEV= 6
##$NOISF1= 3.799351
##$NOISF2= 2.8
##$NSP= 1
##$NTH_PI= 0
##$NZP= 0
##$OFFSET= 15.70392
##$PC= 1
##$PHC0= -23873.1
##$PHC1= 8.052709
##$PH_mod= 1
##$PKNL= yes
##$PPARMOD= 0
##$PSCAL= 0
##$PSIGN= 0
##$REVERSE= no
##$SF= 200.130013532006
##$SI= 16384
##$SIGF1= 3
##$SIGF2= 2
##$SINO= 400
##$SIOLD= 16384
##$SREGLST= <1H.CDCl3>
##$SSB= 0
##$STSI= 0
##$STSR= 0
##$SW_p= 3612.71676300578
##$SYMM= 0
##$S_DEV= 0
##$TDeff= 0
##$TDoff= 0
##$TI= <>
##$TILT= no
##$TM1= 0
##$TM2= 0
##$TOPLEV= 0
##$USERP1= <user>
##$USERP2= <user>
##$USERP3= <user>
##$USERP4= <user>
##$USERP5= <user>
##$WDW= 1
##$XDIM= 8192
##$YMAX_p= 0
##$YMIN_p= 0
$$ End of Bruker specific parameters
$$ ---------------------------------
##NTUPLES= NMR FID
##VAR_NAME=  TIME,          FID/REAL,        FID/IMAG
##SYMBOL=    X,             R,               I
##VAR_TYPE=  INDEPENDENT,   DEPENDENT,       DEPENDENT
##VAR_FORM=  AFFN,          ASDF,            ASDF
##VAR_DIM=   8192,          8192,            8192
##UNITS=     SECONDS,       ARBITRARY UNITS, ARBITRARY UNITS
##FACTOR=    0.0002768,     1,               1
##FIRST=     0,             0,               0
##LAST=      2.2672688,     0,               0
##MIN=       0,             -450475,         0
##MAX=       2.2672688,     288807,          0
$$ Real data points
##PAGE= N=1
##DATA TABLE= (X++(R..R)), XYDATA
$$ [...]
1878F8o67q6M02m85l67O41L46L62M12j95N11M39r89m09P79m27m63M65L87o49M23
1899D98N12p57o66J2m2p57J10R4M71j3Q8J01M12O2n89k7P34j9r80O04J383l3p47
1922D51O91N88j044q64N30j98j72M6l36k43R22m38r00J103k04j533K07R23q97
1941a368L47J380k36n36J268k82p10N60M87q54J43J007q96L35P16n26n00N49p62
1960A22j179M72Q12r78m97J122K40j019N55L87o35k52L76l20L20R67m21R6J338
1979A506j08j299KJ316r50o59J133l20j104R28K80j017P75K14j666k10J137j059
1997a101l22J727j68j142J188L29j479O84J183j245l88J435l96n90J557R7o52
2014G17q3K89r98N2O28r50O0Q11l45j092Q64N16q17m15O53o16o08J033N29m04
$$ y = [68, -599, -685, -283, -768, -1135, -494, -148, 214, 626, 431, 942, 1381, 392, -17, 762, 335, -128, 337, 724, 75, 498, 1010, 253, -413, -401, -443, -1200, -1090, -996, -525, -538, -450, -349, 63, 125, -464, -491, 243, 224, -756, -152, 1231, 1198, 451, 1142, 1730, 686, -178, 352, 154, -18, 28, -308, -551, 371, -67, -967, 136, -68, -1601, -1394, -471, -1368, -1021, 359, 123, -413, 855, 573, -137, 423, 910, 56, 199, 1206, 310, 645, 1361, 835, 335, 884, 122, -1057, -585, 227, -751, -1248, -126, 114, -905, -350, 37, -598, -850, -474, -794, -474, 493, 72, 168, 1506, 1398, 99, 101, 1417, 467, -192, 941, 621, -483, 445, 725, -292, 483, 697, -969, -1179, -42, -1101, -1423, 304, 136, -1006, 182, 511, -968, -284, 899, -346, -734, 701, 305, -285, 1272, 1369, 717, 634, 923, -75, -23, 605, -345, -285, 526, 181, -911, -47, 469, -348, -763, -110, -726, -1334, -301, 228, -176]
2034a76M47J51o86M11P19r58j51R69k45j510J391N59j166P18M40j024o95R88l27
2053a45m72J079L3j329N18O58j249P51P60r39m97J113l96q44J669N50j562M00
2071I8P60j225k74J157j80o19M42n46j5N88L65j040O30L97j435k56J828J41j232
2090d16M14R81j240l90J301m12m82O55m54r97J254m7n33N92O15j547o71J963j014
2109d28q42J798L9j518J025O60r38mJ442r03q48J017k46p02J186N14j559O42L59
2128F94j625N0J505o16j366J295N12j728L79J487k96j098M07K6j39L34N11q22
2146d90J051N17j265J26J499m20j130R57J40j762L82J510j185m63J355j094r77
2163a249R31j9r83N63P46j137O31R85r99J79J498q60j007J308J63j153P86J359
$$ y = [-176, 271, 422, -264, 147, 866, -92, -243, 726, 481, -1029, 362, 921, -245, 473, 913, -111, -806, 182, -145, -617, 462, 495, -834, -316, 342, -907, -156, 604, -335, -832, 281, -115, -959, 710, 1260, -302, 98, 858, -367, -641, 516, 336, -283, 159, -387, -402, 186, 551, -489, 141, 538, -897, -1153, 675, 816, -416, -2, 979, -261, -651, 650, 238, -244, 411, -43, -1040, 214, 167, -366, 226, 841, -706, -1377, 586, -428, -1270, 528, 567, -951, 74, 734, -204, -208, 1234, 331, -517, 500, 254, -448, 738, 1252, -307, 335, 694, -931, -881, 624, 8, -1358, -63, 449, -1279, -900, 587, 291, -807, -400, -374, -513, -179, 332, -490, 561, 1078, -187, -61, 1438, 1018, -112, 845, 985, -777, -395, 1115, -70, -533, 822, -272, -1249, -318, -337, -1320, -757, -11, -1148, -517, 468, -531, -352, 1146, 286, -721, 587, 750, -403, 383, 1742]
2181A742r98n72P74r5o59J84k81m66M6r4o75M14Q57p05m60M25M21j106K70Q27
2201a51j79n47Q36P94n38M2J016n61j52M29n36l43M26k90j71M74Q4j146L83L32
2221B02r90k33J029p26l44N01L58o59O13N17n23R4J48k10O26L54o77J44R55m00
2241G79n56L19L57o19k57R1j53j12n80J63O01j19q15M92J17j68m26M88k7l0K56
2262a99J01M01K41j76K39k11k98K12J87m27JL95j14l56L46k40r1j25o05K86K85
2283a48k92j51O14n0m52J71N54j19n72O78k00K00k60L76J11J53n64L6O4M02o62
2304a11j40K26j35O0k4j23K25L14n79J75M16n08m3L52j33J58K92m8m25L21K79
2325E49n11j22L9p8O3J5J51K5l11j84L29l3k56K8j53J56L42j04o6L41K61k61j80
$$ y = [1742, 744, 172, 946, 851, 192, 376, 95, -371, -325, -419, -1094, -680, 177, -528, -988, -563, -142, -1248, -978, -151, -330, -877, -41, 753, 215, 257, 1273, 712, 560, 989, 453, 110, 536, 246, 75, 549, 633, -513, -130, 202, -788, -1021, 8, -718, -1062, -561, -203, -862, -249, 268, -255, -161, -13, -223, 403, 757, 80, 224, 1179, 779, 223, 542, 899, 280, 23, 114, -39, -151, -731, -568, 33, -86, -901, -409, -292, -460, -886, -398, -425, -455, -199, -98, 303, 544, 368, 607, 396, 98, 310, 497, 70, 71, 466, 352, -4, 342, 102, 11, -114, -719, -433, -148, -440, -591, 23, -27, -479, -308, 246, 127, -445, 233, 33, 233, -27, 349, 460, 613, 49, 85, 149, 551, -111, -251, -25, -160, -100, -124, -247, -22, 292, -287, -112, 304, -204, -247, 105, -28, 130, 422, 374, -51, 270, 549, 38, -84, -45, -123, -60, -45, 106, 131, -180, -364, -35, -68, -324, -296, -449, -293, 49, -55, -121, 220, 481, 220, 40]
2348D0M00k03k70J37P3n5J29k23m8K75n67j39K73Q5l44j8P3K03k13K18j8l7Q9
2371a40J79p2J73r1K27l9J30R7k04Q0k32J00k95M0j32k09J94J66l04o8O1o0m32
2394h31M28L48l64P1M01k97L03J95J20j01j2J87j71M84k78r0j06J29k3n58L80
2415B15k89Pk35l67L08j89k04J28J67O7l6k6J67q4J81M07j31K89Q8M3L82m79J94
2438F03r5m79o9O50l24l50J42q6j51lj20l06L91k90l64K5O45r1j35N11J73l19
2460d2j10O42k58j19K09P7O1J90k16j56L93n19k76r1J96j94j24L11Q4m90Q5R6
2482b51j91R1J02j4m86N83K92k37L61J57j87J99j91k41M68K24p43M4N15j13p15
2503c33L25N43p95j88K22lj59j0j33N00L36n34k02N12L00q73L35K66j35j90N64
$$ y = [40, 440, 237, -33, 104, 177, 122, 251, 28, -20, 255, -312, -451, -178, -93, -437, -455, -382, -179, -392, -174, -192, -229, -140, 39, -33, 140, 49, 276, 237, 367, 464, 260, 340, 108, 208, -87, -47, -179, -388, -194, -28, -332, -400, -339, -399, -831, -403, -55, -419, -348, 53, -244, 59, 254, 374, 273, 261, 448, 277, 761, 483, 393, 287, 416, 393, -165, 215, -74, -67, -302, -669, -361, -550, -754, -626, -459, -392, -428, -454, -287, -371, -190, 217, 86, 375, 463, 506, 888, 409, 603, 508, 29, -40, 610, 286, -64, 78, -8, -159, -162, -282, -588, -197, -487, -851, -826, -181, -272, -407, 104, 277, -42, -152, 490, 232, 113, 322, 399, 460, 650, 434, 278, 671, 152, -124, -215, -19, -213, -337, -26, 58, -432, -347, -251, -442, -351, -249, -263, -749, -166, 126, -111, 250, 407, 220, 419, 228, -13, 455, 679, -64, -20, 495, 382, -333, -8, 535, -260, -448, -226, -229, -388, -398, -531, -31, 305, -229, -431, 81, 381, -492, -157, 109, -26, -216, 348]
2524C48O9j53j01J38j59j09J70l33j64K02l4J23K62m4l82J1K49m95J72K68k81
2545b43o4N92J16k71j24K24k28j52P8l45n1R14p74J09L82J78q73M49N75m62l83
2566c53L78K7n39P70J62n89M11k8k37r3K61k79j81N06l48j89M65L45p39L67J1
2587A28p16J26M07K57q34O77J68l25J29L16l09%J07j52J7J88M0n30R07N2n84m15
2609c46N98N1q77L57M99n66k86M99K05l43K57p8m27M97j41j66N40J84o03Q8Q10
2630G52n94k72P98j06r04P34p5o50M37L57n72j41J79J87o80Q5M92n27L71L34p59
2651e54L77N17j84k25L06J30m75N7K43r2J79K14j30k04J33M9l46r5K96m04j75
2672c83M71j75n24K91L07m99K68j1k06j23N83L0n32N05K53m18L01L30j98k1L3
$$ y = [348, 417, 264, 163, 301, 142, 33, 203, -130, -294, -92, -126, -3, 259, 215, -167, -156, 93, -402, -230, 38, -243, -307, 285, 401, 130, 6, 230, 2, -150, -72, -417, -468, 446, -328, -219, 163, 341, -532, -83, 492, 30, -353, 25, 52, -487, 283, 445, -144, 267, 239, 2, -91, 170, -109, -290, 216, -132, -321, 144, 489, -250, 117, 128, -588, -462, -55, 202, -632, 45, 213, -112, 17, 333, 24, 24, 131, -21, -4, 184, 224, -306, 601, 653, 69, -346, 252, 303, -574, -217, 282, -284, -570, -71, 134, -209, 48, -30, -457, 40, -101, -267, 273, 457, -146, -58, 752, 158, -114, 684, 578, -326, 408, 333, -317, 120, 477, -95, -236, -57, 130, -550, -465, 27, -500, -129, 205, -554, -177, 340, 156, -69, 237, 367, -108, -51, 192, 100, 279, 493, 363, 159, 292, 341, -5, -100, 196, -208, -383, 88, -87, -611, -320, -13, -512, -244, -255, -461, -584, -1, 29, -503, 2, 255, -163, 138, 468, 270, 249, 282]
2693B82m6k9o3L36l14qj13r8Q1n13M79l81K21O8k62lL02j80R3j65J23J86j31L13
2717A78l62J15L73j06k25N4J07L21l22P0LJ95j11l88P5J24q5lM0n4l60J07J4k7
2741b67k6L8j21L58O5l56O8L14O6j51J37M6J84k60O7K5k90J23J31k21K16k68J38
2764A6n9j24J24j13J03k46K54j90n3K45k9j36P0M1o6K38l23L35j32J65pJ83r3
2787B03K06k36q9J64q6m05L37l04J55k34N9J34n8J01j28K03l70L06k20K61n12
2808e13K68L8O9J45R2ok03J6J81P4k55K20L13l08j28J44K77l08l89O20%l54q9
2831i6R1M7J92k67n5M7K14o28L64n4J08J1j66K93j80j22L38l08K43j56J63J76
2853B55j97J91j34m6j32M1K16j07N0j12mj97J68J4J51l37l4J17K60m12Qj29M49
$$ y = [282, 236, 207, 144, 480, 166, 158, 45, -53, 28, -485, -6, -387, -166, -98, -360, -363, -61, -241, -148, -313, -190, -4, -135, 178, -184, -69, 304, 198, -27, 27, 134, 455, 133, 203, 206, 401, 290, -98, -23, 101, 16, 13, 53, -1, -361, -254, -240, -267, -293, -255, -376, -18, 47, -309, -241, 73, 139, -12, 125, 171, 355, 95, 162, 187, -103, 20, 151, -70, 146, -122, 16, -43, -167, -43, -156, -53, -299, -45, -235, -288, -43, -72, -208, -138, -97, -163, 75, -248, 87, -45, 120, 113, 296, 203, 409, 173, 84, 248, 162, -243, 94, -210, -55, -289, -230, -96, -154, -53, -181, 22, -348, -42, -262, -1, -513, -245, -207, -138, 7, 99, 93, -110, -94, 87, 161, -94, 126, 439, 131, 3, 147, 424, 116, -273, 347, 347, -7, -96, -5, 42, 234, -33, -88, -41, 173, -455, -91, -145, -37, -26, -192, 101, -79, -201, 137, -171, 72, -84, 79, 255, 58, 249, 115, 69, -63, -22, 194, 87, 137, 25, 21, -176, -8, 6, 157, -180, -214, -97, 163, -249, -241, -370, 79]
2876G9l53K96j5K91j85k40M08K0j14k94L51O5k36r1L82j49J0j07j8k46K62n1L2
2899I7j85J04j63N7j16j31J97M6k68j10N28K21l89m0L33J14j63r7K87k84P9J07
2921B24O6j20j08J56j48q8K03j07k29J76j49qJ27J62m27R7M32k79j41J92l12J72
2943a09K59j85Q8K08j33j1J19Lk67K01N9k58L4l82M38j62r0R5J02j94JL0Pj79
2967c26K69R5j60K0P4p2J21N7L0J45k33o0K47J07k18J95k69M02l29m12K21K07
2989A11j03K3KM4l0j75j72K07k44K05k8J59j76N2k0k8K55r2J89j34k52K71j76
3012a12J73k4L7Q3k71O1N7M9J4N4k15K27p7k00K04l83L11M3N9l35J70l4J27J26
3036A44n5k63K59j99J5N9p5Q8J27j59J4n3J53L01l59J89J1j69M9N4n9j98K18l9
$$ y = [79, -274, 22, 7, 298, 113, -127, 281, 301, 187, -107, 244, 309, 73, -18, 364, 215, 225, 118, 100, -146, 116, 65, 97, -88, 16, -147, -90, -206, -337, -140, -94, -362, -472, 56, 277, -112, -152, 181, 295, 132, 35, 322, 38, 117, 224, 290, 170, 62, 218, 70, -18, 185, 78, -151, 25, -124, -132, -5, 157, -270, -173, 259, -20, -161, 31, -281, -109, 150, -35, 53, 261, 128, 117, 236, 239, -28, 173, 232, -26, 8, -374, 64, -98, -188, -93, 9, -185, -184, -154, -147, -326, -57, 38, -122, -102, -28, -100, 21, 78, 108, 253, 20, -40, 207, 314, 96, 291, 22, 424, 95, -317, -96, 111, 8, 31, 33, 77, 47, -128, -300, -93, -337, -132, -160, -1, -177, -125, -145, -173, 82, -10, 179, 45, -207, 64, -112, 61, 37, 74, 157, -114, -53, 4, 53, 67, 121, -94, 133, 56, -144, 60, -323, -12, 31, 90, -245, -75, -109, 18, 144, 89, -174, 85, -114, -99, -40, -115, -27, 100, -59, -45, -98, 55, 356, -3, 186, 197, 28, 77, 131, 72, -126, 92, 53]
3060E3j82j6j70N9K72O7k48k21R7K93j75L2n6J11L1J81J14j77l2J80k67P9L08
3083C33k67K35k10J3Rj82Q8n6j73J46pq0J65j61R3M2j54j69J97K08l26K02J08
3106E4K54l08K63r7l63N50rk41j9J81l26M7J83j6k86N6RJ1k3P7j26L8J91k72K21
3131D9J79l73j3l12M89L01j5m30K5L24j4j95r9M10j14l57K67kK8Jk09j24K6J56
3155bj33J87q1k0O3k16J58Mj23M33j18l72K56J76j62q3L37r2l7J3%k42K9R8p9
3180fj30K72M8j43q2j2n6J03n2o2K1L4k45K73L27k73J29m16L28Pq3k9%N3j23j00
3206b17L48r9j19K73k76J26jr0k59N47m27K18J2k84L50o3j18J15J38l03M2j00
3228a87J10m0J45j67M2o9J50N9k36P0N5J8L16j18k3j81K47l1j52J55k81J23K12
$$ y = [53, -129, -145, -315, -256, 16, 83, -165, -386, -289, 4, -171, -139, -195, -84, -53, 128, 242, 65, 33, 213, -54, 25, 333, 66, 301, 91, 104, 113, -69, 19, -37, -210, -64, -71, -151, 14, -147, -54, -12, -166, -335, -138, 70, -256, -54, 54, 308, 0, 263, 166, -197, 353, 344, 103, 84, 265, -61, -14, 169, 153, -133, -77, -68, -57, -80, -3, -129, -91, 100, -172, 49, 228, -145, -158, -470, 19, 320, 305, -125, -100, 224, 210, 15, -84, 326, 212, -145, 122, 120, 148, 149, -60, -184, -158, -2, -135, 52, -29, -49, 14, -202, -44, -40, -163, 270, 152, -220, 36, 212, 50, -33, 304, 212, 175, 188, 188, -54, -25, 73, -6, -136, 136, 184, 41, -41, -53, -109, -6, -58, -120, -99, -65, -310, -37, 290, 17, 146, -270, 58, 65, -18, -47, -47, 6, -117, -217, 131, 32, -87, 186, -90, 36, 35, -55, -314, 233, -194, 24, 36, -248, 102, 39, -79, 36, 174, -129, -87, -187, -77, -117, 28, -139, -97, -166, -16, 43, -193, -123, -68, -50, 266, 148, 125, -56, 191, 160, 8, 163, -118, 5, 217]
3251B17m34r4L31n0j68J68j32J54Q7j50k4k7L4l5J54j71K33j03PP5M1k74M81k60
3275F0o8J99p1k30j7J79Jj60K0rk24k5L18Pj91J13mj58K9m6J40R4n7J33J67j96
3301DL6P6o2L9K91k75j04J64Q7l76K12mN2J54k06j44p8L0O3l35M17L2p2r6L3q1
3327a43K22l69L37J25k49K27M1n9j99K02K57m26J69k21J67m4j5r0J1J04j00%l4
3350h7J60n62M49j38p9L34K0J96m83J21K5P9L0l0q3L7R2j43Q2J7J80k86K74j68
3374C7j03Q9K65l64k13L43n9k45J27K50j35J19k20o0J69m6l10K67K18j29j13N0
3396f3L0O2j45L01j09o9j00K77N8k89O7J37O0j80JN1k23j2r0K40k5J31l41R8L57
3421B24k80J40n1Qj51J57j73J06j9K85k43R5j66J2J3K75o3j83K86j40k83J59J76
$$ y = [217, -217, -311, 20, -30, -198, -30, -162, -8, 79, -71, -95, -122, -88, -123, 31, -140, 93, -10, -3, 72, 113, -161, 320, 60, -8, 191, 120, -110, -127, 52, 53, -107, -87, -96, -320, -345, -27, -20, -211, -98, -102, -260, -231, -277, -137, -43, -100, 33, 200, 4, 40, 116, 54, 93, 384, 109, 5, 169, 256, -120, 92, 88, 140, 294, 88, -56, -134, -104, -41, -376, 41, 73, 1, -95, -62, -143, 79, -290, 47, 172, -77, 150, 191, 132, -67, 135, 392, -34, 135, -86, 81, 37, 22, -68, -57, 47, -53, -53, -87, 73, -489, -40, -178, -257, 77, 97, 293, -190, -69, -44, 35, 65, 35, -48, -11, 81, -62, 20, 37, 217, -69, 205, 37, -66, 23, 288, -76, -289, 54, -5, -250, -123, 127, -8, 111, -109, -169, 0, -46, -356, -89, 129, 0, -113, -63, -33, 29, -116, 185, 76, 7, -93, 184, 242, -47, 20, 157, 217, 37, 38, 89, -134, -146, -236, 4, -21, 110, -231, -133, 224, -56, 84, 33, 41, -110, 47, -126, -20, -39, 246, 3, 98, -68, -56, -43, 232, 169, -14, 272, 132, -151, 8, 184]
3444A84k34q9P7J8j7m8J23j46J17o0J36o2KR1l9K1j89P8n4J88J00j45K9P5qK9
3470A77l01K91q5K0Q6k53Q5j38K89n20M73j9j29j28N8J05k49K62l47L79J30J31
3492C17l72J21O1P9k13J56q6M4j60J02P7j49R5J95j28n4J03j41k84J58J09j92
3514a62J44K8j39P8K94l05J31p8j61K34O4j57n1K05j06j38M64l34K84k28J17m8
3536A36k36K03J32m20J13P2j1j28K30l00L20J55l26J76m7j63J01K06k36J06k47
3557a64L43r4J8l4P1k23J60J44k74J17l04K80P2j14r4R7L52l03p2j33o1K39j59
3580a36J11M9j00m3kJ47j25n2P5n5J51Rk9K23k83K49l64K96L0j14j48K38k16J0
3604g9M2o8M9K53k85j34K73l46K62J00m9n1J05k42M59k36jL8j72M0j95L21j06
$$ y = [184, -50, -139, -62, -44, -61, -109, 14, -132, -15, -75, 61, -1, 1, 92, 53, 74, -115, -37, -91, 97, 197, 52, 81, 156, 148, 177, -124, 167, 82, 102, 188, -65, 20, -118, 171, -349, 124, 105, -24, -152, -94, 11, -238, 24, -323, 56, 186, 317, -55, 66, 127, 206, -7, 149, 63, 107, -53, 49, 126, -23, 72, 267, 139, 85, 188, 47, -237, -79, 30, -162, -18, 10, -129, -51, 243, -62, 69, -9, -170, 64, 128, -29, -80, 125, 19, -119, 345, 11, 295, 67, 184, 136, -100, 103, 235, -185, -72, 0, -11, -139, 91, -209, 111, 266, -60, 116, 69, -94, 7, 213, -23, 83, -164, 179, 85, 103, 69, 140, -83, 77, 221, -53, 64, -240, 40, 112, -2, -96, 1, 353, 50, -22, -155, -216, 23, -136, -25, 24, -76, -119, -121, 26, -99, -151, -76, -131, 20, 29, 0, 223, -60, 189, -175, 121, 151, 37, -111, 127, -89, -79, -37, -105, -56, 197, -88, -222, 51, -295, -33, 67, 18, -33, 72, -170, 289, 53, 52, 90, -82, -42, -237, 84, -22]
3627b2K19pp3l4J13k69J32j43L16k19R7m5k38J71k88M49n66M53o7L76k40l3o6
3650A6J4J18j73R6J0j26M4J45j30J60l44K07J27qo3k18Q8J50l06L05q6k97KM51
3674A82k10lkl9J08j09j2P3j45j48K68j14K16M0M7q3j6J11oL4k20m8J15k31K18
3699B6k48N6L94l35j14L05k58J55o3M0qJ88q4k95K0N1P3J49O4j33JJ03j07J23
3723A03J03k25J06J27n3o4Pj72J80j27kL13q1j10rj05j99J19q5J71m8j33L1J43
3747a0J54j05J52p9j50O2M4j52p0N0k3M19l70J68K25j96l8rj62J8K0j82J64J90
3771A20j68j11K03k47K92j89J36k2j2j6rK1n6L98l90M2K09Rj89J75J29j75J14
3794B64k89J18j25O3M6k86K72j97K3K33l32L1P7r1J85p5r4K84m1k34K98k57J42
$$ y = [-22, 197, 190, 117, 83, 196, -73, 59, -84, 232, 13, 110, 65, -173, -2, -290, 159, -407, 46, -21, 355, 115, 82, 16, 30, 148, -25, 71, 81, -45, -1, 144, 14, 174, -170, 37, 164, 156, 93, -125, -37, 113, -193, 112, 26, -271, -269, 182, -28, -31, -33, -72, 36, -73, -85, -12, -157, -305, -37, -151, 65, 105, 152, 69, 53, 164, 158, 192, -28, -76, 39, -192, 26, -222, -166, 228, -107, -221, 84, -174, -19, -82, -42, -50, 138, 54, -241, -221, -170, -97, 52, 116, -17, -16, 87, -20, 103, 206, -19, 87, 214, 161, 97, 104, -68, 112, -15, -17, 296, 215, 105, 96, -9, -208, -89, -174, -3, -51, -184, -153, -10, 144, 39, 191, 112, -38, 24, 68, -84, -154, -104, -127, 292, -78, 90, 315, 119, 81, 72, -90, -72, -52, -234, -70, 120, -48, -159, 44, -203, 89, -100, 36, 14, 2, -14, -23, -2, -58, 340, -50, -8, 201, 210, 21, 196, 325, 150, 264, -25, 93, -32, 31, 77, -209, 63, -134, -111, 122, -210, -179, -102, -193, -8, -83, -177, 107, 66, -168, 130, -127, 15]
3817A5j9J56j8R5m2Q3l56j08J73j15K31K0J05j64j14k04L31p6Q0k92J26m6P9j40
3841b00J43J87J67k72k62J69j17J21J49k16J59qM4j61J01O4O4k06J50j21k43L35
3863D7j40K04p7J24k79Q3n6J95k66r7J01rN4J3K95j76p3j01O7L38j22j24L0J44
3887A75j94K4j99K94j43q3J68K05m11K37J7j9j62Q7r0o1J13j13K58j24k8M2j85
3910a92N33m43K65j5qj71P8l8o8M0j39L34j85K96m48L31k55L1k87N85k31n2j63
3933b02J26o2m1J85J1J17l87L96l47L29M2k41O2l2j28K39M6r9k23K13k7K32j43
3956F6P0j77m1J5J44j90J27j57J45p7j02R2p6L78k38lk0p8j19J87K13L2k20pK57
3981B21k47L04k49p8J43j46J71j01Q9j61m3J62K01m82K72j79J96k25J77P1j61
$$ y = [15, -4, 152, 134, 229, 187, 270, -86, -194, -21, -136, 95, 115, 220, 56, -58, -262, 69, -7, 73, -219, -93, -139, -60, -200, -57, 130, 297, 25, -237, -68, -185, -64, 85, -131, 28, 20, 64, -97, 4, 68, 132, -74, 76, -45, -288, 47, -93, 111, 34, 158, -121, -38, -94, 101, -165, -262, -161, -170, -116, -103, 192, 16, -57, -158, -91, 247, 125, 1, 31, 175, -19, 5, -194, 100, -43, -126, 42, 247, -164, 73, 90, 71, -91, -4, -94, -155, -42, -155, 103, -21, -49, -7, -192, 341, -102, 163, 148, 140, -31, 47, 9, -59, -19, -158, 176, -9, 287, -161, 170, -85, -54, -341, 244, 13, -39, -202, -76, -138, -179, 6, 17, 134, -253, 143, -204, 125, 167, -74, -12, -44, -172, 67, 113, 14, -209, 4, -23, 209, 66, 136, -41, -82, -67, 77, -113, 14, -143, 2, -75, -177, -85, -161, 217, -21, -24, -44, -122, -241, -54, 159, 191, -29, -36, 221, -26, 278, 29, -49, 94, -52, 119, 18, 107, -54, -97, 65, 266, -216, 56, -123, 73, -152, 25, 96, -65]
4002f5N3M5P0j44k63M08r9J6m8N5J74K53l98j49J87J17j07j02Q8j67M7K55m11
4025a85K34p1n0Q7P7j45K91j03n3k89j8M49j62p4p1L49l13K29J6j51J2Q8p3p3
4049AK50k74j18P0J17J54n9k28Q3K21j17k23m3J76j99j07K91j11K36k91M9J04
4071a8P0k06K47k34L4R6M5l8m4o1Q7R0j54J55j13J70k10L1K36m47L87m10M44k42
4095h5Q0L9j08K56ml34N6kP2JJ05j20j22L93K1j20k11K21k3Q3k56L6K03k01J5
4120eP1q4K3j23K6k3k0J95j08R6Q7J36n26L64j42j37J59J26k2J6p2J01k23K66
4144A81j59m0J29m6m7j45Q6J84p2q2R8n8J6J66n33M55j82R7R0j76l3K37j85J71
4168A52k47M4j29P9Q3J1K8p3J10j91J99n2k5j9J35K03q9k13j16k3K7N1K03k53
$$ y = [-65, -12, 33, 103, -41, -304, 104, 5, 21, -27, 28, 202, 455, 57, -92, 95, 212, 105, 3, 91, -76, -29, 226, -185, 49, -22, -72, 15, 92, -53, 238, 135, 82, -207, -225, 224, 62, -12, -83, 266, -47, 182, 198, 47, 59, 147, 74, 1, 251, -23, -141, -71, 46, 200, 141, -87, -4, 217, 100, -123, -166, 10, -189, -296, -5, -116, 120, -171, -122, -18, 52, -154, 93, -141, -107, -11, 34, -4, -48, -109, -22, 68, -86, 69, -44, 126, -84, -53, 183, -264, 123, -287, 157, -85, -5, 34, -74, 182, 178, -156, -100, -102, -30, -29, 76, -44, -166, 227, 248, 128, -83, 138, 115, 198, -58, -22, 181, -20, -5, 66, -18, 5, -118, -92, -115, -135, 60, -48, 48, 135, 271, -255, 109, -33, -170, -11, 115, 93, 109, 37, 138, -85, 181, 22, -18, 111, 65, 18, -127, -41, 143, 71, -11, 87, 29, 45, 211, -322, 133, -49, 48, 138, -38, -71, 166, -19, 152, -95, -51, -180, -101, -18, -7, 21, -52, 58, -133, 66, 14, -11, -30, 105, 308, 219, 6, -110, -133, -106, -55, 148, -105]
4192a05o3N9J85k86j22K45J05J01k97K52N1n9K50n03L20K46m85J73O5j42J70k22
4214f2R7j05M2Q0k74L18j71J04r2j97J81K02k21q2J19M6R0M1k4J7P1l6j17j90
4238a63K91j44J18j95J76j43P0on8L43l69k25L63j8%J06l05J6J18R0k14J06K2
4261b1j0q9K20P2l22L00k3J7m8m4k15K13J4P2l03L13K54m66J03J50m49K57p0J11
4285C6q8Q6q9l20K86J34l67L29R5j88J71m1j21P2K98l65J69k0N1Rj28j81L94m18
4309a96J56J05j3j22J90j11o4R3j9oJ21kl48L56l05K81k05R5o4K63k46J67o4o4
4333bJ4J97j84L06n24K62m5L3N7l87K74l7J32O8j03j88O2J37j17k03J31n9N7J30
4357A1J25l5k99N0K38l3O0m33M72k03J78l34J38K60j34j23L3L00j68J30j97J03
$$ y = [-105, -168, -109, 76, -210, -332, -87, 18, 119, -178, 74, 125, 66, 316, -187, 133, 379, -106, 67, 132, -10, 160, -62, 35, -70, -28, 52, -222, 96, -75, 29, -63, -260, -79, 123, -98, -180, -61, -15, 75, 116, 92, 109, 180, 144, 27, -163, 128, -16, 102, -93, 83, -60, 10, 4, -54, 289, -80, -305, 58, 40, 40, 146, -159, -143, -25, 65, -149, -43, -21, -31, -120, 100, 172, -150, 150, 127, 144, 96, 52, -163, 50, 64, 136, -167, 146, 400, -66, 37, 187, -262, -5, -75, 36, -52, 34, -55, -375, -89, 45, -322, 7, 102, -86, 85, 44, -77, -5, 293, -72, 97, 77, 128, 137, 9, -172, 222, -196, -40, 65, 52, -70, 120, 9, -55, 38, 19, 13, 134, 132, -216, 140, -165, 116, -89, 6, -58, 205, -41, 126, 62, -2, 12, 209, 25, 331, -193, 69, 24, 57, 114, -273, 1, -36, 96, 164, 61, -127, -65, 72, -45, -248, -117, -176, -119, 11, 136, 101, -198, -148, 90, 57, 117, -316, 156, -47, 131, -203, -65, 195, 61, -62, -29, 271, 103, 233, 36, 139]
4379A39k90J2K1J15m1RO5k62L24Ql58K51k73O24k97k2nk69L55O9q5L8j29k1j48
4404a70J19K51j05j30N9jj1j17K99k43J04l75R3K11j61l2O8j01L57k65L72n12
4426b90J61J24K3J2j87K48j37J99j84j72J21J77J34j07J60l55n0L90l33NJ0k59
4448c10K61Q3l46K1L43K9k16j11M03j3k58L5j14P1M1K35m02J52L50l18J05r7J80
4471A24l8P4j20p2J54O6l02J23p0mK15l00J55K69k48L7k24J94Pj95J83R3j26j87
4495a92L98r2l98L35K5j7m8o7O2P8J79m42K40j73o7K10r6N4k50L09l55R1K44r
4519A9Q3M6j0M0l59L55k19K66j53q8Q3n6Mj42J51R4k03L1j56L60j8m12N66j49
4543A33k33p3Q0O9j47L18j13n2mQ8j12J15k01q7J53K07L0l02Q1J48j67J41j61
$$ y = [139, -151, -139, -118, -3, -44, -35, 30, -232, 92, 100, -258, -7, -280, 344, 47, 25, 20, -249, 106, 175, 90, 128, -1, -22, -170, -51, 200, 95, -35, 24, 23, 12, -105, 194, -49, 55, -320, -227, -16, -177, -209, -141, -242, 115, -150, 222, -290, -129, -5, 18, 30, -157, 91, -46, 153, -31, -203, -82, 95, 229, 122, 282, -73, -123, 267, -66, -61, -51, -310, -49, 34, -312, -291, 52, 81, -135, -246, 157, 144, -114, -79, -193, -122, -81, 154, -248, -96, 254, -64, 41, -56, 124, 86, 160, 40, -32, 122, 188, -114, 9, -61, -65, 150, -150, 5, 274, 26, 63, -161, 33, 40, -155, 28, 121, -5, -192, 206, 114, -284, 51, 76, 59, 11, -56, 6, 84, 263, -179, 61, -112, -179, 31, -65, -11, -261, 48, -307, -216, 28, 19, 102, 148, 138, 178, -181, 174, -45, 221, 68, -20, 63, 7, 11, -131, 20, 114, -89, -58, -214, 146, 128, -284, 282, 133, -100, -173, -93, -24, -171, 147, 34, -18, -22, 66, -46, 69, -132, -219, -66, 141, 171, -131, -50, 98, -69, 72, -89]
4566h9J22mj92J26o8J45K47n65J75N3k7J93j32j94L4J32R2p5k15L38m62N16K59
4589D09m08Q0J75m2l19J98k10J36p9O4O8j15J26k01J53r7J97k83M30j65m8l38
4611b69L82k59J92q9M1j9p3P2N1j3n1j65K47J87j80m5K20q4k29nQ8l18K71P7j01
4636g2J5K20m1k39K33M5l91L83p5j26J03K10j03k41K88k29j07J27p2j83K97J00
4658A42j84k77M31m0j8J32k71J13j1j28K49j56K0O6m9q2J31r5L58l57k13K64q6
4681f1q6J69J12j83K13j92K11l2k6J50m07J38J38J98j61q0M6k06K27k91j18K59
4703A8N0l16L39R4j97j11J10j7j25j24K50J79j17j15K30j09J76k16j80P8K52j90
4725d1L00l04R5m1N5p8o1k38K97L62l59k04K05j20L3Q1r0K23k75J47j67k7L22
$$ y = [-89, 33, 29, -163, -37, -105, 40, 287, -278, -103, -50, -77, 116, -16, -210, -176, -44, 48, -27, -242, 96, -366, 150, 409, 1, 81, 256, 214, -105, 93, -117, 19, -60, 4, 72, -43, 83, -118, 35, -62, 135, -148, 282, 117, 69, -269, 113, -146, 46, -43, -2, -21, -94, -22, 29, 16, -35, -200, 47, 234, 54, 9, 229, 145, -84, -89, -1, -319, -48, 29, -72, -57, 163, 122, -117, 116, 161, -230, 153, 78, -48, 55, 265, 162, -79, 209, -20, -127, 0, -72, -255, 42, 142, -42, -319, 112, 72, 54, 186, -85, 28, 17, -111, 138, -18, 2, 68, 19, -63, 68, -27, 331, -26, -239, 25, -61, -147, 22, 134, -49, 164, -28, 183, 151, 125, 275, -132, 6, 144, 342, 181, 101, 147, -59, 168, -123, -241, 18, 68, -248, 91, 185, -12, -123, -13, -30, -155, -279, -29, 150, 33, -82, 148, 39, 215, -1, -181, -103, 149, -41, 259, -45, 50, 9, 64, -14, -75, -313, -16, 346, -13, -217, -12, -132, -99, -18, -108, 115, -160, -13, -180, -207, 115]
4748A15q1N0j02M7J16J22l87K47Nj69n5N9J91k97K24k60K24m6j11M7J15k98J52
4771i2j20M2P2P6j23%j19L78Jj22J3N5L1j0ON3j01j0j30M37n55L24j25Q7R1k20
4797f1L8J5j66J79J2J17j33j61l0K54q0j53M9K9N7K90k94K70l38J7Q0OJ87l48
4821a64K55n4p7r7L00k01p0L03j53n0oj00J69k5J35l19K94k78K58j68j04O6J1
4844g5Q0J9k4lj19o0J84J03j21M7Q5k02Q8K90k81J5r1K35j20l17K45j82Q6j8m5
4869a81J16J17N5k84J94K28l35J53R6l6q1j15K00R0m7k48J70J56l8j52o0Q5k05
4892a22J02L7l00L27o8p1l6K23j06k33L01k64K47Nj59J50q4j19J59J12J61k14
4914D8l2r1J26J87l50J52jl9j00L1L08l30J84%r4j30J02N3J58l58J69o7k10K52
$$ y = [115, 34, 84, -18, 29, 145, 267, -120, 127, 132, -37, -92, -33, 158, -139, 85, -175, 49, 3, -108, -61, 54, -244, -92, -212, -170, -98, -22, -145, -145, -264, 114, 115, -7, 6, 61, 92, 82, 88, 141, 40, 30, -100, 337, -218, 106, -19, 68, 159, -61, -23, -8, -174, 5, 17, 134, 1, -160, -190, 64, -16, -169, -120, -91, -34, 256, -38, 232, -106, -89, -9, -3, 184, -164, 91, 37, -40, -137, 163, -38, -108, 195, 42, -8, -14, -114, 55, 30, 165, -154, 140, -138, 120, -48, -152, -86, -75, 5, 24, 0, -3, -122, -182, 2, 105, -16, 31, 116, -86, 2, 292, 11, 26, -65, 170, 50, -267, -22, -204, -118, -136, -181, -65, 52, 107, -177, 17, 245, -90, 63, 159, 123, 42, -73, 127, 217, 170, -78, 92, 248, 210, 58, -2, 83, -122, -20, 17, -283, 44, -24, -95, -131, 92, -14, -247, 54, -210, 37, 42, -117, 33, -51, -170, -11, 101, 262, 48, 16, -75, 51, 238, -112, 40, 39, 0, -100, -69, 239, -91, 93, 93, -1, -131, -29, 24, 182, -176, -7, -74, -284, -32]
4938c2j12J1J79j63J81O4j06k42L06j20J07l21L03J29n4O1n4k48l4K63n6k3p7
4961c8j14o3N32l47j7o5J66k72J88n7J26j19J3Q9R9k09L46k62Q3k0q9K4J11k32
4985a27L51j33j58M0O3n4P0M9k09R3j05K48J2j00j42l6J52k22J62q3J0L8R0o7
5009e8J28K77q9l42K25J4k37K37J71j69k2l03K10J48j57O8k03K80j1l58K42j9
5031C2O1Qk90K71l29J01J31k78L03j86L23j18k19K07K8K41k66P9k22J55Kk75K34
5054gJ89l3j69j10Q7J28l2K3q2J49k05J26j55J27J8J3k20L48j51N5p4Kk9J18l8
5079G8oQ4j36J18j68k5p2J00K8Rj57J92r6j43J24j2O9J37k71O1l9K50j68N0K24
5104B31r9j02k18J87j7P5Q8o%J61l19N14n62j46K32l7K57l80K16j69j87J82J59
$$ y = [-32, -144, -133, 46, -117, 64, 128, 22, -220, 86, -34, 73, -248, 55, 184, 130, 191, 137, -111, -145, 118, 62, 39, -38, -152, -215, 317, -30, -47, -112, 54, -218, -30, -87, 39, -80, -67, 22, 121, -88, 258, -4, 79, 59, -30, -6, 105, -127, 224, 91, -67, -27, 36, -18, 52, 101, -108, -15, -120, 128, 140, 40, -102, -138, 14, -208, -46, -129, -119, -81, 9, -58, 70, 347, 258, -84, 141, 155, -82, 155, 326, 157, 135, -168, 42, 190, 33, 101, -102, 178, 167, -191, 51, 32, 93, 101, -189, 82, -247, -146, -15, -293, 10, -176, 147, 29, -190, 17, 45, 286, 20, 99, -123, 32, 34, -241, -7, 182, 149, -20, -130, -43, 85, 53, 76, -6, 143, -62, 64, -91, 36, 54, 67, -153, 195, 44, 99, 25, 27, -2, 116, 78, 72, 156, 20, 138, -30, -55, -127, -27, 1, 10, -147, 45, -51, -194, -70, -82, -13, 124, -147, -86, -125, 125, -43, 7, 231, 132, 30, -188, -1, -18, 57, 145, 139, 139, 300, -19, 495, -67, -213, 19, -18, 239, -141, 75, -94, -281, -99, 60]
5127F0k05J58k28L52lk39j79K03pN9j3%O5J54j5k37K49p0N4q8q9m6q1K91j6j14
5153A5J43l25R1k20K41K0J2L8l3j64K41lJ3o8N2k89L44mk45J83j00J39k57j1L35
5178A48k48J67M9l9j30J28k48K12P1l44J63j42J46p1N2K15Nj69r5K39P3n54N66
5201A94J3j07j15JJ56pp2lk95K37q5J12J23L5r5j82K3Q4k00K32Jk17K03O5l33
5226b32K01r3L04j99R1J29j47r2P4j1K0q7R7k4K5Jj70N4K66j93K6P2j79r8K15
5251E0L0J9j54k24O7K71K5k50JJ25k23L07o7R1K0k23K52j67j42K36P3p0J07l48
5275a94K84q4p4J31J08l73J91j35J81J3J48j07k96K06m1l2K17k69K12j14Q5L7
5297I4j90J44J51l84M77k60J40P5m27J87J86k30J04Q9j75K1N1k55K93r8j59K76
$$ y = [60, -145, 13, -215, 137, 134, -105, -284, -81, -88, -29, -42, -42, 23, 177, 162, -75, 174, 104, 158, 70, -19, -65, -146, 145, 129, 15, 158, -167, -76, -296, -55, -35, -23, 15, -18, -182, 59, 56, 69, 1, 53, -236, 108, 104, -141, 42, -58, 81, -176, -187, 148, -100, 67, 116, 77, -53, 75, -173, 39, 110, -234, -71, -213, -67, -138, -86, 129, 134, -35, -130, 109, 182, -372, 194, 207, 100, -15, -14, 142, 135, 63, 60, -235, 2, -83, 29, 152, 187, 92, -90, -67, 17, -183, 49, 50, -167, 36, 101, -232, -31, -124, 180, -19, 72, 201, 54, -38, 36, 25, 45, -42, 55, 31, 56, 57, -113, -59, 207, 14, 40, 112, -67, -165, 50, 80, 99, -55, -279, -212, 59, 84, -166, -165, -40, -263, 44, -23, 68, 88, -135, 117, -50, -192, 44, 117, 47, 154, -194, 90, 6, -68, 63, 171, -202, -11, -146, 35, 48, 196, 89, -207, -1, -42, -74, 143, -126, 86, -28, 57, 94, -96, 48, 199, -185, 292, 32, 172, 247, -180, 7, 193, -37, 67, 156, -19, 2, 53, -202, 91, -7, -166, 110]
5319A10k28J19p2oJ78L3k79P1j64J99Q5j47K3k4J20K51k63J1J65k09k11N47l90
5342h1R6q7J48n8N7J4m0j39P6j28O0K20l47K1m2M41q4k83J71L58k56l92L27k02
5366a50l3Q0K0p0%K48j14Q2l8j48k73J88j0n3J83o1K01k09J11R1p4o6J97MJ72
5391B78O9l24j51lJ29j9k4k22J42N34o83K83Q0n8M5O1l8K94m96K58k35L02k95
5414g3j13K73J1k02J06n1j5J88l01K12L0N0l58J28P8L00O1j21j90L9Q4M5J7j71
5438B7J5P7p9q7j59L23O2l92N4Q7j22J86J65N6k10j58J86n7Q7M4J31k92njJ81
5463A19P3m14K8J52n5K53j32K64n4m90O4K98Oo2m0j46L03l1j16K62k78Pj26K14
5487I9P1k99K33k15K73n4k75J3R1J71j7J60j77l1MO2j56NK18l27P8q7J76j35j03
$$ y = [110, -118, 1, -71, -77, 101, 134, -145, -74, -238, -39, 46, -101, -78, -102, 18, 269, 6, 17, 182, -27, -238, 309, -81, 15, -72, 76, 18, 75, 89, 49, -90, -14, -142, -82, 138, -209, -188, -230, 211, 127, -156, 15, 373, 117, -275, 52, -150, -183, -103, -83, -153, -153, 95, -19, 63, 25, -123, -396, -208, -218, -271, -88, -149, 52, -157, -46, 45, -29, -95, 102, 106, 278, 347, 23, -128, -131, -2, -21, -45, -267, -125, 409, -274, 9, 89, 31, 76, 137, 99, 393, -103, 155, -80, 222, -73, -186, 87, 98, -104, 2, -49, -64, 124, -177, 35, 65, 115, -243, -115, -37, 263, 324, 203, 13, 52, 136, 181, 198, 27, 42, 119, 40, -47, -206, 117, 179, -213, -159, -72, -194, -8, 157, 213, 3, -155, 31, -26, 61, 105, 236, -56, -61, -62, 119, 192, -222, -194, -42, -97, 156, 24, 288, 234, -256, -192, 106, 112, 50, 10, -136, 167, 136, 20, 282, 4, 11, -115, 99, 170, -129, 104, -111, 162, 108, -167, -154, -63, 108, 91, 251, 74, 43, 47, 109, -47, -42, 176, -151, -73, -160, 16, -119, -222]
5512b22K80j04K03n9k92p2K75J14k2J62m41K90j06k79J50M4J58k97K26L8k7qn8
5535d7Q2K14j31k77J51p4K50k07L5n0m5K48Q5k30j34K87l05L21j97j90J18M2K23
5558A69k43j30K00J0L9J9K3l61K02K67N9l61J95j44k34N63j53J7m06L39r2n6N4
5581b4Q7l41K33Q8lN8k27J49p5L49l34LN6R9j96l8J87j05L1Q0l47L28l22M35k1
5606A50o0R4k79J0J75k96L21k53k72K12L28n6j29k22N52j35n8P1l30J05K67l23
5628a28O2k7L9j3K7K51j33k19K08K9O8r9k86Q2K25O1k96Oo8J00J71J67j26%n6
5653D5p0qJ13J52k68NQ9j5p4N0k45J6J72J84k86O7J0K7m6J41P9m47N19q2km59
5679c33M14l10J39K43j37nm0r7K14j35R1O2j88j02K95J1M2j72o2J25k17K81ql6
$$ y = [-222, 58, -46, 157, 98, -194, -266, 9, 123, 101, 263, -178, 112, 6, -273, -123, -79, 79, -218, 8, 46, 19, 11, -47, 35, 249, 118, -159, -8, -82, 168, -39, -4, -54, -99, 149, 234, 4, -130, 157, -148, 173, -24, -214, -96, -54, 169, -74, -204, -4, 6, 45, 64, 87, -274, -72, 195, 254, -107, 88, -56, -290, 273, 120, 137, -269, 70, -22, -78, -24, 63, -278, -45, 43, 40, 98, -129, 20, -55, 294, -40, -37, 19, 118, -78, -116, 71, -34, -3, 77, -270, 58, -264, 171, 150, 90, 184, -95, -85, 90, -206, 115, -138, -410, -198, 130, 74, -55, -277, 275, 140, 82, 153, -177, -72, 195, -128, -66, -93, -54, -67, -40, 211, 78, -141, 67, 96, 164, 65, -221, -139, 86, 147, -149, -143, -211, -111, 60, 227, 101, 101, 45, -25, -33, 80, 232, -36, -31, 58, 43, -31, 19, -226, -210, -38, 146, -140, -73, -63, -36, -82, 59, 138, -309, 210, 128, 126, -333, 81, -229, -90, 153, 16, 11, -29, -126, 88, -47, 44, 106, -82, -184, 111, 122, 164, -8, -70, 55, -162, 119, 111, 75]
5703G5l28K84q9M4L4j57J90k27LO5J80o7l8M4j50R8J47k16j97L12K1ML9m7OR5
5729A25j67J83L4r6o9R8j15r6K91j37m2j1q4J25k35j32M11j07N3J29k07r3q1K52
5753B9Q3J01j43J18k67K59j51l3K8j21J75j33J76l92O8P7K66j20l94N37k00J21
5775H4p6J02N4j25j48J38Q3o2l13K41K91j27j84O9j07J17P0K2M0l99J06o6K5J55
5799a0olq8K18j58n9N3j18J88o3qM3O1j31j40R0L62k41P0k04R1M2Q7K00k42Nl2
5826Gm6%j65M07j23k3l4n9p1k9L32k25kp6K00k36J30J13k34K42m30L26p9j80L17
5851F2K00J2l83Q9Q6r3k7q0K67j44o7J05J78m10L89j03l7n0q9J61r6O9k59R4N7
5876f9j4j23L02j61K45k67P4J78k76o9K06j12J08J67l70K45jL6J4l04k5K96m2
$$ y = [75, -253, 31, -58, -14, 20, -137, 53, -174, -171, -106, 74, 7, -31, 13, -137, -39, 108, -108, -305, 7, 28, 32, 71, 24, 30, 125, -42, 141, 175, 79, 10, 108, -7, -103, 188, 51, 9, -2, -86, 39, -196, -328, 83, -24, 29, 158, -49, -142, -223, 29, 112, 213, 70, 188, -79, 180, 29, -4, 24, -97, 78, -55, 121, -271, -203, -126, 140, 20, -374, 163, -37, 84, 8, 110, 164, 39, -109, 29, 112, 50, -263, -22, 269, 142, -42, 27, -80, 37, 107, 129, 169, -230, -124, -190, -165, -10, -16, -19, -107, 111, -47, -106, -53, -171, 17, -46, -54, -11, 50, -81, -221, -131, 231, -10, 60, -144, -53, -11, 76, 276, 34, 39, 7, -39, -39, -204, 203, 80, 57, 23, -36, -107, -136, 196, -29, -31, -107, 93, -143, -13, 100, -134, 108, -322, 4, -75, -255, 62, 262, 274, -109, -20, 66, -27, -54, -134, 133, -11, -78, 27, 205, -205, 184, 81, 44, -6, -95, 66, -30, 39, -220, -126, -69, -83, -206, 96, -65, 180, -87, -13, 165, -111, -180, 26, -86, 22, 189, -181, 64, 63, 99, 113, -191, -216, 80, 38]
5899C8N2j58J75j94L3j45J10K52k77J96l62N23nm76K36L60k02j00k34M51k26j4
5921C3P6l40K14M7L84l16P6j24N3MR5k21J9K55m79K39k93K63j09J65j48J60j7
5944C6j79J24j5J35L7j83J03j31k63M03J09j43o4j49J17n3rM52l94M10k06j95
5966e8l08L08K85l76J86k21K91j49L7K5J16l4j11R8k68J70K66j11r3J44j65q9
5988e7j57L78j90m6J3J00k4K33j07q0k57J10N0J98k25L09k24n9J3J46n6O5k42
6011a09P1J25j47O0K38k36l5r6K50J08k63j28J38O1Mk1j74Q5L6N2j53L0L14n7
6035A53m8l17P6p0J78J3m1Q1J48j91J16L5k60K94k37Q6k7k28K29K19j87K6j50
6058a02L27j21j16J12r4R5q1k65J66J33oo5K17j59l2j74L45j33J09j02P5K7k28
$$ y = [38, 90, -68, 107, -87, -54, -199, -89, 163, -114, 82, -280, 243, 238, -238, -2, 358, 156, 56, -178, 273, 47, 33, 109, -231, -17, 30, 414, 98, 174, 50, 103, 107, 202, -19, 0, 255, -224, 15, -278, -15, -124, 41, -107, 53, 36, -143, -19, -34, 101, 138, -45, 58, -73, -336, 67, 176, 33, -31, -180, -63, -116, -125, 327, -67, 343, 137, -58, -366, -58, 227, -149, 37, -184, 107, -42, -5, 20, 136, 102, -9, 89, -179, -9, 257, 146, 53, 197, 32, -57, -214, 164, -26, -72, -59, 41, 17, 250, 143, 63, -194, -84, -34, 164, -61, 248, 24, -35, -22, 124, 68, 133, -109, -38, 87, -60, 0, 238, 2, -33, -129, 121, 229, -34, -162, -24, 37, 41, 20, -154, -69, -33, 19, -134, -104, 210, 153, 105, -212, -136, -206, -28, -15, -56, 25, 173, -18, 98, 133, -127, 167, -70, 16, -11, -239, -10, 209, 22, 48, -102, 225, 104, -12, 100, 6, 101, 20, -245, -79, 54, 48, -17, 200, 41, 9, -165, 180, 47, 156, 54, 129, 156, -72]
6081g2J59j17J37j70J16j26R3l06L51J53k85k73K7K17K54Mk64j74K43k29J54J29
6103B1L6j95K06k43K35j8J27k44j6K37j91j89J53J08j33k7pL75l30M7J39j42j21
6126a72J02m4l5N84n87O5p2J93n5j56K76k17J96k23PL74k69j7K99p3p3k33K72
6149A42j98P4MP4l34L28K24l19O9J0M4j81M3K9p8L32k62m7L13l77K18m6Pj04J58
6174A23p8o1R4o6J17j99O0qr8K10Qk11K04M6k37K5K4J65k74J37Pq3J91r4j4J05
6200I3j96l2K93j91J82m7J45j71jk16J25K12k75K71k03m8j11k7L31j64R9l61K39
6223e3j95L19j83j21J39J78P3j77j76J66m1P1J99k75J64j27K2j06K02n7K5o6R8
6246G9p4m9J27r9O2n0j40L76p6k77J85j34K21k35k71L14L0n9K2J8MJ46l80M18
$$ y = [-72, 87, -30, 107, -63, 53, -73, 20, -286, 65, 218, -67, -340, -313, -96, 158, 162, -102, -276, -33, -262, -108, 21, 57, -138, 68, -175, 60, 42, 169, -75, -91, 146, -45, -234, -81, 27, -106, -133, -140, 235, -95, -48, 91, -51, -172, -70, -114, -149, 435, -152, -87, -159, 34, -21, -177, 99, -118, 78, -145, -138, 236, -33, -50, 249, 176, 103, -130, 142, -56, 18, 22, 96, -238, 90, 314, -5, 64, 74, 118, -63, -20, 9, -69, 263, 1, -46, 267, -110, 108, 62, 69, -35, 123, 45, -16, 78, 12, 129, -70, -10, -18, -116, 94, 102, -109, 95, 141, -96, -71, -47, 118, -156, -19, -12, -95, 96, 2, -12, 93, -103, -135, 158, -33, 149, 102, 247, 76, 75, -141, -16, 196, -79, 192, -11, -59, -170, -197, 134, -30, 69, -292, -53, -248, 71, -112, -233, -94, 84, 157, -20, -196, -30, -71, 0, 199, -76, 88, -39, -17, -123, 79, 22, 47, -19, 79, 5, -44, 83, -16, 46, -4, -144, 232, 156, -121, 64, -70, 151, -84, -355, -41, -11, -70, -48, -30, -26, 120, -260, 158]
6270A58j88J82k29rq1j8J11p5K45k47J12N3J86j3n7j95R0K35l67K8K45j92J68
6293A42r6j24R1J63L9l89L40r7j24R7r4r9M25k19R7%l00J78J7JP2k5J08j64l78
6318c39M51l1J47m23J42O9J73o7K24j69k66M3K5J86m07M68k06K36m16P5K01j44
6340b8M5k09K93k44L39r4j9M5oq1%N8k2K1Rq8p4J9J04J1j35K7J44p6J52l21p5
6367b05J77L04q4k2k37L92k47k71L80k78K55l20M19j18k12l0o6K23J26k30K95
6388B51l47J19k92J69L1Q7k01K37J06j03O7j26k6R2m9r7K36k72J95l67P4J13J65
6411F2J1N7p4P8k83K11Q3k75J86j78j18L49j39j06m5J21J06o5J23j34K36k34K4
6434dj7k39O15l04k03J03R6j09l8L19l26k37K68L16j78j75J67J17j79r9M82k18
$$ y = [158, -30, 152, -77, -86, -167, -185, -74, -149, 96, -151, -39, 14, 200, 187, 130, -65, 25, 260, -107, -79, 166, -26, 142, 46, -78, 13, 176, 215, -174, 166, 69, -55, 42, -52, -151, 274, 55, 152, 152, -148, 30, 47, 48, 120, 95, 203, 39, -339, 112, 81, 228, -195, -53, 16, 189, 122, 346, 177, -89, -46, -21, 165, -242, 226, 20, 256, -160, -85, 116, -28, 17, -192, 101, -143, 196, 102, 83, 128, 122, 41, 41, 99, 77, 98, 107, 19, -55, -36, 68, 79, -56, -29, 115, 39, 191, -130, -205, -28, 276, 192, 170, -67, 325, 78, -193, 187, -91, 164, -156, 263, 145, -67, -97, -163, 60, 186, -44, 251, -96, 23, -269, -100, -69, 18, -183, 54, 160, 57, 124, -2, -28, 64, 15, -82, 154, -118, 77, -290, -216, -103, 62, 73, 130, 56, 134, -149, 62, 145, -130, 56, -122, -240, 109, -30, -136, -181, -60, 46, -19, 104, -30, 206, -28, -4, -21, -260, 355, 51, -152, -49, 47, -62, -100, 219, -107, -344, -76, 240, 62, -113, 54, 171, -8, -107, 375, 157]
6456A57n0O4j96J39k73L66j23j84p5K82k00J77J27l52K57m5R4M7J0l08mp3J15
6479d8K51m14J88K16j8l91J92M1q8k86R2K76n4K80j07m14K75k82M37J45n29J01
6501a37J5K99j84M8n0j20L12l9l99K85j12K44k76J87N9k54m5K18j87J4J33J33
6523A44m9L6p3J7N7j29j32J87Mn9j83M92l78m1L40m03K68j04n6J62j7O0q6jJ70
6548B26k30J19j29M2O6l48J43QM6j68M4L42k1l95r7J65P4j24N04l39m2K41o1M3
6572A09K88k82O1k51K78l86J46O1j7J6p1k9P0P4p7N5k39J1J35J63l84J94j63J91
6596d7K1J03j14m8L29k95l7R4J5K70j80k36J3K32j31Pl6J82l98L09O7k52N6m8
6620a24J4N3j52K06j39n2J36Pl5OL7L94k09j45m3J18j01J73M7k25J66j58j67J97
$$ y = [157, 107, 171, -25, 114, -159, 207, 84, -100, -175, 107, -93, 84, 211, -141, 116, 71, 165, 212, 222, -86, -90, -163, -48, 203, -211, -23, 193, 175, -216, -24, 17, -71, -357, -265, 11, -43, 237, 130, -284, -9, -291, 146, 291, -238, -137, -122, 177, -7, 41, -9, -129, 183, 144, -255, 30, -82, 162, -114, 73, 132, -122, -167, 51, -136, -122, 11, 144, 95, 131, 58, 75, 132, 3, -129, 58, 62, 3, -180, 312, -66, -107, 233, -170, 98, -6, -62, 100, 83, 143, 57, 56, 226, -4, 115, -14, 28, 94, -254, -111, -103, -57, -225, -181, 161, 140, -255, -352, -187, -113, -237, 267, -72, -114, 127, 66, 109, 397, 115, 176, -75, 203, -183, -37, 24, 7, 23, -48, -77, -7, 67, -10, 45, -194, -183, -48, 115, -269, -75, -238, -47, -26, 77, -37, -85, 244, -51, -88, 6, 21, 291, 111, -125, -112, 120, -11, -4, -40, 142, -256, 53, 120, -132, -76, -124, -110, -57, -209, -3, -142, -194, -58, -51, -86, -80, -43, 351, 142, -3, -46, 72, -29, 144, 191, -34, 132, -26, -193, 4]
6644DK11l80K60m32K25J20J29j70n4J41j11o3J63p7J25p1p0m1q4k6J61J93k7j9
6668A07k13J81l7k9M9J95l63J38k74L29j01M8R9k20O5r5J14J50k05K12j15M3r3
6691a5J25r9n4K28k28N3J10k99L83j64l6m7K8R0j00j8J3K20j45k53R6J96K1Ol1
6716H0k32J49K6n2N8j57N9J36j43J26j09J13k50L92j51Q0j68K19J06j84l3o1p
6739cm4J18j39J2K13k55j38K53j0j98L19m35J74K76j55k10K42J59k29M7J5J84
6761A96k37l3J59N9k59m7J74l8j49N6K43j19l1K3O2k06K72j65O4r8n4M46m39K59
6785A38oj3jO6l2M4l1p6O9j4k25Q1oJ13k65J76J66j51J56k12o8J49j91r2K18J41
6811A34o4j07k42J49J97m1m68M86P5j7o4p9L85m00J95N5j87L2k61R8J39p1L14
$$ y = [4, 215, -165, 95, -337, -112, 8, 137, -33, -87, 54, -57, -120, 43, -34, 91, 20, -50, -91, -175, -201, -40, 153, 126, 107, -106, 75, 38, 9, 58, 253, -110, 28, -246, 83, -18, 30, 129, -91, -26, -121, -7, 143, -62, 150, 35, 78, -15, 110, 11, -43, 185, -43, 10, 120, -179, 204, 40, 4, -43, -15, 75, -25, -43, -30, 190, 45, -208, -112, 84, 105, 111, 80, -152, -3, 23, -29, 29, -128, -69, 67, -76, 50, -59, 54, -196, 196, 45, 125, -43, 176, 282, 98, 65, 4, -3, -47, 71, -68, -56, 157, -98, -236, 17, 7, -191, 128, -307, -133, 143, -12, -222, 20, 179, -50, -3, 12, 196, -41, -74, 85, 144, -115, -162, 12, -26, -175, -119, 124, 5, -26, -3, 59, -147, 125, -40, 24, -74, -128, 318, -121, 138, 132, 119, 118, 184, 152, 196, 165, 89, 158, 144, -81, 0, -6, 107, -158, 18, 184, 33, 189, -23, -91, 58, -133, -225, -7, 134, 70, -37, -279, -130, 67, 26, -442, 44, 119, 102, 38, -41, 344, -56, 139, 194, 7, 39, -222, -124, 15, -56, 258]
6834B58j76k55J28K3J87m2k86K35j62J96l36J60J50j65j70K08L4J32N0k86j95
6855c12L92Q5k69K86k45J47j2l4J09l57J06K24l18m9R4M27k23r8J8N3j79K06J8
6878F9q4L02j59l00J55l7L69j10k18k0K5r5M36j14j97K42l71J59p6K0l8q0M8J69
6902I5k06K77j47j74J09J40p5m5oj5L67l21J52j44OM0o2J9N4rk19L3K3J91k41
6927a58L04k08l3K96o1j67m1K8j08m6J31J71l30K82j15J04j57K09k5K7q0J9J53
6950A95k98J65r7m4J87j30k01M74j18j71J92l21R7J31K17k13j09L4J59j47K81
6971B83l56K88j39k06Q2P4r5J29n4M9%J11j98n4j29J40R2m43M82j51K61k36L06
6994B36l31J27J42q0k07K95P8k14J1j36J63k06K6k7J40m4J2L7Oq0J45j26J27l8
$$ y = [258, 82, -173, -45, -22, 165, 123, -163, 72, -90, 106, -230, -70, 80, -85, -255, -47, -13, 119, 169, -117, -312, 80, 165, -104, 182, -63, 84, 72, 38, 147, -210, -104, 120, -198, -247, -153, 274, 51, -47, -29, 24, -155, 51, 69, -15, 287, 128, -172, -17, -54, 315, 205, -13, -33, -8, -103, 333, 219, 22, 264, -107, 52, -24, -4, -42, -122, -74, 95, -111, 166, 19, -155, -46, 94, 19, -26, -32, -47, 320, -1, 151, 7, 13, 53, -9, 10, 64, 55, -164, -131, -108, 83, -158, 146, -62, -95, 201, 140, -27, -68, -40, -148, -194, -63, 108, -222, 60, -55, 49, -108, 101, 76, 103, 23, 42, 195, -103, 62, -35, -79, 108, -22, -223, 251, 133, -38, 154, -167, -70, 61, 278, 65, -44, -10, 149, 2, 283, -73, 215, 76, -130, -48, 26, -69, 60, 6, 55, 55, 166, -32, -86, -215, -75, 17, -426, 56, -95, 166, -70, 236, -95, 32, 174, 94, -113, 182, 260, 46, 57, -79, 84, -122, -96, -123, 17, -27, -15, 22, 28, -52, 93, -33, 94, 56]
7018E6Q9l56L36j03L1K3J25k35L0L9j12M2j33O4J89P3m5j29r0J06M4j02kn8M0
7043g8J26r5k31k7J25M51j99p2j67R5m5L18J47k32q0J97n1J97m67K20k33J21J03
7066A23j27j02J07l15K59O1QJ02J4%j82k01K10Ll8L61n6j60l04L38k90K64j43
7089f8J46p2N9J74l23l6O0P3L6j46J15j71K97P6k67J8k17K3O1P3P7K78l43K09
7113A32k99J07o9L0l2l2J59q5O1J27L0l19pL33j20m4j20J84k12J00J66j88K53
7136A55j32j1M6R5l84L24j18j54J6J16l8M7J15l2J09k66L2j8m1Q4J96j76J4R9
7160G8j81q2J7J57Np3k3J32J6J28k7j75M4o5l3P0j19K27j37K52j8k25Q2L3K59
7185C42m8l45J87M4j74O2p9J49J18k30j80R2k15K45J86j64j86M4J35J40j17J72
$$ y = [56, 145, -211, 125, 22, 53, 76, 201, -34, -4, 35, -77, -35, -168, -104, 85, 158, 113, -16, -106, 0, 44, -58, -60, -118, -78, 48, -47, -278, -305, -180, 271, 72, 0, -167, -72, -117, 201, 348, 116, 36, 233, 182, 379, -88, 132, -101, 20, 123, -4, -106, 1, -314, -55, 6, 14, 116, 130, 130, -52, -253, -43, -40, -78, 283, 227, 67, -237, 101, -189, 75, -68, 78, 6, 65, 239, -84, -120, -60, 13, 49, -97, 18, -153, 144, 220, -47, -29, -246, -223, -162, -89, -12, 266, -77, 132, -167, -60, -129, -99, -131, -163, -4, -89, -28, 99, 129, -190, -197, 136, 16, -28, -148, 36, -176, -76, 90, -98, 155, 23, 12, 58, 153, -231, 93, -25, -179, -163, -47, -85, -38, 77, 45, 154, -112, -80, -98, -139, -55, 141, -35, -21, 78, -103, -185, -168, -11, -6, -79, -102, 30, 46, 174, 147, -28, 16, -49, -82, -12, -131, 96, -41, 211, 193, -32, 50, 83, 342, 294, -51, 136, 180, 6, 68, -11, 138, 256, 26, -154, -62, -277, -32, 154, -10, -196, -152, -17, 123, 6, 178]
7207A78J31l39J95l6j34j1K21k49J66O3j5J40l14R7n5J8N0j64N4K47l39J62j52
7230h6J2L9J18q7j93L07k35O3K00j84K02j08j94n8K30j37J20k80K43j68J45K8
7252b3M9j14K31J90m27J7QN5N4j08J49j4J17l62P4M1j15N05n03L09k0m9j07P1
7276B8o9K5J60r0k18L49J3m25K93Qj98J05mo4K43j96%K72k24M5ON2j54k9J57Q
7302I3j02q0k7K38k2j29O0j08q8K66r3J14j28j97q9L94P4k30L82k39j20J9n2M3
7326b1Q9r6K77k17J0k9P1k76L71j99k29K23j94M46j99O6o8J51m9k66R1O2m7J52
7350A19j4R2j76O2l6k14J48oM4k52PL39k14K3N4J10J50k44J34k41l5P2PoK27j99
7376d9N2PO6j45J79k7l73L53P7m37M45j98j60R1m7R7K40j83k08L80j86m1J92k3
$$ y = [178, 309, -30, 165, 129, -5, -16, 205, -44, 122, 185, 170, 310, -4, 93, 38, 56, 106, -58, -4, 243, -96, 66, -86, -74, -35, 83, -4, -197, 110, -125, -62, 138, -46, 156, 48, -146, -204, 26, -111, 9, -271, -28, -196, -51, -23, 26, -88, 143, 333, -94, -77, -69, -14, 40, -68, 81, 67, 184, -178, -104, -63, -178, 327, -176, 133, 113, 64, -43, 28, -41, -16, 144, 54, -164, 185, 198, -227, 66, 74, -124, -19, -23, -87, 156, -40, -40, 232, 8, 53, 59, 111, -43, -72, 85, 93, -9, -89, -116, 122, 100, -29, 31, -77, -165, 101, 8, 122, -6, -203, -292, 102, 176, -54, 328, 89, -31, -12, -64, -21, 68, -28, 249, 32, 42, 13, 84, -192, 179, -20, -249, -26, -220, 226, 27, 93, 25, 176, 127, -139, -48, 14, -33, 119, 105, 197, 21, 83, 47, -167, -19, -25, 19, -233, -226, 113, -101, -78, -24, 86, 236, -8, 126, -115, -150, -78, -71, -77, 150, -49, 3, 10, 76, -69, 110, 83, -290, 63, 140, -297, 148, -50, -210, -119, -166, -69, 171, -12, -220, 160, -26, -67, 125, 102]
7400A02r1Q5k29J51k11L23j95j02K30k40J35K0j05J79j25R7P4j19J23j75J7j58
7422b14L13k1r3m7j20K27j16o7O3K9K11k73K7K51j51j0R0N7j6K14m44R3k9J19
7446I3j81j85K38K09k50R7j36K34j64K38k29j88J25K84k06j74K89p7K47j26P3
7467B11k73K8k09K80Rq4L4o9N4j49K40l7j92J52j12J32P5j76K38j25P6l9R0k47
7491i3L16l6l32m4J6L35j41j43j53K25R8j89J1K94j80k31P4R5K25j10R0l11J03
7514h1N7J51m8R7k90J5l1J54J80j72M2j28L24n9N0l79J24J81m32K9K94l17K69
7537C0l4M6P3k67J42K12l08J64p7L23k69Km2lJ11j28P6Q0j83MM9K37k80j6R1J91
7563B24j82J70l23m8K76j73J99j78K2K7P2k33M32j85j39K28l39K20j3J15Jl70
$$ y = [102, 11, 96, -133, 18, -193, 130, -65, -167, 63, -177, -42, -22, -127, 52, -73, 24, 98, -21, 102, -73, -56, -214, 99, 78, -15, -62, -182, 45, -71, -138, -75, -46, 165, -108, -81, 170, 19, 9, 99, 156, 140, 354, -90, 3, -26, 93, -88, -273, -35, 174, -76, 21, -115, 119, -45, 193, -36, -224, -99, 185, -21, -195, 94, 17, 264, 138, 211, -62, -34, -243, 37, 46, -38, -4, -73, -19, -168, 72, 35, -157, -5, -117, 15, 90, -86, 152, 27, 103, 64, 154, -93, 223, 187, -145, -189, -173, 162, 21, -122, -275, -50, 48, -141, -130, 164, -16, -247, -173, -78, 147, 37, 127, -184, -81, -24, 127, 79, 176, -114, -99, -130, 24, 204, 32, 74, -54, 270, 211, 261, -118, 6, 187, -245, -216, 78, -239, 30, -4, 42, 115, -152, -10, 202, -106, 58, -19, 304, 35, 37, -5, -8, 103, -25, 51, 131, -52, -48, 1, 238, -42, -58, 33, 224, 42, 212, -111, -159, 117, -56, 143, -35, -13, 14, 86, -147, 285, 100, -39, 189, -150, 70, 57, 172, 173, -197]
7585a97J34k12L99oj35N1m2j50L04p1j5n5j30K83mj92N8K39k82L2J48J07k95N7
7609B6J04m7Lk10J17L1p9mj11K63J14m01M3J92r6M2K36m31M6K83k01J7O3J31k59
7634a28K68k9p1O1n4J78k59K5k33K98oK8l33L52j07M0L6P6LL03n49k43J74O0J97
7659H7M6j42K1k6k0r2L12p4J02j5n7p4j61K27k30K83J46m78K97j65o7K15l14K30
7683E1R0j46K21j26j36j01N16l41J6j1M5K3j0m3q5j96J54n6N4o7o4K68k51JJ60
7708c4P0n3J98k17PQ6j40l2K27k43K25J8J62k85L8l77K70J9n0K72O2m55O0K87
7732A15j95M5R4j3Qj57J08j09m4K19m3J55l07Rm6M35k90M6Q2K22n41K25O4K0j10
7757hq1k2N3M76l40k38L08M1Q4k22l93L29m7K13j65K12k48J06O0k29J77j05J59
$$ y = [-197, -63, -275, 124, 118, -17, 34, -8, -158, 146, 75, 60, 5, -125, 158, 154, -38, 20, 259, -23, 9, 157, 264, -31, 26, 130, 83, 86, -124, -7, 24, -55, -59, -170, 93, 207, -194, -151, 41, -55, -13, 223, -208, -162, 121, -80, -63, 0, 131, -128, 140, 111, 40, 101, 47, 225, -34, -9, -242, 56, 50, 78, -255, 97, -10, 30, 66, 142, 145, 448, -101, -344, -170, -110, 87, 133, -9, 12, -14, -34, -126, 186, 112, 214, 199, 142, 68, -93, 134, -96, 187, 333, -145, 152, -13, -80, 135, -179, 51, 141, -5, 216, 90, -46, -147, 369, 28, 44, 33, 78, 101, 91, 48, -37, -233, -79, -135, -81, -148, -212, 56, -195, -194, -34, 36, -17, 181, -36, -29, 57, -83, -115, 112, -131, 94, 112, 274, -11, 27, -350, -80, -61, -111, 161, 223, -232, -172, 115, -80, -35, 59, 46, 54, -103, 5, -104, -148, 71, 28, 183, -124, -115, -161, 274, -16, 30, 112, 334, -207, 18, 82, 102, -8, -89, -111, -58, 418, 78, -160, 148, 189, 273, 51, -342, -13, -60, 153, -12, 200, -48, 58, 118, -111, 66, -39, 120]
7780A20k50J01J29Q2k34J87j38j50O7l2J14J86k79J15J9O7J66l46J37p3j04J22
7802FP1j87j1J14k65J67L30j14j75M1P8J11K0k72o4K77j22Q7j94N0J00M7O5r9
7826F1k91J36p5J52m3p6K49k50J27K1J02j57K27k94L3J28j5l4L3q5J4J06j48q4
7850a63l7J39K13M0k32J5P3k3Q8j86K29l01K82j86k61L87j35lm5J20k2j80M21
7873B33k83J56j89L0m4l21L42p4K66l46J89J67L3j02m1k66L32q0j52O5K46j34
7895B7n4O5p0J23l17Q8O4L31j01j17k83J29J76J93n13J10J15J29N7j40p1o6J63
7918C8M9j23L4O6j02J43R2j79K34l33J28K77l37J64j98K06J3k89J09j7J07Q3j79
7941a4n7l4r6L51Nk51K40M4p3j05k50J57K49k38L80j82k8k65J28M6L14l97J02
$$ y = [120, -130, -29, 100, 182, -52, 135, -3, -153, -86, -118, -4, 182, -97, 18, 37, 104, 270, -76, 61, -12, -116, 6, 77, -110, -121, -7, -272, -105, 225, 111, -64, -23, 55, 166, 186, -86, -150, 127, 5, 92, -102, -52, 48, 95, 160, 61, -230, -94, -169, -17, -60, -136, 113, -137, -10, 11, 113, -44, 183, -111, -78, 50, 35, 1, 34, -51, -37, 69, -79, -163, -200, -61, 152, 192, -40, -25, 48, 25, 113, -73, 156, -145, 137, -49, -310, 77, -58, -61, -106, 14, -8, -188, 233, -50, 106, -83, -53, -97, -418, -76, -150, 116, -230, -41, 126, 159, 57, 16, -250, 82, 2, -150, -85, 161, 27, -27, 38, -32, 91, -226, -138, -74, 257, 156, 39, -244, -115, 61, 254, -259, -149, -34, 95, 152, 12, -59, -125, 38, 87, -36, -2, 64, -38, 105, 197, 18, 252, -81, 47, 324, -13, 151, -47, 159, 172, -117, -8, -25, 82, 165, -14, -71, -105, -201, 150, 155, -96, 144, 188, 115, 10, -240, -83, 166, -72, 308, 126, 98, -167, -39, 7, 321, -76, 26]
7964B6l07M26j04k88j08L14j9M4J16j08P3m33K73j93M41k15P9J0N5O9k56k9J80
7987D6J6P2o7k80L53j96N3n4J15r6LL6J44p0j12J9q0j9q9K51j14J8k25K35j1R
8013d3R5q7J02R0j56Q0J88k40j69q7M79n7m6M1J13l01k64L32p5q3N4n2r3M0J45
8038Fj83K57j87j3J88j33r6J57l3n9J37n3M3Kp9j21K33k24R3M8R0M6pK1j76jJ45
8065A01j50K1k07N50j67j59O7K7j83K29j36q1o7J30l6J1j37J71J45k5k0j49J59
8088I4q7j71K79J11j81r3J52j14n2Q7o6M2j91L64K1l10K54K1j92j08K91k4k43
8111a16J10j95J77J22k4n9J80l70O3K01j79j90O5K41j26K48k60j03O5j3K60k32
8133a35J77k89K70k22J62K66l18K09rm8j60J01J6J80l08K39o0j08J63j46KM8L42
$$ y = [26, -281, 145, 41, -247, -355, -41, -60, -16, 100, -8, 65, -368, -95, -288, 153, -62, 17, 27, 82, 151, -105, -134, 46, 62, 134, 67, -213, 140, -56, -3, -57, 58, -38, -35, 1, 145, 75, -37, -18, -98, -117, -206, 45, -69, -51, -276, -41, -52, -43, 52, -35, 67, 157, 1, 81, 269, 29, -140, -227, 252, 195, 149, 190, 303, 2, -262, 70, -5, -88, -34, -86, -179, -139, 6, -177, 80, -107, -120, 68, -65, -161, -4, -37, -96, 41, -12, 31, 33, -46, -167, 66, -158, -65, -17, 73, 119, 112, 133, -43, -44, 101, -49, -28, -235, 315, 148, -11, 56, 83, -100, 129, -7, -88, -155, -25, -61, -50, -187, -16, 129, 104, 84, -65, 94, 7, -164, 115, 226, 45, -48, 104, -10, -62, 25, -41, 1, -190, 174, 195, -115, 139, 160, -32, -140, 151, 127, -116, -6, -201, -24, 98, 74, 15, 195, -175, -112, 89, -90, -280, -215, 26, -100, 148, -112, -215, -150, -163, 97, -135, 42, -247, 23, -199, -37, 229, -89, 120, 111, 63, -97, 4, 20, 200, -108, 131, 71, -37, 126, -20, -18, 30, 372]
8156C72m42KJ43M3j51o4L34k49O4j59m2K5j06J06N0R9n5Q3j46P1n7N1J01l14N21
8181B80k87J41r8q8J48j23Q2K9j14J24
$$ y = [372, -70, -68, 75, 118, -33, -97, 237, -12, 52, -107, -149, -124, -230, -124, -74, 25, -30, 53, -93, -22, -79, -28, 73, -241, 280, -7, 134, 36, -52, 96, -27, 55, 84, -30, 94]
8191I4
$$ Imaginary data points
##PAGE= N=2
##DATA TABLE= (X++(I..I)), XYDATA
0@%%%%%%%%Qj6J6j6K4l2M0m8N6p2Q8j06J30j60J91k23K61l06L57m13M77n49O29
31C36p17Q15r24J045j179J326j488J665j860K074k307K559k837L141l471L834
47B012m231M664n138N659o233O869p575Q363r250J0252j1395J2715j4262J6101
61H551j8327K1092k4628K9339l5966M6036o3365J01312l32010J63436L19437n18587
73c03680K61710K39120l31450m3268K79761j54210P5299J95391k48229j05799
83a35355L09662n8515p8857K47715m5644k78057P4323J4797j69066P6518J38007
94I5528j08831r5657j5284K5800O9855l1087n9175J00618j6664j67173M7959J64038
106I927L0274L2987P359n2861N3768K288j16812J09793J39943j76151p1279J51917
$$ y = [0, 0, 0, 0, 0, 0, 0, 0, 0, 8, -8, 8, -8, 16, -16, 24, -24, 32, -40, 48, -58, 72, -88, 103, -120, 141, -165, 192, -221, 256, -293, 336, -381, 434, -490, 555, -624, 702, -786, 879, -981, 1093, -1214, 1345, -1492, 1649, -1822, 2012, -2219, 2445, -2693, 2966, -3267, 3602, -3973, 4390, -4860, 5392, -6003, 6712, -7550, 8551, -9776, 11316, -13312, 16027, -19939, 26097, -37268, 64044, -267966, -104530, 214907, -303680, -41970, 197150, -134300, -177568, 102193, -52017, 23282, 218673, -29556, -135355, 174307, 115792, 36935, 284650, 239006, -39051, 35272, 50069, -118997, -42479, 95528, -13303, -108960, -124244, -98444, -28589, -59676, -118851, -18233, -34897, -202070, -154111, 9927, 40201, 73188, 80547, 27686, 81454, 83742, -33070, 76723, 216666, 40515, -30764, 121153]
118A21153q2715r2652J71299j7191j91730M1822J2294j50226N6999J20201o1712
129g2458J9463N9785j04188J0552J42914n7834o6446J26939j580j28223O9187
140a889J23344k5600l765L8581n6104o0799P521j6393k2029K6743q818n7278n833
153f2319L1423p222j715K8492k7747o0545J4564L1837j5488L9494Q0660j2620
165C8814l5056M0690J4393k1949K7125M233m3509P336N627m3148K6260N3905m8543
178B6178m6054K1787l0609n0456K4962J5837k2713J3833J2499j6944K0923L2929
190B172p535O93J5872r038o363K1534J8981J1952J1644J136r858j5099j0402k956
204B2733j5867j8049J695p949k2002J0163J7405j5678l779P603k2591q480K0276
$$ y = [121153, 38438, -54214, 117085, 99894, -91836, -50014, -37720, -187946, -130947, -10746, -72458, -52995, 6790, -97398, -86846, 56068, -1766, -68212, 58727, 57147, -71076, -1889, 121455, 95855, 92090, 130671, 74567, 13768, 21289, 4896, -17133, 9610, 792, -56486, -62319, -30896, -38118, -39833, -11341, -39088, -99633, -85069, -53232, -68720, -29226, 51434, 38814, 3758, 44448, 58841, 36892, 64017, 68250, 24741, 32077, 37704, -5444, 20816, 74721, 26178, -19876, 1911, -28698, -79154, -54192, -38355, -61068, -47235, -34736, -51680, -30757, 2172, -5363, -4670, 11202, 2164, -4199, 17335, 36316, 48268, 59912, 61048, 51190, 36091, 25689, 22733, 6866, -11183, -9488, -17437, -39439, -29276, -11871, -27549, -31328, -23725, -46316, -54796, -34520]
217c4520l892N675M0846N381j2177L4242J5620k6697J0417J6750l0090r327J7805
230C0033j4068l476K2499j6773k1941J2811j7148l7299R138O571k6608M665K5063
243b6533m594L875K4751O43n214J2893p96q452J4423J2881j487J0719J4002m448
257D2663m855Q77j3447j7441o555q902j3687j313O524k739m885L650L50r624n708
272c5092J290J971L413Q386J1567J5738J4764M130J661P274r76j2002m004M505
286B2625j917o073J525M836l102j0070q926p011j1451j4398n925K624K803L217
300c1243P269Q436O421L213J377K266K115j13M309Q404P754P907Q381J032n485
315C2043m122n344j1307j0557n289k775m099k997J573M347k955j0426m181J842
$$ y = [-34520, -38412, -32737, 8109, 13490, 1313, 35555, 51175, 24478, 34895, 51645, 21555, 12228, 30033, 15965, 12489, 34988, 18215, -3726, 9085, -8063, -45362, -36224, -29653, -56261, -51596, -26533, -31127, -27252, -2501, -1858, -7072, 5821, 5025, -3427, 10996, 23877, 22390, 33109, 47111, 42663, 37808, 38685, 25238, 7797, 1242, -7660, -21347, -22660, -16136, -18875, -23760, -20110, -19760, -29384, -35092, -33802, -31831, -28418, -20032, -8465, 7273, 22037, 26167, 27828, 35102, 34126, 22124, 18120, 22625, 20708, 14635, 16160, 20996, 17894, 7824, -1102, -8113, -19564, -33962, -39887, -37263, -34460, -31243, -23974, -15538, -9117, -5904, -4527, -2261, -146, -259, 4050, 12454, 20208, 28115, 36496, 37528, 32043, 27921, 22577, 11270, 713, -4576, -7351, -11450, -14447, -12874, -8527, -11482, -21908, -26089, -24247]
329b4247n248m512J0155J3434L019L982J4148J0328m75k310J011n34n241l449
343A0061M514P471l07n925n93r17j1325j2141l344n095j0961j451O999M071L590
358a5353O341K835j532j596j068L005M718Q74M610J2375N696j245P997M793j2139
373B0311j0805P09n585j0351P72M895k426l010j29p12j533m636q206n70L381l459
389b1354J502J6033Q358l730N239R938m208o484N081L267m497j292J715K325L284
404A5177l543n984Q54l247j6153n154R076j749p059O788O216n597O3N627m79l30
420e494K771j364J59O778P072N066L196j180l028k555m838n430M67L050l331q752
436g413M08J0394k240j1347M942N461j6604j0054J1971M681J044R884n45o7J3462
$$ y = [-24247, -29495, -34007, -23852, -10418, -7399, -3417, 10731, 21059, 20584, 18274, 19285, 18751, 13510, 10061, 14575, 22046, 21739, 15814, 15221, 14304, 2979, -9162, -12506, -17601, -28562, -30013, -23014, -18943, -15353, -9012, -6177, -7709, -9305, -10373, -7368, -2650, -1776, 2834, 15209, 20905, 19660, 27657, 32450, 20311, 9506, 10215, 4630, -5721, -4949, -54, -2480, -5490, -5619, -6331, -7864, -12500, -20706, -21276, -17895, -21354, -19852, -3819, 4539, 809, 6048, 15986, 11778, 5294, 10375, 13642, 9145, 7853, 9568, 11893, 15177, 11634, 5650, 6504, 3257, -12896, -18050, -8974, -10723, -17782, -10994, -4778, -10375, -10312, -4685, -5164, -5494, -2723, -4087, -3928, 2850, 9922, 14988, 18184, 17004, 13976, 11421, 6583, 1153, 1620, 4670, 1339, -7413, -7005, 3389, 1149, -10198, -5256, 205, -16399, -26453, -14482, -9801, -8757, 1127, 582, 515, 13977]
451A3977m946j1992J9287O324k8994K623J9953j6498j209K6351j1678j7625J6775
464A2348j0898k5755K0383O602k6728J0275J3463k3649J0540K7090k0463l688
476a0480K8179j9391k3050L1002R742j9293J5495J1262j8593K957P593j1430M970
489H963N595j9722m725R801p295j041J1267k719p858m692o443N715M144n009J2185
504a834Q344j7507N939K2693j2040k162K2577j6465j9276K1606l609j4064K9701
517B3903J122l2553J5202P341l7082J2289K6355l6179p603L2223k3965j4623M4471
530A0901j557k8835K3087K937l1434J7497K1491j7867J1593J8997k4727k281K7014
543B6816j0045j4015J6315n897k4049K610R479l302K244M204o797r435m298J966
$$ y = [13977, 9031, -2961, 16326, 22650, -6344, -3721, 16232, -266, -1475, 24876, 13198, -4427, 12348, 1450, -24305, -3922, 2680, -24048, -13773, -310, -23959, -13419, 13671, -6792, -10480, 17699, -1692, -24742, 6260, 16002, -3291, 12204, 23466, 4873, 7830, 15423, 3993, 8963, 14558, -5164, -9889, -88, -7383, -8424, 2843, 124, -7734, -12426, -18869, -13154, -9010, -14019, -1834, 6510, -10997, -5058, 17635, 5595, 3433, 26010, 9545, -9731, 11875, 8266, -5798, 23903, 25025, -7528, 7674, 15015, -22067, -9778, 16577, -19602, -27205, 5018, -18947, -33570, 10901, 9344, -19491, 3596, 6533, -24901, -7404, 14087, -3780, 7813, 26810, 2083, -198, 26816, 16771, 2756, 19071, 13174, -10875, -8265, 1214, -2088, 156, 4360, -2437, -11872, -16170, -14204]
557a4204J325J217N643m90q481O111J2926j922O143J1888j4353r771J3306m178
571E160o890K4829K502k5784P097J0004k3759J385J9901j7351j5085J1532p695
584a4154p810K1637L206j5174R156J080j9124O606K0499m380k669J1734k586o894
598A127Q628P372l077j895j970q686o569N941P341k862j784J094r898j0545N647
613a0136K974m106M435J36q800O070J0672m008N787J0363j1662r351J0067N7p82
628A716J4055R0r916N729k002j1931Q156N100j5918l007M821r690J345J4118l341
643f75m153O097q521j0022J0327O328n147N168O395l804J31N889L007J293k250
658A0063o585l938m88J555K003J645K465j045j0466k686P015n003o835Q503q0
$$ y = [-14204, -12879, -11662, -6019, -6509, -14990, -8879, 4047, 2125, 8268, 20156, 5803, -3968, 9338, 5160, -1730, 23099, 25601, -183, 6914, 16918, -6841, -5456, 14445, -2906, -17991, -6459, -14154, -21964, -327, 2879, -12295, -3139, -2059, -21183, -14577, 5922, 1542, -1127, 10607, 8021, 1127, 9755, 17127, 14050, 12155, 10185, 1499, -5070, 871, 8212, 5350, 3566, 4660, -5238, -15783, -10136, -7162, -11268, -6833, -6697, -15497, -9427, 1245, -2763, 3024, 13387, 1725, -7626, 2441, 2498, 1716, 15771, 15861, 5945, 11674, 9672, -2259, 5897, 10997, -4921, -7928, -3107, -12797, -11452, 2666, -675, -4828, 1269, -7252, -17274, -6947, -619, -5766, -598, 5797, 1993, 2124, 8013, 11020, 12313, 10063, 3478, -460, -948, 607, 2610, 4255, 6720, 5675, -4791, -7477, -462, -5465, -12300, -3797, -3877]
673c877j0682Q155R350n264O063Q012j2739l070R762o241k059J4560k680q689
687F01J0358j394j2906R501L904j8406r52R629r957l469J3526J257m622L001l176
702c105m256N941r58m762P570M871n105K224Q749R93l368j666o38l419o606n06
718d041N667j566k964N136m65o725J170J784n889p04J594l347M031O688k394M414
734B389J0051o793o249Q685j156r143N941N988p389J916N285m987p47K084p095
749a220m290P40n722j750Q151m16m019O814L478o668j0O006j381l309J245M195
765A844M072R76n0N020K609p139m858K517j381n453j321J833R24j006j460Q78
781a995P46m047m025M59J30j047M171L873J10L492M922l80k050J016L14j629j681
$$ y = [-3877, -14559, -6404, 2946, -2318, 3745, 11757, -982, -4052, 5710, -531, -2590, 11970, 9290, 601, 10959, 9565, -3341, 6160, 10064, -8342, -9294, 335, -9622, -13091, 435, 1692, -2930, 71, -3105, -7361, -1420, -2378, -7140, 430, 5301, 196, 2420, 11169, 12162, 8794, 7128, 6490, 3071, -3535, -4041, 1626, 60, -2904, 2232, 1767, -4958, -3788, -2004, -7893, -8597, -7003, -10350, -6319, 369, -2025, 2389, 12440, 5647, -602, 8083, 6927, -2216, 3725, 9713, 2324, 4240, 9525, 4538, 3791, 5875, -1220, -5510, -4770, -10492, -12242, -4091, -4507, -8526, -1712, 1766, -4902, -4912, 1094, -287, -3596, -2351, 1844, 5916, 6892, 6842, 11862, 14471, 7332, 2474, 4991, 3610, -1843, -3164, -1331, -407, -1413, -2873, -1995, -1249, -5296, -9321, -8862, -8732, -9779, -5608, -1735, -1625, 1867, 6789, 6409, 4359, 5375, 5689, 4060, 2379]
798B379J5L917K882l649j457M098k119q746k151K207l109n095J557M835J550j144
814d030J44L261K96l838q14L555J135j105L133M562J802K91M24n95k205l096j598
831A322m90j187r93J586P35j453n76P40k277m020j211J629k04j52K968M755P86
848A958p31K570J586k319k388Q79J074m21j23J990K688m79l494k90L79l939m016
865e076R77J128j830J68K791K509n98j702M40K99j443j365J805K644O00L78K356
882D081J898q98j246q75j635j850p55O19q1O76J223j43j249l82l2j156j821k53
900c879N31J279R38R30K593K562j773k752J807N62l638o87L898J91k312O24J667
917B541j46j244k086j216L38j444k499K866M408j788j336L642n8l652J367L154
$$ y = [2379, 2394, 6311, 9193, 5544, 4087, 8185, 6066, -2680, -4831, -2624, -5733, -10828, -9271, -4436, -2886, -4030, -3886, -625, -329, -4167, -4981, -1426, -291, -1396, 1737, 6299, 8101, 8392, 8816, 8221, 6016, 2920, 1322, 832, -355, -1348, 238, 973, -480, -1056, -316, -2593, -6613, -7824, -6195, -6399, -6551, -3583, 1172, 1958, 1227, 3797, 5383, 3064, 676, 1555, 2629, 2208, 2085, 4075, 6763, 6284, 2790, 2500, 2879, -1060, -5076, -4099, -2971, -4801, -4633, -1842, 667, 69, -1633, -1193, -894, -2337, -3702, -1897, 747, 1347, 1725, 4081, 5979, 5081, 3835, 2960, 1325, -525, -1280, -661, -742, -66, 1157, 1014, -235, -617, -649, -1805, -3626, -3879, -3348, -2069, -1131, -201, 2392, 4954, 3181, 429, 2236, 2798, -840, -1527, 2371, 2562, 250, 874, 2541, 2395, 1151, -935, -2151, -1813, -3257, -5756, -2890, 1518, -270, -1606, 2036, 1978, -1674, -307, 2847]
933B847k320j072J833k76Q84K171j86n70L7k625k966P37O47j674J000K020k567
950b080j412L096R31k647P43J440k489k234L654L644Q1M71J173j188j123r7j046
967I17J901J361m645k165M740J5m268K590L745n879m477K736l48r98L586O67j492
984b014K329p05k158M761K721m506l45K875l085o94O089J422l316N90o09m201
1000h46q99K644n86j590n08r24o48J041J302P24O90j838l516k74L482J510p60
1017i96L604K452m168j440L732J437j662j14p73j697J98p86R18M628o35o509j41
1034a952J608m887k69N805r40l355K238l22j023M272J253k358N90j000l912K800
1050a452M778l36J218J706l253l567K359J291j472q61K9j432k367J76M648J969
$$ y = [2847, 527, -545, 1288, 1012, 1896, 4067, 3881, 3311, 3348, 723, -2243, -1506, -859, -2533, -1533, 487, -2080, -3492, -396, 535, -2112, -1369, 71, -2418, -4652, -998, 2646, 2727, 3198, 4371, 3183, 2060, 1963, 917, 2818, 4179, -466, -2631, 2109, 2124, -2144, 446, 4191, -1688, -6165, -3429, -3777, -4775, -1189, -522, -2014, 315, -390, -2548, 2213, 4934, 428, 83, 2958, -127, -821, 5268, 6690, 3374, 3964, 3355, -846, -1745, 899, 313, -1277, -1785, -2709, -3357, -2316, -1014, -290, 400, -1438, -4954, -5228, -1746, -236, -996, 2608, 5060, 892, -548, 3184, 4621, 2959, 2845, 2072, 375, 573, -213, 705, 5333, 4698, -1811, -1952, -344, -5231, -5500, 305, -635, -3990, -1752, -2074, -3097, 1175, 2428, 70, 660, -340, -4252, -1452, 3326, 2990, 4208, 5914, 2661, -906, 1453, 2744, 1272, 411, 440, -992, -3359, -3183, 1465, 3434]
1066C434k846j740o32k649n25J910J955K766J15m464J647N210l434j452O423k797
1082B921p824L283L313k147M190K894n368m91R26o045J850O642n704l554O758
1097A644k445n231Q397L605p050O08J211o224J003N431n40R78K617l670n30K823
1113B627k221l31L399k734m860J914K505M11J571P73j15j848n173k22N256p67
1129A85k881L580M07l605K161K723o36J404l163n610L293K265m295M519P005o653
1145F99k914N774l310l914O148j011o047L553J218l502N486L675n024P37J255
1160B823o727k10O344k154k831N394l06m751K649L019k015j197r98k462J024M46
1176a952m19L897K016l095j100J684n85j530j2R40P19j574r15L989K383k668k31
$$ y = [3434, 588, -1152, -1784, -4433, -4958, -3048, -1093, 1673, 1788, -2676, -1029, 4181, 747, -705, 5718, 2921, -4903, -1620, 1693, -454, 3736, 6630, 1262, 771, 1697, -4348, -2498, 4144, -1560, -5114, 1644, -801, -6032, 2365, 5970, -1080, -472, 739, -5485, -4482, 949, 409, 1387, 4004, 334, -196, 2627, 406, 75, 3474, 740, -4120, -2206, 299, 710, 2281, 3054, 2939, 1091, -4082, -4304, 952, 185, -2696, 884, 1291, -2314, -153, 2570, 1934, 3338, 175, -5435, -2142, 123, -4172, 347, 7352, 699, -2215, 3559, 249, -3665, 2483, 1472, -4575, -1022, 196, -3306, 2180, 5855, 831, 1568, 2823, -3904, -4114, 2230, 76, -2755, 2639, 2333, -2418, 231, 3250, 1235, 38, -960, -3422, -2398, -1952, -2371, 1526, 3542, 447, -653, 1031, 446, -1084, -1096, -156, 563, -1011, -1926, 2063, 4446, 1778, 1547]
1193A547J847l749k429J658k54J62K335j130q60K603j486k097K716p68m375J758
1209b522J951k959K172N148k141j646K546j206k214J166j61q52J933p83j063L522
1225B891J201l785K17J682l459k376J689R05l63N26N05N97K45j322q78J612r51
1242a064k168J341J769M70L72J091R59l7j496o16l1k06j064J073O69o72O03J109
1260B102j368o65Q2j415j246j28Q1P07J302k88L56J561p27j917J088J087j769
1277a157k14K309N80l41J001O63j82o77j643p35R37n65j820J226K115j319j151
1294i73J311P6j886r86M98l22Q6K56J049J293N49k56o3N31p16j026O57N86o3M99
1314A100P30o4J5k78n07j258o18l47J59O9l95N52J299j079p54J325R3j822o51
$$ y = [1547, 3394, -355, -2784, -1126, -1380, -1218, 1117, -13, -873, 1730, 244, -1853, 863, 95, -4280, -2522, -571, -3530, -1358, 3790, 1649, 3, 2549, 1343, -871, 295, 134, -718, 1215, 432, -631, 2891, 4092, 307, 524, 2206, -1253, -3629, -1940, -1035, -1398, -872, -367, 230, 475, -847, -1725, -113, -1064, -3232, -1891, -122, 348, 720, 1811, 2770, 2733, 1237, 621, 590, 384, -680, 393, 1062, 390, 993, 2102, 734, 69, 151, -1264, -2510, -2638, -2557, -1850, -548, -836, -480, 1081, 354, -1563, -475, 612, -1157, -1371, 938, 1518, 1177, 2178, 2841, 2659, 1982, 339, -396, 541, -24, -1844, -618, 1497, 178, -973, 338, 414, -1472, -2458, -1960, -2282, -2196, -1940, -891, 402, 951, 695, 632, 1163, 447, -579, 78, 664, 601, 1100, 1830, 1766, 1781, 1503, 996, -262, -880, -1227, -1068, -999, -1394, -842, 457, -622, -1376, -51, 42, -1780, -2431]
1333b431J521N29M4K65J020J134n82j374R79N44j940j103J520P68q00M59Q05J9
1351A377j053j437M5Q14j227r61J811J104j454M86J817o29j082O6k99m81O36j69
1369f36O22Q58K9m80J270o44j714O00M33j733m20K059L77r02J113L48q46o44m45
1388g55K79O8o75k15J925R42j795L62J590q22k393J56J248n00j463J117J692N9
1406H20j250M77Q12r44j024k57J114P44m64j81J978J34j430N58Q25k409r59J777
1424C21n24j384K406L10j663K66O70j327m72L37j396J131Q25j810J180L588r57
1441A501k554J995J039k919m27K597Lq75M48M18O38n5j061l61N52j690k152R77
1459a926J584o46n19J427M45k046l99K011o10j320J214J017j405J097K255n08
$$ y = [-2431, -910, -381, -337, -72, 948, 2082, 1500, 126, 1105, 1649, -291, -1394, 126, 894, 94, 553, 1358, 1377, 324, -1113, -1068, -254, -1481, -2442, -631, 473, -981, -495, 1322, 693, -389, -323, -622, -1103, -467, -636, -14, 844, 873, 393, 1663, 1019, -695, -95, 338, -1395, -1815, 244, 621, -281, 832, 1180, 334, -310, -755, -476, -408, -1083, -1298, 627, 1569, -226, 136, 1726, 904, -1489, -1333, -85, -585, -2048, -931, 761, 820, -430, 47, 859, -85, -1109, -1366, -252, 492, 28, -153, 1825, 1959, 529, 1087, 1912, -497, -1456, 321, -203, -1587, 819, 1129, -534, -268, 402, -925, -1397, -1060, -2456, -1325, -500, -2310, -1130, 2458, 1501, -1053, 942, 1981, -938, -1365, 1232, 1235, 360, 808, 1226, 1864, 1809, 748, 387, 939, -751, -2903, -1926, -342, -988, -1507, -80, 365, -1681, -2080, -69, -679, -1999, -785, 232, -1173, -76, 2179, 1671]
1475A671J7J178j681j550J594q06j253L010k1l529J788J981l963n82M042l012
1491a116l843L305N54j866K284J519j818J171M19k678J301L347k790j401M294
1506B682j029k995L158K598l405l10P96k363j196J771K94j013J118n5k565J039
1522a475J463j306l80J245j620j465K723K053j264Q12K842k469k982K847J017
1537B041k865J367J897k736m23K624j171n62K573k933l227L023k51l715L408L928
1553B978m455j428M557j831k085L274O1k814J457N40j946K606K832l086n05K303
1569B458k523k579L367M76k805J318J609k540l21L359r44j985J191m04k333J067
1585a589K225o76k5K044j846j668K299J4k419K034J658l950n87M340j113k081
$$ y = [1671, 1688, 2866, 1185, -365, 1229, 423, -830, 2180, 2159, -1370, 418, 2399, -1564, -2146, 1896, -1116, -4959, -1654, -1100, -2966, -682, 837, -981, 190, 609, -2069, -768, 2579, -211, -1612, 2682, 1653, -1342, 1816, 4414, 1009, 699, 1495, -868, -2064, -293, 1, -1012, 106, 51, -2514, -1475, -12, -1318, -1698, -453, -2073, -3538, -815, 1238, -26, 786, 3628, 1159, -1823, 1024, 2041, -824, 543, 2440, -296, -719, 1905, 734, 172, 2745, -188, -3415, -392, -643, -4358, -950, 2978, -1477, -2905, 1652, -179, -2264, 1010, 1071, -1743, -286, 254, -1692, 914, 3746, 660, 155, 2458, -65, -2644, 723, 1199, -1606, -288, 1321, -1219, -1540, 1819, 875, -1110, 81, -323, -2656, -1589, 636, -40, -65, 1979, 133, -1535, 764, 778, -1641, 393, 2051, -1899, -2486, 1854, 741, -1340]
1601a340K953O3l549J100N18j697J734K341l434r9L506k127j770M295p17l803
1617b026J572J540k590O06K969j640r02J298j577j780K524K01j953J044P96j737
1633a655M67K065k35j144J518j65k580Q39K015p84l25J919l35k153J090J068j886
1650b81M91L49k244l09K505j209j419L528m17l502R37K121k415J44K855j299q18
1667i83K318q56r45K712o7l011J491J514l091R5L094j259k051J854l49k263R53
1684h44J301k189r7J635j299o77K428j26j396J397J22j810J208J605j469K27K357
1701B373r65j709J810R17k337K07J148j413r82Q45j61l22J222j126j568J348L90
1718c23k170N41K045q77j194J444J341j143M03J027o23k02O42l68k06Q02l9n58
$$ y = [-1340, 1613, 1676, -1873, -773, -255, -1952, -218, 2123, -1311, -1410, 2096, -31, -1801, 2494, 1777, -2026, -454, 1086, -1504, -898, 2071, 431, -471, 827, -750, -2530, -6, 195, -1758, -714, 82, -1655, -1188, 877, 642, -502, 1016, 851, -1729, -890, 1125, 341, 16, 1935, 1600, -553, 537, 1605, -281, 210, 559, -1685, -1994, 511, -698, -2117, 1411, 994, -2508, -1571, 550, -1865, -1721, 1134, -165, -983, 1335, 479, -466, 2246, 2179, -832, 659, 2173, -918, -823, 2271, 1012, -1039, 815, 466, -1797, -844, 457, -1732, -1829, -194, -1493, -2170, 258, 132, -1264, 133, 255, -1555, -347, 1258, -211, 16, 2373, 1408, -301, 1509, 2426, 89, 296, 1444, 31, -951, -106, -267, -589, 633, -493, -2061, -713, -323, -2493, -1952, 93, -784, -1978, -534, 807, -336, 67, 1094, 471, 269, 911, 543, 337, 1139, 1100, 542]
1736E42J94K79q96m13Q76j200q16R98k9j200O20J644j526l44J509m56j493J170
1754e41Q45r39Q93L02k53O13N87j376r0J478j885r74K052J25j665P83J379j277
1772E7q13O50o17j69M39r26J69J514p13k73J517k2j121K51K71p45K22L87J11M86
1792F75J28l21N54n91p04L13j20j060M95Q20m17j59Q81j41l03l09m26L85L22r10
1812h88j34K004n37r67J202M24o60r40N14o73m0p5J78Q64O52j205P42N65r70j058
1832a002P64Q3o74N87L36K67J11J98j51R3n85n86M04J60r06M55J379m75p29R36
1852F65l96q02n10K41K06l83j09P19R78m78j76N89M54j194k15N96J69n54J12O69
1872E81O52m97n75N57k98j041m79P41m53m66O89J59K83Q9m47p3L83o03m91Q94
$$ y = [542, 736, 1015, 119, -294, 582, -618, -1434, -436, -465, -1665, -1045, 599, -927, -1271, 238, -218, -1711, -541, 304, -635, 258, 560, 307, 920, 1507, 131, 41, 1519, -366, -1340, 712, 837, -828, -45, 1334, 57, -756, -106, -723, -892, -453, -1379, -1210, 304, -409, -682, 835, 813, -308, -57, 214, -531, -309, 78, 189, 675, 803, 482, 1036, 445, -259, 54, -66, -1126, -631, 189, -228, -387, 494, 353, 50, -259, -685, -300, 22, -888, -1022, 982, 445, -522, 680, 1104, 444, -496, 18, -655, -695, -770, -592, 272, 924, -281, 461, 1026, 56, -1002, -238, -155, -829, -242, 94, 361, 472, 670, 519, 612, 27, -559, -155, 5, -901, -446, 933, 458, -271, 665, 269, -533, -1043, -802, -596, -979, -1088, -369, 609, 131, -45, 544, 998, -196, -411, 185, 354, -200, -88, 581, 1233, 736, 161, 718, 420, -621, -1100, -359, -812, -1278, -589, -430, -147, -58, -505, -578, -195, -798, -1289, -395]
1892c95M48o42R55J023n42l53P17l45j013L92P5k08j05L22J78r3k79l17n3m1j129
1913a405o5N28K27k35L5J300k36r42N74O06n58o40R90N56n20N79j71L27P17n98
1933A069j200P49J18j377R2N90m21m85J258k64j143L24L7j032O88O66o86m7J370
1952C06j13j85Q31k27n27N55l48n20O35P90n26n77Q38J36j156j10M72o03o82K80
1972g31m8l4M48L00r12R18L8j221L95J194n74n91J561Q0r60M65J150q96K6M95
1992A103j196m77J294l56r71J498Mj532P8P22r51r7R29j074n59J498J21o92R14
2011B56O37j158l78J009o77P3J004l15l53Q84m27n22N26O88r47r05Q10j60q99
2030h54P52O09n14k71K76p04qR14n58n76J061j02j001J204J161j335k53J078q52
$$ y = [-395, 53, -589, 366, 1389, 847, 494, 1211, 866, -147, 245, 320, 112, 7, 329, 507, 414, 135, -182, -235, -276, -1405, -1470, -942, -715, -950, -915, 385, 149, -793, -219, 387, -171, -811, 179, 735, 215, 794, 623, 950, 1667, 1069, -131, 618, 736, -641, -549, 41, -380, -865, 393, 129, -1014, -690, -653, -1685, -997, -331, -1017, -1064, 306, 193, 8, 839, 612, 85, 640, 292, -228, 407, 1197, 671, 94, 932, 1068, -88, -198, 274, -329, -1011, -731, -779, -813, -365, -65, -977, -59, -21, -1242, -847, 347, -227, -818, 743, 823, -137, 328, 1478, 582, 608, 1103, -93, -570, 724, 368, -603, 895, 899, -633, -555, 167, -784, -881, 48, -1026, -1585, -87, 34, -658, 256, 893, -265, -643, 366, -311, -238, 766, 451, 98, 982, 555, 33, 559, 1247, 300, -605, 205, 45, -854, -102, 507, -7, -278, -2, -706, -714, 200, -358, -934, 127, 25, -976, 228, 1389, 54, -199, 879, 27]
2049B7r15J243Q2m29N88L76j326j2J136j192J80Q43r68p24J262J79j001J273M67
2068A089j685j60J356j157l13J561J22j358O38L22p17Q46L3j027Q5P36j041l21
2086i91J665N41j718K69R37q65o51J162M23j280P28M7p48Q01P68j067O5J069j569
2105d14p75J776j52j367J398K41j906N21J520j113m36J453j078j144J363M50m12
2122g5O88M76j264K64Q82j048l89J772n87j450R25Q00j010l33J152n03j510P50
2140d60J46o07N34L93o02K70O25j113l68J532J8j531J543N59j193j33K074r62
2158G25o60J371m03j748J104M56j130J35Q10r72k22J081j103o56J504n46j667
2175a921J002R59j311Q00J628r88n27O79N63j023P75j15j62M45J27p70N34O90
$$ y = [27, -888, 355, 437, 8, 596, 972, -354, -366, 770, -422, -242, 601, -367, -1091, 171, 350, -651, 622, 1089, -596, -756, 600, -557, -870, 691, 813, -545, 93, 415, -302, 544, 577, -450, -365, 371, -670, -991, 674, 1215, -503, -234, 703, -162, -813, 349, 772, -508, 220, 267, -481, 320, 1088, 21, 86, 1155, -414, -1189, 587, 435, -932, 466, 707, -1199, -678, 842, -271, -707, 746, -332, -1476, -113, 337, -75, 613, 1089, -175, 89, 971, -77, -466, 1306, 719, -731, 194, 994, -16, -349, 803, 300, -1210, -460, -314, -921, -387, 6, -596, -326, 299, -814, -1182, 350, 368, -1163, 380, 939, -254, -387, 1687, 725, 65, 1436, 1033, -715, 389, 845, -285, -150, 660, -312, -534, 547, -556, -1212, 292, -254, -1921, -919, 40, -1271, -471, 1157, 169, -358, 321, 884, -139, 636, 521, 359, 804, 931, 161, 695, 1385]
2193A385p42r57N59mj184R0R00m58o45N12K85n57K85L26r0p0J53J21j89Q23L0
2214E73n6M29K92r61J17Q96p98k56P37o10q73M84P52j216j87O09o41r0K76n7n5
2235f35O47n98P5Q40j8n54L72M08j61k90M38L46o1k08j0J33j59m50j92J84l11
2256b04k61n2J13m0J39k13M6K19l70P8J87J37K25k8M3Q4M71j21j31k63K90N2j10
2279B91m06K01J60ml30K47K77o34j67J71r6m58L55K78J52M0r2J2J92K03n78N20
2301C34O3n82K78M05J23j86j70k97L09j10j4p62M17Nj28J39o4K4L98j49j64j43
2323b74L45m73J87K40r8K77o2P5j53K47k30K0J44k40j76K12j76N4j02j23J25K85
2345A04l95p7L92j8m9L5j1K80j17j4L18o5J67m31J36J8k42j95K84J82k59m13M30
$$ y = [1385, 643, -314, 245, 241, -943, -853, 47, -411, -1056, -544, -259, -816, -531, -205, -295, -365, -212, -91, -280, 543, 573, 517, 946, 1238, 277, 394, 1290, 492, 236, 973, 363, -510, -26, 726, -490, -677, -68, -709, -799, -523, -580, -635, 12, -586, -511, 329, 311, -243, 129, 537, 376, 86, 524, 870, 809, 601, 591, 724, 565, 115, -77, 107, -204, -465, -517, -404, -444, -305, -518, -472, -253, -623, -545, -358, -221, 4, -24, 19, 103, 574, 453, 322, 59, 349, 401, 291, -115, 86, 246, 242, -88, 159, 436, -198, -365, -194, -290, -748, -393, -115, 37, 77, -15, -3, 189, 392, -186, 334, 397, -185, 93, 498, 621, 435, 265, -32, 277, 167, 153, -609, -192, -187, -315, -176, -240, -216, 182, 33, -131, -274, 71, -402, -215, 25, -73, 204, 142, 217, 64, 311, 81, 101, 245, 5, -171, 41, -135, -81, -183, -306, -181, 104, -291, -368, 24, 6, -43, -8, -19, 261, 144, 130, 448, 383, 550, 119, 255, 273, 31, -164, 120, 302, 43, -370, 60]
2368F0k87r1j09K3j82L49N9m4L39j41J22R1k2J53O2k2K07N6r9j37j12j54K35k93
2392F3j83OJ06l57l43N30J33j50l10R7K67j08k43J45M21M02m83K17L09L0k63L97
2414F83l8l74O7P4J08j04J17k45k73k32J67m97J20K8l38P1L88l24J90L14J69k58
2436a87O2L03j71O9L94O6k9j20K92q9r5j20k05L71m51l53K56K88k18p74M98L2
2458a81m95j26M66k06J6L43J00L4P6J39J14J62o5k29J33L58j83l75N10J24m08
2479C07l24K33m46k14M71k78j80K44K75m60K11RO3j29r5j41J36L34J46k35P34
2500F61L2n37j33N37j76m45K02J46l37J77r4P2J48j32o76M90p0k73J25L30j80
2521a33j75M60j03Q6k53L41l89j08K77Nj00M84j0n9j94O7j89Q6K16k54P0M78r08
$$ y = [60, -227, -318, -427, -404, -586, -237, -178, -222, 117, -24, 98, 189, 167, 320, 382, 360, 567, 623, 524, 387, 275, 121, 356, 63, -120, -114, -8, -365, -708, -178, -45, -195, -505, -408, -141, -249, -492, -347, 74, 476, -7, 210, 519, 549, 286, 683, 645, 271, 338, 412, 520, 416, 533, 288, 15, -217, -50, -547, -427, -399, -737, -666, -278, -602, -412, -98, 71, -187, -125, 178, 7, 76, 470, 536, 507, 387, 679, 590, 495, 375, 170, 541, 90, -263, -7, 281, 63, -711, -213, -181, -676, -802, -336, -542, -526, -183, -83, -49, 27, 166, 280, 442, 377, 148, 281, 639, 456, 81, 591, 715, 307, -17, 216, -230, -444, 27, -251, -431, -187, 88, -372, -161, -152, -89, -218, -313, -454, -318, 16, 162, -73, 661, 693, 156, 23, 560, 384, -61, 141, 287, -50, 127, 33, 105, 253, 121, -555, -65, -135, -408, -283, 47, -133, -308, 152, 49, 135, -118, 223, -166, -274, 3, 8, -92, 392, 382, 323, 129, 196, 7, 93, 309, 55, 125, 603, -305]
2544c05L05L03J74p20L96k19K5l75M12l2k37N27l68o1M11J08n58R0O47p56l83
2565f16O45J49j39P9J51j71k13K69j99k75P50l36k54L63L14p46M31L00m95j16
2585a09K66j21m48N93j13m42L62N8l41j17M42k51O3K4Q2k50O03J16m41M43J54
2606E73o97j29P72M2p55M88J53m32K5K88j93j64K1j88l39K38K97l97L54L63l16
2627Dn78R87k58n49M73J94o52M78M23m42o9P52n48l74M35Q6l14K1K30m66J91J59
2649A83l01j75N11l24l19L47K19n87J5N12nl17J06L84l21N7K59l17K96J10N7j77
2671B13J3K85k61o5N8k06k11R8kl56M10j30l79K58K40k80K10K0l6k88M39j74j06
2694b50M11N4j4Q7L3k20K29l5j32j18K28j2j39j7L40m16j2j83j60K31j00K11m31
$$ y = [-305, 0, 303, 477, -243, 153, -66, -41, -416, -4, -36, -273, 254, -114, -175, 236, 344, -214, -124, 523, -233, -616, 29, 178, 39, 118, 269, 98, -115, 154, -45, -320, 430, 94, -160, 203, 517, -229, 202, 502, 7, -109, 157, 36, -412, 181, 68, -374, -12, 46, -295, -412, 30, -221, -158, -134, -52, -302, 301, 417, -24, 419, 573, -124, -253, 519, 561, -194, 294, 447, 15, 40, 328, 135, -29, -8, -196, -535, -297, 0, -397, -43, 320, 4, -574, 413, 155, -394, 79, 273, -379, 99, 522, 80, 11, 763, 215, -159, 276, 362, 48, 69, 299, -167, 24, 183, -118, -293, 218, -106, -425, -78, 141, -446, -431, 81, 76, -241, -135, 249, -72, -15, 244, -73, 223, 333, 390, 213, 226, 511, 250, 185, 243, 37, -174, -76, -78, -434, -24, -154, -533, -275, -35, -315, -105, -85, -121, -409, 30, -144, -250, 161, 215, 201, 288, 321, 101, 330, 295, 163, 45, 273, 261, 122, 105, 445, 29, 17, -166, -326, -95, -195, 16, -415]
2717d15J20L65k62N1r5J09O4j44J56M64k80p0J55O2N7m13K05P4j18J89l55O9J3
2740Aj15l6J51j6p7k36K64J30k16P2j14Q1J36j78J93O5l2Ml38L34M7P2k84K84
2764A92J25k81j5j6j56L65q3m06J74J2j13P8J38R1l31rK97N4l6J5j04j24J59k73
2788b47j50N72k99O2J52L2k95J78P3JJ24K4j18LKj73o1K33r5J25j1m64J7L73N3
2813A11k51J03M4q8Mm4M0K4k3q2J10M20n93L19R5j06o4J21j74K11l58K6L18k70
2837a07J45m07O12j14k23R7Kj39p7N48n77L56j69m1l5J70mK32m80L43L6k6j17
2860B5r7K53R1k24J27K74k73p1k54K42J74k00j86K98j20k5P0j91j12j98K05K7
2882a65L8N8j82K23R6rj95J97j7k27K21P8L5Q7k80K51K05J70m29l6N9j64l32K18
$$ y = [-415, -295, 70, -192, -141, -236, -127, -63, -207, -51, 413, 133, 63, 218, 280, 337, -76, 129, 203, 85, 274, -81, -12, 1, -114, -150, 1, -15, -92, -328, -64, 66, -150, -78, -192, -111, 25, -153, 40, 105, 73, 77, -261, 73, 120, 192, -92, 192, 317, 36, 21, 5, -151, 214, 131, -275, -101, -89, -202, -124, 14, 105, -226, -235, 62, 116, 80, 95, -9, -133, 26, -247, -397, 175, -124, -62, 90, 122, -173, 5, 78, 79, 203, 227, 109, 112, 114, -59, -120, 113, 18, 143, 132, -332, -315, 58, 111, -140, -37, 7, -81, -77, -121, -81, -57, -80, -162, -52, 368, -225, 94, 189, 83, 19, 140, -34, 177, -181, -155, 163, -107, 38, -369, 243, 129, -94, 3, 5, -134, -211, 337, -240, 116, -53, -94, -129, 41, 37, 269, -211, 132, 168, 142, 25, -72, 181, 272, 48, 175, 449, 176, 105, -149, 93, 267, 67, -119, 179, 59, 34, 104, -87, -199, -397, -192, -165, -127, -69, -251, -28, 68, 59, -136, 61, 44, -183, 38, 116, 151, 238, -42, 209, 414, 584, 155, 119, 178, 14, -318, -100]
2906a00j1j85K53j07j59P8L4J44j64O7j20J27O6q3N54j94j7j8k4q5J7J35k3J45
2930C30k92l7M05k50l45J07R2j34k12K45l3k14P2j9J98M9J95o38O24j46j88J74
2952a7J79m26J30L59j63m7K57k6k04J80m2k58K00j15o7K90l32j23K96k49N8n2
2974a72j23M53l19R6k07M18j00Q7j42J23k99K68J38J6k83J56M00l56j10j04Q2
2995B2Jr0J4j12J51nj69l6K08p9q7L66j82k55J38J00j78J39M3J72j81M4K2M4p2
3020A8r3M57k80n7K69j42k07k8J32oP1j28j36J75R7l06k2J13p7J29q2j6j60O4
3044b15K64l37O1Q8K18j85K88Q1k74J01k54K23j78K32K10M0l23Q3j23L28m05J16
3066C9k30K87j51j46M43k0k07j22l6J26n0J28k86RP5K15o6J37n7j16J19o0R4J4
$$ y = [-100, -111, -296, -43, -150, -309, -231, -197, -53, -217, -150, -270, -143, -77, -160, 394, 200, 183, 165, 141, 56, 73, 208, 185, 330, 38, 1, 406, 156, -189, -82, 10, -124, -336, -91, -124, -338, -266, -285, -87, -38, 157, -481, 143, -3, -191, -17, 162, -264, -134, 225, 62, 15, 272, 246, 42, 222, 180, -78, 122, 7, -60, 230, -102, -225, 71, -178, -120, -172, -295, 158, -161, -65, -272, 146, 46, 133, -9, 114, -185, 83, 221, 237, -46, 110, 510, 154, 44, -60, 22, 23, -67, -53, -165, -14, -19, -188, -224, -16, -95, -182, 184, 2, -253, -115, -15, -193, -54, -11, 161, -20, 24, 46, 90, 18, -75, 382, 102, 45, 314, 172, -35, -63, 69, 63, 134, 6, -130, 45, 142, -164, -186, -73, -150, -21, -103, -119, -279, -215, 49, -288, -227, -139, 79, -106, 182, 263, -11, 90, -164, 59, -119, 113, 323, 363, 40, 123, 0, 328, -77, 39, -191, 96, -55, -201, 242, 222, 15, -107, -143, -17, -67, 61, -225, -216, -141, 74, 8, 145, 88, -28, 91, 31, 125, 139]
3090A39J55k73J11J91k48k02k4L02j20l20J12L71l66j63K78n7r6O8j13J92q5J99
3112E1j08J81pj31j3M65l19P5j90L3jJ35N7k10M2q1J27k72J31pp1K8l46K78m6
3137a99L5J37r9J77j2k57K39O7J1l05M23J53l75J29K54l02j48J04j0k18K12L15
3159C31k93k10M87k42j66K27l25qj49K29j24J82j80K60j70K09j49q9J79J62k43
3180h2N29k59m22K81r6J70k4K6J85k30K6q9O3j79M4M5j14O1o6K3j30M3M00k68
3204f3K08k44J81p7R6L2j28j01J98j02K27p5j68N2K92k48K2l32K14j83K67j71
3226a03j50Q6K67p8l2L4j28J35k88K90j96r1K42q2J4J25J33k72m4J22n6j05K84
3249A07j17P5Qo3k7J0J91k52nM0P2j73K44k81n9K62O0j98L9j90PJ75j64K70m1
$$ y = [139, 294, 21, 132, 323, 75, -127, -151, 151, 31, -289, -177, 194, -172, -335, -57, -114, -210, -142, -255, -63, -148, 51, -57, 124, 117, -14, -27, 438, 119, 194, 4, 37, 36, 171, 228, 18, 60, -21, 106, -166, -35, -42, -113, -85, -431, -153, -199, -164, -27, -126, 51, 39, -218, 21, 88, 99, -206, 217, 370, -5, 124, 378, 76, -72, 32, 22, -196, 16, 331, 38, -172, 315, 73, -93, 134, -191, -199, -348, -119, -243, -61, -241, 19, -151, 58, -91, -180, -1, 161, -82, 447, 188, -234, 47, -49, 121, 97, 123, 308, 78, 104, 15, 78, -101, -57, -12, -126, -65, -131, -108, -238, -195, 205, -63, 145, -99, 82, 5, 101, 133, 5, -96, 102, 0, 227, 152, -16, 36, 328, 80, 102, -230, -16, -199, 68, -103, -253, -167, 100, 22, -10, 24, -104, 31, -257, 33, -163, -254, -12, -94, -80, 45, 178, -94, -138, -16, -72, -177, 107, -10, 65, 73, 10, -17, -7, 184, -68, -73, -33, 39, -134, 110, -171, -230, 32, 92, -106, -67, -257, -250, -75, -239, 31, -10]
3274a0p7L86j00k49R2J1m2m9M51K5n21R6J80m1k56R8J17k10O7k2k4K59k54j11
3298a84J14J02k36J84K4O5k44J42L5j6J80j63Q6J7j27j9Q8M2p7J67k9j99K45J02
3322B99j98j70k50R5K04j02m8J40j53j51J41L00k87l7Q2J9R0p8j23K97k03J68
3344C5NL84m87K65k14K05j78J07L0j81k9K95j02o7j41K02j68j29J89j21K16j54
3366c8J28j46Q1o9K5N3k48K64k5J29l02K68j11M4j11K00m1q0k4j18K36j76M5o2
3390g8K6P6k67MJ24J90J09m73M85j27m33K98J07Q5k56K65P6j67r5K33k15j3M7
3413AK8K23j52k04L13O5j86r0r8J09k01J17K97k65j09K7mK36K0m14o4L26O9k24
3437a80L22j84N6P0j47L45j92j65L8J60L8J00k01N5j00J88r7k55J38j52qJ38M1
$$ y = [-10, -87, 299, 199, -50, 42, 53, 11, -38, 413, 438, -83, 13, 193, 152, -104, -6, 111, -99, -32, -54, -78, 181, -73, -184, -70, 32, -204, -20, 4, 69, -175, -33, 2, -14, 166, 3, 89, 106, -21, -40, 48, 90, 13, 180, 151, -48, 197, 299, 101, -69, -319, -224, -20, -122, -170, -30, -183, -334, -193, 107, -180, -217, -135, -116, -26, -104, -227, 70, -133, 35, 40, 424, -63, 202, -12, 193, 15, 122, 152, -29, -58, 237, 135, 68, -73, 129, -39, -168, 21, -100, 116, -38, 90, -56, 25, -44, -19, 34, -214, 50, 25, 154, -148, 120, 9, 53, -58, 142, 101, 21, -3, -121, 115, -61, -16, -78, -52, 24, -243, -239, -115, 75, 184, -289, 196, 69, -364, -66, 41, 126, -130, 135, 211, 44, -51, 182, -33, -46, 1, 29, 252, 100, -104, 209, 274, 88, -2, -100, 9, -192, -75, 222, -43, -152, -125, -129, 107, 127, -287, -351, -25, 44, -180, 142, -42, 14, 84, -63, 282, 90, -75, -37, 123, 161, 261, 60, 115, 15, 203, 106, -149, -11, -163, -171, -33, 8]
3460Hk46L0L56k10J39o0j01QO4k13O36j52k57J03j7LJ90j96k55L45N7j97j1Rl01
3485b68K04Q3j51J97k39j00K0J59K04j56Lj47K3K43o8O4j79j42L18j23kJ28J40
3508B11j78J82l14M48j59n9oo1R0k02j63N8K65k54P2J25P2r5j58J63l1l42L13
3531b3O2j59J29L13n25J45J68Q2j56M1k07K62k4j50J48j56o1J98n5k58j36J00
3553b62L82l54Q4J47l5r5R2J33j2k89M86m00O2J55J2k7j52L18l02L96k09J04j53
3576H1J05j82MRK0n2k05J46K02k25M1Qj7j72M04m2l66J32j49M94l9m0L7l12J17
3601aJ52k04m1J27m9J80m2j41K26k01J0l6L7L59m26r5J02k7J61k77J88J00P5l23
3625a46J82p3r7j7K49k55K64j78L42k0k08r8J83j75J29L04l02j50n5L64k63j05
$$ y = [8, -238, -208, 148, -62, 77, 17, -84, -76, -12, -225, 411, 259, 2, 105, 88, 91, 281, 85, -170, 175, 232, 35, 24, 33, -268, -64, 19, -132, 65, -174, -274, -254, -95, 109, -47, -44, -191, -168, 75, 7, 71, -108, -250, 68, -55, -57, 71, 211, 33, 215, -99, 349, 190, 131, 125, 64, 154, -48, -211, -153, 112, -142, -70, 55, 127, 32, -126, 37, 6, -336, -23, 39, -120, 9, 322, -203, -58, 110, 192, 36, 77, -130, 132, 108, -42, 106, -50, -111, 87, 32, -226, -362, -262, 120, -234, -150, -3, -38, -133, -41, 92, 80, -209, 277, -123, -61, 94, 106, 79, -73, 245, -57, 339, 130, 234, 81, 186, 4, 8, 17, 37, -15, -220, -74, 128, -97, -56, -48, -65, -237, 167, 125, -241, -109, -258, 236, 197, 157, 194, -118, -1, 151, -53, -94, 33, -16, 164, 122, -19, 207, 6, 16, -20, 17, 376, -50, -145, -43, -70, 91, -186, 2, 102, 177, -146, 36, -37, -134, -151, 98, -157, 107, -71, 271, 251, 43, -55, 128, -47, 82, 386, 84, -66, -121, 243, -20, -125]
3647a25K07j86k27L88j68K77k76J48j30o7K08r8J69j2r1k69N08j84j45L84l75
3668f4J29K22l02Q8o5l3L3J41k81JK56k28j59J87j5J4O2nK48m22M8j55K52J97
3692A49j92k98M54r2J96k44L67k56P4%j91K17K2l42K75J89l77m5%pJ02K0J06l1
3716I6k70K74k40K64k91K68L0k63J80JK9K39j35j63j71Q7K05N0n8j40j9p4J04
3739CR6k05K09p7j6k17K97K4l09N69k85k4j33j76L93j42j36K83j84K08l51J64
3761iN9Q1j30L4m0o1J13J06j14J54k64j03R4Q2Lm7Q9j10J33k21L47m26L66l4j66
3786f4J29j97J68j47K37m3Kj6J16r9j6j84K36N0j96K72j73J57k46k34R5p7R4K17
3810H1k87K26R3l18J39P6l2r3J50p3L5N8K96j08o8r3nn2o4n3J03Qj55L20k94K38
$$ y = [-125, 82, -104, -331, 57, -111, 166, -110, 38, -92, -159, 49, -49, 120, 108, 17, -252, 256, 72, -73, 311, -64, 65, 287, -15, 73, 8, -25, 8, 149, -132, -131, 125, -103, -262, -75, -90, -76, -14, -19, 229, -193, -145, -300, -48, 149, -43, -341, 113, 21, 217, -27, 340, 84, 158, 158, -33, 184, 206, -136, 139, 328, -49, -94, -94, -101, 1, 21, 127, 96, -174, 100, -140, 124, -167, 101, 131, -132, 48, 49, 78, 317, 182, 19, -152, -65, 140, 190, 132, -8, -27, -101, 3, 99, -106, 103, 26, 10, -207, 90, 114, -195, 374, 89, 65, -68, -244, 149, 7, -129, 154, -30, 178, -173, -9, 50, 131, 1, 35, -5, -66, 47, 153, 39, 193, -71, -174, -80, 2, 5, -42, 47, -63, 70, -151, 196, -230, 136, 102, -64, 65, -132, 36, -111, 126, 83, 85, 69, 185, 86, 70, -114, 122, 172, -24, 248, 75, 232, -14, -248, -153, -230, -136, 81, -206, 20, 113, -205, -66, 10, -22, -115, 35, -38, -3, 55, 351, 243, 175, 82, 77, 25, -39, -92, 11, 19, -136, 184, -110, 128]
3836A28k84J86j35L0j74K22r5O3R4p2j12K61j64J4J35j68L3j3k28L78j23O0j35
3859i9K74k5l5J88k05o7k09K90j55O4k38L88r3j27j95J25M8Q7J39r2J2j22J21
3882G4k19J78k49L89l45L81k68K43l26K52k10R2Q4k28K38J68k34L4L8n4Q7r8j2
3905A5Qq8j85K26n2j59L37q9j36QJ91j71k0J36j19J74m4j80J8K0K39r1oN9O7j01
3931E7l3J39k63K56o5j28J1q8j3J64j02l1j40J61m6r3N6O2j0K2K07r6pR4l00K93
3957A07K27k78J72k24J04l16J45KK21k76k21L05J16j21j49K33O3k83j53K30M7
3978d9J16k39L85j53n0l26N00l06J0L3l4M53m48k4K03Q1k98K50J24l51J80j41
4000h4O6j9O2Jk30K72l5r7k12L15m8m2K46l45K94P0k74K6j8M26l64qJ26j96j01
$$ y = [128, -156, 30, -105, -75, -249, -27, -122, -59, 35, -37, -149, 112, -52, -38, 97, -71, -38, -51, -279, 99, -24, 36, -99, 175, 150, 115, 303, 98, 31, -178, 112, -43, 21, -217, 171, 78, -49, -244, -119, -71, 16, 155, 63, 75, -47, 74, -145, 33, -216, 173, -172, 209, -59, 184, -142, 110, -100, -8, 76, -152, 86, 254, 20, 54, 92, 38, 125, 27, 15, 23, -65, -250, -24, -76, -235, 102, 13, -123, -115, 76, -95, -115, 21, -98, 76, 32, -148, -130, -110, 129, 38, 32, 91, 158, 57, 24, 163, -100, 156, 91, -37, -26, -114, -127, 37, -65, -96, -236, -75, -121, -214, -158, -96, -106, -84, 123, 27, 20, 114, -186, 107, 334, 56, 228, 4, 108, -208, -63, -61, 160, -116, -337, -32, 84, -37, -186, 47, 110, -173, -326, -96, -49, 67, -172, 213, 60, 10, -316, 184, -122, -112, -79, -113, 340, -108, -132, 71, 152, -146, 104, 228, -123, 57, -84, -18, -37, 25, 26, -204, 68, 33, -64, -276, 39, -9, -51, 195, -150, 144, 214, -60, -34, -52, 374, 10, 2, 128, -68, -169]
4025a69K65j43L17n05L07l8M4j12J1P0j21j02J52n3J16m6q4j41K08j14J98J44
4047B04j33J53k55J49r9l2N5J21k18K53k57j19J74m3MP0J09j32J06j88k71N04
4069A55Qk95J17j10J76Mj36M5L82l07l5q6K67j93R1l0o3KJ51j97P5l4J49K3j60
4094aJ52k70L97k05m6M3J23o6k43r7Q8J68k83nO25l59l54L11p8J8L06q0k09K28
4118A63j74P6j08J78j59J35o1j3k9k47L00m4j81P9J77k46J54M5j44K49l51j0K57
4141D6o1j4Qj89K4K33J09o8m04L74K2j3l1K11J4n26O5K83M4L3j42j02J23k56K43
4166B6r3n5J51j4N1o2J48k20m0J66j62J95j9r8R9k90kN36l55K12k25k64K25J67
4190G7R1k75Q2k97K42J48j86K2P7N2l7k5J55n9Q9j38J33l2l44J56K03R8m7l14
$$ y = [-169, 96, -47, 270, -235, 72, 34, 78, -34, -23, 47, -74, -176, -24, -77, 39, -7, -91, -232, -24, -138, 60, 204, 71, 224, -31, 118, 19, -13, 42, 163, -55, 198, -59, -178, -4, -47, -43, 27, 136, 4, 110, -78, -349, 155, 163, -132, -15, -125, 51, 55, -81, -36, 346, 39, 4, -82, 185, -8, 83, 53, -10, -8, 143, -54, 21, -13, 136, 159, -1, 151, -119, 278, 73, 27, 70, 193, 127, -116, -213, -125, 43, -240, -245, 380, 21, -333, -22, -100, -82, 224, 144, -65, 163, -11, 65, -43, 135, -24, 111, 50, 37, 8, -239, 61, 17, -164, -85, 92, -154, 0, 45, -99, 150, -201, -211, 46, -15, -29, -21, -210, -186, 47, 156, 88, -316, 58, 80, 67, 36, 247, 261, -265, -200, 83, 127, 160, 18, -84, 39, -217, 26, -67, -122, 29, 15, 66, 4, 152, -68, -108, 58, -104, 91, 72, -26, 73, -217, -219, 317, -38, 174, -51, -315, -90, 77, 168, -107, -25, -322, -80, 68, -118, -96, -19, 33, -4, -29, 126, 67, 156, 18, 151, 119, -225, -69, 134, 232, 185, -129]
4214a29r2L28l07K74k16J64n8L54r1j08j40l1o7J30j56n2L74j85j18J37j12p6
4236a77L01j96J3J04K19q9k68J88J57k73J62j87J16J39k73K29j9l20m3J77L8k09
4258b11K64j22j72R6P9k01K19j8r2K44Q9j69q3P1po4j62K49j92L22q7q6L2O4k69
4283b06J75k3J5R2J30j82j32K88l10J09O0J7k11K20l19L23P9l92K99o6R1J07l23
4306a59O0K38k61J07p8r2K2K10r3K29k58O1P4j52P2j30k1J04J2k43K45k2Q3m4
4330c6k23j7K89o9j9O8k24L94p3n2K58m58Q3p0K73j32J51j10j02J85j03l56L12
4353c1j42J85J9n3p4kO3j05K01L9j72J87k55J34l5N5j27K44m0j43K21k40K26q3
4377G2o4K01k84J41J32l00p2K21m5L4L5j92L49m28j31L19J5M0q6OK18l15j55J96
$$ y = [-129, -221, 107, -200, 74, -142, 22, -36, 318, 227, 119, -21, -52, -119, 11, -145, -197, 177, -8, -126, 11, -101, -177, 124, -72, -59, 45, 264, 175, -93, 95, 252, -21, 141, -46, 70, 209, -64, 165, 146, -174, -217, -40, -2, -211, 53, -69, -241, -145, -66, -267, -48, -66, -158, 86, 175, 6, -77, -6, -13, -77, -239, 10, -182, 140, 53, -33, -1, 63, -206, -31, -54, -39, 53, 183, 1, -131, 157, -153, -44, 16, 33, -178, 42, -277, 46, 125, -267, 32, -34, 57, 164, -159, -99, 139, -122, -15, -93, -185, -163, 47, -46, 183, -75, -14, 60, -92, -20, -150, -171, -67, -55, -298, -53, -75, 8, -36, -259, -276, 13, -56, -75, -7, -231, 163, 90, 38, 296, -162, -79, -149, 124, -8, 143, 33, -69, 116, 13, -343, -31, -173, 12, 31, -22, -96, -98, -35, -140, 61, 100, -72, 115, -140, -6, -41, 14, -113, 131, 91, -52, 169, -71, 155, 72, 8, 209, -75, 66, 198, -102, -174, 47, 2, 36, 71, -121, 228, -200, -331, -12, 3, 43, -43, -37, 181, -134, -289, -93]
4401i3J55j70K74k2j15K2k14Q6P0J06j5J83j82k75K62j46K0J53n8M1j22R0K49
4424B99j48j94q0J22N1N2k86K84r4j76K94j65n8M9J40l0o2J90q6O5j05j08Pj18
4448a57J69j98J84o0J06k3K08l13K08k8p0j21O3P5k81L25n2j23L17m29L6j7K51
4471G0j46K12j38J45l1K0Qk7k16j32L36j8k7mm1O0K7P9k89p9J28o4J0J93P1l69
4497b22K84Lk01L68j48o2k4m5j77J56O2NJ65k30K05l02J80j29L40k63J40j08m31
4520d34N59Om4k25K49j27k9j16R8l20M89j01k44L17l4J00j24j7J10j16q3K6J5
4543d5l8q3K14j17k6J28k2k83K88q5Q5K5Q5j51j25RJ00m9Q9m2k72L68o4l%j85
4569a99R5J35J37j50J62K3N9k01p4J82l55K97q3p7M2J7j29K02j62K21q2j12Q1
$$ y = [-93, 62, -108, 166, 144, 29, 51, -163, -77, -7, 99, 84, 267, 85, -190, 72, -74, -54, 99, 41, 82, -40, 50, 299, 151, -43, -123, -1, 50, 102, -184, 100, 6, -170, 124, -41, -99, -50, 90, 60, -2, 188, 102, 167, 62, -46, -39, -157, 12, -186, -2, -62, 44, 21, 229, -84, 124, 96, 26, -95, -32, 43, -238, 87, 35, -88, 229, -200, -164, -181, 70, -76, 136, -2, 143, 112, 132, 140, 113, -103, -235, 101, 83, 56, 52, 11, 71, 98, 177, -112, -191, -63, -127, -117, 76, 147, -222, 62, 65, -136, 232, 84, 22, -2, -47, -224, -68, -6, -1, 164, -66, 139, -163, 17, -112, 228, -35, 105, -3, -434, 125, 131, 87, -138, 111, -16, -45, -161, -63, -383, 106, 5, -239, 78, 44, 144, 20, 3, 113, -3, -86, -60, -45, -83, -166, 48, -69, -95, 33, 11, -272, 16, -69, 16, 41, 126, -25, -150, -141, -41, -90, -1, -43, -315, 53, -11, -14, -14, -199, -104, 31, 168, 18, 180, 203, 262, 61, -13, 169, -186, 111, 28, -49, -7, 10, -119, 83, -79, 142, 60, -52, 29]
4592B9L48n14J60J28l53K51J20k47K1N4j54K73k99J43K04j22n8J11m7J07j26l7
4614hK27l50L1L04k94J90j08OJ8m1O1P6l3j26K50N6L2l81j10O7J69J2l8J1L5j12
4640e6k59K12l5K55l14K89k38Q2j86M6J68J74j12k1P0j32q5M5j49J61J32j02k5
4663h0M8R0n2J26l47K88j97J90n5J44k87P4k67K45J76M5k07J08n1N3j26l7Q0P4
4687C5m99N21n6k70L41O7j39p5L2J79k5o9J0k06R3k29L89Q3j13l3j25J74J04k10
4711b1l1l3Q4ok80L01p0J44J97k39n8P2L7l23L85k57J48j46j48L42O4J7R4k12
4735F1L8j90Q1j02J2K8r8O1k4l0Q5j83N4N2J64j45K8M5Rj38M8jP4Q3Q4l85K31
4762e8j56O47k61Q8l56K35j89r0K37l7j12p9K13l9j29M9R9P0J40j33j1k59k6J55
$$ y = [29, 377, -137, 23, 151, -202, 49, 169, -78, -57, -3, -157, 116, -183, -40, 164, 42, -16, 95, 48, 155, 29, -8, 219, -131, -100, 204, -90, 100, -8, -2, 16, -25, 36, 112, 79, -47, 203, 259, 291, -90, -200, -133, 36, 48, 10, 21, 56, -56, -315, -103, -138, 117, -197, 92, -146, -64, -250, -204, -36, 138, 26, 5, 75, -57, -142, -97, -246, -85, 47, -55, -80, -32, 58, 6, 132, -215, 73, -124, 66, 11, 155, -132, -58, -325, -80, 96, 141, -66, 42, -9, 44, -82, -119, -39, 35, -464, 57, 1, -269, 72, 139, 0, -75, -43, 136, 111, 42, 52, -154, -61, -290, 99, 182, 69, 36, -89, 85, 189, -21, -52, -85, -1, -7, -287, 14, -56, 88, 285, 46, -12, 60, 97, -226, 159, -98, 50, -96, -244, 98, 162, 179, 273, 61, 99, -91, -10, -112, -100, -72, -170, -109, -133, -163, -78, -261, -207, -155, 9, -136, -108, -63, -54, -192, -144, -145, -71, 12, 96, -289, -58, -214, 433, 172, 260, -96, 139, -50, -140, 97, 60, -52, -131, 82, 43, -86, -37, 62, 132, 272, 139, 128, -131, -157, -2]
4786bK78j78m9P6k16K51l17L19q5J2N6Pj08K7k07l7J91j29K27O6l42M8K6j44K90
4811F0Q5q6m3J3J95k75K63l43K9J36mmn8L1J13N1l99L41K23m13L16l24K34R3k79
4836d5K36l4j58L2J95k58Q4j23K59l69K86j13P2l0p2P0r7J20n1j58J12K26k60
4859g6J51N6j06l3q3J18j35J96k25LK05m8KJ10j58j87J23l5K39L10m39M4j14J02
4883B0K4j45J37q2l34M47K37m2l53k0K47J15k05j74J92k07K21P9q0o6j06j19K38
4906B4N7j24k61P8L67nk36J12j9Q8o6pJ54j00k15O9J67j44O8K03j40J26j80o4
4930d8K77J20j84J2k07qk1pQ2L9k73L76l52MJ03J76k28J52p1L2K42k20O9q5J3
4955gK11j52K03l39Q8L3j04R2K2j6K1j7j01k22N8K51j95K17M0Ok12J01L5O1R6
$$ y = [-2, 276, 98, 49, 125, -91, 160, -157, 162, 77, 89, 145, 152, 44, 71, -136, -173, 18, -111, 116, 182, -160, -112, -86, -230, 60, 145, 59, 16, 29, 224, -51, 212, -131, -102, 34, 30, 26, -32, -1, 112, 163, -236, 105, 328, -85, 231, -93, 141, 234, -45, 191, 157, -1, 31, 226, -32, 52, -71, 188, -181, 105, -8, 64, 34, -38, 32, -65, 55, 4, -154, -42, 184, -76, 75, 131, 25, -8, -91, 27, -108, 88, -137, -134, 71, 23, 25, 135, -23, -210, -87, -122, 117, 427, -12, 32, -82, 20, 44, -101, 36, -46, -380, 67, 304, 262, -91, -111, 136, 251, 46, -128, 64, -143, 78, 157, 77, 11, -95, -214, 24, 81, -43, -304, -226, 141, 136, -100, 12, -7, 81, 15, 8, 162, 62, -153, -84, 83, -61, 7, 210, 70, 196, 16, -48, 229, 349, 165, 177, -30, -38, -59, -66, 16, 55, -218, 158, -194, -190, -87, 89, -139, 13, -58, -26, 216, -4, 65, -20, -7, 204, 52, 255, -84, 4, 37, -67, 25, 47, 31, 52, 35, -66, -288, -230, 21, -174, 43, 83, 89, -123, -22, 13, 74, 170]
4980A70j38m75L51j22J25M0qJ61r4J35K28k47j7j72K58k03J51j38o1o9K95K1k71
5003h0p6j47N24k99K07j85N2j15l5j26K98m3J2P8J88m17L63k06m2K72j85J38j13
5026F3n8n2J30j87P2J70lk76M0k2J62L0K2o2m5r2q7R2J30j71PJ36K13k21K5R8
5052A14K71m42J44j22k10J86P4m0J9Q2J21n0k46rJ65j06R9k24j81J34P6j96L77
5075C6l13J15O5J13O3l74L78k45K36j23J32k4J9K3j59k1J02J9m8l5p9L05k38J44
5099I1j48J15k00nL48l58K55k49O7R9NP7n6k9o6JJ98k18R6k02M00k69K83o6l90
5124b21K24j24J14K22k66l3J2K2k16K85J26l12L11j39K7L8Lp6rj60R3J63K8j81
5148f9N31n15J59l18M36m09R8L00j85L2l8p1J96o6l0J11j76n9n5o1L38k49o1J79
$$ y = [170, 32, -443, -92, -214, -89, -49, -57, 104, 10, 145, 373, 126, 109, -63, 195, -8, 143, 5, -56, -125, 170, 191, -80, -156, -303, 221, -78, 129, -56, -4, -119, -154, -280, 18, -25, -13, 65, 253, -164, 199, -7, -49, 223, 38, 176, 63, 5, -47, 83, -104, -32, 138, 135, -141, -101, -123, 39, 69, 91, 29, -16, -108, -195, -103, 27, -144, -137, -1, 212, -9, 16, 114, 385, -57, 87, -35, -245, -59, 15, -25, -6, 76, 197, 147, -99, -108, 57, -49, 50, -174, -355, -221, -145, -341, 36, -277, -162, -97, 16, 79, -295, 83, -162, 74, -49, 83, 59, 78, 101, -58, -79, 23, 42, -6, -41, -120, 185, -53, 91, -57, 58, -142, -147, 201, -157, 98, -151, -84, 15, 20, 97, 41, 12, -54, -53, 145, -73, 23, -179, 221, -48, 235, 169, -221, 3, -121, -7, 215, -51, -84, -72, -50, -266, 19, 145, -167, 144, 5, 32, 70, 73, -3, -12, -172, -79, 84, 112, -69, 462, -53, 106, -212, 224, -185, -87, 213, 28, 60, 22, -49, 147, 81, 51, 162, -14, -73, -128, -189, 149, -100, -161, 18]
5172A8L4l8q2R7j07j8J92rK79k8k79j32L57j89k9K8p2k5k74M33m01K15P6J5J35
5197A96j54j33K91p9k59MK71q7K9J15j54j23p0K36j00N8KQ7j43N6j41K61m8k28
5221a13J53NR1K5j40r0K38l79L34l48J46r8K13Q2j33K3p1K26K4l10N1L9J22l56
5245b66J96L01j06J40l88K67l72K25R8J57k11l4k47K42Q9l98K19J18R5j59Q3L5
5267H4m29M44J97n03Q1Q5J16L08o74K92R1j30q7J11R1j18J10k08K48k80J93J25
5289A47l27L42k38p1Q5M7k23K66k45J42PP3O7j90j00L11m03L53p8J0NK83l70J36
5313B9n7j25J93R8k01J02L1J00j39r4J07j27J98n1kj48L23n13J1K80jnj22J5M94
5338C96l33R8q1j81K67j57j03j4l7L67m1j12K1k9L78n71K7J05K45k14j16J01k8
$$ y = [18, 52, 14, -68, 29, -78, -96, 96, 87, 366, 338, 59, -73, 284, 95, 66, 94, 22, -3, -277, 156, -245, -30, 46, 61, 196, 42, -91, 200, 121, -138, -134, 137, 50, 79, 194, 40, -83, -153, 83, -17, 41, 43, 130, -13, 43, -98, 163, 115, -113, 40, 45, 136, 161, 21, -69, 169, -210, 124, -224, -78, -176, 37, 119, -14, 9, -62, 164, 188, -122, -71, -32, 90, -266, -70, 231, 125, 265, -123, 144, -228, -3, 95, 252, 41, 7, -240, 2, 91, -307, -88, 30, 125, -34, 49, 84, -345, 99, 296, -207, -126, -41, 75, 383, -291, 1, 92, -38, -125, -14, 77, -41, 69, -139, 109, -171, 22, 147, -180, 162, -76, -147, -62, -15, -238, 28, -217, -75, -68, 5, 72, -118, -218, 93, -310, 43, -35, -25, -20, 263, -107, 29, -28, -153, 40, 138, -63, 39, 70, 170, 31, -63, 44, -83, 115, 64, 62, -86, 237, -276, -265, 15, 14, 9, -113, -98, 396, 63, 161, 80, -101, 166, 9, -94, -108, -145, 222, 181, 69, 90, 61, 439, -132, -105, 0, 245, 31, -85, 16, -12]
5361a2M5n5j09K20j25p9m0n1K00K07k14L3o1k62K32K77k19J26N2j74R8L23n07
5384i5q9J42J61j63Q2j86K8K21j2k70J60N1j96J91K3k43J50j47P0J0J38L01k04
5407A23o2K3j84N0K28k27M8j82J66J51q3j29J02LK9L5l42p9M33q1P3m10O7M52
5431B04k74L32j84l43J75K62n6M6j04k26N5J92J47n2j58q7J11j6R5k43K79j9j73
5454c7J05r2J03j14j05ol8k8O0m02P24m03L41k81K16j35K14j15mK3n2k7O6llQ
5480A5o6l6k3J20j20k8n2K46o5J49m8q5n5J9j37L09m06L12N2r1K84l21p6L05l34
5505a32K38j3j19K1k30J14K25j16J53o9j43J56o3Q7k85Q9j83L26j48J75k71l9
5527b27K03l2n4L15k77O5M0M5k51L22k87P5M1J41j81K10r3l0k9O1Q1J2k45n0n8
$$ y = [-12, 33, -22, -131, 89, -36, -115, -155, -206, -6, 201, -13, 20, -41, -303, -71, 206, -13, 113, 165, -9, 89, 412, -95, -184, -42, 119, -44, 38, -148, -120, 101, 89, -181, -21, 30, -166, 25, 48, -195, -45, -192, -122, -112, 26, 327, 123, 61, 84, -100, -50, 178, -49, -1, -183, -17, 134, 51, -78, 24, 27, 56, 91, -251, -330, 103, 22, 95, -315, -248, 204, -70, 262, 78, -265, -90, 172, 116, 162, 58, -168, -113, 79, 226, 174, 16, -71, 40, 24, 119, -124, 155, 136, -37, 68, -24, 79, -35, -140, -146, -184, -212, -152, -554, 170, -233, 108, -173, 43, -92, 122, 7, 3, 26, -26, -53, 13, 10, 7, 15, -51, -87, -110, 10, -110, -138, -190, 56, -9, 140, 92, 7, -48, -29, -166, 143, -263, 49, 101, 10, 294, -27, -103, 202, -132, 106, 93, -26, -5, -235, -121, 104, -12, 141, 72, -71, 85, 22, 109, -176, -87, -270, 56, -92, 83, -188, -227, -24, -56, -110, 205, -72, -7, 33, 78, -173, 149, -138, -63, -22, 119, -62, 148, 55, 25, -4, 57, 138, 150, -95, -145, -203]
5552b03j25L77J73k27j8j55Lq6K0P5K5J68m4o7M9J88l31m7K40J44l18K29j95J8
5576a07J1qK59m0L4j45j44L43j96J01k79O8J8J98k15N2l8K17l67K41j88K04O3
5599H2j87R7j37L03j54N0m5K42k45j1L3j5r9Q0K44l25o8Q4j08Q9J31Kn7r6M09
5624B99o80M89j19k6j37K27j18j65J98K51l39Q4J41j40J00q3kJ37r7r0Q0l55M78
5647A33k95K10l8j13k22J90K93l66J70N0o1o8J40K12n56M12p0n6nJ45k57M5L23
5670B16l09p9K18j12n6L72j66p1K42o8n50N6L40Pk06K08J29p4j24j37R1R7k54
5693b30L09n7j06r7L13k84K9MJ63lj05j85K24n0k07K66q8K50M2p0j94q2J79J47
5717A68j75j2Q7k83L51j08k17j71L37N9m9O7O1l65J99J20k40J2K40l55K18K10
$$ y = [-203, -328, 49, 222, -5, -23, -178, -175, -261, -241, -166, -141, 27, -17, -84, -35, 153, -178, -225, 15, 159, -159, 70, -125, -107, -96, -104, 155, 115, 149, 4, -140, 203, 7, 108, -171, -103, -85, 113, -102, -50, -88, 129, -238, 3, -185, 19, 82, -105, -8, -145, 158, 4, 54, 9, 251, 6, -5, 28, 13, -86, -6, 238, -87, -155, -71, -179, -90, 41, 43, -14, -110, 299, -381, 108, -11, -37, -174, 53, -65, -230, -32, 219, -120, -36, 105, -35, 65, -18, -20, 117, 20, -70, 10, -345, 133, -162, 48, 10, -103, -325, -135, 158, -208, -38, 12, -49, -117, 23, 235, -321, 91, 21, -35, -40, 105, -152, -107, 216, -93, -172, 46, -66, -122, 250, 84, 13, 255, 187, -363, -307, 33, 40, -166, 42, 171, 97, -27, -164, -73, 24, -230, 79, 22, -84, -181, 132, -152, -123, -119, 44, 41, -64, -249, -25, -75, -282, -16, -104, 146, 188, 118, -76, -158, 21, 168, -7, -19, 68, -215, 136, 28, -189, -360, -23, 36, -13, 54, 115, -250, -51, 69, -171, -159, 81, -274, -56, 154]
$$ [...]
8191B01
##END NTUPLES=NMR FID
##END=
