##TITLE=1H_LR-774-CK
 CDCl3
 8 sc, 
 20.11.2023
##JCAMPDX= 6.0         $$ Bruker NMR JCAMP-DX V2.0
##DATA TYPE= NMR FID
##DATA CLASS= NTUPLES
##ORIGIN= UXNMR, Bruker Analytische Messtechnik GmbH
##OWNER= root
$$ XWIN-NMR		Version 3.5
$$ Mon Nov 20 16:10:42 2023 Russian Standard Time (UT+4h)  she@DPX200
##.OBSERVE FREQUENCY= 200.1313
##.OBSERVE NUCLEUS= ^1H
##.DELAY= (6, 6)
##.ACQUISITION MODE= SIMULTANEOUS
##.ACQUISITION SCHEME= undefined
##.AVERAGES= 8
##.DIGITISER RES= 18
##SPECTROMETER/DATA SYSTEM= spect
##.PULSE SEQUENCE= zg30
##.SOLVENT NAME= CDCl3
##.SHIFT REFERENCE= (INTERNAL, CDCl3, 0, 15.7039)
##AUDIT TRAIL= $$ (NUMBER, WHEN, WHO, WHERE, WHAT)
$$ ##TITLE= Audit trail, XWIN-NMR		Version 3.5
$$ ##JCAMPDX= 5.01
$$ ##ORIGIN= Bruker BioSpin GmbH
$$ ##OWNER= she
$$ F:/spectra/data/she/nmr/H-F/1/audita.txt
$$ ##AUDIT TRAIL=  $$ (NUMBER, WHEN, WHO, WHERE, WHAT)
(   1,<2023-11-20 16:09:36.71 +0400>,<she>,<DPX200>,
      <created by zg, POWCHK disabled, PULCHK disabled
       configuration hash MD5:
       00 E9 B6 7A A2 85 ED C7 34 08 36 98 17 FE 4E 26
       data hash MD5: 16K
       52 4B 7E 1C 69 F5 AF 37 D7 12 3C D0 A8 C4 F2 8A>)
$$ ##END=
$$ 
$$ hash MD5
$$ F5 71 F1 50 68 6A E4 DC 4F E9 1E 75 1E 88 02 8F
##$RELAX= 
##$RELAX= 
##$RELAX= 
##$RELAX= 
##$RELAX= 
##$RELAX= 
$$ Bruker specific parameters
$$ --------------------------
##$DU= <F:/spectra>
##$EXPNO= 1
##$NAME= <H-F>
##$PROCNO= 1
##$TYPE= <nmr>
##$USER= <she>
##$AMP= (0..31)
100 100 100 100 100 100 100 100 100 100 100 100 100 100 100 100 100 100 
100 100 100 100 100 100 100 100 100 100 100 100 100 100 
##$AQSEQ= 0
##$AQ_mod= 1
##$AUNM= <au_zg>
##$AUTOPOS= <>
##$BF1= 200.13
##$BF2= 200.13
##$BF3= 200.13
##$BF4= 200.13
##$BF5= 200.13
##$BF6= 200.13
##$BF7= 200.13
##$BF8= 200.13
##$BYTORDA= 1
##$CFDGTYP= 0
##$CFRGTYP= 5
##$CHEMSTR= <none>
##$CNST= (0..31)
1 1 145 1 1 1 1 1 1 1 1 1 1 1 1 1 1 1 1 1 1 1 1 1 1 1 1 1 1 1 1 1 
##$CPDPRG= <>
##$CPDPRG1= <>
##$CPDPRG2= <>
##$CPDPRG3= <>
##$CPDPRG4= <mlev>
##$CPDPRG5= <mlev>
##$CPDPRG6= <mlev>
##$CPDPRG7= <mlev>
##$CPDPRG8= <mlev>
##$CPDPRGB= <>
##$CPDPRGT= <>
##$D= (0..31)
0 1.2 0 0 0 0 0 0 0 0.06 0 0.03 0 0 0 0 0.0002 0 0 0 0 0 0 0 0 0 0 0 0 
0 0 0 
##$DATE= 1700482176
##$DBL= (0..7)
120 120 120 120 120 120 120 120 
##$DBP= (0..7)
150 150 150 150 150 150 150 150 
##$DBP07= 0
##$DBPNAM0= <>
##$DBPNAM1= <>
##$DBPNAM2= <>
##$DBPNAM3= <>
##$DBPNAM4= <>
##$DBPNAM5= <>
##$DBPNAM6= <>
##$DBPNAM7= <>
##$DBPOAL= (0..7)
0.5 0.5 0.5 0.5 0.5 0.5 0.5 0.5 
##$DBPOFFS= (0..7)
0 0 0 0 0 0 0 0 
##$DE= 6
##$DECBNUC= <off>
##$DECIM= 32
##$DECNUC= <off>
##$DECSTAT= 4
##$DIGMOD= 1
##$DIGTYP= 9
##$DL= (0..7)
0 120 120 120 120 120 120 120 
##$DP= (0..7)
150 150 150 150 150 150 150 150 
##$DP07= 0
##$DPNAME0= <>
##$DPNAME1= <>
##$DPNAME2= <>
##$DPNAME3= <>
##$DPNAME4= <>
##$DPNAME5= <>
##$DPNAME6= <>
##$DPNAME7= <>
##$DPOAL= (0..7)
0.5 0.5 0.5 0.5 0.5 0.5 0.5 0.5 
##$DPOFFS= (0..7)
0 0 0 0 0 0 0 0 
##$DQDMODE= 0
##$DR= 18
##$DS= 0
##$DSLIST= <SSSSSSSSSSSSSSS>
$$ [...]
##$SUBNAM2= <"">
##$SUBNAM3= <"">
##$SUBNAM4= <"">
##$SUBNAM5= <"">
##$SUBNAM6= <"">
##$SUBNAM7= <"">
##$SUBNAM8= <"">
##$SUBNAM9= <"">
##$SW= 18.0517328524113
##$SWIBOX= (0..15)
0 0 2 0 0 0 0 0 0 0 0 0 0 0 0 0 
##$SW_h= 3612.71676300578
##$TD= 16384
##$TD0= 1
##$TE= 0
##$TE2= 300
##$TE3= 300
##$TEG= 300
##$TL= (0..7)
0 120 120 120 120 120 120 120 
##$TP= (0..7)
150 150 150 150 150 150 150 150 
##$TP07= 0
##$TPNAME0= <>
##$TPNAME1= <>
##$TPNAME2= <>
##$TPNAME3= <>
##$TPNAME4= <>
##$TPNAME5= <>
##$TPNAME6= <>
##$TPNAME7= <>
##$TPOAL= (0..7)
0.5 0.5 0.5 0.5 0.5 0.5 0.5 0.5 
##$TPOFFS= (0..7)
0 0 0 0 0 0 0 0 
##$TUNHIN= 0
##$TUNHOUT= 0
##$TUNXOUT= 0
##$USERA1= <user>
##$USERA2= <user>
##$USERA3= <user>
##$USERA4= <user>
##$USERA5= <user>
##$V9= 5
##$VALIST= <valist>
##$VCLIST= <CCCCCCCCCCCCCCC>
##$VD= 0
##$VDLIST= <DDDDDDDDDDDDDDD>
##$VPLIST= <PPPPPPPPPPPPPPP>
##$VTLIST= <TTTTTTTTTTTTTTT>
##$WBST= 1024
##$WBSW= 4
##$XGAIN= (0..3)
0 0 0 0 
##$XL= 0
##$YL= 0
##$YMAX_a= 138408
##$YMIN_a= -136075
##$ZGOPTNS= <>
##$ZL1= 120
##$ZL2= 120
##$ZL3= 120
##$ZL4= 120
##$ABSF1= 10
##$ABSF2= 0
##$ABSG= 5
##$ABSL= 3
##$ALPHA= 0
##$AQORDER= 0
##$ASSFAC= 0
##$ASSFACI= 0
##$ASSFACX= 0
##$ASSWID= 0
##$AUNMP= <proc_1d>
##$AZFE= 0.1
##$AZFW= 0.1
##$BCFW= 1
##$BC_mod= 2
##$BYTORDP= 1
##$COROFFS= 0
##$CY= 11.3945322036743
##$DATMOD= 1
##$DC= 2
##$DFILT= <>
##$DTYPP= 0
##$F1P= 15.7292609196834
##$F2P= 12.9074282941183
##$FCOR= 0.5
##$FTSIZE= 0
##$FT_mod= 4
##$GAMMA= 1
##$GB= 0.15
##$INTBC= 1
##$INTSCL= 1
##$ISEN= 128
##$LB= 0.24
##$LEV0= 0
##$LPBIN= 0
##$MAXI= 10000
##$MC2= 0
##$MEAN= 0
##$ME_mod= 0
##$MI= 1.114404
##$NCOEF= 0
##$NC_proc= 0
##$NLEV= 6
##$NOISF1= 3.799351
##$NOISF2= 2.8
##$NSP= 1
##$NTH_PI= 0
##$NZP= 0
##$OFFSET= 15.70392
##$PC= 1
##$PHC0= -23869.17
##$PHC1= 9.052692
##$PH_mod= 1
##$PKNL= yes
##$PPARMOD= 0
##$PSCAL= 0
##$PSIGN= 0
##$REVERSE= no
##$SF= 200.130013532006
##$SI= 16384
##$SIGF1= 3
##$SIGF2= 2
##$SINO= 400
##$SIOLD= 16384
##$SREGLST= <1H.CDCl3>
##$SSB= 0
##$STSI= 0
##$STSR= 0
##$SW_p= 3612.71676300578
##$SYMM= 0
##$S_DEV= 0
##$TDeff= 0
##$TDoff= 0
##$TI= <>
##$TILT= no
##$TM1= 0
##$TM2= 0
##$TOPLEV= 0
##$USERP1= <user>
##$USERP2= <user>
##$USERP3= <user>
##$USERP4= <user>
##$USERP5= <user>
##$WDW= 1
##$XDIM= 8192
##$YMAX_p= 0
##$YMIN_p= 0
$$ End of Bruker specific parameters
$$ ---------------------------------
##NTUPLES= NMR FID
##VAR_NAME=  TIME,          FID/REAL,        FID/IMAG
##SYMBOL=    X,             R,               I
##VAR_TYPE=  INDEPENDENT,   DEPENDENT,       DEPENDENT
##VAR_FORM=  AFFN,          ASDF,            ASDF
##VAR_DIM=   8192,          8192,            8192
##UNITS=     SECONDS,       ARBITRARY UNITS, ARBITRARY UNITS
##FACTOR=    0.0002768,     1,               1
##FIRST=     0,             0,               0
##LAST=      2.2672688,     0,               0
##MIN=       0,             -136075,         0
##MAX=       2.2672688,     138408,          0
$$ Real data points
##PAGE= N=1
##DATA TABLE= (X++(R..R)), XYDATA
0 0 0 0 0 0 0 0 0 0 0 0 0 0 0 0 0 0 0 0 0 0 8 -8 8 -8 8 -8 14 -16 16 -16 23 -24 26 -32 34 -40 46 -48 56 -63 70
41 70 -78 86 -95 105 -116 129 -140 154 -170 189 -207 230 -254 278 -309 342 -381 427 -478 542 -618
62 -618 718 -844 1015 -1263 1651 -2355 4012 -16635 20862 84675 20805 -83363 -59105 85078
76 85078 138408 45607 -59833 -63254 12382 84887 57064 -65070 -136075 -54541 54759 40195
88 40195 -53399 -86756 -31508 57947 114183 72521 -39572 -68805 42540 131131 57151 -74346
100 -74346 -95736 -13125 52341 31358 -53060 -106525 -49268 62269 83185 -5414 -70483 -32749
112 -32749 44142 77925 46583 -21690 -54489 4145 84821 63832 -39934 -84123 -22396 46491
124 46491 38140 -26185 -78977 -65400 7965 59269 23663 -42645 -38692 31464 80183 59581
136 59581 -1274 -42658 -19334 45215 59188 -15150 -87099 -64903 11869 40963 -2124 -53395
148 -53395 -50841 9279 65004 51137 -16926 -47776 240 61132 56483 -4409 -50955 -35415
160 -35415 21044 48899 5557 -59105 -61113 2212 45815 17658 -40102 -54315 -6786 49992
172 49992 52694 793 -37704 -11945 43973 58083 10274 -43515 -44599 2598 35449 8648
184 8648 -46538 -61336 -14929 37267 36739 -9269 -38334 -10304 43825 56845 13605 -32887 -27589
197 -27589 17599 42582 14886 -35510 -50954 -11899 31892 23998 -24433 -49393 -19240 27997
209 27997 39092 4844 -31283 -22357 25496 54389 25833 -22886 -30506 5995 35494 20515
221 20515 -23625 -49920 -28040 16401 26118 -11363 -43234 -23463 23775 44095 21041 -14339
233 -14339 -20218 12024 43383 29808 -17282 -39882 -12984 22337 20566 -13647 -40227 -28350
245 -28350 10286 31776 8369 -29063 -28548 10896 38116 23347 -11183 -23453 -683 31900
257 31900 33945 -1467 -33205 -21427 14538 24425 -4988 -36763 -34663 -2004 24792 15708 -16219
270 -16219 -26897 3486 38248 34537 156 -21634 -8755 19385 26969 374 -32189 -31898 1024
283 1024 23658 7459 -23195 -28548 -1076 26520 23854 -4755 -24568 -9207 22545 29904 3031
296 3031 -22878 -17404 11236 27235 10527 -19664 -27899 -4569 20172 13694 -15881 -30440 -11803
309 -11803 17713 24609 3051 -18218 -11217 17261 31238 12839 -16228 -22616 -849 18714 10274
322 10274 -17625 -30360 -12038 15623 20254 -1178 -19378 -10875 15537 28056 10455 -16452
334 -16452 -18939 3430 21172 11644 -13460 -24024 -7494 16134 18362 -4631 -23297 -13577 11805
347 11805 21244 3205 -17613 -16706 5248 23202 15045 -9052 -18660 -855 19694 16162 -6996
360 -6996 -22820 -14604 6379 14691 -332 -20427 -17666 6784 23126 13115 -7662 -13583 2435
373 2435 19995 16846 -5320 -21287 -11766 9619 13994 -3278 -19993 -15668 4362 17276 8807
386 8807 -11000 -16372 420 19051 15312 -4883 -16180 -5135 14365 18026 1542 -15784 -12663
399 -12663 5328 15554 2816 -16600 -19275 -2976 13039 10058 -6442 -15070 -3037 16205 20004
412 20004 4137 -11743 -8054 8733 16553 3275 -15860 -17608 -2101 11730 6567 -9701 -16672
425 -16672 -4473 12926 15217 -63 -13209 -7418 9743 16670 5202 -10624 -11991 3056 15730
438 15730 9840 -9019 -16200 -3784 10387 8966 -6189 -16049 -9847 5679 13606 4186 -10352
451 -10352 -9240 7075 17926 10170 -5968 -11392 -2653 10302 9852 -5621 -17958 -10042 7973
464 7973 11381 -859 -11236 -7871 4518 13157 8312 -6508 -13363 -1032 13676 9642 -5630
477 -5630 -12010 -3972 7834 11660 1820 -11668 -11380 4320 13057 2177 -11555 -10729 521 9192
491 9192 8188 -1566 -10386 -4533 10842 13524 -902 -11625 -6777 4060 7835 2590 -7722 -12151
505 -12151 -1650 12095 9391 -5530 -10500 -751 8495 8388 -93 -9267 -9546 2550 12219 3315
519 3315 -11024 -9727 3503 10978 6193 -3024 -9115 -4059 8296 11067 -2292 -13050 -6111 7319
533 7319 9498 921 -7406 -7630 995 10466 6823 -7196 -12235 -725 9749 6017 -3571 -7550 -3278
548 -3278 5231 11085 4004 -8458 -7815 4461 9610 1632 -7748 -8897 -2595 5184 6520 -2117 -9689
563 -9689 -3906 8492 9598 308 -6012 -3867 2329 7290 5098 -4499 -9894 -1598 8869 6414 -4408
578 -4408 -8618 -2871 4552 6658 206 -8350 -7829 2901 9528 3035 -5926 -5678 2149 8024 6649
593 6649 -1040 -7916 -4066 5692 7300 -2230 -9923 -6232 3131 6547 1968 -5540 -6724 1273 8940
608 8940 5735 -3783 -7003 -776 6245 5704 -880 -6463 -4714 3533 8032 2010 -7042 -6845 1427 6318
624 6318 2592 -5251 -7727 -1785 5719 5799 -884 -5617 -2201 5471 7630 1876 -4981 -5171 1116 5870
640 5870 2934 -4879 -7855 -1931 5583 5093 -1982 -6631 -2921 4699 6237 647 -5557 -4988 1735 6138
656 6138 3674 -3409 -5255 115 6386 5172 -1615 -6284 -3341 3011 4786 -722 -7036 -5776 1738
671 1738 6003 2186 -3744 -4280 1298 6210 5151 -1163 -5474 -2513 4114 5418 -1009 -6148 -4002
686 -4002 2163 5324 2234 -3601 -5621 27 5310 3271 -3345 -5827 -1283 4226 4432 280 -3873
701 -3873 -2732 3261 6606 2330 -4279 -4687 781 4214 1823 -3621 -5874 -2437 3613 4729 -764
716 -764 -5050 -2024 3617 5158 1124 -3430 -3828 781 4919 2790 -2984 -5101 -472 4631 3525 -996
732 -996 -4480 -2782 1896 4345 93 -4914 -4447 1256 4244 2035 -2534 -3271 223 4464 4317 -716
748 -716 -4488 -2216 2802 3745 -830 -4508 -3695 1008 4019 2119 -2671 -4348 -120 4200 2994 -1912
764 -1912 -4128 -1646 2869 3829 313 -3587 -2701 2382 4791 1730 -3123 -3616 35 3083 1889 -2330
780 -2330 -4548 -2088 2502 3131 -255 -3615 -1897 2014 4049 1579 -2443 -3137 541 3682 2521 -1698
796 -1698 -3889 -854 2657 2961 -479 -3726 -2926 1234 3007 296 -3383 -3718 387 3574 2498 -1310
812 -1310 -2643 127 3566 3665 -184 -2877 -1867 1633 2927 -51 -3559 -3717 390 2757 1583 -2118
828 -2118 -3456 -559 2919 2926 -583 -2903 -1189 2466 3620 669 -2088 -2097 972 2908 1572 -2144 -3826
845 -3826 -990 2047 1429 -1887 -3343 -1829 1859 2883 839 -2137 -1396 1906 3621 1698 -1642 -2796
861 -2796 -57 2314 1745 -1540 -3572 -1653 1518 2362 -517 -2980 -2103 860 2948 987 -2001 -2340
877 -2340 402 2943 2348 -415 -1947 -30 2373 2487 -232 -3029 -1971 788 1592 40 -2424 -2801
893 -2801 59 2635 1891 -1057 -1862 55 2538 2410 -96 -2135 -1377 1292 2437 759 -1882 -2273
909 -2273 557 2179 977 -1463 -2577 -1023 1526 1746 -877 -2596 -1214 1479 2349 753 -1128 -1192
925 -1192 1007 2600 1668 -1457 -2425 -472 1929 1174 -1128 -2317 -1417 1110 2132 657 -1958 -1494
941 -1494 912 1876 866 -1530 -1841 -99 1862 1964 -126 -2027 -663 1663 2132 129 -2215 -1562
957 -1562 -81 1385 391 -1699 -2411 -306 1905 1508 -815 -1439 34 1688 1906 535 -1389 -1608 906
974 906 2228 214 -1829 -1957 273 1565 679 -770 -2073 -756 1328 1774 -524 -1811 -418 1079
990 1079 1929 857 -490 -784 415 2180 1523 -1172 -2009 -427 808 652 -757 -1926 -1696 411 1675
1007 1675 199 -1545 -1105 820 1827 931 -319 -1070 -269 1322 1516 -163 -1904 -955 1222 1183 -406
1024 -406 -1599 -1639 -214 1021 695 -1516 -1831 154 1893 1372 6 -659 -297 1146 1728 493 -1590
1041 -1590 -1611 267 1156 324 -1443 -1377 -265 791 1106 -288 -1579 -214 1138 1293 31 -915 -462
1058 -462 559 1610 931 -699 -1365 93 1457 617 -793 -1485 -907 412 732 -221 -1598 -1073 353
1075 353 1245 517 -658 -883 334 1654 1127 -424 -1245 -499 1043 1040 -265 -1281 -1013 275 854 33
1093 33 -944 -1313 169 885 558 -358 -1143 167 1316 1273 20 -893 -396 912 1345 203 -892 -1038
1111 -1038 -101 822 377 -1133 -1317 -233 703 723 -414 -1124 -594 627 1262 508 -856 -513 790 1471
1129 1471 744 -393 -990 -161 850 608 -485 -1398 -1107 490 557 -475 -1008 -774 407 1269 982 -207
1147 -207 -371 529 1447 1029 -363 -961 -339 470 498 -381 -1116 -1183 63 826 -140 -694 -857 -28 843 996
1167 996 -53 -854 -69 1459 1207 94 -494 -464 194 734 -43 -1154 -1331 -351 445 198 -707 -864 -135
1186 -135 809 715 79 -282 40 1049 1351 371 -755 -567 467 907 590 -538 -1110 -152 294 745 -621
1205 -621 -1278 -512 465 700 134 -364 -559 715 1375 868 -168 -878 182 673 500 -256 -882 -718 112
1224 112 333 -195 -1127 -551 202 820 162 -225 -583 237 792 429 -5 -697 -168 611 941 -46 -636 -455
1244 -455 -362 581 331 -616 -892 -209 545 470 -374 -638 -451 549 853 306 -525 12 588 960 373 -326
1264 -326 -407 49 552 194 -409 -724 -331 407 396 -323 -451 -710 84 702 91 -623 -362 215 968 688 -243
1285 -243 -105 91 373 596 -414 -670 -740 72 565 -441 -798 -643 -19 260 254 -284 -443 249 623 613 84
1306 84 -237 -91 637 436 194 -561 -1060 -72 391 -84 -551 -775 -318 448 337 -84 -546 82 758 909
1326 909 430 -121 153 442 704 345 -408 -266 -284 134 -129 -438 -755 -503 67 366 107 -408 -427 579
1346 579 654 523 -121 -166 127 668 526 -334 -309 -429 220 324 -359 -861 -753 -188 369 29 -355 -179 178
1367 178 517 529 111 -143 159 807 741 142 -516 -496 -114 295 -128 -427 -756 -138 -16 23 -390 -499 110
1388 110 628 375 270 -148 -20 394 385 464 -211 -313 28 174 151 -417 -356 -344 41 -43 -351 -498 -241 331
1410 331 560 153 -184 -26 353 650 257 -280 -426 105 427 137 -194 -347 -237 26 213 -150 -552 -568
1430 -568 81 336 95 -116 -151 9 497 455 208 -250 -175 467 294 1 -223 -185 -15 359 146 -460 -650
1451 -650 -135 211 176 -152 -660 -176 258 330 149 -38 -33 261 705 408 -299 -236 66 130 60 -198 -614 -413
1473 -413 -17 -15 40 -330 -396 407 313 91 -176 -243 377 434 529 349 77 -154 273 186 -23 -254 -457 -157 17
1496 17 -124 -594 -228 -98 232 570 143 -88 -55 549 543 59 -293 -371 103 52 -400 -659 -590 -300 100 111 -189
1519 -189 -459 -194 132 243 132 -319 -123 338 546 118 303 41 308 496 43 -183 -272 -265 -154 -38 -304
1540 -304 -538 -273 234 169 141 -63 -103 509 723 209 113 131 181 201 237 -293 -204 -359 -48 8 -282 -240 -507 65
1564 65 218 72 -4 -42 77 480 279 202 94 42 322 298 -269 -139 -108 121 14 -29 -411 -345 89 39 383
1587 383 -326 -289 46 126 258 20 -292 157 428 249 -37 -143 -212 113 221 -108 -172 -403 -218 -119 -5 -33
1609 -33 -244 -251 46 406 -33 -98 -5 307 521 259 -143 -117 241 112 187 -130 -295 -49 51 -138 27 -71 -271
1632 -271 -267 346 236 -279 -16 183 347 366 54 57 144 208 193 109 -399 -266 -37 -96 -224 -425 -254 -120 -100 40
1656 40 -238 -16 78 253 299 294 241 276 378 343 -92 -9 -286 -210 301 -197 -146 -429 -494 -16 146 -217 -249 105
1680 105 356 373 136 141 -35 257 10 -19 -57 -118 45 25 -210 -41 -283 -192 -30 -114 -70 -305 -171 212 206 43
1704 43 -47 63 306 272 240 -110 -129 -138 -149 173 -239 -266 -226 -258 -146 -24 -371 -529 -185 117 36 -70 -126 262
1728 262 96 264 44 8 23 65 32 -21 -38 -245 -30 -290 109 -263 -16 -27 -25 319 -87 156 109 -68 368
1751 368 -28 80 -47 63 357 54 -84 -129 -262 -112 -241 -350 -305 -274 -87 167 -42 91 -28 289 195
1772 195 229 -51 -87 357 150 264 134 -257 -148 -257 82 90 -290 -405 -93 29 163 -18 -173 12 378
1793 378 138 -33 118 1 331 360 -168 -169 55 -66 0 -325 -437 -200 -186 -190 145 187 -129 -158 -80 302 60
1816 60 -194 152 87 102 207 109 -115 -79 153 149 -117 -178 -103 24 -157 -173 -353 -391 -23 72 -167 8 175 259
1840 259 114 55 -58 -181 187 -153 272 -132 -30 -268 68 114 -197 -267 -243 42 88 -56 -132 -191 142 -51
1862 -51 281 347 -127 -31 -98 255 76 -209 -96 -191 -22 -231 -205 190 -257 -114 73 164 -165 -20 353 128
1884 128 108 184 129 167 238 -11 -201 155 -416 -68 -39 -111 -144 -297 -279 -132 118 -140 275 133 187 -11 118
1907 118 135 18 533 67 13 -205 -55 158 478 -235 -277 -396 -32 -114 -226 -172 -37 5 -11 165 78 96 161
1930 161 22 306 134 -15 57 -104 -24 -218 -2 -402 -211 -154 59 -140 -153 37 38 309 -127 -147 81 103 68
1953 68 253 -64 -120 146 60 56 -55 -299 -114 -79 -12 -208 154 13 282 -192 -117 45 258 80 178 389 147
1976 147 324 -209 -60 22 -55 -212 -75 -241 -184 -43 -111 -206 69 -169 -2 43 -30 39 -13 233 12 -38 260
1999 260 235 112 59 -71 129 -249 -170 -105 -237 -357 -148 102 9 94 145 112 197 162 63 -221 138 90 -67 138
2023 138 -101 -54 -30 -38 -153 -179 -224 -185 -10 -123 -93 76 53 105 51 254 211 -156 -17 343 322 34 -140 185
2047 185 -89 24 -112 29 -263 -89 -324 -18 58 -45 15 123 15 29 116 -27 151 178 205 57 399 -83
2069 -83 -78 207 -4 -217 -83 -8 32 -309 -190 -140 -246 65 54 250 115 238 230 334 63 -116 148 371 282
2092 282 3 -401 -92 -280 -122 -208 -60 -16 -315 146 -111 -53 283 -24 68 307 59 27 35 -67 -29 -136 -187
2115 -187 -46 -257 -53 -235 -283 70 83 48 50 142 87 -191 350 44 -175 156 154 92 -24 102 -38 205 -206
2138 -206 59 61 -91 -233 -160 32 -250 -22 -81 -188 207 42 -29 120 -12 117 -86 30 81 40 -229 16
2160 16 -147 70 -174 -208 157 -32 -11 152 -157 -125 33 -194 36 -152 331 301 -7 140 -31 -86 261 -95
2182 -95 75 152 -186 -100 -96 106 -81 -202 20 -12 -4 -54 15 -5 71 70 -228 -118 220 146 139 3 -67 -117 -142 -10 -125
2209 -125 -187 -134 -92 -19 6 -98 -34 100 174 -145 34 40 -38 54 110 125 48 -174 111 -121 -58 -103 -311 44 -325
2234 -325 213 -146 -8 -29 -9 194 -27 42 -183 407 86 166 9 -66 44 -96 -259 15 -410 -50 -267 -43
2256 -43 93 -165 89 -109 306 -42 -132 49 32 103 238 89 43 178 49 -327 -169 -297 -105 -209 -59 -16
2278 -16 -25 -249 -86 -70 50 244 55 69 287 223 -40 -9 -255 165 114 -87 56 -221 -115 47 9 -64 -217
2301 -217 -194 11 -46 -22 89 257 277 -49 210 164 31 359 208 -83 101 50 -187 -185 -33 -238 -168 6 112
2324 112 -304 -213 -113 -91 142 114 51 258 222 76 345 208 7 62 81 -3 -61 -196 -107 -220 -9 -67 -389 -290
2348 -290 -24 21 -147 134 94 49 98 -21 271 -24 101 -16 220 -9 -259 -70 -96 -67 -31 -97 -83 -30 11 -60
2372 -60 44 262 137 278 135 78 -19 -27 190 -45 -53 -21 -50 -105 -449 -23 -4 -73 -104 -247 -38 212 64 -117
2396 -117 30 139 237 88 -136 74 60 48 163 -137 -89 200 38 -82 -134 215 -310 47 -179 14 125 87
2418 87 187 31 303 166 33 168 -23 -46 281 -196 -89 33 -39 2 -99 -87 95 -136 -66 -89 -163 -150 -145 -85
2442 -85 201 289 252 362 4 -59 85 81 -30 -48 -106 -44 -27 98 -9 -238 -247 -39 -228 134 -41 164 -32 214
2466 214 153 -4 23 63 -98 156 32 -133 12 58 -65 -108 106 -117 -84 -67 -136 -115 74 -125 59 307 335
2489 335 41 -97 47 35 -13 137 -30 -144 -147 -178 -308 -148 -272 -12 -183 -3 82 -27 54 73 90 190 111
2512 111 -22 -140 69 42 -142 -45 64 103 -373 24 -138 -164 -259 94 54 -25 3 192 60 79 -175 -167 17 -4
2536 -4 -73 280 139 -264 -194 -103 -23 182 44 -120 -179 53 -96 164 -39 235 -139 -241 -129 222 192 133 33
2559 33 131 149 -69 24 -196 183 -7 -11 -97 -18 -188 175 -212 67 131 58 -126 54 327 17 272 185 46 110
2583 110 -52 -249 38 -52 -51 -203 -61 -245 -34 -33 55 145 -165 213 230 -215 262 -234 50 -22 -77 3 -215 92
2607 92 35 -106 -204 34 -30 -250 -279 -194 106 56 7 1 -17 248 29 37 123 99 90 125 74 -8 -227 78 -41 92 112
2634 112 132 234 74 115 -50 28 80 257 -49 84 191 96 24 100 -108 224 -133 108 100 -169 -159 -54 -112 -164
2658 -164 -147 -41 -9 -53 170 -166 231 -31 193 -93 -109 169 -26 549 -61 -76 13 -160 -247 -212 -215 -21 -68 90
2682 90 -148 -129 -161 116 117 43 239 169 -195 -40 -69 63 1 243 -89 76 3 68 10 -126 -176 -97 -84 36 -143
2707 -143 32 -17 -113 133 126 140 174 41 14 -10 -16 -129 2 112 3 -172 102 43 -138 -176 192 13 -54 48
2731 48 -74 -134 78 -212 254 86 -228 276 107 -34 -116 -250 -42 -138 50 -200 -81 -108 -221 81 -80 -38
2753 -38 74 52 -26 359 -52 114 219 29 -109 14 -186 -27 -66 -121 30 -230 30 108 394 -154 -209 -36
2775 -36 -41 -228 53 1 131 184 137 291 -79 -195 -172 1 -89 -149 225 -53 -81 -119 88 163 20 146 -48 112
2799 112 -159 -57 317 3 95 -102 -113 53 -124 197 181 -102 -164 -177 -122 -112 -130 -2 -155 257 334 -85 126
2822 126 84 -39 15 202 138 -20 2 221 -195 -47 14 99 -125 175 -339 -13 -77 0 15 -172 286 106 171
2845 171 -199 146 -81 158 34 251 -95 -98 -39 -240 -26 0 -225 87 -151 71 -91 68 71 99 -94 -121 59
2868 59 179 197 -110 73 163 -134 -195 -103 -189 -41 -252 -198 259 103 172 -2 -29 281 -86 247 162 50 -85
2891 -85 19 79 -97 61 238 -118 -165 211 -215 75 -143 -191 -33 -9 -13 164 -107 121 -157 527 -27 345
2913 345 -44 124 90 -5 94 36 -33 -242 169 -85 21 113 76 -72 161 93 -87 -96 189 -7 189 44 -21 10
2937 10 133 -7 -98 -42 221 8 -129 -249 -362 -253 -83 -72 58 233 -4 -247 83 493 51 79 184 -84
2959 -84 18 -87 -70 -13 -149 36 -256 111 49 -85 -86 -185 -120 -105 -36 77 -161 64 339 -186 -28 116 121 241
2983 241 -47 73 -150 -168 -134 86 145 -88 -72 -79 -16 13 99 -39 7 171 234 285 8 27 -51 -34 83 -2 -62 -99
3009 -99 97 -66 -251 -290 -136 -124 71 -38 -227 -238 -210 77 329 136 193 100 -188 6 -180 -115 145 -23 -84
3032 -84 188 -283 -26 33 -249 6 151 -132 35 -241 172 -120 25 140 32 146 58 151 34 95 72 -157
3054 -157 -176 -249 101 4 -20 220 84 -40 -87 -142 217 -223 311 83 103 451 -60 -12 119 -219 -213 6 -283
3077 -283 21 -84 154 60 -17 -190 -116 91 -201 -127 369 87 1 143 -79 -335 14 -206 -305 -75 -146 -29
3099 -29 -81 59 -156 -200 88 38 24 145 3 10 -148 83 -211 -41 -79 239 28 -96 10 133 180 -22 -35
3122 -35 14 -106 18 67 -195 -166 262 167 -32 -71 14 367 -62 139 9 190 -138 102 128 -317 -50 -124 70
3145 70 48 -78 -149 55 -106 -71 -198 22 -159 -70 64 242 96 86 -131 207 -21 139 497 115 -114 -8
3167 -8 -301 -183 -74 237 -137 65 97 -4 -10 -113 -166 5 352 113 -76 323 143 -103 -267 106 -39 -109
3189 -109 109 -234 107 -89 -13 192 108 31 29 134 137 127 173 -77 -61 13 -113 -51 -112 -137 -43 64 -292 -67 -150
3214 -150 43 60 -363 -129 -68 53 -38 -58 -261 34 -87 17 165 34 186 -265 108 -187 230 -141 27
3235 27 -60 -73 85 123 -3 -150 -154 -26 86 -189 110 226 116 176 128 -23 -123 -108 -110 50 100 -188 -94 -67 0
3260 0 -41 326 -414 242 -84 60 -126 -20 -164 -258 141 -30 -91 42 -35 -62 197 -243 -177 -272 -133 -10 429
3283 429 159 -67 39 29 -142 -158 92 -19 56 46 103 -20 -207 -194 42 -189 -47 79 115 -70 -57 -19 60
3306 60 200 126 14 158 135 -86 53 38 9 -229 -196 -2 244 -52 -63 264 13 26 -6 -142 -154 -30 -120 52
3330 52 -18 -6 -92 -36 -108 163 -190 -117 131 133 -22 -125 16 150 -13 -5 -150 182 -171 -111 2 -294 215 -119
3354 -119 146 39 24 212 -20 -73 42 18 162 -121 159 -96 -175 -3 -92 29 -81 -22 -77 -237 100 -174
3376 -174 -143 -39 110 -57 -6 165 56 38 -94 180 -93 108 -145 -52 -69 -176 102 -50 34 172 -142 40
3398 40 -148 -5 -21 -145 127 -43 -136 53 46 194 245 336 -165 -220 138 -423 100 -20 161 13 -13 158 48
3421 48 -4 -25 183 -63 68 -15 -94 103 -203 125 143 56 106 -51 76 234 -301 -65 18 -151 99 14 16 161
3445 161 -57 294 28 109 -24 124 124 69 33 -38 196 -100 -20 -170 -63 -51 -64 -22 27 132 153 -121 -23 54 -38
3470 -38 25 -25 80 -73 -162 222 -171 186 -85 -104 85 -205 -104 12 -156 3 -75 -203 65 30 -5 352 97
3493 97 72 49 -38 -87 80 10 -98 -90 -45 175 158 -39 13 -223 191 -78 70 -36 128 -104 -26 27 -109 204
3517 204 -351 -205 61 31 28 11 9 -38 -157 41 30 41 -57 260 66 200 -24 -1 -164 -51 -45 183 23 60 -152
3542 -152 81 -348 70 -64 55 238 -45 60 2 10 69 13 66 -132 -83 102 255 10 58 60 -197 131 -12
3565 -12 63 -207 38 -158 139 111 131 67 136 -5 82 -48 56 -217 22 132 339 136 -36 34 -107 361 121
3588 121 109 14 95 -121 15 -44 69 -290 -195 -33 160 202 170 -21 40 66 -38 150 47 -210 89 -307 -118
3611 -118 -277 -11 -60 -104 -37 246 -123 -25 92 -60 46 -128 -194 43 70 -254 -45 66 116 107 -33 -175 87
3634 87 -21 4 60 -97 35 -285 5 7 -9 -258 -57 106 -19 22 20 95 -59 54 -170 -133 138 20 -21 -2
3658 -2 24 -120 -214 2 -155 232 -229 44 -120 -235 54 104 218 7 -58 -57 -191 -21 224 -131 78 107 -49
3681 -49 88 -42 -169 131 312 -2 -83 129 -76 -122 5 -31 242 83 262 -209 238 24 -122 47 -223
3702 -223 113 86 48 -52 -37 59 -35 152 319 90 -52 15 112 123 142 -15 108 19 94 -167 7 -307 299 -30
3726 -30 149 74 -128 -36 -96 355 96 323 -112 157 -146 -68 58 31 -26 119 39 15 27 -387 -23 -123 69
3749 69 -221 -23 -198 169 -7 -97 -208 -136 -105 6 -107 -286 -2 135 -131 -34 -91 50 -237 -137 155 63
3771 63 169 98 19 -180 -21 70 -139 -5 283 68 176 195 -69 -171 131 61 38 229 283 -128 -163 -95 -121 -2
3795 -2 -109 -93 -46 -134 15 42 170 361 7 -63 -58 63 -65 99 -245 -13 -403 223 105 -20 193 -109 42
3818 42 80 99 76 -54 133 115 -64 -60 253 26 -156 -125 -56 112 195 97 54 -99 265 -215 -169 -107 -117 162 -110
3843 -110 -40 166 353 207 -102 172 112 -132 -214 -187 210 -14 145 -27 -366 97 -25 -234 -268 82 21 54
3865 54 -322 105 201 -7 -112 102 53 43 10 0 25 -33 -20 -302 34 -91 -30 -34 -35 24 70 121 -155 -106 46 -9
3891 -9 131 -44 -210 -32 -147 308 -297 147 -189 -51 206 205 69 -85 -81 235 21 189 -294 -113 -111 -37 61
3914 61 83 3 -48 233 -128 -94 -59 -21 12 -142 -81 58 -211 -33 -227 -165 -177 227 -57 -144 -73 -45 -261 240 71
3939 71 -79 140 131 42 -71 -171 377 154 104 113 178 -38 -101 -22 -16 230 -182 -238 17 -34 -202 -23 -78 26 112
3964 112 -69 -122 -59 55 -177 245 23 -218 40 -364 138 176 45 93 -5 -143 -112 52 -150 224 13 -19
3986 -19 94 -97 -9 239 123 -177 51 24 127 -273 62 -47 154 -200 52 152 -75 -35 152 95 -133 -127
4008 -127 -263 -2 -6 28 -121 -173 -60 -148 -186 75 147 98 -20 -179 104 81 194 207 94 64 -39 -115 -141 127
4032 127 298 -291 -188 -106 7 -271 -124 -235 45 -71 -106 -87 -16 86 -42 13 -20 126 -64 52 -135 -9
4054 -9 40 95 112 150 -166 -11 -63 112 -248 -414 36 113 -184 -100 -43 12 177 -13 -156 -106 105 66 197 -160
4078 -160 10 171 -144 98 75 -26 -148 -242 266 111 -9 15 -21 -249 159 -56 169 99 -250 -60 -20 138
4100 138 -111 -28 -68 135 -99 156 91 -175 105 -191 -240 26 84 -37 -144 -72 166 -149 -29 -333 -135 162
4122 162 -105 75 189 102 -152 -35 55 -107 -56 151 -157 -230 114 109 32 277 176 81 -100 -70 134 66 69 169
4146 169 60 92 -209 -93 -138 31 10 55 -189 102 -233 66 296 120 -19 103 157 -247 96 116 61 -12 93
4169 93 -104 7 4 40 -157 37 -110 -140 -87 -119 41 -120 -362 75 13 209 96 -56 -77 226 59 -37 171
4192 171 -145 14 160 99 -85 42 -34 108 -162 -78 78 172 155 271 -57 156 77 28 170 189 -34 -14 -109
4215 -109 -6 -35 23 -122 31 -80 -31 111 31 308 -103 221 -43 -22 59 101 -157 141 -98 107 193 26 91
4238 91 -132 -154 102 -89 -225 -176 80 53 -37 -354 -145 -29 99 113 -67 74 91 181 -229 35 227 49 154
4261 154 -275 -13 52 -387 258 327 82 24 73 -128 8 63 52 83 122 201 3 -62 76 151 12 22 175 -396
4285 -396 5 -129 -180 188 -101 6 -248 5 102 -114 -220 -50 280 -78 -130 -163 -61 -79 -20 -19 -45 -46 -269 -244
4309 -244 42 -99 289 111 17 -365 334 -55 -14 6 11 38 -284 -310 45 113 75 -39 68 36 70 7 -25 -35 31
4334 31 -108 21 -20 37 -56 -10 -77 156 12 302 -111 -105 -18 12 -86 31 -256 54 -4 188 60 -274 262 -38
4358 -38 -41 143 100 31 -21 138 -34 356 361 100 -220 109 39 -130 -147 -126 45 28 -145 -255 -100 5 61 46 -259
4383 -259 -128 43 -95 -111 -204 10 143 -30 68 363 -81 -64 -47 -51 288 -2 171 30 -5 -108 -314 -165 50
4406 50 16 26 115 130 140 212 -221 -95 59 -117 -83 9 -157 100 69 26 215 -104 -32 -357 -240 165 -10 109
4430 109 193 -69 25 -108 16 -18 11 101 -1 191 -333 -256 98 -201 -231 -26 -51 -121 -35 -37 95 -77 129 -126
4454 -126 147 168 -190 -209 89 -120 32 61 -253 138 11 -188 219 373 38 62 -44 0 218 -90 -132 45
4476 45 -213 -177 195 -173 9 -71 22 60 -81 -100 -63 -69 -132 -167 130 98 319 -49 -47 135 122 109 -38 -78 -376 -71
4502 -71 -2 -210 -63 170 39 196 -116 -10 34 -72 39 46 31 60 -108 37 -4 -76 -56 -295 -237 -112 174 -220
4526 -220 -190 5 55 -79 -159 -224 -58 -25 -78 -207 -167 -194 -36 -223 -57 52 96 -124 114 -95 149 -3 -86
4549 -86 -146 -54 162 -9 -205 17 -58 118 -16 -101 -31 -114 100 223 173 53 -279 31 59 -87 -81 -41 -237 -142
4573 -142 3 75 190 125 -188 120 175 67 -97 -126 -99 71 78 -1 132 108 -12 -105 -95 -106 -49 -49 -81 -6 -267 -69
4599 -69 -9 137 163 134 -58 201 -78 -181 22 -103 116 15 136 23 -98 -23 161 2 -216 5 23 -56
4621 -56 261 -74 75 -302 101 129 -152 -189 -84 130 -217 -24 33 50 -149 -42 1 31 -30 -334 4 -6 172
4644 172 -113 14 66 88 -117 -44 71 169 -204 141 19 24 111 -163 -270 -78 -63 -110 166 -227 89 -207 13
4667 13 -135 78 243 142 77 224 75 144 -15 -61 97 76 213 -44 32 -143 -242 -129 -72 -254 58 -280 10
4690 10 -103 -19 91 -49 355 230 -98 42 206 -225 66 119 -252 -217 -305 -166 -53 -211 -149 -220 68 174
4712 174 -52 266 -151 47 -129 -121 -125 118 179 53 320 -44 -113 177 146 -167 87 24 73 76 162 13 84 131 115
4737 115 5 55 37 -85 -30 11 117 328 95 -205 134 -238 276 -256 -164 -160 70 136 63 211 -102 -179 -158 18
4761 18 424 -86 -8 -183 116 201 -196 -109 -233 120 102 161 32 359 -91 -57 -84 89 227 22 258 -6 40
4784 40 -106 53 -245 -12 -212 -32 68 141 -48 -179 101 -4 -148 35 155 19 -9 6 208 -97 30
4805 30 72 27 -87 334 -100 63 -45 -5 121 -78 -281 19 -77 -4 -171 -19 39 124 -116 -154 -115 88 -51
4828 -51 46 -177 162 20 125 -31 -7 -20 -29 141 78 64 -344 52 138 -96 72 250 32 -73 -306 -167 54
4851 54 114 53 -47 56 300 206 -9 135 -61 -70 -194 -65 -138 88 -59 83 188 326 32 44 7 96 106 -30
4875 -30 55 191 246 -177 -189 38 67 -49 37 -252 118 -140 -125 -12 101 -58 22 -270 111 73 64 166 -91 -47
4899 -47 215 -47 3 -165 -83 -14 4 19 -3 93 -74 151 52 -78 157 126 -110 -50 -69 89 10 -50 4 86 -95
4924 -95 1 -86 166 76 -156 96 243 51 -171 -91 65 71 236 209 125 93 -48 25 22 79 74 159 68 130 -51 -52 -11
4951 -11 -331 11 -137 67 287 -57 -80 8 21 -193 275 -119 -26 -109 -84 -70 47 -19 -338 -154 -69 49 -139
4974 -139 139 -218 106 215 -50 -171 39 225 -100 117 -31 240 94 138 -53 -65 -53 33 286 131 -6
4995 -6 86 -89 -91 -50 -121 95 28 -92 -112 -26 147 266 -4 130 -7 44 116 -121 -30 -193 -48 -79 -17 323 -186
5020 -186 -28 121 23 -1 -159 -15 -197 -66 -261 -86 -196 107 -103 -26 133 -54 -138 378 -78 -78 -60 73
5042 73 125 -65 -65 -82 133 -322 -168 -139 -254 31 -59 -11 -171 110 31 164 -133 56 51 -24 36 177 -274 -50
5066 -50 184 168 -223 276 -38 58 334 -83 -19 -66 -56 103 -57 -184 -66 238 -39 42 160 18 -303 73
5088 73 -155 -118 -157 -93 -112 -57 -121 29 175 48 -335 37 153 39 -123 40 -20 -8 106 -91 47 -49 96
5111 96 50 40 9 -136 153 142 -54 128 -58 210 55 52 30 148 59 -217 28 288 -176 18 -26 -3 -13 29
5135 29 93 -96 177 -121 -16 -94 86 -148 -23 -132 145 -113 -10 -323 -98 -325 -134 157 -1 -25 50 -11
5157 -11 -43 -91 -50 -105 107 -51 -62 114 -33 -106 224 164 -186 -13 -74 39 255 -44 141 -101 -202 116 207
5180 207 -200 189 64 103 -127 62 -16 -112 334 6 125 253 7 181 191 -167 229 -59 110 50 236 -35
5202 -35 146 55 127 235 122 -38 -91 -98 -148 -67 -48 162 -51 54 -120 344 -9 -39 123 -49 -55 16 -130 -112 -9
5227 -9 -170 -30 -23 244 30 161 167 118 -21 -168 -42 180 224 142 90 30 -62 42 -7 -211 78 -155 90 -80
5251 -80 -5 87 -121 43 172 -16 15 -107 159 -23 -284 -325 47 -115 16 -38 74 -144 199 107 -280 159
5273 159 73 122 66 -45 -34 -183 -127 6 17 99 -117 -23 -253 -9 -17 -79 81 -66 -57 -96 -215 43 181 186 49
5298 49 126 -129 165 21 14 -8 33 136 -152 391 -167 -204 35 -36 -7 90 -109 -123 -63 -130 55 -35 -56 42 150
5323 150 115 -171 44 54 92 126 -356 -87 -260 122 -63 -6 -2 27 -29 304 172 -189 -12 -67 -115 -133 -60 -27 78
5348 78 229 27 -150 235 -32 -32 6 -14 -250 -36 -295 4 237 40 199 210 142 31 122 -23 110 379 -183
5371 -183 -65 -108 205 8 -125 -36 -169 196 90 -137 15 -78 24 126 -86 -107 127 57 -178 -61 -232 142
5393 142 245 79 110 2 -54 51 -14 -201 27 -196 -122 120 66 122 37 -209 -92 145 106 118 -34 -44 -41 -8
5417 -8 239 -269 -3 -7 -117 -100 194 -113 -60 47 -12 128 -28 237 -125 -64 -162 -142 0 91 -167 -10 -162 -4
5441 -4 -118 197 -32 -156 -122 51 162 5 -74 210 -54 1 -211 33 156 96 244 120 -137 24 68 -83
5463 -83 -200 -56 -82 -159 -155 123 -127 16 -60 -129 79 -114 1 -204 -10 -129 184 -67 -8 -366 -204 -310 11
5486 11 198 -87 113 -189 -130 210 -110 20 77 -160 -163 96 -136 212 -52 -99 80 125 -24 104 26 6 -373
5509 -373 -90 236 31 58 47 28 75 158 -159 159 87 -41 -70 -190 106 -93 -90 86 38 74 39 30 30 -114 -41 -60
5535 -60 -84 10 104 59 105 -115 172 -112 151 -146 -106 310 -290 18 -11 -289 -184 -80 -22 -286 17 -271 164
5558 164 -214 -137 -230 -16 2 -44 223 -229 121 61 -102 20 -186 116 -237 -161 -92 -60 270 -47 -94 174 -165
5581 -165 22 -1 -61 130 -36 -53 12 -49 -37 38 22 190 -66 -69 -297 33 270 23 80 -46 -160 -221 102 116
5605 116 157 -78 85 21 0 178 -94 6 -83 97 -21 -228 41 173 -91 4 91 13 152 -110 29 6 180
5628 180 -71 379 133 100 -92 27 34 72 -134 -38 29 -164 -136 -177 -188 129 -115 -116 109 -24 -91 46 71 55 75
5653 75 -187 -49 76 113 -180 -131 -112 -353 -46 186 5 30 114 -107 -225 86 3 -66 149 22 109 -156 1
5676 1 -65 -152 -48 -20 85 96 207 -85 -146 -127 130 65 4 135 -201 170 125 204 34 258 19 -89 146 169
5700 169 -110 62 75 50 -279 -242 61 17 -75 66 131 12 55 -368 -79 -114 -119 -126 110 -43 -107 100 84 -100 -306
5725 -306 -225 -236 1 212 26 -137 213 28 74 -88 -24 -223 132 149 -19 -208 -136 -92 -54 -103 288 282 15 -181
5749 -181 221 39 -208 56 147 -4 82 -18 -54 113 10 -152 1 218 -137 36 13 -145 -2 131 -51
5770 -51 -49 -129 48 -59 24 54 -65 -106 -4 203 10 54 -44 8 -106 -222 -182 166 85 81 -62 -148 -142 -12 -68 -80
5796 -80 98 69 229 133 51 88 -45 -186 -149 -67 176 -249 90 -12 -7 72 25 -168 37 0 46 323 -27 -191
5820 -191 249 -63 122 12 62 33 75 158 213 173 -118 234 122 101 -208 -350 34 174 74 -67 167 -181
5842 -181 -171 -29 18 69 -53 -51 87 -130 -172 91 50 49 -37 -127 285 29 83 -13 82 -33 -155 -4 151 184 -145
5867 -145 -10 -119 -279 -215 -115 -164 -52 -87 -189 88 -71 233 -118 -72 72 20 31 98 -46 -164 4 -255
5889 -255 -302 -214 43 113 -90 107 75 189 221 71 31 79 182 73 -64 -157 -95 95 -23 -213 -279 -21 -40 -230
5913 -230 106 96 49 -173 -237 -83 -50 123 -89 -4 -47 -10 49 162 -158 89 14 -88 103 174 -41 7 -33 52
5937 52 -79 41 0 154 -200 126 111 51 -55 -220 13 85 14 43 0 5 103 45 -132 -2 -200 -88 -144 -9
5961 -9 168 -8 -6 -140 168 -121 60 47 -29 -9 49 -90 -189 -25 -186 -160 -164 159 105 -41 168 -248 -57 -16 -1
5986 -1 66 95 209 33 42 386 -98 -48 20 27 -126 -15 -238 227 125 -189 143 -141 -34 77 -70 -109 52 -227
6010 -227 -58 125 -109 -20 -30 183 -112 67 273 14 55 155 -212 -209 -427 23 132 -55 -92 166 -98 57
6032 57 244 -160 178 179 191 174 23 -279 95 43 -91 -161 81 151 -53 43 -268 -260 3 153 -38 116 -1 -146
6056 -146 9 26 2 -9 151 182 157 -209 -67 -245 -151 -142 134 146 79 -150 -60 -29 51 157 -171 101 229 -77
6080 -77 -109 391 -13 -344 51 -138 41 -185 91 -47 -123 -71 -80 -208 -93 -89 27 64 -118 203 207 201 -131 18
6104 18 26 159 -96 157 -181 -184 133 -47 200 -39 -21 -66 -240 -44 150 -156 65 -63 32 -169 236 -56 -26
6127 -26 26 61 39 -167 -83 -260 97 -76 -63 -107 30 -184 -136 -2 -153 -12 -189 101 -134 -30 59 225 146
6150 146 -68 158 -129 25 -117 75 1 -74 108 -49 172 -203 -20 74 -132 -38 92 -165 -158 -175 -327 -55
6172 -55 -30 -26 -8 208 -173 -151 -174 50 68 -159 -21 -59 -235 -136 -45 -32 -115 -33 -49 25 111 213 -252 -215 -166 89
6198 89 -109 -58 89 16 96 187 165 -221 105 -130 220 122 -29 312 132 -120 2 177 102 -176 27 190 -105
6221 -105 -198 92 -108 67 5 121 -3 104 -147 -60 29 -100 -11 -93 -159 96 -2 32 38 -76 168 -37 38 -57
6245 -57 -95 -207 45 -62 135 85 -106 -113 -26 88 14 248 326 232 131 -40 -228 -168 355 72 -191 10 -164
6268 -164 -148 83 -23 34 310 -71 150 25 12 37 98 190 279 79 17 -57 -162 76 46 22 -62 -202 149 -22
6292 -22 9 -98 92 133 -12 70 191 38 -269 163 18 -237 -18 99 -120 9 -72 276 -15 -86 -122 38
6314 38 -59 195 -68 -117 95 -126 44 165 -58 332 148 -18 36 -192 -50 35 -154 38 -175 173 41 127
6336 127 -89 47 -154 -188 187 -160 -171 -193 -31 -13 -194 -29 14 -92 -3 134 209 77 82 155 125 -74 -29 245
6360 245 -31 -113 156 63 74 -31 156 -6 7 16 -206 -185 224 -439 -156 -283 -228 54 -68 -257 187 10 -137
6383 -137 222 75 -173 236 -96 82 274 -122 147 192 39 37 150 -217 -267 67 -141 223 118 -95 279
6404 279 -115 1 112 245 13 138 -127 142 189 72 100 -137 154 -13 47 -189 -17 -122 172 22 -20
6425 -20 137 85 368 21 114 -275 -65 28 64 174 -177 -99 -271 -327 439 70 -21 19 -6 -11 -66 304 -34 69
6449 69 -81 -108 -5 -9 -198 -142 -23 105 100 180 10 158 73 129 64 -42 40 190 -111 242 14 129 179 47
6473 47 -82 -122 -154 213 -33 -114 -29 25 191 6 271 -194 -6 -196 72 70 130 -144 181 165 -4 13 -79 -39
6497 -39 -57 102 -38 -62 -136 49 144 -115 83 50 -138 -83 -55 -175 -29 -25 85 -32 -110 -337 -262 126 -50 75
6521 75 -170 76 67 -84 -21 -247 65 -31 184 -129 -110 153 -98 -4 145 109 0 -164 131 78 -49 -2 -43 179
6545 179 -31 84 -98 19 85 115 170 -41 -37 -9 56 91 14 29 205 91 -35 124 -60 -56 8 33 180 -145 54
6570 54 104 12 -15 45 -72 253 -5 -201 -4 77 42 24 6 65 249 -77 122 158 -327 36 288 151 -101 -92
6594 -92 -49 110 -101 11 186 -47 90 128 -9 45 119 -5 -340 -133 203 -261 -52 -182 -183 -104 18 186 181
6617 181 149 176 101 169 31 -175 84 -16 -10 -122 -75 -185 184 23 130 -39 -111 32 -12 -95 343 51 2 -201
6641 -201 -80 271 332 -9 -22 -67 162 -23 107 -44 121 -103 -448 99 -124 -108 -60 187 70 52 -135 111
6663 111 -14 -236 52 -66 -41 -80 21 4 -218 41 106 -164 221 347 123 -44 -67 -207 78 -23 215 -127
6685 -127 107 2 -110 -129 1 127 -99 -101 104 -3 -170 75 -163 3 -228 119 -242 -308 139 122 28 157
6707 157 -260 -133 57 -163 -80 0 45 86 174 -178 -37 10 -152 -137 -216 45 -47 -125 -517 -185 -50 -97 -99 101
6731 101 151 5 79 217 -186 1 -19 -16 -40 -6 300 130 -78 -139 -17 121 52 -168 18 38 -28 -122 -56 -70 123
6756 123 -164 -157 -50 227 30 293 -1 -77 110 -76 118 126 -2 30 94 -62 80 282 1 78 219 104 -17
6779 -17 48 -130 -215 61 149 -279 -263 -69 -152 133 -74 -114 220 -10 228 -65 -76 145 164 -20 81 17 -37 16
6803 16 16 83 -68 -115 -109 -121 -92 -67 268 17 144 110 -21 183 31 179 -61 82 104 216 166 74 -76 52 69
6828 69 -164 203 89 170 58 156 -109 212 -251 -1 -91 -385 -202 153 -136 27 -163 137 -61 127 -81
6849 -81 -203 166 -120 -68 36 -196 9 -178 -79 -26 216 -2 210 54 -356 -21 37 -235 68 95 -198 -36
6871 -36 97 44 -81 -133 24 196 -72 71 134 71 -144 -46 138 148 -39 -360 20 -94 42 36 -63 -87 -135 -64
6895 -64 -56 -154 195 -54 90 111 228 89 104 -1 -51 -70 119 -58 22 67 -90 294 -9 -95 15 -311 152 2
6919 2 157 61 137 -161 -65 110 -177 33 -134 76 74 192 -161 -28 -73 -123 327 194 143 109 -179 -86 177 -191
6943 -191 101 135 285 4 -101 -2 -69 73 14 180 -149 -194 -117 -162 103 -140 163 -86 -198 67 -30 168 -168
6966 -168 -132 -107 49 11 180 -86 -13 41 2 118 26 -75 -54 -50 42 -118 183 -323 -115 -72 42 143 -108 69
6990 69 88 102 -23 319 -68 55 -241 175 227 -211 -116 -37 184 92 -11 114 -198 10 -16 -258 12 -10 237
7013 237 314 -28 3 123 -146 66 -228 196 43 -207 84 -86 -180 -117 -224 -216 -85 -111 -102 69 -27 -88 -69 -284
7037 -284 -150 -77 105 12 -228 140 56 -51 115 243 210 -150 116 -67 45 141 180 -234 11 -136 153 -137
7059 -137 78 -209 -182 107 -137 -259 178 -190 -315 -48 4 -15 -82 37 -150 -110 -97 16 -116 -45 33 203 -62
7082 -62 129 -111 -100 284 -194 159 -80 -89 -101 15 148 -222 199 1 -18 -175 -179 -170 -87 -166 -145 20 35 -16 64
7107 64 -82 135 -31 152 -10 317 103 -233 28 31 -63 41 10 126 -38 254 -10 -28 230 -15 24 255
7129 255 -110 18 -63 92 -52 -79 -33 -146 -34 10 -68 -76 39 -175 -75 -107 167 111 126 36 147 49 27 79 -75
7154 -75 158 81 325 -17 -66 -250 86 138 -92 14 10 -145 -21 -185 -253 124 30 -69 -63 356 344 190 123 264
7178 264 296 5 -60 82 -278 -115 -126 -45 48 -348 133 -62 -15 118 -6 -117 2 -4 -11 197 -212 -47 -63 218
7202 218 -103 -315 66 -4 -157 123 60 -105 -128 -22 -113 39 -152 20 351 -216 5 161 52 46 -290 -101
7224 -101 247 17 91 213 56 235 -36 -67 82 120 77 -79 58 -81 59 98 110 -14 -93 196 388 23
7246 23 204 293 124 168 -142 77 87 53 -55 60 284 -117 -138 -19 110 -35 86 -129 60 14 151 174 7
7269 7 154 47 126 -226 33 -383 106 16 279 2 -70 66 -361 109 -85 -98 4 -30 -68 30 17 -17 -206 150
7293 150 25 32 -203 138 253 138 -86 -54 -202 108 27 67 181 -183 -238 -166 -62 78 34 31 -207 128 124 -18
7317 -18 -102 -119 -127 101 80 -1 -100 113 -48 -154 -27 -35 187 16 110 3 -90 -228 92 -44 5 -24 -5 64 44 203
7343 203 -291 139 -94 -17 -104 -61 97 -159 103 -25 16 -4 52 -64 64 65 61 -130 145 125 92 3 80 -161 61
7368 61 -52 -132 -148 10 32 109 108 -113 -428 193 -41 -69 11 50 40 30 281 -27 41 183 24 64 -200 -16 -159
7393 -159 184 99 -108 231 -51 -58 -257 261 -99 -136 329 107 -89 12 -16 90 19 141 -34 90 -152 -102
7415 -102 14 146 121 171 8 -26 -31 238 91 131 134 212 -36 161 79 126 -25 -104 -171 9 -205 -62 -22 -32 38
7440 38 -227 154 -101 229 -98 -27 -45 -3 -66 -64 -64 76 -252 248 41 -94 160 -69 182 177 206 -9 142 144 -120
7465 -120 82 149 -78 -290 -51 158 32 19 24 -121 -288 -58 106 -88 -139 164 89 7 72 106 139 223 93 65
7489 65 -94 -229 -130 -34 -176 22 169 -262 330 -113 76 -160 166 -151 41 236 169 41 -240 -36 147
7510 147 -248 143 73 11 -82 189 314 -380 240 105 22 -178 86 -69 36 -60 -81 -4 -23 288 29 -162 144
7533 144 -27 287 21 6 -130 133 101 -4 158 144 178 -71 -243 -131 -41 -146 -49 -9 -195 -289 -64 7 -16
7556 -16 -66 210 176 109 4 -25 63 -126 127 130 -75 -48 102 84 74 -148 -103 -10 -136 45 -65 122 -164 -190 -133
7581 -133 5 19 -157 127 95 34 198 -215 -207 17 100 181 160 -146 -187 142 -198 184 178 -114 -28 -114 330 70
7605 70 -109 158 -25 110 -151 -155 -290 9 129 -56 -187 -68 -164 13 -217 171 -150 30 -221 387 -167
7626 -167 123 71 -84 310 -13 -165 -9 274 -125 125 -12 79 -134 87 -95 -190 75 48 -74 -29 -80 -24
7648 -24 -65 96 36 -122 182 -297 -30 251 54 75 -92 -134 66 -32 -175 144 68 -76 -15 134 173 -75 94
7671 94 -183 2 -95 -258 -132 -40 -158 -105 -155 -85 -44 15 -20 61 -81 150 76 -118 224 -102 18 -491 -166 83
7695 83 88 71 162 -204 252 115 26 175 -107 -105 12 131 -248 11 150 -379 -30 -193 -16 55 68 106 -250 180
7719 180 96 -19 -62 -91 3 255 131 106 -186 -68 201 20 220 -45 117 179 114 -24 26 -6 152 192 75
7742 75 23 83 -137 214 31 -187 1 -45 -55 -70 12 -85 210 155 6 111 -26 -7 -84 -89 -56 -70 -77 108 -177 57
7768 57 57 -31 158 -150 165 288 198 46 -159 135 141 -60 143 221 -137 -183 137 -55 1 -98 -174 -257 -38 32 51
7793 51 -174 4 -100 -44 -42 55 8 -228 136 -61 30 -123 -27 1 -206 -202 -19 -241 215 -313 -183 158 71 69 -236
7818 -236 300 139 -181 111 -84 -118 -63 -12 182 0 218 -80 21 4 26 -115 -68 -7 -145 232 19 67 99
7841 99 -191 -98 -5 -273 146 -12 77 -210 -95 -20 190 2 -85 284 24 80 59 -27 0 -21 97 115 184 88 65
7866 65 -211 17 -6 -64 68 -302 -27 78 -34 39 -12 -180 261 256 -75 5 20 -176 -90 33 -22 -38 166 -18
7890 -18 144 161 -97 -35 136 69 149 -32 -94 198 -150 -4 168 -81 77 267 141 173 -57 -3 110 154 113
7913 113 -2 -100 221 -131 -12 -35 38 130 208 8 -51 59 38 -154 -253 195 7 -50 -96 128 44 18 5 -212
7937 -212 140 -6 111 149 36 -101 115 21 -23 105 -3 159 -27 14 164 94 130 -26 -102 -13 -215 19 30
7960 30 -238 104 44 15 255 -161 -58 -6 -160 28 -229 173 117 189 59 258 -188 -10 67 -198 -22 350
7982 350 -62 51 -48 34 -295 19 214 -148 107 6 -15 111 -22 -85 -237 -213 -190 74 -110 -130 -54 -96 -72
8005 -72 97 -61 -11 -45 13 -407 -3 163 51 70 -13 -69 -21 142 -2 37 275 30 -83 114 -181 10 -129
8028 -129 -22 -61 79 183 -152 80 -65 -7 -129 16 -111 -153 -31 -6 19 -200 -163 98 191 81 9 -3 -119
8051 -119 -25 120 -30 138 26 -135 -98 -336 205 23 164 23 -204 -312 11 138 -51 49 196 -168 155
8072 155 118 -248 166 -86 -371 -38 174 -78 8 217 -6 -52 203 -74 80 -7 -26 166 387 61 85 -99
8094 -99 38 -132 -226 -208 -4 109 1 -307 13 319 128 -165 -33 -3 -57 103 -26 186 -90 197 10 283
8116 283 -79 198 -126 -309 -15 266 -3 -243 -115 -28 71 24 98 14 230 -119 25 68 15 120 -34 156
8138 156 99 -34 -146 -184 47 20 89 143 -97 -124 33 -312 205 -65 149 81 -99 157 73 -149 203 -62 -12
8161 -12 41 9 99 -138 -73 -101 84 -121 -18 184 19 -26 138 112 15 125 -223 2 150 -84 88 266 28
8184 28 131 -184 -172 -26 8 -181 3
8191C
$$ Imaginary data points
##PAGE= N=2
##DATA TABLE= (X++(I..I)), XYDATA
0 0 0 0 0 0 0 0 0 0 0 0 0 0 0 -8 8 -8 8 -13 16 -16 24 -24 32 -33 40 -48 56 -64 75 -87 98 -112 127 -145 163
35 163 -184 206 -231 259 -289 321 -357 396 -440 486 -537 593 -652 718 -791 871 -962 1059
53 1059 -1168 1291 -1431 1588 -1769 1980 -2230 2528 -2896 3360 -3966 4799 -6019 7976 -11652
68 -11652 20984 -101234 -129576 66590 66711 -11314 -82415 -48694 32824 120108 86444 -25312
80 -25312 -70767 24541 102518 67079 -35204 -90446 -66559 25234 76856 5361 -110678 -95667
92 -95667 23512 71600 -49 -64372 -51097 8569 67947 82066 16452 -53402 -22938 72772
104 72772 94657 16297 -63691 -69872 -13632 39682 14046 -78291 -111577 -20924 79077 60837
116 60837 -24747 -50583 3450 70851 89108 36607 -43614 -54980 21074 71239 13412 -75890
128 -75890 -82424 -9347 52510 39177 -32657 -78064 -27971 62411 74329 -3279 -56252 -19868
140 -19868 48502 67229 24077 -35573 -48778 5328 59906 34872 -45560 -78144 -28558 33038
152 33038 34466 -17538 -57021 -31477 39082 72857 28243 -32904 -28399 30104 63293 30750
164 30750 -31385 -58929 -25245 26869 29277 -25324 -65210 -35409 28312 51009 11820 -35891
176 -35891 -31243 23403 61915 35898 -23425 -42530 -2163 43419 34841 -18728 -54669 -30731
188 -30731 20581 34292 -7212 -51084 -42155 9970 45672 25271 -21941 -33028 10488 55400
200 55400 44435 -6835 -37121 -15394 25360 31844 -9417 -52994 -46352 3800 33144 7860
212 7860 -32770 -34215 6669 44308 38685 -3290 -30537 -7200 37083 41451 -2231 -38698 -27401
225 -27401 10900 29512 5860 -34871 -43743 -6341 31850 20952 -21845 -36819 -5265 34355
237 34355 39011 7657 -22939 -14034 25457 43885 11773 -32009 -35305 -1765 21686 6958 -28315
250 -28315 -43194 -16413 24644 31774 -2098 -27230 -8194 30795 40522 12970 -20008 -22989 5517
263 5517 29508 14422 -24655 -37905 -9794 21939 18776 -12212 -32224 -17786 16186 30093
275 30093 6466 -24299 -20262 14764 36394 19098 -12409 -21731 239 25538 21217 -12310 -35698
288 -35698 -21306 10936 18869 -5666 -29184 -21276 10893 31467 19047 -10323 -18011 6521 31016
301 31016 22312 -10152 -28636 -13877 13183 18353 -5350 -28587 -21268 9227 26187 9911 -17105
314 -17105 -20708 3510 25730 18654 -9452 -23211 -6352 20162 23143 -740 -22438 -15539 10255
327 10255 22265 3901 -22387 -24513 -641 19769 12792 -10896 -20935 -2672 23150 25458 995
340 995 -18409 -10155 12707 19997 1562 -22151 -24032 -1887 17345 9775 -13467 -20678 -944
353 -944 21431 21118 -350 -16620 -9124 13322 21399 2731 -20093 -18285 3947 18162 7802
366 7802 -13569 -20245 -4360 15990 15193 -6112 -20261 -9016 14011 19922 3820 -13751 -11571
379 -11571 8768 21648 10589 -12514 -19784 -3259 13725 8419 -11943 -22315 -10656 10195
391 10195 16909 2253 -13286 -8934 11350 22470 10333 -9919 -14570 -282 14557 9881 -9777
404 -9777 -20977 -9030 10216 13480 -2732 -16705 -10899 7593 16915 5577 -11013 -12749 3252
417 3252 17532 13082 -4281 -13698 -3124 13409 14148 -3099 -17815 -12889 3960 11044 672
430 672 -15177 -15165 2004 16560 11660 -4754 -10394 1214 15239 14413 -809 -13937 -10392 5641
444 5641 12798 597 -15625 -14244 2836 13174 6709 -7790 -12871 -2113 12636 12854 -2681
457 -2681 -13805 -5386 10545 13339 2549 -9013 -9042 2581 13177 7189 -10545 -16470 -3011 10206
471 10206 6930 -5886 -11892 -5173 8078 14574 4740 -10091 -8678 7227 14177 3939 -9113
484 -9113 -11362 -2927 8293 9328 -4158 -14829 -5669 11207 12793 -1588 -10616 -6500 3736 10583
498 10583 5203 -8613 -13138 645 13644 7602 -6604 -9866 -1628 7592 9328 315 -11439 -10167
512 -10167 5230 12558 913 -10794 -7656 3160 9102 6411 -2902 -10410 -4151 8816 9513 -4172
526 -4172 -11985 -4838 5513 7979 2800 -5210 -7786 1671 12091 7444 -6608 -10204 -986 6330
540 6330 5055 -2156 -9105 -7929 3712 11464 2935 -9137 -7426 4518 9719 4284 -4497 -8356
554 -8356 -2753 7588 9411 -2531 -10869 -4309 7288 8341 -256 -7721 -7603 242 8542 4932 -7667
569 -7667 -10800 1109 10785 6412 -2925 -5770 -1586 6378 9111 1463 -8957 -7587 3085 7500
583 7500 381 -7695 -7302 -634 6613 6627 -2130 -8743 -2145 8342 7871 -1560 -6898 -3635 3608 7116
599 7116 3355 -4827 -6899 632 7753 4493 -4643 -8218 -3246 4040 5531 -687 -7632 -5148 4604
614 4604 9183 3064 -4776 -4425 2719 7240 4205 -3614 -7572 -3042 4619 5255 -1876 -7757 -4604 3589
630 3589 6878 1496 -5863 -5849 1279 7088 3731 -4168 -6559 -420 6979 5948 -954 -5632 -2509 4305
646 4305 6046 410 -6578 -6411 484 5790 2458 -5090 -6641 83 6818 5500 -1220 -4922 -1637
661 -1637 4817 6259 376 -6001 -4649 2144 5729 1951 -4110 -5622 -548 5268 4394 -2289 -6713
676 -6713 -2990 3845 4901 -865 -5466 -3265 3186 6428 3238 -2787 -4606 761 5803 3198 -3283
691 -3283 -6193 -2732 2391 3905 -932 -5846 -4050 2799 6433 1526 -3878 -3631 1219 4893 3170
706 3170 -2444 -5360 -1967 4517 4756 -1073 -5012 -2322 2645 4454 1186 -4310 -5483 18 4633
721 4633 2231 -3574 -4747 99 4754 4153 24 -3535 -1904 2809 5061 847 -4851 -4108 797 3941
737 3941 1680 -2938 -4591 -955 4007 4100 -1407 -4863 -1951 3008 4074 -54 -3564 -3088 1403 4807
753 4807 2812 -2447 -3856 523 4131 2829 -2075 -4511 -2368 1970 3577 -94 -4311 -3097 1746
768 1746 4561 1716 -2492 -3178 530 3817 3078 -1501 -4028 -1447 3013 3831 -296 -3548 -2784 1502
784 1502 3621 1146 -3487 -4126 -251 3116 2102 -1957 -3661 -693 3107 4028 381 -2758 -1482 2290
800 2290 3744 1112 -3090 -3297 -71 2968 1672 -2262 -3792 -1059 2750 2889 -454 -3466 -2203 1721
816 1721 3741 1141 -2446 -2324 1272 3863 2130 -1329 -2890 -469 2717 2407 -1657 -4269 -2534 1407
832 1407 2339 -183 -2776 -2466 992 3642 2385 -1299 -2137 557 3193 2711 -774 -2938 -1317 1640
848 1640 2314 -320 -3162 -2660 625 2677 715 -2178 -3129 -336 2793 2254 -581 -2265 -485 2862
864 2862 3309 801 -2012 -1627 1267 2421 520 -2707 -3323 -570 1797 1037 -1516 -2887 -708 2444
880 2444 2830 512 -1892 -1142 1704 2717 1176 -1952 -2273 222 2626 1432 -1626 -2661 -633 1485
896 1485 1565 -560 -2691 -1982 1024 2415 578 -1797 -1572 1181 2941 2045 -767 -1993 -247 1984
912 1984 1866 -1099 -2850 -1609 554 1655 142 -2006 -2025 392 2476 1240 -1443 -2329 -275 2164
928 2164 1581 -314 -2017 -947 1433 2768 676 -1619 -1268 953 1875 411 -1520 -2451 -1013 1496
944 1496 1797 -1110 -2364 -716 1837 2091 292 -1531 -1144 720 2213 745 -1708 -2049 10 1858
960 1858 1018 -668 -1547 -1197 795 1768 -37 -2586 -1982 854 1841 293 -919 -1219 476 2226 1941
977 1941 -383 -1766 -585 1480 1675 -840 -2153 -1157 127 1122 458 -1493 -2346 20 2246 1011
993 1011 -1035 -1322 -177 1463 1526 211 -1389 -1331 1422 2073 7 -1836 -1369 222 929 361 -1126
1010 -1126 -2259 -1301 1318 1475 -539 -1596 -133 1581 1848 632 -608 -1178 443 1673 729 -1543
1026 -1543 -1653 -438 663 611 -784 -1501 -1070 676 1565 313 -1792 -1181 932 1709 627 -550 -861
1043 -861 6 1637 1283 -142 -1461 -848 708 881 -403 -1628 -1178 -61 1126 651 -786 -1186 350
1060 350 1856 1211 -417 -1065 -485 1095 1341 151 -1366 -1181 633 1458 257 -1154 -1282 -251 1020
1077 1020 618 -905 -1351 -559 955 1123 -98 -1060 -352 1004 1566 815 -802 -836 60 1129 708 -923
1095 -923 -1462 -357 616 969 -433 -1097 -629 591 1331 197 -786 -1010 505 963 799 -260 -881 -29
1113 -29 1262 1162 -87 -1273 -605 539 798 -293 -1515 -1274 -18 833 636 -601 -890 317 1360
1130 1360 1673 -80 -848 77 977 1314 65 -1112 -998 109 522 20 -1035 -1274 -25 674 295 -636
1148 -636 -1048 -144 772 1373 543 -430 -431 602 1456 352 -327 -958 -18 520 409 -867 -1714 -517 331
1167 331 856 -190 -816 -398 325 1071 495 -584 -539 161 1170 489 -931 -737 -274 432 463 -289 -1159
1186 -1159 -918 -117 537 -312 -813 -700 115 987 818 75 -453 194 896 1519 -95 -745 -368 342 441 -190
1206 -190 -962 -1064 -51 302 387 -623 -923 10 576 751 -134 -604 -214 589 1001 311 -492 -523 356 673
1226 673 89 -624 -872 -372 520 445 -657 -1208 -251 468 693 288 -392 -406 504 1012 696 -382 -499 63
1246 63 676 555 -382 -822 -412 329 938 -227 -773 -770 456 504 44 -652 -703 101 805 476 -80 -405 59
1267 59 948 725 59 -286 -276 249 601 135 -602 -846 -126 550 232 -574 -684 -296 677 463 143 -487 64
1288 64 439 610 198 -333 -339 142 714 360 -517 -956 -427 235 323 -406 -501 -364 316 488 161 -251 -115 442
1310 442 924 526 -8 -220 91 614 124 -380 -769 -676 64 152 -126 -731 -349 78 251 306 -72 -775 401
1331 401 800 674 228 -233 221 941 568 52 -576 -804 -172 164 -260 -946 -677 -201 328 7 83 -311
1351 -311 -64 712 960 477 -256 146 504 666 256 -491 -518 -151 239 137 -587 -852 -507 122 384 -181
1371 -181 -159 -193 645 807 228 15 -142 266 492 283 -194 -228 -130 148 65 -442 -865 -750 -1 583 225 -131
1393 -131 -169 433 521 448 11 -179 -44 545 610 181 -249 -198 290 168 -151 -415 -431 -185 490 51 -204 -482
1415 -482 178 229 294 123 -148 96 423 475 331 -233 -282 -13 222 168 -562 -474 20 245 65 -138 -383 2
1437 2 263 314 115 -270 32 274 782 551 122 -247 105 695 483 -65 -322 -433 140 52 -100 -194 -496 -210
1459 -210 314 -81 -102 -307 -194 335 489 228 -280 84 369 345 -137 5 -482 224 -245 -238 -372 -600 -168
1480 -168 245 -154 -424 -639 -112 469 415 139 -47 -149 396 665 622 -161 -54 53 203 -107 -349 -639 -567
1501 -567 -87 -42 -243 -174 -72 65 325 34 -155 -51 323 414 349 -227 -9 -55 195 -396 -154 -620 -205 -94
1523 -94 3 -324 -272 -129 125 180 156 -117 318 180 344 457 -102 154 -107 -7 386 -413 -283 -220 -53 83
1545 83 -364 -417 -450 -183 365 183 103 214 -76 422 326 276 -44 -25 303 528 -107 -385 -48 -301 40 -295
1567 -295 -556 -509 74 -78 77 -291 -78 -76 397 342 150 151 -77 414 372 312 -90 -221 -239 -13 -105 -286 -485
1590 -485 -249 -44 336 134 123 -179 428 348 155 -91 -29 -148 358 164 14 -35 -190 93 39 -252 -274 -154
1612 -154 100 -1 -12 -128 -219 -53 311 360 107 9 -34 376 493 313 99 -80 -41 178 -79 -272 -374 -314
1634 -314 62 -41 -157 -235 -358 -133 41 181 -58 107 155 102 345 189 129 -193 190 -38 14 -263 -263 -120
1656 -120 -121 -243 -527 -139 125 110 24 -273 89 146 489 379 289 -21 122 125 93 -27 -601 -169 -57 45 -408
1679 -408 -455 -294 -207 -41 -229 -92 -43 -42 422 532 208 81 138 -13 400 -39 -311 -159 65 -75 -135 -151 -248
1702 -248 -287 199 -10 -214 -159 251 208 437 186 66 108 231 476 120 -214 -180 -69 56 175 -108 -244 -300
1724 -300 -190 14 -222 -27 85 391 68 266 30 -28 139 217 184 118 -141 -181 4 -147 -252 -358 -245 -264
1746 -264 68 -57 -308 -74 -41 242 -38 91 28 211 145 230 145 30 -62 -63 210 -224 -244 -222 -72 -63 57 -79
1770 -79 -354 77 90 78 -145 -144 107 322 336 459 -151 117 44 134 304 -320 -167 -101 -173 -128 -146 -77 33 25 258
1795 258 12 59 -138 -15 204 -7 57 33 201 91 158 105 -213 -167 49 55 -258 -278 -267 -68 -29 92 118 -25
1819 -25 316 309 154 -85 168 9 141 80 -34 -84 -138 91 333 -244 59 -7 -85 -204 5 -30 -87 -115 157 94
1843 94 14 191 98 171 353 57 -203 -144 -264 40 -191 27 -48 -298 -50 -173 20 -297 -172 -68 24 -110
1865 -110 -66 45 338 416 -223 134 198 -231 210 -134 -259 -31 -287 196 56 -72 -363 -24 -124 -118 5 347
1887 347 96 112 57 381 181 -29 114 -18 224 -20 -45 -172 -116 32 -103 -382 -140 -78 -60 65 -6 239
1909 239 18 -11 202 101 5 184 65 251 29 -330 -252 -156 -432 -43 -63 -137 -103 -98 136 -155 -333 301 189
1932 189 36 23 -206 -67 40 151 205 -107 -71 -155 48 -312 -139 -190 -482 -56 -21 -213 -10 9 65 373 -132
1955 -132 -10 88 440 39 -23 81 -37 247 169 -23 -238 -209 -126 96 -158 -42 -171 122 185 -42 423 150
1977 150 142 102 -72 56 241 10 297 -111 109 -175 -331 -329 -148 152 53 -31 -251 -30 -228 -58 187 137 -57
2000 -57 360 288 -167 -63 302 -22 116 122 -226 -68 -26 131 -80 13 357 160 -32 -294 -41 -18 61 -92 176
2023 176 115 99 109 158 263 100 45 -77 -165 -208 -220 43 -46 -66 52 95 -63 79 186 83 14 224 213 -43
2047 -43 79 214 147 -18 -171 -17 46 163 -317 -174 -522 -12 -83 99 -71 -220 11 218 -9 -205 65
2068 65 136 192 236 183 185 -28 -109 -40 -25 214 -280 -245 45 -25 79 -72 10 -161 179 346 28 -120 -248 327
2092 327 119 51 -32 -64 -34 224 -167 -69 -127 -191 -27 -224 227 -174 -61 14 -26 83 -172 -29 224 279 119
2115 119 163 91 119 212 -170 104 43 -74 -221 98 -22 -137 -162 -181 -91 59 -10 -164 350 33 159 86 -176
2138 -176 221 201 -420 -158 269 -264 -43 122 -240 -376 -392 -46 -249 -203 -123 -194 62 117 122 287 185 264 71
2161 71 -76 270 -383 -30 10 -37 -27 -25 99 47 255 -75 -247 -148 24 -63 238 26 150 109 283 152 164 9
2185 9 -88 -99 -266 -23 -111 -168 55 -183 -184 -20 -150 -103 -90 37 224 12 273 331 188 92 -160 -120 123 -129
2209 -129 125 -343 -57 -204 -259 114 -3 -60 -190 186 -95 85 -175 124 259 120 -124 292 31 98 125
2230 125 -105 -143 -132 158 1 110 -1 -54 -67 96 48 -48 -186 -111 213 216 147 -38 155 255 159 -80 259 -23
2254 -23 -50 -48 108 -152 -140 -57 -98 65 -214 -48 -147 -32 210 31 168 292 90 198 142 -162 89 -36 -30 99
2278 99 70 -18 -284 -142 -174 -150 27 17 137 56 -196 -3 26 -81 125 -305 -54 115 118 202 -87 -95 -163 37 74
2303 74 90 -110 -34 18 109 -103 -10 -124 -133 -2 -31 200 148 179 163 82 68 70 11 -253 -57 184 21 -246 -39 -114
2329 -114 -160 -91 65 66 -122 -78 181 154 181 48 -202 -168 100 -6 -77 -37 81 -38 -74 -112 48 -440 -353 184
2353 184 202 -66 -81 66 274 223 49 -16 -40 204 -309 118 -419 -61 -173 -127 -229 -125 -308 198 -250 -209
2375 -209 -21 67 -48 176 82 137 -26 -15 288 -183 -255 -404 -207 -44 49 16 1 5 -229 229 -48 -73 -15 153
2399 153 -151 -21 108 37 -62 290 -207 250 -90 -51 -125 -33 -260 -167 -269 220 86 -21 143 -406 -79 -88 161
2422 161 259 17 114 -101 461 131 -71 207 -61 125 -108 -274 -199 -33 -176 45 80 -18 16 -202 -32 -136
2444 -136 257 -12 -21 427 26 -49 141 308 34 243 233 125 158 -93 -394 58 -194 -316 1 -48 -49 210 -30
2467 -30 160 67 154 127 51 98 -145 104 105 5 -15 -353 57 13 -225 -273 -241 369 -151 -229 -71 295 -27 5 -56
2492 -56 -42 40 193 135 -159 -74 32 -238 -70 -204 -141 -10 -70 122 -159 85 146 -166 42 47 75 -117 100 -95
2516 -95 268 102 -170 -13 102 87 -97 -53 2 -207 15 -51 -19 38 58 -28 -14 108 -165 135 23 163 121 175
2540 175 -124 23 172 -15 9 -213 -347 -76 -154 84 -82 -384 -135 -70 59 50 40 -24 127 -67 -31 2 64
2563 64 -36 -156 67 71 57 -133 -53 -194 -69 -131 77 -16 -146 70 221 -2 -146 43 567 304 -74 -8 -101
2586 -101 -139 -352 67 -111 -320 -167 97 -126 113 126 -19 31 43 51 -32 86 204 139 50 17 -124 249 112
2609 112 39 -65 -79 -60 -91 30 219 -204 207 -107 -293 59 -46 -74 -212 4 264 -109 301 205 -175 373
2631 373 -86 54 -120 96 127 -299 -255 -339 -187 -27 -21 59 240 -124 124 257 -11 143 -193 269 198 133 -10
2654 -10 69 -36 -127 -148 -250 90 15 149 3 -188 -224 142 -294 -164 18 20 214 53 66 -36 -14 210 -170
2677 -170 -6 255 -7 -89 100 -45 55 -132 50 -143 0 23 -171 -110 -52 23 154 24 -55 80 118 305
2699 305 53 3 66 -167 -44 -213 -207 -163 -147 -152 -278 -93 190 -3 275 -99 -24 136 104 -104 -117 -345 0 -79
2723 -79 -62 232 -12 -87 -112 -132 -184 -153 -24 143 177 108 259 -204 23 182 0 144 -76 33 -94 112 -196
2746 -196 207 0 49 141 73 27 42 -90 -70 57 -144 -26 91 171 96 155 143 -17 21 -199 22 179 -63 -148
2770 -148 44 -293 -50 -93 -25 15 -65 -144 -162 136 -27 122 7 170 71 69 61 -149 -90 105 29 -238 5 54 -257
2795 -257 -6 -141 -28 168 -18 106 109 148 301 70 -32 17 -48 -43 196 -194 246 -272 -29 -151 -218 -7 -61
2818 -61 34 29 159 -182 -95 207 -94 122 58 236 201 85 108 278 118 109 106 -257 -31 13 -150 -328 -215 190
2842 190 -86 -34 -75 -21 185 -21 -293 306 214 175 -41 -38 238 -44 -45 72 -176 49 47 -75 -105 175 211 24
2866 24 12 87 5 -12 33 203 48 -38 199 92 -114 -251 -24 -72 -94 141 -74 -104 -219 -55 -240 25 -60 125
2890 125 21 -87 -43 57 266 299 134 24 125 -310 -114 -100 -172 52 -361 -334 -118 22 -79 -6 -101 -197 89
2913 89 199 -154 -87 54 107 112 59 158 14 25 -6 -3 68 -65 -11 3 -71 9 203 10 -34 304 198 -243 34 -149
2939 -149 6 9 4 63 -30 -13 -166 -265 -75 109 -154 -140 180 123 -158 113 52 98 58 -29 -124 -2 63 31 -50 -66
2965 -66 43 -103 188 -12 181 -211 145 194 -230 90 2 -14 -309 106 244 21 270 227 -102 153 -172 -229
2987 -229 141 -97 -126 -165 127 -408 -137 -147 21 -74 -62 -280 -62 130 -25 124 90 75 35 83 4 281 -27
3010 -27 -71 44 -187 -96 -480 -52 -165 7 191 -64 -206 -151 86 75 32 208 204 43 47 291 24 -116 87
3033 87 -98 -18 -32 -3 54 -200 -251 96 -86 -103 -259 -99 103 29 -31 -62 -180 96 123 136 185 84 -228 133
3057 133 -78 -300 38 -157 8 -529 -128 187 -136 151 121 -94 -117 -335 -185 29 -9 -48 323 -2 159
3078 159 -206 -258 -31 101 40 246 119 -55 -77 66 24 -16 113 38 113 112 -14 -291 217 152 182 -39 -159 -75
3102 -75 52 -127 -18 25 193 -43 -114 240 181 -21 132 44 220 210 -65 56 -187 50 73 -40 -56 3 124
3125 124 170 120 -109 -25 -29 -305 14 102 79 -42 -19 244 212 -59 -6 -10 -68 227 55 60 -83 -276 -33 -82 -7 -111
3151 -111 -76 -167 -68 -177 -19 198 -29 247 125 28 195 141 -19 -61 -147 149 28 175 -77 -20 -58 326 -208
3174 -208 -226 2 -271 32 -50 -167 116 312 127 96 -23 -168 -89 184 31 133 -81 138 -102 41 -143
3195 -143 -26 305 -160 -232 60 -93 -177 303 57 46 54 -121 256 32 123 22 8 -270 -149 -229 -8 -184 -86
3218 -86 -162 -263 -77 -104 -127 10 31 -123 152 -34 -92 -30 107 -75 -145 -104 394 144 167 -80 -196 47 7 -52
3242 -52 88 -196 -90 -80 -18 -270 -1 -116 125 65 9 215 55 -25 -268 10 122 165 -134 -52 -30 -203 29
3265 29 206 -49 -7 -47 150 -26 34 -279 -93 21 131 301 205 106 123 -265 67 -209 -101 -114 175 -4 -215
3288 -215 -9 -67 156 -151 -24 -128 -124 65 227 183 206 -223 -254 84 30 -191 -34 -395 162 -14 54 101 -76
3311 -76 111 333 -6 -152 112 219 72 50 80 -173 68 56 124 -126 15 -8 31 -50 70 -322 -185 -42 -85
3334 -85 81 -13 -137 -105 19 146 -11 4 84 -168 6 160 -110 215 -24 -59 190 60 152 -154 64 -87
3356 -87 -11 -75 -78 -36 -56 155 196 105 -31 -32 -170 -123 176 -358 -131 111 -21 -138 -98 -419 209 -80 -227 54
3380 54 164 60 300 197 -133 -70 -36 -77 102 163 -38 -197 -89 -8 42 -50 -102 -91 -19 -122 284 103 203 -127
3404 -127 121 376 87 -218 -68 281 178 50 -388 -77 -127 82 -59 54 -144 -191 -393 67 84 -35 166
3425 166 -7 -86 -51 -73 110 25 136 -91 89 76 -33 -264 67 -145 -11 -64 -140 -72 -195 -180 -283 -28 257
3448 257 -84 -19 -9 301 23 -84 126 -36 262 27 -195 -69 6 -226 19 -147 35 5 144 87 150 -144
3470 -144 -60 56 -289 255 65 47 130 111 196 93 426 -43 69 143 -113 136 -71 -132 59 -59 106 185 275
3493 275 -4 -124 20 330 -77 -44 -41 30 279 -262 -216 -61 19 -30 58 341 -253 -141 3 -87 -89 -76 171 -61
3517 -61 60 82 183 18 227 97 -187 -31 226 144 -86 -84 -146 39 24 78 -149 143 12 -67 129 -23 -110
3540 -110 -33 109 52 -46 53 -191 -26 116 110 0 177 117 -16 83 -240 -286 -46 260 207 -110 -121 -112 -16 -146 114
3565 114 -140 -37 -210 -131 -115 -66 100 110 30 -141 -179 -165 166 -152 -26 61 -76 118 -145 -69 199 395 -225
3588 -225 -146 -45 -73 59 42 128 -7 66 -158 57 120 -241 -14 49 197 208 -14 -137 13 66 5 75 294 76
3612 76 -109 -63 133 -244 114 142 -14 85 244 -38 -123 129 -44 -98 -192 199 230 -197 29 67 -117 -71 -140 -197
3636 -197 118 -219 -293 177 121 -26 241 -56 32 -43 193 -113 -73 -41 57 -1 79 -138 111 -139 -47 -149 -89 -158
3660 -158 207 -151 133 -209 25 50 -64 15 -10 -162 8 151 -15 46 94 12 119 -127 -88 115 -128 11
3682 11 -219 -231 71 167 -63 1 46 -179 276 -75 41 60 170 8 -10 -135 60 136 -84 -27 81 -346 95
3705 95 26 -108 -279 24 -162 -115 -11 164 65 14 -50 -3 -20 -69 180 -182 77 -277 57 117 14 -234 -19
3728 -19 70 -60 -217 29 22 -229 -227 -205 -91 -158 109 -119 -81 118 -73 209 137 -143 -187 -213 -212 2 -43 -37 136 97
3754 97 -247 -52 39 16 22 -208 -66 -22 -98 139 48 159 -234 -69 -87 35 -82 103 90 -13 -78 89 -340 -82
3778 -82 -23 35 174 7 129 -10 274 151 119 67 92 193 50 -99 -121 -193 -59 -254 150 187 -312 -23 -206
3801 -206 -66 95 79 199 -14 281 -86 -241 6 -170 -3 63 59 -155 -149 4 97 -41 -127 -154 -129 -64 327 71
3825 71 85 222 -31 87 -32 -289 -187 91 -116 -63 -31 348 142 -214 303 -125 181 159 63 -32 -13 34 -34
3848 -34 185 106 -166 35 162 24 129 186 -140 -90 -79 25 -185 -242 153 424 -128 -96 64 172 -22 162
3870 162 -175 -57 -5 64 32 -65 -32 -125 -100 -66 -30 -172 -184 -137 -2 -110 154 69 -97 67 57 149 5 24 41
3895 41 -25 208 214 -18 -53 65 162 -10 58 27 70 -22 228 58 -94 -72 -118 -158 100 78 -91 124 -92 7 83
3920 83 84 271 -246 428 156 91 267 70 8 -66 52 -5 -411 -134 32 92 36 337 -3 123 -35 -118 292
3943 292 35 -28 -59 121 -53 -125 53 -45 136 -32 -100 88 -322 44 -188 -223 124 -120 20 -37 -99 73 87
3966 87 -116 -120 -19 -22 -69 -55 -261 -328 -401 15 125 36 113 -67 -88 174 -354 -70 175 23 32 131 -44 170 183
3991 183 -319 -307 -93 -174 14 -60 -156 -330 173 45 52 -15 218 14 165 149 -321 -260 -236 56 93 -153 23 189
4015 189 40 11 52 132 -68 211 -64 -287 182 265 1 83 38 218 115 200 -59 -38 224 -14 -197 -14 51
4038 51 -206 -229 54 -272 -104 -112 -25 5 178 40 -92 37 -253 -125 -95 63 -229 94 193 -42 -44 -200 -125 -20
4062 -20 -46 -117 48 -162 -180 47 -33 154 63 25 -119 162 -103 206 103 78 24 205 -25 -48 -120 -85 -106 -53 180
4087 180 38 74 21 162 -210 -242 49 -82 -165 -153 -81 22 -11 -49 -30 -97 254 65 -150 293 14 208 208 -197
4111 -197 23 -60 -10 -68 200 134 65 -2 -149 -1 81 108 -79 35 -24 63 -68 242 -34 17 5 29 -6 -347 231
4136 231 -9 -78 -239 164 110 -40 -132 147 156 146 116 -33 -108 -279 101 117 -207 -183 105 50 20 -65 -82 22 81
4161 81 140 -7 199 70 -10 189 96 -82 -131 -73 -51 169 -28 30 -10 80 -3 76 42 174 -180 -239 112 126 -15
4186 -15 -204 -110 -250 -44 73 -28 -54 -62 -97 134 28 274 -108 -65 32 -25 -2 7 23 -84 147 40 267 130
4210 130 107 -47 -169 127 165 84 133 39 -102 -276 -10 -238 -26 -123 -90 177 209 82 -212 -351 101 -64 -36
4233 -36 40 -92 -162 286 243 76 24 274 -42 -129 46 -190 -319 -161 -120 -31 179 94 -135 185 -63 -207 -100
4256 -100 -2 178 -214 -109 98 131 -178 7 -26 -39 211 -192 -59 65 234 61 5 -193 -164 57 63 161 -83
4279 -83 -97 -155 -114 -92 -70 -38 195 282 -16 8 -77 109 199 -106 -266 47 61 -223 -12 88 -190 -235 -29 20 77
4304 77 -24 135 -268 166 48 -235 -5 -66 40 276 195 -88 -27 -29 -90 138 -141 262 193 -137 90 -20 -183
4327 -183 140 -147 62 175 -62 -102 -150 -47 -73 -50 -44 -34 226 57 129 253 51 139 144 -61 -81 -279 98 -74
4351 -74 -124 23 23 7 84 209 149 -88 -274 27 22 -129 -35 182 -131 -160 -56 -202 239 44 4 27 -88 -1 -183
4376 -183 222 16 21 72 271 -225 32 216 107 134 138 -90 227 42 305 3 -117 65 154 91 -151 -65 -69 -17
4400 -17 27 210 106 -315 37 -28 82 1 -98 81 196 90 -201 2 -6 55 -315 82 195 334 -130 26 -246
4423 -246 11 -87 222 186 -73 94 -115 211 160 9 -15 20 -115 -192 75 183 -131 -183 -10 -73 -38 -172 -1
4446 -1 -6 -200 -152 12 113 138 168 206 112 -192 -10 55 -126 -66 268 -296 168 -115 -68 -37 -326 -128 -138 186 44
4471 44 -24 -173 127 94 -131 -38 -12 44 -186 -150 42 -73 -20 -58 -69 100 13 90 119 -451 125 96 -58 -151 -74
4496 -74 -109 -10 -5 -29 -155 -351 -54 97 -230 -63 201 -96 -74 -76 -40 -98 -8 7 41 -58 3 -105 70 90 170 -151
4522 -151 122 -49 100 231 103 42 132 -45 226 204 -183 -300 -59 313 168 81 -75 -64 -96 339 24 -86
4544 -86 60 33 133 297 41 -107 267 -133 -294 62 -13 -99 -35 -101 -340 -87 24 207 194 -59 20 41 87
4567 87 244 197 -146 -67 -78 -30 -115 73 -114 0 82 -135 -217 -122 -143 -11 179 -146 -357 -30 3 -121 246 167
4591 167 160 195 -15 -79 -58 113 129 -14 -115 -93 8 104 -276 14 200 -274 87 -184 240 -77 0 -199 99
4614 99 32 -121 -224 -140 -195 121 -84 -1 255 -13 296 197 -114 69 44 -92 -49 14 -2 176 131 -309 250 -131
4638 -131 185 -197 -22 -22 72 65 65 -81 139 205 -65 -61 187 106 -111 -155 -39 58 -197 -86 -74 -128 -205 57 73 -21
4664 -21 -148 38 -339 -184 -7 -131 171 38 -1 -103 -141 -109 43 -51 -43 181 232 95 196 -81 -301 -11 -174
4687 -174 12 -1 140 140 -61 203 -147 153 -175 -2 173 153 88 57 0 -47 -99 -105 -87 154 18 -132 -63 -163
4711 -163 -114 15 146 114 199 -148 -204 -51 -90 296 -23 -27 -160 166 144 -80 -53 101 200 126 -159 -101 120 37
4735 37 36 -276 71 92 264 94 126 162 43 62 132 58 17 74 -24 -117 32 -260 -51 6 -48 -158 26 155 -135
4760 -135 254 -26 -26 -12 120 -18 98 443 4 -147 -94 -176 -58 -26 110 -19 63 122 2 169 274 233 9
4783 9 266 118 -88 86 18 306 25 -158 265 -64 -306 73 72 20 -82 -273 -160 -28 175 95 -32 61 31
4806 31 77 -24 -43 138 -138 1 -140 -11 -76 -13 96 -166 123 48 96 -14 42 233 -153 27 -74 -103 133
4829 133 -536 94 -31 160 137 36 121 189 -20 60 154 115 141 121 90 258 -25 -9 -143 110 -17 -131 -99 -28
4853 -28 -143 -12 208 4 -101 36 -42 80 36 172 -296 120 -93 189 -92 146 207 -21 50 -59 53 -13
4875 -13 108 159 41 115 -90 -7 92 -92 -39 -177 -146 57 -219 -58 124 17 205 108 -213 -85 27 -71 23
4898 23 207 -91 131 131 7 100 97 311 -20 78 19 240 -282 -59 166 78 -24 5 -124 -32 88 139 210 18
4922 18 182 -190 -90 -104 -191 -183 121 10 149 -172 24 -93 43 49 -75 -6 177 301 130 -131 -82 11 -134
4945 -134 -144 223 5 -186 -40 -39 50 -313 96 -87 32 -46 226 -247 202 84 -23 22 -86 -93 -138 26 -23
4968 -23 -230 -246 114 4 -176 66 -36 -221 162 47 -50 -1 20 -318 -13 -190 29 40 118 -100 -60 -136 9
4991 9 123 221 4 -66 107 -71 -118 -148 -240 75 -90 -115 91 -67 -188 211 -3 160 141 41 -31 106 214
5014 214 -150 182 -34 -143 28 156 106 -46 -55 181 241 -55 -27 0 -116 182 -159 -22 26 -320 56 182
5036 182 143 -227 12 33 -161 57 56 -233 34 -84 32 0 -355 264 171 -194 -154 -143 140 -169 39 70 -156
5059 -156 117 -182 -9 7 -229 70 92 130 124 2 -62 -25 241 -41 -72 107 177 17 126 -162 -22 136 -175
5082 -175 166 -72 -22 129 440 124 126 -370 -7 -213 45 32 53 -185 -1 -23 24 38 139 54 158 76 -19 101
5106 101 155 -64 55 -76 -9 -164 75 200 -53 -42 -270 39 -27 61 -224 79 98 -72 92 217 66 -186
5128 -186 -180 -101 136 -50 -292 142 181 -13 10 -38 -88 -153 34 -5 172 -17 127 -29 -124 -82 5 -185 89 82 51
5153 51 -168 74 68 -286 181 60 147 -70 -3 38 -56 67 175 -331 198 76 32 291 -130 -179 -104 -70 71 -26
5177 -26 155 -2 -90 -7 -52 -109 5 26 -37 96 101 9 69 -3 46 -64 -91 288 180 186 -205 34 -123 276 103
5202 103 -14 -98 -60 195 40 17 -88 -213 243 -6 -13 84 -225 303 -100 -46 258 -21 -32 419 83 84 -140
5225 -140 69 -36 -59 164 12 4 221 -81 206 -131 26 -60 72 -244 99 -135 -36 -169 28 -148 -224 -39
5247 -39 -10 102 134 85 -71 52 -181 38 205 79 -3 270 172 -23 33 230 151 11 -5 9 -176 283 -134
5270 -134 18 254 15 -114 147 -190 86 -85 -88 -33 -249 -67 -146 -41 -153 -40 96 21 -115 -14 119 8
5292 8 -13 -47 -321 375 -68 34 38 -70 10 -8 -106 -31 63 32 -156 -285 291 90 -64 -19 -132 -7 -86 -166 111
5317 111 210 -7 -180 -67 60 6 -6 -97 40 -152 0 198 -164 -1 91 -29 -90 -14 -82 60 -31 -24 -90 -170
5341 -170 -10 114 86 282 -129 170 43 143 336 -22 90 114 362 -12 26 149 -117 -29 -272 76 -90
5362 -90 35 291 265 -91 43 72 -57 335 147 132 -157 13 -24 121 114 9 -39 -2 -254 -168 -18 167 -50
5385 -50 -241 96 114 214 -77 3 88 214 79 -93 -217 203 5 -98 257 -4 23 -7 -55 66 -29 -239 -101
5408 -101 -141 281 102 -28 55 365 113 -370 -215 11 -139 -26 45 149 -51 -174 47 165 -180 180 235
5429 235 169 -181 -156 208 56 -338 196 47 285 -30 139 -77 -73 22 80 103 28 -42 75 71 204 143 -77 18
5453 18 -14 16 -223 73 -5 70 83 126 75 104 -141 -89 201 178 207 -220 -141 46 -3 27 57 -149 28 132 56 15
5479 15 -185 -15 -214 17 -120 -110 84 -211 122 -82 126 -146 155 295 -142 194 317 -88 -198 56 -60
5500 -60 -146 -116 -168 -150 -56 -3 74 158 121 31 49 -87 152 -110 -74 29 -111 -100 -241 39 165 0 -7 33 52 58 45
5527 45 -84 209 126 85 159 -128 50 17 126 224 111 343 -72 74 -89 144 25 -4 74 287 -160 160 -1
5550 -1 165 58 -163 -69 -61 -20 -76 95 68 38 126 -110 95 -166 9 1 -144 -282 -122 99 -47 19 -264 104
5574 104 29 39 -116 -4 -44 -266 14 -157 137 16 76 -140 90 -174 40 162 -29 26 -11 106 -144 47
5596 47 89 170 -130 -60 -38 71 -35 -51 -331 82 -169 -67 -29 -35 157 31 -98 -71 -149 146 -44 67 174 -59
5620 -59 84 -294 321 -225 -235 213 -91 54 -12 -140 -91 -63 208 85 -25 106 -153 -35 28 -16 -126 -155 -69
5643 -69 138 232 -166 129 -28 85 303 -111 -38 -20 -69 -141 273 62 41 51 -283 121 -88 -267 -69 -7 -91
5666 -91 -39 -57 -12 -205 -181 -46 56 11 -98 55 -22 78 -47 129 155 -179 120 -90 -338 85 -169 54 149
5689 149 -162 96 -150 41 204 -164 93 57 196 -4 -34 -104 -292 189 95 -65 169 -81 -92 109 -20 -197
5711 -197 -13 -20 -49 20 26 -167 24 -279 153 70 -141 10 5 33 53 76 141 -96 -257 92 -59 -121 -9 -156 77
5736 77 34 67 14 -119 -130 -90 -92 -2 239 -307 3 249 76 121 -322 64 -72 18 -85 -27 -95 -82 -148 23 -344
5761 -344 -157 -161 142 106 -35 150 -25 -13 -86 -105 -2 -36 -31 -25 110 -229 88 286 -43 40 -205 26 -241 -153
5785 -153 77 -323 -113 139 55 -105 201 -226 -187 -245 174 320 -120 8 -22 250 -26 194 16 37 24 -330
5807 -330 -144 0 64 -43 -372 -98 97 118 87 -73 50 -108 41 -430 24 -1 -29 -65 -13 -45 94 15 -4
5830 -4 -22 -39 -20 17 -251 201 -11 108 -148 4 36 113 -51 -127 42 -119 -2 45 -66 -26 -145 72 30 9
5854 9 139 -136 -99 -182 -19 -113 -5 -89 -10 -50 114 -80 -102 30 209 -174 -145 -63 120 3 -175 38 14 27
5878 27 77 -201 -123 76 163 -119 325 215 132 -70 72 31 -87 26 142 27 97 -288 12 -164 -82 232 32
5901 32 77 -19 -52 -137 305 118 87 -37 -69 128 -22 -96 -191 -106 -63 -131 -113 -25 34 -179 102 129 55 140 -194 -148
5927 -148 88 85 -133 -63 113 132 70 -39 -109 104 82 59 -64 141 132 90 125 195 -54 315 218 0 114 -7 34
5952 34 122 -17 -211 -37 28 24 10 -116 -46 -135 46 -4 189 -47 -188 183 45 -93 58 210 282 58 -151
5975 -151 -1 -89 -43 89 -45 -94 -117 -379 111 -72 -147 -85 -48 51 214 -2 2 -108 -149 52 -271 205 6 -125
5999 -125 86 -86 109 -21 -290 44 -165 119 31 -68 -50 -159 89 3 -104 -119 -105 286 -25 -73 60 69 126
6022 126 119 -188 -17 26 -190 -143 -385 -38 -27 -38 126 -85 118 183 32 -244 170 108 -30 67 399 -7 54
6045 54 79 88 -44 -5 -150 -86 -133 190 238 63 72 -44 26 19 -120 54 -267 137 164 -206 -110 96 23 -134 -151 -32
6071 -32 155 187 19 66 5 263 54 -121 -106 112 -34 -46 -141 -200 99 -103 -32 73 -147 97 206 43 -261
6094 -261 -41 175 167 -59 150 -115 -309 -145 -83 131 322 -82 -70 68 15 -120 142 -41 84 211 -27 156
6116 156 18 -123 143 -61 161 -118 10 -74 107 282 2 -105 92 225 44 291 238 -29 -8 115 33
6137 33 -46 -24 85 10 -129 -58 -78 27 -34 61 -197 121 -287 46 92 48 233 -361 -183 -15 -6 44 185 -286
6161 -286 196 37 -24 220 -113 -120 -101 -246 -83 -159 168 -83 -172 -5 -23 -112 102 94 -273 -32 -42 -67 -128 80
6185 80 52 -23 109 65 -348 -95 -305 31 -60 -146 -22 -94 290 -64 48 0 55 -161 -43 215 54 -43 -26 9
6209 9 -44 106 -191 -52 5 -34 20 237 39 373 51 74 -330 -311 19 -264 32 34 -173 -299 -108 -275 -141
6232 -141 -194 -22 40 -94 -1 -243 -169 90 -84 183 80 79 51 -9 12 -121 -65 118 18 -201 143 69 -263 78
6256 78 61 -117 72 439 7 -195 174 279 -111 -111 104 20 324 198 83 -74 37 42 -128 -81 -44 -55 -114 154
6280 154 -175 -171 63 -45 -113 129 -134 42 124 -20 -195 -44 -150 -169 96 147 -38 28 -218 -58 245 -113
6302 -113 7 -159 -40 -25 115 -128 -104 -88 -157 -80 130 -33 88 356 144 -69 -70 -65 267 -102 69 206 56
6325 56 110 64 46 96 -69 21 -101 -55 39 -39 -128 127 -3 -108 81 147 -107 -85 -25 36 82 327 -306 -83 -107
6350 -107 -128 213 94 117 22 118 115 -17 14 183 64 -25 -10 -193 -172 216 113 -7 277 85 -76 33 359
6373 359 17 342 -52 -83 -134 34 65 23 27 35 69 -241 135 -47 -135 109 -38 -113 22 43 64 189 8 -195
6397 -195 27 195 -198 -13 -13 -24 -130 28 11 163 -132 134 16 -214 -80 37 97 160 -147 -87 -19 15 8 105
6421 105 145 0 7 -126 91 -31 -61 -16 -84 48 52 18 127 120 -20 -2 163 -187 -36 -56 288 -62 -68 196 159
6446 159 -85 -223 -138 -65 -6 274 251 -41 -88 107 33 158 -148 151 241 -34 -60 -239 -51 11 -56 -123 61 223
6470 223 52 -78 94 161 -195 94 -69 220 28 -22 21 179 447 61 -362 -194 -85 97 67 119 14 82
6492 82 -54 -69 163 -191 -57 -79 64 -242 25 24 -255 70 147 205 86 6 -187 -82 97 262 -120 161 -5
6515 -5 -104 5 -54 82 10 151 -120 283 58 -48 -239 -156 48 133 -23 45 101 -219 -174 -7 8 97 155 31
6539 31 -76 154 -25 289 -320 -250 46 83 -55 181 77 160 3 100 74 1 226 -5 23 -45 135 411 -58
6562 -58 -38 74 -121 -25 72 113 120 -98 8 -118 -153 131 -265 125 -5 7 54 176 -153 101 32 -185 -156 51
6586 51 -105 61 59 -34 -15 85 -321 -131 77 -197 99 25 46 85 -3 83 148 -174 211 60 -102 -14 -3 49 53
6611 53 124 -197 191 200 170 -201 16 -83 88 31 -117 -141 -136 189 -26 -75 -42 25 305 -93 -12 -46 -13 -47 -87 -201
6637 -201 26 29 -50 -91 198 298 -59 -17 -304 242 73 -80 5 -127 163 -95 -305 -177 228 -3 26 -156
6659 -156 -76 -5 -118 -42 -113 94 194 -186 -62 -218 228 9 43 -46 -48 -106 42 44 -131 -110 -326 55 116 -219
6683 -219 -135 212 25 2 -188 -121 -291 192 -172 -115 -214 -12 62 43 -99 -74 -174 -56 125 -65 21 -265 -125
6706 -125 198 -241 144 -136 -182 -44 -20 133 80 -178 -7 -63 130 -56 -256 210 143 -171 -55 94 87 30 -131
6729 -131 184 15 44 59 -260 33 -62 64 41 -64 -21 -3 219 -38 -64 218 21 -92 90 -300 161 237 124
6752 124 36 -6 -29 126 34 -51 194 -170 -20 -51 -202 -94 29 -171 172 57 47 100 -113 90 -145 187 157
6775 157 50 -134 44 84 -41 177 -62 82 -15 -20 -21 25 -117 129 54 -47 -24 -73 -154 -116 230 15 117 159
6799 159 -50 -275 77 280 140 26 71 139 -12 -109 -24 117 -134 -44 -87 -44 96 -91 75 -19 -304 -120 105
6822 105 347 -13 -228 -72 -27 0 -80 -83 -25 -30 -96 28 -107 101 29 -19 60 -9 48 106 60 116 85 -205 240 -157
6848 -157 -248 -174 -171 28 57 126 80 73 -19 130 138 140 -143 -145 -48 64 -142 163 162 132 -239 -66 129 84 86 10 161 132
6876 132 229 -16 187 189 -42 15 191 -111 -262 -135 55 121 -18 268 -72 223 -110 -153 -192 99 -6 -109
6898 -109 45 36 148 54 293 74 -40 -83 34 10 99 71 -122 -52 -180 188 159 -73 -146 -17 -93 -99 -64 143 -35
6923 -35 -75 156 196 245 -162 162 -66 -164 -19 85 51 -80 -143 -256 -105 -68 -76 117 -2 -110 -24 132 -233 89
6947 89 47 84 38 -30 -167 -84 275 30 -34 -34 185 -121 346 -52 222 -135 192 -30 -70 100 -112 139 -240
6970 -240 258 7 243 -259 -151 193 4 99 1 141 127 3 -145 128 -264 -123 -111 -201 269 -133 -26 -16
6992 -16 -212 67 -7 277 -237 228 76 -300 124 71 -285 -263 -34 -66 -102 41 -94 27 -27 -74 -270 30 178
7015 178 -17 126 63 337 108 21 -37 -106 97 2 -116 -43 -134 -172 209 -11 -76 -127 6 -118 -99 16 211 27
7039 27 -49 256 -11 49 10 72 -351 -193 -6 9 78 28 -99 45 -228 -17 -25 -64 -259 64 10 -124 89 30
7063 30 265 -65 -32 -78 18 -33 -83 -38 4 95 -223 -68 -49 -52 -161 -45 -86 70 -88 -166 -101 70 123 -110 172
7088 172 71 33 129 -279 280 71 -69 71 -80 -31 -230 176 -143 -125 239 -263 120 6 -111 60 -138
7109 -138 302 85 -185 129 -60 9 53 116 -138 -78 -143 60 -138 -220 -65 51 100 -80 -122 43 -6 -6 90 -67
7133 -67 -159 -113 -4 34 -121 156 -111 22 -229 55 45 -38 50 185 0 187 0 -31 2 68 39 -142 207 -89
7157 -89 25 -76 23 -80 -169 173 -68 173 -5 -261 -170 -94 -187 275 37 -50 -51 275 -175 152 262 -160 12
7180 12 144 120 -34 -61 5 -167 -38 23 -49 -80 -320 141 91 15 -156 -101 -172 -11 121 -20 226 57 31 -73
7204 -73 -95 -77 47 323 226 17 248 3 24 140 166 69 21 18 229 -6 57 -81 -100 -149 200 192 109 135 -127 85
7230 85 -180 -26 190 -37 -84 50 -58 110 -103 4 23 288 77 -3 -133 131 -69 172 67 -192 -282 -49
7252 -49 -15 -58 18 111 31 43 83 -82 -287 -40 -122 -79 -360 34 -97 -259 9 -216 -66 22 -50 -90 54 -76
7276 -76 140 14 208 -103 -152 -28 -13 -77 246 186 -305 90 99 -9 40 -189 97 95 -196 58 314 -105 -18 61
7300 61 -52 34 299 206 -12 167 85 100 -45 -96 -83 11 8 -5 69 -130 36 -56 26 175 -41 -138 56 -484 226
7325 226 -61 9 28 -149 -61 343 -233 206 87 -113 188 54 115 304 -93 -21 -86 103 -196 13 3 -203
7347 -203 -123 -23 -214 -154 -145 9 -5 -29 -155 -17 124 -13 115 -117 226 -108 -46 -226 -96 61 20 -52 171
7370 171 144 -86 148 76 -40 56 -54 142 279 -58 -117 155 -94 86 132 -90 -149 -151 -227 20 -210 -235 -244 -44
7394 -44 -16 -30 94 -55 -9 74 -7 -134 60 -84 139 -44 79 34 -152 -41 -124 20 103 98 343 218 97 -46
7418 -46 -130 146 -136 139 301 -47 72 -147 -177 42 -47 -40 -70 60 185 -10 -183 45 104 -87 -82 21 53 -169
7442 -169 -161 -26 -42 -106 42 39 -140 -30 -89 -78 -23 -81 -169 200 -130 -6 141 160 -4 -98 74 -102 227 -118
7466 -118 -126 -100 -130 86 3 -56 -79 -164 -24 258 171 126 12 98 2 -2 203 26 41 -15 -197 -133 -112 -118 167 104 201
7493 201 -120 -1 52 88 -12 56 62 -98 109 -164 -58 -24 72 -166 134 -318 -276 178 -314 84 9 348 -163
7516 -163 121 84 13 -107 -253 110 -35 -37 221 183 -252 -90 -33 114 -163 221 -44 86 -53 14 28 -186 -81
7539 -81 -38 71 -138 52 69 83 9 30 308 213 99 185 134 -491 41 132 31 4 -119 -64 73 -34 -145 -180
7563 -180 57 127 126 83 198 55 27 -14 -209 79 4 -70 48 2 198 42 152 55 -7 -101 163 -39 -89 135
7587 135 262 -54 -139 255 235 0 -88 -14 -113 142 -52 157 102 226 39 -133 41 -84 -187 -1 94 2 -128
7610 -128 70 -44 55 -94 -80 109 11 -6 -101 -80 -110 21 299 -60 -286 -64 120 179 -5 166 -20 -186 72
7633 72 239 202 -5 64 -186 24 12 148 142 71 69 71 116 -62 -39 -152 -166 125 -179 3 -30 -70 -25 -103 73 -127
7659 -127 -122 -5 225 -40 -409 36 6 221 320 -313 7 -145 144 7 -54 27 119 127 12 -73 60 34 118 -46
7683 -46 313 -3 101 -96 -171 10 -377 119 -80 -235 10 10 31 360 -122 54 4 -50 -140 -294 -94 -155 35
7706 35 32 201 137 -38 53 31 32 62 -82 47 -213 54 162 -55 128 -108 282 -39 -341 3 -341 -178 23
7729 23 187 73 0 -87 41 -155 -35 217 95 -4 95 191 60 -95 -290 -50 165 -53 78 142 1 120
7751 120 -23 159 -259 105 122 -150 -161 203 95 162 -80 -28 28 -269 -257 -206 86 -327 -42 99 -131 -106 1
7774 1 116 -116 -21 -98 -32 -63 -13 102 197 113 58 9 131 66 -97 194 65 24 -80 23 -40 154 -54 -52 126
7799 126 9 -288 352 -10 136 -4 86 -193 218 12 -4 -92 -39 -28 -150 -17 -10 -63 24 84 14 43 135 55 47
7824 47 -208 159 236 -153 76 11 30 -108 -297 -60 3 98 43 192 -263 -224 -116 -94 290 134 -64 -55 -68 -201
7848 -201 196 142 -14 -174 -13 -67 114 260 52 20 -128 75 -45 -140 -141 -21 95 -12 215 -62 101 -145
7870 -145 15 27 77 67 63 20 -171 31 512 243 -89 -137 134 11 -134 -45 41 -154 59 -31 -219 102 64 116
7894 116 -41 17 -239 163 -124 -71 -196 34 41 -191 -138 -81 -20 57 178 151 -123 -8 -65 -179 -229 131 185 175
7918 175 -74 -94 -220 -213 76 19 146 -156 82 -160 10 101 39 -51 36 23 -106 -17 156 112 -34 -198 35 -49
7942 -49 -65 -145 -28 156 143 -2 -72 10 48 182 39 -112 198 63 101 61 -322 53 22 3 -182 70 -121 -361
7966 -361 -156 161 -336 -75 -24 118 -374 -50 -80 214 -2 95 -155 -14 -61 0 85 -121 -65 266 -69 -146 173
7989 173 186 164 57 80 -55 -152 -78 401 55 143 -230 -239 105 -42 -82 -129 68 -195 -168 94 172 14 77 -181
8013 -181 91 150 -64 111 17 55 -25 -61 195 -252 265 -58 0 56 20 190 103 133 137 -94 -9 238 110 75 -73
8038 -73 -101 -86 16 -214 12 -6 -53 -38 3 -54 -20 7 73 115 7 206 165 61 16 66 111 316 59 94 -37 25
8064 25 137 -306 -105 38 -23 -105 -52 -50 -74 97 -89 -178 -90 206 -27 148 93 -11 76 -9 153 -2 139 -40
8088 -40 203 -52 -25 8 -128 -48 -298 -76 31 -277 122 110 -107 60 -185 11 -201 -183 115 -2 -68 -308
8110 -308 -53 76 157 -63 23 -164 -34 17 131 -82 -215 84 70 231 -316 -27 -83 -170 -26 -10 268 -111
8132 -111 24 -18 43 -213 175 126 286 265 193 -64 56 183 82 154 -110 4 -21 -95 -250 -13 50 92 71 2
8156 2 60 98 -81 -296 -171 -54 -3 -173 151 103 127 100 179 4 141 267 -2 -198 -110 -3 46 153 -155 113
8180 113 63 67 143 -36 -21 169 194 104 122 -236 83
8191H3
##END NTUPLES=NMR FID
##END=
