##TITLE=1H_LR-773-C1M
 CDCl3
 8 sc, 
 26.10.2023
##JCAMPDX= 6.0         $$ Bruker NMR JCAMP-DX V2.0
##DATA TYPE= NMR FID
##DATA CLASS= NTUPLES
##ORIGIN= UXNMR, Bruker Analytische Messtechnik GmbH
##OWNER= root
$$ XWIN-NMR		Version 3.5
$$ Thu Oct 26 13:59:56 2023 Russian Standard Time (UT+4h)  she@DPX200
##.OBSERVE FREQUENCY= 200.13135
##.OBSERVE NUCLEUS= ^1H
##.DELAY= (6, 6)
##.ACQUISITION MODE= SIMULTANEOUS
##.ACQUISITION SCHEME= undefined
##.AVERAGES= 8
##.DIGITISER RES= 18
##SPECTROMETER/DATA SYSTEM= spect
##.PULSE SEQUENCE= zg30
##.SOLVENT NAME= CDCl3
##.SHIFT REFERENCE= (INTERNAL, CDCl3, 0, 15.7039)
##AUDIT TRAIL= $$ (NUMBER, WHEN, WHO, WHERE, WHAT)
$$ ##TITLE= Audit trail, XWIN-NMR		Version 3.5
$$ ##JCAMPDX= 5.01
$$ ##ORIGIN= Bruker BioSpin GmbH
$$ ##OWNER= she
$$ F:/spectra/data/she/nmr/H-F/1/audita.txt
$$ ##AUDIT TRAIL=  $$ (NUMBER, WHEN, WHO, WHERE, WHAT)
(   1,<2023-10-26 13:58:42.42 +0400>,<she>,<DPX200>,
      <created by zg, POWCHK disabled, PULCHK disabled
       configuration hash MD5:
       00 E9 B6 7A A2 85 ED C7 34 08 36 98 17 FE 4E 26
       data hash MD5: 16K
       A4 E2 B1 DD EF 46 27 E3 B9 5C B5 5F 4A AE 35 03>)
$$ ##END=
$$ 
$$ hash MD5
$$ 24 01 F8 ED 49 77 FA 3D 2C FD 91 E2 C6 30 03 A0
##$RELAX= 
##$RELAX= 
##$RELAX= 
##$RELAX= 
##$RELAX= 
##$RELAX= 
$$ Bruker specific parameters
$$ --------------------------
##$DU= <F:/spectra>
##$EXPNO= 1
##$NAME= <H-F>
##$PROCNO= 1
##$TYPE= <nmr>
##$USER= <she>
##$AMP= (0..31)
100 100 100 100 100 100 100 100 100 100 100 100 100 100 100 100 100 100 
100 100 100 100 100 100 100 100 100 100 100 100 100 100 
##$AQSEQ= 0
##$AQ_mod= 1
##$AUNM= <au_zg>
##$AUTOPOS= <>
##$BF1= 200.13
##$BF2= 200.13
##$BF3= 200.13
##$BF4= 200.13
##$BF5= 200.13
##$BF6= 200.13
##$BF7= 200.13
##$BF8= 200.13
##$BYTORDA= 1
##$CFDGTYP= 0
##$CFRGTYP= 5
##$CHEMSTR= <none>
##$CNST= (0..31)
1 1 145 1 1 1 1 1 1 1 1 1 1 1 1 1 1 1 1 1 1 1 1 1 1 1 1 1 1 1 1 1 
##$CPDPRG= <>
##$CPDPRG1= <>
##$CPDPRG2= <>
##$CPDPRG3= <>
##$CPDPRG4= <mlev>
##$CPDPRG5= <mlev>
##$CPDPRG6= <mlev>
##$CPDPRG7= <mlev>
##$CPDPRG8= <mlev>
##$CPDPRGB= <>
##$CPDPRGT= <>
##$D= (0..31)
0 1.2 0 0 0 0 0 0 0 0.06 0 0.03 0 0 0 0 0.0002 0 0 0 0 0 0 0 0 0 0 0 0 
0 0 0 
##$DATE= 1698314321
##$DBL= (0..7)
120 120 120 120 120 120 120 120 
##$DBP= (0..7)
150 150 150 150 150 150 150 150 
##$DBP07= 0
##$DBPNAM0= <>
##$DBPNAM1= <>
##$DBPNAM2= <>
##$DBPNAM3= <>
##$DBPNAM4= <>
##$DBPNAM5= <>
##$DBPNAM6= <>
##$DBPNAM7= <>
##$DBPOAL= (0..7)
0.5 0.5 0.5 0.5 0.5 0.5 0.5 0.5 
##$DBPOFFS= (0..7)
0 0 0 0 0 0 0 0 
##$DE= 6
##$DECBNUC= <off>
##$DECIM= 32
##$DECNUC= <off>
##$DECSTAT= 4
##$DIGMOD= 1
##$DIGTYP= 9
##$DL= (0..7)
0 120 120 120 120 120 120 120 
##$DP= (0..7)
150 150 150 150 150 150 150 150 
##$DP07= 0
##$DPNAME0= <>
##$DPNAME1= <>
##$DPNAME2= <>
##$DPNAME3= <>
##$DPNAME4= <>
##$DPNAME5= <>
##$DPNAME6= <>
##$DPNAME7= <>
##$DPOAL= (0..7)
0.5 0.5 0.5 0.5 0.5 0.5 0.5 0.5 
##$DPOFFS= (0..7)
0 0 0 0 0 0 0 0 
##$DQDMODE= 0
##$DR= 18
##$DS= 0
##$DSLIST= <SSSSSSSSSSSSSSS>
$$ [...]
##$SUBNAM2= <"">
##$SUBNAM3= <"">
##$SUBNAM4= <"">
##$SUBNAM5= <"">
##$SUBNAM6= <"">
##$SUBNAM7= <"">
##$SUBNAM8= <"">
##$SUBNAM9= <"">
##$SW= 18.05172834244
##$SWIBOX= (0..15)
0 0 2 0 0 0 0 0 0 0 0 0 0 0 0 0 
##$SW_h= 3612.71676300578
##$TD= 16384
##$TD0= 1
##$TE= 0
##$TE2= 300
##$TE3= 300
##$TEG= 300
##$TL= (0..7)
0 120 120 120 120 120 120 120 
##$TP= (0..7)
150 150 150 150 150 150 150 150 
##$TP07= 0
##$TPNAME0= <>
##$TPNAME1= <>
##$TPNAME2= <>
##$TPNAME3= <>
##$TPNAME4= <>
##$TPNAME5= <>
##$TPNAME6= <>
##$TPNAME7= <>
##$TPOAL= (0..7)
0.5 0.5 0.5 0.5 0.5 0.5 0.5 0.5 
##$TPOFFS= (0..7)
0 0 0 0 0 0 0 0 
##$TUNHIN= 0
##$TUNHOUT= 0
##$TUNXOUT= 0
##$USERA1= <user>
##$USERA2= <user>
##$USERA3= <user>
##$USERA4= <user>
##$USERA5= <user>
##$V9= 5
##$VALIST= <valist>
##$VCLIST= <CCCCCCCCCCCCCCC>
##$VD= 0
##$VDLIST= <DDDDDDDDDDDDDDD>
##$VPLIST= <PPPPPPPPPPPPPPP>
##$VTLIST= <TTTTTTTTTTTTTTT>
##$WBST= 1024
##$WBSW= 4
##$XGAIN= (0..3)
0 0 0 0 
##$XL= 0
##$YL= 0
##$YMAX_a= 349199
##$YMIN_a= -380399
##$ZGOPTNS= <>
##$ZL1= 120
##$ZL2= 120
##$ZL3= 120
##$ZL4= 120
##$ABSF1= 10
##$ABSF2= 0
##$ABSG= 5
##$ABSL= 3
##$ALPHA= 0
##$AQORDER= 0
##$ASSFAC= 0
##$ASSFACI= 0
##$ASSFACX= 0
##$ASSWID= 0
##$AUNMP= <proc_1d>
##$AZFE= 0.1
##$AZFW= 0.1
##$BCFW= 1
##$BC_mod= 2
##$BYTORDP= 1
##$COROFFS= 0
##$CY= 11.3945322036743
##$DATMOD= 1
##$DC= 2
##$DFILT= <>
##$DTYPP= 0
##$F1P= 15.7292609196834
##$F2P= 12.9074282941183
##$FCOR= 0.5
##$FTSIZE= 0
##$FT_mod= 4
##$GAMMA= 1
##$GB= 0.15
##$INTBC= 1
##$INTSCL= 1
##$ISEN= 128
##$LB= 0.24
##$LEV0= 0
##$LPBIN= 0
##$MAXI= 10000
##$MC2= 0
##$MEAN= 0
##$ME_mod= 0
##$MI= 1.114404
##$NCOEF= 0
##$NC_proc= 0
##$NLEV= 6
##$NOISF1= 3.799351
##$NOISF2= 2.8
##$NSP= 1
##$NTH_PI= 0
##$NZP= 0
##$OFFSET= 15.70392
##$PC= 1
##$PHC0= -23507.12
##$PHC1= 9.652719
##$PH_mod= 1
##$PKNL= yes
##$PPARMOD= 0
##$PSCAL= 0
##$PSIGN= 0
##$REVERSE= no
##$SF= 200.130013532006
##$SI= 16384
##$SIGF1= 3
##$SIGF2= 2
##$SINO= 400
##$SIOLD= 16384
##$SREGLST= <1H.CDCl3>
##$SSB= 0
##$STSI= 0
##$STSR= 0
##$SW_p= 3612.71676300578
##$SYMM= 0
##$S_DEV= 0
##$TDeff= 0
##$TDoff= 0
##$TI= <>
##$TILT= no
##$TM1= 0
##$TM2= 0
##$TOPLEV= 0
##$USERP1= <user>
##$USERP2= <user>
##$USERP3= <user>
##$USERP4= <user>
##$USERP5= <user>
##$WDW= 1
##$XDIM= 8192
##$YMAX_p= 0
##$YMIN_p= 0
$$ End of Bruker specific parameters
$$ ---------------------------------
##NTUPLES= NMR FID
##VAR_NAME=  TIME,          FID/REAL,        FID/IMAG
##SYMBOL=    X,             R,               I
##VAR_TYPE=  INDEPENDENT,   DEPENDENT,       DEPENDENT
##VAR_FORM=  AFFN,          ASDF,            ASDF
##VAR_DIM=   8192,          8192,            8192
##UNITS=     SECONDS,       ARBITRARY UNITS, ARBITRARY UNITS
##FACTOR=    0.0002768,     1,               1
##FIRST=     0,             0,               0
##LAST=      2.2672688,     0,               0
##MIN=       0,             -380399,         0
##MAX=       2.2672688,     349199,          0
$$ Real data points
##PAGE= N=1
##DATA TABLE= (X++(R..R)), XYDATA
0@%%%%%%%%%%%%%%%qJ6j6J6j6K4l2L2l6M4n2O0o8P9r1J04j19J34j50J68j91K14
$$ 0 0 0 0 0 0 0 0 0 0 0 0 0 0 0 0 -8 8 -8 8 -8 16 -16 16 -20 24 -28 32 -36 43 -48 56 -63 71 -79 89 -102 112
37A12k37K64k94L27l63M02m44M89n39N94o55P21p92Q73r64J065j175J299j441
$$ 112 -125 139 -155 172 -191 211 -233 256 -283 311 -344 377 -415 458 -506 559 -616 683 -758
56g58J606j797K020k290K622l038L573m292N313o865R465j4568K7948j22506k76832
$$ -758 848 -949 1071 -1219 1403 -1635 1938 -2354 2959 -3906 5559 -9009 18939 -103567 -380399
71c80399L96520J39893k60703J74062K79826k09979j08913J79161n1601p9489
$$ -380399 16121 156014 -104689 69373 349199 139220 30307 209468 157867 78378
81G8378J50200j02142k61987O4172N9633j48729J17695J71699k28168j25693J95324
$$ 78378 228578 126436 -135551 -71379 -11746 -160475 -42780 128919 -99249 -224942 -29618
92b9618j04552k18145K69757K34233k62427r9286K69595M3729j28438R5011J05157
$$ -29618 -134170 -352315 -82558 151675 -110752 -210038 59557 103286 -25152 69859 175016
103A75016n5577n3574p5774l8894J76145J11562j53388k6421J42836j13613k04387
$$ 175016 119439 65865 -9909 -48803 127342 238904 85516 59095 201931 88318 -116069
114a16069Q3641Q3065j34868n6468L6241o9543j9J39987K6153n4670M3973J3518
$$ -116069 -32428 50637 -84231 -140699 -104458 -174001 -174020 -34033 -7880 -62550 -18577 -5059
126e059q1500q442O6653N6605N9663k744o3579M8928R2499o7505o2085R7303O983
$$ -5059 -86559 -95001 -28348 28257 87920 85176 21597 70525 163024 95519 33434 130737 137720
139A37720j58723m1623R0766Q292l7773J0454p393m2703m3578m9106M712O0972
$$ 137720 -21003 -62626 28140 36432 -1341 9113 1720 -40983 -84561 -133667 -128955 -67983
151f7983q641m0423N7228N1000l4923L8629J00705k4099o7916L2153J1933n1927
$$ -67983 -76624 -117047 -59819 -8819 -43742 -5113 95592 71493 3577 35730 47663 -4264
163d264K6552P1733J848j3782m53l3508j4619R478m7496m1664K4420k5085o8282
$$ -4264 22288 94021 95869 82087 81634 48126 33507 42985 -4511 -46175 -21755 -46840 -115122
176a15122L3869O2537k9284j0055M5299l0050n0879M1768L3861k0131L5634N7921
$$ -115122 -81253 -18716 -48000 -58055 -12756 -42806 -93685 -51917 -18056 -38187 -2553 55368
188E5368j1643p291L6163N305j1647L597k9025l1951J9449l849l5599L2222M2112
$$ 55368 43725 36434 72597 77902 66255 69852 40827 8876 28325 24476 -11123 21099 63211
201F3211n3525n0244K4170j2336n7441J559K8697j0732j707K5598J5738K2340
$$ 63211 9686 -40558 -16388 -28724 -86165 -84606 -55909 -66641 -68348 -42750 -27012 -4672
213d672K7287q573r199J9888o768k1919K8977L7162q269m70K2537j2832k8450
$$ -4672 22615 14042 4843 24731 17963 -3956 25021 62183 53914 53444 75981 63149 34699
226C4699k502j2301l1725j1595l040j5608j32J6574K493n937j639q752r404j319
$$ 34699 32197 19896 -11829 -23424 -26464 -42072 -42204 -25630 -23137 -29074 -30713 -39465 -48869 -50188
240e0188j98J0564K7873J5766N914K4381K3823n385q113N038o061j7149p763J818
$$ -50188 -50386 -39822 -11949 3817 9731 34112 57935 52550 44437 49475 43414 26265 18502 20320
254B0320P082N816r028r646K945j6393l8000j0650O703j8973j4029K4148J9236
$$ 20320 27402 33218 24190 14544 17489 1096 -36904 -47554 -40851 -59824 -73853 -49705 -30469
267c0469k720J3700K1095k764m133O144l607J74J9427J0412L500K2002J3927j2343
$$ -30469 -33189 -19489 1606 -1158 -5291 853 -2754 -2580 16847 27259 30759 52761 66688 54345
281E4345o258O32k2175k4871k857q686j7255O265J0390j1671n879Q527r967k1300
$$ 54345 48087 48719 26544 1673 -1184 -9870 -27125 -20860 -10470 -22141 -28020 -19493 -29460 -50760
295e0760o05P396k220O453K1038J9638J5127J1938N182L064J792q788j0644M328
$$ -50760 -51365 -43969 -46189 -39736 -18698 940 16067 28005 33187 36251 38043 29255 18611 22939
309B2939P901l164J69J0944K723j4653j5757j0362j5734k0765j3602p00M361L523
$$ 22939 30840 27676 27845 38789 41512 26859 11102 740 -14994 -35759 -49361 -50061 -45700 -42177
323d2177O566J1651Q240J266j587K43J774L017N588J1050J5703J4845O998M714
$$ -42177 -35611 -23960 -15720 -14454 -16041 -15798 -14024 -11007 -5419 5631 21334 36179 43177 47891
337D7891M279o093j5798j0079m404j0636q419L820L156n634m216k549j2035j4141
$$ 47891 52170 46077 30279 20200 15796 5160 -3259 561 3717 -1917 -6133 -8682 -20717 -34858
351c4858p329p636l414Q141J1377J0530J8756J5972J664L645Q514o769j0408R058
$$ -34858 -42187 -49823 -53237 -45096 -33719 -23189 -4433 11539 13203 16848 25362 18593 8185 17243
365A7243P916o668P281J8033l595j0359L678p929k5685j1994k819j4089n241R338
$$ 17243 25159 18491 25772 43805 40210 29851 33529 25600 -85 -12079 -14898 -28987 -34228 -24890
379b4890N69o28P699m625q942Q869Q07j4497J1399K5840k305J145L4107J4072
$$ -24890 -24321 -24949 -17250 -21875 -30817 -21948 -21141 -35638 -24239 1601 -704 441 34548 48620
393D8620j8862O93J0234j7780j5889O252P71l861N033l430o527O638p861k4355
$$ 48620 29758 30451 40685 22905 7016 13268 14039 10178 15211 11781 5254 11892 4031 -20324
407b0324l816J584k3661p098K4148N628m306K3332J2866j6470J865J7761o567
$$ -20324 -24140 -22556 -46217 -53315 -29167 -23539 -27845 -4513 8353 -8117 -6252 11509 4942
420D942p213J5643P304k329P872M761K870Q923j3260k8398J724M559k8526o199
$$ 4942 -2271 13372 20676 18347 26219 30980 33850 42773 29513 1115 2839 7398 -21128 -27327
434b7327L1446j907k7496Q162J2612j8591o168J0803p740n224J0934J175J0085
$$ -27327 4119 2212 -25284 -17122 -4510 -23101 -29269 -18466 -26206 -31430 -20496 -19321 -9236
447i236K9906O265r411J4535j811l0213P800K5844k1801j3826L0401l754l3343
$$ -9236 20670 26935 17524 32059 30248 35 7835 33679 11878 -1948 28453 24699 -8644
460h644J5227K0974k7923j6431N538j9539j1262J9921M61r05K7317m087l1290
$$ -8644 6583 27557 -366 -16797 -11259 -30798 -42060 -22139 -21678 -22583 4734 647 -30643
473c0643J8598K4031k6449J014L9104j4969k5004L7158J9943k6216J2680K1497
$$ -30643 -12045 11986 -14463 -13449 25655 10686 -14318 22840 42783 16567 29247 50744
485E0744l7938k6611J8980o689j5174K2086J696k4629R269N865k7055R802K6997
$$ 50744 12806 -13805 5175 -1514 -16688 5398 7094 -17535 -8266 -2401 -29456 -19654 7343
498G343l0854k4745L3171N011k2468L3957L7047k4851j1278K1004j3010j4746
$$ 7343 -23511 -48256 -15085 -10074 -32542 1415 38462 13611 2333 23337 10327 -4419
510d419K5596P412j7975N603L001j6787Q274J3540j9201j0309L573k7211j8041
$$ -4419 21177 28589 10614 16217 19218 2431 10705 24245 5044 -5265 -1692 -28903 -46944
523d6944K8721J1794j5837J3332J4522k3575q710K1332M807m630P499j798k833
$$ -46944 -18223 -6429 -22266 -8934 5588 -17987 -26697 -5365 -558 -5188 2311 513 -2320
536b320J3820N580N345K2295l985l3522k408J0134k1520l698K8626o636k8248
$$ -2320 11500 17080 22425 44720 40735 7213 4805 14939 -6581 -10279 18347 11711 -16537
549a6537P441N230j7265P222J1280j9705p250P657j2952Q862L9466p6j7249K4635
$$ -16537 -9096 -3866 -21131 -13909 -2629 -22334 -29584 -21927 -34879 -26017 13449 13373 -3876 20759
563B0759J102l8508J5777M0167k3089j7324L3886p484l3266K5653K1489l0038
$$ 20759 21861 -16647 -870 39297 16208 -1116 32770 25286 -7980 17673 39162 9124
575I124o186P353l5765j2549K9783q309j1246L3994n446m3415K1279L1757l3605
$$ 9124 2938 10291 -25474 -38023 -8240 -16549 -27795 6199 753 -42662 -21383 10374 -23231
588b3231j882M4893j9644l4571L9639K6418k3907J7616K5552l3597j8700K0774
$$ -23231 -25113 19780 136 -34435 5204 31622 7715 25331 50883 17286 -1414 19360
600A9360j2910j1175K9994o914l4009J7176R876l5413Q046L3071l4134l1614L0172
$$ 19360 6450 -4725 25269 18355 -15654 1522 11398 -24015 -15969 17102 -17032 -48646 -18474
613a8474N60k6800L2587L2623k5808n300K2153j4230p755K8427k21j4880J8114
$$ -18474 -17914 -44714 -12127 20496 -5312 -10612 11541 -2689 -10444 17983 17762 2882 20996
626B0996n48k2884K3798K3477l2265r796K2523k8933l3442K9795J5685k8799N081
$$ 20996 20448 -2436 21362 44839 12574 2778 25301 -3632 -37074 -7279 8406 -20393 -15312
639a5312J9746k3282j0560K1812l093r640J4988o175j5628K3557J6592j2597J6260
$$ -15312 4434 -18848 -29408 -7596 -10689 -20329 -5341 -11516 -27144 -3587 13005 408 16668
652A6668K3352k7076j7819K6244j328k4163J7125J6083k5499q422J6904n820r883
$$ 16668 40020 12944 -4875 21369 20041 -4122 13003 29086 3587 -4835 12069 6249 -3634
665c634O143r298j5243L525l615o999K0361J2428j6926K285J7797j2495j0297
$$ -3634 2509 -6789 -22032 -18507 -22122 -29121 -8760 3668 -13258 -10973 6824 -5671 -15968
678a5968K3206O456j7276O109J4986n822O93J3086j801p513l774j2751n218R545
$$ -15968 7238 13694 -3582 2527 17513 11691 12384 25470 23669 16156 12382 -369 -5587 3958
692C958n866j0441J4007M327k2430n24J9053r387j5768J1247M285j2517O507J5106
$$ 3958 -1908 -12349 1658 5985 -16445 -16969 2084 -7303 -23071 -11824 -7539 -20056 -13549 1557
706A557J008M865Q108p732l006Q189o055n434J2712Q60j4226P141J0598j4592
$$ 1557 2565 7430 15538 7806 4800 12989 6934 1500 14212 15072 846 7987 18585 3993
720C993o679J3150q842k1446N076Q864j0782o53J3897M62n219K992K65j351N076
$$ 3993 -2686 10464 1622 -19824 -14748 -5884 -16666 -17319 -3422 -2960 -8179 -5187 -4922 -6273 -1197
735a197j713m066R463P379o555L281J4963l407j2639L133K824j2103n369P706
$$ -1197 -2910 -6976 2487 9866 3311 6592 21555 18148 5509 8642 11466 -637 -6006 1700
749A700m02o299J480L423l544m554q06k96k498l506J647O730M021L31M955O129
$$ 1700 1298 -5001 -3521 -98 -3642 -8196 -9002 -9298 -11796 -15302 -13655 -6925 -2904 -2573 2382 8511
765H511n97m568Q60K513j035k510J595N559R65n084O75L988o737j0629L08K039
$$ 8511 7914 3346 4206 6719 5684 3174 4769 10328 11293 6209 6884 10872 4135 -6494 -6186 -4147
781d147q380l546Q784L241n138K627N993k599l924K336K092q26K659L427M189
$$ -4147 -12527 -16073 -7289 -4048 -9186 -6559 -566 -3165 -7089 -4753 -2661 -3487 -828 2599 6788
796F788N267J556k622J525J165p807n374L746J40p297N13O428k450o700P16L40
$$ 6788 12055 13611 10989 12514 13679 5872 498 4244 4384 -2913 -2400 4028 1578 -5122 -4406 -4066
812d066o942l571K852M87k94M889N266K550J517K707N55p77o28J91M70K732J177
$$ -4066 -11008 -14579 -11727 -11240 -11534 -6645 -1379 1171 2688 5395 5950 5173 4545 4736 5206 7938 9115
829I115j55K755K047m659n475J49k661q314l320L936q40l694K701M553k133k927
$$ 9115 8960 11715 13762 9103 3628 3777 1116 -7198 -10518 -6582 -7422 -11116 -8415 -3862 -5995 -8922
845h922J495O58j784P65L727L346L891M456K134J337K197k212l415k53m94l926
$$ -8922 -7427 -6769 -8553 -7788 -4061 -715 3176 7632 9766 11103 13300 11088 7673 7420 6926 3000
861C000p04L875j054m354J380N3p913m869J726k723m865L336M473l44K122N560
$$ 3000 2296 6171 5117 763 2143 2196 -5717 -10586 -8860 -11583 -16448 -13112 -8639 -8983 -6861 -1301
877a301P07j26J862k37o35L393J732j19N301M853m210j885M264l987r733J020
$$ -1301 -594 -720 1142 905 270 3663 5395 5276 10577 15430 11220 9335 13599 9612 -121 899
893H99J572p199l635M563N45l270L83m09k567l38k176k134N885M401k150L775
$$ 899 2471 -4728 -8363 -3800 -3255 -6525 -6142 -6551 -9118 -9456 -11632 -13766 -7881 -3480 -5630 -1855
909a855R429r95l323O596K414o759q72M211k825j176M379L58k877q32n317m452
$$ -1855 7574 6579 3256 9852 12266 5507 4635 8846 6021 4845 9224 9582 6705 5873 556 -3896
925c896R71l584o455M452L453p717M17J1143j227o445O653K885p859J541Q234
$$ -3896 -2925 -6509 -12964 -8512 -5059 -12776 -12359 -1216 -2443 -8888 -2235 650 -7209 -5668 2566
940B566q5K740O142k009j338M732l844n710O353n74j3873K195R349r297m645J2426
$$ 2566 2481 5221 11363 9354 8016 12748 8904 3194 9547 8973 -4900 -2705 6644 -2653 -7298 5128
956E128k263j4997K171M238p627J936Q600l169l61P890l641j851J3268m1j1966
$$ 5128 2865 -12132 -9961 -5723 -13350 -11414 -2814 -5983 -6344 1546 -2095 -3946 9322 9281 -2685
971b685O827O331j3043J971J7158n101r973R124j680j5806M099Q347j0575l136
$$ -2685 4142 10473 -2570 -599 16559 11458 1485 10609 8929 -6877 -2778 5569 -5006 -8142
985h142P384q103l672J1972j546o625J0808j339j7360P079J6397j0161j600J9570
$$ -8142 -758 -8861 -12533 -561 -2107 -8732 2076 737 -16623 -9544 6853 -3308 -4908 14662
999A4662l785j6619J1231Q758j2038K187Q085j2333n824R918m096l601J3387m031
$$ 14662 10877 -5742 5489 14247 2209 4396 12481 148 -5676 4242 146 -3455 9932 5901
1013E901j8267O438N915j6180L881J9842j0274j3205J6023L943j3588J0588J3359
$$ 5901 -12366 -5928 -13 -16193 -12312 7530 -2744 -15949 74 4017 -9571 1017 14376
1026A4376j2730n751Q808n426j430J4658o72r295P742k985j6832Q126J2762j5215
$$ 14376 1646 -4105 4703 -723 -2153 12505 11833 2538 10280 7295 -9537 -1411 11351 -3864
1040c864o204J3712p863j4432J5406J0516j2196j72O311j0472k710J0648J174
$$ -3864 -10068 3644 -4219 -18651 -3245 7271 -4925 -5097 1214 -9258 -11968 -1320 -146
1053a46J732R169o128r405J2378M417j2620O705J0936j7378j0205J4851J062r166
$$ -146 1586 10755 4627 -4778 7600 12017 -603 6102 17038 -340 -10545 4306 5368 -3798
1067c798Q898L840j4900l845M263n257K989Q785p180m114J0008l963n245J6840
$$ -3798 5100 8940 -5960 -9805 -5542 -10799 -7810 975 -6205 -10319 -311 -4274 -9519 7321
1081G321O085j7217J516J1480j1432l430K0011K123j3460L918J816j1329K345
$$ 7321 13406 -3811 -2295 9185 -2247 -5677 14334 16457 2997 6915 8731 -2598 -253
1094b53O909p699j885L905j2248l674J6871j234j2108J1331L186k0709J493K0064
$$ -253 6656 -1043 -2928 977 -11271 -14945 1926 692 -11416 -85 3101 -17608 -16115 3949
1108C949m789o566J5549O16j2844O724R293o099K971M448j2623k643J0418o279
$$ 3949 -840 -7406 8143 8759 -4085 2639 11932 5833 8804 13252 629 -2014 8404 2125
1122B125m852J5934l137k1036N338R115j6222j756J7995o822j4630J0734O415
$$ 2125 -2727 13207 10070 -10966 -5628 3487 -12735 -14491 3504 -3318 -17948 -7214 -799
1135g99q516O753R706q190k097N651o193K353J5587l907q815J2038Q45j8284N131
$$ -799 -9315 -2562 7144 -1046 -3143 2508 -3685 -1332 14255 10348 1533 13571 14416 -3868 1263
1150A263J5810j2945j1897J1029k137j3302O877Q978p915k122K471p874n56Q016
$$ 1263 17073 4128 -7769 3260 1123 -12179 -5302 3676 -4239 -6361 -3890 -11764 -12320 -4304
1164d304l075m53J2030k978r721J0858R758j0970R43J2716p635j1348R861N798
$$ -4304 -7379 -7832 4198 1220 -8501 2357 12115 1145 2088 14804 7169 -4179 5682 11480
1178A1480p139J579L893o668m082J90m482O23M189p495m162Q633j470p833R278
$$ 11480 4341 5920 9813 3145 -937 -747 -5229 -4606 -417 -7912 -12074 -3441 -4911 -12744 -3466
1193c466P682j0846l030J0364j465n494R174O177m572Q83K640k684K169J540n950
$$ -3466 4216 -6630 -9660 704 -761 -6255 2919 9096 4524 5407 8047 5363 7532 9072 3122
1208C122J08M073p982n138J0240N85j1516K328O471j0144n842R220J018o386M068
$$ 3122 3230 7303 -679 -5817 4423 5008 -6508 -4180 2291 -7853 -13695 -4475 -3457 -9843 -5775
1223e775M874l141J213M665p03J197K664l897o21O798j224m487O894L329r941
$$ -5775 -901 -4042 -2829 1836 1133 2330 4994 1097 476 7274 6050 1563 8457 11786 1845
1238A845j766P083m524q423M219L072o917j979M780J66k092K88k12M12K23j858
$$ 1845 79 7162 2638 -5785 -1566 1506 -5411 -7390 -2610 -2444 -4536 -4248 -4460 -4048 -3825 -5683
1254e683J547O041P22l477M397M783m293k511M983O77n425o51L019o32k288l10
$$ -5683 -4136 1905 2627 -850 3547 8330 4037 1526 6509 7186 1761 1110 4129 3497 1209 899
1270H99J512q24l670k905J992k1l859J57M486j20k791L237M018k190j743L188
$$ 899 2411 1587 -2083 -4988 -2996 -3017 -6876 -6719 -2233 -2353 -5144 -1907 2111 -79 -1822 1366
1286A366J004j768O52K856J112q7r39N58R04k485l934P52J619l933k709L842J433
$$ 1366 2370 602 1254 4110 5222 5135 4196 4754 5658 3173 -761 -9 1610 -2323 -5032 -1190 243
1303B43m794J20L660j534m005J567K661q26j99K877K031P46O52L33M86K30j631
$$ 243 -4551 -4431 -771 -2305 -6310 -4743 -2082 -2908 -3107 -230 1801 2547 3199 3532 4018 4248 2617
1320B617r36J467j68j735K6J997j422l611R01K86m067j416K147r2k131J541L399
$$ 2617 1681 3148 2980 1245 1271 3268 1846 -1765 -864 -578 -4645 -6061 -3914 -4006 -6137 -4596 -1197
1337a197j82j120J657J749m78r47J310J944J17L99J339R58l80j431m51p25j577
$$ -1197 -1379 -2499 -842 907 429 -518 792 2736 2853 3252 4591 5549 5169 3738 3287 2562 985
1354I85k422l10M30p03j791N98J466j552k275J281J430k167k64L203J868j000
$$ 985 -1437 -1747 -1317 -2020 -3811 -3213 -1747 -3299 -5574 -4293 -2863 -5030 -5294 -2091 -223 -1223
1370a223K236L211j55q99J665m9j386O86j09j052R60M31k794l83Q01l017k943
$$ -1223 1013 4224 4069 3170 4835 4786 3400 4086 3977 2925 3885 4316 1522 1139 1940 -1077 -4020
1387d020J172o15l532R88L049j194r57L410M26k020J707K231o70P64J991K45J648
$$ -4020 -2848 -3463 -6995 -6007 -2958 -4152 -5109 -1699 -1273 -3293 -1586 645 -25 739 2730 2975 4623
1404D623K020j062l46J727j619l749M60Q43l097j044J360j215k035k8r92o36Q81
$$ 4623 6643 5581 5235 6962 5343 1594 2054 2897 -200 -1244 116 -1099 -3134 -3162 -4154 -4790 -3909
1421c909j627j172K395J007j300L128M450j856p16L704n75k315L122J613k309
$$ -3909 -5536 -6708 -4313 -3306 -4606 -1478 2972 1116 400 4104 3529 1214 4336 5949 3640
1436C640R55J179k737k88K748l563l509K401k655n687L478L127n264K30N137l830
$$ 3640 4595 5774 3037 2749 5497 1934 -1575 826 -1829 -7516 -4038 -911 -6175 -5945 -808 -4638
1452d638l698O150J437m355L203M062l742Q31N861j327n84M713k141n387L733
$$ -4638 -8336 -2186 -749 -5104 -1901 2161 -1581 -750 5111 3784 3200 7913 5772 385 4118
1467D118J524o141K174N236p084m071N647j590n901L479K221o872k06M019k128
$$ 4118 5642 -499 1675 6911 -173 -4244 1403 -187 -6088 -2609 -388 -7260 -7466 -3447 -5575
1482e575R79N515j997k050M625j395l485O691L780o409J360N408n065k250P364
$$ -5575 -4596 919 -1078 -3128 1497 102 -3383 3308 7088 679 2039 7447 2382 132 7496
1497G496o35o878K166ro415J285M408l754k45L267n911k889P881j284n971P158
$$ 7496 6861 -17 2149 2140 -4275 -2990 1418 -2336 -2581 686 -5225 -8114 -233 -1517 -7488 -330
1513c30L500j0577J944J1633l707m405R090j52r819L910M793m934J932N149p639
$$ -330 3170 -7407 -5463 6170 2463 -1942 7148 6996 -2823 1087 5880 946 2878 8027 388
1528C88k495O846m807n825R720Q3j3646L484Q750q955j676J2874k165j0167N894
$$ 388 -2107 4739 -68 -5893 3827 3910 -9736 -6252 2498 -6457 -8133 4741 2576 -7591 -1697
1543a697L769p167M195P547n820j599O182m533k720J0036j325r145N371K194j1578
$$ -1697 2072 -5095 -900 6647 827 -772 5410 877 -1843 8193 6868 -2277 3094 5288 -6290
1558f290J688J1591o078o679P604p53r848M385O446n143J5L298m656m36P968j948
$$ -6290 -4602 6989 911 -5768 1836 1083 -8765 -4380 2066 -3077 -3062 236 -4420 -4856 3112 1164
1574A164k272Q074j944j0444N770O737p946O02R293o123q079O688K241o811L364
$$ 1164 -1108 6966 5022 -5422 348 7085 -861 -259 9034 2911 -5168 1520 3761 -3050 314
1589C14K955q079p80M081l599J170Q230m585n942P153J00q380P200Q927r046l179
$$ 314 3269 -4810 -5590 -1509 -5108 -3938 4292 -293 -6235 918 1018 -7362 -162 8765 -281 -3460
1605c460R604k719o763Q328M058q604p0K594n939O59N504l651j877M841m839p103
$$ -3460 6144 3425 -3338 4990 9048 444 374 2968 -2971 -2312 3192 -459 -2336 2505 -2334 -9437
1621i437Q826L551r813K426Q415p890n031J1196L017o624L385L619o209L62M291
$$ -9437 -611 2940 -6873 -4447 3968 -3922 -8953 2243 5260 -1364 2021 5640 -569 -207 4084
1636D084k467J135M348n979l463O926j732o999N973L387j1026j987Q466l462m745
$$ 4084 1617 2752 7100 1121 -2342 4584 2852 -4147 1826 5213 -5813 -7800 666 -2796 -7541
1651g541P743J920p439J204M044k838K041L473l179O49M543m147j494Q925j08
$$ -7541 202 2122 -5317 -4113 -69 -2907 -866 2607 -572 77 4620 473 -1021 7904 7796
1666G796r021L788M859q756k512Q958j623p070K834J344m966N34K768k417Q2J616
$$ 7796 -1225 2563 7422 -1334 -3846 5112 3489 -3581 -747 597 -4369 -3835 -1067 -3484 -3402 -1786
1682a786m093M28O518j920k951O894J190p567K401P432m102l111O360K51o036
$$ -1786 -5879 -5451 1067 -853 -3804 3090 4280 -3287 -886 6546 2444 -667 5693 5944 -92
1697i2J899L185l053o87P62l210n89J073k817k98M548k595m751M492K156n683
$$ -92 1807 4992 1939 1252 2014 -1196 -1785 -712 -3529 -3827 721 -1874 -6625 -2133 23 -5660
1713e660J038O582k290m062M704K707k692J247K950q48j081Lj260R61J924l317
$$ -5660 -4622 1960 -330 -4392 312 3019 327 1574 4524 3676 2595 2598 1338 2299 4223 906
1729I06j205L994k437n176L018L103n071k728M578q39l623J908L243j614l12J397
$$ 906 -299 3695 1258 -3918 -900 2203 -2868 -5596 -1018 -1857 -5480 -3572 -329 -1943 -2255 -858
1745h58K17L72O88o25J725K419k500q73L971k78m061J370L383l635l461L071Q95
$$ -858 -641 -269 419 -206 1519 3938 1438 565 4536 4258 197 1567 4950 1315 -2146 925 1820
1762A820l173o02J596n02j540q45Q08R73m37j885J594K669j450j450L642J729
$$ 1820 -1353 -1955 -359 -861 -2401 -3246 -2438 -1465 -1902 -3787 -2193 476 -974 -2424 1218 2947
1778B947k960k36L184l31k437J331J620q82j061j4M00m55j178p21O95l89k130
$$ 2947 -13 -249 2935 2604 167 1498 3118 2236 1175 1161 1561 1106 -72 -793 -98 -487 -2617
1795b617L75K118j078j870J836J719k334q89K754L20j618N78K238K14j053N10
$$ -2617 -2242 -124 -1202 -3072 -1236 483 -1851 -2740 14 334 -1284 -706 1532 1746 693 1203
1811A203Q88M4j386J8N51R7j522n70J745k04k236K60J596j495j869J540J220j214
$$ 1203 2091 2135 749 767 1318 1415 -107 -677 1068 864 -1372 -1112 484 -1011 -2880 -1340 -120 -1334
1829a334p27J960P80j079k02J485L77r08n72R91R02j093o0J334L70k020j27R06
$$ -1334 -2061 -101 679 -400 -602 883 1260 352 -220 771 1673 580 520 1854 2224 204 77 983
1847I83n16j869L29R17o91q50O27J085j69j267J13J671n85j263J143J692o99j020
$$ 983 467 -1402 -1073 -156 -847 -1697 -1070 15 -154 -1421 -1308 363 -222 -1485 -342 1350 651 -369
1865c69J928R56j702o68J407M8j599K18K59m40l58l80L10L22k13j573J90J468
$$ -369 1559 2515 813 145 1552 1600 1 219 478 38 -320 -700 -390 -68 -281 -1854 -1664 -196
1883a96j144j158K155J034j871L78K361o89j128J369O37j226L18O20o05K69M66
$$ -196 -1340 -2498 -343 691 -1180 -802 1559 870 -258 1111 1748 522 840 1460 855 1124 1590
1900A590q26j67L24r61j288R55j49j769O99R60j030p83J872n3j011J077K3k33
$$ 1590 764 597 921 -40 -1328 -373 -522 -2291 -1592 -632 -1662 -2445 -573 -626 -1637 -560 -537 -770
1918g70M91R22J50P83M01j122N87J021j071j084J665n35k054P31N17j163j34P79
$$ -770 -279 643 793 1576 1977 855 1442 2463 1392 308 1973 1438 -616 115 632 -531 -665 114
1936A14j813n93J205j029j076K264L75k262J601J983k048K70L349j163j968K343
$$ 114 -1699 -2292 -1087 -2116 -3192 -928 -553 -2815 -1214 769 -1279 -1009 2340 1177 -791 1552
1952A552Q99k403J261K369k040r55K100j590j928K055j78l187J124J262l457L21
$$ 1552 2451 48 1309 3678 1638 683 2783 1193 -735 1320 1142 -2045 -921 341 -3116 -2795
1968b795L569k086k306L180M1l296J965L369k209m67K815q31j303K580J3j328
$$ -2795 774 -1312 -3618 -438 -397 -3693 -1728 1641 -568 -1035 1780 949 -354 2226 2239 911
1984I11K014n7l077J123K392k867q66K991j936l502J973P70k536Q76J369j762
$$ 911 2925 2868 -209 914 3306 439 -427 2564 628 -2874 -901 -131 -2667 -1791 -422 -2184
2000b184l44J366r17L97K820j556j566K820M06k954K948L463l868j122M041j732
$$ -2184 -2528 -1162 -2079 -1682 1138 -418 -1984 836 1242 -1712 1236 4699 831 -291 3750 2018
2016B018l084L224J094l677N41J173l060O38K383k700q38K782k337l836M946J992
$$ 2018 -1066 2158 3252 -425 116 1289 -1771 -1133 1250 -1450 -2288 494 -1843 -5679 -733 1259
2032A259m780J353M899l853k938N771R15l739K006K238l903P06K884j914k89L247
$$ 1259 -3521 -2168 2731 -1122 -4060 1711 2626 -1113 893 3131 -772 -66 2818 904 615 3862
2048C862l256l059L778J77m809L061L144n602j347N182j680l463M351J226m435
$$ 3862 606 -2453 1325 1502 -3307 -246 2898 -2704 -4051 1131 -549 -4012 339 1565 -2870
2063b870O63K768j744P58K905j858p52K281j977j668M212N87m650J608K866m378
$$ -2870 -2207 561 -1183 -425 2480 622 -130 2151 174 -1494 2718 3305 -1345 263 3129 -1249
2079a249r46N152j075m023J709R81l353J046K475j594L08J444l096r9M322j309
$$ -1249 -2195 2957 1882 -2141 -432 549 -2804 -1758 717 -877 -569 875 -2221 -2320 2002 693
2095F93l283M813P04n849J568N426l189k420M942p22n305K196K602k953Q73J769
$$ 693 -2590 2223 2927 -2922 -1354 4072 883 -1537 3405 2683 -2622 -426 2176 -777 96 1865
2111A865l206n79L118k492q64M329p97n279L121L475m791K18N766j905m700L485
$$ 1865 -1341 -1920 1198 -1294 -2158 2171 1374 -3905 -784 2691 -2100 -1882 3884 1979 -2721 764
2127G64K132l968P60L082k250j050J179k012O55L121k032k398L328p15m522K275
$$ 764 2896 -1072 -312 2770 520 -530 649 -1363 -708 2413 381 -2017 1311 596 -3926 -1651
2143a651M387l383k190L944j93l205K157K128j318l07N28j370M81J780j702M37
$$ -1651 2736 -647 -2837 1107 914 -2291 -134 1994 676 369 897 -473 8 1788 86 523
2159E23K601k855k907L361Q52m165J398L260l679k166L719L51k537J936J058k057
$$ 523 3124 269 -2638 723 1575 -2590 -1192 2068 -1611 -3777 -58 293 -2244 -308 750 -1307
2175a307M08P88q26J346J818k443m56L436j465l029L686J752m228p01L441j678
$$ -1307 -899 -111 -937 409 2227 -216 -672 2764 1299 -1730 1956 3708 -520 -1221 2220 542
2191E42l188L189J037k941l68J261q82j73R63j051L87J401j632j041L363P49l208
$$ 542 -2646 543 1580 -1361 -1729 -468 -1350 -1523 -560 -1611 -1224 177 -1455 -2496 867 1616 -1592
2208a592J890K552k778j199L575M65k963Q27J866j793p48N81pj36p62j149M08
$$ -1592 298 2850 72 -1127 2448 2913 -50 777 2643 850 102 683 676 540 -222 -1371 -963
2225i63R06j775o27K903m95k894R25K456j239j324K416J030j564J06J254N11l04
$$ -963 -57 -1832 -2459 444 -51 -2945 -2020 436 -803 -2127 289 1319 -245 -139 1115 1626 1322
2242A322n35J82J414o49j992J042J718j790j806J633O95l006j82K212n85k186
$$ 1322 787 969 2383 1734 -258 784 2502 712 -1094 539 1234 -1772 -1954 258 -327 -2513
2258b513Q78R75p61L0M84L84N73n17l83J301R41j296J75K314p47j991J232J749
$$ -2513 -1635 -660 -1421 -1391 -907 -523 50 -467 -850 451 1392 96 271 2585 1838 -153 1079 2828
2276B828k015j143J632Kj964j36J277m87j266k41N88j16o39k23Q13P44r74l59
$$ 2828 813 -330 1302 1304 -660 -796 481 -6 -1272 -1513 -925 -1041 -1680 -1903 -1090 -346 -1320 -1679
2294a679J976L11j511P12J763n58j253R96J301r59o13P41K57p93n37L36L35p54
$$ -1679 297 608 -903 -191 1572 1014 -239 757 2058 1099 486 1227 1484 691 154 490 825 71
2312G1r95O09M99j244p41J316K05j357J74J571n06p35O88J047j14q65P08P21j2
$$ 71 -924 -315 184 -1060 -1801 -485 -280 -1637 -1463 108 -398 -1133 -445 602 488 -377 331 1052 1040
2331A040r86K54J034P4j525K98J115p53j191O87O96j130r99J374j15j021J27M24
$$ 1040 54 308 1342 1416 -109 189 1304 551 -640 47 743 -387 -1386 -12 -127 -1148 -1021 -597
2349e97M39o53R5Q17Ln66p5J004N13j080j78J231L77j372J47J037o79n15J23M77
$$ -597 -158 -811 -716 101 104 -462 -537 467 980 -100 -278 953 1330 -42 105 1142 463 -52 71 548
2369E48p24l53N03N0o06j25J65L60rj025O20R31n44o42J082Q01j183J0O40j02
$$ 548 -176 -529 -26 24 -582 -707 -542 -182 -191 -1216 -596 335 -209 -851 231 1032 -151 -141 499 397
2389C97m24K05L55j5l86M3l1j39n8l14J58N31p56m96R17O3p21O20L78n51k81O13
$$ 397 -27 178 533 518 132 175 144 5 -53 -367 -209 322 -434 -930 -13 50 -671 -51 327 -224 -505 108
2411A08m6j80K62M13m68K49J75l64L57J70p13m01J137j019m14Q89J64j222K05
$$ 108 62 -118 144 557 89 338 513 149 506 676 -37 -438 699 -320 -734 155 319 -903 -698
2430f98Q52q01l25J019q9o23O45K56m41O67K33o24N88O73j474j32J437m75j291
$$ -698 154 -647 -972 47 -42 -665 -20 236 -205 462 695 71 659 1332 -142 -274 1163 688 -603
2449f03J193M77j668J09J210j109k89P94n14j138J047P9r65J446L75j546L42J778
$$ -603 590 1067 -601 -492 718 -391 -680 114 -400 -1538 -491 -412 -1377 69 444 -1102 -760 1018
2467A018j269m74J893R4j949J105R94r46k0J305j078p08R03p34p52R04K02j610
$$ 1018 -251 -725 1168 1262 -687 418 1412 466 446 1751 673 -35 868 134 -618 286 488 -1122
2485a122M14P33j496p2J692l15j491J362M36j493P59J305n79K75N75r01n10J666
$$ -1122 -708 25 -1471 -1543 149 -166 -1657 -295 141 -1352 -593 712 133 408 983 82 -428 1238
2503A238m52q07J833j69k525O96J962j804q00J899j151j951J343P65j576P93P44
$$ 1238 786 -21 1812 1643 -882 -186 1776 -28 -828 1071 -80 -2031 -688 77 -1499 -706 38
2520C8j537K55J336j210k87K144j54k037J909J095k079P53K505j711j212J546
$$ 38 -1499 -1244 92 -1118 -1405 739 585 -1452 457 1552 -527 226 2731 1020 -192 1354
2536A354j89j658J011J132k083K64P72j816k43K319j315j474J811k6k582J632
$$ 1354 1165 -493 518 1650 -433 -169 603 -1213 -1456 863 -452 -1926 -115 -141 -2723 -1091
2552a091K399k186p23K688r74j667J902J275j397O54R57j747Q6J449j091j90J889
$$ -1091 1308 -878 -1601 1087 113 -1554 348 1623 226 880 1837 90 176 1625 534 344 2233
2569B233j599k155J845P45k461Q75J922k446j425K423l22j216J556N21j943O44
$$ 2233 634 -1521 324 1069 -1392 -517 1405 -1041 -2466 -43 -365 -1581 -25 496 -1447 -803
2585h03J087j125O55J989j823m17K024j188j555K605J574l557R0K363j985j520
$$ -803 284 -841 -186 1803 -20 -437 1587 399 -1156 1449 3023 -534 -444 1919 -66 -1586
2601a586K607j1j998N29L42j458O60J470j648J35J827k068j175L221K75k650J554
$$ -1586 1021 1010 -988 -459 -117 -1575 -915 555 -1093 -958 869 -1199 -2374 847 1122 -1528 26
2618B6K061k641j060L307n9k119J182P76k226O91P83q60M95Q89j901o85J798q22
$$ 26 2087 -554 -1614 1693 1634 -485 697 1473 -753 -62 721 -139 356 1245 -656 -1341 457 -365
2636c65j333K118Q18l037K61K411j457j008K463J32k057O96M95l01P09L55p15
$$ -365 -1698 420 1238 -1799 -1538 873 -584 -1592 871 1003 -1054 -358 137 -164 545 900 185
2653A85J23O23j446J10K144j225k027J910M83k332M07K253q68j440J031Q5r12
$$ 185 308 931 -515 -405 1739 514 -1513 397 880 -1452 -1045 1208 340 -1100 -69 16 -896
2670h96Q32M59o57P29J45j286M60J497j325o12K163n46k664J800J519j961o71
$$ -896 -64 395 -262 467 612 -674 -214 1283 -42 -654 1509 963 -1701 99 1618 -343 -1014
2687a014K403j153j774J403R62j495M67O01j087N44L71r75P01J574j254j384K013
$$ -1014 1389 236 -1538 -135 827 -668 -201 400 -687 -143 228 -747 -46 1528 274 -1110 903
2704I03M34k269O47K321j454j551J626L63j470K57O29m67m59R4k04L59O86j448
$$ 903 1337 -932 -285 2036 582 -969 657 1020 -450 -193 436 -31 -490 -396 -600 -241 445 -1003
2722a003L17J329r51q01R94J211j457M9J405l74j037N40P69o11J0r9M5p8k12m39
$$ -1003 -686 643 -308 -1109 -115 1096 -361 -312 1093 719 -318 222 991 380 390 291 336 258 46 -393
2742c93P14N5j635K48J703r45j458J683N75j544l62J388J95q94O14M48l06K93
$$ -393 321 376 -1259 -1011 692 -253 -1711 -28 547 -997 -1359 29 224 -670 -56 392 86 379
2760C79k80N9P73j6j096M09J005j277o58J448R0j754L73J178q22j165Q72M10p65
$$ 379 99 158 931 915 -181 228 1233 -44 -702 746 836 -918 -545 633 -189 -1354 -482 -72 -837
2779h37k94P83j15r3J61j78M48L31l56K17J001n57p45Q40Q03j016m02J248j80
$$ -837 -1131 -348 -463 -556 -395 -573 -125 206 -150 67 1068 511 -234 606 1409 393 -9 1239 1059
2798A059j132j38R81q22l45j76P63l15o00k2N67j59p47M31O50m03n48Q33P10m78
$$ 1059 -73 -211 770 -52 -397 -573 190 -125 -725 -747 -180 -339 -1086 -655 -5 -408 -956 -123 587 109
2818A09m23P04O70n10l29O22L60o41j14P0N61q97o79N79L48j052k86R67n5j007
$$ 109 -314 390 1060 550 221 843 1203 562 448 518 1079 182 -497 82 430 -622 -908 59 4 -1003
2838a003j97R87m36n87O90N32l75l08N16O81k49k87K48P60m56m23K08P45o77m87
$$ -1003 -1200 -213 -649 -1236 -546 -14 -389 -697 -181 500 251 -36 212 972 516 93 301 1046 369 -118
2858a18L89N85j020l45P04J20r98J19N52k36p02L2O60O4n79P9N32K15l66r2O04
$$ -118 271 856 -164 -509 195 315 -683 -564 -12 -248 -950 -918 -258 -194 -773 -694 -162 53 -313 -405 199
2879A99K59l11K52N67k71n91L70L45n16k47N9K50m16k13K70O0l71k31L44K04o84
$$ 199 458 147 399 966 695 104 474 819 303 56 115 365 -51 -264 6 66 -305 -536 -192 12 -672
2900f72k22Q13J31r92O79O68o23k1N12M2l36K18K49L9j67q7k27L29J21p58o3J006
$$ -672 -894 -81 50 -942 -263 405 -218 -239 273 315 -21 197 446 485 318 231 4 333 454 -304 -367 639
2922F39m22r26P61L76j229K26P42n75k57M13J47k85K12L77l76K8L49m98J63J040
$$ 639 217 -709 52 428 -801 -575 167 -408 -665 -252 -105 -390 -178 199 -177 -149 200 -298 -135 905
2942I05r75PN91Q6r09J98Q78q18m49O10j46m70N02Q9m66J55J19k64N21K38p57
$$ 905 -70 -63 528 614 -295 -97 781 -37 -486 124 -22 -492 10 99 -367 -212 -93 -357 164 402 -355
2963c55K86N52n95m15R92M2p82M71M84o14l24L22o7l00N08m01m96Q84o2p23K68
$$ -355 -69 483 -112 -527 465 507 -275 196 680 66 -258 64 -3 -303 205 -196 -692 192 130 -593 -325
2984c25J172j431rR42Lj063R32O05j209J79Q97n33l63R11l92l97M86k76r16Q21
$$ -325 847 -584 -593 349 352 -711 221 826 -383 -204 693 160 -203 708 316 -81 405 129 -787 34
3004C4M53j154J30J260r95q31J031L53r63L64O93r53J99R83m52l06P88l66n95
$$ 34 487 -667 -537 723 -272 -1103 -72 281 -682 -318 375 -578 -379 604 152 -154 634 268 -327
3023c27J102J22j262M65J045j438l32J459o35j072J062K09j410N06P26q15J02
$$ -327 775 897 -365 100 1145 -293 -625 834 199 -873 189 398 -1012 -506 220 -595 -493
3040d93P98p61m29J042j28q65J240J97j145O66Q60r27k13J341l95j170N76Q45
$$ -493 305 -456 -885 157 29 -836 404 601 -544 122 982 55 -158 1183 788 -382 194 1039
3058A039j234L11Q25r37l37Q23r22o68J150M0j416J148M06j700N11J664p48q04
$$ 1039 -195 116 941 4 -333 490 -432 -1100 50 90 -1326 -178 228 -1472 -961 703 -45 -849
3076h49J083J31q76P84P10q22K53N46r56j58J506r86m96J188o18j540Q05J138
$$ -849 234 365 -511 273 983 161 414 960 4 -154 1352 366 -130 1058 440 -1100 -295 843
3094H43j256m11J199o17j137R28M65p21M81K39p62L33O18p40J13J556o63q67J198
$$ 843 -413 -824 375 -242 -1379 -451 14 -707 -226 13 -749 -416 202 -538 -425 1131 468 -399 799
3113G99K83j526O79J298j021r30R34J06j420R38M44j091K16J20q61M57R58j075
$$ 799 1082 -444 235 1533 512 -418 516 622 -798 140 584 -507 -291 -171 -1032 -575 383 -692
3131f92m97J518p46r23J384P32j198J35J282n88r28J099N55r36M75n7l96q1M14
$$ -692 -1189 329 -417 -1340 44 776 -422 -287 995 407 -521 578 1133 197 672 615 219 138 552
3150E52o57L72L16j110l68J006m0j197R15O46j366l91J495j02j002J012K40m16
$$ 552 -105 267 583 -527 -895 111 71 -1126 -211 435 -931 -1322 173 71 -931 81 321 -95
3168i5J66J77n14O99L75q63J01J075j012n95J418j90j478L55J364j406m75J229
$$ -95 71 248 -266 433 808 -55 46 1121 109 -486 932 742 -736 -381 983 -423 -898 331
3186C31k30q32M61L95p58L97M18n54J33O37o52j34J133k64j196J205O78j521q1
$$ 331 101 -731 -270 125 -633 -236 182 -372 -239 398 -254 -388 745 481 -715 490 1168 -353 -434
3205d34J616q37r52J123l3p89k33N98k98Q9J07o39Q05K55o39l67J154l90q67O85
$$ -434 1182 345 -607 516 483 -306 -539 59 -239 -150 -43 -682 123 378 -261 -628 526 136 -731 -46
3225d6P03p02n58J036K34j168M02J47OJ5l64J84K94j10n65N67M77p53l78R87j01
$$ -46 657 -45 -603 433 667 -501 -99 48 54 69 -295 -111 183 73 -492 75 552 -201 -579 408 307
3246C07q98J63J163p96k95O14N1l16m1L81K6om72j08O11Np37K20O45r67l12R43
$$ 307 -591 -428 735 -61 -356 258 309 -7 -48 333 359 353 -119 -227 384 389 -348 -128 517 -450 -762 181
3268A81J37r32p0J120m47m46L23M31l72p4M74m86K55J4j93N42M8m73J31O36l77
$$ 181 318 -614 -684 436 -11 -457 -134 297 -75 -149 325 -161 94 108 -85 457 505 32 163 799 422
3289D22p70L45O57o88n23N60L4m82j31N84Q5o18L24K27L4k17j11N38Q6m78j6N07
$$ 422 -348 -3 654 -34 -557 3 37 -445 -576 8 93 -525 -201 26 60 -157 -268 270 356 -122 -138 369
3311C69J82o87M17J59k9n99L00J60k67k24l1M01p9o80K97M85p29l14N48N18l87
$$ 369 551 -136 281 440 411 -188 112 272 5 -219 -250 151 72 -608 -311 174 -555 -869 -321 197 -190
3332a90n75Q42J28o22J57O37P0m32J93M67j36l31L8P5J01k97r7Q5K33p86K55L68
$$ -190 -765 77 205 -417 -260 377 447 15 208 675 539 208 246 321 422 125 28 113 346 -440 -185 183
3354A83k23o93K21O62n97n76N23Q22q23J58L40J85m00K30J60K23k02j55K97J89
$$ 183 -40 -733 -512 150 -447 -1023 -500 322 -501 -343 -3 182 -218 12 172 395 193 38 335 524
3374E24l33j40L29K97p08k85N56O9m71K9M76m03l01K27l6j5m69L17L78j50j29
$$ 524 191 51 380 677 -31 -316 240 309 -162 -133 343 -60 -361 -134 -170 -185 -654 -337 41 -109 -238
3395b38L51J74q4l38M94L69p50J22L39m2m85N05Q3l31j52j39L16j40k96l10L91
$$ -238 113 287 203 -135 359 728 -22 100 439 397 -88 417 500 169 17 -122 194 54 -242 -552 -161
3416a61K68o44O5O03j78k61j2L88k97k45N12K95m27J71K38j38Q0p1p1K11j3k15
$$ -161 107 -537 -472 131 -47 -308 -320 68 -229 -474 38 333 -94 77 315 177 257 186 115 326 313 98
3438I8OL92n54l33L39L35n69j68M10nl69K12L06o82L71K04K26k72O7N6m0L58m81
$$ 98 104 496 -58 -391 -52 283 -286 -454 -44 -49 -418 -206 100 -582 -211 -7 219 -53 14 70 30 388 -93
3461i3J7L11j00l71L41M02o51J2K54k59J00QK54k56J28j20r8J23j57l24L69N59
$$ -93 -76 235 135 -236 105 507 -144 -132 122 -137 -37 -29 225 -31 97 -23 -121 2 -155 -479 -110 449
3483D49p97N9L77Pm08L67K75l84k2K91m36K95J35k65o2K34m0p33P76Pn63J85O35
$$ 449 -348 -289 88 95 -313 54 329 -55 -77 214 -222 73 208 -57 -119 115 75 -658 118 125 -438 -253 382
3506C82n66k56N75L22q63K21O12n93KN41m31p9L79j13m05K77J34n53L22M64n34
$$ 382 -184 -440 135 457 -406 -185 427 -166 -164 377 -54 -133 246 133 -272 5 139 -414 -92 372 -162
3527a62j60M80l0o89N70M16n97Q9K74m18N12J26m3j35j44q3k27N01L35p96L00
$$ -162 -322 158 128 -561 9 425 -172 -83 191 -227 285 411 368 233 89 6 -221 280 615 -181 119
3548A19J66n27k25O00R2p30L17L39n17J54N06l92J15K56l60j29P80n42l21P17
$$ 119 285 -242 -467 133 225 -505 -188 151 -366 -212 294 -98 17 273 -87 -216 564 22 -299 418
3568D18L50r68P0P50m13o19O40J40p78L49L34m49K05K12m59l65O36j89n62P95
$$ 418 768 -200 -130 620 207 -412 228 368 -410 -61 273 -176 29 241 -218 -583 53 -136 -698 97
3588I7K23j052O49N39o32l51R22j13n74L20L44m90M16m8j86K82L60q30o3P21n4
$$ 97 320 -732 -83 456 -176 -527 395 282 -292 28 372 -118 298 250 64 346 706 -124 -187 534 480
3609D80j016P22J46r01LR84q08L5L50J94p72M76K66m51L12r6k10K79N45o02j39
$$ 480 -536 186 332 -569 -566 418 -390 -355 -5 189 -583 -107 159 -292 20 -76 -286 -7 538 -64 -203
3630b03J002l60o85N61J48l59j17P99m52m77J91K20n95K92K6m10J06K76n78L53
$$ -203 799 439 -246 315 463 104 -13 786 334 -143 48 268 -327 -35 -9 -419 -313 -37 -615 -262
3650b62N48l56n08Q20j74o00M57P81o95k70O11p4l94M45Q7m82J86K4j51J07J75
$$ -262 286 -70 -578 242 68 -532 -75 706 11 -259 352 278 -116 329 416 -66 120 144 -7 100 275
3671B75p36L65L03m89l34P98j45p16O26K42k44o02N40J64j32K07j92L22j11N3
$$ 275 -461 -96 207 -282 -616 182 37 -679 -53 189 -55 -657 -117 47 -85 122 -70 252 141 194
3691A94k61K46J47n29RQ73n14n66N94M03n48n81O63n2m51K43J02J09k13l35K27
$$ 194 -67 179 326 -203 -194 679 165 -401 193 596 48 -533 130 78 -373 -130 -28 81 -132 -467 -240
3712b40K03rj59L4L39l95r8P20J52p35R8N88n65P6J80L80l92k80K52m3O7k76J89
$$ -240 -37 -46 -205 -171 168 -227 -325 395 547 -188 -90 498 -67 9 189 569 177 -103 149 106 173 -103 86
3735H6M0J02o18M4O70k27n94P49k2m33n0M09Q2n64J86K51l5M5j8j1m8j21j55N66
$$ 86 126 228 -390 -346 324 97 -497 252 230 -203 -253 156 238 -326 -140 111 76 121 103 92 44 -77 -232 334
3759C34j35n36J88N03k29m20L13L60o65q7O37j08n60K49M36k64M6l25L68j75N2
$$ 334 199 -337 -149 354 125 -295 18 378 -287 -374 263 155 -405 -156 280 16 62 -263 105 -70 -18
3780a8n2Q8J86k53l13P62k25p40M74O35n21n03M81L64k32k84K41J38k40n2j61
$$ -18 -70 18 204 -49 -362 400 175 -565 -91 544 23 -480 1 365 133 -151 90 228 -12 -64 -225
3801b25N02k41k34L90m9k41j47L31kl70K40J83km11R3o2J97j8j06K92J43m00O1
$$ -225 277 36 -198 192 143 -98 -245 86 84 -286 -46 137 135 -276 -183 -245 -48 -66 -172 120 263 -137 -76
3824g6M42J59p34N0P77n97m66M95M49l73k61J70J54j61l82L35K24n81J77q5N24
$$ -76 366 525 -209 -159 618 21 -445 50 499 126 -135 35 189 28 -354 -19 205 -376 -199 -284 240
3845B40k94l63J69K77j7k89L25J88m28j97N79N9k91J57L92j67k65L6J18Ml29J74
$$ 240 -54 -417 -248 29 12 -277 48 236 -192 -389 190 249 -42 115 507 340 75 111 229 233 -96 78
3867G8J28o8j79nK40l80k60J88M09m80l6L50j44jJ36O2M0m19L42K31j14k68M99
$$ 78 206 138 -41 -46 194 -186 -446 -258 151 -329 -365 -15 -159 -160 -24 38 78 -341 1 232 118 -150 349
3890C49R3j12m12k8M97k61R1l46M98n48j49J02PK16j71j74J48J29n6j00L46k20
$$ 349 442 330 -82 -110 387 126 217 -129 369 -179 -328 -226 -219 -3 -174 -348 -200 -71 -127 -227 119 -101
3912a01l34N43Ln22L60J21K34m31M2M38l24N9lK11k10j15oR2j34M0q4J20O4k66
$$ -101 -435 108 111 -411 -51 70 304 -127 -85 353 29 88 85 296 86 -29 -35 57 -77 -37 -121 -1 63 -203
3936b03R4J29q2m23K80N04m23l26M78J93j77QJ74k31j93J74K23O4j12k41J52K47
$$ -203 -109 20 -62 -485 -205 299 -124 -450 28 221 44 52 226 -5 -198 -24 199 263 151 -90 62 309
3958C09n28J20L02j22k50k3K35k95J6J31J38o5m7k79K01KK1Q3L18k14k95J89N33
$$ 309 -219 -99 203 81 -169 -192 43 -252 -236 -105 33 -32 -79 -358 -157 -155 -134 -51 267 53 -242 -53 480
3981D80n29j52N18k03m3J2K66o66N58Q5j86j66K00k89J02K65m85P0K00J40m83
$$ 480 -49 -201 317 114 71 83 349 -317 241 326 140 -26 174 -115 -13 252 -233 -163 37 177 -306
4002c06J3L68j76l16N17j50l02M27l5j91j39O77l82l5M00j29l77M24j49l41J67
$$ -306 -293 75 -101 -417 100 -50 -352 75 40 -151 -290 387 5 -30 370 241 -136 288 139 -202 -35
4023c5M90l95k73L07J01n51L27l5l8m1K77k37j93L55k15L6L23j47k13M64j85j55
$$ -35 455 60 -213 94 195 -356 -29 -64 -102 -143 134 -103 -296 59 -156 -120 203 56 -157 307 122 -33
4045c3j8N23n82k42O58l23m44N43J52j38k01J89o8N6J90m41mL50m57j94O05O8
$$ -33 -51 472 -110 -352 306 -17 -461 82 234 96 -105 84 16 72 262 -179 -183 167 -290 -484 121 189
4067A89m84j30P50m41k25M84L9l50M40J39p57L17K58m98j43P48k35p59Q49J51
$$ 189 -295 -425 325 -116 -341 143 182 -168 272 411 -346 -29 229 -269 -412 336 101 -658 191 342
4087C42p15J75O37k96m94O02l10k28M84L9m18L43j29q0J19Q1m22L54N2r4m44L08
$$ 342 -373 -198 439 143 -351 251 -59 -287 197 236 -182 161 32 -48 71 152 -270 84 136 42 -402 -94
4109i4M36n22J73M90m87J83k02K08k40J44K96m44K89n1k08Q4K47m33N0M97l73
$$ -94 342 -180 -7 483 -4 179 -23 185 -55 89 385 -59 230 179 -29 55 302 -131 -81 416 43
4130D3k65L44m5k15j72N66m98J5L3J4ML49Ql60K95L0m83L80M62m21m18J072k12
$$ 43 -222 122 77 -138 -310 256 -242 -227 -194 -180 -176 173 181 -179 116 146 -337 43 505 84 -334 738 526
4153E26o82K95N66p41k53P23l42m04L14j7m42P95k23n43K07K59k64r4Q37o03k65
$$ 526 -156 139 705 -36 -289 434 92 -312 2 -15 -457 338 115 -428 -221 38 -226 -320 517 -86 -351
4174c51N67j27l50K5Q31m12r9Q3J69l20K89P0l56K04m3k14J28K54m50n9N40m82
$$ -351 216 89 -261 -236 595 183 84 167 336 16 305 375 19 223 180 -34 94 348 -102 -161 379 -103
4196a03k54k6N70n84l4L68J88k03K6n8p6L33k08p8K04J34l53j8M54j67k82L58
$$ -103 -357 -383 187 -397 -431 -63 125 -78 -52 -110 -186 147 -61 -139 65 199 -154 -172 282 115 -167 191
4218A91J23l29k9M05n20r3K08k68K37j7P7k06M06l03l84M42K11j71k31L98l00
$$ 191 314 -15 -44 361 -159 -252 -44 -312 -75 -92 -15 -221 185 -118 -502 -60 151 -20 -251 147 -153
4239a53j73M02L10o05J96L97j71m19L21N8k74L41k99N0R2R3k06J50J04m92k36
$$ -153 -326 76 386 -219 -23 374 203 -216 105 163 -111 230 -69 -19 73 166 -40 110 214 -278 -514
4260e14O20j85k5P2K00k01k32L08M6l11J45J79R7q5j41K01LJ34n80K36K36l14
$$ -514 106 -79 -104 -32 168 -33 -265 43 89 -222 -77 102 199 114 -27 174 177 311 -269 -33 203 -111
4282a11o2L27J9m57J27K18o2j80O8J99m08J8K38J12J36l97L0K46L4l12L64K3k34
$$ -111 -173 154 173 -284 -157 61 -1 -181 -113 86 -322 -304 -66 46 182 -215 -185 61 95 -217 147 170 -64
4305f4j9J30Q4k40k09L30J89m72L36N4j7j0k16K6J55p8K9k71N50m24k58L23J98
$$ -64 -83 47 131 -109 -318 12 201 -271 65 119 102 92 -124 -98 57 -21 8 -263 287 -137 -395 -72 126
4328A26l66m9N09l68j65K58K08n4n30O29r2o3j75J06L1j55N2n8L33r9lNJ59l47
$$ 126 -240 -289 220 -148 -313 -55 153 99 -431 198 106 43 -132 -26 5 -150 -98 -156 177 78 75 80 239 -108
4352a08M4M28l3l28k22J68N1j84L45k54R5j50k18N63l34K3k9K84j95o1K44J20
$$ -108 -64 364 331 3 -219 -51 0 -184 161 -93 2 -148 -366 197 -137 -114 -143 141 -54 -115 129 249
4374B49k5m78N64j88l3l78L30K04j79l00J94O9J03k8kM5k28q3J4K34n03L72J4
$$ 249 224 -254 310 122 89 -289 41 245 66 -234 -40 29 132 104 102 147 -81 -164 -150 84 -419 -47 -33
4397c3J00k53R3l3K8j43p2L62n0L1O1J77j07k65L27J92m31l63M70L42n85K5J68
$$ -33 67 -186 -93 -126 -98 -241 -313 49 -1 30 91 268 161 -104 223 415 -16 -379 91 433 -152 -127 41
4420D1n5p4J1R1P3k07J01k64L66k84j43N10J10p21N07J39J76l50NL07j53p0K07
$$ 41 -14 -88 -77 14 87 -120 -19 -283 83 -201 -344 166 276 -445 62 201 377 27 32 339 186 116 323
4443C23j20j49K79m78N1K87R3m19q3K1Q3J31J3k03j52N45l65l21K10K95k9j83
$$ 323 203 54 333 -145 -94 193 286 -133 -216 -195 -112 19 32 -171 -323 222 -143 -464 -254 41 12 -171
4465a71K79k0Q7j1j23Q2K07k46q4M61j68n65M3L97k12o4N0K46m93R5M18n85K99
$$ -171 108 88 175 164 41 123 330 84 0 461 293 -272 -229 168 -44 -108 -58 188 -305 -210 208 -377 -78
4488g8j7q3O5P4J12k01K42J41o33M42K42l64KL94k29k17M20Q8n14j50M92k91J13
$$ -78 -95 -178 -113 -39 73 -128 114 255 -378 64 306 -58 -56 338 109 -108 312 400 -114 -264 228 -63 50
4511E0nJ8l30L4K04k85M75M7m13j50L74j79k28O07k80j67M07J3k28l4L37k68o0
$$ 50 45 63 -267 -233 -29 -314 161 208 -205 -355 19 -160 -388 219 -61 -228 179 192 -36 -70 267 -1 -61
4534f1J93j02j8K71k35k64M00J67m87mK75k66j03L76O2n37K20M5K6M0J51k82L51
$$ -61 132 30 12 283 48 -216 184 351 -136 -140 135 -131 -234 142 204 -333 -113 -68 -42 -2 149 -133 218
4557B18J04l33k32K94Q9k68K04K38k83K2L05k36o2j88J85n8K78j07l8j66J64k17
$$ 218 322 -11 -243 51 140 -128 76 314 31 53 358 122 60 -128 57 -1 277 170 132 -34 130 -87
4579h7j50M99k03n50L54M76q19M66J86Lm89L40J05l97K11N1J80l85L40k79JM23
$$ -87 -237 262 59 -491 -137 339 -480 -14 172 175 -314 26 131 -266 -55 -4 176 -209 131 -148 -147 276
4601B76m30k0M11p1k83J13J80m15J26L01l40m6K53L8J6k5j20n9K0K19j90r3M91
$$ 276 -154 -174 237 166 -117 -4 176 -239 -113 188 -152 -198 55 93 109 84 -36 -95 -75 144 -46 -139 352
4624C52k66j33J19M1k66J19K97k28k87O88l18j6m0J52m11L08q8k61L33p2l4j79
$$ 352 86 -47 72 113 -153 -34 263 35 -252 436 118 102 62 214 -197 111 23 -238 95 23 -11 -190
4646a90L23L2l05J97K53o63K83K71j61m41M45j00j16J36M8k65N18r7j96k3N26
$$ -190 133 165 -140 57 310 -353 -70 201 40 -401 44 -56 -172 -36 12 -253 265 168 -28 -51 475
4667D75n92o6M84K7o54L34L29l32l48L91kk53K95J10l01j6k03J14L26k79R4K3
$$ 475 -117 -183 301 328 -326 8 337 5 -343 48 46 -207 88 198 -103 -119 -322 -208 118 -161 -67 -44
4689d4K40k40k53K39L35n73M95k7k24k03M89N6k47L8J93j61k19K24k78J73J39
$$ -44 196 -44 -297 -58 277 -296 199 172 -52 -255 234 290 43 81 274 113 -106 118 -160 13 152
4710A52k64j0L75k02m19L72L7k39KM44k46j29o3J54PK62j69N9m3J2j11mJ44j39
$$ 152 -112 -122 253 51 -368 4 41 -198 -196 248 2 -127 -190 -36 -29 233 64 123 80 92 -19 -23 121 -18
4734a8%J38J9m06M02N6k08k35L45o2k65L36j87q6k4Q6p5K25J63l51M01K19m56
$$ -18 -18 120 139 -267 135 191 -17 -252 93 31 -234 102 -85 -171 -195 -109 -184 41 204 -147 254 473 17
4757A7k86L41R3j80L8K56j44k80L96j33RJ4K4p5l67J78N5K41j34j66j98M65l06
$$ 17 -269 72 165 -15 23 279 135 -145 251 118 127 141 165 90 -277 -99 -44 197 63 -103 -301 164 -142
4780a42l2J87l0j15k48K41L29l20j00M14j12P7j89j3J15M0j34O2K93l42j10K59
$$ -142 -174 13 -17 -132 -380 -139 190 -130 -230 184 72 149 -40 -53 62 102 -32 30 323 -19 -129 130
4802A30l9l93R5L36j69q4jN9j53J4R9k5j21L89j90k8J88l32P4L60j11k2K3J61
$$ 130 91 -302 -207 129 -40 -124 -125 -66 -219 -205 -106 -131 -252 137 -53 -81 107 -225 -151 209 98 76 99 260
4826B60j22m1Q9p3m4j9J0J50l01M8Q4J33l37J19k16N06l70m5K86j31j23J64l9
$$ 260 138 97 186 113 69 50 60 210 -91 -43 41 174 -163 -44 -260 246 -124 -169 117 -14 -137 27 -12
4849a2J8l42M10J09k84L4P0J32l0k6JK68m90K7K60K04l74JN3K57l65l1K71j78
$$ -12 6 -336 74 183 -101 -67 3 135 105 79 80 348 -142 -115 145 349 -25 -24 29 286 -79 -110 161 -17
4873a7N5M7J00k1n86L21P0J29j89QL12j24j72q3N37j81k19J78J64k82j89M49r7
$$ -17 38 85 185 164 -422 -101 -31 98 -91 -83 229 105 -67 -150 387 206 -13 165 329 47 -142 307 210
4896B10k31K34qm6rk56k6M78l66j98J05N3q4j02K45J35n57J91K6r7J13J69Q1n5
$$ 210 -21 213 205 159 150 -106 -132 346 -20 -218 -113 -60 -144 -246 -1 134 -423 -232 -206 -303 -190 -21 60 5
4920Ej69K91J07J84m16LK84j88k16J72J73j57j66K84lk04r8L06k41j39or2K18
$$ 5 -164 127 234 418 2 5 289 101 -115 57 230 73 -93 191 188 -16 -114 192 -49 -188 -194 -286 -68
4943f8j36j34K65J7j90K93R6R7j68j15L96k90j95L1K35k48J26J41j21J12o1K3
$$ -68 -204 -338 -73 -56 -246 47 143 240 72 -43 353 63 -132 -101 134 -114 12 153 32 144 83 106
4965A06r3m5k9l04L96l58m1J66K65r4k94L72j75j42L47Q9q2l46L57K8l03K60l46
$$ 106 13 -32 -61 -365 31 -327 -368 -202 63 -31 -325 47 -128 -270 77 166 84 -262 95 123 -180 80 -266
4988b66O12j69N8k28O9m4k29K22J24j20j77J88m9j72P1M64m62L5k78J88J05J76
$$ -266 346 177 235 7 76 32 -197 25 149 29 -148 40 -9 -181 -110 354 -108 -73 -351 -163 -58 118
5010A18k74R1L80o09L92j55K62l48N8K92R4k12n3K90l41J44Q3l50j60K18n0J87
$$ 118 -156 -65 315 -294 98 -57 205 -143 -85 207 301 89 36 326 -15 129 212 -138 -298 -80 -130 57
5032E7j10k30J43J97j96l01O41q7l09J74J49J46m14m7K15L2j44J80r6J94J90k32
$$ 57 -53 -283 -140 57 -139 -440 201 114 -195 -21 128 274 -140 -187 28 60 -84 96 0 194 384 152
5054A52k58K11K47n33L12j82k33M24k9k03j03J72K9j04K1Kj55L5J70o7J46j2j22
$$ 152 -106 105 352 -181 131 -51 -284 140 111 -92 -195 -23 6 -98 -77 -75 -230 -195 -25 -92 54 42 -80
5077h0n6L82k17l61N32J64l67J00N8j34L1J04K58l79j34L47m22R3K23k52J60R3
$$ -80 -136 246 29 -332 200 364 -3 97 155 21 52 156 414 35 -99 248 -174 -81 142 -110 50 143
5099A43k42qO4R6k75K38K04k43j76K44j09RJ59J18j49r1M2p3M0J54k47J79R7j01
$$ 143 -99 -107 -43 53 -222 16 220 -23 -199 45 -64 -55 104 222 73 -18 24 -49 -9 145 -102 77 174 73
5123G3r5K04p2l25j3K83P0j90Q5J34k38Q7j04J12j31J90k15J52J25j97J3N0J71
$$ 73 -22 182 110 -215 -228 55 125 -65 20 154 -84 3 -101 11 -120 70 -145 7 132 -65 -52 -2 169
5146A69m44J39O59m86j5j19M67m05L23j59k65K60n6r3MK14l62J06R6j45j86L92
$$ 169 -275 -136 523 37 22 -97 370 -35 288 129 -136 124 68 -25 -21 193 -169 -63 33 -112 -298 94
5168I4J71l73j08M71m95J84J02K1O3j22J73n2j17J84j64j54K47o4k25M80p9k65
$$ 94 265 -108 -216 255 -240 -56 46 67 130 8 181 129 12 196 32 -122 125 61 -164 316 237 -28
5190b8J22rm09K44L14l03N2j03R3j70K87j44j11p6K61j93K0M13k40q4L87l31P3
$$ -28 94 85 -324 -80 234 -69 -17 -120 -27 -197 90 -54 -165 -241 20 -173 -153 260 20 -64 323 -8 65
5213F5K1n2L5O0j75J86M2r0q7k2k06J34oJ7J4k45K21L65m99J30n7J46k51J50J21
$$ 65 86 34 69 129 -46 140 182 92 5 -17 -223 -89 -95 -78 -64 -309 -88 277 -222 -92 -149 -3 -254 -104 17
5238A7r7k8oL66k20j93M07k71k2J38q2J52K7o5l17M36k95j11O5N5j39j21L83J41
$$ 17 -80 -108 -114 252 32 -161 246 -25 -47 91 9 161 188 123 -194 242 -53 -164 -99 -44 -183 -304 79 220
5262B20l29M4J80k77K42j67K89J21k75r7J14L08l83j06N30k79j09m9K43n2l04
$$ 220 -109 -65 115 -162 80 -87 202 323 48 -49 65 373 -10 -116 414 135 26 -23 220 168 -136
5283a36J25J42Rl48K55Q4j73oj62L30p6k72J22J4j68K04K9j38J28n4K80m6k91
$$ -136 -11 131 140 -208 47 131 -42 -48 -210 120 44 -228 -106 -92 -260 -56 -27 -165 -37 -91 189 143 -148
5306a48L27j34J42j5k26J77Lk37l7QR2K26n01O58l59Jp6K30L1l55K18J14pm40
$$ -148 179 45 187 172 -54 123 126 -111 -148 -140 -48 178 -323 335 -24 -23 -99 131 162 -193 25 139 132 -308
5330c08K88Q9q4nm8K02nk87L95k66L16m46J91J95k38j75K89k4l03j08L61N0r4
$$ -308 -20 69 -15 -20 -68 134 129 -158 237 -29 287 -159 32 227 -11 -186 103 79 -224 -332 29 79 -15
5353a5j42L03k00k35L74o3o5j84O6J06M1j66n4L05j17j55K80K4l79L26nN9l7m00
$$ -15 -157 146 -54 -289 85 22 -43 -227 -161 -55 -14 -180 -234 71 -46 -201 79 103 -276 50 45 104 67 -333
5377c33N98O3l56j33L09o8o6k41K05J33k11J89j29m6P4j40o4K50Lm1J09Ql1m52
$$ -333 265 328 -28 -161 148 80 14 -227 -22 111 -100 89 -40 -86 -12 -152 -216 34 37 -4 105 113 82 -370
5401c70M53k12K20p5K70m12RN34m24K2j98J97J99l39J51J44M8k26k4J23MM9j69
$$ -370 83 -129 91 16 286 -126 -117 417 -7 15 -183 14 213 -126 25 169 217 -9 -33 90 94 143 -26
5424b6O7m04J56J05l7oj23L49K2Q9r1n5J27o0j83J33J37j92J3j5l2K4o3K39j92
$$ -26 41 -363 -207 -102 -139 -145 -268 81 103 192 101 46 173 113 -70 63 200 8 21 6 -26 -2 -65 174 -18
5449a8j64l9K65ql22N1J87o7j03M5K51n54O4L54q6L43k67j01M82l67L9M0J25k02
$$ -18 -182 -221 44 36 -286 -235 -48 -115 -218 -173 78 -476 -412 -58 -144 199 -68 -169 313 -54 -15 25 150 -52
5473e2j60J98K23j59k29O37o2o71K62J67j54J98k71J40j55K71m50K82Rj26j37
$$ -52 -212 -14 209 50 -179 458 396 -275 -13 154 0 198 -73 67 -88 183 -267 15 24 -102 -239
5494b39K10K1k26P1K26N2j92J57p3o4R3j90J76L46l69Q5L11k09k71J24J10n2m41
$$ -239 -29 -8 -234 -163 63 115 -77 80 7 -57 36 -154 22 368 -1 84 395 186 -85 39 149 97 -344
5517c44N01k6l96J85K05n8N2j41M0o5k17K40q2K24j31M1J27J99m83K60K18l13
$$ -344 157 131 -265 -80 125 67 119 -22 18 -47 -264 -24 -106 118 -13 28 155 354 -129 131 349 36
5539C6j76K25Q5k33k9K90k77R2J08j60N7k57n2p0N24j5j93O5j63m9Q2M12k98k92
$$ 36 -140 85 170 -63 -92 198 -79 13 121 -39 18 -239 -291 -361 163 148 -45 20 -143 -192 -110 302 4 -288
5563b88M66j10j08K1L12r1j69K18l26J06L1k45J52K56k45k12K11K1m5k24K74K27
$$ -288 178 68 -40 -19 293 202 33 251 -75 31 62 -183 -31 225 -20 -232 -21 0 -45 -269 5 232
5585B32m03jL87k44K7L6k6J34m2k06Q7R0J2k00M99j82o81M98J43k45O1J12k1J12
$$ 232 -171 -172 215 -29 -2 34 8 142 100 -106 -19 71 83 -117 382 200 -481 17 160 -85 -24 88 67 179
5609A79j15j8l43M51q7m42K21L72n05J42N12m02j16J0M0j84L15q3L09n48M31j4
$$ 179 64 46 -297 154 67 -375 -154 218 -287 -145 367 -35 -151 -141 -101 -285 30 -53 256 -292 139 125
5631A25n1R5N5j91M9J22k41j46L06l00R1J76K11l17L5J31k54K5q8K12K5m2j20
$$ 125 74 169 224 33 82 204 -37 -183 123 -177 -86 90 301 -16 19 150 -104 -79 -167 45 70 28 -92
5654i2q3P8K87k97m2L88j20k8J22j71n56O47Q5k31OJ54p4j14J12k16J31k1J45
$$ -92 -175 -97 190 -107 -149 239 119 91 213 42 -514 133 218 -13 -7 147 73 -41 71 -145 -14 -35 110
5677A10k46J32J15r5j23R1j5m8k26M10k74K31j02L51m77r8L06j86J96J24J27m48
$$ 110 -136 -4 111 16 -107 -16 -31 -79 -305 105 -169 62 -40 311 -166 -264 42 -144 52 176 303 -145
5699a45K67l31M09j47Jo3J96l43n1K19M0l84K65J86j16k88K31L0j64J35j1k8K01
$$ -145 122 -209 200 53 54 -9 187 -156 -207 12 52 -332 -67 119 3 -285 -54 -24 -188 -53 -64 -92 109
5722A09j80o6Q7k1o7J41L47l26j80L55Q0j90k68K73K2j03k4J14o1m4R6k88K40
$$ 109 -71 -137 -50 -71 -138 3 350 24 -156 199 279 89 -179 94 116 13 -11 103 42 -2 94 -194 46
5745D6p4j04K46J3k88k12M99o6m31L30J28j84Q2rL96j80k41K05n4j61j10J05M63
$$ 46 -28 -132 114 127 -161 -373 126 60 -371 -41 87 -97 -15 -24 372 192 -49 156 102 -59 -169 -64 399
5768C99j46l06J32J56j73k42L14k07J69m07N29p0k63j56%K95J26r6K6j11Q4k65
$$ 399 253 -53 79 235 62 -180 134 -73 96 -311 218 148 -115 -271 -271 24 150 54 80 -31 53 -212
5790b12J19J59j70j33M72q0m30M03J44k11R3k32K14k87O5Q8j15J55k58J29J95
$$ -212 -93 66 -104 -237 235 155 -275 128 272 61 154 -78 136 -151 -86 2 -113 42 -216 -87 108
5811A08pk93Q2J88k55j46M27j38m0J3J28J40j18j63K60k00k2j0L78l73j87M41
$$ 108 101 -192 -110 78 -177 -323 104 -34 -74 -61 67 207 89 -74 186 -14 -36 -46 332 -41 -228 213
5833B13k45p0J93j80K81k69Q4j36K61k60k4n4M36n22QK58J06l40K21J53J0j45
$$ 213 -32 -102 91 -89 192 -77 7 -129 132 -128 -152 -206 230 -292 -284 -26 80 -260 -39 114 124 -21
5855b1R0n4K73j65k05O2K17j74j4J41j48m8J01J61m49K07j73M08K2m58J94j78
$$ -21 69 15 288 123 -82 -20 197 23 9 150 2 -46 55 216 -233 -26 -199 209 231 -227 -33 -211
5877b11K73l57J2M98k62J4O5K15j75j45J89O0l37L83j39K29r9j35J54m4j37m2
$$ -211 62 -295 -283 215 -47 -33 32 247 72 -73 116 176 -161 222 83 312 213 78 232 188 51 9
5899IL00j56m24K15K07K1m25O9K92j51j19j4L39M9n06L28j3r1l2M8k8L1J03%o5
$$ 9 309 153 -271 -56 151 172 -253 -184 108 -43 -162 -176 163 212 -294 34 21 -70 -102 -54 -82 -51 52 52 -13
5924a3J12m3j44L45j82k51J33K94m98N66n21Q6K41J07k64N7r0PJm4Q1J86j86j03
$$ -13 99 56 -88 257 75 -176 -43 251 -247 319 -202 -116 125 232 -32 25 -65 -58 -57 -101 -20 166 -20 -123
5948a23N6m7J61P3j21N4J72k31j26J11K05l55Q3K38r0j98K22j77J92j12j68K73
$$ -123 -67 -114 47 120 -1 53 225 -6 -132 -21 184 -171 -88 150 60 -138 84 -93 99 -13 -181 92
5970I2j11j84J1M00k72k51L15j94K07j31J11L6L8k89PM01j28j48J61J89j66k97
$$ 92 -19 -203 -192 208 -64 -315 0 -194 13 -118 -7 29 67 -222 -215 186 58 -90 71 260 94 -203
5992b03K38M04n33O6K32k52K29l63K50p7J08k44L02k87j73N1M59l26J8J93q9O8
$$ -203 35 439 -94 -28 204 -48 181 -182 68 -9 99 -145 157 -130 -303 -252 207 -119 -101 92 3 71
6014G1j1m1Q2j89qJ28j09N1J11N4j50m8mL02M6k55r2J76k1l28j02M06k12p1M3
$$ 71 60 19 101 -88 -96 32 -77 -26 85 139 -11 -59 -63 239 285 30 -62 114 93 -235 -337 69 -143 -214 -171
6039a71K20l08L56Jl14J73r3l8J1J77j00L53j25N2j15n6R8J46l79K03o9k14L25
$$ -171 49 -259 97 98 -216 -43 -136 -174 -163 14 -86 267 142 194 79 23 121 267 -112 91 22 -192 133
6062A33j13j49J52J18l12J11Rk09O3K23k0m0k91L48j88k40N35k15M8K70k27J37
$$ 133 20 -129 23 141 -171 -60 -51 -260 -197 26 6 -34 -325 23 -165 -405 130 -85 -37 233 6 143
6084A43k36J88O2j2k44K19J37j72j45Q9j20K95m69K80K41l37o5n9J34j81K51J29
$$ 143 -93 95 157 145 -99 120 257 85 -60 29 -91 204 -265 15 256 -81 -146 -205 -71 -252 -1 128
6106A28k45o2m5L10j00l3J24j22J85Rk16M63l88m1j72N52l63l38O63j62p3j88
$$ 128 -117 -179 -224 86 -14 -47 77 -45 140 149 -67 396 8 -33 -205 347 -16 -354 309 147 74 -114
6128a14K64k83J45m8J18r4N7k29q0L34j35k12K13L07k96N7K4k10J49m8J16k18
$$ -114 150 -133 12 -36 82 -12 45 -184 -264 70 -65 -277 -64 243 -53 4 28 -182 -33 -81 35 -183
6150a83J26K76k34J61j16n3j05N5K13l37K02m5o4J85o8k73Q7K09l3k26P1o0J25
$$ -183 -57 219 -15 146 30 -23 -128 -73 140 -197 5 -40 -104 81 13 -260 -173 36 3 -223 -152 -212 -87
6173h7L26j98Q9j07k37J6OL17j0l71K57K80j74k15L76j19j54q0n8J97m9j06mN1
$$ -87 239 41 130 23 -214 -198 -192 125 115 -256 1 281 107 -108 268 149 -5 -85 -143 54 5 -101 -105 -54
6197e4J14j00P5K3k34J24J66r9l45M04J51k19J44k21L67l78o4K95q7K33m36L1
$$ -54 60 -40 35 58 -176 -52 114 15 -330 74 225 6 150 -71 296 -82 -146 149 62 295 -141 -110
6219a10J71M4m07N19j31j61j85L65n7k24L04p4j38j21Q0L53m43L20K1k57J17n0
$$ -110 61 105 -302 217 86 -75 -260 105 48 -176 128 54 -84 -205 -125 228 -215 105 126 -131 -14 -64
6241f4o7K63j41j65J91r3K70k96j39K99qN0M4l17O6JL58k70o0K15l26J49P5l07
$$ -64 -131 132 -9 -174 17 -76 194 -102 -241 58 50 100 144 -173 -107 -106 252 -18 -78 137 -189 -40 35 -272
6265b72M87j77m05P0L86l8k42P3R1j18J30K05k91QJ77J31j10O2j33n0K09j91Q1
$$ -272 215 38 -367 -297 89 51 -191 -118 -27 -145 -15 190 -101 -93 84 215 105 167 34 -16 193 2 83
6288H3m1K47j65j72J81l1j89N8J15k38N6j0p5J79j39L02L7l72J24j36K67J71o3
$$ 83 42 289 124 -48 133 102 -87 -29 86 -152 -96 -106 -181 -2 -141 161 198 -174 -50 -186 81 252 189
6311A89k14K60j29l55L13J17j69j07L05k85J1j36L02R3l63K65n0j26j16%K00K15
$$ 189 -25 235 106 -249 64 181 12 -95 210 -75 -64 -200 102 195 -168 97 47 -79 -195 -195 5 220
6333B20n42M40M2k9k82J28J84j84O4K26l45J01P3k31J90j34K24j39J54j12r8p
$$ 220 -322 118 160 131 -151 -23 161 -23 41 267 -78 23 96 -135 55 -79 145 6 160 48 -50 -57
6355e7N7k73r1J97K85l25L23l4o1r3k28L71P9j84j86K99j4r8o6J54NJ12p3J33
$$ -57 0 -273 -364 -167 118 -207 116 82 21 -72 -300 71 150 -34 -220 79 65 -33 -99 55 60 172 99 232
6379B32J07l80J42L4J79o23K04J55M6q7k7n3K05j90M5K1j45Q7j86M79k73l1J45
$$ 232 339 -41 101 135 314 -309 -105 50 96 9 -18 -71 134 -56 -11 10 -135 -48 -234 245 -28 -59 86
6402H6J33j82J0K08J90n10Q7N8L6j42J4mJ04l69L77R5j36k17j29K88K13m32J52
$$ 86 219 37 47 255 445 -65 22 80 116 -26 -12 -16 88 -281 96 191 55 -162 -291 -3 210 -222 -70
6425g0K42l46j38K25K39m39K94N7R9k54m7J88J95k15K0L03k67l34J71J73o8k26
$$ -70 172 -174 -312 -87 152 -287 7 64 163 -91 -138 50 245 30 50 353 86 -248 -77 96 28 -198
6447a98J92rJ52j83q0L40m89m0J16J25J6j50R4k1n5q6J46K19j88l06N25J73m81
$$ -198 -6 -15 137 -46 -126 214 -275 -315 -199 -74 -58 -208 -114 -135 -190 -276 -130 89 -99 -405 120 293 -188
6470a88J59L07P3m52K05r8j79J05Q2K11j36k07K3J15J31j32k07P5K36k01L05r1
$$ -188 -29 278 351 -101 104 6 -173 -68 14 225 89 -118 -95 20 151 19 -188 -113 123 -78 227 136
6492A36k33K6K06k55%K17K11l83L6J06j15R3K1l19L43k08J39p2L82n1m61J49J45
$$ 136 -97 -71 135 -120 -120 97 308 -75 -39 67 -48 45 66 -253 90 -118 21 -51 331 280 -181 -32 113
6515A13K3k15j52K88m4m8p4P4L0j87L61J30j86j47K75q0j32J49j0L0j82K8P8j1
$$ 113 136 -79 -231 57 13 -35 -109 -35 -5 -192 169 299 113 -34 241 161 29 178 168 198 16 44 122 111
6539A11k24J70q4j21J94k85L42Q5r0j65L6K13l25R8J27j09l71L67r0j69M56j9
$$ 111 -113 57 -27 -148 46 -239 103 188 98 -67 -31 182 -143 -45 82 -27 -398 -31 -121 -290 166 147
6561A47l01j32K16J26j41M3k09K08J41j0j82J43L30n23J14K28J1l31Q9K32k26
$$ 147 -154 -286 -70 56 -85 -42 -251 -43 98 88 -94 49 379 -144 -30 198 209 -122 -33 199 -27
6582b7j69K1J04q2J02l4l18L82j42R9j13L74l62J07L11k12m05M28J65j73l8OJ46
$$ -27 -196 -175 -71 -153 -51 -85 -403 -21 -163 -64 -177 197 -165 -58 253 41 -364 64 229 56 18 24 170
6605A70j38J8j50J42Q5j86J38l9n2k20K66J58l69K45K42m72J1l1L74k62L49k44
$$ 170 32 50 -100 42 127 -59 79 40 -12 -232 34 192 -177 68 310 -162 -151 -182 192 -70 279 35
6627C5Q3l66L50p4o5J60k84K50q5Q9k88L71j56Jl5lk47P1J28J02m31K01K82l46
$$ 35 118 -248 102 28 -37 123 -161 89 4 93 -195 176 20 21 -14 -17 -264 -193 -65 37 -394 -193 89 -257
6651b57J67J01j23K0Qp1O1K09L7l83Q4M12m37M4J42M9N5J2m9j40J95m5k18J06
$$ -257 -90 11 -112 -92 -84 -155 -94 115 152 -231 -147 265 -172 -128 14 63 118 130 81 -59 136 91 -127 -21
6675b1r2J64j12J19l28R8L8K03j58j17Q7J7K08O7j44k9J2r4K80k05L04j75J1j40
$$ -21 -113 51 -61 58 -270 -172 -134 69 -89 -206 -119 -102 106 173 29 0 12 -82 198 -7 297 122 133 -7
6699gR1k54K83k3l68N3J80r4J68Q3j22j19M07l72J41j33l8J70l8%k10K10n0J8
$$ -7 84 -170 113 90 -278 -225 -45 -139 29 112 -10 -129 278 -94 47 -86 -124 46 8 8 -202 8 -42 -24
6723b4k1M8L42m69j0K85k61L4O7L14j79l26J45Q4K1k9m4J29L5k58k2K58j60j34
$$ -24 -45 3 345 -124 -134 151 -110 -76 -9 305 126 -200 -55 29 50 21 -23 106 141 -117 -139 119 -41 -175
6747a75K8J36k1l2j69J69j51L10j46J21j30o5K39J6r2k32K06n0K14j87J33J3j42
$$ -175 -147 -11 -32 -64 -233 -64 -215 95 -51 70 -60 -125 114 130 38 -194 12 -38 176 -11 122 135 -7
6770gJ20o8J03j50J33m5l50J82j28J66P0L1j59K48l3k14N5J93j23p4J61k52J51
$$ -7 113 45 148 -2 131 86 -264 -82 -210 -44 26 57 -102 146 113 -101 -46 147 24 -50 111 -141 10
6793A0kJ39k07K4J94q7n6KP8k11q4RK29n0J41j81k00K05j4j15J49M5R5l74J50
$$ 10 8 147 -60 -36 158 71 15 17 95 -116 -200 -191 38 -12 129 -52 -252 -47 -61 -176 -27 18 113 -261 -111
6818a11k1R3K21n5k79L36j49Q0n9K59l50rJ45j20K7R6l6j61l8J87p8J38jQ4k9
$$ -111 -132 -39 182 127 -152 184 35 115 56 315 -35 -44 101 -19 8 104 68 -93 -131 56 -22 116 115 199 170
6843A70j24j02L5J32k03j83L76k78j4j3M68l37RL9k8J60k13j40L58j66J90j68
$$ 170 46 -56 -21 111 -92 -275 101 -177 -191 -204 264 -73 -64 -25 -53 107 -106 -246 112 -54 136 -32
6865c2n4J20O9k55M67l25R0M2M8l62J05J19r7K2m1R3j07m6O0J75j62J57Nj47K62
$$ -32 -86 34 103 -152 315 -10 80 122 170 -192 -87 32 -65 -43 -84 9 -98 -144 -84 91 -71 86 91 -56 206
6890B06j38K0j52Q0M6J42K52j88n06K64J85l50J73q9P9j91p5J77M2k8k7l33K36
$$ 206 68 88 -64 16 62 204 456 268 -238 26 211 -139 34 -55 24 -167 -242 -65 -23 -51 -78 -411 -175
6913a75j35L80J23k53j32R9K23o8j15J63K0k63L33j6j01j64LM3o5K21p9n5j64
$$ -175 -310 70 193 -60 -192 -93 130 62 -53 110 130 -133 200 184 83 -81 -78 -35 -100 121 42 -13 -177
6936a77K04k37K36J05k6k75J68j60M0r9L83j1j75j81K75j59K32P3k83Q3r2R6Q9
$$ -177 27 -210 26 131 105 -170 -2 -162 -122 -221 162 151 -24 -205 70 -89 143 216 -67 16 -76 20 109
6959A09l6o0L7j56K28k79J75j4q9J3K22j22k14O6qN9mj48P5J58j03j58M22N1l27
$$ 109 73 13 50 -106 122 -157 18 4 -85 -72 150 28 -186 -120 -128 -69 -73 -221 -146 12 -91 -249 173 224 -103
6984a03M3L21l99k5K05J71k37o4l8Q0k4J22J60k00j33j47P5L3J92NP3j21j99k1
$$ -103 -60 261 -138 -163 42 213 -24 -88 -126 -46 -70 52 212 12 -121 -268 -193 -160 32 37 110 -11 -210 -231
7008b31K15o6J80k53J87K64j62j26Q7k46J42j22L56l24L27k31j4R8j24k3M8nk76
$$ -231 -16 -82 98 -155 32 296 134 8 95 -151 -9 -131 225 -99 228 -3 -17 81 -43 -66 -18 -23 -299
7031b99L57L4k94J30J55j3l7J48j68J44p1j77K03p4j64L3K49j11L0k05K58J3k80
$$ -299 58 92 -202 -72 83 70 33 181 13 157 86 -91 112 38 -126 -93 156 45 75 -130 128 141 -139
7054a39R3L88k34l21J14K87nj0k47J49p5Q3j18M6P9j44MK75r3l41K02r8k4j83
$$ -139 -46 342 108 -213 -99 188 183 173 -74 75 0 83 -35 11 90 -54 -50 225 132 -209 -7 -105 -129 -312
7078c12K45K46l13J31P7l8k80M13k85J22l6j61L84j67J43m65O20m00r6j39J65
$$ -312 -67 179 -134 -3 74 36 -244 169 -116 6 -30 -191 193 26 169 -296 324 -76 -172 -311 -146
7099a46J67lj50L87m22L0J88j67J0r5J21J86l39P9M03k66l0k66N56l46RM3MJ65
$$ -146 21 18 -132 255 -167 -137 51 -116 -106 -201 -80 106 -233 -154 249 -17 -47 -313 243 -103 -94 -51 -47 118
7123A18Rl04L19ol63J55J31lj62j10M94j44l34J17N2L5p5K65J87l14r3k2K8P3
$$ 118 127 -177 142 136 -227 -72 59 56 -106 -216 278 134 -200 -83 -31 4 -71 194 381 67 -26 -48 -20 53
7147E3j59J23m2K29n2j9O5j88k92J77L0R3p9o7L60l28J34K17k22j86l1K32o6J98
$$ 53 -106 17 -25 204 152 133 198 10 -282 -105 -75 18 -61 -128 232 -96 38 255 33 -153 -184 48 -18 180
7171A80k60J87K5j70o4L13j27j36K72j84k29p7L34L23n04j8K23j06j3N9q0J14
$$ 180 -80 107 132 -38 -102 211 84 -52 220 36 -193 -270 64 387 -117 -135 88 -18 -31 28 -52 62
7193F2J13m51M27l02J85l65L85R9n77M10l5J22o42N83P3Q8n1n1k03J1K51P5j25
$$ 62 175 -276 151 -151 34 -331 54 153 -424 -14 -49 73 -569 14 87 175 124 73 -130 -119 132 207 82
7216H2J0j46L5L6P9j9r8K73k25O8k15K11m07M19p5J24j82J65j7K7nj8k41QK38
$$ 82 92 -54 -19 17 96 77 -21 252 27 95 -120 91 -316 103 28 152 -30 135 118 145 140 122 -119 -111 127
7241A27j94M55l73k31p8L24J39j07p1J91p9k50K2K04j77P9lm5M0j28J81r0m6j49
$$ 127 -67 388 15 -216 -294 30 169 62 -9 182 103 -147 -125 79 -98 -19 -22 -67 -27 -155 26 -64 -110 -259
7265b59J80Pk23J12J43l5J41j05L29l20o8J23jJ14j04J07j20J57p8q2K39j56k16
$$ -259 -79 -72 -295 -183 -40 -75 66 -39 290 -30 -98 25 24 138 34 141 21 178 100 18 257 101 -115
7288a15R7l7j16Q6k00M6J65p3J68J0r2n3O9k57M11l4n4Q9k0q0J32nj54j92L05
$$ -115 -18 -55 -171 -85 -285 -239 -74 -147 21 31 -61 -114 -45 -302 109 75 21 110 90 10 142 137 -17 -209 96
7313I6L0M6l25J44J30j21J32o0J22j67o6J77k93R3J98j80j9j8p0M07k71j34K04
$$ 96 126 172 -153 -9 121 0 132 72 194 27 -39 138 -155 -62 136 -44 -63 -81 -151 256 -15 -149 55
7336E5m9J2p5K07P1j82k13J99J1P9j24o6L23l39J71p2J43m50K75Rj19J10r8N9
$$ 55 6 18 -57 150 221 39 -174 25 36 115 -9 -75 248 -91 80 8 151 -299 -24 -15 -134 -24 -122 -63
7360f3k34K87l8K56n2k38L4k4J43O7l3j27j86K31K12j30k10K45K65l78k73Q4L54
$$ -63 -297 -10 -48 208 156 -82 -48 -72 71 138 105 -22 -208 23 235 105 -105 140 405 27 -246 -162 192
7383A92l1k89M6j91J69J82JO6p6k24J04O0q7n7K29p0j11p9Q8L97k49l5Q9l13L41
$$ 192 161 -128 -82 -273 -104 78 79 145 69 -155 -51 9 -78 -135 94 24 -87 -166 -78 319 70 35 124 -189 152
7408A52m15J01K56l4j73K84q4j13J02j76K51n7k58N4o8K82m5k2J36k24l40L54
$$ 152 -263 -162 94 60 -113 171 87 -26 76 -100 151 94 -164 -110 -178 104 59 37 173 -51 -391 -37
7430c7K81m82K78N9jj06M8J27j09p5p2K27j48n7j6M3j89J30J29K39j93j60J23
$$ -37 244 -238 40 99 98 -8 40 167 58 -17 -89 138 -10 -67 -83 -40 -229 -99 30 269 76 -84 39
7453C9O8j83L9j07K85k07N4o2J24j21K4K01j58l1R2k52K31M3j61l8K10j77K79
$$ 39 107 -76 -37 -144 141 -66 -12 -74 50 -71 -47 154 -4 -35 57 -195 36 79 -82 -120 90 -87 192
7476A92l1q4J32j36L3J14k18l0j30l1J05J35k04K42p4j88J62j61J99n6K8j97N6
$$ 192 161 77 209 73 106 220 2 -28 -158 -189 -84 51 -153 89 15 -173 -11 -172 27 -29 -1 -198 -142
7499a42J28l1MR3Q8p7j04L6J04k55j5N73j45l12J86Rl60M13m78L42J57m55PL00
$$ -142 -14 -45 -41 52 140 63 -41 -5 99 -156 -171 402 257 -55 131 140 -220 193 -285 57 214 -241 -234 66
7523F6p6p4Q6m1k03K2Q7J44o1K4M4j00R6J55j34p4P5J9k6K65k73k20J46P3M8j43
$$ 66 -10 -84 2 -39 -242 -220 -133 11 -50 -26 18 -82 14 169 35 -39 36 55 29 294 21 -199 -53 20 68 -75
7549g5K34p6r6n1r1M3N2K39j78j22j0K04j51j3L0j05K71j03p5L3L53m32J80Q1
$$ -75 159 83 -13 -64 -155 -112 -60 179 1 -121 -131 73 -78 -91 -61 -166 105 2 -73 -40 313 -119 61 142
7573A42J08j43rj53J48K8P5qlj09J9K4r7J46m05L09J85l58r7K95j42o5K22J20
$$ 142 250 107 98 -55 93 121 196 188 185 76 95 119 22 168 -237 72 257 -101 -198 97 -45 -110 112 232
7597B32q6m56J11K20oK14j63OJ8l0J10l68L29Kj60M4J30k31k5M5q9J90k12J35
$$ 232 146 -310 -199 21 15 229 66 72 90 60 170 -198 131 133 -27 17 147 -84 -109 -64 -153 37 -175 -40
7621d0l21K50J31O7n2r2l2K33k51N9j0j4L64j57K53k17o5r4J42j81P0K13j80j7
$$ -40 -361 -111 20 87 35 -57 -89 144 -107 -48 -58 -72 292 135 388 171 106 12 154 -27 43 256 76 59
7645E9k51K8Q0K02q2j50M19l19o7L8L03m10J20L4J39r3k74R1K31j57K57j32k01
$$ 59 -192 -164 -84 118 36 -114 305 -14 -81 -43 260 -150 -30 4 143 50 -224 -133 98 -59 198 66 -135
7668a35J36o1N3m2K29k40J5L8j64J52J23j61m9R4%j5jR8r7j94K90K1r8k1j29J85
$$ -135 1 -60 -7 -49 180 -60 -45 -7 -171 -19 104 -57 -106 -12 -12 -27 -28 70 -27 -221 69 90 -8 -29 -158 27
7694B7J24k48RrL57l69K35O6j20j13K36m3l0l7j76j39L27j66j52J42J04j57K16
$$ 27 151 -97 -88 -97 260 -109 126 192 72 -41 195 152 122 85 -91 -230 97 -69 -221 -79 25 -132 84
7717H4j73Q1o4K4J2J42k28o4L18o8l42M41j19j64R6K61m16J22J07k02J81p7m4
$$ 84 -89 -8 -72 -48 -36 106 -122 -186 132 64 -278 163 44 -120 -24 237 -179 -57 50 -152 29 -48 -92
7740i2L01q8j48p4J31R8m11J88K42l00K8J6o1M18l3k79K5J79k09OR8M2k30O2L6
$$ -92 209 121 -27 -101 30 128 -283 -95 147 -153 -125 -109 -170 248 215 -64 -39 140 -69 -63 35 77 -153 -91 -55
7765e5L3J6rJ12k03M0J39k73K61n0Q1k59J16K46m8j39q6K0p4K82j41k19K59J36
$$ -55 -22 -6 -15 97 -106 -66 73 -200 61 11 92 -167 -51 195 147 8 -78 -58 -132 150 9 -210 49 185
7789A85k15O8p9O1K30l87P0m7K11q8L3J7L5j68P2M3j53n3L98j70j05J36k4m2j49
$$ 185 -30 38 -41 20 250 -137 -67 -114 97 9 42 59 94 -74 -2 41 -112 -165 233 63 -42 94 70 28 -121
7814a21K90o2q9k85L56r8L4n8l17N68j77r3Q7J37k79J75k12K08j52J48k06J64
$$ -121 169 107 18 -267 89 -9 25 -33 -350 218 41 -52 35 172 -107 68 -144 64 -88 60 -146 18
7836A8Q3j13K22l76K31n5M5J13l09J84o5k9j66J59L9Q7k29J56O0j30P7L3r5K67
$$ 18 101 -12 210 -166 65 10 55 168 -141 43 -22 -51 -217 -58 -19 68 -161 -5 55 -75 2 35 -60 207
7860B07j31j95K02K16l07J3M8q7Q1J1P7m35L25j50K0K6J53J30k71J12k49K3K06
$$ 207 76 -119 83 299 -8 5 53 -34 47 58 135 -300 25 -125 -105 -79 74 204 -67 45 -204 -181 25
7883B5J03l53k4q5K52j4K6p1K23r0Q0Pj18Q7K4k12O5k9M84m60J58J09k01p2J09
$$ 25 128 -225 -249 -334 -82 -96 -70 -141 82 -8 72 79 -39 48 72 -140 -75 -104 380 -80 78 187 -14 -86 23
7908B3J28k89r7P2J61O8k36J00Q5q3o2K30R2r0l12M9J03P2j12K30N9r6k0j69K61
$$ 23 151 -138 -235 -163 -2 66 -170 -70 15 -68 -130 100 192 102 -210 -161 -58 14 -98 132 191 95 75 -94 167
7933A67j45O5j17Q3k43j14M28k2l86L98m49L05l12K31K61l41O0J36mj01K25j91
$$ 167 22 87 -30 53 -190 -304 124 102 -284 114 -335 -30 -342 -111 150 -191 -131 5 1 -100 125 -66
7955f6K23nj43l23L42j71K56N4j61K18j10j26j9R4j32K13j60P5p8q3R4O5l3J18
$$ -66 157 152 9 -314 28 -143 113 167 6 224 114 -12 -31 63 -69 144 -16 59 -19 -102 -8 57 24 142
7979A42q2n0r4J72j61kK59j5l70Q7P7K11k19Q3N5J44q1j52J3J34l7k49J01j14
$$ 142 60 10 -84 88 -73 -75 184 169 -201 -114 -37 174 -45 38 93 237 156 4 17 151 114 -135 -34 -148
8003a48o6l4L37p0j27j35J00J44j64J59L2l05K34J74j99L93j92l22M47j89m8m1
$$ -148 -214 -248 89 19 -108 -243 -143 1 -163 -4 28 -277 -43 131 -68 325 133 -189 258 69 21 -20
8025b0J56j08P5Q4j64r0K5K27k24q8n1m5J30J17l02K22RJ36q7j91J5J03j17K80
$$ -20 136 28 103 187 23 -67 -42 185 -39 -127 -178 -223 -93 24 -278 -56 -47 89 2 -189 -174 -71 -188 92
8049I2m12N06k12L8J87p1o2nJ59j93j80L9M5N3j1l0k2k2L50j10j96k41K81k74
$$ 92 -320 186 -26 12 199 128 66 61 220 27 -153 -114 -69 -16 -27 -57 -79 -101 249 139 -57 -298 -17 -291
8073b91K56P4K90j63j51J72k44K85l06J8K25J0j60O7Jj18n8j40L62k13j24L75
$$ -291 -35 39 329 166 15 187 -57 228 -78 -60 165 175 15 82 83 -35 -93 -233 129 -84 -208 167
8095A67m60J80K44k54J51P2n5p5r9m3o4K81o6j2k52M41n8k70K47R4k69m2P9M5
$$ 167 -293 -113 131 -123 28 100 45 -30 -129 -172 -236 45 -21 -33 -285 156 98 -172 75 169 -100 -142 -63 -18
8119a8k6J06Q0l7J18j85K6k55K85O1k8j43J27j32J69l71M01k78MJ35j49L4J83
$$ -18 -44 62 142 105 223 38 64 -191 94 155 127 -16 111 -21 148 -223 178 -100 -96 39 -110 -76 107
8142A07k53M4J87j42J20k24J29kJ73j80J47m9j45o4KK85j62mL15k33Nj74L73j37
$$ 107 -146 -102 85 -57 63 -161 -32 -34 139 -41 106 57 -88 -152 -150 135 -27 -31 284 51 56 -118 255 118
8166A18j01j57K08R5l59p5K58M4l08L72k3J29m25L46o2j05n0K21K3j82lN0j13
$$ 118 17 -140 68 163 -196 -271 -13 31 -277 95 72 201 -224 122 60 -45 -95 126 149 -33 -36 14 -99
8189i9P1K23
$$ -99 -28 195
8191A95
$$ Imaginary data points
##PAGE= N=2
##DATA TABLE= (X++(I..I)), XYDATA
0@%%%%%%%%Qj6J6j6K4l2M0m8N6p2Q8j04J28j53J78k16K55k96L45m00M64n32O08
$$ 0 0 0 0 0 0 0 0 0 8 -8 8 -8 16 -16 24 -24 32 -40 48 -56 72 -81 97 -119 136 -160 185 -215 249 -283 325
31C25o94P92q99J013j143J286j440J611j801K009k234K478k746L039l359L710
$$ 325 -369 423 -476 537 -606 680 -760 851 -950 1059 -1175 1303 -1443 1596 -1763 1947
47A947m094M511m971N477o033O649p332Q098q960R933j1043J2330j3838J5631
$$ 1947 -2147 2364 -2607 2870 -3163 3486 -3846 4252 -4708 5225 -5818 6512 -7326 8305
61H305j7808K0518k4000K8658l5251M5375o3058J02768l54018L3739M51314l97655
$$ 8305 -9503 11015 -12985 15673 -19578 25797 -37261 65507 -288511 -254772 196542 -201113
73b01113K0425K95155o5493k07249J70742L7467r082J28913o7442k41280J92481
$$ -201113 -180688 114467 48974 -158275 12467 49934 40852 169765 102323 -138957 53524
84E3524K17328j58768j9610K18949j73693k49875J20528L3040j80241J41746J42740
$$ 53524 270852 112084 92474 311423 137730 -112145 8383 41423 -138818 2928 145668
95A45668k73383j31547K43561o352j94869R7193J21839j41702o7264Q6261O8149
$$ 145668 -127715 -259262 -15701 -22053 -216922 -119729 2110 -139592 -206856 -120595 -52446
106e2446J22678J03083r0374l0054J11468p8758j37660J45926J12490j65289n5761
$$ -52446 70232 173315 82941 52887 164355 85597 -52063 93863 206353 41064 -14697
117a4697J22731m1299p8094J05609L2496j44130p5969j881m4358r242L9359K8220
$$ -14697 108034 66735 -11359 94250 126746 -17384 -93353 -95234 -139592 -148834 -109475 -81255
129h1255M7997K101q8947J8464J35602j0083q8221P4420P7323q0672k1011J16061
$$ -81255 -33258 -31157 -120104 -101640 33962 23879 -64342 10078 87401 6729 -14282 101779
141A01779N4663k3925j2982l9636m7980l776k0788k7074L7612J1849o0772j2904
$$ 101779 156442 132517 119535 79899 31919 28143 7355 -19719 17893 29742 -31030 -43934
153d3934K1272l1746j414L5126o1377p0983N5236L7544m3475N2783J18066j011
$$ -43934 -22662 -54408 -55822 -20696 -82073 -153056 -97820 -60276 -103751 -50968 67098 66087
165F6087n1562J9597K3361m492M265j3646k443L8995j7413o0005M5524O6447p0508
$$ 66087 14525 34122 57483 52991 57256 43610 41167 80162 62749 2744 48268 114715 44207
178D4207p2297L2046k0142q3960J1016N3018j5629o747K5409j3789r129K8134
$$ 44207 -28090 3956 -16186 -100146 -89130 -36112 -51741 -58488 -33079 -46868 -55997 -27863
190b7863l917j2994L1764O620k0440M1661N2815o735J1964L5799l4153m8700J3748
$$ -27863 -31780 -44774 -13010 -6390 -26830 14831 67646 60911 72875 108674 74521 25821 39569
203C9569m224m2064R387K4943l0824j7735K3232q749k7316j526j2372k8055j289
$$ 39569 35345 -6719 2668 27611 -3213 -20948 2284 -6465 -33781 -35307 -47679 -75734 -77023
216g7023O278K868L6284L5109p136O646L3044q714k5741K2579K2891j8651l642
$$ -77023 -70745 -67877 -31593 3516 -3620 3026 36070 27356 1615 24194 47085 28434 24792
229B4792K5940Q944n795j73o361j6723k2139l0438j9074K608j810q288J1038J3073
$$ 24792 50732 59676 53881 53708 47347 30624 8485 -21953 -41027 -38419 -40229 -48517 -37479 -24406
243b4406p194l881O500m539n951N287M832Q511K3049K1192J4723J8451P113r497
$$ -24406 -31600 -35481 -28981 -33520 -39471 -34184 -29352 -20841 2208 23400 38123 56574 63687 54190
257E4190n187p167j9559n760P951j1037r427J6384M48k6924p980K417k7188k6541
$$ 54190 49003 41836 22277 16517 24468 13431 4004 20388 20836 -6088 -14068 -11651 -38839 -65380
271f5380N537M268l191J5509K0948R622J4326R684p049K748J1717p409n404K4283
$$ -65380 -59843 -55575 -58766 -43257 -22309 -12687 1639 11323 4274 7022 18739 11330 5926 30209
285C0209J5857q016R368J8304j3212k3633m963j1959k5609j1382J429l682r08
$$ 30209 46066 38050 47418 65722 52510 28877 23914 11955 -13654 -25036 -23607 -27289 -28197
298b8197N879p42l631j206r101r582K156N530L235J5662K4280J5862R921J2930
$$ -28197 -22318 -23060 -26691 -27897 -36998 -46580 -44424 -38894 -35659 -19997 4283 20145 30066 42996
312D2996N666o898q288m314n682n082R71M546J996r64l720r037j4825j7356j3348
$$ 42996 48662 41764 33476 29162 23480 18398 19369 23915 25911 24947 21227 12190 -2635 -19991 -33339
327c3339j0444p737J49P916R462Q495Q936N592L008J469p51l83Q611J2944P808
$$ -33339 -43783 -51520 -51371 -43455 -33993 -25498 -16562 -10970 -7962 -6493 -7244 -7627 984 13928 21736
342B1736R451J6416Q029p994o778l597j5094j9109o884j993m888J04K958j067
$$ 21736 31187 47603 55632 47638 40860 37263 22169 3060 -3824 -5817 -10705 -10601 -7643 -8710
356h710p97o036j5924q975J777o952o923J8356K2087K171R974K5186N032j0010
$$ -8710 -9507 -15543 -31467 -40442 -38665 -45617 -52540 -34184 -12097 -9926 48 25234 30266 20256
370B0256N043M009j2235j222J0603j4P62R975m004j3506l773j2359k1977l941
$$ 20256 25299 29308 17073 15851 26454 26440 27202 37177 33173 19667 15894 3535 -18442 -22383
384b2383l49j5834J219J9375l878r143K0192O444k4293k248J8752m123m357K4932
$$ -22383 -22732 -38566 -37347 -17972 -21850 -30993 -10801 -4357 -28650 -30898 -12146 -16269 -20626 4306
398D306J8996K430R542O067m915J464m958k1217l918O251j6035p669K1698J843
$$ 4306 23302 25732 35274 41341 36426 37890 32932 11715 7797 14048 -1987 -9656 12042 13885
412A3885k1437L210K289k8474j2438J5396l674j0176J5818J3727j095Q732J0118
$$ 13885 -7552 -4342 -2053 -30527 -42965 -27569 -31243 -41419 -25601 -11874 -12969 -4237 5881
425E881K284P814l785j7431J0487K3066j0076l137L1725J422l4203k205J1684
$$ 5881 8165 15979 12194 -5237 5250 28316 18240 15103 46828 48250 14047 11842 23526
438B3526k2087j6799P886q464j2558R247L155k029J5887j132k2041K491N176j9124
$$ 23526 1439 -15360 -7474 -15938 -28496 -19249 -16094 -18123 -2236 -3368 -25409 -22918 -17742 -36866
452c6866J1315L6980p284j2272L4615J0026k9817J2828K8534k5629k3054J4111
$$ -36866 -25551 11429 4145 -8127 26488 36514 6697 19525 48059 22430 -624 13487
464A3487m498j1259J8604L383j5940P005r167l8300O103K6476k5727j1666L6343
$$ 13487 8989 -2270 16334 19717 3777 10782 1615 -36685 -30582 -4106 -29833 -41499 -5156
477e156m815k9360L1959K9906k7702r79K6434k3989k1288L5604J5168j2459J9577
$$ -5156 -9971 -39331 -7372 22534 -5168 -6147 20287 -3702 -24990 10614 25782 13323 32900
490C2900R380k8392N06J2249k4824m874K1608k7169l2094K9617J3656k8549J5187
$$ 32900 42280 13888 14394 26643 1819 -3055 18553 -8616 -40710 -11093 2563 -25986 -10799
503a0799K8525l4062k6558K4296O56j4102K7679J8391j7595M872J6905p236O397
$$ -10799 17726 -16336 -42894 -18598 -17942 -32044 -4365 14026 -3569 1303 18208 10972 17369
516A7369J7810j5227j4682R906j0720j2192K9482J4057k7480n907Q240k6767j7847
$$ 17369 35179 19952 5270 15176 4456 -7736 21746 35803 8323 2416 10656 -16111 -33958
529c3958J9435M029j4773J634K047l184J3587J0052q14J1338j752k7091L328K8138
$$ -33958 -14523 -10494 -25267 -23633 -21586 -24770 -11183 -1131 -1945 9393 7641 -19450 -16122 12016
543A2016k989p76L0361m03l0029N789J4496j7384k800R427k1374j6240J1075n161
$$ 12016 9027 8251 38612 38209 8180 13969 28465 11081 8281 17708 -3666 -19906 -8831 -13992
557a3992j398K5928o712l3734Q586Q079l2188J1380M6829j4437k4664L5389J0417
$$ -13992 -15390 10538 3826 -29908 -21322 -13243 -45431 -34051 12778 -1659 -26323 9066 19483
570A9483k9398K2549L2310k8235j5108J8684j5842j0045L5748K498k5301J7206
$$ 19483 -9915 12634 44944 16709 1601 20285 4443 -5602 30146 32644 7343 24549
582B4549l391m8272P695L4834l3006k1847L8129j0339m0879L3636L5182k9717
$$ 24549 21158 -27114 -19419 15415 -17591 -39438 -1309 -11648 -52527 -18891 16291 -13426
594a3426j788K7526k5910j9785L5106R175j0185K8640O095l2559J2929K3522k8761
$$ -13426 -15214 12312 -13598 -33383 1723 10898 713 29353 35448 2889 15818 39340 10579
607A0579m120L1272k7935l8574K9466J4267l2141J4554K6592l6142k4930K1875
$$ 10579 6459 37731 9796 -28778 688 14955 -17186 -2632 23960 -12182 -37112 -15237
619a5237o634j5227K5641P266j9383J4059J3566j6307J7917K9376k6530j6969
$$ -15237 -21871 -37098 -11457 -4191 -23574 -9515 4051 -12256 5661 35037 8507 -8462
631h462K9767q176k6930L3218K7293l1511q447K0811k0627k1196J8946j353k1752
$$ -8462 21305 13129 -13801 19417 46710 15199 6752 27563 6936 -14260 4686 3333 -18419
644a8419N815q51j7892J5792J8562j8052j91J9290k2153j9541L1683J3656j9873
$$ -18419 -12604 -13455 -31347 -15555 3007 -15045 -15236 4054 -18099 -37640 -5957 7699 -12174
657a2174J5664K4914j8577r535K4034J427j4454M783k986j4877M553M440p749
$$ -12174 3490 28404 9827 292 24326 25753 11299 16082 13096 -1781 2772 7212 -537
670e37J0059O775k4205j0466J3986j1168j6283J8403R459j9172K898K0109k800
$$ -537 9522 16297 -7908 -18374 -4388 -15556 -31839 -13436 -3977 -23149 -20251 -142 -2942
683b942l051J3395O07q839J366j23J333J5128K902r349R721O059k1604o184J7992
$$ -2942 -5993 7402 8009 -830 536 413 1746 16874 19776 10427 20148 26207 4603 -1581 16411
698A6411r127k1994P468P094j4202Q89J3542l764o004K855p136n673J0636J552
$$ 16411 7284 -14710 -7242 -148 -14350 -13461 81 -3683 -9687 -6832 -13968 -19641 -9005 -7453
712g453l400J3786P546j0173O056J5131r983q406J3749k440j9102O662J5115r538
$$ -7453 -10853 2933 10479 306 6362 21493 11510 3104 16853 14413 -4689 1973 17088 7550
726G550o247J0495l098j3697k188m44n069J201o63m452P113Q677o125K72J2887
$$ 7550 1303 11798 8700 -4997 -7185 -7629 -12698 -11497 -12160 -16612 -9499 -822 -6947 -6675 6212
741F212k119j2796N252R924n717q49J2589M060o227R37L498n253o403j814r80
$$ 6212 4093 -8703 -3451 6473 756 -93 12496 16556 10329 11266 14764 9511 3108 1294 314
756C14l498l544N55M071O7m084o63J331l886n498J463N378J838L63M940P585K403
$$ 314 -3184 -6728 -6173 -2102 -2035 -6119 -6782 -5451 -9337 -14835 -13372 -7994 -6156 -5793 -853 6732 9135
773I135l191R11M897l672p485K624O233m441l173P567J749r436l442K587o155
$$ 9135 5944 6855 11752 8080 595 3219 9452 5011 1838 9405 11154 1718 -1724 863 -5292
788e292q056O89K213j433R94L773K513K351J27k752J782L791l183r19Q605N869
$$ -5292 -13348 -12659 -10446 -11879 -10885 -7112 -4599 -2248 -2121 -4873 -3091 700 -2483 -3402 5203 11072
804A1072l436J669P630k158q285q42J023o687m353K689P96k964M83J608k549l880
$$ 11072 7636 9305 16935 14777 6492 5650 6673 -14 -4367 -1678 -882 -3846 -3363 -1755 -4304 -8184
820h184j195j623k062N42K688K896N097L469J562L546L238k489l286K853K124
$$ -8184 -9379 -11002 -13064 -12522 -9834 -6938 -1841 1628 3190 6736 9974 7485 4199 7052 9176
835I176l835j77O627Q58n263l82J672n991p368j393q97l768j166K937J436N12
$$ 9176 5341 5164 11791 12649 7386 7004 8676 2685 -4683 -6076 -6973 -10741 -11907 -8970 -7534 -7022
851g022J426m23j95J068l68j010L708M708J133L035O640J602l304R56Q91n902
$$ -7022 -5596 -6019 -6214 -5146 -5514 -6524 -2816 1892 3025 6060 12700 14302 10998 11954 12845 6943
867F943m370K818o93m865J062K780l579l947M95l188n192r05m16j203L569L647
$$ 6943 2573 5391 4698 -167 895 3675 96 -3851 -3356 -6544 -11736 -12641 -13057 -14260 -10691 -7044
883g044R30M557N096k782j556O056R57n885L866P788k853k479O630J610n869k520
$$ -7044 -6114 -1557 3539 757 -799 5257 6214 329 4195 11983 9130 6651 13281 14891 9022 6502
899F502j890m921k930k315k878K916K310m939j488N703k644o602M455L856n418
$$ 6502 4612 -309 -3239 -5554 -8432 -5516 -3206 -8145 -9633 -3930 -6574 -13176 -8721 -4865 -10283
914a0283J137Q697K055J99O655K817k662L59j461k622K966K90m937K988M084q323
$$ -10283 -9146 -449 1606 1805 8460 11277 8615 8974 7513 4891 7857 8147 3210 6198 10282 1959
930A959l822P433l685j1611J207K937q542p77R234L61j383M909j413l172N749
$$ 1959 -1863 5570 1885 -9726 -8519 -5582 -14124 -14901 -5667 -5306 -6689 -1780 -3193 -6365 -616
945f16N38l868P824M272q536L510J3296m964p102R994p48j6272J8P959o711k589
$$ -616 -78 -3946 3878 8150 -386 3124 16420 11456 4354 14348 13600 -2672 -2654 5305 -1406 -3995
961c995P145m210o375M748k951n837Q351P19j3112M458J1296q009N43J8556j978
$$ -3995 3150 -1060 -7435 -2687 -5638 -11475 -3124 -2405 -15517 -11059 237 -7772 -7229 11327 9349
976I349j3034Q728M539j2513L871J3737p809o297Q847l781p023R165j91j2395
$$ 9349 -3685 5043 9582 -2931 940 14677 6868 571 9418 5637 -1386 7779 7588 -4807
990d807L902M59j6631M009J7904q317r384J6204j036j8601Q630J5153j0868j841
$$ -4807 -905 -446 -17077 -13068 4836 -3481 -12865 3339 2303 -16298 -7668 7485 -3383 -5224
1004e224J2280o477o139J4101K852p266R135j096j8086L617J1547j2333j717J7595
$$ -5224 7056 579 -5560 8541 11393 4127 13262 12166 -5920 -2303 9244 -3089 -4806 12789
1018A2789q778j9146J2692P995j6481L017J3505j3062r840J2147J908k898J3257
$$ 12789 4011 -15135 -2443 5552 -10929 -7912 5593 -7469 -17309 -5162 -3254 -6152 7105
1031G105J990j2011M875L836j1859O844J6524j1474j0427J4535j617j4868J1330
$$ 7105 9095 -2916 1959 5795 -6064 780 17304 5830 -4597 9938 8321 -6547 4783
1044D783J1312j6215p988P213p420n341J1826K648n261M434m124r783J0863Q567
$$ 4783 16095 -120 -8108 -895 -8315 -13656 -1830 818 -4443 -9 -4133 -13916 -3053 5514
1058E514j1402K176J3515j1266r609J8895Q061j1817M523N658j4265n105R215
$$ 5514 -5888 -3712 9803 -1463 -11072 7823 15884 4067 8590 14248 -17 -5122 4093
1071D093j743j431O617p118r145P498j84r237J0160N221j8935k623J5535n000
$$ 4093 2350 919 7536 418 -8727 -1229 -1413 -10650 -490 4731 -14204 -16827 -1292 -6292
1085f292n232J8964M506j6649K224Q818p129J903J1501n419m524O229o162m255
$$ -6292 -11524 7440 11946 -4703 -2479 6339 -790 1113 12614 7195 2671 8900 2738 -1517
1099a517J4618Q9j7299L408N553j8709k322K0910l605j4086J0141L411j5150M009
$$ -1517 13101 13190 -4109 -701 4852 -13857 -16179 4731 1126 -12960 -2819 592 -14558 -10549
1113a0549J3119n856j965P230o658j934J4784M40n818J2472O92k0419L687J5140
$$ -10549 2570 -3286 -5251 1979 -4679 -6613 8171 8611 2793 15265 15957 -4462 -775 14365
1127A4365j1440o466J6718m609j9127P212R478j1727j254Q312r935p461P861j279
$$ 14365 2925 -3541 13177 8568 -10559 -3347 6131 -5596 -6850 1462 -8473 -15934 -8073 -9352
1141i352n00J3365j126j1843R444O867j4286M168J9336q008j3217J3117N394j2007
$$ -9352 -9852 3513 2387 -9456 -12 6855 -7431 -3263 16073 8065 -5152 7965 13359 1352
1155A352M798J1106r634p920K824n489l563P535k666n938O837k161j2212P033
$$ 1352 6150 17256 7622 -298 2526 -2963 -6526 1009 -1657 -7595 -758 -2919 -15131 -8098
1169h098J0436j0824m311J3255l037j0326J1606J1122o004o68O828m631l377M251
$$ -8098 2338 -8486 -12797 458 -2579 -12905 -1299 9823 3819 3151 9979 5348 1971 6222
1183F222k23mM138n176n816O660K72j0177L321N982j2053p848J0182J60p525O373
$$ 6222 5999 5995 10133 4957 -859 5801 6073 -4104 -783 5199 -6854 -14702 -4520 -4360 -11885 -5512
1199e512O420o131k197M997p44J347L887k168L11O949k575l645J0083L411j1627
$$ -5512 908 -5223 -7420 -2423 -3167 -1820 2067 -101 210 7159 4584 939 11022 14433 2806
1214B806k93P624q157p324Q879J986r573M41M587n328l013L539j777j887J721
$$ 2806 2513 10137 1980 -5344 3535 5521 -4052 -3611 976 -4352 -7365 -3826 -5603 -7490 -5769
1229e769j782q39P450J486m291O064N181p815j947R592n71p202M825N596n735
$$ -5769 -7551 -8390 -940 546 -3745 2319 7500 -315 -2262 7330 6759 -443 4382 9978 4243
1244D243l179N396l56n158j551p38j787j052j809M34L793n89m768K239M441l751
$$ 4243 1064 6460 6104 946 -605 -1343 -3130 -4182 -5991 -5557 -1764 -2353 -7121 -4882 -441 -4192
1260d192k850N492L030l979J101N684J290j901P15J968n45k882j782J856P52l528
$$ -4192 -7042 -1550 1480 -2499 -1398 4286 5576 3675 4390 6358 5813 2931 1149 3005 3757 229
1276B29r99L663j264m839M03K492l910l275K874J319k051J113L398J132m7j34
$$ 229 -770 2893 1629 -3210 -2807 -315 -4225 -7500 -4626 -3307 -5358 -4245 -847 285 238 104
1292A04Q80J799p35j649K073L565k214j867L567J631n007k061K850j774n271M73
$$ 104 984 2783 2048 399 2472 6037 3823 1956 5523 7154 2147 86 2936 1162 -4109 -3636
1308c636K736j984j572J911Q32j234m28J43N35K91J7L77L030J758l30Q33K797
$$ -3636 -900 -2884 -4456 -2545 -1713 -2947 -3375 -3232 -2697 -2406 -2389 -2012 1018 2776 2446 3279 6076
1325F076p09k976J076J102k771j665K209M91l298j77J714j887l313j94O28j625
$$ 6076 5367 2391 3467 4569 1798 133 2342 2833 -465 -642 1072 -815 -4128 -4322 -3694 -5319
1341e319r48J569J905J85N22J732J441J84p22O26J211J48j86J174J905j71j398
$$ -5319 -6267 -4698 -2793 -2608 -2086 -354 1087 1271 549 1175 2386 2534 2348 3522 5427 5256 3858
1358C858k12N70k441l098J37N96k889j657K160R55k904N34J825j052j914J446
$$ 3858 3646 4216 1775 -1323 -1186 -590 -3479 -5136 -2976 -2021 -4925 -4391 -2566 -3618 -5532 -4086
1374d086J411j87J626K489M11J692J461q28J93J795j508k487J762N85l123k50
$$ -4086 -2675 -2862 -1236 1253 1664 3356 4817 3989 4182 5977 4469 1982 3744 4329 1206 956
1390I56K689k388l428R42o33l742m21J786j431m34K076J62P23K361j32l14K294
$$ 956 3645 1257 -2171 -1229 -1862 -5604 -6025 -4239 -5670 -6104 -4028 -3866 -3143 -782 -914 -1228 1066
1407A066Q98k146J931L944j016j44K321k87k081l68m91j724l09j767k424J029
$$ 1066 1964 -182 1749 5693 4677 4533 6854 6567 4486 4118 3627 1903 1594 -173 -2597 -1568
1423a568O09l147L38K185k845l074K868M77k170L053L196j657J371L702j363K44
$$ -1568 -959 -4106 -3768 -1583 -4428 -7502 -4634 -4157 -6327 -3274 -78 -1735 -364 3338 1975 2219
1439B219M315j446k941L215L25m413K789M122n305k829L890l444o402M191J784
$$ 2219 6534 5088 2147 5362 5687 1274 4063 8185 2880 51 3941 497 -5905 -1714 70
1454G0o294J80M045m081r99N650m87k880L827L33m698M942N301m134J367O795
$$ 70 -6224 -6044 -1999 -6080 -7079 -1429 -1916 -4796 -969 -636 -5334 -392 4909 775 2142 8937
1470H937m378m397O225J291o873K129L111o639j743M226j834k559L149k689n135
$$ 8937 4559 162 6387 7678 805 2934 6045 -594 -2337 1889 55 -2504 645 -2044 -7179
1485g179L004K50m133M348M678n956n34P182k201l201Q138J326o889K091M322
$$ -7179 -4175 -3925 -8058 -3710 968 -4988 -5522 1660 -541 -3742 4396 5722 -1167 924 5246
1500E246m223R06O221l101l197L037m081m653O215L99q420L440M404r792j109
$$ 5246 1023 1929 8150 5049 1852 4889 808 -3845 2370 2769 -5651 -2211 2193 -7599 -8708
1515h708J1431k793p977O897J986r547L629Q944l705k35O098m594l793Q252o88
$$ -8708 2723 -70 -8047 -1150 836 -8711 -5082 3862 157 -78 6020 1426 -2367 5885 5197
1530E197o425P349K504j2853R64J1428o671o275J0446j285j3257L582O782o986
$$ 5197 -1228 6121 8625 -4228 -3264 8164 1493 -4782 5664 4379 -8878 -5296 1486 -5500
1544e500L32Q040n102m489O780r30l357Q423J271r768L466O500p876L46J2861
$$ -5500 -5168 2872 -2230 -6719 61 -869 -4226 4197 5468 -4300 -834 5666 -2210 -1864 10997
1559A0997m057j0165O313K431r561K328P860n791m118L911l372k310O955r39n329
$$ 10997 6940 -3225 3088 5519 -4042 -1714 6146 355 -3763 148 -3224 -5534 1421 482 -4847
1574d847N016r4r339M689J0156o257k455R547k954q880P271N987p158P39M604
$$ -4847 169 75 -9264 -4575 5581 -676 -3131 6416 3462 -5418 1853 7840 682 1421 6025
1589F025o488k472O415k090j842N702m192q528N380L009q389L765Q969q276o269
$$ 6025 -463 -2935 3480 1390 -452 5250 1058 -7470 -2090 919 -7470 -3705 5264 -3012 -9281
1604i281J0275R84p718O914N745q417j806O274k394l42O806k230m488M377k253
$$ -9281 994 1978 -5740 1174 6919 -1498 -3304 2970 576 234 7040 4810 322 4699 2446
1619B446p237O581N254j0729j408Q581n793p210R997L840r428J05N036m859q44
$$ 2446 -4791 1790 7044 -3685 -5093 3488 -2305 -9515 482 4322 -5106 -5001 35 -4824 -5668
1634e668O505m66r20M242k859l715P175J660o889M167N243r562k521R588j351
$$ -5668 837 371 -549 3693 834 -2881 4294 5954 -935 3232 8475 -1087 -3608 5980 4629
1649D629p317N093K273q937j197N086k412j425L466k757k086M525j595k459P467
$$ 4629 -2688 2405 4678 -4259 -5456 -370 -2782 -4207 -741 -3498 -5584 -1059 -2654 -5113 2354
1664B354J457q455K275P808n215l053J0075M94p904J976M085m412j103L920k843
$$ 2354 3811 -4644 -2369 5439 224 -2829 7246 7740 -164 1812 5897 1485 382 4302 1459
1679A459k356J617l185j302M874j239n569L657J975p501R07Q397k637m987O468
$$ 1459 -897 720 -2465 -3767 1107 -132 -5701 -2044 -69 -7570 -6663 1734 -903 -5890 578
1694E78K529n732J906N496j941j360K262j509n68K576j210j264L214k030n813
$$ 578 3107 -2625 -719 4777 2836 1476 3738 2229 1661 4237 3027 1763 4977 2947 -2866
1709b866K560K995o085j242N711k398n823L808L275l526n35L661r52j616J686
$$ -2866 -306 2689 -3396 -4638 1073 -1325 -7148 -3340 -65 -3591 -4126 -465 -1417 -3033 -1347
1724a347N97J370K512j102j427M165j24m639K147M266m489l510M441L22m943R40
$$ -1347 -750 620 3132 2030 603 4768 4644 5 2152 6418 1929 -1581 2860 3182 -1761 -821
1740h21K760k713k437J176l57o35L70m36P69J526j436j114L834J385l576J162
$$ -821 1939 -774 -3211 -2035 -2392 -3027 -2657 -3093 -2324 -798 -2234 -3348 486 1871 -1705 -543
1756e43M144k012k764L585K657l098q42K560p95j817p43M59L4j088j883M26K165
$$ -543 3601 1589 -1175 2410 5067 1969 1127 3687 2892 1075 332 791 825 -263 -2146 -1720 445
1773D45j939k572K642J426l328n25L257K21k088J553K506q72p33J146J038k76
$$ 445 -1494 -4066 -1424 2 -3326 -3851 -594 -373 -2461 -908 1598 726 -7 1139 2177 1901
1789A901q43pR49N74j947j15J996r75k742Q90J546k702j702K498K24k110L91J851
$$ 1901 1058 1051 2000 2574 627 512 2508 1533 -1209 -319 1227 -1475 -3177 -679 -455 -2565 -2174 -323
1807c23m68j170P58J220n5p98K69J433P40j111N7J744N3j987J39J625j149j906
$$ -323 -791 -1961 -1203 17 -38 -836 -567 866 1606 495 552 2296 2349 362 501 2126 977 -929
1825i29P13J432j392j287R93Q54j343q51P37N33j168k78J376R28o72k10J355O55
$$ -929 -216 1216 -176 -1463 -470 384 -959 -1810 -1073 -540 -1708 -1986 -610 318 -354 -564 791 1446
1843A446j253j79J283j28j099M24J022m67q78J44M66n11j281jQ27n05j321N86
$$ 1446 193 14 1297 1169 70 494 1516 1049 171 315 781 270 -1011 -1012 -185 -690 -2011 -1425
1861a425J688q24j155J305J365j573q64K005M55j380N60J381n5k74J11o5J46k74
$$ -1425 263 -561 -1716 -411 954 -619 -1483 522 977 -403 157 1538 1483 1209 1320 1255 1401 1127
1879A127j321p7J095q21j617J462P04k187l89J898o00j665J057J105j159K09J302
$$ 1127 -194 -271 824 3 -1614 -152 552 -1635 -2024 -126 -726 -2391 -1334 -229 -1388 -1179 123
1896A23K93L54N16j79r7O34n13o88J297L71j708K79J183j294j382J376l54j937
$$ 123 416 770 1286 1107 1010 1644 1131 443 1740 2111 403 682 1865 571 -811 565 211 -1726
1914a726K79J49o18q7Q38k43M18L92r33K66J904p13p06J808O90j396R29J555q51
$$ -1726 -1447 -1298 -1916 -2003 -1165 -1408 -990 -598 -1531 -1265 639 -74 -780 1028 1718 322 1251 2806 1955
1933A955m14P59j194j166J162n06j419J257K86k668N2J843j816j521L033o65k669
$$ 1955 1541 2300 1106 -60 1102 596 -823 434 720 -1948 -1896 -53 -1869 -3390 -357 -1022 -3691
1950c691K115K031k304N77L003j533j453L016m0j940K563R48k946O44K306k687
$$ -3691 -1576 455 -1849 -1272 1731 198 -1255 1761 1721 -219 2344 3292 346 990 3296 609
1966F09m62L088j942l493K269N71l807R21L184k499j800K378l79j778K046J036
$$ 609 147 3235 1293 -2200 69 640 -3167 -2246 938 -1561 -3361 -983 -1362 -3140 -1094 -58
1982e8j709J417J059k111J253L338j603j171L140q92l500K090K240k361n60J853
$$ -58 -1767 -350 709 -1402 -149 3189 1586 415 3555 2663 -837 1253 3493 1132 572 2425
1998B425k098j515J632q59j064J475j241k462K150R87k980K175L323l196k006
$$ 2425 327 -1188 444 -415 -1479 -4 -1245 -3707 -1557 -570 -3550 -1375 1948 -1248 -3254
2013c254M133P4k873L094K432l439j93K912j619j73K648j741k359K226o86l960
$$ -3254 879 953 -1920 1174 3606 167 -26 2886 1267 1094 3742 2001 -358 1868 1182 -2778
2029b778L454K553n196r58M903l207m337N349J782m759O97L425k908k85L976p61
$$ -2778 676 3229 -1967 -2925 1978 -1229 -5566 -217 1565 -3194 -2497 928 -1980 -2265 1711 950
2045I50j610L218j591l312L989K136m229J395L591m376l061N605k54m808K594
$$ 950 -660 2558 967 -2345 1644 3780 -449 946 4537 161 -2900 2705 2451 -2357 237
2060B37J926m766n50L710j547o41K067j138k203K687k91k152L741J755m813O59
$$ 237 2163 -2603 -3153 557 -990 -1631 436 -702 -2905 -218 -509 -2661 1080 2835 -1978 -1319
2076a319M288k631k275N359r3m921J392K233k656L3K916j944j373J355j972j079
$$ -1319 2969 338 -1937 3422 3329 -1592 -200 2033 -623 -590 2326 382 -991 364 -1608 -2687
2092b687L796m52l928L109J790n392P07O464k364l741L926J041n036J846M126
$$ -2687 1109 657 -3271 -162 1628 -3764 -3057 3407 1043 -2698 1228 2269 -2767 -921 3205
2107C205k662m23K124k421j245L285j110k139L357l80n131J902M175l690j922
$$ 3205 543 120 2244 -177 -1422 1863 753 -1386 1971 1591 -3540 -1638 2537 -1153 -3075
2122c075N735j241n689L207L368l147l38L428j701j836K009k02n17K570j173k808
$$ -3075 2660 1419 -4270 -1063 2305 -842 -1180 2248 547 -1289 720 518 1 2571 1398 -1410
2138a410K417Q55m139J232M655l077l613L540O43l952J461K867j736j208J119
$$ -1410 1007 1862 -2277 -1045 3610 533 -3080 460 1103 -2849 -1388 1479 -257 -1465 -346
2153c46n31L91J784j132l19K358j795k612L775J898m139K34L933k975k998L359
$$ -346 -877 -486 1298 166 -153 2205 410 -2202 1573 3471 -668 -434 3499 524 -2474 885
2169H85J247l364N60J499k258n89J434p55L55J562j986j291L198j54k941K799
$$ 885 2132 -1232 -672 827 -1431 -2020 -586 -1341 -986 576 -1410 -2701 497 343 -2598 201
2185B01K934m013j004M405l49l453K727K134l347q08J902p25q76J154r60o76J247
$$ 201 3135 -878 -1882 2523 2174 -1279 1448 3582 235 -573 1329 604 -272 882 -78 -754 493
2202D93j413k040K802O60l273N79L026k336j770L776Q63k647N33K328r68o07J304
$$ 493 -920 -2960 -158 502 -2771 -2192 834 -1502 -3272 504 1367 -1280 -747 1581 613 6 1310
2219A310L98j41k50p34M67J171j455j254J734Q0l266N23K378j493k257J755J288
$$ 1310 1708 1567 1317 583 1050 2221 766 -488 1246 1326 -1940 -1417 961 -532 -2789 -1034 254
$$ [...]
8191A72
##END NTUPLES=NMR FID
##END=
