##TITLE=1H_LR-772-RB-OM1
 CDCl3
 8 sc, 
 30.10.2023
##JCAMPDX= 6.0         $$ Bruker NMR JCAMP-DX V2.0
##DATA TYPE= NMR FID
##DATA CLASS= NTUPLES
##ORIGIN= UXNMR, Bruker Analytische Messtechnik GmbH
##OWNER= root
$$ XWIN-NMR		Version 3.5
$$ Mon Oct 30 16:31:01 2023 Russian Standard Time (UT+4h)  she@DPX200
##.OBSERVE FREQUENCY= 200.13135
##.OBSERVE NUCLEUS= ^1H
##.DELAY= (6, 6)
##.ACQUISITION MODE= SIMULTANEOUS
##.ACQUISITION SCHEME= undefined
##.AVERAGES= 8
##.DIGITISER RES= 18
##SPECTROMETER/DATA SYSTEM= spect
##.PULSE SEQUENCE= zg30
##.SOLVENT NAME= D2O
##.SHIFT REFERENCE= (INTERNAL, D2O, 0, 15.7039)
##AUDIT TRAIL= $$ (NUMBER, WHEN, WHO, WHERE, WHAT)
$$ ##TITLE= Audit trail, XWIN-NMR		Version 3.5
$$ ##JCAMPDX= 5.01
$$ ##ORIGIN= Bruker BioSpin GmbH
$$ ##OWNER= she
$$ F:/spectra/data/she/nmr/H-F/1/audita.txt
$$ ##AUDIT TRAIL=  $$ (NUMBER, WHEN, WHO, WHERE, WHAT)
(   1,<2023-10-30 16:30:15.51 +0400>,<she>,<DPX200>,
      <created by zg, POWCHK disabled, PULCHK disabled
       configuration hash MD5:
       00 E9 B6 7A A2 85 ED C7 34 08 36 98 17 FE 4E 26
       data hash MD5: 16K
       CB 71 A5 4D BF FB B1 9C 68 A4 94 0D 16 5F B5 A9>)
$$ ##END=
$$ 
$$ hash MD5
$$ BA DB 58 2D 55 48 D0 A3 8F 49 F4 4B 54 DC 0F 3E
##$RELAX= 
##$RELAX= 
##$RELAX= 
##$RELAX= 
##$RELAX= 
##$RELAX= 
$$ Bruker specific parameters
$$ --------------------------
##$DU= <F:/spectra>
##$EXPNO= 1
##$NAME= <H-F>
##$PROCNO= 1
##$TYPE= <nmr>
##$USER= <she>
##$AMP= (0..31)
100 100 100 100 100 100 100 100 100 100 100 100 100 100 100 100 100 100 
100 100 100 100 100 100 100 100 100 100 100 100 100 100 
##$AQSEQ= 0
##$AQ_mod= 1
##$AUNM= <au_zg>
##$AUTOPOS= <>
##$BF1= 200.13
##$BF2= 200.13
##$BF3= 200.13
##$BF4= 200.13
##$BF5= 200.13
##$BF6= 200.13
##$BF7= 200.13
##$BF8= 200.13
##$BYTORDA= 1
##$CFDGTYP= 0
##$CFRGTYP= 5
##$CHEMSTR= <none>
##$CNST= (0..31)
1 1 145 1 1 1 1 1 1 1 1 1 1 1 1 1 1 1 1 1 1 1 1 1 1 1 1 1 1 1 1 1 
##$CPDPRG= <>
##$CPDPRG1= <>
##$CPDPRG2= <>
##$CPDPRG3= <>
##$CPDPRG4= <mlev>
##$CPDPRG5= <mlev>
##$CPDPRG6= <mlev>
##$CPDPRG7= <mlev>
##$CPDPRG8= <mlev>
##$CPDPRGB= <>
##$CPDPRGT= <>
##$D= (0..31)
0 1.2 0 0 0 0 0 0 0 0.06 0 0.03 0 0 0 0 0.0002 0 0 0 0 0 0 0 0 0 0 0 0 
0 0 0 
##$DATE= 1698669014
##$DBL= (0..7)
120 120 120 120 120 120 120 120 
##$DBP= (0..7)
150 150 150 150 150 150 150 150 
##$DBP07= 0
##$DBPNAM0= <>
##$DBPNAM1= <>
##$DBPNAM2= <>
##$DBPNAM3= <>
##$DBPNAM4= <>
##$DBPNAM5= <>
##$DBPNAM6= <>
##$DBPNAM7= <>
##$DBPOAL= (0..7)
0.5 0.5 0.5 0.5 0.5 0.5 0.5 0.5 
##$DBPOFFS= (0..7)
0 0 0 0 0 0 0 0 
##$DE= 6
##$DECBNUC= <off>
##$DECIM= 32
##$DECNUC= <off>
##$DECSTAT= 4
##$DIGMOD= 1
##$DIGTYP= 9
##$DL= (0..7)
0 120 120 120 120 120 120 120 
##$DP= (0..7)
150 150 150 150 150 150 150 150 
##$DP07= 0
##$DPNAME0= <>
##$DPNAME1= <>
##$DPNAME2= <>
##$DPNAME3= <>
##$DPNAME4= <>
##$DPNAME5= <>
##$DPNAME6= <>
##$DPNAME7= <>
##$DPOAL= (0..7)
0.5 0.5 0.5 0.5 0.5 0.5 0.5 0.5 
##$DPOFFS= (0..7)
0 0 0 0 0 0 0 0 
##$DQDMODE= 0
##$DR= 18
##$DS= 0
##$DSLIST= <SSSSSSSSSSSSSSS>
$$ [...]
##$SUBNAM2= <"">
##$SUBNAM3= <"">
##$SUBNAM4= <"">
##$SUBNAM5= <"">
##$SUBNAM6= <"">
##$SUBNAM7= <"">
##$SUBNAM8= <"">
##$SUBNAM9= <"">
##$SW= 18.05172834244
##$SWIBOX= (0..15)
0 0 2 0 0 0 0 0 0 0 0 0 0 0 0 0 
##$SW_h= 3612.71676300578
##$TD= 16384
##$TD0= 1
##$TE= 0
##$TE2= 300
##$TE3= 300
##$TEG= 300
##$TL= (0..7)
0 120 120 120 120 120 120 120 
##$TP= (0..7)
150 150 150 150 150 150 150 150 
##$TP07= 0
##$TPNAME0= <>
##$TPNAME1= <>
##$TPNAME2= <>
##$TPNAME3= <>
##$TPNAME4= <>
##$TPNAME5= <>
##$TPNAME6= <>
##$TPNAME7= <>
##$TPOAL= (0..7)
0.5 0.5 0.5 0.5 0.5 0.5 0.5 0.5 
##$TPOFFS= (0..7)
0 0 0 0 0 0 0 0 
##$TUNHIN= 0
##$TUNHOUT= 0
##$TUNXOUT= 0
##$USERA1= <user>
##$USERA2= <user>
##$USERA3= <user>
##$USERA4= <user>
##$USERA5= <user>
##$V9= 5
##$VALIST= <valist>
##$VCLIST= <CCCCCCCCCCCCCCC>
##$VD= 0
##$VDLIST= <DDDDDDDDDDDDDDD>
##$VPLIST= <PPPPPPPPPPPPPPP>
##$VTLIST= <TTTTTTTTTTTTTTT>
##$WBST= 1024
##$WBSW= 4
##$XGAIN= (0..3)
0 0 0 0 
##$XL= 0
##$YL= 0
##$YMAX_a= 176259
##$YMIN_a= -170760
##$ZGOPTNS= <>
##$ZL1= 120
##$ZL2= 120
##$ZL3= 120
##$ZL4= 120
##$ABSF1= 10
##$ABSF2= 0
##$ABSG= 5
##$ABSL= 3
##$ALPHA= 0
##$AQORDER= 0
##$ASSFAC= 0
##$ASSFACI= 0
##$ASSFACX= 0
##$ASSWID= 0
##$AUNMP= <proc_1d>
##$AZFE= 0.1
##$AZFW= 0.1
##$BCFW= 1
##$BC_mod= 2
##$BYTORDP= 1
##$COROFFS= 0
##$CY= 11.3945322036743
##$DATMOD= 1
##$DC= 2
##$DFILT= <>
##$DTYPP= 0
##$F1P= 15.7292609196834
##$F2P= 12.9074282941183
##$FCOR= 0.5
##$FTSIZE= 0
##$FT_mod= 4
##$GAMMA= 1
##$GB= 0.15
##$INTBC= 1
##$INTSCL= 1
##$ISEN= 128
##$LB= 0.24
##$LEV0= 0
##$LPBIN= 0
##$MAXI= 10000
##$MC2= 0
##$MEAN= 0
##$ME_mod= 0
##$MI= 1.114404
##$NCOEF= 0
##$NC_proc= 0
##$NLEV= 6
##$NOISF1= 3.799351
##$NOISF2= 2.8
##$NSP= 1
##$NTH_PI= 0
##$NZP= 0
##$OFFSET= 15.70392
##$PC= 1
##$PHC0= -23867.35
##$PHC1= 11.05271
##$PH_mod= 1
##$PKNL= yes
##$PPARMOD= 0
##$PSCAL= 0
##$PSIGN= 0
##$REVERSE= no
##$SF= 200.130013532006
##$SI= 16384
##$SIGF1= 3
##$SIGF2= 2
##$SINO= 400
##$SIOLD= 16384
##$SREGLST= <1H.CDCl3>
##$SSB= 0
##$STSI= 0
##$STSR= 0
##$SW_p= 3612.71676300578
##$SYMM= 0
##$S_DEV= 0
##$TDeff= 0
##$TDoff= 0
##$TI= <>
##$TILT= no
##$TM1= 0
##$TM2= 0
##$TOPLEV= 0
##$USERP1= <user>
##$USERP2= <user>
##$USERP3= <user>
##$USERP4= <user>
##$USERP5= <user>
##$WDW= 1
##$XDIM= 8192
##$YMAX_p= 0
##$YMIN_p= 0
$$ End of Bruker specific parameters
$$ ---------------------------------
##NTUPLES= NMR FID
##VAR_NAME=  TIME,          FID/REAL,        FID/IMAG
##SYMBOL=    X,             R,               I
##VAR_TYPE=  INDEPENDENT,   DEPENDENT,       DEPENDENT
##VAR_FORM=  AFFN,          ASDF,            ASDF
##VAR_DIM=   8192,          8192,            8192
##UNITS=     SECONDS,       ARBITRARY UNITS, ARBITRARY UNITS
##FACTOR=    0.0002768,     1,               1
##FIRST=     0,             0,               0
##LAST=      2.2672688,     0,               0
##MIN=       0,             -170760,         0
##MAX=       2.2672688,     176259,          0
$$ Real data points
##PAGE= N=1
##DATA TABLE= (X++(R..R)), XYDATA
0 0 0 0 0 0 0 0 0 0 0 0 0 0 0 0 0 0 0 0 2 -4 8 -8 8 -8 8 -8 14 -16 16 -20 23 -24 28 -31 36 -41 44 -51 57 -62 68
41 68 -76 84 -93 104 -114 126 -137 152 -167 184 -204 223 -249 275 -305 340 -381 430 -486 560 -651
62 -651 769 -930 1162 -1520 2131 -3375 6797 -32695 -74109 126260 126463 -69596 -74033 6069
76 6069 32183 143362 176259 44636 4829 7540 -87960 -49435 89924 47510 -39014 -29318
88 -29318 -90140 -127249 -7930 48561 -6243 -23932 -77121 -135066 -47211 27979 7406 73056
100 73056 115706 -14568 -60055 55452 83658 56306 77445 25534 -48481 -18215 -556 -5794
112 -5794 62230 65731 -43521 -79794 -59111 -73664 -34685 21903 -20649 -55797 -32823 -44243
124 -44243 -25733 52718 55838 17089 24315 -10241 -48546 25540 82271 43155 39982 46065 -14584
137 -14584 -22335 30748 21751 1902 11814 -37283 -84871 -42959 -10070 -14000 10092 4635 -46547
150 -46547 -46443 -17172 -13553 13626 40949 12224 -6510 12789 17196 34136 68853 50079 8772
163 8772 3281 -10250 -24041 7871 24041 -3022 -12817 -18832 -41492 -29603 -516 -7038 -17249
176 -17249 -17304 -35864 -35635 -892 17049 20962 32145 19723 -1287 8314 19876 20303 31434 26592
190 26592 -208 -3922 4568 1111 10968 18955 -5297 -26454 -27346 -33579 -29162 -7077 -6234 -17125
204 -17125 -13037 -14403 -15479 7507 21213 11605 10234 8738 -2635 6849 27535 27402 25397 24567
218 24567 5957 -5591 4187 3531 -5166 -2857 -11400 -28342 -24135 -13674 -11964 -4558 -2835 -15497
232 -15497 -19050 -12272 -9121 1306 13735 11413 7989 12984 12016 14463 24627 22568 11900 8325
246 8325 445 -6784 2155 7391 -587 -2972 -5475 -18062 -20497 -12105 -12099 -14384 -11356 -14492 -15523 -5237
262 -5237 3951 8745 14129 11918 4469 4593 7430 8882 14664 15923 9691 7833 8071 3857 5155 7248
278 7248 -3403 -12615 -12914 -17899 -19614 -8098 -2538 -7630 -6315 -3320 -7287 -5489 2161 1359 -1155
293 -1155 2073 2841 3611 11120 18035 17159 14275 10149 4142 -555 -2102 -2033 -2935 -5960 -8179 -6668 -5811
310 -5811 -5307 -1815 -2013 -8545 -12223 -10298 -9727 -6633 1395 6395 6203 7756 10206 9075 8477 8937 5877
327 5877 -566 -2840 -1684 -699 843 4204 4435 -585 -3858 -4488 -7403 -9485 -7151 -6745 -9132 -6956
343 -6956 -864 1889 3656 7164 7009 1855 305 1539 761 735 4276 5608 3826 4221 6246 3983
359 3983 1196 130 -3239 -9098 -10383 -7852 -7149 -4614 -86 458 -1409 348 1289 -926 -651 1457
375 1457 1279 1055 2912 6069 8445 8832 7479 5228 1817 -2300 -3332 -3121 -5002 -4783 -2631 -3082 -3115
392 -3115 -57 64 -1791 -1393 -2724 -6188 -4702 -543 -221 1705 6302 6971 5249 5746 6226 3672 1528
409 1528 240 -976 -1060 -919 763 3235 2699 311 -268 -2908 -6064 -6036 -6214 -7664 -4910 -2636 -2442
426 -2442 1450 5482 3435 2693 4985 1775 -1040 1539 2292 1021 3894 4800 2897 4674 4257 -217
442 -217 -868 -1111 -6833 -7405 -3685 -5706 -5044 845 979 -1441 1614 817 -3063 -680 -639 -4195 -737
459 -737 2282 -102 2901 7147 4021 3175 5257 647 -2492 582 -1273 -3687 814 417 -2349 1485
475 1485 1766 -3717 -1278 213 -6294 -5473 -623 -3277 -2340 3031 1224 116 4665 1984 -1234 2483
491 2483 1371 -2709 975 1631 -1762 2710 4659 -1091 463 3169 -3282 -3625 1211 -3396 -3575 3555
507 3555 192 -3454 3989 3403 -4203 -73 1886 -5293 -2753 2143 -2307 -850 5633 1096 -1372
522 -1372 4068 1199 -3237 627 -347 -3333 1728 2057 -1350 3773 5056 -1752 -50 2140 -3886 -3085
538 -3085 1456 -3783 -3419 4728 1598 -2394 3687 3045 -3335 -171 -173 -5655 -1609 2246 -2464 -331
554 -331 5185 2139 502 2599 -587 -1592 836 -2896 -4046 2460 1190 -1329 4207 3702 -1478 2034
570 2034 1761 -5809 -2439 1815 -4757 -3442 4421 665 -1167 5287 1453 -3939 1772 258 -6369
585 -6369 -1416 2892 -1391 102 3840 696 1608 3823 -1973 -2351 1669 -2736 -4040 1766 510 -1471
601 -1471 3890 2562 -2250 2086 2013 -4725 -2119 1219 -3306 -1155 4604 -28 -217 5370 1065 -4155
617 -4155 456 -91 -4794 -1500 236 -1827 2104 3300 -735 1585 3072 -2483 -2209 1377 -2536 -2325
633 -2325 3403 1265 526 5449 2853 -1313 1841 421 -5130 -964 417 -4463 -1236 3650 -710
648 -710 -870 3723 -243 -3296 -226 -2576 -4648 -71 -213 -1214 3383 4124 830 3297 4176 -1545
664 -1545 -922 1315 -2351 -1973 2481 449 23 3975 1502 -1597 825 -1850 -6256 -2932 -1441 -5369
680 -5369 -2031 2226 -373 618 3116 491 -305 1380 -1124 -2059 1490 599 -284 4095 4187 1188 2907
697 2907 2999 -1045 -1375 -899 -3378 -2805 -937 -2516 -1523 1599 -171 -1507 652 -1183 -3358 -1046 -872
714 -872 -2437 296 1860 1197 3151 3850 1348 1721 2733 -845 -1261 1332 -291 -1161 1628 1252 -817
731 -817 582 -225 -2462 -1494 -1628 -3931 -2316 -403 -1325 -242 1940 1123 344 1541 815 -276 1227
748 1227 376 -274 1736 1724 574 2032 2067 -765 -622 -75 -2355 -2708 -710 -1539 -1211 300 300 -295 665
767 665 410 -876 -995 -376 -400 155 1180 1386 1942 1569 1509 868 240 -580 -391 -751 -1790 -1113 400 -73
787 -73 -461 875 115 -1118 -517 -871 -1703 -881 77 -148 603 2058 1883 1394 1935 1361 278 -299 -477
806 -477 -791 -909 -719 -167 85 -253 -407 -265 -873 -1719 -1570 -1549 -1703 -862 686 859 1174 2151 2028 962
826 962 1333 881 100 259 761 493 104 1000 853 -64 -593 -508 -1636 -2121 -1835 -1677 -1992 -1194 -482 -238
846 -238 -452 347 821 481 131 501 644 718 1642 1922 1894 2160 2173 1301 320 167 -197 -1421 -1586 -1214 -1436
867 -1436 -1551 -861 -595 -867 -1463 -1399 -1466 -1509 -926 -386 196 874 1668 1879 2005 2118 1842 1259 351 653 313
888 313 58 238 521 489 213 151 -496 -1713 -2242 -1636 -2337 -2573 -1254 -556 -357 310 1301 545 683 1223
908 1223 249 106 344 529 491 1612 1858 1355 1623 1555 237 -380 -1084 -1618 -1727 -1876 -1692 -838 -228 -194
928 -194 123 300 -205 -719 -688 -465 -928 -135 472 833 1449 1866 1753 1191 831 -95 -720 -795 -1018 -1027 -263 -255
950 -255 -161 115 246 -203 -337 -725 -1035 -932 -709 -496 486 922 839 1183 1518 1090 404 -36 -507 -418 -425 -521
972 -521 -462 -20 -66 -351 265 -453 -1154 -975 -1008 -883 -465 269 338 777 1234 1154 999 987 490 61 201 -17
994 -17 -299 158 502 549 248 -206 -385 -598 -1520 -1706 -1211 -1196 -1259 -638 115 167 560 850 274 268 640 200 175
1017 175 1094 1054 714 2125 1742 589 630 564 -684 -1419 -930 -1411 -1116 -745 -1073 -458 209 -492 -1011 -194
1037 -194 -894 -1197 -381 229 -117 1094 1804 1075 1555 2458 761 136 960 -170 -1141 130 -184 -766 71
1056 71 554 -754 -644 -298 -1194 -1512 -1166 -1512 -701 -38 63 422 1376 777 520 1050 520 -188 634 737
1076 737 -433 964 1241 236 516 1073 -765 -1187 -87 -1044 -1570 -168 -573 -1113 86 513 -537
1093 -537 446 705 -397 0 401 -215 99 810 436 526 1112 445 -38 556 -228 -1034 -352 -336 -888 131
1113 131 648 -545 185 458 -769 -506 633 -452 -855 499 678 66 1049 1087 1 410 88 -574
1131 -574 -313 64 -858 11 736 -383 44 389 -353 -805 -29 -717 -1105 112 35 -121 866 1406 244
1150 244 872 1125 9 -107 238 -275 -581 370 171 0 742 414 -18 -199 -747 -1382 -1083 -964 -1253 -414
1170 -414 381 53 699 1113 508 349 573 80 -489 501 435 380 866 1114 288 768 392 -667 -761 -668 -1447
1191 -1447 -1170 -438 -863 -158 406 -102 -347 135 -4 -345 -267 -25 44 758 1102 745 1175 1399 593 350
1211 350 447 42 -426 -412 -254 -602 -176 -204 -74 -49 -359 -721 -906 -744 -832 -439 21 227 443 715 708 646 696
1234 696 131 -4 248 141 98 508 447 496 450 300 -226 -423 -430 -995 -726 -744 -707 -61 85 109 128 384 -37
1257 -37 -362 -18 -228 -449 273 107 325 660 865 227 414 333 -401 -692 -543 -601 -442 293 216 334 398 635
1279 635 42 -34 -144 -544 -426 -311 -347 259 610 420 595 439 -12 -151 -97 -875 -830 -280 -497 -245 299
1300 299 369 40 448 186 -337 -206 -50 -36 -248 128 426 479 544 548 591 202 -101 -366 -530 -374 -480 -297
1322 -297 116 -110 56 -129 -376 -186 -382 -869 -415 88 197 86 469 730 74 447 404 335 141 239 196
1343 196 -90 248 -88 230 96 8 -185 -471 -767 -463 -454 -619 -528 -354 -76 -221 27 42 35 115 267 96 89
1366 89 127 410 258 675 831 452 -27 -148 -23 -149 -509 -176 -341 -53 43 -228 -245 -337 -357 -404 -416 -462 84
1389 84 128 -21 238 629 501 345 313 -154 -25 -15 1 -4 -32 295 65 187 415 293 85 32 -407 -374 -501
1412 -501 -222 -264 -270 154 185 374 66 34 -131 -302 -220 -246 -247 -133 36 581 280 358 340 -18 -79 -315 -245 -263 -210
1437 -210 66 213 191 239 291 263 45 -2 60 -197 13 -83 145 187 119 132 210 -165 -2 -487 -194 -125 -575 -6
1461 -6 -55 273 140 179 -70 322 -53 309 209 0 194 320 154 320 304 80 132 -273 -382 -435 -192 -340
1483 -340 -175 105 -133 113 243 78 -154 -20 -54 23 -113 328 297 146 397 511 459 524 44 19 91 -243
1505 -243 -347 58 166 110 136 1 -55 -227 -265 -522 -412 -299 -625 1 40 180 224 491 430 -44 63 40 -74
1528 -74 -182 252 158 341 543 300 250 163 -149 -204 -519 -516 -683 -130 -73 -194 54 51 -57 346 -119 -201 -245 -91
1552 -91 -146 -201 242 157 298 537 256 176 105 -80 -264 -152 -33 -164 52 77 13 150 269 211 -117 -127 -345
1575 -345 -279 -9 -256 -85 431 136 141 309 199 -205 -90 60 -384 -90 161 -67 96 232 112 -178 9
1596 9 -168 -277 87 46 -38 243 403 50 84 315 269 -38 205 -192 73 -130 -159 -175 -36 -144 7 -109 -258
1619 -258 -307 -249 -113 55 -43 319 194 415 256 49 81 231 118 -181 35 247 29 53 264 185 -53 -67
1641 -67 -279 -566 -401 -698 -512 -287 -91 -207 35 -59 -231 24 168 -291 -5 9 -49 119 241 364 435 453
1663 453 209 185 147 -146 -467 -331 -89 -242 -59 -287 -309 -137 78 -329 -435 -228 -323 -316 -74 -36 134 412
1685 412 507 437 251 176 132 130 299 22 -175 7 43 88 -50 -307 14 -73 -285 -407 -171 -464 -173 196 -308
1708 -308 35 -139 229 -9 -50 113 92 250 134 -53 304 223 -14 40 170 -174 -229 -304 244 -91 -67 130
1730 130 99 -16 -154 142 -147 -172 -221 -44 -41 -30 103 -68 87 11 61 -208 -65 -301 -322 -35 -214 -152 -34
1753 -34 296 289 -32 34 325 28 -140 -126 92 74 146 304 244 381 195 -55 12 -197 -250 -131 -116 -370 -152 -48
1777 -48 17 -13 -77 82 -268 -195 -306 -288 -183 115 -161 187 463 138 496 216 0 79 -104 -219 -79 255
1799 255 217 89 304 227 -121 70 -441 -348 -377 -293 -337 -120 -229 -49 140 191 329 58 -186 -103 89 153 10
1822 10 277 390 173 376 293 136 66 -131 103 -238 -198 -122 -161 -205 -77 -144 -347 -18 -319 -263 -225 13 -199
1845 -199 -65 510 346 397 -36 173 120 314 -234 91 28 303 64 -174 -81 -50 183 49 -176 75 -272 -200
1867 -200 -89 -45 -11 110 -79 -84 -3 -11 108 -69 -111 167 41 267 148 312 173 55 241 -119 -133 -211 -51
1890 -51 54 205 -154 -168 90 2 -127 -253 -106 -270 -133 -5 44 205 -125 300 320 163 385 152 -175 -152
1912 -152 -40 -191 -316 -56 57 47 58 -66 -62 22 -243 -78 163 -69 -378 -108 208 -6 161 73 -57 -171
1934 -171 -191 -85 -20 -99 12 -6 -65 -50 -144 -62 122 213 -66 -162 -108 -62 -189 -117 314 347 47 37 282 72 -72
1959 -72 140 193 163 81 -189 159 -74 -77 -262 23 -226 -277 -80 -135 -135 -211 -117 -10 -187 131 230 125 -2 273
1983 273 -16 182 453 164 143 175 4 171 7 -80 -117 -149 -299 36 -159 -203 -88 -16 -68 -104 -330 -281 -191 -63
2007 -63 102 50 236 191 162 66 437 170 -16 189 -114 -66 100 43 80 135 -137 93 9 -274 -289 -169 -47 -17
2031 -17 -122 281 166 16 -209 161 310 46 111 -15 -119 -27 223 99 227 222 14 34 52 -85 -12 30 19
2054 19 7 9 -90 -71 -108 175 144 -69 -486 -96 212 -2 -240 181 -16 -238 45 -308 -97 56 -200 -96 -127
2077 -127 -118 57 -37 84 -100 -169 -23 206 38 -219 309 29 -104 54 -49 -144 142 108 -147 123 -89 -31
2099 -31 63 145 43 -155 220 -65 -103 141 -63 91 14 193 -11 202 111 209 175 224 61 -2 55 -163 -101 -343
2123 -343 -135 131 12 -201 -263 -145 -195 -216 -315 9 -263 -249 67 -112 227 11 107 82 181 -106 -15 -29 18 300
2147 300 32 -30 -34 -122 206 237 57 -7 -290 -345 -346 -35 -113 -105 34 -50 120 5 -55 -256 0 76 221 10 -43
2172 -43 308 27 199 231 47 254 30 109 240 -18 -20 -59 -152 -495 73 -22 -42 -195 -204 13 97 96 -209 89 123
2197 123 -169 -119 51 -43 -7 -45 -86 180 -56 201 74 195 96 -15 -75 6 -44 -133 12 -47 114 -73 -23 -28 88
2222 88 -113 -116 90 46 -209 119 225 -66 -7 110 71 6 189 -385 312 -114 -26 46 -129 -363 -110 90 -109
2245 -109 89 -185 227 -267 26 -243 -215 -93 173 -92 332 20 24 -54 -453 -117 -222 28 80 4 -112 314
2267 314 64 69 177 143 86 -173 134 7 107 266 -38 148 123 -27 209 -75 258 -114 59 -55 -53 -67 -188
2290 -188 93 -110 -107 -88 24 -10 -118 -27 -119 85 -9 141 14 129 179 87 -32 173 341 205 -192 -42 -12
2313 -12 144 132 -144 -175 -134 -55 78 -180 -73 108 -322 -170 -88 -93 -110 -96 -138 47 -38 -105 -94 40 -78 86 134
2338 134 -156 87 84 249 15 102 129 -155 -118 3 285 56 3 -16 -121 -319 -46 -72 -42 -22 -209 117 -120
2361 -120 10 -88 21 -52 70 298 152 28 -123 -49 -63 38 -24 97 -274 -64 -208 -13 -309 -74 -43 58
2383 58 162 -41 62 91 -46 -174 13 -105 -32 38 -122 -40 208 83 -42 69 -157 -177 -46 213 -216 219
2405 219 -117 160 41 -5 115 25 51 163 -20 -6 226 -57 12 -61 -108 194 238 75 -162 -98 169 -231 -115
2428 -115 -88 159 99 218 147 -65 -97 287 245 36 -162 103 119 286 -161 18 -150 -278 -65 -57 72 108 99 -132
2452 -132 -171 -16 -165 -288 -190 -128 -5 0 -172 34 -3 163 12 96 74 201 -96 252 294 -96 -347 69 -116
2475 -116 55 11 -21 108 -3 184 -246 -79 171 138 -79 290 -21 -177 141 293 -69 -248 -22 47 15 28
2497 28 112 265 -139 -143 50 -25 20 56 -143 -141 -172 -82 -31 118 186 154 -109 -181 -134 -124 -166 -48 -157 -42 -23 21 167
2524 167 68 33 -85 198 -128 153 5 -44 146 -65 129 249 -83 9 -168 -17 -230 -63 -79 -453 -96 -218
2546 -218 99 49 -69 -116 96 13 87 -71 151 -211 -88 -60 94 -208 275 83 -28 364 266 -217 -58 162
2568 162 22 -45 -86 -1 -168 50 -29 82 -5 -175 11 145 49 -19 83 -52 -272 108 -129 -216 -25 184 43
2591 43 25 128 13 58 25 52 -1 -118 83 31 57 235 -69 81 70 -80 115 162 48 -1 47 -166 -85 97
2615 97 -13 219 -78 -110 59 155 -105 10 173 -13 -91 125 117 -169 112 47 156 -66 -84 -9 -47 72 94 -75
2639 -75 29 -1 42 128 -17 -332 -114 154 -87 315 -159 108 43 209 114 -42 -86 -64 47 -104 6 -14 -231
2662 -231 0 -139 -21 55 -196 -3 191 -130 -121 -180 -304 97 -144 -28 95 -12 155 3 -207 -25 23 63
2684 63 29 -88 2 34 -67 28 110 -39 54 -98 -53 -167 -8 -193 -174 147 -110 -79 27 68 191 116 212 147 85
2709 85 -23 -119 -231 6 -61 308 -108 -50 -101 168 44 34 -97 -58 13 77 -98 111 207 132 91 -132 -28 41
2733 41 261 -114 -27 20 -136 11 -210 -131 27 -49 15 -49 -10 207 -90 8 199 -139 -39 28 -13 19 126 31
2757 31 37 -22 13 183 -32 185 -67 80 127 44 -252 58 35 -108 -65 -48 114 -100 74 -30 3 126 74 -107
2781 -107 109 95 -7 40 -178 210 -26 138 88 -144 -145 93 123 259 180 22 -125 229 97 84 26 -96 -54
2804 -54 96 76 -235 -83 -106 58 -220 189 -128 -132 -63 3 135 -80 197 184 102 336 -190 199 73 230 81
2827 81 -208 89 -113 -45 40 0 -68 209 -17 -221 177 21 -122 -84 -253 -26 23 53 71 1 113 316 203
2850 203 104 -108 20 101 -3 212 224 93 -77 -230 -76 -105 17 -14 -179 104 -110 8 -82 -36 -61 102 -73
2873 -73 -87 -63 -115 -29 68 -130 -344 -97 -66 -22 -122 91 90 177 16 -23 -137 221 -196 -268 34 -300 -99 -95 -117
2898 -117 283 -186 2 -113 -233 -80 -249 -188 -191 101 -107 70 57 -144 8 59 -192 -54 -46 88 97 -44 134
2921 134 -29 168 -169 24 34 -67 -56 -215 14 -26 237 251 -187 101 -117 112 160 -96 76 -145 35 159
2943 159 -61 13 267 142 31 -97 192 88 13 105 171 175 115 178 -117 -123 167 215 -77 38 -167 -244 92 -250
2967 -250 11 -361 -135 200 -178 47 -176 74 16 24 -35 167 251 56 -25 220 113 59 -86 -129 -194 -121 54
2990 54 90 51 104 142 -77 -77 -49 -123 -113 -157 214 194 -107 -168 -94 10 -152 -248 318 -43 -50 -42 -85 -36 116 -76 -30
3017 -30 -187 -196 -110 59 58 -107 -147 187 77 -119 -95 -11 -92 -59 -109 173 8 72 -139 98 -12 66 301 -85 204
3042 204 -188 -55 65 -65 88 129 -127 120 82 76 143 110 22 -224 40 -91 -20 265 207 -172 -239 48 -249
3065 -249 14 58 -28 145 5 -29 74 -23 59 -85 -35 -67 146 107 39 -23 -152 172 88 130 -20 -42 174 49
3089 49 244 -122 -52 -147 213 266 -101 -23 70 -174 -16 -261 76 120 -48 -273 54 92 30 -88 -5 131 112 106
3113 106 18 282 85 36 23 12 132 -25 146 -1 111 -3 56 -70 99 3 182 -28 18 -228 -18 80 118
3136 118 16 204 -93 -127 118 55 244 177 17 -58 -48 -66 -62 321 -76 20 141 118 -227 -130 -63 -87 57 -162
3160 -162 -312 -113 -281 -207 -17 -36 211 -203 -52 -128 -75 -173 211 151 216 -228 58 226 295 257 -153 114 35
3183 35 -104 19 159 -40 -225 322 -70 36 -136 20 73 62 128 192 32 -12 50 -138 -89 45 -34 -162 -117
3206 -117 111 -44 106 216 223 -7 5 -112 51 42 -61 -151 32 -218 -23 114 75 107 -324 39 -7 -221 -157
3229 -157 111 -123 -27 -99 23 -59 -24 -25 -3 -15 -26 260 -48 -77 174 -62 -92 -55 203 -114 180 -35 -179 156
3253 156 83 56 -95 45 -67 -24 -177 -51 174 -293 -73 -128 -57 121 84 -64 60 -78 185 -9 -23 -2 14
3276 14 81 -57 162 -156 16 245 69 -94 -51 9 158 20 29 -309 -25 134 -52 -122 -69 -110 51 136 -12
3299 -12 -139 -213 278 211 158 153 43 35 55 143 82 -157 -75 161 -52 60 -260 -38 -15 -195 -75 -79 17 -135 122
3324 122 -132 -8 137 -67 -29 -109 -60 184 -16 58 -74 -73 -3 -50 165 380 -44 -104 44 293 -353 163 142
3347 142 162 156 -8 -52 106 -13 -178 -165 -183 70 87 -143 113 20 -243 177 -91 215 -9 98 -3 -55 -99
3370 -99 183 68 70 205 -122 276 -106 -148 18 -18 103 -75 -29 -130 123 -52 -196 96 -272 55 213 4
3392 4 -207 128 -201 22 76 2 354 58 -46 -39 113 62 -63 71 -24 107 -159 154 34 234 -153 123 120
3415 120 -197 -7 143 93 -16 -111 -286 107 -78 251 14 126 65 6 15 44 97 -173 -169 158 123 57 -13 -8 -139
3440 -139 -214 42 28 -44 -12 149 -202 -299 -96 35 117 -178 -154 -39 -100 -148 117 -20 -61 -34 85 -113 177 -202
3464 -202 115 -61 -116 20 138 -120 227 -92 -74 -14 -179 -105 -53 231 99 24 -125 136 -12 -371 -65 270
3486 270 27 37 -67 147 -131 251 202 -38 -99 122 41 -139 -240 248 11 9 -109 64 68 -184 332 -117 -38
3509 -38 86 175 -277 -58 -201 70 -175 -32 37 -41 -7 -131 68 -14 1 48 -142 -47 -93 145 -52 119 -158
3532 -158 -183 115 40 196 -77 -96 195 -24 98 196 -181 7 -123 -24 61 -17 167 -69 82 -93 -31 122 -94
3555 -94 -120 -80 -84 -73 128 77 -6 -96 -47 149 81 107 48 147 65 319 124 70 -81 -44 -23 -65 -175 103 27 -247 143
3582 143 -92 -22 -75 -15 -121 -21 -331 -4 150 -97 -12 97 57 -38 83 45 -55 158 271 -6 -36 113 -74
3605 -74 155 -2 -37 -99 -87 186 -43 -58 44 -109 -124 -30 159 78 24 23 144 86 118 -19 -90 102 66 148 119 -44
3631 -44 150 -110 169 -104 -5 -118 94 -23 11 -94 -70 21 35 -21 80 139 22 -204 -115 -35 19 -19 167 211
3655 211 63 140 158 -174 150 123 48 102 149 22 -14 137 -307 -45 -189 -240 54 0 153 36 -20 255 -104
3678 -104 -77 -165 -52 66 -103 18 118 -118 37 119 43 123 39 122 -95 152 53 169 356 -52 3 -88 -91 79
3702 79 -115 80 177 20 -174 0 195 -178 65 95 15 174 -8 19 -127 -35 27 21 254 307 227 115 390 116
3726 116 -225 246 29 -11 -149 -19 64 -84 -16 -25 43 -40 -1 65 92 -154 -33 145 5 -107 79 77 -154 -177
3750 -177 -297 24 -58 -288 14 -132 166 97 339 -112 225 205 -72 -101 198 -8 -69 85 64 -45 138 -73
3772 -73 56 162 97 -2 -12 -51 7 195 74 -19 -124 -169 -16 -74 -146 -102 -17 -302 -159 34 14 -75 102 151 143 111
3798 111 -205 112 184 -47 71 -15 38 -165 -155 -104 -8 -26 -14 70 92 21 -147 -2 2 79 -127 -114 81 -91 149
3823 149 145 -155 -56 -337 166 194 117 -46 -90 116 -62 108 189 -12 -84 -63 79 228 21 -221 170 104 122 -24
3847 -24 -55 167 62 211 385 115 28 226 -55 -15 52 33 25 34 147 246 -41 -36 -68 -88 12 68 -30 3 -5 -48 261
3874 261 20 -3 200 -160 -205 142 -64 222 56 -6 325 156 53 126 151 -13 23 -105 149 120 -38 43 -92
3897 -92 79 124 -73 -94 -67 59 25 6 -13 -71 2 36 -332 -234 40 -108 124 60 -117 32 -104 24 -56 21 -80
3922 -80 104 -45 20 12 63 7 49 -198 256 303 -98 80 19 -20 22 43 70 210 -39 187 51 -57 245 -283
3946 -283 -29 98 -137 191 10 -248 -207 76 63 111 92 -49 8 -148 -217 -27 -6 -268 105 44 277 -85 -71
3969 -71 -149 -117 -89 -164 -72 -12 -184 52 -177 -115 45 92 107 -47 -110 -107 34 277 -4 196 233 7 -42 44 -268
3994 -268 -9 -106 -141 -96 -20 -81 -18 209 77 -7 7 -203 -138 -81 239 111 -11 151 5 -3 15 39 -254 -47 -25
4019 -25 -92 111 -98 -26 -46 -86 -212 -59 -280 145 46 125 78 58 109 -193 70 -50 7 107 -99 113 -198 -74
4043 -74 70 -97 28 -35 83 107 -16 56 255 -46 161 67 79 -16 157 -12 93 -185 -73 146 165 -185 -101
4066 -101 66 14 -89 267 -196 -72 -85 -5 32 -47 14 -10 204 127 -133 -210 -31 124 -35 -15 110 -113 49
4089 49 -69 -51 31 20 -44 366 -50 -62 -23 -48 -85 15 109 226 259 173 -29 130 -119 -93 257 -50 -72 27 179
4114 179 -158 -43 -105 8 -191 148 -28 -233 66 -81 64 -5 72 122 58 134 -138 169 27 6 167 127 -141
4137 -141 172 -36 -41 10 175 -3 41 18 -39 119 -56 71 155 136 156 -127 68 148 -39 287 349 200 61 53
4161 53 -314 109 -18 173 50 -112 202 -56 85 -276 180 76 -116 -121 53 44 -23 45 12 -42 -107 23 -93
4184 -93 -85 -179 166 42 44 -79 -60 -55 28 165 15 -234 15 49 172 144 25 -57 43 92 -43 -190 -171 -18 -23 48
4210 48 22 -4 150 -187 225 125 -17 -42 -274 -32 -8 72 -38 72 83 27 -60 72 -103 -79 -123 -16 -120 -127
4234 -127 -33 -7 -77 -121 113 -176 -114 132 73 -139 -45 16 14 53 -176 90 61 -170 37 150 14 -52 323 -73
4258 -73 36 65 -69 -41 55 22 -129 -79 -319 120 86 21 -14 170 120 -188 38 -61 102 153 -75 148 111 -23
4282 -23 52 -182 102 -1 -21 84 60 69 252 -154 -259 -98 13 -355 -228 44 -54 -41 10 84 10 -97 -36 -42 19
4307 19 -103 -26 -144 17 -222 -59 1 65 56 -267 22 -170 42 111 -91 -142 -65 34 -166 -61 177 56 40 -85
4331 -85 -147 -59 -65 -180 -82 132 -7 2 199 -163 125 53 -6 -144 356 -252 73 -107 -121 -39 -19 -188 -120 155 142
4356 142 -1 80 -64 -5 -309 -63 -69 57 86 121 -18 -120 -56 35 39 -339 149 -72 -90 1 -296 6 -437 33
4380 33 -58 -77 -6 -44 122 38 202 113 197 103 37 53 242 22 76 7 126 -86 88 -6 -46 -122 -212 -123 -44 -106 69
4407 69 -131 -121 145 423 -32 -22 -142 -180 -20 65 246 179 -48 -195 30 -73 339 84 30 97 44 48 -7 -89
4431 -89 149 -47 142 88 -61 73 62 17 -116 158 92 13 -118 -106 73 35 22 -7 -153 82 -302 -87 15
4454 15 100 -107 -38 -53 -153 -81 -247 -48 17 208 75 -56 58 85 129 220 -12 180 -2 26 -6 -34 38 24 90
4479 90 -101 -26 -89 -20 147 -255 -44 -106 169 -72 -26 47 142 -17 52 305 147 -165 -288 -23 53 -149 111
4502 111 89 76 99 14 69 8 -139 24 -105 116 258 -274 -71 -32 -112 46 -12 4 27 144 330 140 -66 42
4526 42 -13 110 203 24 -156 -74 -91 -111 -115 333 -58 -62 81 -70 -58 -19 -5 -50 -124 113 205 -266 -79 -45 -36 -64 -51
4553 -51 -145 -67 54 163 371 65 231 -58 8 -99 253 -2 -33 198 273 -122 178 -24 -56 -17 136 8 -8
4576 -8 80 49 64 263 -2 -105 82 -152 -61 96 25 -88 228 -130 -9 -152 -291 -267 -19 -100 16 70 -47
4599 -47 102 0 111 -151 55 -89 -121 -103 -125 118 36 -36 121 91 -36 -12 43 52 -134 160 -134 11 -39 19
4623 19 -191 170 34 -261 -29 102 167 -132 -185 110 32 55 -37 -406 10 49 104 -78 -140 -27 49 104 248 201
4647 201 -38 -143 45 138 -20 -98 -16 -88 155 193 286 7 165 56 -114 38 176 152 13 -203 4 188
4669 188 224 -323 -149 195 -178 -196 -108 -230 58 211 94 177 -103 -33 -74 29 270 -85 -2 128 -49 173
4691 173 88 250 -140 -79 67 -146 75 -81 -101 26 -27 -175 73 -167 4 31 6 -98 -74 133 -235 -87
4713 -87 11 -269 -112 29 -85 85 -54 123 -5 138 -64 10 -153 69 -143 46 75 -113 141 210 219 -199
4735 -199 -136 70 -55 -52 117 -138 174 87 97 65 189 -95 -40 11 -40 -27 -168 -8 -31 53 123 -37 90 26 -34
4760 -34 -202 101 -259 -29 145 115 276 -174 124 10 -90 -136 -163 -183 26 -106 -177 -60 35 -3 50 -24 192
4783 192 219 -273 42 113 -142 -15 26 37 30 135 190 -151 -122 -212 4 -64 -17 232 165 282 105 -125 -144 209
4807 209 -201 114 -157 68 -75 15 -164 -139 -161 -335 -101 -90 166 260 -76 -176 143 270 174 -117 27 -74
4829 -74 -77 133 -72 106 -13 68 -23 273 -100 -216 243 107 71 21 -8 145 226 -32 -112 7 -16 -115 -11 97
4853 97 -235 -17 153 65 -32 192 178 -108 126 121 -164 9 267 166 -102 -10 37 -55 -3 -6 -89 -63 -219 -165 278
4878 278 -8 -117 -9 -160 -243 -144 -88 130 -5 -43 -8 47 16 232 74 1 40 -189 -381 -67 161 6 221
4901 221 63 -278 -79 -14 129 -25 -151 -196 -50 -52 -145 37 -179 -27 45 114 198 -107 9 44 125 59 -29 88
4925 88 -211 51 -83 121 4 -3 5 -61 63 -7 107 -87 -112 -59 82 109 105 204 202 56 327 -54 169 95 124 97
4951 97 119 -90 -45 239 173 24 -94 61 66 -61 -23 9 95 -132 -66 -110 -9 -36 -16 -129 -36 90 -41 20 40
4976 40 145 267 98 135 28 231 63 187 76 -199 -77 -35 141 -322 34 -254 -39 -22 -63 146 -5 112
4998 112 -136 -72 127 -161 -50 106 -44 44 -94 -57 36 30 51 133 172 142 -177 86 204 -202 -39 -125 70 260
5022 260 -31 -69 -41 124 -85 -71 34 -202 125 238 21 -5 20 13 -29 -112 139 -148 137 51 16 250 260 64
5046 64 96 -18 -33 -109 7 13 16 1 -73 111 85 -25 110 3 138 -5 82 204 92 -76 -194 -148 31 118 14
5071 14 43 275 246 -91 66 4 108 188 -78 -155 247 -180 100 -82 97 -37 -267 -17 -143 -115 -119 4 96
5094 96 -25 -63 -79 192 109 62 60 -108 135 -100 32 -42 63 -49 101 27 58 -116 0 64 -112 30 150 -23
5118 -23 252 -47 -83 11 -153 -22 38 72 -73 62 -252 -165 325 -102 66 -98 158 -30 -64 19 145 -92 -61
5141 -61 81 80 54 225 -136 -14 55 17 136 202 109 154 1 176 -40 99 224 12 93 -382 2 -146 88
5164 88 -164 152 -68 -269 -36 88 56 -95 -185 82 -210 -155 31 -232 -94 147 87 -6 -46 -108 99 62 -121
5187 -121 134 -7 12 -36 -7 114 -78 100 -263 134 -25 -36 29 41 32 87 187 218 -101 166 76 -96 -69 213
5211 213 76 7 -16 117 39 93 -33 80 -158 84 -193 69 72 99 88 -98 291 -80 117 75 -13 21 153 -93
5235 -93 -114 -133 280 -34 208 -134 106 244 12 208 311 -54 11 44 -220 116 -127 38 -89 -316 35 -23
5257 -23 -96 -11 153 40 20 -39 -34 275 -20 219 38 -2 -150 -87 -31 -8 79 -135 8 111 -203 -99 202 -134
5281 -134 -124 4 -293 34 156 -20 -200 148 209 151 19 -227 100 -20 163 -75 25 -10 93 365 -78
5302 -78 -14 -107 50 69 -128 184 -98 35 34 116 -53 228 91 -65 -298 -313 -154 -80 -80 170 -103 97 113 -86
5326 -86 30 151 124 -39 210 -7 25 -9 -40 60 -179 -43 50 -144 -103 -87 144 -304 116 -8 208 -17 52
5349 52 146 -74 -221 108 -96 -102 -136 -86 181 -72 253 -92 115 6 29 101 -54 -52 -269 -48 -47 -120 375 94
5373 94 -154 -118 180 46 -133 43 -330 66 -28 -15 302 5 137 186 73 -73 -86 -4 -54 -207 -213 120 21 -284
5397 -284 -180 311 75 40 5 -73 -92 -53 -130 178 -63 -86 305 49 -36 4 -100 22 -152 226 -57 -212 245
5420 245 -50 71 -49 210 -34 -96 203 -124 -203 263 109 83 172 77 56 -189 -129 -64 -22 116 28 81 -4 316
5444 316 197 39 108 -155 165 -36 106 148 17 24 -100 24 40 -106 89 -96 45 32 66 -104 5 16 179
5467 179 -110 304 92 -234 -23 249 144 72 11 -288 -30 -97 -273 104 21 -13 -121 47 46 -86 -47 -13 -16 166
5491 166 -16 82 159 -14 -39 146 25 -128 -183 35 -59 -98 -30 203 139 10 104 53 56 70 -111 -83 189 -87 -100
5516 -100 210 69 -174 -23 -95 113 -50 116 -19 7 199 -21 -281 -75 38 234 -42 51 236 88 18
5537 18 71 72 44 16 -67 43 -44 114 71 115 -59 10 -296 23 -67 -177 -66 32 118 120 -99 13 -6 -44 115 -28
5563 -28 156 -98 -13 201 10 70 -266 -142 54 11 233 -149 -27 -48 -175 -99 -82 40 17 293 93 111 -83
5586 -83 202 255 8 46 -151 128 61 194 151 -4 33 -145 36 -72 56 34 -424 -11 -97 -5 -3 -29 -26 -128 188
5611 188 183 33 202 -65 3 -150 -109 157 -13 -125 -122 190 -116 128 128 -74 77 138 165 12 17 -106 -308 -161
5635 -161 -225 193 167 -4 379 105 -75 -34 107 67 -108 0 -10 -143 -41 -34 -41 32 332 -166 -18 15 -34 -14
5659 -14 -71 355 -14 57 -43 151 59 89 83 -48 -39 -79 106 6 -202 -121 10 -31 7 -184 -63 -14 -161 -178 -186 -187
5685 -187 -65 -115 -42 -14 187 36 -7 -45 136 3 -46 185 -41 -45 -54 137 67 31 -173 -75 72 -5 -170 90 -113
5710 -113 219 -110 123 -179 -106 -78 -208 -135 -5 122 -9 -13 105 19 -53 -249 -60 -25 -143 75 -86 149 -70
5733 -70 -128 25 -131 36 46 -31 113 137 76 -105 -153 -153 42 3 129 -220 49 -18 285 5 -48 118 49 -20 -211
5758 -211 99 54 91 262 -212 -210 -268 -2 10 166 89 4 -50 126 -51 -26 -141 -230 -54 4 101 -59 -115 242 33
5783 33 110 -149 -21 19 34 -10 -9 -269 371 159 151 -2 -185 56 -25 -30 -22 -73 -45 -17 73 24 -35 24 -229 -80 65
5810 65 37 -57 -187 -59 14 -133 -79 120 125 212 -12 129 -84 204 -70 -390 41 -24 156 -50 -241 122 -48
5833 -48 -21 28 -126 146 185 -62 202 -66 91 33 96 -187 99 -17 68 129 81 69 -179 138 173 106 -38 142
5857 142 -167 68 -185 94 97 -196 109 -195 -67 -45 -73 -40 -34 -146 -78 -166 -173 -3 -217 -74 227 -24 -51 -87
5881 -87 73 97 -188 -7 170 -30 -22 -155 100 136 106 227 425 117 -232 -68 -171 -37 22 -104 78 -124
5903 -124 -141 -246 -216 -31 -16 -1 -76 -35 -71 -151 18 106 2 234 14 84 113 19 150 82 51 8 51 250 123
5928 123 55 3 13 -42 40 67 -223 397 -140 80 17 106 16 153 -3 -238 25 -100 -106 18 9 -66 119 119 224
5953 224 19 -139 35 96 121 -190 256 -10 61 23 -202 -177 27 -138 -102 -81 -18 -258 -126 128 -44 -49 -17 -65
5977 -65 64 199 152 18 -60 161 87 56 -96 -160 49 28 14 -205 -73 24 71 -54 98 -6 -52 185 271 17
6001 17 -133 -93 234 192 -83 -125 -30 -385 -22 -208 46 54 314 7 95 -88 2 -93 -13 -107 50 5 -144 -161 148
6026 148 -24 -224 -51 52 22 -64 71 -29 -53 184 156 89 73 65 -102 -35 -143 41 245 -185 42 -254 -188
6049 -188 28 208 -263 135 -77 17 141 -59 -185 35 60 39 -1 -238 55 -21 10 18 284 127 -64 29 47
6072 47 148 126 -65 -334 -15 -78 29 -13 133 29 28 123 -46 -34 -191 108 -152 91 23 -30 -233 72 97 85
6096 85 -32 -48 -97 28 -159 -43 -71 63 -167 126 219 97 87 166 -16 166 -94 -180 -99 -107 151 165 -56 8
6120 8 -272 -59 77 -34 69 -44 335 120 126 41 185 36 0 -10 -147 -39 -74 -20 133 47 -116 -60 20 4
6144 4 185 56 28 51 -186 31 301 338 -9 63 168 -164 -101 75 -18 21 62 91 131 100 117 -56 69 -96 -67
6169 -67 -45 -45 164 -62 -19 -10 -162 65 86 78 104 -228 -250 -57 174 -139 -79 135 45 103 -181 -106 -15 29 40 223
6195 223 -8 55 -187 139 127 -11 -9 -110 -195 -101 -20 130 49 33 -150 -117 37 -15 141 99 88 -43 226 -7
6219 -7 55 -87 -181 -36 104 -190 -202 -1 133 9 -255 0 50 -231 -8 -37 -5 -53 -20 152 5 -17 96 184
6243 184 44 227 167 100 -70 -76 -36 -138 56 -89 -136 91 -150 -110 167 177 -149 71 119 -1 -30 -157 -4
6266 -4 -170 5 41 179 -301 39 323 -246 64 -203 31 93 312 -298 -147 55 -117 186 -278 123 -87
6287 -87 34 -72 87 79 -77 -18 12 -6 -62 -120 177 77 -172 178 36 -43 11 -146 39 -118 138 -15 -149
6310 -149 -126 -49 -31 -177 58 159 -15 -27 -194 -5 179 205 -94 -62 -41 -62 -73 0 -11 -151 -176 59 -34 20 124
6335 124 -76 208 -167 -146 113 132 128 6 -145 36 -21 87 -33 56 128 -101 -70 -7 -115 -70 42 159 78 304
6359 304 -107 -56 108 -45 216 145 13 96 84 -3 -204 -69 -248 40 20 17 95 -68 -70 14 189 22 -137 214
6383 214 130 26 118 204 -84 46 108 -56 120 -139 94 60 83 -28 16 147 113 117 55 56 200 -157 179 12
6407 12 -90 180 57 108 -49 -39 -63 -75 -76 0 87 248 -1 19 -108 -356 -297 -186 -31 103 -271 125 -11 -109
6431 -109 -181 -226 -126 199 -126 19 8 -68 70 272 148 -141 -87 -128 -210 38 162 227 200 -55 -127 -34 -85 203
6455 203 57 -119 219 -395 104 -40 221 -6 -43 -108 -39 38 -17 -159 103 125 41 -74 -22 20 108 165 129 -161
6479 -161 12 -27 -30 -102 41 -169 -48 -54 103 101 -81 112 34 -65 217 129 189 -122 165 -106 -109 -151 -54 -125 26 43
6505 43 -180 -32 -284 10 189 29 -5 -6 132 -71 -182 -140 268 -95 -168 -249 166 80 -8 140 11 -201 -39
6528 -39 -24 -62 -58 -61 -24 -199 -134 -207 -193 32 -68 4 -170 -173 -164 37 301 -101 -270 -136 2 179 62 -93 -107 194
6554 194 14 184 20 77 79 142 -189 -111 23 -149 61 -177 -210 31 233 125 -129 -212 -1 -10 -243 235 135
6577 135 112 -86 -28 38 21 -97 -124 116 -204 -153 -149 -76 -62 42 -3 367 133 -189 79 -199 -39 30 -242 8
6601 8 47 -98 -174 158 55 -31 5 171 -34 88 -76 -107 -52 47 -91 -18 88 228 50 -81 -282 18 58 -290
6625 -290 47 -88 -187 -120 -160 95 -112 90 -67 30 71 -56 276 238 94 249 182 21 -207 64 -7 -15 -415
6648 -415 -195 52 249 -43 41 232 -51 44 201 -22 198 97 -172 124 -280 -20 -102 -77 -20 55 -100 39
6670 39 -5 -49 268 -52 -170 65 70 -208 160 209 -14 90 72 -80 8 -36 -212 -23 138 388 84 313 -122
6693 -122 129 -130 -9 -143 78 -7 166 -169 90 75 109 9 -47 364 139 -81 -91 -12 69 -5 -51 -101 -103 -51
6717 -51 275 -133 -105 -122 -240 -55 -79 6 101 127 19 381 99 -77 25 -47 30 12 -103 -56 -45 122 167 -236
6741 -236 -58 -164 44 113 -1 -65 152 -57 106 102 -86 135 127 -132 -48 -69 22 188 196 -9 -129 -75 -54 142
6765 142 266 116 147 76 -87 260 53 43 259 82 1 17 11 62 66 40 106 135 21 -56 112 -175 -163 -44 27
6790 27 -76 56 55 100 26 37 51 -200 142 -114 -38 -102 34 11 91 -46 -64 -17 60 132 -108 -174 -61 -70 140 -142
6816 -142 248 92 226 81 -229 111 -266 -63 -19 -283 -51 -54 -38 -12 14 -143 -20 -103 -6 -142 4 269 -115
6839 -115 120 -59 -19 -112 107 5 60 -86 -77 -176 -12 149 191 -125 -73 -105 -144 41 30 -19 -51 38 138 205 -79
6864 -79 118 -32 63 98 215 -218 -73 99 -34 19 -25 68 136 33 13 -3 9 -140 88 -216 40 90 1 86
6888 86 93 -24 119 123 -18 -118 68 195 132 -87 69 -49 296 -123 -172 123 24 34 71 96 42 61 101 -107 58
6913 58 -164 51 282 -230 -38 181 -120 85 241 -29 30 -89 15 -1 40 -180 -29 -362 -118 445 -160
6934 -160 -176 173 246 42 93 219 -10 16 261 -62 54 -7 -38 82 -204 191 11 111 -182 42 194 -144
6956 -144 128 266 229 128 -74 -48 114 -121 -85 -102 -15 -98 162 267 -46 -77 -91 34 200 -114 81 130 48
6979 48 68 85 -308 145 -157 65 9 150 -24 -1 -122 23 99 -60 255 104 -231 -82 61 -60 -310 203
7001 203 -97 -30 -210 -347 -61 -45 54 75 257 143 206 46 67 -52 -31 -20 46 -89 131 34 -44 -125 158 -87
7025 -87 49 -234 -104 229 -15 -126 73 26 169 11 -33 7 -205 -103 20 162 -69 -254 123 115 -12 -76
7047 -76 47 120 -132 29 -120 116 -19 46 -14 219 -40 76 29 121 -134 -11 112 -140 162 52 -118 -149
7069 -149 131 -66 191 -88 23 79 -10 -48 -146 102 216 93 -154 -275 258 -63 -105 -127 -215 -38 116 -187
7091 -187 206 18 145 147 132 134 -13 -24 115 -45 -104 -4 192 -120 -248 20 -126 -116 -113 -224 -101 -107 -94 -92 -126
7116 -126 -108 286 -53 -20 -26 315 -65 213 92 -88 168 -11 -23 121 -32 -24 -121 29 97 -23 193 -131 108
7139 108 -125 -79 59 153 -19 -250 -102 -106 34 126 -85 -25 -75 86 -227 -31 -113 -56 268 -15 -189 111 46
7162 46 -180 -7 158 115 -16 1 -141 109 124 1 -167 -276 -13 -67 77 -207 -74 -121 -85 166 -179 -110 109
7185 109 -9 98 -48 296 227 -38 36 -64 -3 -250 16 -4 296 96 -105 65 38 20 -247 -111 -106 2 51
7208 51 -24 48 132 115 -26 -117 -253 433 -288 119 220 41 10 -101 -215 -54 -23 77 -58 100 -43 -201 -7
7231 -7 98 -11 -207 251 -39 -109 -163 47 230 92 93 172 81 -92 -182 -38 350 39 95 162 -82 -243 299 262
7255 262 -50 84 -88 70 -40 188 -33 -13 -34 -62 -63 -158 28 13 -120 -71 -49 -188 -142 -105 -8 23 -86 240
7279 240 26 -202 -148 -92 -162 90 -131 32 -44 142 -33 -15 228 -196 -113 -58 231 -33 -43 153 -10 94 100
7302 100 104 81 3 -103 19 35 172 -17 9 95 7 380 56 -242 50 127 -311 88 -11 -70 -49 -265 252 -56
7326 -56 -22 -172 15 30 -57 70 73 49 75 -38 67 50 -49 -18 84 -34 3 81 19 -61 -81 109 -78 -128 -221 254
7352 254 127 -9 -41 82 -87 -82 -40 -78 20 38 -100 -95 194 83 -22 220 124 -180 172 -118 93 146 -130 68
7376 68 -65 462 37 51 -18 67 15 79 -81 -10 -9 42 181 280 -92 -187 -97 -155 46 -37 86 -117 13 42 56 91
7402 91 -114 -94 -85 3 97 111 -26 15 98 86 -63 -36 247 71 -45 -6 -135 -144 213 347 180 5 183 -50 388
7427 388 189 -70 -7 90 218 -96 -192 -11 203 124 197 -45 -94 -67 -321 -36 274 -105 -74 -159 203 36 303
7450 303 63 -131 270 -192 155 -104 62 -89 63 -11 -148 63 91 -131 -23 -22 106 -251 -115 203 184 -14
7472 -14 -1 -175 110 -70 81 -65 46 138 -156 123 47 79 -137 22 -15 -382 -76 317 55 -90 -1 -41 50
7495 50 -178 24 120 12 40 23 79 -5 18 -164 -102 13 64 31 60 237 -143 148 -81 52 219 251 202 129 -35
7520 -35 39 5 34 180 178 194 -39 55 279 126 -171 114 -104 -30 -216 4 239 169 15 67 56 123 0 -53 113
7545 113 -87 13 51 -59 -90 -97 13 35 41 -64 -141 -38 -194 45 -11 37 2 -34 44 -5 179 -156 -195 38 115
7570 115 381 156 87 -16 -70 -7 175 63 -42 -177 -45 56 -38 -29 -117 9 84 -87 12 118 16 10 235 332
7594 332 -81 -36 120 70 -26 -437 -91 -41 159 131 -12 -140 132 106 -76 35 -84 -110 67 25 39 -59 -141 -24
7618 -24 -120 32 11 173 21 -39 117 -197 -52 12 -77 272 181 308 220 231 39 1 -23 132 55 -129 -14 119
7642 119 -112 215 48 305 15 26 -91 -179 -30 -92 -24 115 -126 141 37 -36 -26 58 11 133 -62 -56 236
7665 236 68 114 -166 -105 21 114 -29 -59 91 -147 -226 -101 -98 -64 91 -216 -271 -96 -149 18 94 -63 55 -186
7689 -186 119 -130 46 374 27 -85 -140 -95 151 -136 -86 -4 -125 34 -130 39 32 -144 80 135 -172 176
7711 176 -80 127 173 -20 -105 31 -43 30 1 216 186 2 -44 45 -118 -25 63 -243 101 91 -23 333 260 94
7735 94 -89 -58 -284 -173 66 87 92 128 185 87 -100 99 -111 48 231 -145 242 351 -45 231 -70 24 -200
7758 -200 155 312 -69 -98 -17 44 19 88 436 -213 160 36 126 211 -173 97 -87 159 65 -180 -158 139 153
7781 153 -239 -18 -77 -9 -160 -110 62 44 84 -38 -82 104 -193 -218 -10 -63 -112 252 29 -47 -110 -60 7 -74 -44
7806 -44 -77 177 -59 58 -12 -9 -181 151 245 -89 -148 -53 15 -61 47 -110 -223 -148 19 -236 -169 -55 -131 45
7830 45 -184 -133 -89 121 216 78 -137 -108 112 54 66 42 120 271 129 291 91 56 -102 -24 94 -27 188 132
7854 132 -49 143 43 19 103 17 -63 157 214 46 -100 -232 -40 -356 -76 208 -14 -95 -21 141 -105 -147 364
7877 364 -203 -153 -8 -153 -11 315 56 -203 -62 -273 124 -151 128 30 -2 9 -31 -240 66 -87 -207 -86
7899 -86 230 -65 -176 -35 24 -172 38 50 87 -143 37 -75 31 -278 -114 56 -195 -46 -167 122 -320
7920 -320 61 -14 -7 127 -54 220 -128 244 -81 42 44 187 82 -14 123 -127 49 230 134 -32 144 5
7942 5 257 -99 -46 -104 -62 -41 -47 -11 -49 167 122 -305 6 206 -36 195 90 -85 -62 58 46 60 5 244 33
7967 33 -212 -359 47 207 68 -132 364 -3 -169 156 365 -196 194 133 -78 -21 -217 -95 27 -123 -140
7988 -140 74 -95 113 -107 -95 -155 -128 -74 -111 351 161 -51 126 3 -211 117 83 -122 125 292 -117 -21
8010 -21 66 32 -25 -79 -10 -200 -271 -117 -296 243 -173 -119 -84 -81 102 -33 -180 103 239 63 61 -236 170 -126
8034 -126 162 56 -5 84 -266 52 -11 41 -216 -9 117 -43 -202 256 86 26 -12 130 70 -56 2 57 -171
8057 -171 -51 -55 78 194 -3 -79 120 -67 134 -173 55 31 -90 8 -157 2 -62 42 -173 321 -36 53
8079 53 -39 105 15 24 111 150 176 -104 99 -70 64 -41 59 45 -135 -192 5 83 -45 32 39 250 135 86 90 -49
8105 -49 72 -67 0 -155 49 -18 63 -97 32 -88 41 -239 -3 -93 -11 128 15 307 168 -17 32 -47 -232
8128 -232 34 -30 -71 230 158 -258 -47 42 18 51 43 24 226 -21 103 209 -80 -15 52 185 170 -414 55 101
8152 101 175 -139 -144 -5 -36 69 -108 148 29 122 -184 9 150 -122 -222 108 133 -85 49 53 36 13 232
8175 232 -49 -62 65 26 0 -195 -191 220 -117 47 -482 35 6 148 -13 -176
8191a76
$$ Imaginary data points
##PAGE= N=2
##DATA TABLE= (X++(I..I)), XYDATA
0 0 0 0 0 0 0 0 0 0 0 0 0 -8 8 -8 8 -16 16 -21 24 -32 32 -40 48 -57 71 -80 96 -108 125 -144 163 -186 212
33 212 -239 271 -305 342 -385 429 -479 532 -592 657 -727 805 -888 981 -1081 1191 -1312
50 -1312 1445 -1595 1757 -1937 2142 -2371 2632 -2932 3281 -3692 4185 -4790 5554 -6551 7913
65 7913 -9896 13062 -18940 33582 -153641 -170760 65902 -23011 33617 60908 -53201 -106574
77 -106574 -17372 -4361 87192 160330 29720 -85898 -1062 22611 39140 153731 143973 -8520
89 -8520 -39753 -43019 -78880 -11303 55715 -4598 -35875 -62841 -136400 -68288 75741 30348
101 30348 -46048 -7795 -43495 -114026 -28925 62672 64767 80852 51628 -31529 1317 74511
113 74511 53700 51990 68084 -11022 -63367 -18678 -3267 8552 53591 11529 -70086 -68080
125 -68080 -60384 -60653 2869 20112 -42499 -37429 -6126 -31294 5846 85637 59996 10715 18584
138 18584 -4861 -17804 46088 66974 26970 26850 14708 -33103 -17877 20800 1793 -12223
150 -12223 -15910 -58569 -67837 -22914 -5691 -1530 16957 -5210 -35391 -16386 -754 2357 33458
163 33458 37927 2178 2408 21942 19609 37505 56931 25740 -5794 -8650 -21971 -21557 6555
176 6555 5858 -15907 -19415 -29472 -39074 -15384 1928 -9238 -12740 -17012 -30062 -13186 16569
189 16569 23690 30502 34748 12631 3088 18688 20639 17876 24619 9320 -13031 -9206 -3545 -4894
203 -4894 6100 3181 -21907 -29339 -26737 -31926 -19186 -460 -6517 -11800 -4013 -5519 -43 20741
217 20741 23447 12631 14095 8077 -1122 12828 26626 20629 17005 12673 -4075 -9629 -2617 -5532
231 -5532 -9113 -9382 -21139 -27895 -19050 -12776 -8057 1118 -2827 -13049 -9731 -4189 -344 12249 18999
246 18999 11810 12268 15307 11004 15918 24331 14716 2320 263 -5920 -10196 -1954 930 -4901 -7701
261 -7701 -12152 -18805 -15909 -10710 -11698 -10189 -8979 -11451 -6202 4262 9265 14841 17815 10203 5523
276 5523 8120 6767 6521 13787 11560 2154 3687 5439 -1285 -1365 1511 -8675 -17893 -16948 -17363 -16291
292 -16291 -6658 -1357 -3372 -2150 165 -94 1557 5222 5469 2789 1569 3187 7021 10911 13808
307 13808 14641 10744 2701 -991 -2827 -6485 -8001 -5536 -7647 -10281 -6722 -2482 -2403 -1330 -360 -4993
323 -4993 -9093 -7831 -4698 -1729 3134 8534 9706 8314 9937 10874 8429 5674 4288 -802 -5436
338 -5436 -4322 -1076 -1321 97 2106 -1374 -6298 -6368 -5528 -7823 -7091 -4143 -4289 -3591 1603 7245 8384
355 8384 8741 9035 5152 290 699 2004 282 1263 3370 2286 665 2669 2009 -1389 -2542 -4463
371 -4463 -9126 -9898 -6231 -2936 -1458 1317 2987 2562 1878 1298 1912 1783 657 1029 2530 2397 4378
388 4378 8176 8029 4763 3188 310 -4123 -4680 -4647 -6839 -5831 -3101 -4024 -3883 236 960 -1852 -1973
405 -1973 -1844 -3299 -3077 -113 3025 5237 6372 7174 7611 6142 3311 2630 1006 -3175 -3659 -2983 -3467
422 -3467 -1357 1281 -442 -763 -225 -4455 -6960 -3990 -4416 -6558 -2986 -278 -876 2627 5674 3834
438 3834 4074 4573 -160 -751 1875 -309 -176 4780 3243 649 4163 3663 -1390 -833 -1827 -7131 -6341
455 -6341 -4433 -6196 -3111 2001 -840 -753 3046 -90 -1990 1378 -113 -2731 1512 2393 670 5198
471 5198 6210 2181 3730 3794 -2991 -2329 991 -3740 -3884 1649 -75 -2312 2211 1101 -2434 691
487 691 -842 -5457 -1872 245 -3126 261 3388 -35 1513 4445 -900 -655 3514 -1167 -3283 2764
503 2764 607 -1339 5236 3708 -2659 2247 3037 -5400 -3171 2026 -3454 -3487 3346 -310 -2035 4383
519 4383 1271 -3993 1074 210 -5185 -1273 1492 -1739 2107 4004 -638 1296 3865 -2460 -2731 1771
535 1771 -2354 -3122 3036 403 -1339 5931 3722 -3074 1061 2193 -4665 -2729 758 -3713 -1229
550 -1229 4015 -280 -1127 4657 1352 -3058 -612 -2015 -3826 -298 -978 -2037 3869 4211 -444 2651
566 2651 3626 -2824 -1187 1189 -4908 -2387 4487 -773 -2072 6068 2770 -2932 2458 724 -5811
581 -5811 -1068 1131 -5424 -1697 5219 291 -699 3586 641 -1163 1048 -2943 -4021 1391 -361
596 -361 -2737 3541 3774 -813 2476 2473 -3600 -960 1429 -4587 -2631 3028 -393 -458 5443 1712 -2041
613 -2041 3356 545 -5552 -908 1618 -3134 -768 2959 535 1724 3255 -1570 -1746 851 -4031
628 -4031 -4329 989 -938 -2265 3553 2450 -1184 2950 1858 -3389 -487 883 -3448 -48 4183
643 4183 -372 989 6226 1707 -1502 2428 -519 -4985 -1483 -1271 -3972 -215 1452 -1144 1409
658 1409 2250 -2552 -1630 470 -3935 -3623 1365 -158 -403 4554 4002 1286 4208 2544 -1955 267
674 267 285 -4118 -792 2523 -939 62 3688 88 -1908 149 -2429 -4557 -2387 -2887 -3940 -49
690 -49 1265 -386 2832 3476 -240 592 2139 -881 -712 1374 523 669 3541 2529 1771 3316 1007
707 1007 -1857 -554 -1869 -4538 -2292 -873 -2823 -1007 802 -814 -445 905 -1392 -1783 410 -1027
723 -1027 -1310 2680 2635 1044 3559 3309 783 1373 1741 -1272 -668 123 -1577 -732 1219 -227 -1127 372
741 372 -901 -2607 -1379 -1402 -2612 -660 -281 -796 927 1821 693 1273 1909 -454 -93 1358 15
758 15 -390 1934 1613 566 1204 755 -961 -930 -1130 -2497 -2137 -1259 -1293 -717 603 710 436 651 253 -156
778 -156 52 -420 -83 803 558 1016 1983 1618 145 509 -125 -1841 -1739 -1061 -1638 -1365 -41 -220 45
797 45 800 614 -490 149 -70 -992 -701 344 919 1327 1667 1933 1973 1104 406 260 -523 -1496 -1301 -759
817 -759 -1255 -900 82 -149 -950 -572 -698 -1543 -1648 -804 -834 -130 1294 1380 1590 2270 2353 1240 996 988 687
838 687 -115 383 373 152 -173 11 -384 -1337 -1508 -1195 -2178 -2347 -1771 -1314 -1061 -267 709 348 708 1282 874
859 874 633 1074 1207 1020 1220 1945 1667 1610 1054 937 -218 -1255 -1350 -1638 -1880 -1490 -957 -984 -1008 -663 -708
880 -708 -1127 -826 -712 -837 -468 307 998 1627 2156 2741 1976 1582 1391 1150 -62 -328 19 1 -547 16
900 16 121 -274 -627 -459 -1316 -2138 -2021 -1970 -1968 -750 -152 340 1226 1763 1344 1149 1069 604 0 316 222 458
922 458 998 1025 1179 1126 313 -674 -775 -1614 -2114 -1916 -1628 -1336 -671 293 438 615 779 534 289 58 -386
943 -386 -140 272 479 855 1272 1491 1186 987 266 -292 -950 -1091 -1581 -800 -961 -621 348 718 198 51
963 51 196 -326 -516 -283 -85 301 592 980 1119 1524 1016 197 147 77 -1025 -1191 -679 -743 -643 -50 -170
984 -170 -196 -11 -620 -658 -394 -611 -487 42 267 648 1050 1603 1528 1217 770 376 -120 -139 -453 -10 153 -323
1006 -323 -112 101 -529 -764 -1193 -1723 -1649 -1083 -761 -807 -24 654 791 1317 1485 190 762 990 -218 98
1026 98 1010 1002 746 1126 656 352 263 -547 -1596 -1201 -1368 -2351 -1238 -414 -1175 -75 371 -678 -399 529
1046 529 -285 -903 313 247 355 1579 2104 1043 1585 2068 156 -92 256 -417 -1160 -470 -523 -590 -73 -400
1066 -400 -638 -229 -710 -1481 -863 -895 -1337 143 493 -166 1068 1906 558 688 1112 -100 -401 650 -7
1085 -7 -964 688 532 -324 385 682 -932 -861 -241 -1247 -1121 -277 -698 -330 608 245 105 631 376 -222
1105 -222 212 124 -717 480 993 3 500 1066 -470 -364 212 -1037 -1088 -489 -450 -754 575 552 -221 324
1125 324 340 -447 -90 -14 -392 -380 791 504 394 1019 391 15 358 -322 -1093 -307 -713 -1180 118 288
1145 288 -302 254 779 -835 -436 196 -810 -653 398 263 24 1368 1346 718 1105 566 -237 -7 -377
1164 -377 -896 -316 239 -203 -53 260 -371 -596 -295 -990 -1551 -662 -940 -862 418 619 494 1111 1585 401
1184 401 820 562 -378 32 500 -13 310 937 548 40 166 -319 -976 -952 -825 -1471 -1123 -580 -470 -31
1204 -31 555 26 288 580 -231 -362 104 -49 -118 626 841 857 918 1077 494 300 26 -445 -595 -357 -436 -55
1226 -55 5 -265 -413 -157 -564 -663 -575 -554 -818 120 162 425 657 949 348 235 717 27 -87 -31 -315 91
1248 91 410 180 574 289 86 -448 -402 -943 -1028 -377 -624 -506 121 568 243 494 495 29 -174 -133 -448 -275
1270 -275 132 282 189 569 852 295 118 -24 -634 -490 -613 -534 -333 -150 184 404 668 385 146 -154 -285
1291 -285 -368 -31 -375 -118 362 436 335 520 158 -99 -412 -318 -736 -915 -315 -189 -174 -87 380 230 410 278
1313 278 88 -184 -75 -325 180 276 244 667 493 265 424 76 -288 -202 -338 -621 -503 -202 21 -470 1
1334 1 61 -363 -512 215 -336 -72 21 291 288 192 621 858 389 460 188 223 181 21 -13 118 159 -279 -281 -220 -296
1359 -296 -532 -544 -758 -422 -470 -489 -272 233 98 493 226 192 234 161 174 110 352 538 471 564 727 471 136
1382 136 -29 -598 -330 -313 -112 -325 -406 -94 75 30 -345 -323 -78 -301 -319 64 38 212 117 641 431 569
1404 569 287 273 -41 -291 -397 104 28 -73 282 161 363 27 -258 -63 -101 -560 -283 -176 2 106 183
1425 183 308 382 68 -94 165 -148 -360 26 -218 -106 -22 -46 151 184 146 -70 -150 -211 -178 -147 -76 -67 171 -42
1449 -42 215 144 171 62 -161 -151 -461 -297 -122 -12 -202 13 151 -259 -28 -93 -117 -51 -510 -264 1 198
1471 198 482 -12 425 234 -62 -61 63 66 174 221 296 254 379 137 -176 -245 -240 -437 -671 -235 -295 -415 295 -119
1495 -119 -128 26 -20 -211 -102 -169 -138 122 18 186 561 590 498 468 533 403 -89 -358 23 -243 277 -227 -87
1518 -87 354 35 -209 -285 -304 -520 -475 -191 -322 197 101 163 406 265 329 94 114 -3 -138 -62 50 45 110 128
1542 128 174 363 193 -14 -103 -335 -590 -481 -10 -381 -136 461 79 12 144 96 -24 -39 -107 -45 -60 326 52
1565 52 244 400 243 -127 -44 -204 -146 -232 -204 -52 -156 219 235 317 71 75 20 -51 -318 5 -144 -68 27 476
1589 476 517 34 193 -2 -254 -179 -105 -297 14 -226 -141 -97 310 -46 12 85 -93 -38 143 198 126 450 352 14
1613 14 -170 97 -69 52 -247 -477 -228 -113 -218 24 -115 -70 -302 -110 -187 -488 75 -302 -148 13 440
1634 440 339 565 701 332 -30 277 121 160 10 101 113 77 194 -148 47 -43 -302 -321 -198 -322 -495 -14
1656 -14 -181 64 -100 47 68 354 87 -2 75 84 248 286 511 145 488 503 398 190 -189 -477 -249 -53 -105
1679 -105 -175 -202 -252 -105 209 -52 -395 -52 -236 -320 124 -111 -44 295 400 46 255 301 232 161 62 -98 214
1702 214 125 -88 261 41 -10 -222 -98 -128 -514 -175 74 -335 -5 61 -150 296 3 94 -67 57 -157 -42
1724 -42 164 48 119 385 330 178 106 -56 -272 -73 -240 -75 89 -66 5 181 72 44 151 -365 -10 -17 -11
1747 -11 265 82 105 178 -76 -8 139 -200 -150 -483 -41 -304 -262 38 20 358 41 -117 -95 -247 -83 146 63
1770 63 -43 -108 338 329 387 211 300 84 13 -165 -396 -334 -381 -272 89 51 -24 -58 -117 -202 -249 -318 5 -278 102
1795 102 77 84 203 -17 193 291 379 93 84 116 -86 -171 -132 65 117 -169 -137 57 -418 -98 -370 -390 -88 -190
1819 -190 206 46 11 -146 330 146 -14 -61 29 318 256 199 218 348 82 242 163 165 -155 -54 -165 -133 -268
1842 -268 16 -224 -168 -197 -354 -302 -74 -115 -118 -227 58 63 160 147 13 391 118 -9 27 237 17 87 -67 -16
1866 -16 169 -112 -76 -228 -102 -123 -358 -433 -65 -225 -175 40 243 505 66 94 -176 -164 -242 29 133 232 211
1889 211 122 256 7 60 -84 -105 -13 -158 -251 -502 -19 -246 202 216 92 75 175 45 -31 -127 -45 33 82 -68
1913 -68 -38 225 87 109 -28 -93 -218 -93 -85 -153 -195 -11 129 122 380 224 -95 46 -122 3 -205 -77 -61 166
1937 166 146 107 115 -137 -6 81 -67 -268 -74 -21 -222 -250 83 -26 224 -71 -4 -200 -188 22 -116 -19 131
1960 131 176 196 117 121 290 108 -25 46 110 86 -121 232 31 -96 -178 -176 -179 -279 -419 -5 -302 74 43 0 47
1985 47 218 215 28 -155 -148 174 190 384 2 169 245 75 308 138 -74 -158 -214 -309 -277 -442 -275 -128 -169 -61
2009 -61 -69 -53 -157 -149 -259 40 129 33 69 156 353 252 83 65 -30 68 -99 -101 21 -68 -75 279 41 298 -31 42
2035 42 -101 -67 -229 -135 -231 -68 -56 -56 71 113 157 328 193 148 -15 -44 -87 67 65 191 266 -7 75 58 -175 -141
2061 -141 -343 -186 -361 27 -192 -132 -77 63 183 59 -108 93 -133 128 160 -97 -79 49 427 68 189
2082 189 -45 -70 -187 -216 71 -28 66 132 -53 -67 -10 56 -173 15 117 189 236 -153 125 -68 -54 -231 -208 -164
2106 -164 139 -107 25 27 8 236 8 -43 152 -73 48 -80 234 -48 142 279 253 143 142 177 -252 152 -192
2129 -192 -53 0 -3 -23 -64 155 -76 -51 -160 -201 -65 -12 -27 -31 -79 -29 -74 -30 48 -38 437 -22 122 92 18 -52 -39
2156 -39 20 84 237 261 367 75 53 23 117 -146 -238 -288 128 -43 -7 115 74 -87 -68 26 103 -175 82 281 181
2181 181 -182 218 108 128 321 -9 56 -314 -131 -12 147 6 19 -9 237 88 320 -161 -104 18 45 -113
2203 -113 -72 197 133 348 -127 249 23 41 -49 -61 -27 -8 -20 -19 198 316 69 69 -150 16 187 -5 -132 -89
2227 -89 122 181 -337 -205 -150 75 76 -173 -90 50 64 66 41 105 359 29 148 -225 -130 16 65 100 26 211 42
2252 42 203 284 79 146 -173 93 109 -170 176 -47 -97 -65 66 13 -48 -86 -68 -337 -189 23 79 -92 -27 52
2276 52 30 272 193 -111 160 -185 -7 -96 100 54 55 75 -15 94 72 18 -241 -71 -15 -31 -85 -129 -8 -221 -74
2301 -74 -52 -177 -23 -27 27 277 56 193 21 -123 211 219 234 -87 274 -40 76 -69 8 21 -108 1 -190
2324 -190 71 69 108 -4 -306 5 -85 217 59 1 35 32 -4 -56 216 -83 95 81 255 332 -127 -88 -85 115 241
2349 241 -14 235 -104 38 -107 -26 113 96 -72 150 171 -261 -356 -273 67 -161 136 -52 98 177 156 -314
2371 -314 225 -152 71 -7 -67 280 13 74 19 189 -46 63 156 2 -107 -220 -217 -91 -286 -66 38 81 115
2394 115 -119 177 -90 -13 -131 -113 -84 163 292 129 321 -60 27 82 -26 27 -123 257 -21 -22 -97 -52 -40 -62
2418 -62 45 316 -131 100 -94 -6 1 -132 -56 -150 -102 -101 -79 294 59 -63 -11 73 -103 113 39 229 -40 -249
2442 -249 128 57 159 235 -18 -39 167 111 403 73 -13 27 -8 -128 72 -106 -220 -10 -56 73 74 28 -178 134
2466 134 -100 -14 190 26 -98 -2 52 104 216 -100 -68 29 -250 288 15 167 50 64 -97 -100 -124 -79 -1 -9 -173
2491 -173 -203 14 -61 154 -168 206 -204 -83 62 160 -71 -104 -53 413 45 -85 40 160 16 56 0 33 -26
2514 -26 -260 20 -102 5 -103 13 -98 -146 -175 96 -61 -110 44 -212 -241 91 41 51 66 15 -35 -42 -76 -183
2538 -183 -205 -68 -160 116 85 -242 -90 -78 81 60 8 112 -82 -75 -48 -38 -156 -67 -38 114 285 -40 164 102
2562 102 143 271 103 36 -62 31 -124 28 294 66 173 45 -8 -33 86 -75 213 -74 142 41 135 -122
2584 -122 -244 -242 -128 -30 -26 80 11 -146 -65 108 74 -26 64 -250 -69 -42 124 1 -81 131 50 132 -260 124
2608 124 -292 -207 -2 36 -221 -28 -39 -84 69 311 27 -191 -169 187 39 -24 -89 -29 -11 14 -271 82 35 148
2632 148 198 141 58 122 -92 -129 -38 72 94 -121 -23 -44 30 -31 198 -4 -43 23 -277 30 -106 -37 -32 91 -42
2657 -42 146 8 -74 52 -109 -96 49 97 -259 -90 164 -219 -132 59 153 215 -27 -146 162 -40 260 -41
2679 -41 8 118 -68 -212 75 -48 -156 -80 44 -60 -284 97 196 303 67 -58 93 66 130 25 59 -60
2701 -60 -50 102 -30 217 73 -47 294 87 -447 -32 -208 -195 4 -27 127 -83 -267 127 75 187 107 -63
2723 -63 171 -173 166 -105 2 220 20 118 192 -164 -143 152 199 68 -27 -18 21 -243 162 -53 78 112 -132
2746 -132 -179 82 200 240 -86 133 -120 -50 126 303 95 -175 -154 -175 -56 -118 180 103 110 22 45 173 -96 118
2770 118 -80 -146 -255 -120 -93 -5 -271 391 -128 -166 -122 220 107 41 80 47 -11 286 -79 1 42 147 250 -118
2794 -118 129 214 48 168 -152 -2 -96 5 363 55 -43 142 18 -51 25 25 16 -3 37 -176 53 -18 2 103
2818 103 43 -53 42 -164 -43 -3 -28 -202 -7 -92 -11 4 116 -8 148 -19 -26 -107 45 34 21 -119 132 -95
2842 -95 -4 279 196 -10 -30 -184 0 -88 -72 -265 37 -205 56 230 17 54 10 195 116 -143 3 -41 -79 -20
2866 -20 -181 -41 27 -16 101 36 106 30 -58 -151 -75 -56 -170 -193 -252 60 134 9 125 89 -107 167 -1 -113 104
2891 104 -8 154 -188 -8 344 71 66 47 -121 -11 -47 -204 -165 75 -225 124 218 -168 -135 56 97 45 -73
2914 -73 21 148 -54 -97 22 -7 -19 -46 61 363 19 -150 30 -294 -49 -36 -135 -130 173 -23 95 -156 -54
2937 -54 70 -119 -3 137 44 257 11 267 252 21 -86 -48 55 52 -77 69 1 -105 -35 153 152 123 -65 135
2961 135 258 -143 46 -11 -88 102 268 -65 132 136 134 4 92 -114 -121 -108 34 -168 8 -93 65 119 217 266
2985 266 -34 -31 9 189 -66 -84 8 22 -129 69 -23 93 -170 165 -230 59 -145 4 -307 -101 -61 62 106
3008 106 -22 -12 95 298 121 -49 87 38 -64 229 87 -64 -128 46 79 -110 -58 15 19 -36 65 -149 -247
3031 -247 125 -19 112 5 259 -29 -106 139 230 -362 -21 -190 -134 -51 144 220 -172 41 79 -32 4 56 169
3054 169 -103 -39 183 59 -327 2 46 77 -108 33 -54 -125 9 253 218 -149 -242 -5 40 -103 34 -50 14
3077 14 -106 -62 68 -80 206 -29 18 58 17 46 146 156 -62 -13 -232 -109 57 4 -62 -15 21 59 30 -10 185
3102 185 116 52 -160 -100 -92 -47 -144 1 113 -70 142 -75 35 55 183 109 182 -62 -149 -148 -53 115 -26 25 100
3127 100 42 -178 15 28 211 -76 178 50 -284 -26 -52 -13 -189 96 93 -204 93 106 155 200 25 61 195
3150 195 149 18 15 396 24 -89 103 -18 -21 61 22 -48 -328 -3 -15 88 79 -22 30 95 28 -19 -135 -124 -65 105
3176 105 -95 -108 -20 58 -10 -124 -75 56 42 -143 42 195 -40 93 -90 -71 -112 -111 -75 -90 -7 -84 -77 186 -48
3201 -48 15 33 -42 -1 41 178 7 -108 -244 123 285 -36 -39 27 18 11 152 57 -28 64 -22 381 -46 -37 23 -113 -137
3228 -137 -288 -5 -64 -27 122 36 26 114 42 50 302 -135 -218 27 -160 -128 -52 120 54 -244 172 13 -5 97
3252 97 -31 72 -92 110 36 128 -148 134 18 -74 239 106 -237 -48 -129 -5 -105 -75 274 109 174 -126
3274 -126 81 83 102 240 62 214 -15 351 255 -51 154 63 -66 -86 -61 -189 -138 70 -167 -228 -63 11 -64 68
3298 68 -46 30 120 33 -25 59 -140 -58 -4 -138 -13 128 34 -6 44 33 4 100 -260 -55 142 -85 158 -63 -62
3323 -62 80 22 -133 100 -198 -169 22 40 -32 -98 226 28 21 -91 -16 -69 43 -122 -106 -128 92 110 -124 153
3347 153 -38 -148 147 41 17 -90 -319 51 288 -58 -97 -227 -19 -238 -32 2 17 97 -48 -5 -126 -226
3369 -226 -31 3 -54 133 -150 -56 167 148 43 89 130 -14 -70 203 -10 166 100 111 82 -232 118 16 248
3392 248 56 -35 -125 30 49 -12 97 -142 132 92 248 -181 47 -53 -50 7 -137 108 46 -96 -148 -60 177 -147
3416 -147 -90 106 8 154 -51 12 39 -189 -347 -146 -9 -32 -86 -193 -152 -6 410 92 50 -135 -46 33 66 137
3440 137 -77 100 -25 193 -1 -92 182 253 206 16 94 -219 65 110 20 -214 92 68 -189 -148 -319 -98 -188
3463 -188 38 122 86 42 51 89 30 171 169 -195 116 -63 66 39 -20 -8 -139 32 -85 -23 90 179 138 -17 -36
3488 -36 67 -28 -92 -22 -133 190 -4 110 -143 -97 2 -63 -130 -103 64 121 7 226 82 77 -197 261 -145 74
3512 74 1 122 156 -33 -21 -307 -121 -160 -192 -60 291 -84 47 -262 -19 278 70 -7 -77 -25 14 -67 -44 -30
3536 -30 190 -87 -210 175 119 -71 -12 -32 -105 236 -115 -230 -40 52 261 91 -102 160 -18 102 31 -108
3558 -108 200 -229 -20 -194 -20 189 -57 3 28 155 61 54 -242 -232 51 -138 22 153 -188 36 -2 -4 -94
3581 -94 -52 -66 35 -33 40 -146 -81 96 129 2 -102 211 104 -54 80 129 165 -277 82 -58 162 58 -409
3604 -409 61 -76 -7 5 -188 212 -35 -122 -150 135 -155 -144 136 -18 -53 -60 -249 -140 -115 12 12 101 38 -103
3628 -103 -56 135 44 99 -90 -112 -33 -84 137 -259 289 108 28 45 219 105 -20 163 51 90 -102 -101 -29 5
3652 5 -54 50 127 -58 -224 86 -289 -58 -78 -184 -26 -220 228 86 169 13 135 79 -183 96 143 223 67
3675 67 -63 -39 -172 185 -174 -208 -46 -128 -95 -115 -59 9 188 134 105 58 4 -171 228 -28 208 265 52 -25 130
3700 130 77 -147 45 20 127 -4 -103 -101 82 105 105 -165 -164 -98 -159 16 -44 -133 -102 -172 127 125 -141 -122 239 89
3726 89 -95 239 26 385 26 58 129 -50 -40 58 -281 38 -16 -391 92 52 -113 32 36 34 177 -119 118 -128
3750 -128 -164 -276 -19 -3 -127 -126 25 -95 10 -115 9 183 -146 -130 -16 -156 -175 0 186 234 -115 -18 -69
3773 -69 121 18 -343 -150 82 137 -49 -42 -45 155 -34 -191 -33 -69 23 104 91 -91 137 -140 70 -53 -122 -17
3797 -17 -94 -110 22 166 81 44 22 196 22 91 -111 123 130 74 40 -16 57 -84 24 195 -186 123 88 -25 141
3822 141 110 73 98 -15 -19 70 307 114 168 -151 46 -229 83 191 -7 235 -17 31 11 -27 -237 -118 13
3845 13 -40 54 -120 -158 -203 17 11 167 265 288 71 12 -28 -134 -54 -143 -73 48 66 142 3 36 54 115 -16 -37 177
3872 177 -130 114 43 12 65 -126 -150 -11 -92 -25 -248 11 121 60 -131 -258 132 20 -31 -11 136 173 111 160
3896 160 59 -203 126 96 101 -16 0 101 -265 -251 78 352 -11 11 -115 -113 -77 129 -12 -353 -356 -49 263 130
3920 130 31 37 27 125 -65 -81 142 263 -96 3 129 -124 -139 24 -159 88 225 36 220 -17 -35 -95 55
3943 55 167 54 -76 -177 250 -27 -124 153 96 -25 53 -18 -123 161 225 114 170 52 -19 -24 101 -125 92
3966 92 -11 -25 -9 -83 -2 -69 4 4 51 68 34 36 92 -22 142 -125 -101 28 -98 116 -140 96 -235 -225 -142 16
3992 16 1 272 -122 -108 86 45 -1 -2 180 36 100 84 -187 -56 -88 65 70 4 17 -175 -103 -36 37 100 -141 -26
4018 -26 336 70 68 212 -132 136 -29 -61 340 -95 99 31 -35 -101 -7 132 67 27 -61 -4 -32 119 202 182 18
4043 18 -71 95 -183 -154 147 -90 86 75 -212 -10 -30 -16 53 30 33 -94 -64 -140 42 7 59 68 -17 -143 -204 28
4069 28 -232 -126 -45 117 -302 78 -170 -41 48 40 50 -74 60 155 -44 47 -73 37 134 -45 84 -36 162
4092 162 -67 7 84 104 19 -87 -18 136 63 -41 -153 222 135 -47 -108 -241 3 -69 -87 -185 -154 -116 -131 110 7
4117 7 -57 268 -23 158 -7 -32 -17 -257 68 19 -12 106 -66 217 -169 -168 -84 -40 -151 111 -207 -42 -103 -200
4141 -200 163 -112 -246 -127 -54 -171 -7 37 67 -70 20 20 51 49 182 215 -53 -22 -40 57 -94 -225 112 1
4165 1 -216 55 -132 -144 161 45 -20 29 -136 -60 -139 -32 32 -74 442 -80 174 -139 11 -163 -176 43 -143
4188 -143 -88 146 -214 -14 84 -6 -39 -176 -85 232 90 -72 -93 -31 -127 -62 -9 -126 -83 50 -122 -177 116 67
4212 67 254 -144 -102 -46 -26 51 194 106 -267 168 41 60 105 -15 -253 41 86 35 -120 -28 36 -150 104 -120
4236 -120 -97 105 156 -70 -50 36 -178 76 102 113 32 -205 -47 149 3 103 19 156 17 -189 26 -43 46
4259 46 40 82 -77 -16 113 31 -108 187 -6 -25 -307 88 65 -150 -173 -72 160 -40 -207 253 -76 119 75
4282 75 -31 -60 -204 11 73 -110 -30 187 -3 -27 -168 154 161 -167 -110 9 10 -105 -161 75 2 -192 146 -84
4306 -84 -7 124 -65 183 379 -63 98 -123 -47 -77 -118 162 -22 -43 92 7 62 142 131 -34 -19 -45 -154 -112
4330 -112 -173 45 -258 53 35 -114 -116 33 -41 75 -227 -22 118 115 -214 -3 -92 -98 -83 -49 -89 74 98 -261 231
4355 231 68 208 101 -199 -228 -98 52 -44 -180 124 196 -35 22 -95 63 -20 137 -152 -135 47 -185 225
4377 225 249 -83 23 127 -99 90 86 46 -80 83 -102 113 -64 -157 -14 -152 136 38 97 -9 -171 -137 -138
4400 -138 134 -31 -227 189 5 -72 47 101 -21 150 81 -153 -105 83 134 123 -104 -14 206 239 88 -31 -192
4423 -192 -13 120 9 145 -80 -52 13 -246 -29 199 238 -88 5 89 -112 34 -60 -42 -87 -182 90 25 316
4446 316 75 156 -84 44 -272 -35 202 -27 -5 176 152 45 -55 264 -57 -234 215 21 -34 -275 22
4467 22 -78 33 105 141 -153 173 -14 -94 118 -67 29 -35 48 -111 -93 10 101 16 -87 227 197 -85 -1 71
4491 71 114 43 155 -30 -201 -101 -227 -81 136 -32 -15 67 145 -84 3 17 174 226 -15 208 -25 -222 -140
4514 -140 -242 327 151 -26 -51 164 -236 -205 -93 129 75 -149 224 50 72 -113 -35 338 -101 44 -16 -137
4536 -137 -62 -137 82 261 -173 -2 38 -40 135 -37 152 111 334 -49 -92 -77 -47 -34 -14 -194 -25 -32 -36 91 -82
4561 -82 11 -5 -22 -11 -186 192 368 171 -174 212 32 201 141 6 100 143 85 112 -117 20 -50 -15 19 -42 -110
4586 -110 78 -132 66 20 166 46 -80 -53 128 85 130 26 213 93 -139 -157 22 132 -97 42 -78 -113
4608 -113 -269 146 -54 206 132 -247 -321 -99 55 -132 -17 -123 -48 -52 -390 25 144 -215 -97 -489 -127 314
4630 314 69 152 1 70 180 227 -54 120 144 23 -50 -13 -71 150 -284 -137 -22 -51 9 -78 -216 -113 47
4653 47 -268 93 -57 129 -93 25 71 -18 18 -222 182 113 -74 94 11 -11 -10 -87 -158 -109 78 -64 154 -19
4677 -19 80 85 10 -151 122 -87 -145 -156 18 -70 -88 160 -44 156 84 -137 -75 -91 144 115 -9 33 104 -69 103
4702 103 -23 11 19 -35 96 264 7 24 -25 -272 122 6 -43 -85 69 17 35 -162 -85 -118 51 176 0 -86
4726 -86 -64 -4 99 206 -184 -105 132 148 -40 75 191 154 178 -80 37 -148 14 -211 -54 -90 337 -80 125
4749 125 15 74 -45 -77 -125 -109 -256 27 -224 -41 164 230 -4 115 -1 -153 23 110 -134 166 -183 212
4771 212 76 136 -57 55 -181 64 66 -46 101 -63 -127 -45 -211 -325 -64 100 -213 -158 -142 -39 -164 146
4793 146 160 -229 -94 -23 -87 -75 115 -195 -10 147 226 -22 -27 120 110 222 111 30 26 39 150 -62 -25 -68 18
4818 18 -33 -194 -57 -80 238 -163 82 10 161 173 -51 -111 205 -255 122 3 16 75 292 -47 -203 -207 -41
4841 -41 -35 -116 144 -171 87 -93 -47 26 216 -82 -13 -264 -127 -52 -170 -153 154 -145 -128 210 -87 68 -12 61
4865 61 -139 -1 -3 129 126 93 -181 -40 -197 -13 -305 107 67 -184 66 149 -55 43 -26 84 104 -144 22 14
4889 14 -26 316 2 57 83 -154 137 -156 -29 -146 -42 -31 -22 150 21 -47 3 111 96 106 -133 -136 -70 -100 -113
4914 -113 59 191 -151 -70 14 85 164 -40 -156 31 -135 -18 240 -41 -174 -86 81 -66 13 145 33 59
4936 59 -23 184 -98 -172 27 147 -133 10 -108 26 79 -158 -172 -148 -28 87 -77 -32 18 -37 -23 -42 147 253
4960 253 -57 -149 49 -14 118 64 47 203 23 -186 -6 116 137 -24 140 -115 60 -204 171 -169 241 -148
4982 -148 -90 -87 16 46 51 87 -245 125 123 -8 -65 -32 -271 47 116 203 -117 166 32 76 63 -305 114 227 208
5007 208 32 -12 148 -3 105 216 -16 -7 -217 -49 44 -69 171 8 -156 181 131 -148 191 -112 -100 3
5029 3 52 11 -49 86 10 -1 -39 -58 -161 -253 -9 -259 43 -63 28 7 116 135 -3 51 90 -82 -56 296 -217
5054 -217 -122 44 -15 110 2 181 -33 -66 -164 -204 169 123 -127 -96 -5 55 17 -272 145 -234 26 -8 -41 -10
5078 -10 -19 99 -112 210 23 107 -51 16 -170 190 4 127 124 -160 95 -24 -42 14 86 -39 110 -104 46
5101 46 97 142 92 -112 36 30 -104 -50 -89 71 -94 -144 -40 187 -89 102 64 -102 13 -63 -6 21 71 168 37
5126 37 -146 157 -178 20 -169 -141 -213 9 -202 -73 -92 -69 -65 36 -62 -2 86 -118 200 37 -25 -145 29 102
5150 102 5 40 -206 -153 74 -125 441 -128 49 -61 -61 50 103 -121 -177 -246 -99 109 -139 -128 -51 -178 -32
5173 -32 43 16 -91 -21 52 -37 71 -73 159 -136 180 -34 -43 71 37 61 -28 -200 45 94 -208 -55 48 -113
5197 -113 -143 -102 28 -92 132 103 48 -78 -87 327 -119 172 54 -202 199 -18 -107 171 178 -198 181 -91 213
5220 213 109 182 -129 53 -27 42 -22 -71 -93 66 -10 -116 113 -91 -84 -64 148 84 145 32 31 201 43 -56 -154
5245 -154 55 -15 -327 51 -94 -193 -109 139 -170 1 -32 -51 -59 238 244 98 49 296 -25 178 174 8 54 -136
5269 -136 36 47 -109 -23 -147 -106 -82 110 12 -163 25 -86 -293 -97 -37 96 -93 98 262 -350 -16 -115
5291 -115 54 104 79 141 -128 -1 9 -80 71 -32 202 -118 -82 271 -55 -154 150 10 -1 -234 -35 131 -68
5314 -68 11 -33 7 -86 248 -103 -79 2 -11 96 87 76 229 -77 9 -53 84 -86 100 -43 -18 22 -245 104 -106
5339 -106 10 -53 265 92 58 122 11 211 -88 -185 236 36 165 105 38 329 97 143 -179 -234 9 194 44
5362 44 0 -106 192 -15 -113 -138 -85 -147 -43 -62 432 -99 -126 57 -11 88 141 -108 -32 -40 -76 28 0 115 106 -99
5388 -99 -191 147 179 -157 83 71 38 -112 23 101 6 -75 235 -56 19 -52 215 -8 -4 113 -49 -8 -74 -188 189
5413 189 78 -529 317 -129 -123 93 -203 -60 -211 115 57 -2 78 -100 171 -27 90 -15 -29 110 -77 -18
5435 -18 33 87 -113 -36 172 218 190 -44 -129 175 111 213 67 -80 -57 -60 -55 208 -31 79 -71 -233 -170 79 20
5460 20 96 -188 72 239 -9 124 -108 117 -41 163 62 -49 -40 42 -83 15 -49 6 -140 188 -60 38 124
5483 124 -233 -1 -141 -120 68 94 144 73 2 -158 71 130 0 -16 286 106 207 -60 -45 -80 -24 -249 105
5506 105 -82 -140 -123 61 -107 -134 122 101 -39 -149 63 -8 123 -140 -85 5 56 -44 132 -172 -75 -11 102
5529 102 65 -148 -119 -238 -263 84 108 -34 -65 91 207 -115 -63 -84 -202 -209 146 -164 180 146 54 -96 -56 -147
5553 -147 -93 -118 2 202 -32 118 10 -29 73 -94 -144 163 -83 -72 -11 33 -54 13 35 50 105 -49 -132 -182 -33
5578 -33 62 187 -230 58 -158 -103 -226 61 -142 -314 140 -75 24 63 58 59 -49 81 -128 -17 73 -133 62
5601 62 1 -177 -185 223 36 -7 171 62 -30 133 -42 -80 -300 115 -231 -115 -9 250 184 65 107 -15 -87
5624 -87 -14 -102 120 -18 -74 -229 19 172 167 -97 -59 -26 238 340 -74 92 39 237 -51 -277 -112 62 -24
5647 -24 -256 -11 135 17 24 133 -112 167 -370 20 138 14 -138 -160 215 43 74 -37 -65 3 57 -30 138
5670 138 197 290 166 -286 49 37 -43 -328 56 -180 32 -77 189 -19 244 34 -243 89 208 73 179
5691 179 -36 -116 52 -69 143 -16 158 157 -119 -252 -45 10 -129 -126 -233 56 243 79 225 86 -337 20
5713 20 -162 -86 17 -4 -78 -102 73 -93 -186 2 -199 122 -86 188 -21 -73 -78 158 100 -244 -30 26 98 -31
5737 -31 242 -67 -11 154 -59 95 38 194 -54 4 -22 -10 155 13 -100 -79 140 -57 -144 -191 85 -156 253
5760 253 -271 -102 -37 133 100 -225 -48 -203 115 -142 1 -166 122 61 203 45 -141 -209 204 -48 -65 59
5782 59 -132 -116 -128 63 17 -1 146 105 -47 -130 -12 108 52 -6 -28 410 18 62 -53 -223 -310 4 -22 -185
5806 -185 25 -56 -289 25 -78 -60 -40 21 58 2 139 -147 -52 67 72 255 -35 19 -51 -134 235 160 -106 0
5830 0 -130 114 112 90 79 135 195 30 -105 126 3 -326 -99 -131 -195 60 -254 -51 121 -105 -2 -20 175 107
5854 107 72 135 -175 -230 258 -180 -135 44 -36 -52 155 143 -4 90 -135 -133 -99 -132 -43 -95 262 -138 84 167 77
5879 77 -187 -215 -83 7 49 -65 -5 287 135 78 -210 -81 -122 202 -64 36 86 -2 -11 -78 -26 -9 -112 153 37
5904 37 172 -5 78 442 -85 23 -7 152 -76 -126 27 -47 36 -88 6 -49 -50 48 84 147 -184 61 88 -210 -143
5929 -143 116 -244 -32 -45 247 41 -34 -18 -139 -143 -23 39 156 -53 -279 513 15 73 -188 -78 129 39 72
5952 72 -47 177 157 -48 22 -15 -113 -87 153 -49 25 93 -21 100 -137 -83 -153 85 -85 -87 44 -177 -11 114
5976 114 -14 -71 -3 91 108 -216 -213 0 -23 -24 33 72 16 -41 -82 70 268 -199 130 244 -92 -16 15 136 -45
6001 -45 -83 -11 -39 238 -94 63 13 -169 -30 -153 -146 270 72 -167 15 -33 -60 27 -2 59 0 -158 275 -261
6025 -261 -225 139 -33 80 -22 85 3 134 -90 -23 -164 60 46 -15 117 197 -10 21 -224 39 202 9
6047 9 -161 -36 115 -134 7 -47 28 -14 128 -75 213 80 -178 -27 59 -78 -62 -19 143 -125 -70 -23 10 -112
6071 -112 86 -95 79 -53 37 78 115 155 -92 237 122 -20 -59 115 202 145 -208 287 -87 58 112 -129 25
6094 25 -423 -51 -44 -103 148 -4 76 -48 -69 40 91 -109 -92 -244 79 352 -318 -36 -41 -183 -130 184 -175 246
6118 246 127 201 -85 95 102 14 101 -184 152 -20 103 -150 -6 77 3 -37 -118 15 -150 135 185 -94 9
6141 9 45 99 -111 -3 18 85 177 -161 26 26 -42 126 301 37 339 -185 174 -111 -199 -90 -96 102 -102 -81 -155
6166 -155 -34 -43 -83 48 47 -167 -160 -24 52 -105 -197 -72 -122 173 -104 -72 19 30 164 1 -242 151 -31 87
6190 87 25 125 48 0 -275 -70 104 -138 77 -83 13 239 -137 -60 -180 122 188 102 -30 69 -58 -166 -145
6213 -145 222 81 -61 -135 -104 189 -225 170 35 -61 -159 -27 -263 322 -161 57 -144 22 -183 -354 -42
6234 -42 -61 -72 -8 -62 -94 -214 -269 -36 26 109 -137 39 35 -7 -71 62 175 -95 -87 -70 -66 38 230 198 -29 -37 -38 140
6262 140 95 -187 -13 -198 -65 -18 78 -92 -164 101 -180 27 187 -29 -172 13 121 -2 51 250 -137 148
6284 148 15 -163 145 -43 -59 166 -193 114 -105 169 -107 -219 77 31 -134 -45 -3 65 127 -120 53 68
6306 68 75 138 87 -42 185 201 -81 99 46 23 48 -172 197 -132 20 -14 -83 -140 -58 -186 0 94 413 15 34
6331 34 63 157 -37 205 -44 109 -101 -82 -157 -123 -3 23 -31 -50 -249 -15 -33 -197 -201 -42 212 -88 -117 -254
6355 -254 83 -350 240 -17 -191 309 122 -18 -10 112 37 25 -218 138 25 -51 -33 93 -89 -39 128 -66
6377 -66 2 -118 93 -105 91 135 14 136 -130 -42 -8 -72 3 -162 -13 -89 43 80 -334 -58 82 80 185 69
6401 69 111 -37 107 -128 -33 -55 -35 -51 110 57 11 -65 -257 62 65 -154 -75 -49 63 -77 -185 239 104 208
6425 208 -106 -30 35 26 87 -140 -56 60 35 -40 -68 35 23 -1 -69 -32 -44 60 49 79 39 -294 -78 -67 9 -58 37
6452 37 193 -52 18 55 79 61 2 -51 -21 94 163 -50 12 -144 93 159 165 -87 259 -145 61 -2 -62 -24 97
6477 97 76 81 -32 -37 -103 -251 90 -23 -69 100 -179 8 -25 -66 130 -133 65 -3 -82 31 -152 196 62 -22
6501 -22 -2 41 -37 -106 -17 42 -46 -36 9 -115 31 21 52 -69 171 90 472 49 -85 -149 193 116 -6 -269 -81
6526 -81 -74 -192 -40 -22 -90 51 -75 87 -78 -55 -39 79 -154 -99 137 -6 -100 -66 39 -161 217 -243 121
6549 121 -96 -33 76 -48 -49 -75 -74 81 -59 -97 120 -72 -87 -143 141 15 86 -159 -92 101 -221 -8 13 -30
6573 -30 -43 52 23 -75 -163 -266 -54 29 189 -4 -170 -144 -52 9 62 -64 11 134 -115 85 194 266 -160 -98 137
6598 137 -182 225 200 118 86 -128 239 50 129 34 188 198 97 6 -72 76 51 -88 80 -3 -34 67 -54 95
6622 95 33 115 -29 -37 -147 21 225 33 -102 135 74 200 7 -55 -121 17 -220 1 -37 195 102 -2 -192
6645 -192 -113 246 -121 41 -106 254 40 38 24 11 -93 -10 -25 175 174 178 141 -97 28 139 -104 100 195 -35
6669 -35 -171 -61 -178 45 103 -143 115 -136 -275 -54 -43 -156 200 5 30 60 38 2 -50 -11 22 -96 108
6692 108 97 -17 108 68 115 166 171 114 148 261 226 43 -212 -100 173 324 128 46 54 -20 164 283 188 -10 16
6717 16 -205 -281 -105 24 0 158 179 130 -22 -164 4 32 160 -53 -59 39 -260 6 92 -303 -6 99 0 75
6741 75 35 36 24 187 -78 -119 -253 200 -104 -104 126 94 -92 -101 -141 -92 -10 -222 -7 -237 -83 -233 -166 -65 280
6766 280 -110 83 41 -39 -11 229 30 44 -62 227 -46 35 -189 -71 110 -245 -6 181 45 121 -64 -108
6788 -108 202 -49 95 -77 -122 13 -47 -88 7 44 -108 -307 -162 -135 -52 101 168 7 -85 59 -113 -282 -107
6811 -107 54 -111 41 111 -173 130 -70 -50 32 -40 -136 73 124 126 70 -304 56 5 -100 10 46 130 -60 -198
6835 -198 -54 70 72 -221 -148 40 -58 -34 13 -15 153 -21 -213 40 -58 -162 -29 85 -119 118 42 116 -83
6858 -83 -223 -187 -27 21 28 -117 -45 -42 209 33 40 -175 150 84 -118 -13 82 -239 -85 157 30 -3 -269 -12
6882 -12 46 152 85 -262 -119 129 -226 83 -51 51 337 264 -200 -235 61 -121 59 41 18 -55 145 83 -88
6905 -88 126 -61 67 117 61 68 -184 -26 109 -86 -47 -176 60 138 -58 135 5 -170 -223 -244 41 126 24
6928 24 39 -114 105 -180 -157 -21 71 27 145 -38 -79 -9 -25 127 -52 -138 121 12 31 -83 -101 -3 151 -158
6952 -158 286 110 182 72 108 -277 -73 -48 -107 -155 -123 114 -70 51 -223 288 406 94 -149 -80 50 279
6974 279 -34 10 110 90 92 47 -120 54 -101 -170 -215 70 177 -99 71 -37 -125 -8 4 -62 11 43 2 -132
6998 -132 167 -3 301 -110 104 -133 -19 -149 283 -11 -24 33 64 -206 -71 126 71 84 92 -53 -16 22 -134
7021 -134 50 -12 2 262 -82 -131 97 -160 0 13 -7 107 101 124 143 70 157 20 -150 -132 104 -203 -178 170
7045 170 -6 23 124 124 -56 -129 -79 149 164 -92 -93 -163 -3 275 -16 140 66 -156 183 73 -208 55 14 95
7069 95 78 65 88 176 253 -44 -127 21 107 -11 -106 17 -47 68 40 2 -23 24 1 239 -95 -34 -51 141 -15 179
7095 179 65 -140 22 -213 325 140 137 -164 45 66 -287 -108 -33 -200 -6 -157 100 -102 -14 -68 180 321
7117 321 144 41 -232 7 -83 6 -151 93 -79 -81 57 146 22 -92 -189 -368 -186 130 -53 35 24 -181 26
7140 26 166 44 44 117 36 72 -110 265 94 217 -121 39 -169 -114 -88 203 135 5 -102 -188 -4 22 -26 62
7164 62 -12 63 169 189 110 50 9 135 133 -76 31 -55 -72 -58 99 -53 -107 -24 -57 18 -9 301 96 -138 94 0
7190 0 -10 -206 -60 146 13 34 -90 50 -5 163 45 -175 143 33 -65 -59 53 -1 -174 -2 42 -82 163
7213 163 -80 -274 -52 -171 58 -51 48 137 -8 -43 -91 -31 -61 28 -93 222 184 237 90 196 -119 46 -5
7236 -5 44 14 -104 41 -29 49 -19 201 -188 -125 87 364 -52 -38 182 92 71 121 -67 212 41 -28 155 -160
7260 -160 80 -56 -3 -48 153 12 114 -89 -118 110 123 461 66 51 166 -22 -80 -103 -16 51 27 -127 -91 176
7284 176 105 -206 -11 84 175 -72 -308 -52 -76 -23 -210 14 -47 -71 135 141 -84 -105 -252 -129 -117 64 -203 270
7308 270 -17 93 -81 -71 206 89 144 45 -29 -38 -122 158 165 -194 -33 10 84 88 22 -42 41 -128 48 60 -16 -42
7334 -42 103 113 -176 -66 211 18 -37 -190 -57 -29 108 11 -67 51 -45 -215 76 -70 47 59 -69 60 54
7357 54 -168 -343 139 -61 -118 -351 -32 63 -131 152 65 139 49 137 -9 105 -124 -225 -1 -38 292 -102 -76
7380 -76 -145 -72 27 -150 154 -107 27 143 1 -159 81 228 -3 -39 27 -354 57 -174 -74 -52 38 -205 70
7403 70 16 134 -50 -10 -73 80 78 11 -42 346 26 206 -180 31 98 -128 185 199 -193 -19 -49 -15 26 -32 -57
7428 -57 -199 -85 90 -182 30 -41 153 -48 155 -105 -27 263 -154 108 41 229 6 70 -7 -73 105 -100
7450 -100 30 -61 -90 -23 -165 -65 -165 110 -9 -71 362 97 -107 -87 38 -8 147 -204 -7 185 145 79 48
7473 48 4 20 -181 68 131 126 -105 254 218 -50 179 -44 40 -26 -100 -83 63 103 -225 171 213 181 -65 322 153
7498 153 -176 60 -128 39 150 178 -213 -27 126 -112 177 -76 -136 290 -17 30 0 131 -38 -61 17 12 204
7521 204 37 356 41 -151 -105 160 -82 35 -135 -31 57 -59 -251 -95 -25 13 -139 -25 -307 -23 -85 87
7543 87 -358 -128 81 -140 47 23 -139 25 50 59 114 -139 -22 -102 -114 -149 -73 -166 59 -96 96 29 -69 -74 -92
7568 -92 15 -212 149 -181 105 -12 -15 -172 -103 86 0 196 146 -98 131 29 -129 13 -202 -70 -17 -115 -173
7591 -173 113 123 -95 -20 -31 147 35 52 -103 38 -133 115 126 -303 99 3 114 96 -153 -130 12 -2 60
7614 60 40 -142 116 -10 86 118 72 60 179 56 -95 49 237 208 7 28 5 54 102 370 31 -29 17 -140
7638 -140 -32 28 26 -148 195 -76 -110 121 74 73 135 -163 10 -42 171 -256 330 57 -3 131 219 -73 103 128
7662 128 -64 161 -82 -160 92 -31 101 -24 152 -54 -159 -179 277 -72 -239 -30 -13 -47 -245 2 112
7683 112 158 -48 -26 43 11 72 -156 136 -4 130 54 95 34 12 103 146 -165 -94 -115 63 -75 -238 55 -150
7707 -150 -45 193 46 40 51 -110 -258 -8 -61 -76 82 -23 105 157 -58 48 -21 -235 -186 43 -35 -85 0 6
7731 6 -37 10 -24 31 -73 9 125 -93 -38 -157 6 60 266 110 88 -88 -19 -100 50 -124 -83 127 27 -81
7755 -81 -112 112 0 98 19 51 -102 316 223 -126 -7 -33 -112 115 -152 -186 55 29 -48 -91 -168 -85 -48 -30 179
7780 179 162 31 -76 121 296 154 236 124 129 -3 155 -33 277 209 -63 -54 -98 98 -72 -69 66 -81 -35 -229
7804 -229 93 -15 150 289 -149 92 -190 -18 202 118 -74 23 262 -39 87 101 -3 43 224 187 -168 -92
7826 -92 329 68 -208 115 201 130 -68 22 64 -265 -66 111 -137 -80 84 -97 231 96 -126 -48 -224 158
7848 158 -30 -29 -292 121 -83 -49 -259 -29 24 -42 -193 265 -21 155 -59 1 274 172 21 5 -33 209 -24
7871 -24 -57 3 -41 -6 -344 -124 1 189 -170 25 230 -110 -82 -23 -28 -22 -48 -37 69 -50 -228 -128 -115 197 -94
7896 -94 -191 -138 -158 69 161 -27 182 44 -180 136 -73 -6 -202 -82 263 81 5 77 37 120 -233 82 18 -4
7920 -4 42 -71 -323 4 142 -3 -176 -44 -52 -149 104 -5 -276 -54 59 -32 105 -266 7 -7 91 66 123 121
7944 121 -18 61 -204 47 34 74 -33 21 -25 -57 121 106 3 281 -257 58 -10 -3 -17 -82 -108 -173 -242 -37 68
7969 68 28 -389 -111 -221 -253 213 77 -45 12 115 -91 18 -298 139 -18 -209 -92 -28 -9 -25 59 94 139
7992 139 14 173 -31 398 126 -29 -12 114 -31 -60 288 126 119 -38 -76 -141 24 -32 288 -150 113 292
8014 292 -86 88 -28 -10 244 -164 -215 33 196 1 146 123 191 243 -51 305 28 -181 56 -7 -239 99
8036 99 -18 188 169 114 206 -35 -104 77 -116 -259 -41 -18 -124 97 -172 -92 -43 59 -23 -136 17 -149 -23
8059 -23 82 -205 37 5 -256 47 -43 15 43 -124 -69 -198 17 -24 112 90 10 -100 -561 85 256 -142 65
8082 65 6 63 -130 -182 -198 -8 24 113 100 -63 3 -110 55 -197 -94 -37 -41 -6 163 198 27 193 -118 -266 38
8107 38 -80 48 163 -25 196 18 -18 -105 174 47 76 -53 34 -85 -104 245 66 210 41 115 67 -160 193
8130 193 -49 249 -167 -91 -108 94 -225 142 84 -221 41 64 207 -24 -120 -72 -31 63 -70 108 -99 -151 273
8153 273 64 -127 -31 -163 86 -54 188 -92 -141 14 21 -98 337 33 -5 66 36 286 -55 -133 75 157 -20
8176 -20 169 5 70 -14 -103 26 -95 -340 20 -180 197 -42 -38 -55 74
8191G4
##END NTUPLES=NMR FID
##END=
