##TITLE=1H_LR-772-RA-PhCH3
 CDCl3
 8 sc, 
 25.10.2023
##JCAMPDX= 6.0         $$ Bruker NMR JCAMP-DX V2.0
##DATA TYPE= NMR FID
##DATA CLASS= NTUPLES
##ORIGIN= UXNMR, Bruker Analytische Messtechnik GmbH
##OWNER= root
$$ XWIN-NMR		Version 3.5
$$ Wed Oct 25 14:12:10 2023 Russian Standard Time (UT+4h)  she@DPX200
##.OBSERVE FREQUENCY= 200.13135
##.OBSERVE NUCLEUS= ^1H
##.DELAY= (6, 6)
##.ACQUISITION MODE= SIMULTANEOUS
##.ACQUISITION SCHEME= undefined
##.AVERAGES= 8
##.DIGITISER RES= 18
##SPECTROMETER/DATA SYSTEM= spect
##.PULSE SEQUENCE= zg30
##.SOLVENT NAME= D2O
##.SHIFT REFERENCE= (INTERNAL, D2O, 0, 15.7039)
##AUDIT TRAIL= $$ (NUMBER, WHEN, WHO, WHERE, WHAT)
$$ ##TITLE= Audit trail, XWIN-NMR		Version 3.5
$$ ##JCAMPDX= 5.01
$$ ##ORIGIN= Bruker BioSpin GmbH
$$ ##OWNER= she
$$ F:/spectra/data/she/nmr/H-F/1/audita.txt
$$ ##AUDIT TRAIL=  $$ (NUMBER, WHEN, WHO, WHERE, WHAT)
(   1,<2023-10-25 14:10:47.73 +0400>,<she>,<DPX200>,
      <created by zg, POWCHK disabled, PULCHK disabled
       configuration hash MD5:
       00 E9 B6 7A A2 85 ED C7 34 08 36 98 17 FE 4E 26
       data hash MD5: 16K
       41 E4 48 0C 4C 0E EB 84 2D 03 4A BB 6E 14 82 00>)
$$ ##END=
$$ 
$$ hash MD5
$$ D3 F0 C6 75 75 50 99 15 6B 60 4A B7 24 98 D7 8A
##$RELAX= 
##$RELAX= 
##$RELAX= 
##$RELAX= 
##$RELAX= 
##$RELAX= 
$$ Bruker specific parameters
$$ --------------------------
##$DU= <F:/spectra>
##$EXPNO= 1
##$NAME= <H-F>
##$PROCNO= 1
##$TYPE= <nmr>
##$USER= <she>
##$AMP= (0..31)
100 100 100 100 100 100 100 100 100 100 100 100 100 100 100 100 100 100 
100 100 100 100 100 100 100 100 100 100 100 100 100 100 
##$AQSEQ= 0
##$AQ_mod= 1
##$AUNM= <au_zg>
##$AUTOPOS= <>
##$BF1= 200.13
##$BF2= 200.13
##$BF3= 200.13
##$BF4= 200.13
##$BF5= 200.13
##$BF6= 200.13
##$BF7= 200.13
##$BF8= 200.13
##$BYTORDA= 1
##$CFDGTYP= 0
##$CFRGTYP= 5
##$CHEMSTR= <none>
##$CNST= (0..31)
1 1 145 1 1 1 1 1 1 1 1 1 1 1 1 1 1 1 1 1 1 1 1 1 1 1 1 1 1 1 1 1 
##$CPDPRG= <>
##$CPDPRG1= <>
##$CPDPRG2= <>
##$CPDPRG3= <>
##$CPDPRG4= <mlev>
##$CPDPRG5= <mlev>
##$CPDPRG6= <mlev>
##$CPDPRG7= <mlev>
##$CPDPRG8= <mlev>
##$CPDPRGB= <>
##$CPDPRGT= <>
##$D= (0..31)
0 1.2 0 0 0 0 0 0 0 0.06 0 0.03 0 0 0 0 0.0002 0 0 0 0 0 0 0 0 0 0 0 0 
0 0 0 
##$DATE= 1698228647
##$DBL= (0..7)
120 120 120 120 120 120 120 120 
##$DBP= (0..7)
150 150 150 150 150 150 150 150 
##$DBP07= 0
##$DBPNAM0= <>
##$DBPNAM1= <>
##$DBPNAM2= <>
##$DBPNAM3= <>
##$DBPNAM4= <>
##$DBPNAM5= <>
##$DBPNAM6= <>
##$DBPNAM7= <>
##$DBPOAL= (0..7)
0.5 0.5 0.5 0.5 0.5 0.5 0.5 0.5 
##$DBPOFFS= (0..7)
0 0 0 0 0 0 0 0 
##$DE= 6
##$DECBNUC= <off>
##$DECIM= 32
##$DECNUC= <off>
##$DECSTAT= 4
##$DIGMOD= 1
##$DIGTYP= 9
##$DL= (0..7)
0 120 120 120 120 120 120 120 
##$DP= (0..7)
150 150 150 150 150 150 150 150 
##$DP07= 0
##$DPNAME0= <>
##$DPNAME1= <>
##$DPNAME2= <>
##$DPNAME3= <>
##$DPNAME4= <>
##$DPNAME5= <>
##$DPNAME6= <>
##$DPNAME7= <>
##$DPOAL= (0..7)
0.5 0.5 0.5 0.5 0.5 0.5 0.5 0.5 
##$DPOFFS= (0..7)
0 0 0 0 0 0 0 0 
##$DQDMODE= 0
##$DR= 18
##$DS= 0
##$DSLIST= <SSSSSSSSSSSSSSS>
$$ [...]
##$SUBNAM2= <"">
##$SUBNAM3= <"">
##$SUBNAM4= <"">
##$SUBNAM5= <"">
##$SUBNAM6= <"">
##$SUBNAM7= <"">
##$SUBNAM8= <"">
##$SUBNAM9= <"">
##$SW= 18.05172834244
##$SWIBOX= (0..15)
0 0 2 0 0 0 0 0 0 0 0 0 0 0 0 0 
##$SW_h= 3612.71676300578
##$TD= 16384
##$TD0= 1
##$TE= 0
##$TE2= 300
##$TE3= 300
##$TEG= 300
##$TL= (0..7)
0 120 120 120 120 120 120 120 
##$TP= (0..7)
150 150 150 150 150 150 150 150 
##$TP07= 0
##$TPNAME0= <>
##$TPNAME1= <>
##$TPNAME2= <>
##$TPNAME3= <>
##$TPNAME4= <>
##$TPNAME5= <>
##$TPNAME6= <>
##$TPNAME7= <>
##$TPOAL= (0..7)
0.5 0.5 0.5 0.5 0.5 0.5 0.5 0.5 
##$TPOFFS= (0..7)
0 0 0 0 0 0 0 0 
##$TUNHIN= 0
##$TUNHOUT= 0
##$TUNXOUT= 0
##$USERA1= <user>
##$USERA2= <user>
##$USERA3= <user>
##$USERA4= <user>
##$USERA5= <user>
##$V9= 5
##$VALIST= <valist>
##$VCLIST= <CCCCCCCCCCCCCCC>
##$VD= 0
##$VDLIST= <DDDDDDDDDDDDDDD>
##$VPLIST= <PPPPPPPPPPPPPPP>
##$VTLIST= <TTTTTTTTTTTTTTT>
##$WBST= 1024
##$WBSW= 4
##$XGAIN= (0..3)
0 0 0 0 
##$XL= 0
##$YL= 0
##$YMAX_a= 214647
##$YMIN_a= -235420
##$ZGOPTNS= <>
##$ZL1= 120
##$ZL2= 120
##$ZL3= 120
##$ZL4= 120
##$ABSF1= 10
##$ABSF2= 0
##$ABSG= 5
##$ABSL= 3
##$ALPHA= 0
##$AQORDER= 0
##$ASSFAC= 0
##$ASSFACI= 0
##$ASSFACX= 0
##$ASSWID= 0
##$AUNMP= <proc_1d>
##$AZFE= 0.1
##$AZFW= 0.1
##$BCFW= 1
##$BC_mod= 2
##$BYTORDP= 1
##$COROFFS= 0
##$CY= 11.3945322036743
##$DATMOD= 1
##$DC= 2
##$DFILT= <>
##$DTYPP= 0
##$F1P= 15.7292609196834
##$F2P= 12.9074282941183
##$FCOR= 0.5
##$FTSIZE= 0
##$FT_mod= 4
##$GAMMA= 1
##$GB= 0.15
##$INTBC= 1
##$INTSCL= 1
##$ISEN= 128
##$LB= 0.24
##$LEV0= 0
##$LPBIN= 0
##$MAXI= 10000
##$MC2= 0
##$MEAN= 0
##$ME_mod= 0
##$MI= 1.114404
##$NCOEF= 0
##$NC_proc= 0
##$NLEV= 6
##$NOISF1= 3.799351
##$NOISF2= 2.8
##$NSP= 1
##$NTH_PI= 0
##$NZP= 0
##$OFFSET= 15.70392
##$PC= 1
##$PHC0= -23505.06
##$PHC1= 5.8527
##$PH_mod= 1
##$PKNL= yes
##$PPARMOD= 0
##$PSCAL= 0
##$PSIGN= 0
##$REVERSE= no
##$SF= 200.130013532006
##$SI= 16384
##$SIGF1= 3
##$SIGF2= 2
##$SINO= 400
##$SIOLD= 16384
##$SREGLST= <1H.CDCl3>
##$SSB= 0
##$STSI= 0
##$STSR= 0
##$SW_p= 3612.71676300578
##$SYMM= 0
##$S_DEV= 0
##$TDeff= 0
##$TDoff= 0
##$TI= <>
##$TILT= no
##$TM1= 0
##$TM2= 0
##$TOPLEV= 0
##$USERP1= <user>
##$USERP2= <user>
##$USERP3= <user>
##$USERP4= <user>
##$USERP5= <user>
##$WDW= 1
##$XDIM= 8192
##$YMAX_p= 0
##$YMIN_p= 0
$$ End of Bruker specific parameters
$$ ---------------------------------
##NTUPLES= NMR FID
##VAR_NAME=  TIME,          FID/REAL,        FID/IMAG
##SYMBOL=    X,             R,               I
##VAR_TYPE=  INDEPENDENT,   DEPENDENT,       DEPENDENT
##VAR_FORM=  AFFN,          ASDF,            ASDF
##VAR_DIM=   8192,          8192,            8192
##UNITS=     SECONDS,       ARBITRARY UNITS, ARBITRARY UNITS
##FACTOR=    0.0002768,     1,               1
##FIRST=     0,             0,               0
##LAST=      2.2672688,     0,               0
##MIN=       0,             -235420,         0
##MAX=       2.2672688,     214647,          0
$$ Real data points
##PAGE= N=1
##DATA TABLE= (X++(R..R)), XYDATA
0 0 0 0 0 0 0 0 0 0 0 0 0 0 0 0 0 0 0 -2 8 -8 8 -8 8 -8 12 -16 16 -16 24 -24 28 -32 36 -40 44 -52 57 -61 68 -77
40 -77 85 -95 106 -117 128 -144 156 -174 191 -210 231 -255 282 -309 343 -382 425 -476 538 -607
60 -607 698 -808 953 -1148 1430 -1860 2603 -4114 8365 -43827 -152032 -22162 21320 -12273
74 -12273 106205 211357 187923 214647 213830 111840 76237 64490 -42040 -76122 -19101 -37596
86 -37596 -58395 -12631 -32935 -91566 -102490 -136471 -177511 -147372 -115825 -100275 -40612 11595
98 11595 32715 74950 99786 87926 100100 107474 77021 73336 92790 86183 81569 80708 56583
111 56583 38383 12773 -40794 -65707 -72511 -117122 -138269 -111904 -113207 -110593 -57823 -32806 -34649
124 -34649 1392 15049 -10041 12179 43226 28258 48902 101887 100256 95670 125684 109091
136 109091 61714 47073 15093 -41394 -55015 -50548 -68174 -61628 -35704 -42333 -57741 -57717 -71648
149 -71648 -88691 -81884 -67568 -46594 -5379 33728 60181 87813 103488 91658 71672 56037
161 56037 39385 26166 24569 30070 36769 38035 25431 4137 -18686 -46174 -74918 -94033 -97112
174 -97112 -86458 -71868 -52540 -24874 -3038 4299 8860 13147 12092 15037 24355 33060 48040
187 48040 68830 74969 70502 73205 63869 31955 6192 -8258 -32738 -51255 -51521 -49584 -48623 -39237
201 -39237 -35037 -40506 -41496 -40093 -45315 -44619 -28521 -10125 6634 29264 52313 65040 68694 67178
215 67178 57454 43348 31925 21232 9140 7470 11722 4990 -4017 -6115 -16954 -38261 -53796
228 -53796 -62844 -68882 -66305 -56926 -42061 -17093 4980 12418 22508 34226 28323 20417 26001 28913
242 28913 30335 42363 50826 50553 51969 43764 19853 -336 -14954 -36298 -51286 -49446 -44810 -40491
256 -40491 -31271 -24887 -23658 -22523 -24539 -28868 -26948 -16430 -3180 9138 26185 46891 57367
269 57367 54915 53164 49549 33180 16272 9023 2577 -3615 -2931 -4070 -7591 -8607 -16506 -33589
283 -33589 -42112 -44532 -52712 -52799 -38751 -23838 -9736 6852 18956 25944 30094 27375 20581 20358
297 20358 22877 22344 25765 33721 36879 34012 25911 13082 -1585 -16660 -32770 -42838 -42102 -37031
311 -37031 -34170 -27629 -14784 -9424 -12667 -12387 -9891 -11479 -10077 -689 8977 20403 36168 44164
325 44164 43517 45091 39507 21483 7531 976 -8135 -14688 -11752 -8800 -8006 -7396 -12182 -21643 -28485
340 -28485 -34305 -40744 -38862 -26827 -12819 -1040 11710 24928 31185 27869 22393 20116 16333 10833
354 10833 11494 16488 21167 23259 21216 16258 8140 -5048 -20352 -30976 -36753 -39126 -35548 -27539
368 -27539 -18566 -7689 -34 -597 -1103 -45 -3676 -5792 1277 10846 19634 30636 38573 39123 37579
383 37579 29126 11982 -1101 -6715 -15467 -22387 -16651 -9155 -9721 -10327 -9145 -14169 -22774 -28298 -30344
398 -30344 -28493 -21021 -9467 2365 16318 27934 31317 29254 26700 21021 12943 7866 7290 8786
412 8786 12156 15350 14710 11165 4746 -6828 -21858 -31788 -35754 -37565 -35135 -24780 -12134 -2601
426 -2601 2976 5828 6865 4851 -458 -3025 3004 10829 15833 24528 35778 36624 29726 23314 12851
441 12851 -1842 -11075 -16895 -22072 -18590 -11743 -11454 -10640 -6493 -10898 -20326 -23230 -24109 -25307 -18042
456 -18042 -6691 3377 16799 28154 30389 28687 27283 20509 9520 3357 3046 4409 5411 8571
470 8571 13062 11886 2633 -7007 -15742 -26013 -32907 -33667 -29746 -20358 -9559 -3038 3998 9877 7380
485 7380 2458 1967 951 680 7439 14785 20279 28457 31266 24437 18583 12275 -2017 -13254 -17095
500 -17095 -20729 -20488 -14066 -10820 -7521 -1540 -4508 -12890 -14462 -14817 -19678 -16431 -4695 4664 13490
515 13490 22636 26439 26536 23167 13904 5468 2570 -749 -2431 1134 6488 7873 5676 1377 -5380
530 -5380 -13079 -21507 -26787 -27246 -23221 -16540 -7604 932 7812 13465 13007 8187 6405 5399 2315 2620
546 2620 8704 14687 17991 19161 17976 14188 6086 -5306 -14334 -17561 -20373 -21175 -15257 -8052 -4108
561 -4108 -1586 -1300 -4271 -6911 -9311 -11844 -9134 -982 6103 12672 21648 26107 23999 19865 14128
576 14128 4825 -1377 -3464 -7276 -7609 -1727 165 -2898 -3249 -4793 -11563 -18360 -20816 -20659 -17606 -12364
592 -12364 -5324 4261 12046 14664 14975 15079 11656 6489 3775 3675 6053 9643 11983 14151 14833 10243
608 10243 2230 -6461 -13964 -19955 -22991 -22258 -17764 -11149 -5730 -2588 -45 752 -1408 -3532 -4645
623 -4645 -2611 2864 7940 12362 19347 24285 21231 16974 13938 7275 -1926 -7026 -9051 -9991 -7984
638 -7984 -6088 -4726 -2877 -4458 -9830 -14282 -16670 -17815 -17186 -12306 -4187 4488 10645 15139 17883
653 17883 17403 13263 8896 5124 3192 4938 6561 7009 9848 11808 6066 -1305 -5749 -11590 -18790
668 -18790 -21542 -19693 -16347 -11336 -6665 -1939 3167 4742 1892 84 706 -145 488 5082 10960 15513
684 15513 18310 18353 16493 12610 5215 -2555 -7781 -10731 -11922 -11102 -7702 -4237 -2507 -3662 -6794 -10027
700 -10027 -11957 -13495 -13382 -8824 -1063 5868 10109 14483 19018 17396 11215 7456 4971 1077 -627
715 -627 1367 3535 5010 5541 3041 -1088 -4708 -10165 -17077 -18811 -16320 -15037 -11289 -3589 2331 5034
731 5034 7248 6582 3998 2837 1966 777 3902 9587 12556 14139 16129 14370 8486 1918 -5539 -10939
747 -10939 -12974 -14409 -13521 -7867 -3700 -3869 -3365 -2553 -5606 -9331 -9515 -8348 -5080 632 6172 11837
763 11837 16877 18276 16132 12824 8320 3844 -360 -3185 -2840 -445 581 1305 1355 -1085 -5579 -10624
779 -10624 -15824 -18348 -16408 -14099 -10391 -1802 5538 7002 8689 10720 7832 3419 2758 2874 4785
794 4785 8389 10895 12621 14825 12319 5432 256 -5136 -11831 -15488 -15099 -13544 -10234 -6054 -3979
809 -3979 -2301 -1713 -3965 -6207 -6783 -6342 -3914 773 5930 11635 16854 17895 15714 13112 8895 3015
825 3015 -1933 -3797 -2857 -1384 -1259 491 2062 -1449 -6978 -10197 -13721 -17219 -16411 -13321 -8255 -1362
841 -1362 4554 6951 9840 10767 7336 3917 3417 3218 3167 5786 9336 11277 11869 10127 5710 360 -5051
858 -5051 -9959 -14095 -14536 -11816 -8769 -6545 -2699 363 -157 -2442 -3951 -4653 -5112 -4133 -778 5166
874 5166 10692 13628 15059 15507 12433 6302 1018 -2467 -4585 -5236 -3779 -1832 108 704 -1558 -4894
890 -4894 -7165 -10493 -13507 -12541 -9343 -5424 48 4722 7800 10027 10224 7297 4277 3126 1947 595
906 595 1825 5999 7755 7473 6978 5197 327 -5606 -10215 -12726 -13228 -11899 -9117 -4620 -51 2184
922 2184 1588 1144 168 -1857 -3164 -1603 1757 5514 9230 11678 13113 12117 8851 3993 -641 -3918
938 -3918 -6231 -7209 -6480 -4335 -2112 -1420 -2456 -2932 -4392 -7936 -10468 -9580 -6446 -4123 -51 6018
954 6018 9857 11184 11031 9342 6475 4157 1266 -16 1266 2913 3614 4000 4335 2139 -2350 -6516
970 -6516 -10139 -12695 -12955 -11604 -8627 -4203 -511 2129 3224 3441 3073 1646 -210 214 3482 5083
986 5083 6941 10532 12347 10720 7728 3920 55 -3484 -6915 -9004 -7697 -6254 -5916 -4357 -2227
1001 -2227 -2920 -4636 -6180 -7854 -7845 -5568 -3555 449 6682 9709 11012 12244 10986 7333 4862 2253
1017 2253 -460 221 1613 804 1804 3602 1320 -2692 -5605 -8689 -11625 -12308 -11875 -8341 -4694 -1777
1033 -1777 675 3973 5000 3836 3238 2882 1938 2743 4261 5468 9317 11166 9370 7857 5104 -39
1049 -39 -4304 -6971 -9088 -9400 -7570 -6016 -4462 -1781 -1324 -3014 -4236 -5636 -6022 -5567 -2912 1113
1065 1113 5924 8517 9566 11261 10652 7144 4782 2897 380 -1385 -1330 -516 601 1491 21 -2220
1081 -2220 -4234 -7346 -10670 -11310 -9775 -8121 -4986 -1117 2394 5215 6491 5912 4709 3586 1970
1096 1970 1349 2910 4778 6996 8278 7809 6029 3585 -287 -5270 -7526 -8468 -9798 -9276 -6009 -3203
1112 -3203 -2086 -1126 -683 -2071 -3083 -3559 -3749 -1180 2523 5098 7730 10785 11308 9460 7659 4782
1128 4782 1296 -1509 -3463 -3743 -2873 -1937 -1099 -1206 -2297 -4128 -6736 -9123 -10080 -8996 -6857 -4284
1144 -4284 11 4575 6905 7938 7904 6399 4322 2374 1633 2832 4556 5033 5983 7028 4844 1114
1160 1114 -1835 -5088 -8614 -10324 -10422 -9708 -6624 -3717 -2366 -362 538 -746 -1429 -1292 -1506 -198 2703
1177 2703 5456 7717 10580 11719 10050 7626 4729 1141 -2858 -4590 -4594 -3718 -3258 -2279 -1402 -2236 -4695
1194 -4695 -6972 -8732 -9272 -8630 -6565 -3228 1421 4402 6609 8334 8613 6511 4808 3328 2509 2500 3468
1211 3468 4033 4863 5725 4023 1529 -1638 -5007 -8288 -9953 -10678 -9233 -6564 -4270 -2299 477 1657
1227 1657 435 -953 -513 -468 164 2116 5097 8031 9556 10079 9338 6900 3478 -227 -2939 -4556
1243 -4556 -4889 -4289 -3506 -1688 -1400 -2094 -3646 -4777 -6876 -7540 -6942 -5672 -2335 1581 4178 6216 7825
1260 7825 8056 6625 4407 2774 1928 1464 1305 2218 3630 3523 2251 739 -1576 -4736 -7883 -8995
1276 -8995 -8672 -7803 -5705 -2787 -54 1864 2250 1744 1275 583 -10 329 1775 4347 6244 7626 8156
1293 8156 7152 4362 2284 -1054 -3823 -5210 -5527 -5595 -4108 -2482 -1993 -2540 -2255 -3091 -4367 -4855 -4541
1310 -4541 -3040 -343 1762 4463 7526 8331 7554 6318 4733 2199 530 -852 -652 255 732 1025
1326 1025 945 -380 -2523 -5178 -6915 -8313 -7822 -6646 -4545 -2079 607 2350 3450 3338 2934 2670
1342 2670 1915 1474 2886 4355 4932 5785 6566 5755 3274 938 -1497 -4234 -6556 -7101 -6578 -5368 -3588
1359 -3588 -2730 -1631 -972 -1825 -3009 -2877 -2864 -2156 -120 2298 5136 7023 8240 7847 6693 4695 2514
1376 2514 588 -761 -1311 -648 -498 -506 -30 -1143 -2880 -4719 -6633 -7240 -7413 -6724 -4351 -1378 705
1393 705 2485 4445 4971 4350 3466 3003 2490 2183 2976 3499 4794 5111 4439 2858 915 -1575 -4027 -5870
1411 -5870 -6653 -6696 -5432 -3804 -2041 -1187 -657 -720 -1737 -2201 -1945 -1318 -112 2171 4806 6336 6862 7652
1429 7652 6397 4264 1751 43 -1225 -2239 -2307 -2118 -1047 -641 -1349 -2327 -3198 -4419 -5745 -6056 -5256
1446 -5256 -3693 -1568 826 3212 4645 5212 4846 3439 2177 1570 1134 1003 1990 3339 3617 3484 2584
1463 2584 832 -1499 -4107 -6000 -6405 -5866 -5271 -3866 -1117 36 351 506 447 -287 -724 -348 41 2033
1481 2033 3700 4857 5634 5880 5392 3133 1185 -864 -2748 -3535 -3695 -2929 -1886 -972 -819 -1134 -1816
1498 -1816 -3000 -4243 -5184 -4152 -2342 -1215 1633 4004 5435 5717 5100 3836 2236 996 321 56
1514 56 974 1431 1772 2064 1830 -162 -2585 -3780 -5354 -6265 -5957 -4808 -2966 -1068 872 1747 2062 1812
1532 1812 1318 129 11 611 1725 3248 4600 5269 5457 4900 2940 675 -984 -3068 -5011 -4529 -3221
1549 -3221 -2789 -1635 -577 -562 -1587 -2497 -3050 -3822 -3238 -2306 -477 2191 4252 4967 5689 5377 3828 1991
1567 1991 1096 13 -612 -134 727 953 1082 1182 -236 -2115 -3352 -4511 -5624 -5757 -4498 -2564 -803
1584 -803 895 2096 2723 2424 1283 284 581 312 869 1973 3966 4676 4361 4323 2790 440 -1469 -3484
1602 -3484 -4279 -3816 -3188 -2463 -1185 -168 -724 -963 -1105 -2307 -2893 -2367 -1563 -482 1601 3454 4211 4354
1620 4354 4646 3524 1452 97 -540 -1245 -1057 -240 565 953 1019 110 -1035 -2409 -4003 -4977 -4316 -2951
1638 -2951 -1957 -199 1874 2658 2575 2530 1705 537 102 -61 -9 1224 2241 2907 3013 2832 1557 -515
1656 -515 -1718 -3118 -4285 -3647 -2709 -2164 -968 841 697 229 97 -324 -1433 -1558 -494 206 1476
1673 1476 2947 3631 4046 3790 2377 616 -265 -1452 -2603 -1962 -1072 -477 -269 504 147 -1076 -2251
1690 -2251 -2739 -3415 -3311 -2110 -736 666 2397 3497 3405 2966 2361 1551 320 -199 71 451 906 1353
1708 1353 1422 1627 383 -1100 -2297 -2886 -3716 -4249 -3004 -1842 -1172 150 1030 1052 849 492 -560 -390
1726 -390 -151 30 1579 3284 3809 3763 3614 2565 769 -465 -1445 -2781 -2741 -1703 -1265 -1211 -183 -225 -1095
1745 -1095 -1835 -2554 -2571 -2553 -1862 -824 736 1856 2721 3426 3414 2750 1675 726 385 93 -120 414 1525
1764 1525 1703 1127 780 -264 -1887 -3071 -3610 -3856 -3301 -2173 -1257 -158 894 1098 1128 984 -52 -105
1782 -105 146 444 1074 2468 2945 2948 2721 2055 938 -442 -1589 -2114 -2244 -2112 -1500 -696 -172 -58 -246
1801 -246 -939 -1130 -1854 -2466 -2063 -830 10 1256 2551 2989 2967 2741 1686 569 -88 -461 -775 -538 336
1820 336 936 666 491 -181 -926 -2142 -3110 -2888 -2235 -1605 -659 740 1564 1631 1453 908 595 93 -468 -97
1840 -97 298 1070 1715 2308 2341 1697 748 -487 -1550 -2345 -2754 -2411 -1829 -1082 -149 560 391 -182 -397 -861
1860 -861 -1432 -1402 -325 334 1436 2542 3143 2973 2361 1480 254 -854 -1363 -1438 -710 -309 -27 168 530
1879 530 -234 -1218 -1984 -2524 -2755 -2349 -1497 -446 653 1437 2168 2404 2061 1474 675 208 -112 466 1025
1898 1025 1346 1902 2079 1450 309 -881 -1997 -2532 -3108 -3259 -2041 -1357 -287 78 642 506 -236 -773
1916 -773 -958 -535 -205 853 1948 2707 3108 3276 2677 1493 466 -352 -1094 -1190 -1321 -968 -219 61 -394
1935 -394 -328 -1276 -2148 -2521 -2654 -2709 -1975 -556 425 1341 2233 2594 2238 1608 969 640 260 356 668 1470 2044
1956 2044 2109 1293 596 -354 -1837 -2403 -2632 -2855 -2209 -1597 -664 157 341 196 -328 -589 -751 -728 -304 634
1976 634 1312 2175 2921 3081 2490 1726 876 -284 -814 -1151 -1168 -1042 -85 99 -179 -292 -582 -1451 -2293 -2625
1996 -2625 -2530 -1857 -606 413 1100 2168 2112 1687 1179 851 25 -364 369 415 693 1547 1700 1152 454 -178
2016 -178 -1334 -2246 -2182 -2460 -1696 -1283 -548 91 760 498 85 -170 -28 -637 -255 218 1205 1410 2407 2522
2036 2522 1938 1195 423 -475 -1318 -1536 -1659 -1030 -567 -224 -138 -26 -541 -1093 -1427 -1651 -1596 -1409 -327 740
2056 740 1342 2094 2436 1857 1401 1033 351 -73 1 89 241 470 644 398 357 -463 -1588 -2174 -2276 -2701 -2404
2077 -2404 -1303 -503 158 857 1030 952 603 595 410 335 645 992 1818 2307 2359 1745 1023 524 -511 -1331 -1794
2098 -1794 -1846 -1871 -1242 -1130 -440 -602 -678 -1021 -1437 -1190 -1337 -948 -209 843 1480 2112 2633 2275 1889 1506
2118 1506 804 165 318 121 161 291 522 326 -212 -574 -1283 -2133 -2642 -2395 -2300 -1604 -595 174 503 1088
2138 1088 848 808 706 706 676 931 1245 1602 2186 2250 1913 1471 723 -313 -935 -1625 -1790 -1817 -1594 -1191 -558
2159 -558 -623 -892 -825 -1092 -1167 -1318 -890 -240 524 1160 1872 2399 2450 2170 1568 933 294 -160 -9 -117 -38 333
2181 333 127 -78 -593 -926 -1588 -2119 -2179 -1982 -1365 -896 -200 299 995 1024 636 988 656 385 454 595 1037
2202 1037 1367 1639 1573 1312 484 -122 -988 -1682 -2023 -1551 -1322 -990 -862 -79 44 -174 -248 -546 -789 -365
2222 -365 -259 343 961 1539 1801 2192 1802 1327 601 173 -452 -854 -442 -297 38 -231 -16 -442 -846 -1427
2242 -1427 -1808 -1793 -1557 -1124 -645 364 832 1409 1526 1302 1024 764 515 584 321 682 967 992 1198 833
2262 833 367 -572 -1360 -1942 -2093 -2110 -1868 -1186 -527 -39 -8 213 -132 -278 -101 -296 116 571 1184 2092 2213
2283 2213 2226 1975 1320 369 -33 -814 -919 -1194 -829 -700 -666 -776 -548 -711 -1340 -1825 -1607 -1408 -1248 -375
2303 -375 317 1147 1760 1787 1815 1381 1004 734 524 513 853 692 1062 910 652 155 -690 -1296 -2063 -2078 -2026 -1926
2325 -1926 -1506 -790 -337 -184 31 -44 -157 -216 27 426 666 1217 1715 1967 2001 1914 1367 730 215 -563 -1057
2346 -1057 -662 -873 -738 -440 -353 -753 -779 -1311 -1511 -1575 -1653 -1275 -226 96 740 1355 1729 1555 1229 1287 529
2367 529 497 403 567 698 634 900 693 123 -357 -900 -1597 -1715 -1936 -1431 -998 -779 -313 3 377 -32 207
2388 207 -162 190 -244 386 893 1159 1559 1562 1521 1439 543 -75 -719 -984 -1211 -950 -506 -399 -280 -255 -524 -750
2410 -750 -972 -1314 -819 -685 -370 294 975 1284 1307 1732 917 772 652 215 84 86 175 238 370 351 224 -222
2432 -222 -862 -1124 -1527 -1520 -1347 -1235 -522 219 445 561 770 308 250 301 377 392 831 1288 1385 1515 1215 947
2454 947 101 -154 -737 -1190 -1094 -994 -981 -753 -390 -514 -402 -513 -695 -811 -769 -403 -38 341 1082 1320 1673
2475 1673 1273 1367 902 833 214 32 -125 -104 -204 75 -182 -208 -701 -883 -1266 -1591 -1630 -1320 -948 -576 196
2496 196 437 528 730 974 725 538 544 721 927 1152 963 1275 908 615 216 -162 -950 -1250 -1115 -1432 -1273
2517 -1273 -1113 -649 -558 -587 -510 -560 -1000 -864 -249 81 422 896 1292 1491 1668 1326 988 651 568 80 -152
2538 -152 163 -126 -258 49 -358 -439 -1074 -956 -1388 -1392 -1231 -1469 -773 -142 255 413 720 690 368 696 325
2559 325 329 473 830 867 987 973 604 324 -95 -399 -948 -1198 -1223 -892 -690 -545 -513 -327 -24 -364 -374 -296 -368
2582 -368 -317 126 930 1070 1093 1349 1268 1070 475 356 -168 -341 -181 -190 -292 -230 -51 -370 -464 -633 -881 -861 -839
2605 -839 -876 -331 -85 549 563 939 947 602 636 470 42 145 436 540 346 637 353 195 -7 -432 -953 -1110
2627 -1110 -968 -1044 -776 -364 1 -23 302 166 260 -192 155 93 220 582 826 1228 934 1000 686 389 -183
2648 -183 -638 -692 -511 -596 -531 -346 -282 -608 -430 -687 -865 -704 -478 -321 -357 343 802 915 1045 1233 1040 393
2670 393 562 139 43 376 84 172 353 193 -306 -451 -1061 -1033 -1368 -1131 -1095 -935 -480 -236 7 125 260
2691 260 58 41 374 341 505 669 714 1185 1151 1079 651 339 -33 -624 -648 -794 -637 -487 -398 -241 -347 -447
2713 -447 -639 -824 -968 -792 -522 -143 222 672 887 1046 1113 905 464 394 139 248 318 291 170 183 371 19
2735 19 -337 -435 -983 -1297 -1256 -1024 -593 -406 -46 29 510 199 163 102 168 268 391 481 691 1066 1162 711 552
2758 552 298 -235 -229 -572 -673 -718 -287 -496 -409 55 -178 -431 -473 -477 -397 -335 -215 139 416 820 974 562 592
2781 592 418 282 377 -176 -203 -122 137 79 154 -107 -224 -619 -838 -926 -723 -728 -624 -111 253 282 326 606 149
2804 149 367 253 290 221 211 515 664 617 414 448 189 -266 -502 -510 -638 -897 -524 -141 -224 150 -59 -133 -259
2827 -259 -124 -265 -58 366 163 646 808 926 700 799 815 143 -112 -315 -158 -343 -267 -83 -353 -514 -405
2848 -405 -516 -454 -892 -616 -559 -270 -47 415 541 471 642 725 445 272 388 436 464 278 278 487 513 425 196
2871 196 -479 -188 -643 -771 -972 -516 -520 -309 -33 21 -93 -27 -164 -38 -121 423 382 472 694 909 1020 972 439
2894 439 538 97 -111 -194 -296 -313 -171 -161 -117 -282 -198 -639 -908 -623 -389 -295 -307 107 370 525 578 499 418 280
2918 280 487 238 114 281 288 259 383 291 143 -85 -382 -490 -720 -809 -841 -349 -61 -126 170 29 -10 48 -108
2941 -108 -150 68 211 380 549 663 844 719 363 48 83 78 -425 -188 -312 -173 141 -216 -57 -50 -305 -394
2963 -394 -306 -436 -322 -128 335 208 474 623 539 552 294 181 -44 192 -136 -54 214 344 189 90 8 -257
2985 -257 -616 -522 -259 -313 -201 -122 59 220 164 142 184 -23 -58 157 305 117 431 550 568 429 423 343 -356 -339
3009 -339 -624 -328 -289 -438 -498 -134 -55 92 -186 -316 -106 -141 -43 163 88 207 710 480 482 324 286 -61 35
3032 35 -101 38 -126 110 -63 187 9 -108 -230 -238 -546 -634 -695 -245 -164 190 334 373 139 -11 89 239
3054 239 171 273 335 533 624 280 125 342 -32 -129 -338 -351 -561 -515 -330 -319 -88 -16 -192 -211 -89 -88 -250 -313
3078 -313 -35 13 512 630 685 520 242 268 204 94 -210 135 34 92 -58 134 38 -219 -419 -614 -718 -685
3100 -685 -375 -261 -242 12 157 89 347 181 220 228 170 200 165 559 386 242 590 277 177 218 52 -326 -485
3123 -485 -502 -133 61 -372 -91 -145 118 -481 -476 -51 -50 -42 -11 348 319 463 575 474 226 185 -28 -230 -45 -32
3147 -32 -21 270 -48 100 -71 -349 -536 -363 -376 -593 -131 -35 -162 175 307 427 189 190 -101 172 -33 47
3169 47 265 307 291 156 104 135 -61 -235 -203 -301 -385 -140 -174 -67 10 84 273 -56 -80 -187 -187 91 215 201 285
3194 285 312 232 303 -55 112 -362 -298 -344 -196 -190 -234 -97 -224 -155 -154 -255 -355 -196 -170 -150 6 487 652 539
3218 539 439 185 517 122 -76 91 -128 -186 202 -209 277 -12 -190 137 -228 -570 -430 -318 -391 -338 154
3239 154 295 184 205 161 203 253 56 15 208 321 563 360 550 616 456 6 -80 -277 -58 -453 -304 -119
3261 -119 -240 -187 -153 -154 -168 -241 -206 -303 -172 161 65 216 198 622 331 214 232 100 245 16 -110 5 12 258
3285 258 25 18 -250 -292 -177 -623 -398 -409 -149 62 162 83 440 144 336 152 -45 97 26 208 394 196
3307 196 566 247 -54 275 -190 -190 -213 -441 -261 -210 45 -129 -137 -88 -139 -319 34 -328 -154 54 337 324 253
3330 253 233 111 177 111 -21 -86 -190 -262 -196 -165 -53 -227 -113 -258 -166 -281 -504 -324 -658 -124 -140 66 -32
3353 -32 228 249 173 23 45 -190 -23 -46 209 291 160 60 -53 -39 -134 -70 -232 -253 -474 287 -126 280 47
3376 47 -175 43 133 155 59 -86 280 330 370 450 181 218 178 201 -9 -75 -13 -37 27 -188 -66 -144 -325 254 -42
3401 -42 -306 -321 -150 -336 3 349 74 90 420 362 454 221 66 -22 -2 193 338 93 192 -158 -334 -165 -382
3424 -382 -253 -163 -256 -605 -235 -241 -13 94 5 164 -40 151 -3 25 179 59 374 303 516 273 115 244
3446 244 -6 -121 -239 -72 -365 -270 -348 -292 -88 -215 -173 -382 -202 -163 -116 -260 197 185 205 328 493 48 373
3469 373 365 220 -19 156 172 208 212 147 -102 -236 -353 -275 -340 -254 -260 -106 -57 109 106 92 -37 58 -49 -24 105 264
3495 264 -31 25 249 352 272 166 336 -33 -159 -139 -125 20 57 22 -195 -9 -188 -202 -289 -43 -189 -144 -80
3518 -80 72 235 149 368 126 63 277 188 49 -80 2 -282 -114 287 236 212 -285 -65 -294 -351 -207 -136 -151
3541 -151 -36 -8 30 19 120 107 -12 206 102 -53 -213 -210 42 265 -173 -37 29 -131 -113 -184 49 -378 -146
3564 -146 -48 52 154 -113 82 -68 -70 37 -306 -168 127 6 99 91 322 347 247 -173 -146 -372 -123 -141 -52
3587 -52 173 104 -198 -253 -81 -78 -253 117 -288 -7 10 329 122 184 432 39 144 116 107 -17 0 46 -118 21
3611 21 129 -158 -282 -24 -365 -250 -410 -231 -289 -157 -108 -201 31 108 -1 68 2 -45 158 -188 212 368 130
3634 130 471 -14 -26 187 26 44 -101 88 -75 45 -168 33 104 -166 -371 -150 -331 -503 -57 -79 42
3655 42 55 57 169 110 206 -31 187 51 137 217 196 297 281 -112 198 -55 -248 -173 -82 -238 -373 -160 -266 -193
3679 -193 59 -19 -47 124 120 54 -113 99 132 96 229 272 401 223 47 120 -45 -12 2 114 150 95 -46 -25 164
3704 164 -222 -197 16 -143 -236 -281 289 120 64 36 49 0 -194 -81 -18 -17 -50 -101 174 463 -13 250 194 -42
3728 -42 -201 -96 -222 -277 -236 150 25 -1 107 -55 -57 -133 -24 -114 -3 -76 -125 73 194 21 147 71 -174 -81
3752 -81 -160 -200 105 40 -2 133 215 -213 -73 35 -150 -92 -174 -69 390 125 238 352 278 26 29 187 -85 -221
3776 -221 97 2 -66 -121 -120 -171 208 -185 -178 -170 -199 79 -3 -123 -134 180 72 -105 -111 169 -235 -183 108 -73 142
3801 142 220 74 175 6 8 -48 -88 -403 -187 -111 -14 -39 90 -147 -130 40 45 -384 -100 70 294 105 249 108
3825 108 237 334 34 -176 258 -33 -91 110 -87 52 -70 -45 22 59 -80 28 -126 -16 -172 -271 -169 -39
3847 -39 -235 -100 4 43 77 -37 10 -122 41 272 11 263 238 142 75 47 -134 116 42 -193 -186 -63 120 169
3871 169 61 181 22 50 -75 -397 -297 -12 84 125 33 -22 -38 183 -130 -140 66 49 83 35 341 -80 -55 174
3895 174 -28 -306 -77 191 -282 17 -14 -56 -22 191 97 70 40 -56 -198 114 76 -59 -31 30 209 -46 91
3918 91 176 22 -192 -409 -52 -54 17 -64 78 137 -46 -32 236 63 -242 -31 -242 74 -195 265 -129 -98 -101 199
3942 199 -33 9 -185 -50 -38 -1 -1 118 -167 82 112 234 -130 186 303 -53 224 2 168 154 102 -54 -195
3965 -195 -144 -84 -380 -57 20 -52 -171 111 -71 -85 -343 -144 -347 -118 75 -3 40 93 199 129 88 127 162 -106
3989 -106 249 66 57 80 126 52 99 98 33 -96 6 -178 -121 -130 -201 -68 -318 -62 -84 -162 -186 7 -142 9 -132
4014 -132 -23 236 167 113 163 -141 229 153 92 -70 -180 102 -70 36 166 54 74 -13 -284 -169 -262 154 10
4037 10 32 -126 95 107 -31 -150 -149 -67 -53 -26 34 142 -11 358 -110 -156 -9 -60 -117 79 -53 -110 0 -163
4061 -163 309 -47 80 -49 215 -77 -152 -51 -76 -89 48 61 46 -54 -1 -60 -193 -5 -276 -241 -111 -71 -2
4084 -2 241 -113 71 86 50 -116 -152 33 -93 88 -304 84 201 62 -71 27 -206 92 51 -55 10 20 32
4107 32 114 38 -76 123 -317 -13 -7 -100 -32 82 20 -50 140 214 51 344 -13 35 57 79 74 -9 92 82 7 -94
4133 -94 44 -57 -221 36 44 -78 -94 133 60 80 -11 -18 -229 48 -66 6 -17 64 -231 34 148 6 58 237
4157 237 -25 -79 74 65 -26 -10 -85 271 -48 -152 -98 -92 -37 -247 196 143 -207 226 91 108 -22 -120 133 205 -142
4182 -142 202 67 160 -116 5 285 -52 128 -118 -244 -316 -175 33 98 9 -195 -230 -47 13 -306 -136 26
4204 26 218 -222 -10 42 192 -92 72 142 74 158 -100 220 -16 193 -266 57 28 97 -100 -265 119 -226
4226 -226 -224 -269 -22 61 -22 28 115 71 -197 -20 -47 -82 -157 -104 91 -213 315 58 118 -12 191 -191 -24 -178
4250 -178 -11 -212 36 124 -153 -64 65 -269 -168 92 -188 -207 -204 88 293 -161 15 92 129 -34 32 22 -94
4273 -94 80 47 124 31 5 203 2 -196 148 -238 158 24 104 136 -68 -126 -125 97 23 -78 146 -49 39 -249
4297 -249 376 -184 139 200 35 -171 -34 61 98 -161 94 107 138 173 -220 80 103 -112 141 269 113 54 231
4320 231 -114 -33 205 98 -145 109 -28 -39 -36 74 -157 66 8 -21 -110 72 -57 -235 -83 -88 -56 -39 179 -168
4344 -168 -60 -103 22 227 234 -85 24 121 176 -26 312 -49 50 -23 -160 -14 -232 -292 -80 10 -113 -105 132 47
4368 47 -34 151 -17 64 248 140 -148 193 298 198 374 106 152 -60 49 -77 -94 -87 -48 -65 27 -15 -64 -119
4392 -119 -114 -14 -59 -245 -129 36 -197 282 78 -73 383 -103 27 208 67 161 303 18 -75 229 136 0
4414 0 -180 6 53 -57 -227 -19 -171 -180 169 9 -12 21 -225 -172 -133 132 -84 143 -146 195 111 60 126 -10
4438 -10 -52 -30 -34 19 -30 -64 116 -124 54 223 6 -189 -366 -198 72 13 -4 74 97 -34 170 14 37 115 188
4463 188 -103 -19 6 96 69 -184 -106 -94 -218 36 -126 -71 74 -48 -58 -89 89 148 -199 83 -252 155 -136
4486 -136 47 -144 103 120 26 50 -25 31 159 -56 -73 -209 13 38 91 -56 16 -99 -227 -174 11 104 125 -30
4510 -30 83 184 214 264 276 -22 -9 78 -237 -191 242 -21 152 -157 -174 62 -34 -159 -269 -196 -139 40 221 -47
4534 -47 115 -44 40 146 -23 -56 -43 183 -18 101 -175 192 146 172 -53 257 -63 -76 -97 -340 79 -196 -127
4557 -127 -58 15 -26 -142 9 23 146 -87 -3 119 167 290 71 -164 129 -40 242 -232 -60 76 -3 32 -77
4580 -77 -272 -73 -137 5 -177 -108 -135 -152 4 -135 -72 -10 166 261 166 -66 3 -17 84 209 40 191 153 -160
4604 -160 -150 -99 18 -146 198 -226 -251 -29 -128 -47 -56 -62 -201 -96 24 -65 -273 6 -116 235 -5 -152 -1
4627 -1 -57 164 -167 -193 -116 -148 63 -65 133 -367 42 129 -40 -272 -73 -40 -38 62 -95 227 85 117 -172 14
4651 14 78 -178 -52 -78 -69 -203 -98 -249 -144 -90 -29 -203 18 -39 -184 182 -38 218 -251 -98 -127 186 131
4674 131 203 19 88 81 -175 222 116 57 183 157 -139 -29 92 -99 -198 46 -186 271 143 11 61 68 -130
4697 -130 165 -235 -2 133 -126 81 223 33 -244 90 57 62 18 133 18 141 -182 -214 -315 35 -174 -364
4719 -364 80 -30 -74 -129 52 193 -137 -103 320 114 70 157 59 -181 -60 212 20 -82 -14 -49 -13 -139 57
4742 57 70 37 -40 -113 105 3 -51 -95 161 -202 -133 85 68 15 147 -148 201 42 80 -29 100 39 -61 -81
4766 -81 -122 -63 -90 -21 -95 250 -140 -143 -86 22 -70 -33 -90 79 -210 128 81 190 16 35 -126 170 -81 -62 -42
4791 -42 48 196 48 -74 28 -9 200 -8 -12 -98 9 97 -35 -65 9 -97 -73 9 151 -336 11 -22 -130 -32
4815 -32 -20 -180 -36 12 58 25 -73 179 116 -98 133 -182 -100 -96 92 57 -63 -119 150 46 96 11 119 258 186
4840 186 -6 -4 -69 1 196 16 0 1 -128 132 -230 -176 51 -35 -182 -322 -146 -145 -163 -261 -62 -144 -77 88 6
4865 6 -137 -95 -59 122 15 136 -1 -44 -225 70 -3 -82 -38 -44 -42 206 -18 -124 -78 12 238 4 -106 -241 -92
4890 -92 97 132 -118 120 141 16 88 109 220 -14 -78 85 56 -145 33 -17 89 -67 61 234 -14 -44 128
4913 128 98 -135 64 74 268 -48 -8 -46 98 25 109 -10 42 45 -9 56 101 -37 211 50 -80 -14 164 -64
4937 -64 -37 93 134 -131 -103 -201 -179 -317 63 90 53 58 63 226 74 23 -44 178 211 88 89 99 -68 148 -34 -141
4963 -141 -42 92 -5 -158 22 244 -149 238 187 195 -353 -23 -97 4 116 23 26 -55 223 -2 64 148 74 -161
4987 -161 12 113 -139 -107 52 166 -94 -216 -108 -73 -79 160 141 -51 -58 52 -120 111 39 -218 -248 214 -155
5010 -155 -174 -89 22 180 56 176 -52 157 -60 -122 -15 158 -14 -252 105 13 112 6 -9 -213 98 -40
5032 -40 94 -149 100 -178 -4 144 157 -8 -58 -104 -40 -75 2 117 -162 159 -149 218 39 -137 -55 109 -52
5055 -52 85 14 -30 54 43 184 -120 1 -34 86 -112 -104 171 67 -280 97 -176 39 -175 -104 -158 -122 223 7
5079 7 24 -109 -120 2 -183 -35 148 -108 202 18 99 40 254 190 71 86 83 17 72 30 -44 211 -105 -9 109
5104 109 82 -58 -321 97 235 -173 0 -129 -22 -8 -92 194 0 -118 9 -3 -3 -55 92 3 -193 -85 -125
5127 -125 121 138 34 126 27 88 -241 -64 256 90 -93 -122 92 114 10 -22 4 223 182 47 -24 -43 -39 94
5151 94 -205 55 228 -69 26 -279 140 -41 -178 -23 -24 60 123 75 193 -148 88 -81 -154 -383 -104 91 2
5174 2 43 -42 19 -133 -19 -187 -109 82 123 -23 177 126 -23 -21 -155 104 94 -60 -89 -206 -11 277 -19 -42
5198 -42 106 6 -6 -174 20 -115 59 174 -196 -170 -104 132 39 -54 3 116 -148 -23 64 56 129 92 -60 -207
5222 -207 89 -13 172 -181 91 172 -138 6 30 222 -16 45 -81 207 82 118 156 42 -78 125 -42 22
5244 22 72 -189 9 164 44 127 34 16 -148 8 -51 146 -4 184 -193 208 80 14 59 171 334 -41 -79
5267 -79 89 59 -128 74 61 -180 69 190 -119 191 143 -143 -32 0 -133 -37 -25 -115 66 45 253 -25 -40
5290 -40 107 -219 207 2 -79 70 -4 30 142 42 67 127 -103 70 -40 -133 47 13 19 119 -2 94 329 -187
5314 -187 -185 -1 -79 43 -102 -37 65 209 114 -231 -29 114 -52 113 -11 -208 -49 -67 95 -96 -4 -39 -136
5337 -136 56 57 51 -366 -264 -196 -146 119 -65 186 158 -66 -105 124 32 112 80 -12 -177 51 25 46 207 -97 -336
5362 -336 -158 -65 -113 -47 166 -95 -200 -66 -162 -166 -128 -46 192 34 -38 149 147 -79 -207 -57 -25 31 -133 214
5386 214 147 -187 -56 -153 -42 116 -13 56 210 -214 -43 161 -49 -71 63 -173 29 -71 -72 219 -71 -13
5408 -13 62 46 89 80 79 326 -9 -158 -162 -41 -76 -194 90 85 -75 112 -231 -11 -18 23 120 -57 131 -260 -142 -45
5434 -45 4 186 69 -153 -110 73 -178 -50 -76 168 43 -203 -175 208 -81 -135 -57 -114 -206 -28 275 -155 5
5457 5 41 41 55 55 -52 9 -56 -163 45 -97 -50 32 -256 -130 -155 -17 -87 -248 147 60 -105 58 115 145 -64 101
5483 101 101 -402 -58 -33 49 90 -42 -90 59 -148 2 81 -41 -252 -41 74 55 -154 -67 -72 -122 159 97 -309
5507 -309 -10 1 -144 24 62 80 46 -129 111 -78 -146 -164 10 148 -243 -12 -12 62 -91 -74 108 27 -107 -95
5531 -95 47 -126 -98 -25 182 -189 252 57 -80 87 152 218 -228 27 -126 -4 -11 70 44 140 176 -12 -82 -303
5555 -303 -126 34 282 148 65 -40 184 4 33 140 29 -122 -12 8 -62 164 -8 -75 -12 77 -149 74
5577 74 35 43 -9 -208 31 -78 -145 38 0 58 -12 -75 -67 172 125 -57 -29 173 57 117 -10 -47 99 -163 -10
5602 -10 156 30 198 -50 -248 -6 216 80 -311 40 -4 91 63 -29 98 234 62 67 -9 -31 -7 -106 24 -165
5626 -165 -31 -52 -22 -151 -39 82 90 -217 -146 -175 81 -54 197 -45 -76 223 160 -3 137 3 118 64 -32
5649 -32 -77 246 -118 -84 -113 -119 40 -59 -54 90 43 -18 -14 219 42 -60 24 43 121 196 47 334 -71 1 102 23
5675 23 52 96 126 -74 121 -11 -38 -34 -13 172 -124 -34 -1 -101 -89 -156 51 17 264 23 310 -63 -176 -95 -371
5700 -371 -117 173 47 76 82 -131 -17 -85 -162 -67 -13 -7 -81 -63 15 -8 -171 -194 -335 61 65 -179 -30 148 -46
5725 -46 40 53 -53 -44 123 71 213 -173 -53 54 -91 81 -19 150 97 71 -79 -3 -15 -86 15 181 -85 -169
5749 -169 -127 189 -105 207 93 57 -22 -48 -78 -55 14 -182 132 -100 -80 134 -129 -34 -52 -31 -61 -17 114 -71
5773 -71 21 -149 279 -45 -170 -35 253 -24 24 -47 -30 68 3 -55 -87 -79 -118 -176 158 104 4 177 196 -140 20
5798 20 28 203 21 94 -155 -60 -75 -39 -66 71 272 -47 -234 -118 -214 34 -90 57 83 76 -19 66 -43 -122 266
5823 266 57 -195 25 161 45 -118 -64 196 -67 -130 -13 -77 73 -137 116 -35 70 -209 -82 -99 -146 152
5845 152 -221 58 -28 121 -193 -206 33 90 156 79 15 162 -217 -56 -40 -47 149 279 -139 -85 330 82 5 -24
5869 -24 45 -102 -30 55 -155 -114 51 -236 270 151 -12 -98 16 8 2 122 -259 -121 -89 189 -36 134 -51 -93
5893 -93 -45 -128 -171 6 184 79 89 174 -31 27 11 -150 126 -156 -90 43 -44 -129 -125 124 -130 306 104 -64
5917 -64 -7 -361 6 160 61 15 -33 52 -153 192 -79 -20 47 15 157 -45 -141 68 -39 -152 119 -4 40 -85
5941 -85 -104 101 334 71 -142 -39 -59 126 19 -115 -16 -25 -136 183 92 -26 -13 139 253 -25 48 -74 -7
5964 -7 14 22 48 -314 -59 -35 285 90 -49 140 -153 24 -139 -42 103 8 -154 188 -21 -124 94 -23 -153
5987 -153 -246 -158 124 222 -215 -176 -64 46 -15 145 145 96 -8 61 102 -146 35 145 -63 6 6 -265 -72 90
6011 90 -246 -8 -67 99 -110 -74 -8 -42 3 123 57 -110 -57 108 7 -13 -151 223 136 -108 77 -296 -83
6034 -83 107 99 316 41 -159 -114 61 50 -20 -168 -157 -182 -78 -10 -280 -222 240 -22 -150 183 204 40 11 122
6058 122 78 -149 9 26 205 24 -77 29 -27 87 -170 -118 -98 47 -87 -109 -62 45 139 -25 252 211 -308
6081 -308 -13 74 53 246 196 15 69 -13 71 -84 189 23 76 -90 27 -119 -49 31 -306 -84 31 180 73
6104 73 -269 3 58 -85 63 91 54 -111 -148 204 -82 110 166 -229 -240 -76 -171 99 7 -224 -71 68 24
6127 24 -183 61 -124 181 -18 -116 163 -49 -58 -10 -63 122 63 55 15 -515 -23 -60 68 24 84 93 134 -41 -45 153
6153 153 82 214 156 -2 -13 20 28 -221 -19 131 84 -153 178 -259 -77 -198 67 209 55 -6 -159 -147 101
6176 101 -92 -211 -136 -77 -146 -193 67 23 53 -44 17 61 -121 112 0 -161 -96 153 36 -102 -157 -54 350 -284
6200 -284 -44 37 -123 -26 -53 -36 -22 -74 -130 -224 156 -3 193 37 -82 99 -122 -31 44 -114 28 46 -196 23
6224 23 64 -69 102 -152 -133 45 -4 -8 173 122 -216 10 35 -148 57 -154 -107 143 -341 67 -121 -92 -67 -75
6248 -75 -159 157 39 36 -80 -241 89 -26 -20 112 12 378 -309 -23 -96 54 73 132 161 -84 -120 150 65 43
6272 43 -46 -72 68 128 244 65 81 -126 240 129 36 -10 78 -163 199 -5 69 -36 -100 -22 -75 -41 12 -94 2
6297 2 210 19 263 90 -266 -274 80 174 7 74 -50 -47 -127 -97 -72 -76 106 223 121 79 59 -140 155 -175 27
6322 27 171 -80 -40 -55 -132 -18 -75 -31 144 56 -15 -238 76 124 57 -232 -37 100 150 -55 34 -50 -165 -14
6346 -14 -222 93 252 22 -47 17 -78 25 61 -215 32 -159 -103 165 89 -80 -50 148 -84 117 -235 150 -249
6369 -249 36 12 -59 -49 -76 -1 184 -70 -146 -114 114 143 -53 -25 83 -197 76 -76 -48 108 -149 22 79 12
6393 12 -27 -172 84 79 153 99 -154 -45 205 81 -50 129 321 -1 -3 362 -117 150 -65 -182 11 -188 -101
6416 -101 81 307 -4 48 75 -218 129 -66 -32 79 18 -55 90 -169 -124 -151 -46 58 89 -148 36 -112 -202
6439 -202 82 33 -111 86 -166 -116 -30 197 -167 174 -35 -192 -213 78 65 160 -129 -31 91 133 39 65 -91
6462 -91 195 -74 -23 212 -135 31 108 24 -18 62 -145 57 24 197 -62 176 65 12 -23 135 -154 -111 63
6485 63 -128 132 -146 81 140 -526 -5 -117 29 -25 46 122 -151 31 -8 40 -10 96 3 36 -134 -101 -43 23
6509 23 -12 133 132 47 -40 -95 6 -241 -194 131 313 -144 17 -51 -43 58 -94 10 30 -124 -2 32 115 299 -207
6534 -207 -148 164 66 8 -48 22 148 16 -212 -59 68 137 8 96 -49 -23 -89 83 139 -67 -171 -24 -19 41
6558 41 -198 -35 -20 -2 9 -89 -166 -108 219 159 31 -198 160 -95 -21 24 23 -120 69 -196 -7 48 -22 109 -38
6583 -38 82 137 -329 -140 -329 -7 -17 -119 -165 -136 -140 175 65 170 312 -76 -54 -170 -121 -165 -45 248 110
6606 110 215 78 211 29 282 431 -42 224 -151 -176 127 204 -192 115 -186 -68 163 -11 79 -96 78
6627 78 -24 65 -220 -211 127 134 -123 -179 60 52 70 -98 -85 59 16 138 97 -145 -160 117 -31 -32 32 -22 150 -127
6653 -127 -63 -72 58 -95 110 -103 52 124 14 89 -229 72 135 99 -187 101 -147 -174 -159 -3 213 294 -186
6676 -186 124 144 68 206 -112 -7 24 -27 59 105 -311 17 33 -148 -1 -50 8 -19 -126 41 59 -28 -43 19 -37
6701 -37 -124 -46 -15 73 -53 -47 -30 98 -178 93 63 -81 71 146 137 84 -29 -10 -111 -89 -42 -141 -51 -77 18 -117 151
6728 151 127 148 52 226 96 2 -54 -10 96 -90 1 -17 71 -3 -204 -12 -130 -22 124 159 -245 -96 -156 -90
6752 -90 -126 -58 -181 -119 272 -101 13 -261 119 -193 -200 -140 93 -45 226 -40 -47 -80 106 176 150 -27 245 -19
6776 -19 27 -26 -129 76 39 -56 110 -101 -95 -160 -97 -13 -38 -144 104 -5 -217 -374 -65 114 205 41 177 -86
6800 -86 13 -190 -161 99 -179 267 13 192 -243 -34 169 -156 144 0 -211 3 178 -70 -123 -184 51 -159
6822 -159 63 121 188 -74 167 2 -27 46 -228 63 65 -39 27 -36 258 151 -86 -10 -112 -180 21 39 -24 60
6846 60 -126 -19 211 -169 -267 -5 -34 -58 -183 284 63 171 -63 185 -26 26 64 -167 170 7 -3 35 -68
6869 -68 -73 8 -41 -46 -113 -61 200 -22 30 -37 -92 98 -45 134 92 25 38 102 8 -62 -60 137 18 -13 119 -3 -150
6896 -150 112 -12 61 150 -14 114 -181 -74 235 -201 62 -186 58 -126 -62 151 133 100 10 62 -64 -160 144
6919 144 -103 0 81 68 -71 -49 62 204 186 -106 33 -230 43 127 10 79 68 149 26 8 218 305 223 147
6943 147 -201 -140 -299 8 74 -149 -218 104 -91 123 318 -6 -43 -11 137 82 -84 -57 -220 -38 44 112 110 -81
6967 -81 119 30 -59 -141 71 -57 135 135 84 -128 -47 107 -120 143 253 38 33 50 -54 -228 -92 -26 -123 -16
6991 -16 2 59 25 127 2 63 209 -139 196 231 -30 -95 114 -27 -112 -124 31 139 43 7 4 -25 22 49 11 28
7017 28 245 85 -136 61 23 35 15 -96 -37 -20 -194 172 106 96 -74 -35 85 -72 -207 -176 -168 78 -92 -56
7041 -56 -2 211 12 -56 -39 -17 -31 86 49 -49 -40 -60 162 22 9 -28 -210 -249 -56 -93 -177 27 -29 -229 37 98
7067 98 -74 182 -12 -133 191 29 -19 -129 219 92 149 66 -52 223 -248 -60 -48 27 -42 -15 -366 191 149
7090 149 -38 142 -371 29 -177 108 -110 -332 -54 -13 127 354 -64 8 204 103 18 -120 -12 177 5
7111 5 117 31 -74 -40 -56 89 -123 239 148 -143 -186 -77 72 157 38 45 -53 152 7 -111 -49 -9 -190 61
7135 61 94 58 -6 34 163 -139 44 -24 45 4 -57 141 -234 -32 29 -77 -100 -265 -123 -46 5 -176 55 -245
7159 -245 -25 113 -70 110 -209 236 -154 149 197 -202 -100 -195 -409 125 46 -36 123 -223 -132 5 -80 -104
7181 -104 -20 -88 -100 -5 39 -77 71 -117 -108 153 26 -81 147 145 11 -48 170 -47 143 156 193 -202 76 77 95
7206 95 97 -161 -57 26 -109 -271 73 -34 -97 64 292 218 12 64 49 -70 199 36 2 63 294 -36 -358
7229 -358 -117 90 -130 47 -18 25 41 -26 -33 65 -135 -84 -78 -37 -107 33 -44 184 295 -79 73 -256 -103 -31 -160
7254 -160 53 -157 35 -257 244 216 -9 -67 -154 -199 -84 -125 2 78 -63 70 177 -8 -170 -310 28 -24
7276 -24 55 98 56 226 -31 190 135 -104 -152 32 49 -11 24 90 66 185 -177 114 241 117 -75 75 49 16
7300 16 -80 26 64 -171 -99 50 -32 -93 -74 -257 -46 6 -11 -72 -108 35 -192 97 -70 33 -67 31 122 88 43
7325 43 128 63 266 156 -57 -26 -90 197 37 -51 102 126 -186 -156 -129 213 174 77 -14 -168 -139 53 -21 -101 -79
7350 -79 -118 72 -56 8 207 183 -13 -180 -40 -177 56 54 -99 -201 -87 -7 -50 90 98 64 91 -93 72 -31
7374 -31 279 220 -81 58 114 132 118 188 20 -75 -13 35 -115 -57 172 22 -67 33 -60 86 -153 -103 -293 -202 119
7399 119 251 299 -7 66 -143 268 -12 -79 -20 -203 -140 138 -55 -111 118 155 218 -230 -161 15 -142 -231 80
7422 80 94 60 12 -307 -177 52 373 -85 51 87 164 147 69 187 -130 -26 142 5 -27 -61 -17 -2 153 9
7446 9 -154 98 -214 152 -263 40 168 83 166 32 25 -15 -3 -378 -66 188 145 -235 -46 159 196 7 -19 -251
7470 -251 97 93 -8 49 -136 61 -139 51 133 106 73 297 17 -44 -76 -238 27 1 60 -157 53 -1 -52 -83
7494 -83 -16 -81 27 -129 -165 42 -192 -67 -177 9 49 -69 109 184 32 71 -149 190 185 60 22 -10 -42 99
7518 99 -2 50 79 46 -208 122 131 111 -41 131 -67 -55 -146 103 52 -31 -2 40 -58 -93 2 86 41 112 188 86 210
7545 210 -59 352 30 -219 29 -48 63 23 -146 141 133 -37 167 11 -23 -114 -199 -176 -269 -118 -1 -24 -143
7568 -143 84 -47 96 -119 103 -46 -207 -138 88 65 43 -50 -141 196 -207 -66 -92 -67 1 -178 -123 23 -2
7591 -2 -25 -60 -202 64 164 149 8 -44 6 241 12 -169 -233 -87 129 -220 -164 138 95 -7 16 41 -26 -82 -140
7616 -140 -213 31 6 -36 2 59 109 96 20 -55 -206 -189 75 244 -46 -94 69 332 -148 64 188 54 220 -128
7640 -128 242 -35 -63 -65 -44 154 -195 68 -46 -150 210 75 155 176 -56 34 74 -79 249 41 -22 197 171
7663 171 -41 209 75 66 -1 28 14 -16 41 -191 -52 -155 203 -91 243 -17 313 207 -181 -98 -19 -87 196
7686 196 278 -79 111 107 -71 348 -94 -84 27 75 -1 211 -55 125 -77 -54 129 129 -59 -110 -40 -25 -126 -88
7710 -88 6 -68 -51 -122 16 39 90 42 61 -38 -112 131 -142 -286 110 95 -80 -90 -204 143 146 1 -8 130 19 0
7736 0 91 217 -129 -184 9 51 -131 143 -45 -5 -33 -75 -3 -318 -288 216 46 138 -66 264 -36 -170 243 -30
7760 -30 -99 85 190 -110 -45 186 131 99 147 2 -22 27 114 -226 66 171 -139 24 60 116 153 -150 -68 233
7784 233 -77 0 -26 -134 39 58 -176 99 284 -324 99 101 14 -8 184 135 -63 -52 -258 13 -72 -114 -13 162
7808 162 93 -149 92 60 79 -119 -101 32 -12 95 62 98 1 141 77 -9 -44 -131 -96 -249 53 -201 88 -11 -38
7833 -38 140 73 -148 166 173 -28 -115 42 134 -31 -2 244 -10 110 -37 -165 -74 171 203 31 21 173 175 212
7857 212 -290 86 136 -40 -89 40 24 -108 -2 104 22 -72 -13 32 333 238 119 -204 98 196 93 21 62 204
7881 204 72 -26 99 28 -163 -31 23 -267 13 -139 -270 187 65 69 -176 336 -66 90 296 61 53 -64
7903 -64 -206 185 -1 -38 -119 -95 -31 -247 -51 -75 -30 78 -109 -88 20 59 93 -26 17 257 100 -70 -162 286
7927 286 33 -102 -75 3 212 -207 95 1 20 -35 74 -324 -85 -55 58 -1 -61 233 77 232 106 -61 24
7950 24 104 254 -148 10 -143 -52 -133 65 91 2 -298 113 71 58 94 -23 87 -28 200 39 75 -103 -134 -137
7974 -137 137 -11 -64 268 -164 65 -79 -156 -93 -101 -1 -93 204 -3 -93 -15 -34 -166 132 107 -104 -139 88 -34
7998 -34 -61 -58 -307 -39 57 -223 -54 -30 -41 90 111 111 -73 -34 125 -55 27 102 -83 108 119 -3 -64 185 61
8023 61 -45 94 86 -2 70 111 -93 50 -44 -221 7 -125 37 -77 45 -274 29 -103 -8 -168 -74 -56 -48 -154
8047 -154 148 -208 -99 22 -90 87 0 -1 -119 -75 -164 -21 -136 59 253 128 26 -50 30 -78 164 49
8069 49 -139 -170 79 -2 -46 -3 6 96 -43 37 39 -106 -149 231 69 -22 -147 308 205 96 -109 -218 16 -232
8093 -232 -74 143 -2 -265 162 93 102 205 -58 -159 -22 -122 25 28 52 -144 -121 158 47 -120 -25 119 103
8116 103 73 47 32 -51 -152 -128 -4 -115 -198 63 -133 -22 104 -10 -71 24 -125 -62 9 -41 24 -75 -110 183 120
8141 120 18 -70 -49 84 -97 42 77 59 24 -133 -10 -97 195 243 85 89 22 -182 45 -64 37 53 242 62
8165 62 8 25 239 216 -108 -29 128 -4 -112 56 161 94 110 -20 -78 131 75 88 -49 -11 154 -127 -51 -35
8189 -35 197 253
8191B53
$$ Imaginary data points
##PAGE= N=2
##DATA TABLE= (X++(I..I)), XYDATA
0 0 0 0 0 0 0 0 0 0 0 0 0 -8 8 -8 8 -16 16 -17 24 -32 32 -40 48 -57 65 -80 92 -105 121 -142 161 -184 209
33 209 -237 266 -301 336 -376 424 -472 525 -583 647 -717 792 -876 965 -1065 1173 -1293 1425
51 1425 -1570 1731 -1911 2110 -2336 2593 -2889 3234 -3637 4124 -4722 5474 -6460 7807 -9771
66 -9771 12917 -18793 33620 -159121 -235420 -74368 -150935 -41473 52254 19034 -8323 34798
78 34798 -25159 -12962 57826 56154 68349 185113 199988 159196 171174 139682 37714 3316
90 3316 -26574 -75082 -66374 -45217 -71080 -66836 -60143 -90774 -103465 -101451 -126723 -118599 -85040
103 -85040 -75780 -44050 23960 59797 81512 111189 116625 113597 114067 87519 74213 83210 54314
116 54314 25399 41191 28190 -9373 -6266 -20598 -75150 -90981 -97934 -138050 -131031 -88461 -87980
129 -87980 -68250 -4360 10395 3855 41044 50852 23280 36096 55352 43906 63684 102862
141 102862 100647 94217 100520 67522 14593 -14319 -44348 -78633 -83363 -76166 -71373 -54927 -41133
154 -41133 -44480 -45881 -46283 -59119 -64751 -47699 -22965 5720 41615 74669 95818 101757 90822
167 90822 71025 52031 33833 16418 7930 9776 13491 11232 2422 -7396 -23415 -50608 -74008
180 -74008 -84649 -89332 -83793 -65606 -44395 -21386 5834 20720 23464 34549 42309 31797 29553
193 29553 43573 48104 48071 60056 64880 55443 44304 26773 -2199 -26402 -41410 -58009 -67259
206 -67259 -59565 -49429 -44820 -36435 -26596 -25037 -27644 -26219 -22895 -16522 -2520 15949 32115 51513
220 51513 69901 72024 64213 60106 47870 24246 7239 -259 -8253 -12595 -13189 -15667 -16259 -20929
234 -20929 -38603 -51961 -53772 -61673 -66052 -49017 -27886 -12424 10619 30488 36767 41487 42600
247 42600 31373 25490 30598 29432 28735 39115 44778 38131 28966 15235 -5748 -24897 -40872 -54035
261 -54035 -57750 -50994 -42071 -34884 -25693 -13735 -9921 -14958 -14008 -6555 -4510 -259 16128 32649
275 32649 42700 52946 57718 52084 45091 32456 11509 -1601 -5287 -14980 -20985 -15074 -12489 -17378
289 -17378 -21368 -26538 -35630 -41191 -44573 -44874 -34570 -17683 -3443 10987 27483 36516 36856 34009
303 34009 28721 23489 20099 17328 17544 23300 27163 22416 14758 8933 -3700 -23706 -36542 -40609
317 -40609 -45268 -45256 -34854 -24289 -15141 -4374 996 -1360 402 2772 -1546 447 13614 23594
331 23594 29925 40704 45991 41477 33536 20259 3614 -8421 -15961 -22821 -23376 -16261 -11459 -12471
345 -12471 -14667 -16402 -21135 -30072 -34259 -28952 -20588 -12112 1444 17550 29107 34039 34128 30322 25054
360 25054 17545 10125 7551 9099 10230 12247 13152 9569 3318 -6646 -21411 -33380 -37786 -40519 -40128
375 -40128 -28617 -14317 -4996 4107 10076 9730 8473 6583 1628 2522 12858 19807 23506 32902 39668
390 39668 32329 21028 12577 81 -14315 -22357 -24795 -23646 -19397 -14462 -11183 -9808 -9819 -15842 -22723
405 -22723 -23597 -21701 -17570 -8466 5833 19438 29766 36201 36160 31590 24562 14767 4688 730 2156
420 2156 2763 3617 6376 6858 783 -9843 -20293 -28787 -34587 -38169 -35133 -23536 -9809 -1891 5733
435 5733 15224 15394 8264 6292 5999 4015 8041 16694 21955 28292 34077 29089 19075 11945 -113
450 -113 -16800 -23730 -24491 -26328 -21860 -14174 -10898 -8038 -6239 -11182 -16812 -16661 -15895 -14850 -7242 6589
466 6589 18882 26514 31575 34420 30212 19051 8825 3422 -1492 -3720 -973 3106 6136 6413 81
481 81 -7471 -13885 -23844 -33008 -32443 -27681 -22087 -10623 659 7173 13271 15941 10625 7468 8486
496 8486 5265 4287 11890 17131 19927 24634 22846 15572 9898 -1664 -17038 -22293 -21997 -25126 -21849
511 -21849 -10191 -4521 -3661 -1976 -3816 -8112 -10921 -13787 -12808 -4135 5463 12577 21620 28970 28476
526 28476 22948 15732 7840 737 -4539 -6901 -5240 -1921 -132 363 -1363 -5647 -10940 -17685 -24431
541 -24431 -24878 -19875 -15205 -7897 3901 13324 16618 16860 15069 11984 7165 2376 1423 5582 9363
556 9363 11308 14821 16949 11644 3521 -4909 -13930 -20437 -23122 -23437 -19164 -10690 -4530 -2101 1752
571 1752 3018 -1587 -4488 -4096 -4133 -113 8076 13649 18419 24849 25240 17901 12049 7013 -2508 -10122
587 -10122 -11911 -10828 -9166 -6898 -4768 -3557 -4040 -9195 -14487 -15888 -17001 -17164 -12373 -4022 4848
602 4848 12920 17641 19947 19414 15435 8823 4375 3335 3370 4908 7569 9843 10174 6281 -705 -7648
618 -7648 -13996 -20531 -24139 -23365 -18850 -11743 -5360 -1493 3549 6855 3655 742 2193 3120 2366 5816
634 5816 12180 16648 19593 20322 17797 13478 6360 -2868 -10229 -12336 -13595 -13195 -9921 -5927 -4047 -4919
650 -4919 -7986 -10304 -12649 -14979 -14110 -9409 -2991 5689 13145 16822 19951 21329 15567 8436 6343
665 6343 4224 166 377 3380 4906 4650 2641 -1263 -5099 -10439 -17723 -21185 -19086 -16475 -13176 -6032
681 -6032 1333 5647 7095 6868 5588 4506 2416 1794 4736 9226 12577 15110 17231 15969 11032 3510
697 3510 -4288 -10269 -13615 -15020 -14318 -10928 -5768 -2896 -3787 -4259 -4225 -6749 -10967 -9904 -4466 -808
713 -808 4141 11726 17226 18453 17550 13724 8214 4499 709 -3802 -3634 -401 101 -318 1211 -164
729 -164 -5373 -10156 -13755 -17330 -17216 -14157 -10624 -3682 4691 8435 9313 10995 10194 5547 2836 1989
745 1989 3110 6851 9595 11116 13756 12966 6422 -486 -5096 -11054 -16468 -16777 -14095 -10971 -6812 -3243
761 -3243 -1697 -73 -1389 -4201 -5349 -4629 -2745 859 5899 11386 16705 18160 17046 14256 9316
776 9316 2767 -2306 -5959 -7108 -4665 -2731 -2808 -593 33 -5898 -11116 -12508 -15286 -17601 -13604 -7336
792 -7336 -1264 5746 10093 11858 13420 11574 6329 3985 4371 3843 4484 8373 10540 10432 9734 4877
808 4877 -628 -5782 -12155 -16370 -16943 -15205 -11909 -7335 -3611 -482 1464 162 -2428 -3340 -3027 -2502
824 -2502 309 5827 11954 16355 16893 16566 14973 8822 993 -2780 -4918 -7128 -6404 -3848 -1941 -945
840 -945 -1882 -5557 -8968 -11253 -14686 -15810 -11601 -6003 -1419 4838 10522 12274 12401 10607 7067 4051
856 4051 2593 2434 2656 5080 8112 9055 7060 4605 1435 -4998 -11272 -14249 -14707 -13736 -11434 -6945
872 -6945 -1857 1434 2015 1084 327 -1131 -3368 -2803 1114 5439 9341 13131 14712 14479 11498 5780
888 5780 -31 -3490 -6515 -8486 -7325 -4722 -2443 -1215 -1088 -3321 -5298 -7430 -10361 -11021 -8043 -4138
904 -4138 -728 3810 9515 12360 11164 9662 7655 4145 698 -679 305 2269 4077 4721 5009 3460
920 3460 -558 -6023 -10292 -12405 -13659 -12978 -9152 -4062 328 3070 4393 4478 3288 1260 -139 -15
936 -15 1867 4723 7085 9661 11585 10938 8030 3481 -378 -3797 -7966 -10331 -8568 -5927 -4805 -3440
952 -3440 -1093 -1197 -3709 -5647 -6797 -7050 -5709 -2792 763 5989 10821 12049 12221 11722 8734 3927
968 3927 990 -984 -1319 -787 598 1360 1652 451 -2820 -6225 -9255 -11106 -12075 -12018 -8934 -3677 22
985 22 2373 5490 6785 5412 3164 2620 2511 3104 4415 6347 9074 10500 8937 7021 5042 22
1001 22 -5103 -8371 -10522 -10809 -8854 -7068 -4737 -1752 -1156 -3030 -3516 -4138 -5356 -4400 -1409 1129 5649
1018 5649 10447 11341 11752 12320 8961 3832 1353 -240 -2024 -1709 -1225 71 718 -859 -3230 -4920
1034 -4920 -7474 -10749 -11410 -10749 -9166 -5599 -1171 2167 6125 8013 6502 5284 4948 2757 2312 3849
1050 3849 5167 6369 8057 8015 6292 4281 277 -4613 -8417 -10031 -10891 -9465 -6826 -4029 -1375 -757
1066 -757 -2015 -1889 -2058 -3711 -3402 -614 1815 3922 7656 10339 11656 10998 8584 4650 2020 -1173
1082 -1173 -3694 -3749 -2494 -2226 -1590 -1226 -2039 -3994 -5892 -8695 -9889 -9173 -7997 -4702 -392 4022 7059
1099 7059 8356 7922 5880 4684 3221 1266 2033 4185 4483 4511 6166 5749 2083 -1204 -4453 -8082
1115 -8082 -10728 -10941 -9671 -6666 -3638 -1796 -475 1102 691 -700 -801 -318 280 2065 4652 7518
1131 7518 9939 11250 10322 7656 4169 464 -3080 -5409 -6023 -5351 -4243 -3454 -2158 -1780 -3486 -5747
1147 -5747 -7163 -7998 -8116 -6960 -3262 1301 5786 7825 9106 10018 7989 5009 3531 2747 1517 1918
1163 1918 2972 3528 4272 3496 400 -2300 -5096 -8756 -11173 -10718 -10063 -7987 -4392 -1541 368 2030
1179 2030 2867 1385 476 872 1209 2317 4577 8130 10209 10385 9795 7875 3785 -540 -4089 -5810
1195 -5810 -6443 -6219 -5271 -3684 -2319 -2666 -4294 -5083 -6133 -7384 -7314 -4955 -2195 1012 4996 7529 9136
1212 9136 9659 8545 5936 4039 2403 1258 1319 1769 2469 3479 2852 2 -1673 -4504 -8491 -10835
1228 -10835 -10566 -9214 -7414 -4230 -778 1801 2726 2700 2086 1470 959 923 1954 4367 6907 8243 8737
1245 8737 8645 6344 2532 -662 -3796 -5572 -6682 -6062 -5110 -3372 -2016 -1838 -2683 -3475 -4375 -5582 -5579 -4423
1263 -4423 -1381 1734 4290 6976 9142 8769 7167 5366 3391 880 -562 -696 84 709 1178 1172 49
1280 49 -1721 -4733 -7132 -8559 -8541 -7727 -5708 -2238 863 2891 3740 4079 3092 1950 1588 1163 1420 3619
1298 3619 5434 5948 6517 6488 4214 907 -1706 -4144 -5999 -7187 -6866 -5570 -3664 -2543 -1715 -544
1314 -544 -720 -2303 -3007 -2440 -1620 -449 2085 5111 7158 8419 7848 6737 4821 1925 -564 -1504 -1788
1331 -1788 -1697 -1106 -248 -548 -812 -2427 -4774 -6368 -7351 -7186 -6544 -4523 -1237 1605 3220 4551 5889
1348 5889 5499 3833 3031 2602 2345 2579 3640 4214 4919 4403 2667 308 -2090 -4903 -7016 -7682 -7257
1365 -7257 -6436 -4715 -2357 -897 -313 -170 -634 -1578 -1605 -891 802 2566 4997 7043 7900 7718 6785 4932
1383 4932 2360 -398 -1913 -2762 -2899 -3104 -2134 -1501 -1715 -3053 -3893 -4998 -6241 -6698 -5464 -3467 -1304
1400 -1304 1252 3656 5207 6311 5308 4472 3620 2243 1445 1420 2319 3214 3484 3465 2389 548 -1910
1417 -1910 -4281 -6300 -7611 -6850 -5803 -4494 -2355 -99 325 101 434 -50 -554 -285 719 2404 4634
1434 4634 5462 6504 6990 5977 3810 1642 -412 -2150 -3797 -4066 -3262 -2409 -1761 -1406 -1291 -1973 -3570
1451 -3570 -4122 -4789 -4975 -3187 -974 1132 3492 5811 6067 5497 4491 3157 1648 641 -32 971
1467 971 1694 1823 1815 1697 310 -2290 -4235 -5009 -6295 -6354 -5175 -3370 -1401 544 1493 1963 2308 1505
1485 1505 398 416 666 1558 2749 4228 5336 5413 4996 3213 841 -1676 -3165 -4536 -5235 -4174 -2572
1502 -2572 -1886 -1306 -355 -966 -2475 -2959 -3373 -3081 -2265 -60 1775 4255 5696 5810 5740 4741 2863 627
1520 627 -324 -799 -868 -272 546 785 514 -658 -1863 -3804 -5096 -5840 -6288 -5100 -2653 -960 1122 2853
1538 2853 3388 3171 2503 1418 447 1223 1671 1928 3258 5226 4773 3712 2726 728 -2074 -3960 -4767
1555 -4767 -5489 -4333 -3493 -2322 -750 6 -925 -1413 -1660 -2483 -2834 -1417 383 1739 3922 5404 5466
1572 5466 5078 4396 2797 793 -391 -1063 -1411 -1129 -230 446 578 -400 -1610 -3092 -4279 -5149 -5500 -4178
1590 -4178 -2286 -853 1042 3306 3501 3161 2372 1591 288 303 510 1457 2968 3948 3669 3408 2226 78
1608 78 -1882 -3113 -4331 -4807 -3654 -2825 -1832 -495 505 259 -380 -544 -1654 -1913 -1204 117 1662
1625 1662 2476 4209 4871 4458 3594 1867 -194 -1177 -1572 -2200 -1466 168 568 196 399 -715 -2040 -3047
1643 -3047 -3550 -3832 -3085 -1600 -41 1774 3329 3564 2946 2569 1507 178 26 -128 70 895 1952
1660 1952 1862 1744 1473 -576 -2000 -2990 -3536 -4274 -3372 -1896 -784 274 1422 1572 1218 422 -231 -951
1678 -951 -321 312 1132 2049 3637 3794 3130 2679 1284 -793 -1928 -2681 -2998 -2520 -1468 -452 -267 -200
1696 -200 -413 -1503 -2252 -2578 -2488 -1663 -624 992 2316 3447 3754 3466 2911 1941 296 -326 -115 -136 -117
1715 -117 540 1208 715 161 -315 -1798 -3006 -3568 -4021 -3605 -2279 -1013 233 1563 1899 1506 1248 1122
1733 1122 -29 -61 1149 1740 2528 3402 3679 2552 2408 942 -1008 -2138 -2919 -2952 -2954 -2161 -1405 -821 -221
1752 -221 -234 -859 -1087 -1663 -1922 -1750 -709 689 1633 2725 3751 3621 3017 2061 1069 -267 -491 -467 -446
1771 -446 157 677 917 333 -407 -1857 -2837 -3290 -3597 -3302 -1911 -794 -24 1333 2041 1588 1613 1153 621
1790 621 -246 91 639 1371 1997 2302 2489 2095 1029 -376 -1346 -2393 -2777 -2688 -2220 -968 -504 -60 481
1809 481 79 -687 -1324 -1472 -1336 -991 438 1316 2449 3143 3318 2881 1674 659 -209 -1067 -1402 -1091 -198
1828 -198 135 99 515 -71 -915 -1704 -2516 -2594 -2577 -1654 -711 533 1695 1945 2033 1868 1000 309 -51 -239 -66
1849 -66 518 1314 1621 1779 1468 795 -377 -1698 -2667 -3030 -3147 -2227 -988 -306 214 1253 983 250 -321
1868 -321 -516 -889 -197 274 1399 2558 2896 2651 2314 1546 305 -769 -1460 -1843 -1538 -1232 -656 -98 144
1887 144 -192 -761 -1553 -2297 -2586 -2086 -1569 -590 594 1731 2781 2898 2668 1878 1164 101 -189 -72 339
1906 339 703 1388 1584 948 186 -773 -1739 -3019 -3009 -2930 -2211 -1498 -581 504 1067 779 302 103 96 -389 -210
1927 -210 770 1700 2215 2971 3238 2571 1855 750 -230 -1223 -1894 -1613 -1887 -1336 -636 -446 -402 -638 -1623 -2107
1947 -2107 -2459 -2232 -2070 -625 382 1455 2243 2770 2723 1963 976 444 -42 45 358 979 1102 1336 1316 653
1967 653 -504 -1762 -2282 -2838 -3000 -2327 -1684 -646 -46 432 738 473 151 -364 -240 -151 274 1399 1929
1986 1929 2425 2685 2682 1545 927 -103 -1142 -1814 -1689 -1638 -888 -233 -179 -53 -159 -898 -1941 -1987 -1758 -1663
2006 -1663 -704 693 1462 1865 2201 2394 1781 851 463 -136 -296 135 281 781 842 665 310 -270 -1159 -1746
2026 -1746 -2522 -2034 -2136 -1788 -245 518 538 1008 1041 339 134 -195 -217 286 823 1541 1869 2274 1900 1270
2046 1270 507 -602 -1282 -1888 -1822 -1715 -1164 -630 -131 -90 -305 -250 -895 -1147 -1062 -392 -179 659 1538 1985 2472
2067 2472 2594 1651 1231 650 -297 -513 -484 -151 -153 211 398 -470 -915 -1273 -1883 -2567 -2420 -1855 -1253 -531 542
2088 542 1273 1535 1541 982 866 568 349 563 976 1226 1670 1854 1941 1054 180 -406 -1438 -2158 -2150 -1864 -1546
2109 -1546 -1306 -847 -355 -374 -409 -890 -775 -762 -519 -136 877 1622 2047 2439 2826 2393 1341 914 28 -551
2129 -551 -192 -350 -321 -182 -63 -485 -678 -1500 -1870 -2385 -2579 -2297 -1385 -759 22 934 1171 1107 1116 856 885 584
2151 584 653 921 1303 1567 1753 1745 1373 650 -262 -770 -1765 -1724 -2131 -1863 -1380 -1012 -621 -165 -119 -506 -699 -472
2173 -472 -578 -606 363 1196 1710 2184 2239 1932 1390 1018 371 -261 -483 -597 -405 -25 85 -120 -334 -966 -1585
2194 -1585 -2010 -1649 -1641 -1397 -787 213 741 1202 1553 1515 1207 698 722 461 645 515 965 1208 1204 913 462
2215 462 -210 -1163 -1419 -1675 -1869 -1906 -1113 -415 -85 -88 400 102 86 -404 -277 142 349 758 1771 1910 1995
2236 1995 1998 1238 669 -115 -813 -1023 -1025 -1096 -846 -470 -529 -737 -581 -1043 -1205 -1576 -1343 -1096 -457 277 1086 1670
2258 1670 1985 1686 1205 920 633 240 267 76 471 606 547 581 -103 -945 -1237 -2139 -2420 -2130 -2013 -1224 -627
2279 -627 -85 471 602 560 186 476 297 161 665 1304 1614 2022 1844 1687 1221 431 -14 -923 -1426 -1314
2299 -1314 -1405 -1317 -666 -296 -638 -847 -1225 -1294 -1430 -1559 -917 -144 525 986 1846 2085 2155 1759 1132 880 309
2320 309 428 260 517 596 571 385 147 -696 -1357 -1571 -2230 -2438 -1608 -1353 -678 -301 238 686 781 404 216
2341 216 299 498 406 1073 1442 1823 1837 1879 1585 531 258 -489 -1028 -1536 -1504 -1132 -809 -911 -561 -488 -845 -1289
2363 -1289 -1509 -1238 -859 -364 250 1097 1411 1796 1881 1344 1167 685 498 338 -16 203 410 614 277 -53
2383 -53 -616 -823 -1440 -1705 -1701 -1495 -1400 -581 -58 438 698 634 722 253 301 310 445 822 987 1370 1570 1308 712
2406 712 730 -308 -971 -1295 -1199 -1072 -893 -818 -498 -215 -545 -483 -641 -704 -556 -456 -181 170 928 1382 1242
2427 1242 1395 1305 865 564 112 -95 -109 -222 -357 17 -170 187 -555 -823 -1181 -1517 -1526 -1240 -1118 -211 -12
2448 -12 690 973 931 1085 529 480 345 667 636 920 954 1260 1033 677 279 -435 -904 -1184 -1422 -1381 -1120 -1039
2470 -1039 -443 -120 -376 -153 -333 -360 -131 -102 84 390 963 1279 1609 1610 1298 805 644 -33 -300 -839 -396
2491 -396 -150 -127 -448 -198 -612 -1026 -1420 -1344 -1587 -1083 -844 -619 94 804 814 1132 1036 990 789 430 557 583
2513 583 792 1134 834 905 797 253 -483 -1033 -1060 -1701 -1497 -1491 -997 -745 -491 -110 -170 -157 -277 -448 -247 8
2535 8 302 889 1186 1409 1274 1634 979 656 228 -94 -514 -627 -79 -477 -473 -274 -600 -678 -1146 -1269 -1356 -978
2557 -978 -731 -551 -106 748 785 894 1121 862 356 694 633 377 159 468 797 774 739 352 -203 -772 -787 -1299
2579 -1299 -1195 -1116 -823 -619 -169 -171 -92 63 198 -198 -176 144 414 273 794 1220 1152 1125 630 383 70 -238
2601 -238 -600 -435 -443 -469 -329 52 -314 -360 -558 -663 -715 -882 -605 -300 -40 610 840 739 822 1177 649 443
2623 443 184 105 102 80 217 478 335 -60 -474 -657 -938 -1128 -1280 -717 -681 -607 28 371 552 375 120 306
2645 306 -105 350 701 429 994 847 952 801 902 -29 -223 -647 -861 -987 -495 -784 -710 -367 -94 -456
2665 -456 -641 -395 -698 -540 -295 -50 137 807 1109 1426 1148 1155 669 248 192 -96 -92 146 73 -103 159 -238
2687 -238 -540 -905 -1062 -1137 -1136 -970 -761 -449 135 235 337 437 475 603 407 611 479 524 527 1163 1117 821 567
2710 567 37 -323 -624 -664 -1006 -1159 -581 -256 -558 -371 -426 -566 -635 -730 -532 -480 269 211 399 998 1084 1090 931
2733 931 576 447 100 43 -7 59 -50 -90 -35 -41 -223 -609 -1077 -1125 -1076 -770 -718 -524 133 158 277 428 456 171
2757 171 53 415 242 576 712 838 942 669 494 142 -204 -536 -783 -733 -640 -813 -476 -77 -63 -178 -63
2778 -63 -151 -152 -543 -249 -101 130 544 754 834 844 704 643 104 112 -42 -250 -352 -266 -233 -67 13 -237 -205 -319
2802 -319 -701 -769 -649 -457 8 591 208 768 539 525 350 380 112 202 367 294 381 313 534 20 59 -622 -369
2825 -369 -853 -792 -965 -488 -400 -241 166 303 40 196 -78 93 180 138 353 366 683 731 631 769 467 133
2847 133 -265 -466 -414 -338 -362 -398 -438 -397 -203 -380 -862 -719 -343 -577 -443 -211 290 719 756 853 760 548 464
2870 464 305 286 375 223 281 361 321 184 -174 -272 -322 -712 -899 -691 -780 -401 -399 -273 -9 106 157 28 -84 78
2894 78 250 690 626 729 1228 715 599 444 200 -43 -410 -391 -466 -159 -538 -605 -310 -237 -365 -482 -646 -605
2916 -605 -529 -474 -45 71 504 412 424 598 718 673 461 443 190 -80 135 193 418 294 -67 -251 -245 -786 -585
2939 -585 -707 -741 -562 -268 163 217 71 0 104 -59 -57 -184 127 377 740 607 853 602 212 182 -74 -372
2961 -372 -496 -295 -448 -468 -278 -122 -379 -367 -227 -94 -164 -372 -263 -162 222 381 579 440 468 426 290 245
2983 245 -38 -82 303 20 -59 252 32 175 48 -224 -611 -702 -653 -324 -153 51 -27 230 531 171 187 16
3005 16 -50 195 50 313 254 422 334 299 455 37 -372 -475 -446 -420 -602 -189 -472 -188 -276 15 89 -214 -246
3028 -246 -472 76 260 250 403 598 678 604 491 285 303 -172 -184 -150 -145 -287 -72 -278 -279 -161 -430 -437 -814 -735
3052 -735 -407 -130 -95 238 331 503 352 454 324 437 -4 264 155 400 485 576 351 328 1 -243 -291 -549
3074 -549 -539 -657 -524 -161 -109 -101 -171 -141 -118 -399 -366 90 223 140 361 578 680 513 546 724 195 60 115 -125
3098 -125 -159 37 242 -45 -386 -166 -255 -487 -693 -412 -400 -492 -22 37 190 427 187 239 551 349 297 235 293
3121 293 138 259 280 450 187 -109 -253 -327 -322 -640 -467 -144 -329 -264 -47 -152 -72 -74 -154 -126 -231 158 149 137
3145 137 434 616 487 512 204 -171 -169 -106 -107 -278 222 124 104 28 -12 -132 -373 -403 -407 -339 154 -130 25 389 513
3170 513 429 241 100 143 53 25 -35 80 147 18 156 221 32 -196 -416 -237 -450 -513 -98 8 -186 145 54
3193 54 119 254 -66 -151 -5 -27 214 163 7 398 256 284 -22 49 -149 -104 -152 -334 -232 -269 -80 61 -139
3216 -139 -221 -398 -41 -153 -69 141 112 301 467 363 343 331 464 51 64 132 -232 -13 -56 -237 -75 -96 -298
3239 -298 -256 -412 -657 -577 -488 -362 -133 108 -55 208 9 175 120 324 199 -24 188 227 429 255 210 94
3261 94 19 -56 -434 -150 -253 -195 -368 -308 -26 81 -108 -53 -164 20 -235 -210 36 48 397 389 493 261 432
3284 432 268 318 59 103 13 -373 -204 109 -79 -206 45 -277 -209 -227 -428 -402 -332 -101 -70 183 204 120 155 151
3308 151 384 122 40 29 132 123 141 143 351 210 23 -26 -273 -249 -375 -305 -183 -112 147 -20 17 -1 -152 -165 -99
3333 -99 -132 334 107 186 353 299 201 244 116 -188 -125 -221 -90 -250 -35 -106 19 86 -215 -222 -216 -194 -85 -223 35
3358 35 103 30 220 111 256 10 60 180 81 -307 224 -69 165 -7 -182 -95 -203 -211 -328 -95 -477 -254 -80
3381 -80 50 160 317 70 148 98 -127 69 68 136 187 162 357 288 522 116 56 -134 -215 -623 -272 -83 -193 -37
3405 -37 -182 -105 6 -117 -156 -504 -181 -89 -51 125 126 339 340 331 315 197 19 81 239 -86 65 154 71 -89 69
3430 69 -136 -182 -388 -519 -456 -298 -92 -187 354 182 247 53 -7 -186 -57 248 47 321 191 204 397 516
3452 516 423 -53 38 28 -278 -62 -210 -315 -407 56 -209 -156 37 -221 -327 -232 -186 -263 15 7 205 470 472 89
3476 89 3 249 207 -68 90 -31 50 86 -28 70 -55 147 -292 -370 -412 -350 -59 -1 -58 30 164 181 163 122 215
3501 215 66 -39 120 47 201 170 329 109 114 189 100 -121 -150 -112 -48 -281 -313 222 -58 50 -81 -147 -53 -171
3525 -171 -396 79 -6 168 9 239 138 -15 -56 83 -217 -419 39 96 127 111 220 -14 -444 -73 -325 -214
3547 -214 -148 -42 -56 8 522 -67 187 346 127 25 -16 41 -1 195 2 -31 -38 15 -105 -241 -341 -48 -133 -170
3571 -170 -81 -205 36 -214 165 17 -71 89 -215 -97 -49 86 9 329 39 -134 178 314 -39 -126 13 -79
3593 -79 -124 -270 -133 -67 -63 -39 -86 120 79 -314 -234 -33 251 150 95 145 182 408 222 167 90 191 24 -99 238
3618 238 308 57 58 119 -147 -53 -12 -158 -226 -317 -176 -102 -143 170 1 -106 -91 79 59 15 -12 -98 104 429 115
3643 115 181 181 159 29 119 103 -165 -54 -146 -138 -112 -225 -164 -88 -250 -324 -361 -213 -150 1 -92 65 127 258 154 101
3669 101 41 -79 130 109 30 98 21 161 -95 -11 -34 23 -23 -259 -297 -349 -123 -105 -24 213 8 -76 -80 7 134 81
3695 81 218 561 104 54 231 133 23 -182 59 23 -84 -8 73 -118 82 -33 -112 -9 0 69 90 -16 -237 184
3719 184 27 61 -47 244 138 -38 85 -233 1 -163 83 158 -64 37 62 70 -126 -100 -1 -280 -234 -44 240
3742 240 -27 207 210 -62 -19 -51 -14 -47 -162 55 2 83 -49 170 30 261 15 -79 182 -283 -126 -211 146
3765 146 -109 -3 6 64 -87 -65 -8 94 -36 -15 36 106 53 270 68 10 15 6 -141 100 71 -11 211 -90 -84 -119
3791 -119 -14 -97 -235 -104 -76 -172 100 158 144 189 67 239 41 153 9 -81 161 17 72 169 207 46 82 334
3815 334 7 -242 -254 39 -184 -80 -144 -168 -160 -258 -225 123 -329 -46 -297 77 147 -252 340 150 74 209 180
3838 180 209 35 -25 -127 11 -117 -19 26 -119 -83 -193 -164 -143 -313 -226 -264 141 -187 131 189 27 -165 222
3861 222 114 138 192 132 211 119 90 -114 207 -147 32 121 -308 -149 33 -67 -170 107 -1 94 -164 119 33
3884 33 23 -133 223 123 -141 78 -29 71 194 161 161 137 -37 -139 90 -81 116 120 223 -25 0 -65 -145 -145
3908 -145 -11 -293 210 37 76 -85 44 -196 -180 -190 211 -59 -28 -68 31 71 -7 263 129 -52 88 -133 -149
3931 -149 -8 39 159 13 231 23 186 -181 202 126 93 16 -234 100 -69 27 -145 -154 77 -44 -134 -92 -321
3954 -321 -34 -12 55 -49 178 239 69 52 -213 90 208 108 -5 281 61 210 -125 86 105 41 199 -85
3976 -85 -149 92 76 -89 115 -77 75 43 63 -62 47 65 -127 44 147 -6 208 -10 99 119 75 57 -84
3999 -84 -34 -20 57 159 95 14 7 -92 -94 -248 -104 108 -96 -278 -149 -22 -108 -39 35 -124 5 3 -61 182 -41 153
4025 153 16 132 86 105 82 -47 -113 -172 -71 -209 118 61 18 123 -27 16 -95 -230 -78 12 109 121 5 47
4049 47 64 66 -34 2 -17 249 12 91 301 75 259 -25 8 -65 130 126 -153 -336 1 -103 -120 -261 43 -124
4073 -124 -108 -34 16 -10 -321 76 -93 30 -20 121 -70 -49 104 -31 -58 14 -14 -12 -88 25 180 -66 133 90
4097 90 92 60 83 142 -14 111 8 -7 -143 189 23 -296 -118 19 -210 -307 75 128 74 252 66 73 22 -90
4121 -90 -257 -79 -99 179 44 -17 58 173 34 49 57 -38 -29 -95 -30 54 142 208 227 -135 -132 99 -99 -190 32 -163
4147 -163 -144 5 -14 -15 46 -23 -208 260 15 230 -168 308 -74 98 208 92 128 -139 -110 -58 -252 -118 75
4170 75 -182 86 -9 -81 -222 -135 -85 36 -72 -196 -265 65 51 16 -52 37 123 -159 -143 -84 14 8 181 314 244 241
4196 241 124 -121 -113 -82 48 -12 89 -190 -192 140 -9 -155 -58 -13 -312 49 -113 -118 247 46 143 171 70 293
4220 293 -162 -31 85 -134 -135 -331 91 -93 -10 -74 40 -284 -203 -238 -428 31 3 -33 -141 2 106 -183 -34
4243 -34 225 -169 -112 -57 3 176 6 105 131 22 145 -168 -92 -40 -227 29 -35 -19 82 114 164 -152 -236 -124
4267 -124 116 -40 184 11 -150 -28 34 8 -50 197 -33 207 -155 78 -43 -225 -106 -93 88 -3 -18 -270
4289 -270 -154 173 -263 141 -56 -101 224 205 -66 -176 58 -23 100 -14 66 -186 -6 109 -44 38 150 -279
4311 -279 -169 -283 -67 -7 36 95 -138 142 217 40 -142 -99 -36 195 33 -4 249 181 16 188 -16 75 -110
4334 -110 -207 -232 103 -237 -318 -78 58 -163 22 97 -219 160 -44 -215 -18 3 95 208 159 150 122 47 1 -95
4358 -95 192 149 87 64 48 31 174 -145 25 -110 -179 -57 1 -223 -36 -37 33 14 149 80 32 -157 432 36 88
4383 88 1 139 173 148 97 -49 94 -198 -125 -197 -177 -40 -41 54 31 -118 -161 -187 2 141 88 -95 72 -130 113
4408 113 40 228 140 91 273 -77 25 127 80 -66 306 15 68 61 113 230 -121 5 -208 -63 152 -37 -149
4431 -149 40 90 114 -12 -126 87 -54 -268 -102 -11 -67 -137 22 48 151 80 -22 -7 29 97 48 216 -18 43
4455 43 -32 28 -150 -150 -123 88 114 118 145 221 162 -1 -107 64 133 -61 75 -108 32 -3 -5 -8 150 -146 70 -335
4481 -335 16 -210 -86 232 228 179 -1 -141 77 25 -114 -65 99 -131 -299 248 99 221 105 59 -151 49
4503 49 101 -120 -64 -199 -284 -100 -334 -101 37 78 74 -145 -111 -18 145 249 20 32 179 139 51 6 -166 -50
4527 -50 -186 -20 -74 -319 -21 -250 -181 -249 99 1 -195 -97 -215 23 -44 116 81 -3 249 242 122 -49 -49 49 67
4552 67 198 222 -77 65 -98 34 -378 -381 -245 19 13 82 -154 -39 -12 205 154 -143 -125 34 -56 -16 146 -8
4576 -8 98 -40 93 4 158 -3 -5 112 26 91 -9 -244 -141 -43 -101 94 -28 -225 -348 -301 33 134 -67
4599 -67 -43 55 53 6 1 8 116 18 47 265 79 -164 36 -62 -107 80 -355 -87 -142 36 97 -12 -204 8 -22 201
4625 201 -32 76 -68 -53 105 -106 70 -61 335 34 182 -83 -101 -100 -150 34 -4 0 151 74 123 211 23 -193
4649 -193 65 148 -188 -10 -6 21 4 -83 -195 -156 -27 23 -96 131 75 156 71 193 -68 -110 -20 -81 -83 -81 -166 -91 -232
4676 -232 73 151 -26 10 169 -243 -120 -85 169 83 138 -34 -57 -116 31 261 -134 -135 -90 -97 43 -167 -116 52
4700 52 -15 256 63 70 -342 -260 47 -4 61 176 -79 -16 41 3 -51 97 74 -75 1 -95 3 255 -78 48 21
4725 21 -98 -42 -184 14 232 -17 17 -298 23 136 184 102 -125 265 -132 -35 176 221 92 227 2 9 205
4748 205 -69 -116 90 -41 -110 -109 -201 -67 167 176 -109 57 16 -85 -195 147 193 0 69 206 185 -28 45 148
4772 148 21 29 -61 -149 34 -162 184 216 172 52 -96 -54 72 -198 -97 5 -5 107 -78 -98 -246 82 15
4795 15 -30 -102 198 42 47 313 131 232 -120 102 47 31 -60 -30 30 221 -314 -33 55 -102 64 -68 -175 -126
4819 -126 43 -57 81 62 150 80 289 -140 128 22 146 -75 116 -13 -71 46 15 83 -145 -53 -226 -217 39
4842 39 -67 27 262 89 173 -61 -78 81 155 30 176 -259 112 -136 16 99 -89 -171 -84 82 86 321 7
4865 7 33 -162 -18 -254 -1 -20 -31 27 184 95 129 186 -224 -129 199 -136 -32 153 157 48 -29 -43 -356 -80 -90
4890 -90 -29 117 36 -139 166 -33 -53 -54 -85 -18 -37 96 -73 227 30 65 192 22 -266 -63 -58 -299 34 -145
4914 -145 64 -94 123 70 -303 -28 -315 -34 -10 52 -245 20 -23 -94 3 -196 107 39 -71 92 135 215 -59
4937 -59 374 -65 78 -19 -3 -118 -22 -76 -37 -61 55 -153 -90 34 -33 144 6 127 -164 -355 -53 45 17 33
4961 33 -40 -219 139 -124 38 122 -30 108 7 163 -10 -107 -171 -110 11 -83 141 -121 138 147 17 -12 -63 -140
4985 -140 -91 -13 -174 18 -203 123 154 58 147 -3 220 46 -74 -22 -20 -151 93 -168 46 -111 -91 -32 31 -6
5009 -6 27 -359 -60 -247 63 -54 -39 232 143 -82 -68 -68 -14 -154 -161 -44 52 -23 280 188 -93 -100 73 192 56
5034 56 -17 50 308 18 220 -121 -12 -207 111 220 -25 34 -172 -10 -97 118 -51 170 185 -234 156 -197
5056 -197 -4 -302 60 109 -153 -36 -133 106 162 -78 -149 -88 -123 -207 152 -21 -58 -102 -108 260 -191 -90 -194 -1
5080 -1 -125 109 12 17 154 -50 -63 -24 72 -112 -215 -10 7 59 56 256 52 -196 175 -98 1 -122 -148 32 20
5105 20 -122 12 67 -87 -164 -93 -286 38 59 -47 -42 146 142 86 -6 106 -60 17 274 -115 5 62 -22 89 90
5130 90 -15 48 38 -78 -97 -98 -250 -3 149 326 196 -197 -24 -134 -96 -275 -82 -193 -211 34 171 152 250
5153 250 228 -23 -59 -30 -9 -57 68 -19 182 -60 64 25 45 -42 -23 -109 -22 79 163 -55 -163 140 -10 -161
5177 -161 -66 23 -228 -227 119 32 -285 -25 88 79 79 198 147 -89 4 -193 -105 -234 -34 79 23 -146 -117 233 1
5202 1 -147 98 -114 -10 32 -30 12 96 11 106 -137 16 41 11 0 -33 -143 -167 86 -124 -12 -248 -197 223 -184
5227 -184 15 57 50 -124 6 70 18 39 -90 -92 78 -93 101 132 -209 26 -14 244 198 18 -75 159 -253 60
5251 60 55 150 141 136 -51 -64 -1 -62 12 -44 188 -49 -10 -8 13 -29 -25 -121 21 -260 32 -4 64 49 144 -47 -30 40 -46
5280 -46 -16 -9 262 21 64 -155 -140 -28 -42 223 -2 98 64 211 71 9 97 277 -17 130 213 24 -33 -60
5304 -60 -39 106 229 -30 101 -150 -194 -81 -27 133 -66 28 -151 114 78 -106 395 92 -4 -220 -8 99
5326 99 41 -85 -143 101 67 -128 -94 -141 45 151 -114 -37 91 144 60 -153 -3 61 143 -149 -17 -108 158 62
5350 62 64 185 -139 -64 84 104 4 108 56 -32 -115 92 70 -176 -73 -141 -94 60 87 -97 82 -140 10 -86
5374 -86 172 -101 -140 -235 40 -74 -34 350 24 160 60 15 248 2 165 71 -287 304 -172 157 138 -130
5396 -130 173 -34 -59 -184 72 -37 -166 -134 101 -200 27 131 -39 -40 225 -226 97 -23 -41 253 170 93
5418 93 69 -66 -82 -19 -33 169 -89 63 232 227 58 -62 157 165 23 -114 1 -199 280 41 -94 79 -15
5441 -15 13 222 103 106 -233 144 -2 -94 116 25 210 -16 213 -62 32 201 -173 -44 -80 99 42 77 -165
5464 -165 254 -178 -22 166 255 -153 -95 77 -263 7 -130 -8 27 20 -127 129 -195 -34 116 333 -265 -8
5486 -8 -37 149 14 -28 63 -54 -23 -81 -53 100 -173 93 280 38 -48 80 136 -178 -165 155 11 -126 -29 -122
5510 -122 -43 39 33 24 78 -79 79 47 30 173 22 -141 -51 -18 -92 1 194 124 -385 82 -290 -227 52 -219 17
5535 17 -26 -210 -214 -9 8 -270 21 33 209 271 34 292 -27 215 -5 -3 1 -95 -103 171 165 -175 50 22 11 -19
5561 -19 -181 -74 113 -5 387 25 67 160 -170 77 111 -16 -106 68 -25 74 -120 -92 -52 225 99 -6 312
5584 312 -122 -68 93 -102 -65 -107 -32 83 60 216 99 127 -93 -174 -69 -39 98 54 -36 -177 -70 204 -4
5607 -4 35 -65 -90 38 326 166 56 60 35 116 6 103 -49 -42 -67 -1 -119 193 164 146 -53 54 187 11 -5
5632 -5 -83 -125 93 6 -185 -55 30 10 40 6 -48 -81 -132 49 -154 91 126 -155 18 7 -58 -101 14 143 -34
5657 -34 -51 110 52 -160 -234 87 217 -87 -10 -175 -127 108 -99 -160 95 -247 60 -176 116 149 40 289 131
5680 131 -8 90 -54 38 -193 116 186 119 -115 -229 -67 -110 -320 10 78 -155 -46 113 -119 72 -130 -210
5702 -210 -57 98 101 250 -96 61 151 -105 32 90 154 106 -107 4 -82 49 161 -218 -168 -76 -108 211 114 187
5726 187 115 128 -234 -75 154 -51 122 167 131 -43 -216 191 -76 360 -62 114 -189 120 43 139 113 32 104
5749 104 29 51 27 97 -16 56 29 -127 -176 -36 32 96 70 154 456 27 105 41 139 59 313 67 -216 24 -19
5774 -19 -192 -79 123 -306 -55 -188 -180 109 113 -272 -211 -75 -89 -165 -18 148 43 87 187 80 95 -240 32
5797 32 238 -3 -461 -184 3 -114 -47 -59 100 -55 -201 -123 151 -91 38 -14 -211 -61 -188 98 166 -208
5819 -208 3 57 111 82 -46 88 -179 -105 51 -200 -166 -130 -74 -135 -239 50 64 -201 -136 28 -120 82 249
5842 249 264 -170 13 -43 124 -8 -57 60 150 102 141 147 136 15 91 65 80 78 112 -90 -170 -91 15 -102 -154 122
5868 122 305 -57 -221 69 51 -84 -74 85 133 130 -379 62 6 -135 -23 -278 -111 -68 63 -51 45 -74 -66
5891 -66 -8 0 -183 -148 -65 115 -167 -41 73 44 -295 101 100 219 33 269 38 75 -123 73 -123 -20 49 -36
5915 -36 44 -16 152 21 -46 -131 -83 -174 -69 331 158 39 238 -183 138 71 80 -12 138 -264 17 109 -144 -178
5939 -178 -56 31 -75 -60 24 97 -49 94 217 -45 83 197 -152 -139 -143 -123 -141 44 30 96 -130 -8 -12 -66 -139
5964 -139 -99 43 -25 -43 -103 -50 37 5 26 57 173 -4 45 17 186 -41 -208 -116 189 168 68 -160 -96 -217 -183
5989 -183 141 -3 91 153 -259 90 -28 144 -77 9 14 69 -23 208 79 90 18 -93 51 -207 0 47 225
6012 225 -15 -64 -46 -56 -107 -102 197 -15 -55 -9 189 -43 -61 31 40 -36 -253 125 129 82 86 230 -101 109 116 -15 -287
6039 -287 -219 -217 -162 34 -59 181 120 129 -170 77 19 77 -95 136 -36 -94 251 -105 19 57 -70 -31 210 -37
6063 -37 93 21 -50 149 36 -100 108 29 162 9 148 72 -38 -21 66 -282 -88 -17 125 -80 -102 -82 -67 36
6087 36 29 -24 -98 9 -64 -124 42 105 -110 -68 66 -166 181 -28 102 -88 -106 -21 -25 -86 15 -7 90 73 -9 -181
6113 -181 224 143 -174 -54 -40 -28 88 -57 27 142 -154 177 -58 -173 -158 93 50 31 -186 -53 132 85 -54
6136 -54 249 220 -5 -1 -163 129 -45 -87 158 5 89 154 66 95 10 -59 27 157 -21 -299 -44 119 -1 44
6160 44 -211 -150 -27 -316 99 -16 -95 197 170 -122 -51 19 -274 26 -107 -41 -76 47 27 -42 79 101 138 12
6184 12 124 -39 -48 -87 139 46 3 89 -107 45 -133 25 125 10 59 -16 -78 167 -37 -37 130 111 -163 88
6208 88 -182 39 -10 -120 -84 -219 -64 -29 -72 -29 46 85 -65 52 15 -39 134 72 -150 21 -145 83 -122 -100
6232 -100 -195 46 -201 -34 22 78 -156 47 -44 -73 -131 -112 -13 87 -24 -25 -160 64 -120 -198 82 -87 68 -15
6256 -15 151 -205 166 20 -91 34 -14 113 -159 -14 73 -191 73 151 -12 -91 -239 21 -55 -30 -100 154 50
6279 50 3 -301 155 -92 -309 45 -99 -177 149 -117 -102 -82 276 -252 -16 104 -179 67 -76 4 -11 -36 -79
6302 -79 -8 50 7 -110 -6 -56 28 152 321 55 179 9 -172 -93 193 -4 -51 102 48 -272 32 145 -65
6325 -65 31 296 108 221 121 -73 144 124 108 24 -18 -13 -138 -27 -123 123 -16 -21 -91 144 155 -76 17 67 303
6350 303 -33 -110 47 61 61 -98 132 -157 -96 -126 103 84 93 74 -53 192 -250 -12 169 64 -48 80 -102
6373 -102 77 -297 35 -181 -24 119 9 -51 142 -15 -17 111 16 12 -150 38 7 12 13 -140 78 118 -80 122
6397 122 -255 90 21 -195 -4 -97 -141 150 -160 -86 61 -96 54 -216 109 177 -69 53 52 195 -27 -26 -77
6420 -77 110 126 -119 -85 -6 -370 -101 78 187 -227 85 -56 155 206 -60 -23 -16 -311 -10 -242 169 386 221
6443 221 55 26 115 -171 -99 -63 182 4 -37 -73 134 -37 -88 49 11 83 -119 26 144 134 112 47 -221 14
6467 14 -32 -143 -1 -48 -97 -16 -20 132 91 346 76 294 79 -77 -323 73 -126 70 172 -76 -97 119 -28
6490 -28 75 -83 36 154 -42 11 -121 -10 -11 36 -129 161 17 130 117 75 -98 0 60 -135 -55 81 234
6513 234 -5 28 -105 163 98 113 -40 30 49 51 7 77 -26 110 -30 18 232 32 -42 -82 59 -7 -29 174 77
6538 77 -46 -117 -168 -537 63 -8 110 138 32 66 -52 223 -44 76 -80 213 303 -25 -85 -35 46 -132 160
6561 160 51 101 -23 40 318 31 39 125 15 165 49 -24 7 -23 151 92 -45 53 365 -147 -53 139 148 -48
6585 -48 80 -70 -65 97 79 239 72 -24 -11 112 68 202 50 -90 106 72 -189 -87 -22 68 218 -113 110
6608 110 -20 -32 12 -56 20 230 -193 160 -2 -84 -67 -108 6 -182 -50 -62 216 -65 -54 -229 29 -70 98
6631 98 -169 -91 27 -16 116 28 -149 100 219 29 8 119 -80 9 -76 -53 -104 67 106 124 -196 -55 122 -111
6655 -111 -99 -28 -180 187 111 -26 -159 170 349 -108 -95 201 -47 -34 140 -336 39 41 49 182 172 -232 205
6678 205 199 101 10 163 18 252 -58 -164 113 -38 25 -212 -11 98 -159 -32 -38 -40 -94 -235 167 -255 112
6701 112 -106 -2 -10 -27 130 13 69 -185 136 98 -124 226 183 -29 50 -151 -140 89 -188 -15 25 48 -14 80
6725 80 -142 -82 -26 153 77 -144 230 127 -65 114 -187 -74 70 -27 111 -238 -11 -64 76 -78 -25 74 44
6748 44 20 -34 0 152 107 145 -147 -33 140 25 -170 72 -10 206 56 -19 -103 -161 -65 117 172 3 -128 -139
6772 -139 -113 -84 -95 -207 -104 92 209 -132 -87 188 -35 -19 -18 147 94 -151 57 -144 -41 -115 46 -111 36
6795 36 -207 -56 87 11 -97 -154 146 51 -17 118 -132 27 49 272 68 101 230 -121 63 117 -58 89 -51
6818 -51 -205 -95 28 57 10 -8 111 -199 107 179 -273 97 314 -168 68 -149 -155 -58 25 -117 181 -134 54
6841 54 -110 46 -28 73 -105 -109 -118 75 -67 -1 -90 78 -196 -227 100 -99 74 23 -58 -68 2 -233 26 204
6865 204 160 -80 182 72 182 23 -24 -236 52 67 139 116 55 79 186 70 141 0 -4 -94 -75 -45 -5 186 226
6890 226 321 166 -25 -46 -26 -3 -13 191 133 8 40 -79 -224 -249 -65 -134 -48 -281 -197 -35 -212 -251 85 52
6914 52 -221 9 -48 -8 47 -30 -64 -166 119 -271 -76 80 14 -10 -144 -86 -69 -134 49 -35 49 -134 40 -27 -158
6939 -158 56 25 91 233 203 108 77 9 -213 231 -170 68 250 2 17 78 41 -187 134 -47 55 -134 119
6962 119 82 12 78 -127 131 -33 -183 -139 -174 243 67 47 30 180 133 -13 57 -133 76 208 -94 16 -92
6985 -92 49 55 235 -35 -32 -118 -78 -97 -84 16 15 182 -196 -156 -61 -45 60 -41 87 -23 142 122 60 63 -323 -80
7011 -80 -112 -23 -28 -60 59 -76 14 -109 -97 10 26 -91 -16 -70 129 81 -126 -170 -11 -69 -63 74 -54 135 -203
7036 -203 84 -42 140 -1 197 -266 -125 -169 117 -86 -175 -331 -65 151 -5 51 -196 -77 37 133 -123
7057 -123 76 90 172 10 87 -46 19 39 87 90 42 39 103 -39 -76 30 139 -130 -280 -220 152 99 -65 2 -92 -149
7083 -149 -23 141 35 -51 115 8 227 26 74 -18 -41 85 -4 -112 -92 -136 -54 -92 137 136 -13 24 44 -66
7107 -66 -123 96 80 21 -94 -191 60 53 -13 -96 94 27 -95 -178 49 -85 -213 -168 64 -49 211 143 82 21 105
7132 105 53 -81 -83 -23 35 -249 -193 -105 25 41 -94 37 42 39 164 115 49 -19 -72 111 13 405 -81 -45 235 44
7158 44 -23 85 166 173 151 173 129 19 -111 -42 -77 88 -94 162 82 113 37 0 72 -94 54 147 5 -38 -118 -46
7184 -46 298 -82 -80 -126 -179 -234 196 -138 77 97 -24 195 -133 190 -105 77 -34 86 29 -11 -33 89 -219
7207 -219 -26 116 52 -1 261 9 -217 -63 -63 -116 -116 25 101 -7 -23 -11 -225 -139 155 156 171 -21 -179 283 -120
7232 -120 -99 -85 -209 -191 61 -144 -193 -7 165 67 -124 -102 43 87 -131 99 3 -9 -106 29 191 -122 -92 -30
7256 -30 102 82 -133 -84 -215 -73 58 169 159 -64 22 -97 155 131 -101 -28 143 19 -16 -192 -92 249 167
7279 167 -114 -146 -5 -79 -209 -31 -85 -99 -108 -206 10 54 2 41 -172 13 -210 214 154 38 -78 -128 9 62
7303 62 99 -173 217 -171 16 89 -184 90 211 -123 -16 -78 -102 -54 174 -33 -44 71 235 183 -247 -72 47
7326 47 58 -46 -93 64 -28 -3 7 -71 -53 97 119 -202 137 125 -59 -32 28 -6 245 -132 75 249 -74 187
7350 187 74 -222 -197 106 -42 143 87 140 82 79 259 -193 143 -215 23 31 -68 -187 67 274 399 -37 52
7373 52 -85 -214 237 -159 -238 78 30 127 -160 120 -76 93 136 -54 49 -12 -94 79 -172 1 194 -74
7395 -74 142 -27 -126 253 -25 -221 8 189 -105 32 8 83 -59 358 38 -76 216 45 -88 84 5 -119
7417 -119 170 93 -3 42 5 138 70 -104 40 137 -131 -185 30 -82 -88 32 9 115 91 -81 9 36 -59 -94 7
7442 7 176 -107 39 -59 28 -215 -43 163 -22 -135 86 16 -159 -58 65 -149 -253 43 15 103 73 58 -188
7465 -188 -125 38 -93 -162 -112 52 21 7 -47 47 -150 79 158 -87 -42 148 -19 -40 -33 -57 -169 -157 197 101 -92
7490 -92 -92 61 -27 -22 -90 -17 18 -114 -75 -15 -256 52 -91 79 93 160 158 -88 35 -35 -65 25 -103 69 -26 128
7516 128 178 -1 59 -27 -1 -92 -162 27 26 51 -78 -186 176 71 -214 214 50 -96 16 -108 -27 75 -11 -71
7540 -71 -179 -287 250 77 -270 11 -343 -43 128 79 71 116 -69 -244 -114 75 13 221 42 -86 -129 -37 -203
7563 -203 -42 -166 -167 -124 -31 17 55 -199 -31 -132 198 -55 121 -163 16 -175 6 205 94 23 55 138 27
7586 27 -39 205 148 -81 -162 -263 69 236 54 -18 100 3 240 -161 22 166 127 41 218 -38 224 333 -116
7609 -116 -113 40 -70 59 134 -11 180 95 -38 -181 55 74 -105 -53 21 142 58 -71 -65 63 -155 -103 -6 6
7633 6 25 -75 103 296 -31 -229 -32 -131 318 -55 88 73 200 68 -12 17 133 -5 307 -37 1 -50 -154
7656 -154 -164 -56 212 -105 -45 185 -76 -6 -269 -149 -14 -76 43 -245 29 11 145 -116 -141 65 -139 48
7678 48 -180 101 25 -11 28 124 -129 125 -104 -305 -197 -51 -90 145 -26 0 106 -74 168 -80 52 54 61 289
7702 289 17 -33 -139 49 165 -26 13 -71 17 146 -145 5 136 -71 158 45 -175 180 -126 -39 -126 82
7724 82 38 67 -205 -216 -228 -32 -149 97 111 26 -34 -165 -40 47 70 -3 -271 -129 -165 138 53 -68 -35 -232 12
7749 12 125 91 130 150 -51 114 124 -24 8 93 48 68 -8 -138 -108 -44 -196 39 25 76 -166 324 -187 190 -199
7774 -199 -43 37 91 -132 -283 -193 24 -92 22 63 -51 139 -81 6 219 14 -58 -81 93 -71 38 38 -8
7797 -8 -112 108 23 -44 -85 26 179 -163 138 109 22 44 138 80 70 -44 -50 128 -106 -65 113 -37 42 9 -1 80
7823 80 -122 -79 -33 -15 102 105 -34 185 186 156 241 45 378 70 -170 -75 420 -141 -15 -59 -38 -92 21 201 29
7848 29 91 -57 100 2 -192 -33 -31 -35 -153 -43 8 142 233 94 15 -32 2 -63 -17 264 -52 95 -4 249 80
7873 80 84 -22 154 -91 -283 -42 8 -10 -171 170 8 -119 88 145 -21 -172 10 41 45 -302 5 -31 -1 -264
7897 -264 -280 -43 -47 -106 -1 130 -146 40 -101 -80 138 -165 95 262 10 -21 -208 -30 174 -23 -200 114
7919 114 -70 7 -189 126 82 185 -35 32 -63 132 54 15 -111 111 304 -12 106 165 -11 -38 62 185 -204
7942 -204 -178 -14 0 169 -103 -157 -166 92 23 78 142 -120 22 -82 -114 33 -42 -58 -261 55 187 -130 63 25
7966 25 -91 -143 135 120 -43 9 -166 -35 23 148 4 -2 -62 -55 -18 76 149 -257 140 113 44 -103 283 76 -100
7991 -100 -128 63 39 86 -182 -120 -216 -119 1 -118 -105 -145 -69 -44 27 50 107 177 -86 -52 40 -27 235 -67 53 -282
8017 -282 -118 199 -54 25 -5 88 1 -97 -157 64 25 -118 -75 -139 160 23 33 -205 284 43 -67 77 -145
8040 -145 -15 -44 -168 -68 -135 65 -74 133 61 0 -67 70 65 -80 43 117 40 -62 -86 138 -18 160 55
8063 55 116 2 79 121 75 -168 -19 22 64 -63 -33 70 -97 -227 -180 -42 -69 14 -22 133 47 150 120 -111 102
8088 102 43 -66 35 -5 -123 -147 181 -18 13 -93 -104 -88 -179 -328 39 -275 35 121 -183 -223 115 -180 -46
8111 -46 237 121 -210 110 -24 -94 132 4 451 21 87 130 9 13 303 -12 150 -113 -59 -95 -34 7 -127
8134 -127 195 -14 24 -33 49 -217 71 -99 57 188 56 -22 -188 78 181 -72 129 81 96 93 -70 -9 42
8157 42 261 33 140 149 -25 218 -39 -5 282 -62 90 -50 86 37 -128 -14 9 -103 120 14 -266 -195
8179 -195 -220 -261 79 40 69 71 -138 23 268 189 -281 284
8191B84
##END NTUPLES=NMR FID
##END=
