##TITLE=1H_LR-772-BK1
 CDCl3
 8 sc, 
 23.10.2023
##JCAMPDX= 6.0         $$ Bruker NMR JCAMP-DX V2.0
##DATA TYPE= NMR FID
##DATA CLASS= NTUPLES
##ORIGIN= UXNMR, Bruker Analytische Messtechnik GmbH
##OWNER= root
$$ XWIN-NMR		Version 3.5
$$ Mon Oct 23 14:55:16 2023 Russian Standard Time (UT+4h)  she@DPX200
##.OBSERVE FREQUENCY= 200.13135
##.OBSERVE NUCLEUS= ^1H
##.DELAY= (6, 6)
##.ACQUISITION MODE= SIMULTANEOUS
##.ACQUISITION SCHEME= undefined
##.AVERAGES= 8
##.DIGITISER RES= 18
##SPECTROMETER/DATA SYSTEM= spect
##.PULSE SEQUENCE= zg30
##.SOLVENT NAME= D2O
##.SHIFT REFERENCE= (INTERNAL, D2O, 0, 15.7039)
##AUDIT TRAIL= $$ (NUMBER, WHEN, WHO, WHERE, WHAT)
$$ ##TITLE= Audit trail, XWIN-NMR		Version 3.5
$$ ##JCAMPDX= 5.01
$$ ##ORIGIN= Bruker BioSpin GmbH
$$ ##OWNER= she
$$ F:/spectra/data/she/nmr/H-F/1/audita.txt
$$ ##AUDIT TRAIL=  $$ (NUMBER, WHEN, WHO, WHERE, WHAT)
(   1,<2023-10-23 14:53:59.26 +0400>,<she>,<DPX200>,
      <created by zg, POWCHK disabled, PULCHK disabled
       configuration hash MD5:
       00 E9 B6 7A A2 85 ED C7 34 08 36 98 17 FE 4E 26
       data hash MD5: 16K
       CB 4F 5E D0 94 89 8E A3 77 E3 0F B0 23 F7 59 0E>)
$$ ##END=
$$ 
$$ hash MD5
$$ EB 7E CA B6 97 46 0E 42 35 4B B3 94 B0 86 5C 87
##$RELAX= 
##$RELAX= 
##$RELAX= 
##$RELAX= 
##$RELAX= 
##$RELAX= 
$$ Bruker specific parameters
$$ --------------------------
##$DU= <F:/spectra>
##$EXPNO= 1
##$NAME= <H-F>
##$PROCNO= 1
##$TYPE= <nmr>
##$USER= <she>
##$AMP= (0..31)
100 100 100 100 100 100 100 100 100 100 100 100 100 100 100 100 100 100 
100 100 100 100 100 100 100 100 100 100 100 100 100 100 
##$AQSEQ= 0
##$AQ_mod= 1
##$AUNM= <au_zg>
##$AUTOPOS= <>
##$BF1= 200.13
##$BF2= 200.13
##$BF3= 200.13
##$BF4= 200.13
##$BF5= 200.13
##$BF6= 200.13
##$BF7= 200.13
##$BF8= 200.13
##$BYTORDA= 1
##$CFDGTYP= 0
##$CFRGTYP= 5
##$CHEMSTR= <none>
##$CNST= (0..31)
1 1 145 1 1 1 1 1 1 1 1 1 1 1 1 1 1 1 1 1 1 1 1 1 1 1 1 1 1 1 1 1 
##$CPDPRG= <>
##$CPDPRG1= <>
##$CPDPRG2= <>
##$CPDPRG3= <>
##$CPDPRG4= <mlev>
##$CPDPRG5= <mlev>
##$CPDPRG6= <mlev>
##$CPDPRG7= <mlev>
##$CPDPRG8= <mlev>
##$CPDPRGB= <>
##$CPDPRGT= <>
##$D= (0..31)
0 1.2 0 0 0 0 0 0 0 0.06 0 0.03 0 0 0 0 0.0002 0 0 0 0 0 0 0 0 0 0 0 0 
0 0 0 
##$DATE= 1698058438
##$DBL= (0..7)
120 120 120 120 120 120 120 120 
##$DBP= (0..7)
150 150 150 150 150 150 150 150 
##$DBP07= 0
##$DBPNAM0= <>
##$DBPNAM1= <>
##$DBPNAM2= <>
##$DBPNAM3= <>
##$DBPNAM4= <>
##$DBPNAM5= <>
##$DBPNAM6= <>
##$DBPNAM7= <>
##$DBPOAL= (0..7)
0.5 0.5 0.5 0.5 0.5 0.5 0.5 0.5 
##$DBPOFFS= (0..7)
0 0 0 0 0 0 0 0 
##$DE= 6
##$DECBNUC= <off>
##$DECIM= 32
##$DECNUC= <off>
##$DECSTAT= 4
##$DIGMOD= 1
##$DIGTYP= 9
##$DL= (0..7)
0 120 120 120 120 120 120 120 
##$DP= (0..7)
150 150 150 150 150 150 150 150 
##$DP07= 0
##$DPNAME0= <>
##$DPNAME1= <>
##$DPNAME2= <>
##$DPNAME3= <>
##$DPNAME4= <>
##$DPNAME5= <>
##$DPNAME6= <>
##$DPNAME7= <>
##$DPOAL= (0..7)
0.5 0.5 0.5 0.5 0.5 0.5 0.5 0.5 
##$DPOFFS= (0..7)
0 0 0 0 0 0 0 0 
##$DQDMODE= 0
##$DR= 18
##$DS= 0
##$DSLIST= <SSSSSSSSSSSSSSS>
$$ [...]
##$SUBNAM2= <"">
##$SUBNAM3= <"">
##$SUBNAM4= <"">
##$SUBNAM5= <"">
##$SUBNAM6= <"">
##$SUBNAM7= <"">
##$SUBNAM8= <"">
##$SUBNAM9= <"">
##$SW= 18.05172834244
##$SWIBOX= (0..15)
0 0 2 0 0 0 0 0 0 0 0 0 0 0 0 0 
##$SW_h= 3612.71676300578
##$TD= 16384
##$TD0= 1
##$TE= 0
##$TE2= 300
##$TE3= 300
##$TEG= 300
##$TL= (0..7)
0 120 120 120 120 120 120 120 
##$TP= (0..7)
150 150 150 150 150 150 150 150 
##$TP07= 0
##$TPNAME0= <>
##$TPNAME1= <>
##$TPNAME2= <>
##$TPNAME3= <>
##$TPNAME4= <>
##$TPNAME5= <>
##$TPNAME6= <>
##$TPNAME7= <>
##$TPOAL= (0..7)
0.5 0.5 0.5 0.5 0.5 0.5 0.5 0.5 
##$TPOFFS= (0..7)
0 0 0 0 0 0 0 0 
##$TUNHIN= 0
##$TUNHOUT= 0
##$TUNXOUT= 0
##$USERA1= <user>
##$USERA2= <user>
##$USERA3= <user>
##$USERA4= <user>
##$USERA5= <user>
##$V9= 5
##$VALIST= <valist>
##$VCLIST= <CCCCCCCCCCCCCCC>
##$VD= 0
##$VDLIST= <DDDDDDDDDDDDDDD>
##$VPLIST= <PPPPPPPPPPPPPPP>
##$VTLIST= <TTTTTTTTTTTTTTT>
##$WBST= 1024
##$WBSW= 4
##$XGAIN= (0..3)
0 0 0 0 
##$XL= 0
##$YL= 0
##$YMAX_a= 186741
##$YMIN_a= -165527
##$ZGOPTNS= <>
##$ZL1= 120
##$ZL2= 120
##$ZL3= 120
##$ZL4= 120
##$ABSF1= 10
##$ABSF2= 0
##$ABSG= 5
##$ABSL= 3
##$ALPHA= 0
##$AQORDER= 0
##$ASSFAC= 0
##$ASSFACI= 0
##$ASSFACX= 0
##$ASSWID= 0
##$AUNMP= <proc_1d>
##$AZFE= 0.1
##$AZFW= 0.1
##$BCFW= 1
##$BC_mod= 2
##$BYTORDP= 1
##$COROFFS= 0
##$CY= 11.3945322036743
##$DATMOD= 1
##$DC= 2
##$DFILT= <>
##$DTYPP= 0
##$F1P= 15.7292609196834
##$F2P= 12.9074282941183
##$FCOR= 0.5
##$FTSIZE= 0
##$FT_mod= 4
##$GAMMA= 1
##$GB= 0.15
##$INTBC= 1
##$INTSCL= 1
##$ISEN= 128
##$LB= 0.24
##$LEV0= 0
##$LPBIN= 0
##$MAXI= 10000
##$MC2= 0
##$MEAN= 0
##$ME_mod= 0
##$MI= 1.114404
##$NCOEF= 0
##$NC_proc= 0
##$NLEV= 6
##$NOISF1= 3.799351
##$NOISF2= 2.8
##$NSP= 1
##$NTH_PI= 0
##$NZP= 0
##$OFFSET= 15.70392
##$PC= 1
##$PHC0= -23146.22
##$PHC1= 10.2527
##$PH_mod= 1
##$PKNL= yes
##$PPARMOD= 0
##$PSCAL= 0
##$PSIGN= 0
##$REVERSE= no
##$SF= 200.130013532006
##$SI= 16384
##$SIGF1= 3
##$SIGF2= 2
##$SINO= 400
##$SIOLD= 16384
##$SREGLST= <1H.CDCl3>
##$SSB= 0
##$STSI= 0
##$STSR= 0
##$SW_p= 3612.71676300578
##$SYMM= 0
##$S_DEV= 0
##$TDeff= 0
##$TDoff= 0
##$TI= <>
##$TILT= no
##$TM1= 0
##$TM2= 0
##$TOPLEV= 0
##$USERP1= <user>
##$USERP2= <user>
##$USERP3= <user>
##$USERP4= <user>
##$USERP5= <user>
##$WDW= 1
##$XDIM= 8192
##$YMAX_p= 0
##$YMIN_p= 0
$$ End of Bruker specific parameters
$$ ---------------------------------
##NTUPLES= NMR FID
##VAR_NAME=  TIME,          FID/REAL,        FID/IMAG
##SYMBOL=    X,             R,               I
##VAR_TYPE=  INDEPENDENT,   DEPENDENT,       DEPENDENT
##VAR_FORM=  AFFN,          ASDF,            ASDF
##VAR_DIM=   8192,          8192,            8192
##UNITS=     SECONDS,       ARBITRARY UNITS, ARBITRARY UNITS
##FACTOR=    0.0002768,     1,               1
##FIRST=     0,             0,               0
##LAST=      2.2672688,     0,               0
##MIN=       0,             -165527,         0
##MAX=       2.2672688,     186741,          0
$$ Real data points
##PAGE= N=1
##DATA TABLE= (X++(R..R)), XYDATA
$$ [...]
1865a401R78J019K0j412j057Q35J526O08q25j318m50J246J273j89j348q09R57
1882c47J398L70o73j206m40J373Q98n05j563q54R48J350K63j299q68n3J404P53
1900I49o54j268m39J042J322J22j091r58N38J135P09o54j502o81J240J179k42
1917G47j021q45O50J117N98q43j429j51J149Q11nj191o82N95J346L35q72j273
1935i64Q9J024P75l72j199o88J052J167L38j168j075L26Q58R58o05j458m38R83
1953c97J407r8q19q21J11J427M51r19r05k99N26J449j81j334n03M22R47P02j377
1972b11j286jJ578M12l56p86l60N81J141L86r85p58n0J101J035l92j190o29R30
1991A60J060j47q72r76p2J088O94p46j024l72O52Q91J09j474k89L51J203N36l89
$$ plain form
1865 -1401 -423 596 616 -796 -1853 -1018 508 1116 291 -1027 -1477 -231 1042 853 -495 -1304 -347
1882 -347 1051 1421 748 -458 -898 475 1373 868 -695 -1549 -601 749 1012 -287 -1155 -1208 196 949
1900 949 295 -973 -1412 -370 952 1074 -17 -975 -437 698 1407 753 -749 -1430 -190 989 747
1917 747 -274 -1119 -469 648 1246 403 -1026 -1177 -28 783 778 -413 -1095 -500 846 1181 309 -964
1935 -964 -875 149 924 552 -647 -1335 -283 884 1222 54 -1021 -695 163 1121 516 -942 -1380 -397
1953 -397 1010 912 93 -728 -617 810 1261 342 -563 -862 -336 1113 932 -402 -905 -483 464 1166 -211
1972 -211 -1497 -1498 80 492 136 -650 -1010 -429 712 1098 113 -645 -695 406 1441 1049 -141 -770 160
1991 160 1220 1073 201 -775 -847 241 935 189 -835 -1207 -555 336 445 -1029 -1318 -967 236 772 383
2010C83q72o5Q44O70j31p14q56N83J068K94r47q99K51M84J087l47j402o16Q44
2029c41O64m7n50j097J05J275Q58q13m94l59O86J141J83j518k95M98N06O67l5
2048A034j352j05Q89L32k10q04r27R8J486K84o35r93O5K85J205m14r51n34R92
2067b55N35N4n5o01j48J186N59r29m99n06L00R83L56j206p18N62M72P88j04j375
2087f01m70J034O40m05l59q20J28J085J018j090p65Q9O34N04J29j138q68Q49R10
2106E04P4j2j201l18J182O27m98r12m94L07J076M30p93p22P36K63N93lr42p42
2126h45Q17N99k63J5q44M8R99M64q29j016n6M64M00K73m43q62N88P57M04J01p66
2147Eo15N35J164o03p22p7P4R34M53q43j026K47M51K76j03o46o80M65P87J23k27
$$ plain form
2010 383 -489 -554 290 960 829 115 -741 -158 910 1204 257 -642 -391 93 1180 833 -569 -1185 -341
2029 -341 323 276 -274 -1371 -1266 9 867 54 -440 -799 -113 1028 1211 -307 -602 -104 402 1069 1034
2048 1034 -318 -423 466 798 588 -216 -1143 -1045 441 725 90 -903 -838 -553 652 238 -713 -1247 -255
2067 -255 280 334 279 -322 -470 716 1275 346 -153 -659 -359 624 980 -226 -944 -382 90 878 774 -601
2087 -601 -1071 -37 603 198 -161 -981 -853 232 1250 160 -605 -516 118 622 751 -387 -1255 -406 504
2106 504 578 566 -635 -953 229 856 358 -554 -1048 -741 335 765 -28 -750 -14 249 842 839 -103 -845
2126 -845 -28 571 308 323 -521 -473 526 990 161 -855 -911 -447 -47 226 -217 -1079 -491 266 670 771 5
2147 5 -610 -75 1089 486 -236 -313 -239 695 1148 305 -721 -474 -23 253 150 -496 -1176 -711 76 199 -28
2168b8o69m37J038Q50q34l63j07N66M18O57o30p69M68N98J40j04o30r36P50O78
2188F56o14n48k69J82L3J139p42q64O3N37K41J05l40m22P07O32K10m38k15l00
2208b47M74R43m83r85J02M24K62L50p54q08P1P51q3J4o41k51K54Q67j02l97k45
2229d84k7M51M45O3j189N39M02M89J62n61p21K16J015k92l07l97k40K16Q38k59
2249C59q02m2L05K98M25l47r43nM54P10j80n22q5L15N86K48r02l89M64K84L31
2270E62Jj050J29M62M66j1m73o54P5O93L72n79k29k42M87N85j11r04j2M90k0M91
2292E28l95o53m8P51J10N7m40o27K41O35K96m20m81k64O91M94J26n72m93N27L47
2313D10J54l56o12q5P39L76K0p39k43j25P62o9o75k42P5O77L52n59k63k15P36
$$ plain form
2168 -28 -697 -1134 -96 754 -80 -443 -550 16 434 1091 461 -308 160 758 898 794 164 -772 -22 656
2188 656 42 -506 -775 -593 -560 579 -163 -1027 -964 -427 -186 -81 -421 -843 -136 496 706 268 53 -247
2208 -247 227 1170 687 -298 -196 228 490 840 86 -722 -651 100 17 31 -610 -861 -607 260 158 -239 -484
2229 -484 -511 -60 385 448 -741 -202 200 689 851 290 -431 -215 800 508 201 -196 -436 -220 618 359
2249 359 -443 -485 -180 118 543 196 -747 -752 -298 412 232 -290 -375 -60 526 774 -128 -517 -53 231 562
2270 562 563 -487 -358 104 570 559 86 -568 -493 200 572 -7 -236 -478 9 594 483 -421 -433 57 37 528
2292 528 133 -520 -568 183 293 350 -90 -717 -476 159 455 35 -446 -710 -19 475 601 29 -464 63 410
2313 410 564 208 -404 -489 250 626 646 -93 -336 -461 301 232 -443 -685 -610 67 419 -140 -403 -618 118
2334A18M71l42l43k58K7P93K2k01m63J24M45N75j58r81n51L06N02l2j78m95j06
2355g25O83L76l05l79k65K96L84L7l33n56M84O60R2n1l36k53L56M69j50l46l62
2376b24K53L32L64o06m19qp5N87m8n31l62K27M60J00p4m24J41L54L26n6n02m2
2398b27J56N61J09l67l14j24O94l3j53k22l53P5M93j71r0o40J69N66n3J84o99
2419d39k97N90N07m1n87j50N83L20K51m77l87p4L12M31l30k07l11J63O22r8k67
2440A14m68L23J76K19m28j89r4LN68L05n05k44k0K95L91j98n06r7M49J99P1j76
2462A88n44K67K31N08m89m65J61K07L61n2m08l64J45M10K90j9o86k76P28J24l25
2483hj75j15M77J38J34p49j56r9N59n3j4j9m43K28N45J34l31l90J50N37l40L26
$$ plain form
2334 118 589 247 -96 -354 -327 466 488 287 -176 -52 393 968 810 -171 -722 -416 86 54 -124 -619 -725
2355 -725 -42 334 29 -350 -615 -319 65 102 -231 -787 -303 357 449 398 62 -191 165 634 484 138 -224
2376 -224 29 361 725 119 -300 -308 -383 204 156 -375 -737 -510 -50 50 -24 -448 -307 47 373 317 -185 -227
2398 -227 -71 490 599 232 -82 -206 488 455 302 80 -273 -198 295 124 34 -606 -437 129 76 260 -439
2419 -439 -736 -146 361 320 -267 -417 166 486 737 260 -127 -201 111 542 212 5 -306 -143 479 381 114
2440 114 -354 -31 145 364 -64 -253 -347 -344 224 529 24 -220 -240 55 446 248 -258 -355 94 293 364 188
2462 188 -356 -89 142 650 161 -304 -143 64 425 373 -35 -399 -254 156 446 427 -259 -535 193 317 -8
2483 -8 -183 -298 179 317 451 -298 -454 -553 6 -47 -61 -80 -523 -295 250 384 53 -337 -187 350 10 336
2505C36o47J65K11L30J13l80m09J72P4J37L1n70m9L15M19j80l80l59N57J63L04
2526C53k29l77J6K25N14j68j95j15K67J69J10l89o6l35L61K36M0n14j63k0N29
2547B49N6o98n5K55K5K58k19J66n34L76L83J12m07J23j21K96M30m43k59L0J32
2568A55J11J60l05m89J56L98J7j88n28q1N56J66j48n54J82J25J50L13j11l63K17
2589f1K45J58Q0n07j17K04L87o9j37m97J11M65J6J55o63kK34M50l11k07m88L97
2611a57N05j92l24j21k09M38M15m08Pl03L59J82q9K53n72j8O71q9j11l12k24J80
2633a19M81k35k00j04J48K07K97j57m80k02N69k10J67P4p33K77L80r8n9j09k28
2654c34R3M61k8m40J85j25O32om94k79K59J89K35j36N6n26O6L92n8l9m8q0k0K90
$$ plain form
2505 336 -311 -146 65 395 508 128 -281 -109 -35 102 133 -437 -486 -171 248 68 -312 -671 -114 49 353
2526 353 124 -253 -237 -12 502 334 139 24 291 460 570 181 115 -220 141 377 417 -97 -260 -280 249
2547 249 305 -393 -448 -193 -168 90 -129 37 -497 -121 262 374 -33 90 -31 265 695 252 -7 23 155
2568 155 266 426 121 -368 -212 186 203 15 -513 -594 -38 128 -20 -574 -392 -267 -117 196 85 -278 -61
2589 -61 184 342 422 -85 -202 2 389 320 183 -314 -203 262 278 433 -230 -232 2 452 141 -66 -554 -157
2611 -157 348 156 -168 -289 -498 -60 355 -53 -46 -349 10 192 103 356 -216 -234 437 348 237 -75 -299 -119
2633 -119 362 127 -73 -177 -29 178 475 318 -162 -364 205 -5 162 236 -497 -220 160 62 3 -106 -334
2654 -334 -241 220 192 -248 -63 -188 444 438 -56 -335 -76 113 348 212 268 -258 -192 200 142 103 55 -25 -45 245
2678B45J3p05j13J75L22m3J49l43p7N90p6j07nj32L5K99k8k88J80O0j8O7L2m36
2702b04m3L60J13j96j44j90J76M30p7k13j10j57k35O02J9l95n3r2M79L5K03l68
2724f0k76Q57j20k35j43n0P4L86l42n4j66j14K03N0P0k14k65K68K24q2p4j81R2
2747a52J40M07m10k48M7M18L25l17l00l62M23L65J87l65l07J49K13J05j37k94
2767a13J44k05N61k61k87r6L2J43o2Q3m7k54L63K08L3k19R9m49L35L8j16j21m6
2790b37K62O0K83m31Q9J47L32k86q1k69r7K80L67m00n7k03J44J75P6l62m7Q9J46
2813b0m8N9q8k02L83K12j08l4n7l42L36q5J29k9R2n4R3J44l30m47L66K6N5R4m46
2838c01O7q1N51l3l02j0O0O2jk10J31n5K48oK17n93J80J79o2n3K14j50qJ96r0
$$ plain form
2678 245 258 -447 -560 -385 -63 -106 43 -300 -377 213 137 30 25 -107 -72 227 199 -89 91 151 133 200 232 -204
2702 -204 -247 113 226 30 -114 -304 -128 302 225 12 -98 -255 -490 112 131 -264 -317 -409 70 105 308 -60
2724 -60 -336 521 401 166 23 -27 47 433 91 37 -129 -243 -40 10 80 -134 -399 -131 93 11 -63 -244 -152
2747 -152 -12 395 -15 -263 -216 202 527 210 -90 -452 -29 336 523 158 -149 0 213 318 181 -113
2767 -113 31 -174 387 126 -161 -257 -225 -82 -144 -61 -108 -362 1 209 242 23 122 -327 8 46 -70 -191 -237
2790 -237 25 85 368 -63 26 173 505 219 138 -131 -228 52 419 19 -38 -241 -97 78 154 -208 -255 -166 -20
2813 -20 -68 -9 -97 -299 84 296 188 154 97 -245 91 6 135 106 198 144 237 381 51 -396 -30 -4 51 145 -301
2838 -301 -234 -315 236 203 -99 -109 -49 13 12 -198 -67 -122 126 120 337 -256 -76 103 41 -12 202 52 44 240 150
2863A50K7m14O4jL12o1j57J17l18K60O4j55j27k55N06J40k21L8n0j4JM70l54l5
2887a3r2L06lK10k01k73q1L12j59j63j13J97Q1J09j25j48q7p7K5M75l39R9m3N8
2911d5L05k81n0j6j15K06J09J0n1j14J79j92J27O2Jj17L01k39j89P0k47L08J06
2934A28n0m59o0M78J2k9j73N9l11L78K0L44m68k22M16R5q1M6K0j50QM5o9q4O9
2959c8K79k75L9p0m6J84k52K73%l06r8N89j66j40j61j22K15J79j08j37j04P7L39
2982A51o3P2o2Lj74J91j23L4J0j48K04j62M14m91L4K41O8j81k04P9K7K42j02j35
3006g5o9J31M0J65L7l02M1Q6L5r1k12L52j21R1L48n13MJ00k14K98m7k61q1L52
3030I4j18J04l85J33J23%O7q8j69K2K19k0P6P0k14l1K47n7l4j50J20J16j5K8j50
$$ plain form
2863 150 177 -237 -173 -174 138 77 -80 37 -281 -21 43 -112 -239 -494 12 152 -69 -31 -81 -95 -94 376 22 -13
2887 -13 -105 201 198 408 207 -66 -147 165 6 -157 -270 -73 8 117 -8 -156 -243 -320 -295 180 -159 -60 -103 -45
2911 -45 260 -21 -71 -87 -202 4 113 123 72 -42 137 -55 72 134 135 18 319 80 -109 -39 -286 22 128
2934 128 78 -381 -441 37 49 20 -153 -94 -405 -27 -7 337 -131 -353 63 158 77 123 143 -7 1 46 -23 -107 -38
2959 -38 241 -34 5 -65 -111 73 -179 94 94 -212 -310 279 113 -27 -188 -310 -95 84 -24 -161 -265 -188 151
2982 151 88 160 98 101 -73 118 -5 29 39 -109 95 -67 347 -144 -110 131 199 18 -186 -107 -80 162 60 -75
3006 -75 -144 -13 27 192 229 -73 -32 54 89 -2 -214 138 17 108 456 -57 -53 47 -167 131 84 -177 -258 94
3030 94 -24 80 -305 -172 -49 -49 18 -70 -239 -217 2 -18 58 128 -86 -117 130 73 39 -111 9 125 110 138 -12
3055a2p2Nj00L85j01k50K5J30k5q5K37l37p6J92K20l73j34M74j47K63K2j38K3
3078A26j08n9M09k40k08J68RQ2k76J50m1N9K9q9o1r1J63r9J49j97J69j00j36K64
3102G2j73K17j62j29J77N5r2J03k32L20n6J58j46l00J89oK05l8j52q8J16R3K9
3125A60l15j94K48J48j06M4k80R0J02n9R4k9r4K82J96k91o8J90k34J30j32J51
3147C3r6J49K14k56%j53K55P9k68p5J72m40K00J81m5P3j25j26j89L71J7J26k8
3170F9R4o8qK1k35K58m9J38J12j98j99J24J31Q9k81J76j78J59%k64j47L15n13
3193d54L56J7K18m85L63j17L5Q2r2j06L1J09K81k40J33m2q1Oj2K82k60l49K96
3216b9M03n24K54j41l0J70o0n0n8p5J49n4r6K43n9j10m2J27j84K8qj0K36j32L0
$$ plain form
3055 -12 -84 -79 -179 206 105 -145 -120 10 -15 -100 137 -200 -276 -84 136 -237 -371 103 -44 219 241 103 126
3078 126 18 -41 368 128 -80 88 97 179 -97 53 12 71 100 11 -50 -141 22 -77 72 -125 44 -56 -192 72
3102 72 -101 116 -46 -175 2 57 -35 68 -164 156 100 258 112 -188 1 -5 200 162 10 -78 38 131 160
3125 160 -155 -349 -101 47 -59 -15 -295 -205 -103 -162 -68 -97 -191 91 287 -4 -72 118 -116 14 -118 33
3147 33 -63 86 300 44 44 -109 146 225 -43 -118 54 -386 -186 -5 -50 23 -102 -228 -417 -46 -29 97 69
3170 69 163 95 87 108 -127 131 82 220 332 134 -65 59 190 279 -2 174 -4 155 155 -109 -256 59 -454
3193 -454 -98 -81 137 -348 15 -102 -67 15 -77 -183 -152 -43 238 -2 131 89 8 14 2 284 24 -325 -29
3216 -29 374 -150 104 -37 -67 103 43 -7 -65 -140 9 -45 -141 102 43 -67 -109 18 -166 -138 -146 -156 80 -52 -22
3241b2j16J66O6Q6n19L30n1K42j71j1o2J81J01K0l81J73k49J54j4R9kj25o9M12
3265B38k04k46J69j5j06J95j37mJ46J77j16r4mnJ25j33k6J87k60l7R6K73j45m5
3289B9n4q9Q8R8j82l77M38R1r3l8L97k42o2j3J9L1q9K08j23J14n3o8r2J96P1j96
3315IL59r3k32q2L76k48j24q1Qj04J40Q5j34K3%k1Q3L6q9N6M9J86k73L2J25N4
3341A40P4l41K53j49j49L53j77j86K34k09J1K80l45J43J50j57P7M9o6P5j53r0
3363a83J39L8P4Q4l28K06K08k46r9K08k78L41l4j69J12k8o4j35k50L89M5q7Q1
3386B4j82M9j21J34K34p8k2rj93J22J13j53K38j38r0K73l65L90k25J82l72K95
3408A06k5j25l9o2r2J32j9J62k10M26j32l42J58J86k92L61k32J35j18%k50L11
$$ plain form
3241 -22 -138 28 94 180 -339 -9 -60 182 11 0 -62 119 220 240 -141 32 -217 -63 -77 22 20 -105 -174 238
3265 238 34 -212 -43 -58 -164 31 -106 -110 36 213 97 3 -1 -6 119 -14 -40 147 -113 -150 -54 219 74 29
3289 29 -25 -114 -26 72 -110 -487 -49 42 -51 -89 308 66 4 -9 10 41 -48 160 37 151 98 30 -62 134 205 9
3315 9 368 275 43 -39 337 89 -35 -116 -108 -212 -72 13 -121 -98 -98 -119 -36 0 -89 -33 16 202 -71 -39 86 140
3341 140 214 -127 126 -23 -172 181 4 -182 52 -157 -146 134 -211 -68 82 -75 2 51 -15 60 -93 -183
3363 -183 -44 -6 68 152 -176 30 238 -8 -107 101 -177 164 130 -39 73 45 -19 -154 -404 -15 30 -57 24
3386 24 -158 -109 -230 -96 138 60 38 29 -164 -42 71 -82 156 18 -72 201 -164 226 1 183 -189 106
3408 106 81 -44 -83 -145 -237 -105 -124 38 -172 254 122 -220 -62 124 -168 193 -39 96 -22 -22 -272 39
3430C9L6mR0j66r4N5J62l2k04K65j9nJ99k67L5j40J23k03K7J37o1j40J81Q5q1
3455A8l26P0J31k26J43L05j90J99j75m7J26l4K9P9j27J58n5J34k57L67K0n11L30
3478A61k03r9o4R6m5K36j03l48N73j86k17M2K38k58r1N01l14N6k06K4K13R2j06
3501hJ0j13K84j18j50K6k03L46j49k6J47j63M5r4K73j25n1o7n2R3p7K09n0M6l1
3526BK53l24O9J21k08M6K7j54M8K53P3p3k84K43O6l57M36p5l53J41O5N0j52J35
3550D8l19N28j72k5j1p0K89j42j79q9N4J23l08K67J5J74l90L7L69j91o4J58q3
3573A9J1J10m4j08r6r3K43L18m12k62L14o2L04k51l4j15R4P5l6J94k1j54K6J59
3597A79k13j08J49K9j51m2L05q2r4KP1J7K3p7J96l28Q3n3O8j1Q5n7j16P1K00m05
$$ plain form
3430 39 75 71 161 -5 -99 -44 118 86 -118 147 128 123 322 55 90 -50 73 -130 -103 34 -27 -167 14 99 18
3455 18 -308 -238 -107 -333 -190 115 -75 124 -51 -98 28 -6 23 102 -25 133 78 212 -45 322 342 -169 161
3478 161 -42 -141 -205 -109 -154 82 -21 -369 204 18 -199 -157 81 -177 -268 233 -81 -25 -231 -207 6 98 -8
3501 -8 2 -111 173 55 -95 -69 -272 74 -75 -101 46 -117 -72 -166 107 -18 -69 -136 -188 -95 -172 37 -13 33 2
3526 2 255 -69 0 121 -87 -41 -14 -168 -120 133 206 133 -151 92 158 -199 237 162 -191 -50 15 65 -87 48
3550 48 -271 257 85 60 49 -21 268 126 -53 -142 -88 35 -273 -6 9 183 -207 -170 199 8 -56 102 19
3573 19 30 140 96 -12 -108 -201 42 360 -52 -314 0 -62 242 -9 -43 -158 -64 11 -25 169 148 -6 20 179
3597 179 -34 -142 7 36 -115 -157 148 66 -28 -26 45 62 85 8 204 -124 -41 -94 -26 -37 48 -9 -125 -54 146 -259
3623b59K86j0k5j64J96k7K22k6k19rj27J72r1J6oj05L8J80o4q4O1k26J24J48J07
3648A08j25q5Q6j24J04jj41K30r8J28P2k31K89m52L92k19J26J97m39K99k52K90
3670A54k60L37j86j32q4j7K13j71m2K4p0J44NO5P4j66M9K13j64%J48j4o7O5r6
3695B2l0r2N8k1L71j14k83J49k96K21P3K5j24k41M6M75k44r1K24j94r3L61Ml62
3719a56L05q7j49J1L36n78K64N8J75o7Oj68J15L3k1p1K67m06nK15j97k55L50J27
3743A02q7n6j40J87j20P4J96m27L85j7j14k8M4n8J15m8Q0j50k6J68n6K72l35L06
3767B67j64m9l35K87K5j17j05O4P4K26j9j72j1K03k22rJ09j78k4oP9J43j54P2
3791a6J71j54K19m2r9J9n9K09k31O9l1p8j0RK63n39M31j05p6L01l7k10n3q3J30
$$ plain form
3623 -259 27 17 -8 -172 24 -3 219 193 -26 -35 -162 10 -81 -65 -71 -176 -138 42 -22 -106 -45 -271 -147 1 108
3648 108 -17 -102 -16 -140 -36 -37 -178 52 -46 82 154 -77 212 -240 152 -67 59 256 -183 116 -136 154
3670 154 -106 231 45 -87 -171 -188 25 -146 -188 -164 -234 -90 -85 -20 54 -112 -63 150 -14 -14 134 120 53 118 22
3695 22 -8 -100 -42 -63 308 194 -89 60 -236 -15 58 83 -41 -282 -236 239 -5 -96 128 -66 -159 202 206 -156
3719 -156 149 62 -87 -76 260 -318 -54 4 179 112 118 -50 65 98 77 6 273 -133 -138 77 -120 -375 -25 102
3743 102 15 -41 -181 6 -114 -40 156 -271 114 97 -17 -45 -1 -59 56 8 88 -62 -88 80 24 296 -39 267
3767 267 103 54 -281 6 31 -86 -191 -127 -53 173 154 -18 -29 174 -48 -57 52 -126 -150 -156 -77 66 -88 -16
3791 -16 155 1 220 178 79 98 39 248 17 86 55 -23 -33 -24 239 -300 131 26 -50 251 214 4 -49 -132 -2
3816bR1k98L92j77NL8J12k91K55l0j95K03M2j30j2R8k5K5j06mL5k13K41k08K64
3841A10j24J55j88k84M31j1j26M5j9n7j12J22O1p2QJ33l6o3J43j13j16L1K18k21
3865h5j90M44k24r8J5L55k60N4J90k06n9O6o0N6J31j93J17j39n1J01J3r7MJ1J33
3890B8j90J87k11PL35j26k66K06O3q2r5K09k24J98J20k42N9n7J37lk39L66m55
3913b75J98K08r2Qj01K68j5k37L97l60O4P4l64K59j19rk8J48j52K05M1Mk67L41
3937A96l62K05k08q9J87j16J01K2J36j92J80O6j84R8L2j77K14Qj4L23m05J49j26
3960D4J06n7Jp8q9p9Q2J61j23j68P1J03K49j88j54J08k4J33k76L13m4l57J00K92
3984A26J7j28R9l8k94K72k15J04J61j04nO4j5j74J30K77l23K34l02N9q3P7o9J26
$$ plain form
3816 -2 89 -209 183 6 11 49 161 -130 125 95 -100 103 145 15 3 101 76 101 -5 -9 26 -187 54 -154 110
3841 110 -14 141 -47 -331 100 89 -37 8 -11 -68 -180 -58 3 -69 -61 72 36 -27 116 3 -113 -82 136 -85
3865 -85 -275 169 -55 -153 -138 217 -43 11 201 -5 -64 2 -58 -2 129 -64 53 -86 -137 -36 -23 -120 -116 -105 28
3890 28 -162 25 -186 -179 156 30 -236 -30 33 -49 -144 65 -159 39 159 -83 -24 -81 56 53 -186 180 -275
3913 -275 -77 131 39 47 -54 214 199 -38 359 -1 63 137 -227 32 -87 -96 -124 24 -128 77 118 122 -145 196
3937 196 -166 39 -169 -258 -71 -187 -86 -64 72 -120 60 126 -58 40 72 -105 109 117 103 426 21 170 44
3960 44 150 93 94 16 -73 -152 -70 91 -32 -200 -129 -26 223 35 -119 -11 -35 98 -178 135 91 -266 -166 126
3984 126 143 15 114 76 -218 54 -161 -57 104 0 -5 59 44 -130 0 277 -46 188 -114 -55 -138 -61 -130 -4
4008dj49K68n8K12k55M6O3k61J59p6p6K68q5p4m8K17k29l9M00k57k38O6J06O0
4032A6m7m8P8k30K22j89J45k08J44J17N2q1j43K88J3K3j09J49r0j55Q1p3J41O2
4056A58k12M4J0nK99j31Ml2Nm2k57K15q4J12j49K23J2k81M5j2j5K28k41k3p5J10
4082i4J40j84L29m41K50k2j17j83J39K62k2j91J43J20k75P6J80k36J35j43L1J3
4104i0P9K3J63k48j30K01k71J48L08l78K84%j36J30k30K38j66J48Ml4k03J10j31
4127a81J49K25j63k35K45j35M1J7j8J0J7p7O7J88l08O1J22L0p8o3J48o5k09J77
4151c5O0j20L68k56j18m7k3J12J26k53J56K91k00M3o6k07j09J00Q2j67M3K70Q0
4174A30J54l48J92k41K79n1j70K40k2j25n8p7J26M6n1R1k8j82j35J49J91j94N5
$$ plain form
4008 -4 -153 115 57 269 14 60 123 -138 21 -55 -131 137 52 -22 -70 147 -82 -121 279 22 -216 -150 -44 16
4032 16 -31 -79 -1 -231 -9 -198 -53 -261 -117 0 52 -29 -172 116 129 152 43 192 102 -53 28 -45 96 158
4056 158 -54 -10 0 -5 294 163 167 135 140 98 -159 56 -28 84 -65 158 170 -111 -66 -78 -93 135 -106 -129 -204 -94
4082 -94 46 -138 191 -250 0 -22 -139 -322 -183 79 57 -134 9 129 -146 -70 110 -126 9 -134 -103 -90
4104 -90 -11 12 175 -73 -203 -2 -273 -125 183 -195 89 89 -47 83 -147 91 -75 73 77 43 -160 -50 -181
4127 -181 -32 193 30 -205 40 -95 -54 -37 -55 -45 -28 -105 -38 150 -158 -97 25 55 -23 -86 62 -3 -212 -35
4151 -35 25 -95 273 17 -101 -148 -171 -59 67 -186 -30 261 61 104 38 -169 -278 -178 -96 -263 -220 50 130
4174 130 284 -64 128 -113 166 115 -55 185 163 38 -20 -97 29 75 24 115 87 -95 -230 -81 110 -84 -29
4197b9J3k50L63j86J17O5j21j03J6J04L25j33l5J88o05K11K41j17o7Lk26K87j07
4220d6j63K47m5J21k00o3L94m81M61j94K9Jj65J60k88P4R0J0J09j06K41j53j8
4243A5m7j09O2K82j20%L2k15kJ23L8k41J50o7R5q1QR1R0n5j11j63J36o1K09m6
4269A3m9pJ33K32j59k14P3K9k15J44P1k44J04K43k23RQ8N1k50O6l2O1j03K60r1
4294a0j86L3K67j55K59k99L61p11N01o9j43J67l9K08O1k71N0J01J50k61j61J33
4316a4j05L29j76J2P5j63M2j05K27k11Q1L0n9J09n8mj4J59k1l6j91Q2j88J53J81
4341A35K35l11l8r9J07o7j64p8N4K13J66j77O5Nj28lP3m5J36j27L2o2j4J88o7
4366B9j5K06k77P9j40K07Q2k64J6K35k44K02l26K47k02M54m71M8J38R3j8p0M6
$$ plain form
4197 -29 -16 -266 97 -89 28 93 -28 -131 -115 -11 314 181 146 334 -271 -60 181 64 -3 0 -226 61 -46
4220 -46 -209 38 -7 114 -86 -149 245 -236 225 31 60 61 -104 56 -232 -158 -68 -58 51 -55 186 33 15
4243 15 -32 -141 -79 203 83 83 115 -100 -102 21 59 -182 -32 -99 -4 -85 -77 14 104 49 -62 -225 -89 -150 59 13
4269 13 -36 -43 90 322 163 -51 22 51 -164 -20 51 -193 -89 154 -69 -60 28 79 -171 -105 -137 -76 -179 81 -10
4294 -10 -196 -163 104 -51 208 -91 270 -441 60 -9 -152 15 -24 184 245 -26 24 125 275 14 -147 -14
4316 -14 -119 210 34 46 121 -42 0 -105 122 -89 -8 22 -37 72 14 10 -4 155 134 98 -93 -11 -199 -46 135
4341 135 370 59 21 -78 29 -38 -202 -280 -226 -13 153 -24 41 46 -82 -85 -12 -57 79 -48 -16 -78 -92 96 29
4366 29 14 220 -57 22 -118 89 171 -93 -77 158 -86 116 -210 37 -165 289 -182 -134 4 97 79 9 55
4389E5p4J58P9k60m4n1m6J12J77k59P5J10Q4j28j88L10o8j46R0m5K58k38K49K
4413B12k02O1r5O4j86O0MO7j25k6K46k05R8Q1J84k40j6J27l37K31J00q5K53k43
4437B8k86K76j25J74k23L09j80p0m8J19J83M3r2k04l6oL28l06j24L68J7j50J14
4460A09k3n0j90K4J71K20k37j74K68j06q3n6J49j20K43k22M9J65L6k89L7j4J87
4483I4j71J71m2j7J12k76J87J36k19n4k0J04nj74L44m3m5l25J39j36J40J84l0
4506E4J39p9j09j9J76K6j25J10m99L40j61J1M94l93j15J40Q4M5k53r4J52J2M4
4529b0j52J70J02K16m72M93m04J22p4O5p6n9Q7p0k63L99o6j84Q9K51no0j57J61
4553I3p5J81j67j48M5M02l31k29L13M2j94J20r1J42k04N4J60k09J6k60L15j05
$$ plain form
4389 55 -19 139 218 -42 -86 -137 -183 -71 106 -153 -78 32 116 -12 -200 110 42 -104 -14 -59 199 -39 210 212
4413 212 10 71 -24 40 -146 -86 -82 -15 -140 -166 80 -125 -27 54 238 -2 -18 109 -228 3 103 18 271 28
4437 28 -258 18 -107 67 -156 153 -27 -97 -145 -26 157 200 108 -96 -132 -138 190 -116 -240 128 145 -5 109
4460 109 86 36 -154 -130 41 261 24 -150 118 12 -71 -127 22 -98 145 -77 -28 137 173 -116 -79 -93 94
4483 94 -77 94 52 35 147 -129 58 194 -25 -79 -99 5 0 -174 170 127 82 -243 -104 -240 -100 84 54
4506 54 193 114 5 -14 162 188 63 173 -326 14 -147 -136 358 -35 -150 -10 74 119 -134 -228 -76 -64 -20
4529 -20 -172 -2 100 316 -156 337 -67 55 -19 46 -30 -89 -2 -72 -335 64 -2 -186 -97 154 149 89 -68 93
4553 93 18 199 32 -116 -71 331 0 -229 84 126 -68 52 -39 103 -101 -47 113 -96 -80 -340 -25 -130
4575a30J02pP9k08L56k08J26k12L98m45K00K0Qj44N0P6O6j20lN5K2j05j36L1J23
4600fL6m1J13k45J76n4L8j79N8l9m9K37k60M93k8l15O2o1J73j78k14L02j8j28
4624a27K30j01P8ql8Lk7P2Rk23J6J49o3J76j05J56j25P7j72J20l35L13l93K52
4648f6J93j42K18k86O5j95J81j45J14L18j25k11K85m7k13O7J44j13j13L40k07
4669F2M1J4r8j7J19j8J9k49J79L2j7J47k51j9L07l70j3L15P0j45L3l49K68J19
4693A79j25L0n4R7k36J23K54k00j75L03k47N1N9J2j87l6j35K52pj17L26k63M6
4716e0j9J39q0r9Q2rJ4J16j92J02M3k59PM05k12l32L13P0RJ55l37K46j55J63j64
4741d4J42r9r7N5M09k13m15K24j09K65J36j03k11n2J79l15L64J7j9K3k86J48p5
$$ plain form
4575 -130 -28 -35 44 -164 192 -16 110 -102 296 -149 51 71 79 -65 -15 61 127 7 4 59 81 -24 -160 -129 -6
4600 -6 30 -11 102 -143 33 -21 17 -162 -104 -143 -192 45 -215 278 250 -65 -3 -64 109 -69 -283 19 1 -127
4624 -127 103 2 80 72 34 37 10 82 91 -132 -116 33 -30 146 41 197 72 149 -23 97 -238 75 -318 -66
4648 -66 127 -15 203 -83 -18 -213 -32 -177 -63 255 130 -81 204 157 -56 11 155 42 -71 269 62
4669 62 103 117 19 2 121 103 122 -127 52 84 67 214 -37 -56 251 -119 -132 183 253 108 141 -208 60 179
4693 179 54 84 30 127 -109 14 268 68 -107 196 -51 0 59 71 -116 -152 -287 -35 -42 -159 167 -96 -50
4716 -50 -69 70 -10 -109 -27 -36 -22 94 -98 4 47 -212 -205 200 -12 -344 -31 39 48 203 -134 112 -43 120 -44
4741 -44 98 -1 -98 -43 366 153 -262 -38 -147 118 254 151 -60 -112 67 -248 116 133 114 137 -149 -1 -76
4764g6P0N8J5K0K5k0j51J66Q1j48p4k21L41j21QO9j61L1M0K5R2Q8k04K00k73K8
4790i2K57k04m8J73L7k48K37O9m55K01j71L02K5n1L0K16k95Kj94J17K60k07J10
4813G1L8K6k08J7M7L6k7J0OJ27j7Q9Nj45P6j11J16l04M5r8L18k80L17O4j53j64
4839i9R5j50K88j09qJ6j04q2R1J92l6l8q4N1j10kQ7j15r3K35l00L81j2m6O1q9
4865B0P4J8j29j14k31M16j52K90m07J23ON9J8M4J16k26M4K70k36n4L24j77j96
4888a00j96L62P2j80j32K43k06K15k73L32j67j13P8j02J12J22O7j55j26J03j04
4909a48J97o7j5q0J0K64M3j69K7k83J56J25l9Q9k96J28j9l9o4K0K97k55J64j11
4933f5M5j23R7o7J32q3K14q7j28J15K7J01k10n2Q8K65k70Q4j7j35K28Q0J9k55
$$ plain form
4764 -76 -6 52 67 87 112 92 -59 107 188 40 -34 -255 86 -35 -27 42 -119 -88 -48 -23 69 157 -47 153 -120 -92
4790 -92 165 -39 -87 86 123 -125 112 181 -274 -73 -244 58 83 32 62 278 -17 -15 -209 -92 168 -39 71
4813 71 109 135 -73 -56 -9 27 0 10 16 143 126 215 220 75 151 40 156 -148 -103 -201 117 -163 154 218 65 -99
4839 -99 -4 -154 134 25 17 33 -71 -153 -62 130 94 56 -28 23 -87 -89 -2 -117 -210 25 -275 106 94 48 109 20
4865 20 94 112 -17 -131 -362 54 -98 192 -215 -92 -86 -27 -9 35 151 -75 -31 239 3 -51 273 96 -100
4888 -100 -296 66 138 -42 -174 69 -137 78 -195 137 -30 -143 -65 -167 -55 67 134 -21 -147 -44 -148
4909 -148 49 -18 -33 -113 -103 161 204 35 62 -221 -65 60 21 110 -186 -58 -77 -116 -180 -160 137 -118 46 -65
4933 -65 -20 -143 -46 -113 19 -64 150 63 -65 50 77 178 -32 -84 4 269 -1 83 66 -69 159 239 258 3
4957CJ83j13J81n5k88K57Nj17J05j22Q5J14mm79J00J71j04M4n4J47M4k69K59n2
4981D1L7j77J26j0J12l51N4oK70k41K05k93K75J31l10K35P9j89p8K22j90o6K7
5004i7kR2J26Q8k49K17q9p5K41k45o8J8L06k17ML9J4j73J52j36M7m8J7j20K31
5029G3l0NK02k96K9M52k66j52J1Q4J38l94L92l20J70J24l10K13k96K86m5k96N7
5052a69R0L4j81L12p2J57k01Q8K4j62L10k40o9P7j34R5l2JL6J40q1K15k03r1J43
5077H7o0J15R1r2k8Pl86K78j9j15M6J20o7K27l07J54k06J05QJ79j03k28J35m6
5101a05M0J2p8L67k19J5j65K16l3O0k14J61rK3O1j13j15j37J75N25l42M7k00P4
5125D6r4J80k8k56J60J21k13K6J5O6LO4j29J28j21J7m0K57k63K95l8j3l38J23
$$ plain form
4957 3 186 73 254 199 -89 168 173 56 161 39 124 238 234 -245 -145 26 -78 -34 -88 59 103 -166 93 41
4981 41 78 -99 27 17 129 -222 -168 -174 96 -145 60 -233 42 173 -137 98 177 -12 -90 132 -58 -124 -97
5004 -97 -99 -7 119 207 -42 175 86 11 252 7 -61 -43 263 46 50 89 103 -70 82 -54 -7 -55 -38 -158 73
5029 73 43 48 250 -46 -17 435 169 17 28 112 250 -144 248 -72 98 222 -88 125 -171 115 70 -226 -169
5052 -169 -79 -45 -226 86 14 171 -30 58 82 -80 230 -10 -79 -2 -136 -41 -73 -72 -36 104 23 238 35 -56 87
5077 87 27 142 233 141 113 120 -266 12 -7 -122 -76 44 -23 204 -103 51 -155 -50 -42 137 34 -194 -59 -105
5101 -105 -65 -53 -131 236 17 32 -133 83 50 110 -104 57 48 71 132 19 -96 -233 -58 467 125 172 -28 46
5125 46 -48 132 104 -152 8 129 -84 -58 -43 23 26 90 -39 89 -32 -15 -55 202 -61 234 196 183 -155 -32
5149c2MQ4j50K34j45PK76j2j89l02K65J00k34K16k48R1Qk6K9O5J87j95Q1J83k38
5174E9O3r8M4J6K87n87K29j44P9J33q7J46r6O1m4J05m6l01J60N7n7q3J35O2J3
5199A06j72K13O4m66K60Q2Rk29n1K90p6l14K23J93j8j41J76j24j2J9l56K64QK6
5223b6o8O5P1K00k34r6M7J32K11m10l2Q9j17L08j79j35J8J48R4j84r2K24l6K05
5247B03l00R3j4J68k63q6J87j29L09l30L15m9j04r1K73k5%j74j91L71j89k9J50
5270I5k06K54k22J29q6n5K8J03J7j21J42K88r2l00P0l78M98k42O6J09k13K42q
5293A18r5J75l40o7K04J34n3j98O8j6L08q3r0R2k8k19M8J72k88J14P9j49K1K56
5317A63k2j6k08n3j56M95M6k49q2J68lj72K76k06J8J47k57j4J75J12j69J23m7
$$ plain form
5149 -32 -28 56 -94 140 -5 2 278 266 77 -225 40 140 -94 122 -126 -35 -27 -53 -24 41 228 33 114 297 59
5174 59 122 24 68 84 371 -216 13 -131 -52 81 -6 140 44 105 61 166 120 -181 -21 36 -21 -104 31 93 106
5199 106 -66 147 211 -255 5 87 96 -133 -184 106 30 -284 -61 132 114 -27 149 25 13 32 -324 -60 -52 -26
5223 -26 -94 -29 42 242 8 -88 -41 91 302 -108 -140 -51 -168 140 -39 -174 -156 -8 86 -98 -190 34 -2 203
5247 203 -97 -4 -18 150 -113 -199 -12 -141 168 -162 153 104 0 -91 182 157 157 -17 -208 163 -26 -55 95
5270 95 -111 143 -79 50 -36 -91 -63 40 57 -64 78 366 274 -26 44 -334 164 -78 -12 97 -116 126 118
5293 118 23 198 -142 -209 -5 129 76 -122 -54 -70 238 155 65 157 129 -90 -42 130 -158 -44 35 -114 -93 163
5317 163 141 125 -83 -136 -292 203 249 0 -82 86 83 -89 187 -19 -1 146 -111 -125 50 162 -7 116 69
5340F9j09N3j22J44l3j80K47L1j18p0p7K42l61O29m27NK88m08J27l8J4j9r9L56
5364A44k43p6J04L7K08l20r7J48J23o9L4L43m18J06r9O6k33M00J1k50p8K05j14
5387f8J37k2J36k36n2K53l54L8J82k0M5j28L43R7m56K58q7k55J29r5J87J2M60
5410E04o90j50N25k24r1J40P4l48N8J18L03l22J87J17j71J0PJ19k88K00k3q9L58
5433C24m70J70j41J95Om1Kj43J09j36O4P4N0J46k24j06J26K3j28J07JQ9j62j44
5457b09K64k57J59O7qq7K2J01j66J86J7pj28K66l39K3J78q8m5M6l0N6K2Pj99j7
5483a66L11j02k08J89O1k68J95L65l03j05o0r0K34n0J01k06J30J20k85J6J07R3
5505G9J22k59J40j34L4j31R5J65p7j04p9L14m3m51N3L68j36O0k91L22mK7j03J8
$$ plain form
5340 69 -40 13 -109 35 2 -178 69 100 -18 -88 -165 77 -284 345 -82 -77 211 -197 -70 -108 -94 -113 -212 144
5364 144 -99 -175 -71 -34 174 -146 -243 -95 28 -41 -7 336 -82 24 -75 -9 -242 158 169 -81 -159 46 -68
5387 -68 69 47 183 -53 -105 148 -206 -168 14 -6 39 -89 254 351 -105 153 66 -189 -60 -155 32 44 504
5410 504 -186 -336 189 -35 -126 14 88 -260 -202 -84 219 -103 84 201 30 40 47 166 -122 78 55 -34 324
5433 324 -146 24 -117 78 84 43 45 -98 11 -125 -61 13 63 209 -15 -121 5 28 -100 7 8 97 -65 -209
5457 -209 55 -202 -43 24 16 -71 -49 52 -114 72 89 82 -46 220 -119 -96 82 -6 -51 -5 -35 21 43 50 -149 -166
5483 -166 145 43 -165 24 85 -183 12 377 74 -31 -91 -181 53 3 104 -102 28 148 -137 -121 -14 79
5505 79 201 -58 82 -52 -18 -149 -54 111 34 -70 -149 165 122 -329 -276 92 -44 16 -275 47 43 70 -33 -15
5529a5j71J89K2j14J5K46k55Q3n6p0M36l66l49L58k33j01J10M51k55j16K28j88
5551a51K23j24q9L74j54J36k03j8J50n9j22j21K8J92K3j26J63p2j17l7J60Lm1
5574A8r6K4o3K1p1n1R8j89J19K47n6Jp2j63O6K23J7J74k52jM4k77K43r6K17j33
5600hJ58Pm6l1q7j02J29k7o2M3j93M07l03j3J05J09k41j30L00L0J42o7j3r6j12
5625a01K4M2K28l15K4N8P1k6k9qk25K16qJ56j45j81K78p8K33l79K23q3J8K8K65
5650B86k01r8J1j72L26k07o8J95P9Q3r3l18O3P9NJk7J54r0R8j03J12j46K09q6
5675I2ppk68L75oj92J20j29K02r6j71J77%J85k49j96L22L1r5l20L33O6j79r9J65
5700E4r8P4J72j52j29J36m1p5M8J47M8j80k45L97ok72K31j33o3J06J6p6L4J05
$$ plain form
5529 -15 -186 3 25 -89 -74 172 -83 0 -56 -126 310 -56 -405 -47 -280 -381 -271 180 -75 -191 37 -151
5551 -151 72 -52 -141 233 79 215 12 -6 144 85 -37 -158 -130 62 85 -41 122 50 -67 -104 56 59 18
5574 18 -78 -54 -117 -96 -167 -218 -120 -309 -190 57 1 2 -70 -233 -167 56 73 247 -5 -6 38 -239 4 -92 125 -8
5600 -8 150 157 111 80 -7 -109 20 -7 -69 -26 -219 188 -115 -128 -23 86 -155 -285 15 45 187 120 107 11 -101
5625 -101 -77 -35 193 -122 -98 -40 31 5 -24 -32 -257 -41 -49 107 -38 -219 59 -19 214 -165 58 -25 -7 21 286
5650 286 85 -13 -2 -174 152 -55 -123 72 151 234 141 -177 -114 -35 -30 -29 -56 98 8 106 3 115 -31 178 92
5675 92 85 78 -190 185 179 -13 107 -22 180 84 -87 90 90 275 26 -170 152 183 88 -232 101 167 -12 -111 54
5700 54 -44 30 202 50 -79 57 16 -59 -11 136 184 4 -241 156 150 -122 109 -24 -87 19 35 -41 -7 98
5724I8M9q1j12K39m36J06J32l6R0j83J03P2k52L64k69%J08J89m05N7l2O6l0L7
5748a26L6J47j31J98k62K19L2m9J07l25Q6o0k14N44l57K78j93J38j07J26o0j74
5770a47M3R6J25l21Q1J50o4J7J24k11J1J15K12k52J56N8l35J66m6J10l38R3J5
5793a42K75Qj36J08j30j44K54n7k35R4j76L34j25Q2j84j1K69k91K7J32k8k11J30
5816a57oK80k00P2j94K18Q7L1l35J61n4M5K85k76J03j87M5J22J48k23L18k61N2
5839G4R0k09K27k60j50L44k71J71nm0j13J40K12n1l9J33q9k62K96k96R3k13J78
5862d0O0M5m9k4m7J10j30J47k38M52k33K6n2j30L05n04M28k08J98q8J54J17n89
5885b90J91K67k55K33j26j34J73P6k04m6J65J07l06L41l62L5k6P0J34k71J88P1
$$ plain form
5724 98 147 66 -46 193 -243 -137 -5 -41 49 -134 -31 41 -211 153 -116 -116 -8 181 -224 -167 -199 -133 -163 -126
5748 -126 -90 57 -74 124 -138 81 113 64 171 -154 -68 -128 -342 202 -155 123 -70 68 -39 87 27 -147
5770 -147 -104 -8 117 -204 -123 27 -37 -20 104 -107 -96 19 231 -21 135 193 -142 24 -22 88 -250 -157 -142
5793 -142 133 141 5 113 -17 -161 93 36 -199 -105 -281 53 -72 10 -174 -185 84 -207 -180 -48 -76 -287 -157
5816 -157 -163 117 -83 -11 -205 13 100 131 -204 -43 -97 -52 233 -43 60 -127 -82 40 188 -35 283 22 74
5839 74 164 -45 182 -78 -228 116 -155 16 11 -29 -142 -2 210 159 120 253 164 -98 198 -98 -5 -218 -40
5862 -40 20 65 16 -8 -55 55 -75 72 -166 286 53 79 27 -103 202 -302 126 -82 116 28 182 299 -290
5885 -290 -99 168 -87 146 20 -114 59 135 -69 -115 50 157 -149 192 -170 -135 -161 -91 43 -228 -40 31
5907C1k03K31j46O4l1Q3k90K50j4J02Ro5j86L69j50R6k55K71l32L10P5l50J43
5930A2k70M24l08J61j71L94l12RJ84q0J83l40J01k34J70K1K4m5J90k06Q3K40l26
5953i6J70k20K61k4K7m4j82K35k53R5Q2j06J64k99M9O3O9O9K6k06L57l72J53R3
5977A11l02J43J11j12p8J80L8J33l06J63j4J25l27J85k00N3O6K02Q1k21K02m53
5999b20K03jJ8r8L43m32K9O6MN2Q1N2j98J94J33j03p9k5P0K51l98O0nl0K41p3
6025A35j57n6P6K83l86J0O5O0N8MOn7j63j02L70l28K42J52r3k00K79N7k82m3J04
6050C4J5n3K4K22l61onO9k8J96k88J65J9J92k14M7n5k12J44Q5n1m9K54l98J17
6075a37L37q3l29L99l46J68P3J32m25K14J71j96J39p1K31m22J49j79L10o0q6R7
$$ plain form
5907 31 -172 59 -87 -23 -54 29 -261 -11 -25 77 86 21 -165 204 54 150 -105 166 -166 144 219 -131 12
5930 12 -258 166 -142 19 -152 242 -70 -61 123 43 226 -114 -13 -247 -77 -56 -32 -77 113 -93 -10 230 -96
5953 -96 74 -146 115 91 118 74 -108 127 -126 -31 51 -55 109 -190 -141 -78 -9 60 86 -120 237 -135 18 111
5977 111 -191 -48 63 -49 -127 53 91 224 -82 81 67 192 -135 50 -150 -97 -31 171 252 31 233 -220
5999 -220 -17 -18 0 -98 245 -187 -158 -92 -88 -36 45 97 -101 93 226 123 44 19 89 340 -58 2 -3 -33 208 135
6025 135 -22 -78 -2 281 -105 -95 -30 30 88 92 98 41 -122 -224 146 -182 60 212 119 -81 198 255 -27 -70 34
6050 34 49 -4 20 242 -119 -125 -130 -61 -89 107 -181 -16 3 195 -19 28 -27 -239 -95 -10 -61 -110 144 -254 -137
6075 -137 200 117 -212 187 -159 9 82 214 -211 3 174 -22 117 46 277 -145 4 -175 135 75 -11 86
6097H6j12K08j66L45l54J10n6j0R2k31N0l3K17rj17r7J5j22k7L48k59K08M7J5
6121A48Ok53M2N2QQ5J12j65j16K57k71Q7j30J71N6j6l8m3k08L30K8j21Q0j12k01
6146b12K25L15N3k44l34J13J80k15K50k9j18q6q1L68k97K55k6l30L81Q0l94K3
6168a23R6KL0L13l14m7L91l88k0J74p2l1p8J24m8n1R3L7j5l58M59l3l69r5M13
6193I0k83L54j30J15j11L1n1m6L1L7j10l1J59Q5k26J1J66l9NQ8k44L8L67l25j1
6218c0J27O5j82j9J07q0j63J23k06L92o0r7q8J32j10L78m27J12k1K22j49M3j7
6241E2q8p1j73L81J0q6J01j34M9j30m9J35j92K13j32j83N94k38J56k13j77J68
6263gK8J02o8o2Q5m9m8o1N8K29m55M43l22N53n11J41k1p6j34M43l93J49j32K33
$$ plain form
6097 86 -26 182 16 361 7 117 61 51 143 -88 -38 -71 146 137 20 -77 -62 -184 -211 137 -122 86 133 148
6121 148 154 -99 -57 -5 3 88 200 35 -81 176 -95 -8 -138 33 89 73 35 -8 -216 114 142 21 101 -11 -212
6146 -212 13 328 381 137 -197 -84 96 -119 131 102 -16 -102 -183 185 -112 143 117 -213 168 248 -146 -123
6168 -123 -27 -25 5 318 4 -43 348 -40 -60 114 42 11 -67 57 9 -42 51 88 73 -285 174 141 -228 -323 90
6193 90 -193 161 31 146 35 66 15 -31 0 37 -73 -104 55 140 -86 -75 91 52 57 145 -99 -61 306 -19 -30
6218 -30 97 162 -20 -39 68 -12 -175 -52 -258 134 74 -23 -111 21 -89 289 -138 -26 -47 175 26 69 52
6241 52 -36 -107 -280 101 111 25 126 -8 41 -89 -138 -3 -195 18 -114 -297 297 59 215 2 -175 -7
6263 -7 21 123 55 -7 78 29 -19 -80 -22 207 -248 195 -127 426 -85 56 35 -41 -175 268 -125 24 -108 125
6287A25k5n4k5q6l0J5K21j56J12k09kJ41r7k97L90J65k53J09j25K09Nk46K38o8
6311E7j4L31m14J32J26k26p6J73j77K89q6k07L21k36J40p8j00J7N3j19M1L6O3
6334D6j68J03kk5k3J13K14k72m5l7M5K64k80j4K50J07l26R4J43j61l08R1K1O0
6358a10J44o9j03J06O3R8k01P1k0j9M3kN7K0k37M4Q0o0K19j96R7K61k74N3n9j06
6384a00pL6M18m47L3N0O9j5p2Q2R9j65j14P8K42j39r3J15m7o6M8k78J54L00l60
6409a79K18J16o0q6K07j30Qj71J75R7j76r9j7N3K01k13J81l27L04j16J95l23L01
6432A59j12J08j92J12j6j77K19k59k3j20K02J59K5j43MLJ79j53l6J32k73L19j47
6455c0K50l08J51p6k70L5M33j75M8j1m9j03O5K08j87L05l45k50K12J75m11M36
$$ plain form
6287 125 100 46 21 -65 -95 -80 141 -15 97 -112 -114 27 -70 -367 23 188 -65 44 -81 128 133 -113 125 57
6311 57 43 374 -40 92 218 -8 -84 89 -88 201 115 -92 229 -7 133 55 -45 -28 25 -94 -53 -17 46
6334 46 -122 -19 -21 -46 -69 44 258 -14 -59 -96 -51 213 -67 -81 169 276 -50 44 187 26 -282 -191 -170 -110
6358 -110 34 -35 -138 -32 31 129 -72 -1 -21 -40 3 1 58 78 -159 -115 -35 -95 124 -72 25 286 12 65 6 -100
6384 -100 -107 -71 347 -100 -67 -17 52 37 -35 47 146 -19 -133 -55 187 48 -45 70 23 -43 5 -273 -119 181 -179
6409 -179 39 155 95 9 216 86 94 -77 98 195 19 -80 -97 -44 157 -56 125 -202 102 -14 181 -142 159
6432 159 47 155 -37 75 59 -118 101 -158 -181 -301 -99 60 85 -58 -54 -51 128 -25 -61 71 -202 117 -30
6455 -30 220 -88 63 -13 -283 -248 185 10 58 47 -2 -105 -40 168 -19 286 -59 -309 -97 78 -333 103
6477A03j4j1m3j39J89j05j2J05j7k86K83k48K67j1k2Qj35J13J35k66J15j72K08
6500D5k62L65k12K10l02J56J86j68J57k55%oK13l20J40Qj75K34K0j85J79J4j70
6523a28k5K20j10L91l11o8N7j51J24P7j26J21J06j72N9m3n9L7M6l9P3k46n7R6
6547a28J52J98k44m5N9q7L2k43J69o4K2L52k78K94j85M2q6J35qL5p9j08j0J90
6571A15j17Kj78J47N5r7J63Km6L8Jj63j32L25j19j09jM9R7J31j95j9RM9P3k97
6597b17K65m4p5J26o8J81j52k4l5j07J00j38M28k44j40K77j09k4J91l90j2K81
6619G0k58K17j6p7j23J62J23j19oJ54q5J20n0L8j16J92k85n8K06j67K82p8p2J29
6643A83k89OJ6R1k3m6m6J97N9j40kj94L87o9l73K10l3j49K31l5k0l4lJ05j49J99
$$ plain form
6477 103 89 78 35 -104 85 -20 -32 73 56 -230 53 -195 72 61 39 47 -88 25 160 -106 9 -163 45
6500 45 -217 148 -64 146 -156 0 186 18 175 -80 -80 -86 127 -193 -53 -45 -220 14 34 -151 28 42 -128
6523 -128 -153 67 -43 348 37 -31 26 -125 -1 76 -50 71 177 5 64 21 -38 -1 45 6 79 -167 -224 -128
6547 -128 24 222 -22 -67 -8 -95 -63 -306 -137 -201 -179 173 -105 189 4 46 -40 95 87 122 43 -65 -75 115
6571 115 -2 0 -178 -31 24 -73 90 92 46 84 85 -78 -210 115 -4 -113 -114 -65 32 163 -32 -51 -42 7 80 -217
6597 -217 48 4 -71 55 -13 168 16 -8 -43 -150 -50 -188 240 -4 -144 133 24 0 191 -199 -211 70
6619 70 -188 29 13 -64 -187 -25 98 -21 -27 127 42 162 112 150 34 226 -59 -117 89 -78 204 126 54 183
6643 183 -106 -100 -84 7 -16 -62 -108 89 148 8 6 -188 199 130 -243 -33 -66 -215 16 -19 -39 -73 -76 29 -120 79
6669G9MN6l02M15k81j70Q5J44j38k1J1n2j07K63J20k19j27M40j80q7J59Q9n8j62
6693c9p9r0J49m8r5K65j19n0L32l01R8j24J74J13j79j73L18k08J16P6j83kk9P2
6717fO7k11j25M0N8K4J25j9J51N7k97N21j94j70R8P2k0r2P7k13J13J16l53K89
6741A08l6j18n0k5r2L74k0m09M41p6l7j44J67l43L69k68mJ71J16l31K14r6Q4L0
6765B5N7k29n1K34j66K79k31j0K01k06K04k12K9J55R3kk22Q4j18J4J74p7j44J60
6789D1J42k86M02j57j27L61m58j13P1m5k6J21Q3K61k35K00m11j87L00K1lj12Q7
6812g0J2L5J1p6k4J49K2k86K07K30k39J00l6J58p8m9J86k77J84j03l9K2j24J7
6836f8P5R4p8Q2j11L7j19j24J35J39o9K5o1q6J45n9k03L28m0j88P8J54L6k0k20
$$ plain form
6669 79 83 139 -163 252 -29 -199 -114 30 -108 -129 -118 -170 -277 -14 106 -113 -240 200 20 -67 92 181 123 -39
6693 -39 -118 -208 -59 -107 -202 63 -56 -106 226 -75 23 -101 73 186 7 -166 152 -56 60 136 -47 -49 -78 -6
6717 -6 61 -150 -275 -235 -177 -153 -28 -47 104 161 -136 385 191 21 119 191 171 79 156 -57 56 172 -181 108
6741 108 72 -46 -96 -121 -213 161 141 -268 173 97 60 -84 83 -260 109 -159 -163 8 124 -207 7 -89 -5 25
6765 25 82 -147 -198 36 -130 149 -82 -92 109 -97 107 -105 -76 79 172 170 -52 32 -86 -72 102 25 -119 41
6789 41 183 -103 299 142 15 376 -82 -195 -124 -169 -195 -74 9 270 35 235 -176 -363 -63 -42 -45 -157 -70
6812 -70 -58 -23 -12 -88 -112 37 59 -227 -20 210 -29 71 35 193 115 66 252 -25 159 56 17 39 -85 -68
6836 -68 7 101 23 105 -6 31 -88 -212 -77 62 -7 18 -43 -129 16 -43 -246 82 42 -146 -68 86 122 102 -118
6861a18q0j80L74ON5j69J29j97R8K08m43L61nj22P4J06j36J24k4J34j38NQj33
6885f3J72r1k55J51q7p8K50N4r9O5j52K51m16L69oO9r2j10l2J6l8J27j76K58o5
6910B2j3k9m1J2N9j98L6K14j82L3P1k47L18P0j78J0Q9n1o0J90k2j09K1Ll9K69
6936B48j12Q8l50L40l96J09L9j45j00J56L17j06j33R3Qr0L0J16j07n5M03k48l18
6959b13K93M5j26K0Pm4Kq1O5r1K2L53l29K69j72m8q3N6l2J85j41J13n5J38l01
6984a48K05O8j36J42j71q4P2q8J28q4O7J58k0k44J45q5r4L31k79J77j74K13o1
7007C8j48M08j10l57K31k50M1J38J55ml19Q7J55j8j84KQ0k7J03L4J9n2o4N7q6
7032g1J10r6q6J28J27n1N2J2j33j28J29J50o2JLJ0j16J89k84M08p9l85Q7J04o
$$ plain form
6861 -118 -198 -378 -4 2 57 -112 17 -180 -82 126 -317 44 39 -83 -9 97 -39 85 61 195 57 62 70 -63
6885 -63 109 18 -237 -86 -173 -251 -1 53 -46 19 -133 118 -298 71 65 134 42 -68 -100 -84 -122 5 -171 87 22
6910 22 9 -20 -61 -49 10 -188 -152 62 -120 -87 -16 -263 55 125 -53 -43 46 -5 -65 125 103 -6 15 18 -21 248
6936 248 136 224 -126 214 -182 -73 -34 -179 -279 -123 194 88 -45 48 56 -34 -4 112 5 -50 353 105 -213
6959 -213 80 125 -1 19 26 -18 -16 -97 -32 -123 -101 252 -77 192 20 -28 -111 -55 -87 98 -43 70 15 153 -148
6984 -148 57 125 -11 131 -40 -124 -52 -140 -12 -96 -29 129 109 -135 10 -75 -169 162 -117 60 -114 99 38
7007 38 -110 298 188 -169 62 -188 -147 -9 146 142 -177 -90 65 47 -137 -135 -55 -82 21 55 74 22 -42 15 -71
7032 -71 39 -57 -143 -15 112 61 113 125 -8 -136 -7 143 81 82 85 95 -21 168 -116 292 213 -172 -85 19 13
7057A3k0Q5k52P0l8P4L24l14k83K88j84J90J52j94p9L53l3k26J52q5J96n4k01
7080f6J18p1R3N2l1R3k1l64P9o1j6o2J82J82o0k12J33q5J92j24o1l2M05o0k66
7105f3l43N10l25K86p2j47J10K20l12Q7q7J50l2l9N5j41M73j86j53l7m3J39o2
7128a2r3M1J65l14M8K50Q6m3o7J44qMl4k35O8l22K46J26j19J77k09n3K88j67L55
7153C22k22k9l63L29o7oK5M9j45L10j77j29J61J06m28J82J41j31lQ9l1P7l0j81
7177a51K07O6o5P5k50j28N23k61M2k18j12L12m0J67k21o0K54k91J72j27q9N4L02
7200A61m24K19L21m08KJ98M6j45J21J56k41r8o2L03r0k48M12j1j56O5k63K77k11
7223g6L1j28K36j64J37j32J32p6N2j52m7J28J33Q2l17N9p2J15Q0Pm07N40k03o2
$$ plain form
7057 13 -7 78 -174 -104 -142 -68 256 -58 -341 -53 -237 -47 105 -89 -168 185 152 -74 78 -7 189 135 -66
7080 -66 52 -19 74 126 95 188 167 -197 -118 -179 -195 -257 -75 107 47 -165 -32 -117 75 -49 -110 -142 263 203 -63
7105 -63 -406 104 -221 65 -7 -154 -44 176 -136 -49 -136 14 -18 -57 -2 -143 330 144 -9 -46 -89 50 -12
7128 -12 -105 -64 101 -213 -165 85 171 128 61 205 197 201 167 -68 0 -322 -76 50 -69 108 -101 -154 134 -33 322
7153 322 100 71 -292 37 -30 -36 -11 38 -107 203 26 -103 58 164 -264 -82 59 -72 -75 14 -17 60 30 -151
7177 -151 56 122 57 132 -118 -246 277 16 58 -160 -272 40 0 167 -54 -114 140 -151 21 -106 -195 -141 161
7200 161 -263 -44 277 -131 -129 69 115 -30 91 247 6 -92 -154 149 59 -189 223 212 56 121 -142 135 -76
7223 -76 -45 -173 63 -101 36 -96 36 -40 12 -140 -187 -59 74 156 -161 -102 -174 -59 21 28 -379 161 -42 -104
7247a04J32J86J08l32P9R6k21j06K2J46O5q0K62n34R8K16O3j56OK3j36n5J00j68
7271b90M88k45J09j90K26j11o8J02m7n2J90l67pK30J33m52L21J86j01Pm3m9K71
7294B41k45J11j80l3R3j72J54j78J36K25j90KK32l09K53k70j5J78j45M2L74k64
7316D0r3L5L8j04K66j64J93j09k67M3p8O1n0n7K84lj24J64j24l2J3K74m58J99
7340e3PQ3n8J41j38k17LJ13J23j26J62j98P7j00J33J7j84J35K79j21R1k98K42
7363A13N2j98l4J42J26k21j04N6o0Q1L75l57k9k3o5M4J66N2r1j34K10k05J9K87
7387B02k64J77j76l09J38M20l9j59k21J18K86l19J58J63m82K82o5L6J01J7J8j83
7409a01L7J42k44o2L18l40K70J1K89n56K03J35k00K20K0j87j07L71l00q5K38N6
$$ plain form
7247 -104 28 214 322 -10 69 165 -56 -162 -140 6 71 -9 253 -281 -183 33 96 -60 -54 -31 -167 -222 -122 -290
7271 -290 198 -47 62 -128 98 -13 -81 21 -26 -78 112 -255 -262 -32 101 -351 -30 156 55 62 19 -30 241
7294 241 -4 107 -73 -106 -13 -185 -31 -209 -73 152 -38 -36 196 -113 140 -130 -145 33 -112 -70 304 40
7316 40 -53 -18 20 -84 182 18 211 102 -165 -122 -200 -139 -189 -246 38 35 -89 75 -49 -81 -68 206 -252 -53
7340 -53 -46 37 -21 120 -18 -235 -232 -119 4 -122 40 -158 -81 -181 -48 -31 -215 -80 199 78 169 -129 113
7363 113 165 -33 -67 75 201 -20 -124 -68 -128 -47 328 -29 -58 -81 -146 -102 64 116 25 -109 101 -104 -85 202
7387 202 -62 115 -61 -370 -232 188 149 -10 -231 -113 173 -146 12 175 -307 -25 -90 -54 47 64 82 -101
7409 -101 -64 78 -166 -228 90 -250 20 31 320 -236 -33 102 -98 122 142 -45 -152 219 -81 -166 72 128
7431A28L2k04q9J68J7pj27P5j87L2L24q0j30qk5j25J16J6N2j58K91M1j38j66j97
7456c49L41j55K11l13K84j40K62j52J32K71m43J53J56n9k34j01J41m7Q8J32k53
7477g5J16K3j68J21j64P2J52j95K79k6k04o7m7L2J32j92K69J7k8J19k08K2P8k25
7501a67J33P0k03K39m7J72j01lOK3m2K7O6k08Oj30J13k9Q0M9j8j67K19Q2m0j64
7527c4M3J23l07M33k82j10j01K59J17k08j60M32k24M8J4J3j47J64p6m2K25j40
7549D0K8p2r5K61J4j47O4j29J13n4j69l1j8J43j64N9L49j97q2K08r8j16K09k98
7573a82L97R5k82r4K01P0J99l95j2M8p2L7J19k31J89k45R7L1K71l32K71M0l6j60
7597B4j6M7L2pk0O8m6j96j03K84k4k14J57j39Q3j84L4K41k34J9L2L49n6j25q3
$$ plain form
7431 128 160 -44 -133 35 52 45 -82 -7 -194 -162 162 82 -48 -56 -81 -206 -90 -74 -22 -180 111 152 14 -152 -349
7456 -349 -8 -163 48 -265 19 -121 141 -11 121 392 -51 102 258 199 -35 -136 5 -42 46 178 -75
7477 -75 41 64 -104 17 -147 -75 77 -118 161 135 -69 -136 -183 -151 -19 -211 58 75 47 166 -42 -20 58 -167
7501 -167 -34 36 -167 72 25 197 96 93 99 122 80 107 173 -35 -29 -159 -46 -75 5 54 36 -131 88 170 130 -34
7527 -34 9 132 -175 258 -24 -134 -235 24 141 -67 -227 205 -19 29 43 56 -91 73 -3 -45 180 40
7549 40 68 -4 -99 162 176 29 93 -36 77 23 -146 -177 -195 -52 -216 -157 192 -5 -87 121 23 -93 116 -182
7573 -182 215 310 28 -66 135 205 404 9 -3 45 -27 10 129 -102 87 -158 -61 -30 241 -91 180 220 184 24
7597 24 8 55 87 80 60 128 82 -114 -217 67 43 -171 -14 -153 -70 -254 -220 21 -213 -194 -162 187 131 6 -77
7622g7L22j26l37J49K0J84k4O7J9k91k4K6l6J88j29J99j29j28Q3N2Kk50K89l78
7646c29L44k47K05n0k26L67l0J39m0J8k06L7J43j58K6K90m41m6L72l74L51j86
7668d1J92J0j60J71k20J62k50K60k3p9k93L67j76LK02k66J46k6j68M22l52K41
7690A22j23N80l25k51j69K19j9k22K98j95J55p6J64j00m7j41K2K78j06j71L02
7711A95j87R5j14J96j24k10K00p9L09l41K19m78K99J16j81J03j01J27P1j2j75
7732g2n7J8k5J26j96J84j49K46r6K0j62M1p5J27P1l14N18k13J17l0j96l0O4K58
7756A75k81Q9j96R4J97n6o4J38k9j38j37j4K98j52oJ53k07o4m5L91j90P0l3l3
7780d0J47j0j05q9J26k56J90J65r6m5j57K33j59r0K72n8q3q7J08R4mL9m6k53L69
$$ plain form
7622 -77 245 119 -218 -69 -49 135 111 178 197 -94 -118 -92 -128 60 -69 130 1 -127 -44 8 10 -240 49 -329
7646 -329 15 -232 -27 -77 -303 64 34 173 133 151 -55 -18 125 -33 -7 283 -158 -204 168 -206 145 -41
7668 -41 151 161 1 172 -48 114 -136 124 101 22 -271 96 -80 -77 125 -141 5 -21 -189 233 -119 122
7690 122 -1 579 254 3 -166 53 34 -188 110 -85 70 -6 158 58 11 -130 -108 170 64 -107 195
7711 195 8 103 -11 185 61 -149 51 -28 281 -60 159 -319 -20 96 -85 18 -83 44 115 103 -72
7732 -72 -129 -111 -136 -10 -206 -22 -171 75 -21 -1 -163 -122 -197 -70 1 -313 205 -8 109 79 -117 -147 -83 175
7756 175 -106 -17 -213 -119 78 22 -42 96 67 -71 -208 -222 76 -76 -82 71 -136 -200 -245 146 -44 26 -7 -40
7780 -40 107 97 -8 -97 29 -227 -37 128 32 -13 -170 63 -96 -186 86 28 -55 -142 -34 60 56 95 49 -204 165
7805A65j30M5j08q3K20L4l1q9J12k14J5L41l07q3J08Q2P9l41L36l9l44J83Q5j34
7829i8P8J25j07K36j49N2k25J0J41Kj61j64K48n9MQ1o1p4N4j5N8k39K11P5K6j12
7855f3KJK27l37j78M41K5k07K74p1k20R3j22K3K2K24j89pnM5pk13K69q2L4K4k5
7882b2k37N45j48o5J81k32k6Q6k2q1O1J94l07J27m9J42m46K58j00n2J96m0J02
7905F5j11j7n8R5Q1j32J73m0l19R6K69l37L02o6n2J8J67l72J01NL51n23M73k92
7929a23L20k38JK84l87J27NJ27k23K04n6J0k19j03L19J00k55J40j45K67j97Q8
7951D6J27n56M99J03j92k95J80K28j5m0j89q2J50J40j52J30J15j81p0N1n0M0j47
7974a60L20j8j3o1k6J82m19RK43l7R8k52k5J24L4j74J29k9j48L50j74P4N8k33
$$ plain form
7805 165 35 80 -28 -111 109 143 112 23 135 -79 -64 277 -30 -113 -5 77 156 -185 151 112 -232 -49 36 -98
7829 -98 -20 105 -2 234 85 137 -88 -78 63 65 -96 -260 -12 -71 -67 14 -47 -121 -67 -82 -24 -263 -52 23 49 -63
7855 -63 -61 -60 167 -170 -348 93 118 -89 185 114 -106 -13 -135 -112 -90 134 -55 -62 -67 -22 -29 -242 27 -55 -21 3 -22
7882 -22 -259 286 138 73 254 22 -4 82 60 -21 40 234 -73 54 5 147 -299 -41 -141 -193 3 -37 65
7905 65 -46 -63 -121 -26 55 -77 96 56 -263 -167 102 -235 67 1 -51 -33 134 -238 -137 -132 219 -304 169 -123
7929 -123 197 -41 -40 244 -143 -16 -11 116 -107 97 41 51 -168 -271 48 148 -107 33 -112 155 -42 46
7951 46 173 -383 116 219 27 -268 -88 140 125 85 -104 -186 -36 104 -48 82 197 16 -54 -3 -53 -13 -160
7974 -160 160 142 129 68 42 224 -195 -186 57 20 118 -134 -159 -35 -1 -175 -46 -75 -223 127 -47 27 85 -148
7998a48J69l1j33K8m5M73q9l39K19J77m13j8M33k40m8K10j21q7J33k49Q0q0O1
8021e8n5K09l7k04J6J94p2J88l67K31j80O9j20J70J21j17r4J23k33j7K04J80q5
8044F6n6J97k28J0j39K16J04k14j17O3J43j4k05K20j85K91J4k3m06J41j8L97k42
8067A5lO1q5j57L07j01oN2J7k12M0J77j2j61J17M8q3j8J52j22k34K57J56j50j11
8092e6l6L82l13K02r1q4j49J42O8M8J44M8l75j63K27M2j64J23j25R4n8j16M54
8115B44l51K26n4j17M1N2n6N9q6J27p4K31j72O4J0N0n1j00Mj4j01m6Q3J80j47
8140BL9j77J17K10k92J54j69J53L2K50l58k3J8j32O9p2N8L1J4m6Q2l7J69M8j22
8165A8o6j3J5M1o3J39j43r6K2K51p0j54R1K65j74J03k12o1Q7O9L0j53L12j0j54
$$ plain form
7998 -148 21 -10 -143 -115 -160 313 224 -115 104 281 -132 -150 283 43 -5 205 84 -3 130 -119 -39 -119 -58
8021 -58 -113 96 59 -145 -129 65 -7 181 -186 45 -135 -66 -186 -16 105 -12 -106 17 -216 -233 -29 151 66
8044 66 10 207 -21 -11 -150 66 170 -44 -161 -98 45 31 -174 46 -139 152 166 143 -263 -122 -140 257 15
8067 15 12 73 -12 -169 138 37 31 83 100 -112 -72 105 93 -68 49 97 14 -4 148 26 -208 49 205 55 -56
8092 -56 -92 290 -23 179 88 4 -145 -3 65 113 257 305 -70 -233 -6 36 -128 -5 -130 -36 -94 -210 244
8115 244 -107 119 65 -52 -11 41 -15 44 -42 85 11 242 70 134 144 194 143 43 47 33 -68 -114 -31 149 2
8140 2 41 -136 -19 191 -101 53 -116 37 69 319 -39 -62 -44 -176 -107 -179 -121 -90 -76 -122 -40 -77 92 140 18
8165 18 -48 -61 -46 -5 -68 71 -72 -168 -146 105 35 -119 -28 237 63 166 -46 -107 -20 49 79 -74 238 228 74
8190G4k8
$$ plain form
8190 74 46
8191D6
$$ Imaginary data points
##PAGE= N=2
##DATA TABLE= (X++(I..I)), XYDATA
0@%%%%%%%%%%%%Qj6J6j6K4l2L8m6N6o4P2q8J04j21J45j68J92k24K56k90L31l76
34a99M24m80N41o06O79p58Q43r37J041j153J275j410J556j716J891k083K294k529
52a327K790l076L395l756M166m635N175n808O563p480Q624j0094J2065j4866J9190
67A0926k6802M4142j59014j2196K47151m5100n7641r0861l0241J24441J46235
78A51040q3338j02280k6709Q865J05571J26832j23355j64520O5438J24977J4838
89I7359j9470j13550j21444Q6090J54197k3713r4264p5970k9047J37058J57038
100A54284j07132j78533K4267J00758N8850L2465q5360j10585P5184J32474N545
111A02217l9653o7100p9203P6616J39207n4119j38709k7825L2995P6732Q5668
$$ plain form
0 0 0 0 0 0 0 0 0 0 0 0 0 0 8 -8 8 -8 16 -16 22 -24 32 -32 40 -48 56 -65 80 -88 104 -120 136 -154 177 -199
34 -199 225 -255 286 -320 359 -399 444 -493 548 -605 670 -740 816 -900 991 -1092 1202 -1327
52 -1327 1463 -1613 1782 -1974 2192 -2443 2732 -3076 3487 -3993 4631 -5463 6602 -8264 10926
67 10926 -15876 28266 -130748 -142944 104207 59107 1466 -89395 -119636 4805 151040
78 151040 67702 -34578 -61287 -52422 53149 179981 56626 -107894 -42456 82521 97359
89 97359 77889 -35661 -157105 -71015 83182 59469 -34795 -110765 -139812 -2754 154284
100 154284 47152 -131381 -107114 -6356 52494 84959 -401 -110986 -35802 96672 102217
111 102217 62564 -4536 -83739 -7123 132084 77965 -60744 -88569 -55574 21158 106826
122A06826p8481j53336J9317J11687M2677q100q3034j00132P6393J56408n114
133H5111q9449l4555l710O8768J02114m9474j34308q999O9136N1135L0868o6656
145A9981j19134K7214J21629J7725n9451o5085n5201N4672J24552q358j07437
156d8893l1108M0411O8858O8783m6061j19380L123R8719M1476j5089n5649p5417
168g0227L2235J15457J1440q5710n6577j2129M9006Q3935k3177j12637k4591O6450
180b6525N6518K5398m3298r0908Q471J03175L8794m3146n2673l5422M2164J00528
192H3076O793r1639m6078K5567N0328M7001l2537j00186k1165P4968N0232j0574
204C5786n1517o4160J6310R3112K8335o3395n2912k272M9964P4425p34q3067l4188
$$ plain form
122 106826 28345 -124991 -105674 6013 48690 40590 -42444 -142576 -66183 90225 85111
133 85111 -4338 -38893 -42603 26165 128279 78805 -55503 -64502 4634 55769 86637 19981
145 19981 -99153 -71939 49690 67415 7964 -57121 -112322 -57650 66902 58544 -48893
156 -48893 -80001 -39590 29268 98051 51990 -67390 -64267 34452 75928 60839 5190 -70227
168 -70227 -37992 77465 88905 3195 -53382 -65511 -16505 67430 44253 -68384 -92975 -26525
180 -26525 29993 55391 12093 -78815 -70344 32831 71625 28479 -24194 -59616 -17452 83076
192 83076 89869 -1770 -47848 -22281 28047 75048 42511 -57675 -78840 -3872 46360 35786
204 35786 -15731 -79891 -63581 29531 57866 -5529 -58441 -60713 -10749 63676 62942 -20125 -54313
217e4313N0894N6250J9949l9201p7511q275P7483M3722l4139n6736l6914K5477
229c3314P4544J4016p3788n4390J6365N3212M6586j6761p3554k2437O3075N8274
241E1828j257m5971n2165J0149P4942L6420m5550n5279r299L9738N7113j039p1696
254a2066m7610K7416N2205K0666l3484o3508j2187O2736N1700j8381n3790l2432
266e8735K5586O4806K2376m9620m9859J0953N3226M4827j3570o2401l1356L9225
278d542N1002K026m7002n0534K901N8293L7696l0987n5060j7765L5177N0811L905
291C5921n4959m3033K2234N6947K9890k5192n0706j1169M8123M7617r760n1922
303f009l6641J8101N4284K2750l7864m9998k960M4112L8384j3409n5589l3723
$$ plain form
217 -54313 -3419 52831 72780 33579 -43932 -52207 25276 68998 34859 -21877 -58791 -33314
229 -33314 41230 55246 -18542 -72932 -56567 -3355 43231 26470 -47084 -69521 -6446 51828
241 51828 50571 4600 -47565 -37416 37526 73946 28396 -26883 -36182 3556 60669 59630 -12066
254 -12066 -59676 -32260 19945 40611 7127 -56381 -68568 -5832 45868 27487 -26303 -58735
266 -58735 -33149 31657 54033 4413 -45446 -34493 18733 63560 49990 -12411 -43767 -4542
278 -4542 46460 48486 1484 -49050 -46149 12144 49840 18853 -36207 -53972 -18795 32016 35921
291 35921 -19038 -62071 -39837 17110 47000 21808 -28898 -40067 8056 55673 45913 -6009
303 -6009 -42650 -24549 29735 52485 14621 -35377 -38337 5775 44159 30750 -24839 -58562
315e8562K6715N0264J3296l6809m1831N810N2342L9266j8131n1146k2031L1440
327i377M7250P309m2155m0780J0260N0087L0385k5132n1125j9085L1851M0256
339B9744k689m5247l5430J7037M9605K6325k5166m4491q506L9498L9721p673m5690
352a2962l0191K1611M9650K0573l1672m1655j806L8095L2922j3847m9297k8471
364d7050K4391M3562J0067l2499l7250L193M3224L0606j9680m4543j8570K6272
376a8277M3496R897l5965l3350J3639M4445K6278k0027m5635j6937L1905L5616
388C5085m872l7686k9870J0770M2504K2518k8710m2535o941L0359L3104k943m1091
401b0308k5386K4368M3473J5798k1976l5816o213L7284L2589j4886m0173k0082
$$ plain form
315 -58562 -31847 18417 31713 -5096 -46927 -41117 11225 50491 32360 -18786 -40817 -9377
327 -9377 37873 45182 3027 -37753 -27493 22594 52979 27847 -23278 -42363 -10512 29744
339 29744 27055 -18192 -53622 -36585 13020 39345 14179 -30312 -38818 680 40401 32728 -12962
352 -12962 -43153 -21542 28108 48681 17009 -24646 -26452 11643 44565 30718 -18579 -47050
364 -47050 -22659 20903 30970 -1529 -38779 -35586 7638 38244 18564 -25979 -44549 -18277
376 -18277 25219 35116 -849 -34199 -20560 23885 50163 30136 -15499 -32436 -531 35085
388 35085 30213 -7473 -37343 -26573 15931 38449 9739 -32796 -39737 -9378 23726 20783 -20308
401 -20308 -45694 -21326 22147 37945 15969 -19847 -26060 11224 43813 28927 -11246 -31328
413c1328J8942M0482J2848l4908l5980O355L1635K1561j2453m1903k2329K8975
425a8103L9679K464k8786k7828N015M0703K5816k4292l7064o244K4090L3089P145
438C5684l4802k9742J7769L6750J2502k0657l7856j3597L2651L1504j2847l2728
450a5369j7496J0505L5793J9914k9806l7594L252L0450K4768l119l5263k1339
462c5304K8830L8052J338k3341k6017n430L2591K7820k1332l7350p082J9368K8321
475B0464J0242l2634l2855J3751L1099J0332j1428k9211j8210K9366L9176n474
487B4618l0295j6578O247L2045K2818k7622l8145M111K7228J9559J362k9229k7553
500c1434K0653L5051j249k2678k1989q879K5962L2372j3589l2433n478J4228K3970
$$ plain form
413 -31328 -12386 28096 40944 6036 -29944 -23589 8046 29607 17154 -24749 -47078 -18103
425 -18103 21576 24040 -4746 -32574 -27559 13144 38960 14668 -22396 -28640 -4550 28539 35684
438 35684 882 -28860 -11091 25659 38161 17504 -20352 -33949 -1298 30206 17359 -15369
450 -15369 -32865 -22360 13433 33347 3541 -34053 -30801 -351 24417 21298 -13965 -35304
462 -35304 -6474 31578 32916 9575 -16442 -21872 10719 38539 17207 -20143 -27225 -7857 20464
475 20464 30706 -1928 -34783 -21032 10067 20399 8971 -20240 -38450 -9084 30092 24618
487 24618 -5677 -22255 -16008 16037 38855 11233 -26912 -22801 4427 23986 25348 -3881 -31434
500 -31434 -10781 24270 23021 343 -21646 -30525 -4563 27809 14220 -18213 -23691 -9463 14507
513A4507J7955k4992l8653R082L4597J2656q575k5337k0766K4987L8910q453l2455
526f537j4120K266K2663K3272k0280l5644M482K3859J4221N717j9190l1180J1350
539a9121L6161N012j7271j7905j1998K2007L8801q470l8300q824J4071J9065J5086
552B8314k1269l8305O937L4569R273r702j7927j9653J4636L4710m223k7387r119
565a9146O65J5207K9442n853l6514m681K4054J5738O124j7992l4594P498L9699
578A9647N791k1327j4586r515J3352L2598m895l7127r969J4023J4486J4904r786
591G596l2693J919L1905R815o365j1155k2050L319L6847P560k7188j4957K180
604a3267J5483K7069n674l8891p689K3748J1365O30j0019k7242l05L5345J1743
$$ plain form
513 14507 32462 7470 -31183 -22101 12496 25152 16577 -8760 -29526 -4539 34371 25918 -6537
526 -6537 -20657 -18391 4272 27544 7264 -28380 -23898 -39 14182 19899 709 -30471 -19121
539 -19121 17040 22052 4781 -13124 -25122 -3115 35686 27216 -11084 -19908 -5837 13228 28314
552 28314 7045 -31260 -24323 10246 19519 9817 -8110 -27763 -13127 21583 17360 -10027 -19146
565 -19146 -18481 -3274 26168 20315 -16199 -20880 3174 18912 25036 7044 -27550 -20052 19647
578 19647 25438 4111 -10475 -19990 -6638 25960 21065 -16062 -26031 -12008 2478 17382 7596
591 7596 -25097 -23178 8727 18542 12177 1022 -21028 -17709 19138 26698 -490 -15447 -13267
604 -13267 2216 29285 23611 -15280 -22969 779 12144 12774 2755 -24487 -24792 10553 22296
617B2296j8346j4268q612P785K9185K654l2454j0734J4816J2676J5096j187l1685
630a2778q625K9040J4992r232j4267j9305K076L3275R348k5896j3862L732Q316
643c186K0369J974l2808j4376K1723J6353K359o743k2155l663L0699J4318j7449
656G415j4405p427L041K5480J0037k7830j6948J2872J5183J0588k731k7417j1547
669b3689K3668J5548p275j0286j4079k220K7654J6135k1132j8827K572R464J6388
682A3921L582k5395j5217J8114J6940K534n512j9877r308K4005J7984j4433j7211
695i873n660M404K1293J1603k1189j7718Q325J2861Q863M52k1635j4975J9526
708c723K0503m320j1791j1759k216K1387J4816j7514j9680K19Q902J5143O957
$$ plain form
617 22296 3950 -10318 -18930 -11145 18040 20694 -11760 -22494 -7678 4998 20094 18907 -12778
630 -12778 -21403 7637 22629 13397 -870 -20175 -18099 15176 24524 -1372 -15234 -11502 -3186
643 -3186 17183 19157 -13651 -28027 -6304 10049 12408 5665 -16490 -20153 10546 24864 7415
656 7415 -6990 -14417 -11376 14104 24141 -3689 -20637 -7765 7418 18006 15275 -12142 -23689
669 -23689 -21 15527 8252 -2034 -16113 -18333 9321 25456 4324 -14503 -11931 -2467 13921
682 13921 17503 -7892 -23109 -4995 11945 14479 8967 -10910 -20218 3787 21771 7338 -9873
695 -9873 -15533 -11129 10164 21767 578 -17140 -8815 4046 12909 13361 -8274 -23249 -3723
708 -3723 16780 12460 669 -11090 -13306 8081 22897 5383 -14297 -14078 -5176 9967 16924
721A6924j9861j7906J2316J8877L059p243j6780r353J7673J9049p335j5213n350
734a1143M073J7027J1735j6258k0408L642J4463R236j054j7690j3502J4364K0706
747A5191j468j2815j2633l831J5951J5566j0348j8756j630J0129J4171O557j3923
760B161j7329P079J6743M495p337j4240q136J4714J9030l187j6549q509L840J4454
774G229R744j2625j9828k16J4105J1199K11j3574j2416R015J7719K197j2238j2297
788a1775k405J3672J4724m872j6242m660J0240J3609M432j3015j6855J724J5960
801D537P922o403j3364p161J0707J6305K96j4508j1054K185J2910R348p895j5871
815a2046k471J3734J2624L80j2726j1883M833J5467N106r937j3223k129J2066
$$ plain form
721 16924 -2937 -20843 -8527 10350 13409 6166 -10614 -19967 -2294 16755 9420 -5793 -11143
734 -11143 -7070 9957 21692 5434 -14974 -11332 3131 12367 11313 -6377 -19879 -5515 15191
747 15191 13723 908 -11725 -15556 395 15961 5613 -13143 -14773 -4644 9527 16084 2161
760 2161 -15168 -8089 8654 13149 5812 -8428 -16564 -1850 17180 13993 -2556 -11065 -7225 7229
774 7229 16973 4348 -15480 -15696 -1591 9608 9819 -3755 -16171 -7156 10563 12760 522 -11775
788 -11775 -14180 -508 14216 9344 -6898 -11558 -1318 12291 16723 3708 -13147 -11423 4537
801 4537 12459 6056 -7308 -14469 -3762 12543 12839 -1669 -12723 -10538 2372 11720 3825 -12046
815 -12046 -14517 -783 11841 12221 -505 -12388 -7555 7912 13018 3081 -10142 -12271 -205
828b05J4070k176j4597q213O548J3019L657j0809j4145l4J3845J0401m186j2978
842e803o653Q341J3936J922j2708j1464J683J2786R801m961j3258m404R870J2423
856A1511N37j2685j1051K802J3168P279p739j2586k474J1271J1460r67j2869j0180
870a2523M873J3461M882q820j1640j167J1650J1196k526j3170p548O022J1713
883F403L967r596j2164J660J2641Q809m323j1978n773O937J2064J379j1043j0226
897a1243K440J1983Q775n165j3148l520R239R623r5j0433j0066K850J2993N956
911A0189o551j0497k823Q960J1059j760j3009p129N352J0727M966o362j1141o10
925h629J0859Q637k669j1177p430N304J2682K591r855q892J509R149Q665l478
$$ plain form
828 -205 13865 11689 -2908 -11121 -4573 8446 12103 1294 -12851 -12885 960 11361 7175 -5803
842 -5803 -12456 -4115 9821 11743 -965 -12429 -10746 2040 11841 6880 -6378 -10782 -912 11511
856 11511 12048 -637 -11688 -8886 4282 11561 3822 -8764 -11238 33 11493 10526 -2343 -12523
870 -12523 -7650 5811 10693 1873 -9767 -10934 716 11912 9386 -3784 -11332 -5310 6403
883 6403 10370 774 -11390 -9730 2911 11720 7397 -4581 -10354 -3417 8647 10026 -1017 -11243
897 -11243 -8803 3180 11955 6790 -6358 -9878 -639 8984 8889 -1544 -11610 -8760 4233 10189
911 10189 3638 -6859 -9682 -722 10337 8577 -4432 -11561 -6209 4518 9484 3122 -8019 -8629
925 -8629 2230 10867 8198 -2979 -10409 -5105 7577 10168 313 -8579 -7070 2079 10744 7266
939G266j3063n210P569R542J561q382r906K293J2696N729o170r364l432O285J0597
954H011N08j0699o903L784R864O412n334j1981k469J0078P671k622q505p455L504
969f136J1707M384q677r008n16P959Q732k570j2216m424Q029Q159K372n928q859
984f992n3J0343O290m941q499m846N035J1253K530j0200p591L059P751N725l828
999E036j2204l253R121Q360j354o686p838K391J2035L866q564q082l51N767Q077
1014F321J83r334n191N514P733L497m113j0829k793J0269P030m105p725m244L950
1029c837J1257K564j0347p619K536O567N307k486j0822l142R434P120q46m546
1043A140o636q34R186N171o325p220j942M375R704K595j0140o886N866O875J981
$$ plain form
939 7266 -5797 -11007 -3438 6104 7665 -717 -10623 -8330 4366 10095 3925 -5439 -8871 -2586 8011
954 8011 8519 -2180 -9083 -5299 4565 10977 5643 -6338 -8807 1271 8942 6320 -2185 -9640 -6136
969 -6136 5571 9955 1278 -7730 -8246 -287 8445 5875 -6341 -10765 -2736 5423 7795 1867 -6992
984 -6992 -7045 3298 9588 4647 -3852 -8698 -3663 7590 10120 -80 -7671 -4612 3139 8864 5036
999 5036 -7168 -10421 -1300 7060 5706 -980 -8818 -6427 5608 9474 910 -7172 -7523 -1756 6321
1014 6321 6504 -2830 -8021 -2507 5226 8723 4610 -6219 -9012 1257 8287 4182 -3543 -7787 -3837
1029 -3837 7420 9984 -363 -7982 -5446 1121 6428 3942 -6880 -10022 -588 6532 5686 1140
1043 1140 -5496 -6330 2856 8027 1702 -5518 -7460 -3085 6619 9214 -926 -7812 -1946 4929 6910
1058F910m022r614l051J0183P288l561o016l838J998R666L060r770p041J884M725
1073a199N212R66q228n118O998P596K96m790p145k943R713O842o531o791j08L878
1089a352Q001K635r283p354M190O173J828k124p764m287R443Q009l484n670l508
1104d547m01P228N337p721p801J842N065N749J881p732o670O831P404j168m665
1119F32n564k662Q364P934n231o540q98K263O252L937q295q517L493O338K109
1134C615n09o106n070P128Q141k965n635l427j016O555O294n206q129J933N167
1149G70M693K012p004q090M826P510j16l385m677l228O412Q356l890p195j113
1164d119J302M609M377o249q323L307O890K133l53m814n522M932Q077j617n711
$$ plain form
1058 6910 2888 -6726 -9777 406 7694 4133 -1883 -5721 -3723 5943 9003 -767 -7808 -5924 -1199
1073 -1199 4013 4979 -3249 -8367 -1369 6227 6523 1733 -5412 -8355 1358 8200 1669 -5122 -5230 -1352
1089 -1352 6649 9284 1 -7353 -3163 3010 4838 2714 -5050 -9337 106 8115 4631 -1039 -4547
1104 -4547 -4948 2280 7617 -104 -7905 -6063 -998 4751 6632 -1100 -7770 -939 6465 5297 632
1119 632 -4932 -7594 770 8704 3473 -3067 -3965 -1702 4550 8487 192 -8325 -4832 1506 3615
1134 3615 3106 -3000 -8070 -942 7199 4234 -1401 -4828 -5844 711 7005 1799 -6330 -4397 770
1149 770 5463 7475 471 -7619 -2793 4717 4601 1216 -3461 -6689 -277 8079 4189 -3006 -4119
1164 -4119 -2817 1792 6169 -80 -8403 -5096 1794 3927 3574 -1240 -6762 -1830 6247 4630 -1081
1179a081k934j271N625P434l465q614O97M444L206J452n165p472K898P859N52
1194D165k819m048l224M649Q032k828p536j598K034M219M191l419p608J643O366
1209B219K461l86m425n900K983Q229l09n546k395q47M540O367k882p958j215M507
1225e57L040K264m376o780J972P568J655l244l643l152L063P045m78o696k433
1240d752K031L948M225k321p712J78N899K890j057l650m962J880P505J590n128
1255E64l499o96L074N934j473p512j868M111L468J934k749o055J29O368K694k819
1271A605l876k901K617O445J185n922l154J955L607L801k087o631j683N409L416
1286C786k85l442m285J084O360J986m541l766j008K711M562L18n757k835L412
$$ plain form
1179 -1081 -4015 -5286 339 7773 4308 -4306 -3609 835 4041 5493 328 -7144 -4246 3613 4165
1194 4165 1346 -2702 -5926 -1277 6755 3927 -3609 -5207 -3173 1046 5237 1818 -5790 -4147 2219
1209 2219 4680 4294 -131 -6031 -3048 5181 4872 -674 -3069 -3916 624 6991 4109 -3849 -5064 -557
1225 -557 2483 4747 371 -6409 -4437 3131 4786 1542 -2101 -5253 -2190 4855 4377 -2319 -4752
1240 -4752 -2721 1227 5452 3131 -4581 -4403 1496 4386 3329 -321 -5283 -3403 4102 5692 564
1255 564 -2935 -3631 -557 5377 3904 -3608 -5476 -1365 2103 4037 1288 -4767 -4638 1730 4424 1605
1271 1605 -2271 -5172 -2555 3890 5075 -847 -4001 -2046 1561 5362 3275 -3356 -5039 370 3786
1286 3786 3501 59 -4226 -3142 3218 5204 663 -3103 -4111 -1400 3162 3480 -2277 -5112 -1700
1301a700M062J862k739n580n28N169L071j729l534k256K185N847J409m918l799
1316c178R00L030L030j194n555j989M418M222j31l023m150K91M808K220l222m203
1332c726r98L228M610O43m469l101K427L640K071k791m943r36M349M009j220l380
1348e87k346J746M507J628m225m474J53K959L647q37m125k194L011M460Q61l873
1364C11l967j78M208K770k138l780j051L387M039O49l685l586P28L974J715k211
1380A185m102j126L822M139k21l875l038J411L444J636l120l903n53L769L286
1395B754k72l544k060J792L774J034l297l811K14L350L268r01l677j700K627L898
1411C449N07l467l705R3L713K900k092l510j033K701L365O17l885l449R77L580
$$ plain form
1301 -1700 2362 4224 1485 -4095 -4623 546 3617 1888 -1646 -3902 -1717 4130 5539 621 -3178
1316 -3178 -2278 752 3782 2588 -2967 -4956 -538 3684 3553 530 -3620 -3329 1479 3699 477 -3726
1332 -3726 -4724 -1496 3114 3757 -712 -3813 -1386 2254 4325 1534 -3409 -4345 4 4013 2793 -587
1348 -587 -2933 -1187 3320 4948 723 -3751 -3598 -639 3008 2171 -1954 -4148 -1137 3323 4184 311
1364 311 -3656 -3834 374 3144 1006 -2774 -3825 -438 3601 4250 565 -3021 -2293 1681 3396 1185
1380 1185 -2917 -4043 -221 3918 3697 -178 -3216 -1805 1639 3275 155 -3748 -4301 -532 2754
1395 2754 2482 -1062 -3122 -1330 2444 3478 181 -3630 -3416 -66 3202 2301 -1376 -3076 -449 3449
1411 3449 3956 489 -3216 -3123 590 3490 1398 -2112 -3145 -444 2921 3538 -347 -3796 -2819 761
1427G61J792j698l626j003L733L317n62l521k025Q15L595J860k814l772N82L007
1443D41L196m86l482k648K172L331L23k659l205m21L808L134j709l696q65J661
1459a105K839J004l360l356J330L428K084j214l097j366K625L507p62k733k401
1474b577J46L445K750k279l524o9K887K012rl513k939J878L563J47j708k517o70
1491b977K827L169j235l312j362J096L060J355k698k545M91L156J727j98l192
1506f38k380K410L293k94k951j955O82K989K510k001l648k34J867K106K37k627
1522f34l054J297L694R23j628k061j434K143L433q44k847j366Q64K729K073k047
1538A241l491L11L341J150o74k503k690K366L309l14k116j684m80K291K702j289
$$ plain form
1427 761 2553 855 -2771 -3774 -41 3276 2714 -807 -2832 -2017 1578 3438 624 -3148 -2566 441
1443 441 3637 3151 -331 -2979 -807 2524 2847 188 -3017 -3438 370 3504 1795 -1901 -2766 -1105
1459 -1105 1734 2738 -622 -3978 -2648 780 2864 1650 -1447 -2813 -188 3319 2557 -176 -2577
1474 -2577 -2431 1014 3764 1485 -2039 -2108 779 2791 2782 -731 -3670 -1792 1771 1918 210 -2307 -2977
1491 -2977 -150 3019 1784 -1528 -2890 -1794 1266 2621 -77 -2622 -2131 1025 2752 2554 -638
1506 -638 -3018 -608 2685 2391 -560 -2515 -1833 1156 3666 1665 -1983 -2217 -350 1756 1993 -634
1522 -634 -3688 -2391 1303 2226 598 -1463 -2897 -754 2679 1835 -1012 -2378 -1514 1215 3288 1241
1538 1241 -2250 -1939 1402 2552 1878 -625 -3315 -949 2360 2046 -70 -1754 -2234 57 2759 1470
1554A470l765m92J685K198O89j609l034P57L677P71j196k202j941K381L307n65
1570B131l115j196J041K388J745j597l304m14K531J339j32j850k433J473L698
1585B305rk279j810m78J861K539j048l084o81K151J714J299j550l039J28L527
1601A546R08j453j797j474J395L394n3k651j109N13J333K023j296l458l36K087
1617d28J703L26j613k767J252L357Ok062j621l44J172K898J06l139q54J563J920
1634A475J331j357l729L21K916J127j395j147j421J073L130J93k732j706N39J047
1650c35K062n98l433m12K584J347L96r59k820M2K982J090j720j732j62R05L030
1667B267K99k740j147J444Q63J103q64k867m18K607J584j050j319j234L34K608
$$ plain form
1554 1470 -2295 -2787 -1102 1096 1785 176 -2858 -2101 1576 2347 1151 -1051 -2992 -611 2696 2131
1570 2131 -984 -2180 -1139 1249 2994 1397 -1907 -2321 210 1549 1417 -433 -2866 -1393 2305
1585 2305 2296 17 -1793 -2271 -410 2129 1081 -2003 -2684 -533 1181 2480 930 -2109 -1981 1546
1601 1546 2454 1001 -796 -2270 -875 2519 2466 -185 -1294 -781 552 2575 1279 -2179 -2515 -428
1617 -428 1275 1601 -12 -2779 -1527 1830 1836 -226 -1847 -2191 -1019 1879 1985 -1154 -2008 -445 1475
1634 1475 2806 1449 -2280 -1959 957 2084 689 -458 -1879 -806 2324 2517 -215 -1921 -1382 -335
1650 -335 1727 1129 -2304 -2716 -132 1215 1611 652 -2168 -2126 856 1946 226 -1506 -1668 -763 2267
1667 2267 2566 -174 -1321 123 986 2089 1225 -1642 -2060 547 2131 1081 -238 -1472 -1138 1470
1683A470Q11k988j391K93J293J897J08k620r56K086J539M9p82k387l64L030Q98
1700A986j287j393k65P59K082O19k943j688J388J270P26o07k516o25K708J413
1716A627p04r24j974K16K614P78j922j263M91J142J623J93k333j388J687J246
1732A109K55r29j928n31K889J484j367j602m52N26J765N46k234j609Q65J429J090
1749A306p3k089r69J851J317m15j236j288jK255J168j483j510M66J056J154N85
1766B094k703j431J467J537J30m63j463m83J704J692r88j622p96K59J659Q02j656
1783b61j699M19J955R29m12j684j448J744J565j10j254j259O2K192J358j088j698
1800f89P8O65Q75P87j819j623J104J553N67p92j301j112J545J492q92j411q69
$$ plain form
1683 1470 2281 -707 -2098 -1805 -512 1385 1493 -1127 -2083 3 1542 1591 809 -1578 -1942 1088 1986
1700 1986 699 -694 -959 -200 1882 2501 -442 -2130 -742 528 1254 647 -1869 -2494 214 1627
1716 1627 923 -1 -1975 -1759 855 1633 -289 -1552 -1061 81 1704 1897 -436 -1824 -137 1109
1732 1109 1364 435 -1493 -2024 865 2349 982 -620 -1072 -546 1219 1765 -469 -2078 -1213 216 1306
1749 1306 1233 -856 -1825 26 1343 928 -308 -1596 -1597 658 1826 343 -1167 -701 355 1509 2094
1766 2094 -609 -2040 -573 964 1094 631 -832 -1315 389 2081 1093 -529 -1325 -1066 593 1395 -261
1783 -261 -1960 -1541 414 1343 931 -753 -2201 -457 1108 998 -256 -1515 -1453 739 2097 1009 -689
1800 -689 -611 54 929 1716 -103 -1726 -622 931 1498 706 -595 -1707 -162 1330 438 -973 -1842
1817a842N52J556J112j423j637N52J485J168m50j576j116J261J561M3o51j193
1833e98LJ322J239j003j730m55O98J246J64j416j323P87J564O42p99j682m07J081
1851f67J467o6j607n05O06J714R29p05j932l3J233J041l80j118j140N78J738J68
1869A321q20j323l73J435O80n82j426n58P45J362O44j260r05l5J507P96o28j291
1887g11n05R56J517J21j042j034L56J185O08o31j688m93J136J307p8j478o38N01
1905f11J297O79j084j186k19R36J094j86j276m55P33J367K55p73j628l9J217R87
1923A108o39j316l81Q43J150L68r26j390M48J140M12l42j186m63R61J417j60j021
1941B3r98M06R05R24j007j296j00P96J101j75j204n00N31J432J39j109p40k59
$$ plain form
1817 -1842 -1290 266 1378 -45 -1682 -1130 355 1523 1073 -503 -1619 -358 1203 1246 595 -598
1833 -598 -595 727 1966 963 -767 -1222 -524 722 886 -530 -1853 -1066 498 1140 341 -1341 -1748 -667
1851 -667 800 734 -873 -1378 -772 942 1871 1166 -766 -799 434 1475 1095 -23 -1163 -585 1153 1321
1869 1321 501 -822 -1195 240 920 338 -1088 -1646 -901 461 1105 -155 -1060 -1095 412 1208 580 -711
1887 -711 -1216 -260 1257 1378 336 -698 -342 843 1451 820 -868 -1361 -225 1082 1004 -474 -1112 -611
1905 -611 686 1365 281 -905 -1124 -188 906 720 -556 -1011 -278 1089 1344 571 -1057 -1096 121 1108
1923 1108 469 -847 -1228 -385 765 1133 207 -1183 -735 405 817 475 -711 -1174 -213 1204 1044 23
1941 23 -975 -569 336 1260 253 -1043 -1143 -347 754 579 -625 -1125 -594 838 977 -132 -872 -1131
1959a131J153J086m5j370m48P04J004K83q14j281QJ255P05p13r52m19P92R51N1
1978H19j378o36jQ34R45l59j172k68R91R28J74p53j236O28J444L12o92q62j76
1997d58J048P70j39j303q42N48P33K95m26j202l94J106Q01k27j098n21N69J076
2015C36M53q51r75K11J163Q17j3j335m10R91L85J77l96j282K95J026K77q55m70
2034d56m17K69J212j55j158p72Q31N92O07l69r04l27J549O58l92p15n43L8J357
2053I05K77q00n23j10O52P96k64j145q06O90P95l97k24q24j87J234P11n06o79
2072d05n64L65P57O58j029o38N93N81R39n55q52p41J320N35n57o30p69L00R11
2091B19Q51r91r60N67K86N89K25j148r14J038M74N59l21r37k52J093Q78r53l95
$$ plain form
1959 -1131 22 1108 1063 -307 -755 -51 953 1236 422 -859 -851 404 1109 396 -556 -975 -183 768 819
1978 819 -559 -1195 -1196 -362 583 224 -948 -1216 -225 703 877 124 -1112 -484 960 1272 580 -282 -458
1997 -458 590 1360 1221 -82 -924 -376 357 652 226 -976 -1370 -264 537 310 -788 -1309 -740 336
2015 336 789 -62 -1037 -826 337 1154 1141 -194 -604 387 772 949 553 -729 -434 592 869 14 -456
2034 -456 -873 -604 608 453 -705 -1477 -646 -54 553 184 -720 -1047 502 1160 768 53 -490 -452 905
2053 905 1182 382 -141 -251 401 1197 933 -212 -1018 -328 467 70 -154 -978 -1165 69 780 274 -405
2072 -405 -969 -604 153 811 -218 -856 -263 318 1257 702 -150 -891 429 964 407 -223 -992 -692 219
2091 219 1070 79 -881 -314 -28 561 786 -362 -1276 -238 236 795 474 -463 -715 378 1256 303 -92
2110i2n87J93P89J33n21o69K70P38M62j99j124m85R87P57k08k94o70J1J002R03
2130A396r25p66O4J43P00L01j189o48O31N02K59j97j009k76R52O57n86o11j61
2149g63M5J009O02p57n66J80R11K08lq49o08P45P07k31k21n38k53N80O35r34q84
2170i85l8L47P10J99o38q74R21L58K30M7o93m49P11J164k86p66RO1P26O41q90
2191E05q17j07O33j97M35q38n78M93P10J52o11m12j10L22O71l41m54M0L74M98
2211C68N46l53j124N20P77J04r0p64m30L54J058l57q89j79J2M74M17m35r08P3
2231h26L99N95o5m69o90Q99N58j73j86k86o5M19Q29j98j068j0N01M78K43n71j031
2252g17K66Q47K01m13m67k08r4J120k28o75l5o2L09M98j17r12L95L70K12L36m41
$$ plain form
2110 -92 -679 -486 303 436 -85 -754 -484 254 716 517 -607 -1092 -105 652 444 150 -520 -509 493 1396
2130 1396 471 -295 -231 -88 612 913 -276 -924 -293 209 468 271 -738 -1014 -62 595 9 -602 -763
2149 -763 -718 291 893 136 -430 -250 661 869 866 17 -591 154 861 630 409 -129 -382 198 833 -101 -985
2170 -985 -1023 -676 34 233 -405 -1279 -358 0 230 277 -416 -865 -154 1010 724 -42 -33 28 754 1395 505
2191 505 -312 -419 214 17 452 -386 -964 -471 239 391 -220 -632 -742 -420 251 -90 -544 -504 -130 368
2211 368 914 561 -563 -43 734 838 748 -16 -446 -92 966 609 -280 -459 -447 27 444 9 -899 -826
2231 -826 -427 168 103 -366 -1056 -157 401 228 42 -244 -309 110 939 741 -327 -337 164 642 885 314 -717
2252 -717 -451 396 597 184 -283 -491 -585 535 307 -368 -403 -465 -156 342 225 -687 -292 78 290 626 185
2273A85o79O6R09K50o64k80k58M24P46k56q95J47J58K82M64m32o22J5N24N78m17
2294B45m10o82N99Q56j73o66k02k14Q79K39k47q29m1N32J17L84l84o18k5P09M73
2315E42l91m22P8J36P25j14q58j66N22L92K58l71q30kM00M61j61p01l53J09Q53
2336A07M6l80k63J90K52L80J33q86j4M99L27M47p25m27K5O42L32M8o24m19k6P38
2358D02P1o59m77j4N09M53k07n86j14L88M17Q8m89m58L44N85O30n85k42J59J86
2379D01R1m8o32j80M77J79J83k4r85L30K91K94k35o65j53K10N23N8m07k75K26
2400c41M80J78mo73J03K98L84R8m70m23J40N29J97n5m24k10J64K54l3n03q0j21
2422e12N04K60k21l76o7L38L72j36n04j57K77O69n5r1m55J51J90K21K7p11j59
$$ plain form
2273 185 -494 -428 481 731 67 -213 -471 -47 699 443 -452 -305 -147 135 599 167 -455 -440 84 662 245
2294 245 -165 -847 -248 608 435 -231 -433 -647 232 471 224 -605 -646 -114 3 387 3 -615 -640 69 542
2315 542 151 -271 -193 -57 668 554 -304 -470 52 444 702 331 -499 -501 -101 360 199 -502 -855 -746 107
2336 107 153 -227 -490 -300 -48 332 465 -421 -435 64 391 838 113 -314 -289 353 685 733 109 -310 -336 402
2358 402 473 -186 -663 -677 -168 285 78 -508 -622 -234 183 271 -218 -676 -332 253 883 298 56 215 401
2379 401 492 444 -188 -368 109 288 471 447 -538 -208 83 377 142 -523 -676 -466 57 115 -292 -567 -341
2400 -341 139 317 313 -360 -257 41 425 523 53 -370 -230 299 496 441 17 -193 -29 225 192 -311 -391 -512
2422 -512 -8 252 31 -345 -412 -74 298 162 -342 -499 -222 447 392 301 -154 -3 187 408 435 -276 -435
2443d35J13M52N4r5o10K76N06J09j34m90l89N40J64J72k59j16P3K95J46q9l65
2464h2j86kM78M0m54j71K46L13K34l78k47J57J65M60n25Pk88M58L67O8m70m52
2486b62J66J67L13l19k04l66J57N80p9k11J38l10K11K37j76m70J12L84P4p1J59
2507B30k75M7N0M46j26o60n1M85L01l92Pl97K41M69L0n40l39K1L52M8K2m27kJ99
2531b61O75k16j60l23Q6L40K13l7l37J53k10O52j9j13n60J51J82j19j49l57q9
2552d98L78N25m10l71J56j27J71K27j87l44L7L20O4J62N0m62L25O03k88k13j49
2573c1j53L57M68l59n01J62J17L18J0l56m65J12L21J43l8l42k92L24N32%l68k26
2595b67o3K63L77k9m17k11L64N61m78M8m32P3N42r8r5j07j68Q2L83k84j16k57
$$ plain form
2443 -435 -322 130 184 89 -521 -245 261 370 236 -254 -643 -103 61 233 -26 -142 -69 226 372 283 -82
2464 -82 -268 -270 208 248 -206 -377 -131 182 416 38 -209 -52 113 573 48 55 -233 225 592 660 190 -262
2486 -262 -96 71 384 65 -139 -505 -348 232 153 -58 80 -230 -19 218 42 -428 -316 68 142 71 230
2507 230 -45 2 52 498 372 -288 -339 146 447 55 62 -335 -94 375 405 -135 -474 -453 -101 -53 -31 -458 -460 -261
2531 -261 414 198 38 -285 -199 141 354 317 -20 133 -77 575 556 443 -117 34 216 97 -52 -409 -498
2552 -498 -120 405 -5 -376 -220 -347 -176 51 -136 -480 -443 -123 -59 103 153 -309 16 619 331 118 -31
2573 -31 -184 173 641 282 -219 -57 60 378 388 32 -433 -321 0 143 105 -237 -529 -205 327 327 -41 -267
2595 -267 -330 -67 310 281 -136 -347 17 578 100 148 -284 -211 331 233 138 31 -137 -55 328 44 -72 -329
2617c29K02l5K18Ll12j19N66j36J01j67m36L31K49K1n20J71K4L86K02k09l49j25
2639b63N17k08J39k91M9k55P53q8m00j04j18K65K68j27k99m5j7K60J38J08p49
2660d67J95M94j52N5k94j15L8N21N6l43N6k29N97K67j55o18J43l8J06j78o0K4
2682i7J3K81K13k22l70k9o7K58P0l66o4L41K2K28r0k40j04O6K43O1N6k88k3K89
2706A81N4k09j34J30J8M8P8k50k96L59rJ30m54j56K25K93j60N3Pm6j20J18L06
2729A66n2l30L48J20o2j86j12M6R3K38Q6m50J52k92L99j05K6k74l0L4N38k96m49
2752c92M4L05J9K27l0l83n2J57K06j33R8j33M3K97K25m83mj90K21Q9K23n89j43
2775c78M91J15j19q6k41J57R9N6j63k30K68%Kj28O5k09L80J31K71k82k28k12M37
$$ plain form
2617 -329 -127 -162 56 59 -253 -372 194 58 159 -8 -444 -113 136 157 -363 -192 -168 218 420 211 -138 -263
2639 -263 254 46 185 -106 -57 -312 441 353 -47 -151 -269 -4 264 137 -162 -207 -224 36 174 282 -467
2660 -467 -272 222 70 125 -169 -284 -246 275 331 -12 44 -185 412 679 524 -94 49 11 117 -61 -121 -97
2682 -97 -84 197 410 188 -182 -211 -278 -20 50 -316 -380 -39 -17 211 121 -119 -223 -157 86 147 203 -85 -108 181
2706 181 235 26 -108 22 40 88 166 -84 -380 -21 -30 100 -354 -510 -285 8 -152 -99 -92 -138 -258 -140 166
2729 166 114 -216 132 252 190 4 -108 -62 31 269 355 -95 57 -235 164 59 85 -189 -219 -185 353 57 -392
2752 -392 -348 -43 -24 203 173 -210 -262 -105 101 -32 66 -67 -24 273 498 15 11 -179 42 131 354 -235 -378
2775 -378 113 228 109 23 -218 -61 38 94 -69 -299 -31 -31 -29 -157 -92 -301 79 210 481 199 -29 -241 196
2798A96K8j18J07l78J25K11R4l30j0JN4pP0j88j05J39K22k47K95m33M5K16p8J94
2822A03l23N0L40nJ85l05n4j25L90r3J73l43j10K19K44n12N51l21k41K32J02j81
2844b4l04P4J49L00Mj69m16K28K47J71m09o2j1L10J67k18m8j46j02N97k7j24j
2867A86j55M24j92l99M3j50J10K97l64K19k87K19Q8N8k74J28m0J41K14l18j18
2888a70M8k5M05l51j2J6LK75K0l7k10M5j00J46J71m6k43k6R5j8J78j89k40M4K44
2913B3j41L93l49n0R9L54k03j40J01K9J76k04l37K2m8K31K51k85L0O8J07J99J63
2936D89o28K07j49L4J10j80m2n1Q8J22M1n6k50Q0K30n8Kj85K01NK49j88J34j90
2960A5j5J8P1O7k1j51o8K96K2l32NQ8JJ09m79J02OM80j65k96K77k85K98P3k64
$$ plain form
2798 196 224 106 213 -165 -40 171 265 -65 -75 -74 -20 -27 43 -145 -250 -111 111 -136 159 -274 -229 -13 -91 103
2822 103 -220 -170 170 165 350 45 -9 -134 256 163 336 -7 -117 102 346 -166 385 64 -177 55 157 -24
2844 -24 -328 -254 -105 195 199 30 -386 -158 89 260 -149 -211 -222 88 255 37 -11 -157 -259 338 311 187 186
2867 186 31 455 263 -136 -93 -243 -133 164 -200 19 -268 -49 39 97 -177 -49 -89 52 266 -52 -170
2888 -170 -122 -147 258 -93 -105 -89 -86 189 209 172 -38 7 -93 53 224 178 -65 -91 4 -14 164 -25 -265 -221 23
2913 23 -118 275 -74 -124 -25 329 126 -14 87 116 292 88 -249 -227 -275 -44 207 -78 -48 20 127 326 489
2936 489 -139 68 -81 -47 63 -117 -159 -210 -122 0 41 -15 -265 -185 45 -13 -11 -196 5 10 259 71 205 15
2960 15 0 18 89 156 135 -16 -84 212 234 -98 -93 -5 -4 105 -374 -272 -266 214 49 -247 30 -255 43 116 -148
2985a48j96lL26J96K59l11J9k41K02P5k03J20j63J11K25k82K1l8Pq0L17k88j2
3008h7q0P6K6J35j25k10J13R2J64M4O4l63K71K4k70K49J23l46M74k89O5k76j12
3031b38K56J90k18j94N2R2j09K78j31l17J94P6j55L52k42q7K04M3N9m6k5k9K92
3054B97j93k4pJ9j57J32J45j88k04L44r7l5n8j39P5N1K17l5k50J72l18K25L0j19
3078a17J03n5J81L56j49l98k2K33m1k09O3J33N9j63j1q3m6j27L24k62K08J60l2
3101A05j60k87L90j35j1N7J44k0o9K05n43L03j4p9J26L1o1mJ62K13k05k18Q0o4
3125e4p6J5K1n7L19k87R9J53o0k27K15J70l76J19j29j19K52j93J45n7J99Kk27
3148a53J4p5J52L84j33j34J02j89L78l08K91l48q8J66J87l00K64l03l70J64K68
$$ plain form
2985 -148 -344 -347 -21 175 434 123 142 -99 103 178 -25 95 -68 43 268 -14 7 -31 -24 -104 213 -75 -87
3008 -87 -167 -91 -65 70 -55 -265 -152 -60 104 148 212 -151 120 144 -126 123 246 -100 374 85 150 -126 -238
3031 -238 18 208 -10 -204 -152 -60 -169 109 -22 -339 -145 -69 -224 128 -114 -201 3 46 105 59 34 5 297
3054 297 104 80 73 92 -65 67 212 24 -180 164 67 32 -26 -165 -90 -39 178 143 -107 65 -253 -28 2 -117
3078 -117 -14 -69 112 468 319 -79 -101 132 91 -118 -55 78 137 -26 -37 -120 -166 -293 31 -231 -23 137 105
3101 105 -55 -342 48 -87 -98 -41 103 83 14 219 -324 -21 -35 -114 12 43 -18 -22 140 353 148 -70 10 -54
3125 -54 -130 -115 -94 -151 168 -119 -20 133 73 -154 61 231 -145 -26 -155 -274 -22 -215 -70 -127 72 74 -153
3148 -153 -139 -214 -62 322 189 55 157 -32 346 38 329 -19 -107 59 246 -54 210 -93 -463 -299 -31
3169c1o2j11Q8K3Q8OL5o8n7p2K86K28k47j48K5L1MJ48K05m05L9J07K5M1k65k18
3195c05L80o2J05k11k56L83j09N8J6M7q4r9J15L2P5l02Q5J08J11j74K4J42j82
3218a03L76k01j40n1K65k71M07n5k40k90M52j39O7j31M5l8J98k67L2j85J43j3
3240a39M5Q0j2K87r3j18J28m7j63m9O7J81j76K9R8J70l01n9j47L54j91Q3n5J40
3264A12l35L58j21J90n71J07N05k95l8j11J82k34L78O1k00j41K49k30K59j83J66
3285A08m0o4K11j06qj04j1l8J00OJ96l64M8M0M0j16Ol7l9j20N07m03L64M5j60
3310F1Nj25p6Q3K42r1l9j27Km8K81J03k08L8l43K67J03k39j68J32J5j75O08n07
3334b06J56M3j09L2O9m3rp3J94J37Q3k63k2J29l4j35K1Q0J4J16j26J7j74K23j55
$$ plain form
3169 -31 -93 -204 -116 -93 -5 1 36 -32 -89 -161 125 353 106 -42 -17 14 18 166 371 -34 5 112 137 178 -87 -305
3195 -305 75 13 118 -93 -349 34 -75 -17 -1 46 -38 -137 -22 10 85 -217 -132 -24 87 -87 -63 79 -103
3218 -103 273 72 -68 -119 146 -125 282 227 -13 -303 149 10 77 -54 -9 -47 151 -116 -84 -269 -126 -139
3240 -139 -94 -14 -26 261 168 50 178 131 -32 -81 -14 167 -9 20 118 288 -13 -72 -219 135 -56 27 -28 112
3264 112 -223 135 14 204 -367 -260 245 -50 -88 -199 -17 -251 127 188 -12 -153 96 -134 125 -58 108
3285 108 68 4 215 109 101 -3 -14 -52 48 54 250 -114 -66 -26 14 -102 -96 -133 -172 -292 215 -188 176 221 61
3310 61 66 -59 -135 -52 190 99 60 -67 -65 -113 168 271 63 101 -242 25 128 -111 -279 -147 -132 -307 301 -206
3334 -206 -50 -7 -116 -84 -15 -58 -67 -140 54 191 274 11 -11 118 84 -51 -30 50 64 180 54 71 -103 120 -35
3359c5j3K6j05K9O1J78j24j51rK08j20J73Q8k92N0O5o0J93k95K07J39P3k39k50
3383b03J96L9Q6o6n8LR7K34l93m5k8J97J04j31m3P9j39j42L62j06N7l02K75O2
3407A35Qj42o2J71j89K21o4j34j52K65j5J11K5p1j44m08M57r0J08l5J03r7K8K53
3431B82m11J88l73J12L23k50M1p7K97j39r0J80j2Q8j29J8L1j4m6n9K31k07K7n6
3455d5j42K44J52j66r1j58J28L1J34j92j19J71n7o5J55LJ52K7j80J79J7j93N3
3478C8J03n2J10l28J82K32k84J70j78R3r6Qq4Kj19J29J47j07L5n9P3l8l4R3l5
3503AJ17Q2r6J24j22p8q2K77kj75r5J45j21m28M10k8J93l68K02qn1J16m0j5J74
3528A32j8k37J86j76k9K17l04R7J53R2j41L75l13j37l9J94n3K75m28L13j23J19
$$ plain form
3359 -35 -48 -22 -127 -98 -37 141 17 -134 -143 65 -55 118 206 -86 -36 29 -31 162 -133 74 213 286 47 -203
3383 -203 -7 32 118 52 -6 -3 94 328 -65 -110 -138 59 163 32 -11 68 -71 -213 149 43 100 -202 73 135
3407 135 143 1 -61 110 -79 142 78 -56 -208 57 42 153 178 107 -37 -445 12 -78 30 -5 98 1 29 282
3431 282 -129 59 -314 -202 121 -129 -88 -165 132 -7 -97 83 71 159 30 48 79 65 19 -40 191 -16 11 -45
3455 -45 -187 57 209 43 -48 -206 -78 -47 87 -105 -224 -53 -110 -175 -20 -17 135 162 -18 161 178 -15 38
3478 38 141 89 199 -129 53 285 1 171 -7 86 -10 -2 -86 -84 -203 -74 73 -34 1 -58 15 -23 -57 36 1
3503 1 118 200 104 228 106 28 -54 223 221 46 -49 96 -25 -453 -43 -71 122 -246 -44 -52 -103 13 -27 -42 132
3528 132 114 -123 63 -113 -142 75 -229 -132 21 113 -28 347 34 -103 -142 52 -1 274 -154 159 36 155
3550A55K18l35J64k82j26J00j33K18J0j47KJ9Q9K19j1r3J6j07L1K34l92rL86l31
3574a05M98j16j86j84j20M5M39j09j07q6r1K28J20j41P4o8Q2l44J88J8K7k64K56
3597E4k21J79j28j03l8O8K56J0J21k20j31K6L61j22K61m95oK52j51j32J63N6n
3620E5j72J96j27L2L8m5j81K20j8k29K71J43l57L94j42j44J42k05K61p5J07p6
3642H8k36K01JJ52k98j26K35j00Mj65M9K42k7R5oj43L2m9K53j90j04K49l17K42
3666H2N9j86M05l98k09K33K11j25o9r9L52l57J05o2J88P2k21K8n7K20Q5Jl16O4
3690FN1p9m3J44k94K13N0k06l7L93q9k50l1J64L9j17k0l3J87pj38J26R6p8q8P3
3716C2j09J85q2m5P2k28N9K56L4k36J21L5j03J93k24m7k7K49MQ3o2j50J60l3J0
$$ plain form
3550 155 373 38 202 -80 -206 -106 -239 -21 -11 -158 -156 -137 -48 171 160 67 83 -24 7 241 -151 -160 226 -105
3574 -105 393 277 91 -93 -213 -168 271 162 55 -31 -122 106 226 85 159 91 173 -171 17 35 62 -202 54
3597 54 -167 12 -116 -219 -257 -189 67 77 198 -22 -153 -127 234 112 373 -122 -128 124 -27 -159 4 60 55
3620 55 -117 79 -48 -16 22 -23 -204 16 -2 -231 40 183 -174 220 78 -66 76 -129 132 57 164 88
3642 88 -148 53 54 206 -92 -218 17 -83 -79 -244 -195 47 20 115 109 -34 -2 -51 202 12 -92 157 -160 82
3666 82 141 -45 360 -38 -247 -14 197 72 3 -96 256 -101 4 -58 130 202 -19 9 -48 172 257 258 -58 6
3690 6 57 -22 -65 79 -215 -2 48 -158 -195 198 109 -141 -172 -8 31 -86 -106 -139 48 41 -97 29 125 47 -41 32
3716 32 -77 108 26 -19 53 -175 -116 140 174 -62 59 94 -9 184 -40 -87 -114 135 139 222 160 10 170 137 147
3741A47l51J05o5L99O2j31p9j66%J68k01J43j84J80r6K95r9q6r0J16K63n41K30
3764A9j92R6L30l02J02j39N4J8l9J69j75K10k02J79j21J56k58K16p1j16j26L94
3786B02l03p8L84k54O4j53J33L4J1q1P3k22L6K23L1j34J29n2m4M2K40k96M8O4
3810I7J38j76j59J45j37J46N0r9Q3J7j97j4Q3l6j83M85r6j23j45l2j5L5J60P7
3834A04K86m35M3lm7m6M4k4J9pK9P8j11O4o6J32N3o8k9j7m8k13o4J4K02L56l9
3861B07N4j75J44k77M5o9M35n68L00J04q4q3j14K09k37J56Q1j78k0l9J83k8j80
3884a34J26j2M0p5o2J82J76j92K10J0j02m26R7P8n3J52l1k14K65km9l6J02k2J57
3909A85j79J16k73L74j47j90J74J05j63l8R9K7k07J30J32l4l6O1q0j19N1J74j11
$$ plain form
3741 147 -204 -99 -164 235 297 166 87 -79 -79 89 -112 31 -153 27 -69 226 127 41 -49 67 330 -211 19
3764 19 -173 -77 253 -49 53 -86 -32 -14 -53 116 -59 151 -51 128 7 163 -95 121 50 -66 -192 202
3786 202 -101 -179 205 -49 15 -138 -5 29 40 -41 32 -190 -154 69 100 -34 95 43 -1 41 281 -15 33 97
3810 97 235 59 -100 45 -92 54 104 5 88 105 -92 -106 -23 -59 -242 243 147 24 -121 -153 -168 -133 27 104
3834 104 390 -45 -2 -5 -52 -98 -54 -78 -59 -66 -37 41 -70 -6 -72 60 113 45 16 -1 -49 -262 -326 -312 -110 246 207
3861 207 261 86 230 -47 -2 -71 364 -204 96 200 116 33 -81 128 -109 47 128 -50 -70 -109 74 46 -134
3884 -134 -8 -20 20 -55 -117 65 241 49 259 269 167 -259 -162 -84 -137 15 -16 -230 35 33 -16 -52 50 28 185
3909 185 6 122 -151 223 76 -114 60 165 2 -36 63 90 -117 13 145 111 75 136 56 -63 -12 162 51
3932E1K4J26q7O3j66q7r8K62l69L57k50MK35M9j28J29j76k87K20J71k8P5L8k48
3956a20J57J43j75j00L9M1K33j66k85N26n01j1K82j23L9Q7K80m09J82r1j43j66
3978b81M65k56J7J50r2l9J67L1j20j46Q1J6o0n2k7J48j59K47P3j13O5P9k3j01
4002G0K3j84M8J09l9K00l43K92j39j43L11p0k02J7M4pk2r0J8Oo9L27J78j70K5
4027A90L9k39O0k35K53l48J43P2j31K80j42l8J57r4k2J6j42M4k49K27K17J06l0
4050A34p5r3J8M5m4j99L22k92m8J42r7L17k56K04j80J56J86j80j79J14kK27k76
4073e6j31J14m5p7J16K89l73pL06r3j34rP2K79o8k56K80j03j53L1J3j04L7J8q7
4098a41p3L30k87L10k56Q5J65k86K06o0J78j96O7m9j26L4J79j81J30n9j92K42
$$ plain form
3932 51 75 201 114 177 11 -76 -174 88 -281 76 -174 -170 65 114 -14 115 -61 -348 -128 43 15 90 128 -120
3956 -120 37 180 5 -95 -56 -15 218 52 -233 293 -208 -219 63 -60 -21 66 346 -63 119 28 -115 -281
3978 -281 184 -72 -55 95 3 -36 131 162 42 -104 -23 -7 -67 -119 -146 2 -157 90 163 50 115 194 171 70
4002 70 93 -91 -43 66 27 227 -116 176 37 -106 205 135 -67 -50 -6 -13 -35 -125 -107 -101 -170 157 335 165 190
4027 190 229 -10 50 -185 68 -280 -137 -65 -196 84 -58 -96 61 -33 -55 -39 -181 -137 -386 -159 58 164 134
4050 134 59 -34 -16 29 -15 -214 108 -184 -232 -90 -187 130 -126 78 -102 54 240 60 -119 -5 -7 220 -56
4073 -56 -187 -73 -118 -195 -79 210 -163 -170 136 43 -91 -100 -28 251 183 -73 207 104 -49 -18 -5 -109 -72 -54 -141
4098 -141 -214 116 -171 139 -117 -32 133 -153 53 -7 171 -25 42 -7 -133 -99 80 -101 29 -30 -222 20
4120B0L5l34K67K13l26P3L12k60j19J91j49J73j48K35k24j9O5j31j38K99n1J22
4142A06j50j69M6J88J79r8Q0n9k67r4K45J49k46q3K05j68J12J74j88M6n3K02j04
4165E3nj50q4J71m0R3l94L32K4lJ18j19m1Q9R9r9j2NL1m5J22N3l7j54M8J15J59
4192C29n7j46j63Q9j01Q0K41j64K2J01n0k10j37j04J99q6K37p4k16K22N4J84l00
4215e0P2j53O7J70q6N1N4o9N9j14lK49o4k83l5q7K05L4Q5j53k50K23L7R1l97J28
4241b19L22k64Q1Q1l0k6j52J71N7Qo4j43J74Q2j33J2Qj03l9J61j80K57j72J0R4
4266gn7m6J83r6P5j5Q9J06k72J10j70J73k31J39K49l78J40L7l4r0L07j84PK0o0
4291em7J47o2j38m9N9J63N0m1Jk8K4J22l21J4J86k72J86J42J4n1j07J56j50J77
$$ plain form
4120 20 55 -279 -12 201 -125 -52 260 0 -119 72 -77 96 -52 183 -41 -60 5 -126 -264 35 -16 106
4142 106 -44 -213 -167 21 200 102 182 123 -144 -238 7 156 -90 -173 32 -136 -24 150 -38 8 -45 157 53
4165 53 48 -102 -186 -15 -55 38 -356 -24 0 -3 115 -4 -45 44 143 44 32 37 68 23 145 198 161 7 55 170 329
4192 329 272 126 -37 52 -49 31 272 108 130 231 181 -29 -166 -270 -71 -157 80 6 -210 12 66 250 -50
4215 -50 22 -131 -64 106 20 71 125 56 115 1 -2 247 183 -100 -135 -222 -17 17 102 -51 -301 -78 -41 50 -347 -219
4241 -219 103 -161 -80 1 -29 -55 -207 -36 21 29 -35 -178 -4 78 -55 -43 -35 -138 -177 -16 -196 61 -111 -101 -7
4266 -7 -64 -110 73 -23 52 37 126 232 -40 70 -100 73 -158 -19 230 -148 -8 29 -5 -95 212 28 35 55 -5
4291 -5 -52 95 33 -105 -154 -95 68 118 77 78 50 74 196 -125 -111 75 -197 -11 131 145 94 -13 143 -7 170
4316A70j34O6m1p0j46M54k17J14j64N9j23k4O2P7j85J15p1r3j06J65j66J28L39
4339B09k62j6R7l1j79L22m29L44J3J39j89k52L1L7J45o4R2j61n8J30o1P3J51o4
4363A7k85J20J67j09K02j78L32j20m31K4K90m6J72jo0j03j3j19n2K88l19Q7J46
4386Ik28L48j1j68l3j5j00J59J25P6K0k35l2L29o29M71j58K0P7k68J70kj02J98
4410B1N6qj79J23j38j3K2J3L59k50l42K30L36n99L53J48R0j03J11p2r5j67p5K64
4434H5j38k6M3J25j64j1L10m16K9L40q1k8k1m7Q9j17k2J6r4L13n9j77L8J72k00
4459d1l0j8J33k30K12K4n4n1m0J40j02J3j26L2K34k02J09K3k27L58l71J82J13
4482H1K6R4m63J41J6K02r9j40J72l1o9J16K60j40j32l32M90k97L19l51J28q7K10
$$ plain form
4316 170 36 102 61 -9 -155 299 82 196 32 91 -32 -56 6 83 -102 13 -58 -151 -257 -92 -258 -130 209
4339 209 -53 -69 28 -3 -182 140 -289 55 68 207 18 -234 -203 -166 -21 -85 7 -154 -212 -82 -143 -70 81 17
4363 17 -268 -148 19 -90 112 -66 266 146 -285 -261 29 -17 155 154 94 -9 -22 -141 -193 95 -224 -137 9
4386 9 -219 129 118 -50 -83 -98 -198 -39 86 162 182 -53 -85 244 -385 86 -72 -52 25 -243 -73 -75 -177 21
4410 21 77 69 -110 13 -125 -138 -116 -103 256 6 -336 -106 230 -369 -16 132 222 119 230 158 63 -104 -179 85
4434 85 -53 -79 -36 89 -75 -86 224 -192 -163 177 96 68 47 0 89 -28 -50 -34 -128 185 126 -51 -13 159 -41
4459 -41 -71 -89 44 -186 26 50 -4 -55 -95 45 -57 -44 -170 -138 96 -106 3 26 -201 157 -214 -32 81
4482 81 107 201 -262 -121 -105 97 -2 -142 30 -1 -70 46 306 166 34 -298 192 -105 214 -137 -9 -96 114
4505A14k08NK76n28L99QJ00k95J41k30J57O3p2J15P9j5j88p4R1J23k7K37m03J15
4529a7K5j04J92k78K16j04j32N68l24J31j40j43K78k96R4N8J05k39J78o5Q9l7
4551E5J26k28j74J45j37M29m32k0M02l4k84L02J7m6j55M4n9L42l92L09p3k2K08
4574C23m63J7j7P5j08K85k27K78l03J20J98j63q0J04N8j67J1J08J6j88j1J68L
4597C7J89r6o3J03J3l5J11m16K35l15J65K34j68K3M9j44J95j38o0k0o8L01o4k42
4621a74J61K73k17K47j42m40J64l4R5J46k9l75L65j1j75K0K62l86K00K17%L1j51
4644D7J32k31M2l55N11k7k79J15j06O9q1j51J72J7k2K24n8j5j0j26J38ml40J51
4668a87J58K17j63m5j2o0j90M05j18NQ0R9l25J61%K6J9j50p9J15j64M54r4Oj35
$$ plain form
4505 114 -94 -89 187 -341 58 66 166 -129 12 -218 -61 2 -70 45 124 109 -79 -153 -62 61 34 271 -132 -17
4529 -17 8 -96 96 -182 34 -70 -202 366 42 173 33 -110 168 -128 -34 24 129 -110 68 3 92 55
4551 55 181 -47 -221 -76 -213 216 -216 -236 166 132 -152 150 167 121 -34 10 -49 293 -99 210 137 115 323
4574 323 -140 -123 -140 -65 -173 112 -115 163 -140 -20 178 15 -65 39 97 -70 -59 49 65 -123 -134 34 37
4597 37 226 130 67 170 183 148 259 -157 78 -237 -72 162 -6 17 66 -78 117 -21 -81 -101 -169 132 68 -174
4621 -174 -13 260 43 290 148 -292 -128 -162 -67 79 50 -325 40 29 -146 -126 136 -250 -50 167 167 198 47
4644 47 179 -52 -10 -365 146 119 -160 -45 -151 -82 -163 -314 -142 -125 -147 77 19 4 -6 -132 6 2 -338 -187
4668 -187 -29 188 25 -20 -32 -92 -282 123 5 10 90 189 -136 25 25 51 70 -80 -159 -44 -208 246 152 158 23
4693B3n8K09k73R8r1o5R4J70j14J74k94J77r5k00L04j78K94k13j24N9O9j7L08
4716B57k85q7K26k6k12J26J0o5M6k13L18J12k31n7K1PK1o1L6R8p6J06j94J46m7
4741b4O5J0l00M23m4j78L47j60j5NO9q8L2j95j4L9m7M7j6R6r4K1Oj36J71j95O5
4768a10J47%J32pl1M7k70R2j24J22n9Q5j3j15J11j80K44r1R9n5qj03Q1Pj1j23
4794a33L05J02k13k12J73Q2k79K28Q6k01J31L4j15O8m1k44J44L8j42K22l79M52
4816A06K6j93o0J37o2o0L36k41p1J44R7j73J37p3O1k07k43N22r5K0k13J78J6q8
4840Ao7J2j1j03K39N4m60L27k41K32J37j82R3J0Q6o9M7j72K34O5j40k6j12J27
4864H1j04J01r7J66j52j03K1J72k1m9o5J87k30R1J97l24J85J88j49k26j00J82
$$ plain form
4693 23 -35 174 -99 -1 -92 -157 -63 107 -7 167 -127 50 -45 -245 59 -119 175 -38 -162 -103 -34 -51 257
4716 257 -28 -115 111 85 -127 -1 9 -56 -10 -223 95 207 -24 -81 -60 -53 -32 -93 -57 41 -35 71 -123 23 -24
4741 -24 41 51 -249 174 130 -48 299 139 124 129 198 110 142 -53 -67 -28 -75 -28 -44 52 -42 -21 -15 -151 20 -175 -110
4768 -110 37 37 169 162 131 178 -92 0 -124 -2 -61 24 11 -104 7 -173 71 -20 79 24 16 -87 -6 1 -10 -133
4794 -133 172 274 61 -151 22 104 -175 53 139 -62 69 103 -12 56 15 -229 -85 -47 -189 33 -346 106
4816 106 132 -61 -121 16 -46 -106 230 -11 -82 62 159 -14 123 50 111 -96 -339 183 88 108 -105 73 89 1
4840 1 -66 -54 -65 -168 71 125 -335 -8 -249 -17 120 -62 31 41 127 58 105 -67 167 232 92 66 -46 81
4864 81 -23 78 -19 147 -5 -108 -87 85 64 15 -50 137 -93 -2 195 -129 56 244 95 -131 -231 -49
4886d9J5J02Q5R2j39k0M0j46K58k23N0j30o3j76K50P0rJ36Q8k74j7j15J9K1J14
4911b1J95l21K01q7K2n5L70j79K6J31p3k10J9P8j46J7p8l7L33l51K32j05J71p3
4935E9l2q5r5J04QJ69jl42j19L60J72q6j34oJ89l61J52K55j28ok25K4OJ72M1n6
4961C5%k12N4L1j29J72Jk6JJ38m8j69j10K2Q6K30m9l70J15K02M5n2r9k9kM7J46
4988C0Q9P2k41J12o4L4O4j30k6J47r6K13j60m7j50j6K39k28J13K04K7k35m1j23
5012b13M4qJ50J79k19J68J11k31N2J40l0k18r0K84p5l68L54P3k20K16k72K45K02
5035B74k92J44l55P4o3J43J62k89L59j16j7j39K5R0kN7M8j48M0j49Q7n3l4P0K81
5060A97o4J7j24J14l13M82l9r3k61O9j89J53N0k18M93q2l14J88k44L35k54k48
$$ plain form
4886 -49 -34 68 153 245 106 86 126 -20 238 15 65 -65 -128 -304 -54 16 7 143 231 -43 -60 -175 -156 -135 -21
4911 -21 174 -147 54 -33 -11 -66 304 125 151 282 209 -1 18 96 -50 -33 -111 -148 185 -166 66 -39 132 59
4935 59 27 -58 -153 -49 -41 128 127 -215 -334 26 198 112 -22 -28 161 -200 -48 207 79 73 -152 -128 -122 50 91 35
4961 35 35 -177 -123 -92 -221 -49 -48 -74 -73 65 17 -152 -262 -240 -154 76 27 -343 -228 -26 19 -33 -132 -161 -163 -116 30
4988 30 119 191 -50 62 -2 32 96 -34 -60 87 -9 204 44 -3 -153 -169 70 -158 -45 159 186 -49 -90 -213
5012 -213 -169 -177 -27 152 -67 101 212 -19 33 173 143 -75 -165 119 44 -324 30 103 -117 99 -173 72 274
5035 274 -18 126 -229 -155 -218 -75 87 -202 157 41 24 -115 -90 0 -2 55 103 -45 -5 -154 -67 -120 -154 -84 197
5060 197 133 150 26 140 -173 309 270 177 -84 -15 -204 -51 -1 -219 274 192 -122 66 -178 157 -97 -345
5082c45L12L17l71K00k07N1J08r2J81j03J30j39m6J72kM7j40n6K53l28j92L55
5104A05n6k03L25N6m78J76Rp9P7j41J11P7P4o7K3K03m01k6L76j95j38M0p4L11
5128A05j63L27l92K31K1pk32J09j1m4j40K65k93K97lk84K94j71O3j06J72N6k48
5151a54J20lL4L2p1J1q8K22j60K31j26k5K5kK16m20K05j8l5k80K14k65K13r6K74
5176E4j26Q5m0k16L92k30J16J31j43l59K82J36p3m2L08l06p0J02R4k48J87j61
5198a27J68j8J85j39j13l9J36J2j75N1K79k76R2J60k45j77K44j06j66K80K46k17
5220E5j71K32J64j18m58M34n1m9l10L27J58mk64r4L29m58N97k30j73q9M2J87j40
5243h4J38k1Jq4o3N9L06k98J2k10J38M9J11j9L4J56j50l76L97q7k45K19K49j96
$$ plain form
5082 -345 -33 284 -87 113 -94 -43 65 -27 154 51 181 42 -4 168 166 213 73 17 270 -58 -250 105
5104 105 49 -154 171 227 -251 -75 -66 -145 -68 -209 -98 -21 53 -14 9 212 -189 -215 161 -34 -172 -132 -206 105
5128 105 -58 269 -123 108 129 122 -110 -1 -12 -56 -196 69 -224 73 70 -214 80 -91 -28 -134 38 94 -154
5151 -154 -34 -37 -3 29 -42 -31 -119 103 -57 174 48 23 48 46 262 -158 47 29 -6 -286 -72 -337 -124 -220 54
5176 54 -72 13 -27 -243 149 -81 35 166 23 -336 -54 82 9 -33 275 -31 -101 1 95 -153 34 -127
5198 -127 41 23 208 69 -44 -83 53 65 -110 -59 220 -56 36 196 -49 -226 18 -88 -254 26 272 55
5220 55 -116 116 280 162 -296 138 87 38 -272 55 213 209 -55 -149 180 -278 319 89 -84 -173 -131 56 -84
5243 -84 54 33 34 -50 -113 -54 252 -46 -34 -244 -106 -57 54 35 69 225 75 -301 96 9 -236 -17 232 36
5267C6j44K08k12J95j6O2Oo7j44j37L68Jj96j64L68j14J0K92o12J4J42k3J22q0
5291h5K69l25J61k30M5J78R4k1j52mJ82k43L4K12K33j98j29j3M0k57K66j44J5
5314g2K6K27j13j61p4K23k8k53M07k95k6K12m5n1L4J42k00R3k63O2K02n0Qo3q6
5339a44K06J22j19r3j38L20k88o0P5P0j33J53L9J06j18r6K62k89J78q7n2L9K98
5362B51j16r4p2P6L5r7L8n5R9q3pJ7K61k61n3P2K14q0j26N6j58N7r4qP7K07n7
5389I9J1j26m4J61k00r8J49Q5J9j99J90j31j29J23J92k18j04K84ln0Q1J20j43
5412F9j13J29r5J29q0J3J01j20Q1j56K97l68O7K68j11l03J47K05n6k61K55P1M9
5435B18k62j1J9Q0n0JP7j16J4K42k91o5n6P7K67j60mk13J70j49K85L3J08k70j37
$$ plain form
5267 36 -108 100 -112 83 67 129 135 68 -76 -213 155 156 -40 -204 164 50 60 352 -260 -246 -104 -127 -5 -85
5291 -85 184 -141 20 -210 -165 13 107 86 -66 -70 112 -131 -97 115 348 150 21 8 48 -209 57 -87 -72
5314 -72 -46 181 68 -93 -167 56 28 -225 182 -113 -139 73 28 -23 11 153 -47 46 -217 -155 47 -3 5 -58 -144
5339 -144 62 184 65 -28 -166 154 -134 -194 -119 -49 -182 -29 10 116 -2 -98 164 -125 53 -34 -86 -47 251
5362 251 135 41 -31 45 80 -17 21 -34 65 -18 -25 -8 253 -8 -61 11 225 145 19 75 -83 -26 -120 -128 -51 156 99
5389 99 110 -16 -60 101 -99 -197 -48 37 56 -143 47 -84 -213 -90 102 -116 -220 64 61 11 92 212 69
5412 69 -44 85 -10 119 39 52 153 33 114 -42 255 -113 -46 222 111 -192 -45 160 104 -157 98 169 218
5435 218 -44 -55 -36 44 -6 -5 72 -44 -30 212 -79 -144 -200 -123 144 -16 -20 -233 -63 -212 73 106 214 -56 -193
5460a93K85j72k01L3M20k36K7J31K10l13j11K69l79N46j88j82J19p2j09L03l75
5481a88O4n2k6R8K26k7q4j78K46q9n0J71k58l2j17K8L87j04m9k5J78k25J39N6
$$ plain form
5460 -193 92 -80 -281 -248 172 -64 -37 94 304 -9 -120 149 -230 316 128 -54 65 -7 -116 187 -188
5481 -188 -124 -176 -202 -104 122 95 11 -167 79 -10 -60 111 -147 -179 -296 -268 119 15 -34 -59 119 -106 33 89
$$ [...]
8191G9
##END NTUPLES=NMR FID
##END=
