##TITLE=1H_LR-770-k1
 D2O
 8 sc, 
 6.10.2023
##JCAMPDX= 6.0         $$ Bruker NMR JCAMP-DX V2.0
##DATA TYPE= NMR FID
##DATA CLASS= NTUPLES
##ORIGIN= UXNMR, Bruker Analytische Messtechnik GmbH
##OWNER= root
$$ XWIN-NMR		Version 3.5
$$ Fri Oct  6 16:20:53 2023 Russian Standard Time (UT+4h)  she@DPX200
##.OBSERVE FREQUENCY= 200.13135
##.OBSERVE NUCLEUS= ^1H
##.DELAY= (6, 6)
##.ACQUISITION MODE= SIMULTANEOUS
##.ACQUISITION SCHEME= undefined
##.AVERAGES= 8
##.DIGITISER RES= 18
##SPECTROMETER/DATA SYSTEM= spect
##.PULSE SEQUENCE= zg30
##.SOLVENT NAME= D2O
##.SHIFT REFERENCE= (INTERNAL, D2O, 0, 15.7039)
##AUDIT TRAIL= $$ (NUMBER, WHEN, WHO, WHERE, WHAT)
$$ ##TITLE= Audit trail, XWIN-NMR		Version 3.5
$$ ##JCAMPDX= 5.01
$$ ##ORIGIN= Bruker BioSpin GmbH
$$ ##OWNER= she
$$ F:/spectra/data/she/nmr/H-F/1/audita.txt
$$ ##AUDIT TRAIL=  $$ (NUMBER, WHEN, WHO, WHERE, WHAT)
(   1,<2023-10-06 16:19:31.65 +0400>,<she>,<DPX200>,
      <created by zg, POWCHK disabled, PULCHK disabled
       configuration hash MD5:
       00 E9 B6 7A A2 85 ED C7 34 08 36 98 17 FE 4E 26
       data hash MD5: 16K
       77 93 D4 2D 2B AF B7 4E 0D 25 BA 0C 1F 97 B9 2A>)
$$ ##END=
$$ 
$$ hash MD5
$$ 01 91 11 23 51 68 33 1C C7 A2 58 B7 CE 94 0C 4B
##$RELAX= 
##$RELAX= 
##$RELAX= 
##$RELAX= 
##$RELAX= 
##$RELAX= 
$$ Bruker specific parameters
$$ --------------------------
##$DU= <F:/spectra>
##$EXPNO= 1
##$NAME= <H-F>
##$PROCNO= 1
##$TYPE= <nmr>
##$USER= <she>
##$AMP= (0..31)
100 100 100 100 100 100 100 100 100 100 100 100 100 100 100 100 100 100 
100 100 100 100 100 100 100 100 100 100 100 100 100 100 
##$AQSEQ= 0
##$AQ_mod= 1
##$AUNM= <au_zg>
##$AUTOPOS= <>
##$BF1= 200.13
##$BF2= 200.13
##$BF3= 200.13
##$BF4= 200.13
##$BF5= 200.13
##$BF6= 200.13
##$BF7= 200.13
##$BF8= 200.13
##$BYTORDA= 1
##$CFDGTYP= 0
##$CFRGTYP= 5
##$CHEMSTR= <none>
##$CNST= (0..31)
1 1 145 1 1 1 1 1 1 1 1 1 1 1 1 1 1 1 1 1 1 1 1 1 1 1 1 1 1 1 1 1 
##$CPDPRG= <>
##$CPDPRG1= <>
##$CPDPRG2= <>
##$CPDPRG3= <>
##$CPDPRG4= <mlev>
##$CPDPRG5= <mlev>
##$CPDPRG6= <mlev>
##$CPDPRG7= <mlev>
##$CPDPRG8= <mlev>
##$CPDPRGB= <>
##$CPDPRGT= <>
##$D= (0..31)
0 1.2 0 0 0 0 0 0 0 0.06 0 0.03 0 0 0 0 0.0002 0 0 0 0 0 0 0 0 0 0 0 0 
0 0 0 
##$DATE= 1696594771
##$DBL= (0..7)
120 120 120 120 120 120 120 120 
##$DBP= (0..7)
150 150 150 150 150 150 150 150 
##$DBP07= 0
##$DBPNAM0= <>
##$DBPNAM1= <>
##$DBPNAM2= <>
##$DBPNAM3= <>
##$DBPNAM4= <>
##$DBPNAM5= <>
##$DBPNAM6= <>
##$DBPNAM7= <>
##$DBPOAL= (0..7)
0.5 0.5 0.5 0.5 0.5 0.5 0.5 0.5 
##$DBPOFFS= (0..7)
0 0 0 0 0 0 0 0 
##$DE= 6
##$DECBNUC= <off>
##$DECIM= 32
##$DECNUC= <off>
##$DECSTAT= 4
##$DIGMOD= 1
##$DIGTYP= 9
##$DL= (0..7)
0 120 120 120 120 120 120 120 
##$DP= (0..7)
150 150 150 150 150 150 150 150 
##$DP07= 0
##$DPNAME0= <>
##$DPNAME1= <>
##$DPNAME2= <>
##$DPNAME3= <>
##$DPNAME4= <>
##$DPNAME5= <>
##$DPNAME6= <>
##$DPNAME7= <>
##$DPOAL= (0..7)
0.5 0.5 0.5 0.5 0.5 0.5 0.5 0.5 
##$DPOFFS= (0..7)
0 0 0 0 0 0 0 0 
##$DQDMODE= 0
##$DR= 18
##$DS= 0
##$DSLIST= <SSSSSSSSSSSSSSS>
##$DSPFIRM= 0
$$ [...]
##$SUBNAM2= <"">
##$SUBNAM3= <"">
##$SUBNAM4= <"">
##$SUBNAM5= <"">
##$SUBNAM6= <"">
##$SUBNAM7= <"">
##$SUBNAM8= <"">
##$SUBNAM9= <"">
##$SW= 18.05172834244
##$SWIBOX= (0..15)
0 0 2 0 0 0 0 0 0 0 0 0 0 0 0 0 
##$SW_h= 3612.71676300578
##$TD= 16384
##$TD0= 1
##$TE= 0
##$TE2= 300
##$TE3= 300
##$TEG= 300
##$TL= (0..7)
0 120 120 120 120 120 120 120 
##$TP= (0..7)
150 150 150 150 150 150 150 150 
##$TP07= 0
##$TPNAME0= <>
##$TPNAME1= <>
##$TPNAME2= <>
##$TPNAME3= <>
##$TPNAME4= <>
##$TPNAME5= <>
##$TPNAME6= <>
##$TPNAME7= <>
##$TPOAL= (0..7)
0.5 0.5 0.5 0.5 0.5 0.5 0.5 0.5 
##$TPOFFS= (0..7)
0 0 0 0 0 0 0 0 
##$TUNHIN= 0
##$TUNHOUT= 0
##$TUNXOUT= 0
##$USERA1= <user>
##$USERA2= <user>
##$USERA3= <user>
##$USERA4= <user>
##$USERA5= <user>
##$V9= 5
##$VALIST= <valist>
##$VCLIST= <CCCCCCCCCCCCCCC>
##$VD= 0
##$VDLIST= <DDDDDDDDDDDDDDD>
##$VPLIST= <PPPPPPPPPPPPPPP>
##$VTLIST= <TTTTTTTTTTTTTTT>
##$WBST= 1024
##$WBSW= 4
##$XGAIN= (0..3)
0 0 0 0 
##$XL= 0
##$YL= 0
##$YMAX_a= 99864
##$YMIN_a= -85084
##$ZGOPTNS= <>
##$ZL1= 120
##$ZL2= 120
##$ZL3= 120
##$ZL4= 120
##$ABSF1= 10
##$ABSF2= 0
##$ABSG= 5
##$ABSL= 3
##$ALPHA= 0
##$AQORDER= 0
##$ASSFAC= 0
##$ASSFACI= 0
##$ASSFACX= 0
##$ASSWID= 0
##$AUNMP= <proc_1d>
##$AZFE= 0.1
##$AZFW= 0.1
##$BCFW= 1
##$BC_mod= 2
##$BYTORDP= 1
##$COROFFS= 0
##$CY= 11.3945322036743
##$DATMOD= 1
##$DC= 2
##$DFILT= <>
##$DTYPP= 0
##$F1P= 15.7292609196834
##$F2P= 12.9074282941183
##$FCOR= 0.5
##$FTSIZE= 0
##$FT_mod= 4
##$GAMMA= 1
##$GB= 0.15
##$INTBC= 1
##$INTSCL= 1
##$ISEN= 128
##$LB= 0.24
##$LEV0= 0
##$LPBIN= 0
##$MAXI= 10000
##$MC2= 0
##$MEAN= 0
##$ME_mod= 0
##$MI= 1.114404
##$NCOEF= 0
##$NC_proc= 0
##$NLEV= 6
##$NOISF1= 3.799351
##$NOISF2= 2.8
##$NSP= 1
##$NTH_PI= 0
##$NZP= 0
##$OFFSET= 15.70392
##$PC= 1
##$PHC0= -22590.13
##$PHC1= 7.452711
##$PH_mod= 1
##$PKNL= yes
##$PPARMOD= 0
##$PSCAL= 0
##$PSIGN= 0
##$REVERSE= no
##$SF= 200.130013532006
##$SI= 16384
##$SIGF1= 3
##$SIGF2= 2
##$SINO= 400
##$SIOLD= 16384
##$SREGLST= <1H.CDCl3>
##$SSB= 0
##$STSI= 0
##$STSR= 0
##$SW_p= 3612.71676300578
##$SYMM= 0
##$S_DEV= 0
##$TDeff= 0
##$TDoff= 0
##$TI= <>
##$TILT= no
##$TM1= 0
##$TM2= 0
##$TOPLEV= 0
##$USERP1= <user>
##$USERP2= <user>
##$USERP3= <user>
##$USERP4= <user>
##$USERP5= <user>
##$WDW= 1
##$XDIM= 8192
##$YMAX_p= 0
##$YMIN_p= 0
$$ End of Bruker specific parameters
$$ ---------------------------------
##NTUPLES= NMR FID
##VAR_NAME=  TIME,          FID/REAL,        FID/IMAG
##SYMBOL=    X,             R,               I
##VAR_TYPE=  INDEPENDENT,   DEPENDENT,       DEPENDENT
##VAR_FORM=  AFFN,          ASDF,            ASDF
##VAR_DIM=   8192,          8192,            8192
##UNITS=     SECONDS,       ARBITRARY UNITS, ARBITRARY UNITS
##FACTOR=    0.0002768,     1,               1
##FIRST=     0,             0,               0
##LAST=      2.2672688,     0,               0
##MIN=       0,             -85084,          0
##MAX=       2.2672688,     99864,           0
$$ Real data points
##PAGE= N=1
##DATA TABLE= (X++(R..R)), XYDATA
$$ [...]
1596C277k615k623q46Q80J384Q97K12L69P20M42r65k449k244j27K417L611K075
1613D415r79l156k903p09J449J995J027j76k94L77N67o05k029k139l88K227L667
1630B346K171q45l331l375q56J724K537J507k71q99k47L81j82j478j841m86J822
1647a323L429K254p40l228l464j105J807K897J806j53j116r60j2m6q49j278l57
1664b438J512K774K082n50l019l287j221J617K960K075R3j285j353n14k4l91o86
1681a655o8J288K277J513n20k620k960j120J407K822K129L18j263j606r13k04
1697a175j10r8L74J276J662R90q14k316k418p89J339K459K019K85j051j538j119
1714a024m78j10K07Q39J446J348L91j234k212j829k74J406K186J529J25r20j353
$$ y = [3277, 662, -1961, -2807, -1927, -543, 354, 566, 935, 1655, 2097, 1132, -1317, -3561, -3688, -1271, 2340, 4415, 3436, 280, -2623, -3332, -1883, 112, 1139, 963, 669, 1046, 1613, 1008, -1021, -3160, -3548, -1321, 2346, 4517, 3672, 341, -3034, -3890, -2166, 371, 1878, 1607, 708, 461, 842, 660, -818, -2659, -3145, -1323, 2106, 4360, 3620, 392, -3072, -4177, -2370, 527, 2333, 2180, 1064, 104, 92, 46, -803, -2081, -2438, -926, 1848, 3930, 3380, 361, -2926, -4147, -2530, 430, 2505, 2598, 1313, -40, -554, -578, -969, -1655, -1723, -435, 1842, 3355, 2835, 215, -2745, -3865, -2458, 364, 2493, 2811, 1548, -58, -971, -1175, -1285, -1383, -1009, 267, 1929, 2919, 2105, -211, -2629, -3418, -2079, 380, 2399, 2684, 1633, 95, -1024, -1502, -1612, -1405, -566, 880, 2228, 2619, 1385, -827, -2656, -2930, -1524, 662, 2191, 2316, 1396, 43]
1731D3r95o82k24L88J183J636J221o6j693k266j467K97J802K048J016k29j061
1748I51j067p27n65l50K31J275J852J315m01k020k509j268Q48K264K014N58q21
1765A580j213r04k88k88l44N3J075J852J426l41k177k797j230J148K650K205L69
1782B776j309j676r23J23K24j01j26O62J711J386j51k125k871j398J209K973K424
1799B808L55j705k120j026L46P09J86j14L64J234J337j5j930k749j384J108K988
1816C92K682L96j918k481j273M32J174P01K3K1P48R35Q1j551k430j372J029K786
1834C75K617N20j787k684j520L69J399J104K97j19K40N21k1j213k008j074Q60
1851b124K536K338N95j688k561j709K18J433J451N82p5n8Jk22j129j401o13R04
$$ y = [43, -952, -1634, -1858, -1470, -287, 1349, 2570, 2504, 811, -1455, -2922, -2625, -823, 1225, 2241, 2012, 951, -116, -843, -1408, -1758, -1527, -252, 1600, 2915, 2514, 494, -2015, -3283, -2435, -171, 1843, 2401, 1580, 367, -537, -825, -1113, -1457, -1404, -329, 1523, 2949, 2608, 431, -2366, -3596, -2448, 202, 2407, 2776, 1467, -209, -1132, -1009, -785, -886, -1012, -350, 1361, 2747, 2596, 471, -2400, -3798, -2589, 384, 2808, 3163, 1458, -662, -1688, -1342, -633, -447, -561, -197, 1037, 2374, 2359, 429, -2320, -3704, -2596, 392, 3074, 3470, 1552, -929, -2202, -1770, -596, 105, 128, 149, 897, 1832, 1913, 362, -2068, -3440, -2411, 375, 2992, 3512, 1725, -959, -2479, -2110, -711, 393, 690, 571, 811, 1332, 1311, 98, -1910, -2984, -2124, 412, 2750, 3345, 1657, -904, -2613, -2395, -962, 489, 1071, 996, 938, 939, 717, -412, -1813, -2426, -1522]
1869a522K143K056L47j586k359j540J13J289J580Q34P5k71l61o55r99r83k15J124
1887i30J850J537Q1j548k046j283J82J170J397R10J92j79o07r15j083p85K75J386
1905c96J885J062m33j659j732q65M22J073J154O91K77j10n59j046j363o82O18
1922a663J684J937P20p67j986j631m68P74J205R35L24J20%m44r75j327p44N86
1940a720J937K057O77j264k200j671j41J228J484O87J8k34k1k08p67j325p95N37
1958a721J989K137O96j448k467j802P5J621J697P81l70n89l11J5m89j003q78M55
1976a612J829K085P18j249k671j905M2J852K068Q47n53j106n29pn7o99o57K98
1994a306J479J973P35j219k531j966m3J912K296J001n67j380r27j27J52j78m12
$$ y = [-1522, 621, 2677, 3024, 1438, -921, -2461, -2348, -1059, 521, 1355, 1430, 1159, 798, 143, -856, -1839, -2054, -930, 920, 2457, 2538, 990, -1056, -2339, -2157, -987, 410, 1320, 1512, 1333, 726, -189, -1272, -2057, -1782, -396, 1489, 2551, 2118, 459, -1273, -2138, -1716, -643, 511, 1202, 1479, 1369, 810, -236, -1599, -2281, -1663, 21, 1958, 2678, 1911, -75, -1706, -2174, -1400, -195, 740, 1064, 1184, 1184, 740, -235, -1562, -2306, -1720, 217, 2274, 2951, 1687, -513, -2184, -2325, -1097, 387, 1074, 1092, 858, 837, 629, -138, -1463, -2258, -1721, 268, 2405, 3101, 1653, -814, -2616, -2541, -920, 777, 1558, 1188, 599, 288, 303, -186, -1189, -2067, -1612, 217, 2302, 3020, 1771, -900, -2805, -2763, -911, 1157, 2004, 1451, 345, -184, -191, -248, -947, -1604, -1306, 173, 2146, 2881, 1662, -869, -2835, -2878, -966, 1330, 2331, 1764, 384, -543, -670, -518, -696, -1108]
2011a108K00J215J550O74j016k359j899j27J872K227J257n21j511j256k94K38
2027h58J45N0J78R67J183L85r74j908j701j7J646K144J223m49j474j283n84J78
2045a149M07L56M70P94P28J6r49j750j244J41J603J840J005n04j284j300o36J43
2063a313M67N79O95O83M41k76j171j488q29M79J518J603O75n95j148j116n78O8
2081a306M15O17R35P73L03o21j465j333m85Q01J748J309K32p80j172q45l54J48
2099a080K42O22R19P99K41o88j610j468k35J151J849J202k3j060j293o47k4L17
2117g86K32L78P15Q52L86q16j631j509k01J350K046J285k52j478j446n11L50N80
2135d56K76K08M23P67M20o31j692j527j93J400K213J327l84j752j626n53O16R01
$$ y = [-1108, -908, 307, 1857, 2531, 1515, -844, -2743, -2870, -998, 1229, 2486, 1965, 454, -802, -1096, -858, -713, -663, -485, 482, 1665, 2050, 1076, -832, -2533, -2550, -904, 1240, 2463, 2014, 540, -743, -1327, -1149, -742, -386, 84, 878, 1606, 1622, 673, -1077, -2321, -2180, -577, 1263, 2268, 1764, 480, -820, -1456, -1313, -846, -267, 428, 1111, 1552, 1276, 105, -1383, -2212, -1733, -215, 1388, 2063, 1468, 320, -796, -1374, -1306, -891, -274, 661, 1434, 1737, 1116, -349, -1682, -2167, -1366, 382, 1691, 1923, 1143, -29, -874, -1228, -1080, -838, -216, 703, 1502, 1743, 1055, -555, -2023, -2258, -1107, 742, 1944, 1921, 861, -432, -1079, -1103, -786, -554, -176, 539, 1391, 1777, 961, -670, -2179, -2380, -1030, 1016, 2301, 2049, 571, -875, -1386, -1036, -456, -180, 28, 451, 1218, 1638, 1007, -685, -2212, -2405, -1005, 1208, 2535, 2151, 399, -1227, -1780, -1164, -263]
2153b63M65N6J13N64L33m42j420j500k31J454K134J373m22j807j867n99P29J212
2171a18Q13j2j08R3J98k63j189j192l34J238K093J337m00j715k001o77Q18J402
2189a7R96P2l36j89l9k97p68j029r4J087J740J212l21j676j904p04P37J465J095
2208A030K67l84n02k77l13o01n04lR97J516Q94l54j491j766o51P44J330J130M04
2227A466l93o09n60m66m53k26L17R57J294N33m90j443j406m31O43J282J013L53
2245A381l50n56n76o77m27l9O40J065J037K34p24j475j046j89P34J221Q14K00
2263A267l05n61n70o38m96Q0O78J277R63M6j092j474q85J51R68J125O08n7l38
2282G47m40m71o35m69K0P84J355J000j37j301j608q32M35J386R86M75k69m88l79
$$ y = [-263, 202, 258, 371, 935, 1268, 826, -594, -2094, -2325, -871, 1263, 2636, 2214, 407, -1460, -2059, -1330, -118, 695, 683, 575, 668, 866, 603, -586, -1778, -2112, -874, 1219, 2556, 2156, 441, -1560, -2237, -1419, -17, 979, 1051, 715, 526, 487, 190, -578, -1607, -1701, -614, 1126, 2338, 2017, 341, -1563, -2267, -1530, -65, 1030, 1297, 913, 411, 134, -179, -780, -1284, -1287, -290, 1226, 2120, 1766, 275, -1491, -2142, -1398, -68, 1062, 1466, 1073, 464, -96, -562, -1015, -1241, -924, 33, 1327, 1860, 1370, -73, -1479, -1910, -1267, 15, 1028, 1381, 1031, 475, -101, -778, -1205, -1244, -604, 461, 1498, 1732, 1008, -467, -1513, -1702, -968, 253, 1067, 1267, 962, 401, -169, -807, -1303, -1223, -545, 732, 1695, 1741, 649, -825, -1710, -1559, -591, 534, 1142, 1085, 747, 307, -164, -799, -1268, -1248, -464, 891, 1891, 1754, 453, -1155, -1987, -1552, -166, 820, 1295, 1026, 538, 159]
2301A59l22l76n83o6N90J608Q42j08j409j696p16O61J253J302L28m86q93l93j38
2320d43j49k03j73O06J194R16j2j344j738r37O31J687J467K12o69j209m02k36
2338h02K13K11r7N74N31J104K48j802j583p80O24J874J326K76j063n78j422J97
2356i49L96R2L52K3P03N42J29j020j295j223P95J282J826K86q46j236j177l29
2374a649J101J10L89J54P69M89o16q65j098l28K55J100J754L77p89j011j155k90
2392a303L74O54J50J84R92o7o20q77n30m55M99J251J025N36p83j596p78k94R14
2411g24N58M95M58K53N9n91j255m58n8P76Q79J213p9q15r17q54j18N34O35K08
2431A99N34L87k86n75j144m51j09J191J033O68r0r47p15p13K9K78O82L81M08L94
$$ y = [159, -163, -539, -1122, -1188, -598, 1010, 1852, 1744, 335, -1361, -2077, -1416, -163, 1139, 1467, 981, 88, -305, -443, -592, -795, -968, -362, 832, 1748, 1736, 392, -1346, -2283, -1652, 35, 1502, 1714, 1045, -164, -566, -802, -589, -378, -475, 99, 630, 1734, 1982, 180, -1403, -2183, -1559, 315, 1641, 1917, 854, 276, -1146, -949, -553, -461, -109, -86, 617, 1159, 1288, 268, -1027, -2250, -1455, -173, 1653, 1939, 1093, -143, -1320, -1649, -548, -438, -49, 105, 874, 1363, 747, -118, -1216, -1544, -1289, -189, 1565, 1942, 1153, 142, -1013, -1303, -929, -275, -125, 59, 1051, 984, 364, -513, -1043, -1498, -999, 252, 1277, 1813, 1030, -566, -1344, -1638, -724, -166, 329, 787, 1040, 1099, 508, -747, -1205, -1263, -487, 392, 1605, 1526, 711, -206, -1060, -1178, -644, -9, 199, 733, 1120, 834, 259, -885, -1336, -1445, -254, 779, 1447, 1357, 410, -305, -1018, -989, -711, -29, 352, 760, 1154]
2451A154j06q48j031o29L07R97J239M67m13r26j050l19L04N30N82K27L15J77k63
2470G14l57j298o67N48J032J545K39p58j170r27o7M39N84O68q5pK69Q2r38n81
2490g35p85K87J216J510L42n79j637r83J6O44O20P52j06j36K10l89k19q47n75
2509a394L67J083J306M36n57j638r25j59P35R03P22k0m51p6j19j42n78o07j24
2528a238J434J162K91n63j443j190j34P74J251P09l94j83m63p0k98n20Q8L0J038
2547B81Q54M70o84j165j433J6P59J268O90J32n63q53j23p9l57K77Q3Q72N33L65
2567A343p03j192j032K9R73J138L68K27n75p58k86k81n5M20L57O11M84L7o56j002
2587e53p24J79O98J128N03k80n84o57m49m05N07R8M61R25K11j05q06q14q43N07
$$ y = [1154, 1048, 200, -831, -1460, -1153, -156, 1083, 1550, 1137, 211, -839, -1158, -854, -324, 258, 485, 800, 977, 714, 357, -941, -1608, -1060, -28, 1517, 1756, 998, -172, -1099, -1166, -727, -143, 525, 440, 433, 702, 784, -154, -735, -1520, -1233, -17, 1493, 1835, 1256, -381, -1364, -1348, -704, -84, 668, 562, 426, 636, 247, 28, -819, -1394, -1027, 56, 1362, 1798, 1241, -397, -1322, -1481, -746, 157, 879, 859, 408, 332, 213, 71, -507, -1114, -1238, 196, 1358, 1649, 1086, -357, -1547, -1681, -907, 344, 1053, 659, 476, 13, -57, -355, -875, -787, -757, 281, 1135, 1605, 921, -244, -1677, -1661, -902, 366, 1056, 1188, 625, -228, -351, -430, -787, -510, -427, 445, 978, 1343, 640, -552, -1584, -1555, -582, 556, 924, 1151, 576, -182, -468, -749, -804, -384, -27, 584, 1068, 1105, 449, -553, -1277, -1098, -400, 728, 1231, 951, 367, -290, -739, -1144, -637, -539, -78, 847, 1058, 953, 147, -667, -1510, -1003]
2607a003P60O43Q20k64n89m86n82j80K23M48L26N41O86k53j131r36l90K74J160
2626F7J019M2n55j76q74j1l01j9M73O91N95K83l29j305q06k76M82R46J069K79
2646A294n07p80m33o0o7K94K55M36L53M52m60j007j249K11N64J157N69J01o97
2665D26p09r5j27j10M90j68R30m17N50M2j098p36q49J024J165J117J64j061j103
2684e65j76M9M44K69K1R6N14J51m01n72j147L03L78J516O01k65q20j096ll3L05
2705d31L91J17K08J68J41mr82q21nO45J153P59k1j232o99m75K79M84M28L62R0
2726E55j54j58j71o41n0l96L30J113J171m70n47j239o00L93M22P93R3j16K9J41
2746D98l29p78j27N8M27Q53O36k07j015o31m34j0P41P82J39J74l71j51m06n38
$$ y = [-1003, -243, 400, 1220, 956, 367, -119, -701, -881, -658, -210, 116, 657, 1343, 1090, -41, -977, -1367, -1093, 67, 1086, 1128, 573, 397, -477, -488, -789, -808, -335, 356, 951, 1234, 905, -400, -1206, -1482, -1000, -54, 1015, 1294, 787, 7, -426, -486, -553, -259, -4, 432, 785, 1237, 777, -230, -1479, -1268, -704, 453, 1022, 1123, 426, -283, -378, -505, -615, -125, -293, 637, 220, 770, 812, -286, -1022, -1871, -847, 318, 1435, 1599, 538, -565, -741, -692, -248, 21, 42, 138, 652, 803, 402, -170, -1317, -1014, -636, 880, 1481, 1216, 396, -700, -703, -736, -431, -40, 77, 285, 453, 594, 590, -392, -1213, -1218, -573, 580, 1339, 1318, 86, -613, -1088, -809, -325, 103, 465, 555, 401, 243, 72, -569, -619, -1015, -685, 428, 1599, 1129, 582, -657, -1257, -864, -442, 351, 444, 328, 357, 498, 169, -609, -736, -678, -251, 602, 1238, 1031, 16, -615, -1049, -1059, -318, 464, 603, 777, 406, 255, -151, -689]
2766f89k37J98O61P71M53k94p78p27l57K69N43N00K66J20j53l53m90m26k08K65
2786f66P89P67K40m52p71o62k04L00N88M12K58K7p8m01m79m22j84M05Q53O33K27
2807A180n11r32o11p9M62O10L42J64j27p6k38n39m92r4M47Q19P56J19o74r64o13
2828a051R1N84O20L17l8j27j96j84l54l82j00L32Q92O97M1o71r94o16J51P10P04
2849D26L18j08l20k30j62k32k99j14L80P38O80L2o95j077m94J04Q32P59L27k01
2869F64m97k80j43p8k44j4L63O18O17p8n85r78n51K14P61Q49L28l34m69m24j17
2890c78j3q2J36K90M48M78l0n80q89m88J92P14Q63L30k33o71m13j79M9R8J22L63
2912A27L26L70j50n84p37l83J59P96P03L06k38o29m67k20N6K03K57M17K81J89
$$ y = [-689, -926, -728, -67, 704, 1157, 863, 85, -642, -999, -730, -187, 313, 579, 699, 546, 193, -297, -723, -931, -666, 123, 890, 1130, 678, -93, -755, -959, -659, -71, 341, 599, 626, 548, 147, -332, -754, -938, -533, 320, 953, 1180, 669, -263, -874, -953, -491, 119, 461, 625, 498, 422, 184, -355, -847, -941, -494, 325, 1081, 1200, 526, -438, -1051, -960, -376, 244, 561, 523, 396, 200, 16, -338, -720, -820, -488, 404, 1101, 1142, 471, -523, -1139, -988, -278, 426, 744, 636, 316, 86, -76, -308, -607, -721, -341, 397, 1077, 1109, 414, -663, -1157, -1053, -221, 538, 865, 664, 167, -113, -256, -334, -578, -592, -229, 389, 1006, 928, 343, -635, -1186, -972, -211, 638, 966, 632, 163, -261, -378, -391, -473, -337, -47, 401, 879, 849, 269, -620, -1108, -916, -202, 661, 991, 758, 87, -326, -505, -456, -358, -236, 127, 453, 823, 673, 89, -648, -1031, -872, -76, 627, 933, 695, 66, -401, -621, -565, -362, -105, 312, 593, 782]
2932G82k37n51o52k66K53P20O74J40j97o23m27j91P1J54L57L26K89O8k99n53n58
2953g20j80L42O74N44J90l71n06m29j69J09K32K84L46L37j2m00o15m88r0N54O78
2974C10N10k8m33n39l29rP1J83L02L66K73mm10o65n27M7N92P51L95o9n30n74k36
2997e53K9J75J86J89L20K83k5m10o53m60jO97P66M15k04o38n29k45J32K79K34
3018a3J96K01J90m3l62o25m31P1O43P22M60k64o76n88k10K63L21K99P8Q5J16r
3040D24l41n67m03J46N30P88L95j98p21o32k59L14M53K85J52K4l5l9k65m91k98
3061g38Q8N70P36L12k61o32o56k83L54N03L05K09o0j74j38k89k95k04J40M60O70
3082F17K53k42o02o62j49K60N88L12J78j20j75k78k14k40r6J74M81N32J30k17
$$ y = [782, 545, -6, -658, -924, -671, 49, 723, 863, 666, 43, -384, -575, -504, -350, 7, 333, 622, 690, 391, -162, -720, -900, -558, 116, 660, 850, 479, -27, -456, -625, -516, -284, 0, 346, 683, 671, 271, -344, -832, -922, -368, 310, 820, 792, 359, -180, -509, -518, -447, -264, 38, 404, 677, 673, 263, -402, -929, -882, -290, 461, 856, 787, 257, -317, -553, -524, -349, -163, 26, 346, 629, 604, 194, -459, -919, -920, -223, 543, 958, 754, 116, -413, -658, -526, -247, -13, 183, 384, 574, 531, 169, -456, -887, -816, -173, 549, 1009, 745, 69, -519, -729, -466, -145, 154, 232, 317, 433, 424, 83, -484, -887, -741, -211, 577, 972, 774, 53, -579, -838, -524, -71, 214, 366, 390, 355, 316, 51, -440, -738, -650, -80, 656, 968, 707, 75, -581, -864, -510, -7, 298, 507, 447, 273, 135, -154, -449, -653, -513, -53, 617, 870, 628, 26, -636, -785, -525, 63, 375, 553, 433, 258, -20, -234, -474, -570, -396, 85, 617, 747, 530]
3102E30n83o22j41L17N50M50M4j30j78l30k10k03L5K04M82M08J10l45o07m67j2
3123f98L10M42L56J06j06k96k28k51j79O0L00N00L49N3m08n74m18kM41M06L09
3144D72P3k29j81k57k51j38M8L65N01K87j2m44o40k61P7M24M64J71n4j45j56k93
3166a79j96q8PL74M75L56j40n14n93k72J36N28N02K10j86l12j54j82q3p8M1L07
3188d1M80K51q0n52o30j83J69N85N17J53k47l53k31j12n7j4Q9K58M32K10j15n15
3210A4n74k01K08N76N51P4k05n71j21j07m4Q3Q3M44J98K97j31n98n56k14L16N59
3232H1M93J27k44m28l28j42P3J89J16K32L12M7j78m31m75j56K43N63M91J24k88
3253D21m95l05j42J64K16J87J34J93J12k66l40m43o5K49M94M24J19l21m09l18
$$ y = [530, -53, -675, -816, -499, 51, 501, 545, 415, 237, -93, -303, -506, -471, -267, 215, 623, 733, 388, -219, -686, -698, -388, 54, 410, 516, 410, 114, -114, -365, -544, -484, -184, 316, 665, 718, 310, -264, -682, -684, -243, 163, 472, 545, 316, 135, -122, -373, -511, -463, -98, 403, 690, 678, 234, -406, -667, -590, -166, 298, 469, 415, 270, 114, -179, -375, -463, -456, -82, 393, 749, 609, 95, -498, -770, -634, -106, 396, 606, 420, 108, -46, -228, -311, -389, -348, -41, 439, 690, 610, 58, -572, -755, -586, -1, 516, 669, 422, 69, -162, -274, -331, -345, -256, 2, 434, 644, 529, 14, -560, -761, -553, 23, 574, 648, 443, -128, -249, -356, -400, -317, -234, 210, 408, 705, 574, -24, -580, -794, -478, 81, 574, 701, 457, 29, -299, -441, -368, -179, -63, 169, 481, 528, 350, -81, -556, -712, -469, 94, 585, 709, 421, -74, -379, -521, -357, -141, 46, 180, 373, 485, 219, -121, -564, -629, -380, 114, 538, 657, 336, -73, -391]
3273c91q6J86K04K14J52J37o2j39m47k92m4K81N44L06R6l18n15k82j3J20K39K73
3295A63J38Q9l8l24l67k28N6L28M62K99l4l17m08k49k6J91K38J89J79N6r8k62
3317C7l68k36R8L69M84J94n8m15l33k25N5J38K45J95J81O1j70l06l83k00J45M79
3339a3M33J86j61m40l35j15N2K25K75J48M5N6q8l37l41j92K28M21L57K27k25m45
3361c9l43j10J60K72K45Q2Q7q3j48j81l08j83J39N32L90J52k99m22l90j25K59
3382c13L07K51N1k2j11n1k12l14m8J59L68M37Q6k67m50l71l0K49L81K67Lo2j74
3405A34j23k05j33n1R4M46L22R1k40m71l67k7K40M40K60n2j09k11p9k59k2n5K15
3428a62L20L30Lj81m78l90J1L41L59K41K3j52k39j19j56l0O1J23L52J92K5k48
$$ y = [-391, -477, -291, -87, 127, 279, 416, 354, 215, -232, -524, -568, -287, 257, 563, 659, 341, -174, -456, -469, -349, -110, 163, 301, 390, 352, 28, -339, -567, -511, -183, 279, 578, 544, 227, -181, -430, -456, -265, -27, 162, 341, 397, 299, 37, -331, -567, -469, -100, 384, 578, 520, 105, -228, -453, -398, -260, -15, 180, 361, 422, 252, -54, -437, -637, -492, -13, 420, 606, 445, 5, -330, -445, -393, -168, 107, 255, 300, 356, 268, -69, -410, -602, -374, 47, 404, 631, 406, -39, -382, -492, -332, -60, 185, 267, 354, 271, 123, -58, -366, -549, -410, 122, 512, 664, 365, -57, -447, -572, -313, -6, 245, 296, 274, 163, 112, -100, -414, -462, -303, 65, 502, 588, 321, -129, -500, -530, -281, 100, 367, 370, 308, 134, 11, -194, -327, -378, -284, 162, 484, 575, 335, -136, -503, -530, -290, 150, 410, 358, 249, 38, -41, -300, -322, -377, -162, 158, 488, 491, 310, -168, -558, -547, -206, 153, 394, 417, 265, 26, -93, -249, -279, -218, -95, 257, 449, 474, 226]
3450B26m25k81l6L12M00K59j6j51k37k47j24m4J17K41K73K08q7k29l93l14Q7K76
3472a85L85K33j7k44k46j46q0p0J74K32L32J01j04l16l54j46O3L43L39R2l9j43
3494B04l38n3j00J7J45K21K64J10j05m19m06l27K39L88M46j5l2k3k65Q7l80M9
3516b93K67K64L81k15r5m80j60j39M09P1N35k34k66J52l25k59K44qJ34R7K19K65
3538E64j17o85l30K19JN90k0K57m26n9j94Q1n6J77j34J36O9P8ll05j78l98N95
3561a38M11ppk56k22j57O4k64L79J31J94l47M31J00m34l03l83K96Q92J43J3k75
3583B61n57j08J82P2L16r7J10J49m5l00j67k73J1K48L98M87l40m14J77o04J53
3604c41L09R4J93j37J45j09j24l71q9m9L61K72J59J86l82j85l86K75L7K66J69
$$ y = [226, -199, -480, -516, -204, 196, 455, 439, 288, 51, -196, -320, -364, -247, -6, 267, 475, 388, 159, -234, -548, -461, -185, 200, 433, 416, 172, -74, -220, -300, -370, -196, 36, 368, 469, 365, 49, -305, -451, -388, -45, 294, 386, 347, 204, -134, -187, -287, -270, -125, 96, 360, 470, 365, -54, -460, -787, -548, -160, 286, 271, 239, 216, -49, 38, -342, -293, -26, 238, 619, 404, 309, -171, -331, -470, -61, 10, 545, 311, 45, 197, -128, -387, -143, -151, -17, 80, 299, 564, 447, -238, -568, -349, -348, 242, 222, 479, 53, -6, -200, -119, -175, 2, -132, 4, 73, 151, 148, -157, -335, -733, -138, 273, 266, 259, 3, -219, -376, -312, -576, -197, -66, 128, -219, 212, 312, -122, -425, -808, -512, 380, 523, 536, 261, -296, -404, -222, -150, 166, 69, 179, 328, 283, -17, -184, -457, -446, -198, 200, 687, 347, -67, 110, -494, -341, -32, 62, 255, 118, 263, 154, 30, -341, -430, -479, -118, 154, 313, 499, 117, -68, -454, -179, -142, 124, 293]
3625B93n6N9j53j24k16k50k0M25N55j44J94n17k57j20mJ04L14J24Q1K10m47j92
3647a41j87rJ47L6N06K83l61k15k88j19m4N18J06j1K08N4m65l70P5R5L9J27j4
3670c0O25j64l83k86r0J59L0L89Q4K3j23j11m3m36o6L12j5M44L4p6n65l1L8K53
3694b8J15J22j90M13l70k64k9k97L64l90N90N57j52j84n68k80j13M81L78Q5J67
3715D07l08R7l35N4o4l15M86J21q8J40lm52l46K59J11K64p6M92l12q1q8L8o55
3738f54J95L64R4L09N5j98j32L1k98K66o2K23M6k68P6m05J19J38l36P88j05j27
3760A19K9K3k32l54k76K97N66J35r3p0l40J21k35R7J07O1J68O9J04k80j44l51
3782d79L84j53M07K93j58r7l74K4j78J05J23J74N9K14o5k48l08j42N8K16L16J44
$$ y = [293, 237, 296, 143, 19, -197, -447, -467, -42, 513, 369, 563, 46, -211, -331, -335, -231, 83, 207, 288, 498, 51, -141, -328, -337, -190, -154, 352, 635, 274, 59, -229, -348, -392, 126, 232, 221, 429, 483, 18, -352, -277, -182, -143, -16, -30, 595, 431, 48, -238, -328, -169, -139, 250, 334, 357, 234, 123, 80, -356, -422, -110, -125, 319, 353, 277, -288, -319, -281, -28, 87, 209, 19, 432, 62, -202, -231, -528, -164, -554, 36, 593, 441, 257, -311, -591, -704, -223, 155, 240, 407, 99, 196, -139, -85, -149, -464, 22, 143, 55, 195, 192, -260, -606, -347, -236, 28, -48, 444, 132, 51, -37, 1, -654, -459, -95, -1, 308, 363, 165, 33, 64, -234, 32, -30, 193, 239, -29, 47, -358, -239, -101, -437, 351, 246, 119, 148, 171, -61, -415, -691, -394, 172, 307, 214, 144, -196, -75, -310, -213, -106, -45, 123, 192, 296, 16, -128, -479, -95, -248, 159, 452, 294, 197, -177, -153, -331, -226, -103, 71, 130, 344, 279, 31, -277, -419, -361, -145, 171, 315]
3804C15l4j71j89j87n2J16P2K37J14N6j1k93k34j07O9K80J84K03j54m7l14l5j8
3827b00k2K24Q9K67j24j71j41k65QM5K62M29r1r5k62j20m9mR2R3J44J53qj30k25
3852a01k48qJ57J95L38Qj65j94j68l5pR7J68J70Q0Lj96k07j56n9J69K79J82K6
3876C28j54k40j32lpJ52J38Q1Q3rj46k76j65nK03K44J56K0j47j89k44M2Q2J39
3900d9J59N1O1L1j98k26q8n8K73J85J97j2k18k22j41N0P4J38J10J07J3n9j60j75
3924a57j84O7J98K46J72l5j96k87j12J8K03R5R5P6L4j26q4j94r4K7K12K43Q0l3
3948B64k01k65j10J31Q6J30J97j4o7p1j47j18j22J42J77K44N2n6k33k03j36K8
3970b92K69J02J29J4j00j22j49o9j9M0K89J68M4j47j86j93o3P2J93J74O8lo8j01
$$ y = [315, 281, 110, -79, -266, -318, -202, -130, 107, 221, 277, 266, -27, -261, -368, -299, -19, 165, 368, 214, 167, -147, -182, -200, -222, 2, 91, 358, 234, 63, -78, -343, -335, -290, -28, 401, 310, 215, -47, -167, -216, -220, -128, -35, 109, 262, 254, 124, -101, -349, -357, -200, -5, 333, 341, 176, -18, -186, -221, -228, -131, 37, 207, 287, 290, 94, -113, -269, -328, -159, 120, 302, 328, 174, -66, -198, -201, -208, -56, 82, 163, 246, 237, 91, -185, -350, -355, -152, 92, 248, 268, 121, -68, -312, -270, -188, -49, 110, 161, 222, 253, 55, -171, -259, -317, -44, 141, 338, 326, 108, -114, -255, -205, -131, 7, 117, 224, 237, 178, 18, -157, -341, -274, -76, 170, 342, 307, 111, -176, -288, -270, -67, 28, 123, 199, 233, 107, 23, -171, -265, -238, -26, 217, 297, 264, 63, -202, -312, -181, -95, 35, 232, 218, 151, 80, -67, -185, -307, -165, 12, 256, 308, 252, 19, -184, -320, -292, -23, 79, 208, 222, 122, 0, -149, -218, -237, -197, 92, 260, 304, 157, -29, -222, -285, -213, -20, 154, 222, 219, 151, 50]
3994E0j60j26j6J53K04J33Q5q2k36k34j2L2K25J51P0Nj20j81r9r1K8R2K06K13
4018B90%j30k71j52n8J56J77J69N5p4r4n4j65o8K3J28K10J46j6j41k67j52qJ84
4042a12K21L7Q9k8j46j55q2l4N7J24J76J57l1j67k51j33L0J01K10J82o2m6j54
4065a7n7r3p6N2J93J06J98pj96k91j22J6K70J58O1O4j38j29j39o5K4J24J22P2
4089A30J49l1k21j68j72P2J59K20J83q8j50j13j19m5L2Q7J05J80jn6j57j63j63
4112c30L6J99K25J26k7j20j90q7k7N1R3J25N0J35q2k49j05r9P1J88K08J29q3j80
4136E7j76l4k3M4R8J51J03oj13j73j88o6J35J91J68O8o8j08k15o8J5O9J36J07
4160A04R9o2n7j39j45l4M9K27J73L6m6j48k00j00O7J15M0K02K3Kj33j67j17p8
$$ y = [50, -110, -236, -252, -99, 105, 238, 323, 241, 5, -229, -241, -209, 16, 167, 237, 242, 122, -59, -158, -249, -221, -129, 77, 290, 290, 160, -111, -263, -321, -165, 12, 181, 236, 162, 68, 14, -151, -219, -196, -68, 142, 288, 272, 131, -136, -288, -296, -112, 109, 146, 235, 207, 61, -94, -176, -210, -153, -29, 147, 304, 273, 106, -145, -278, -248, -147, 63, 245, 183, 137, -17, -74, -167, -243, -191, 2, 108, 306, 299, 103, -188, -310, -294, -24, 134, 195, 259, 121, -8, -147, -212, -188, -64, 58, 130, 279, 248, 27, -141, -313, -241, -82, 138, 321, 233, 83, -30, -149, -194, -162, -75, 30, 210, 209, 153, -4, -167, -330, -294, -95, 130, 256, 229, 109, -81, -168, -195, -144, -51, 74, 124, 259, 177, -72, -177, -276, -205, -17, 191, 320, 237, 57, -119, -153, -176, -132, -34, 117, 220, 214, 101, -72, -260, -326, -191, 0, 168, 236, 168, 60, -155, -223, -208, -139, -3, 104, 203, 141, 84, -55, -200, -234, -185, 42, 215, 251, 205, 57, -143, -243, -176, -61, -21, 181, 204, 206, 73, -94, -211, -289]
4184b89J84J79J37R8j98j37q3j34N9J08J26J13J0nj36j61j24J1J24K03J59P8k09
4207A13j82p2o1N6O4J64J06K3jk27q3j21j8K18J53J83o6j63j42j28j2K6J29J56
4231A15R9J5j24j54j17n8O8J00J83J29J2k35j31j32M8J26J08Q7M2J2j12q5j55
4254a59j19J24J11K17J15o2j64k46l7j0J70J34R1M0l4j07o5j61r9N7J64K27P1
4277B58Nk63j97n7L9J61J68P5Jp1r9j51m3n2Q7J62J56J55j65j71j28q8j0J99J67
4302A38J20j63nq5j52k1oJ06J00J71N9j31j37k36o2J32J87J45P2p8j15k1j45j15
4326b42M6J20J52J58k4p1j74j18j00J24J40J23Q1n0l0k01m9k4LR7J23J67J9j68
4350A02k10j16l5R8J68J84Rm0j57q7o9j1J0J31J66P0K2j32j97j28K4P6J97J05
$$ y = [-289, -105, 74, 211, 309, 111, -26, -109, -243, -184, -76, 50, 163, 173, 168, 32, -129, -253, -242, -118, 85, 244, 322, 113, -69, -141, -202, -146, -82, 82, 188, 211, 210, -17, -100, -221, -239, -21, 132, 315, 249, 86, -56, -184, -196, -170, -41, 115, 214, 229, 105, -49, -166, -224, -156, -56, 127, 256, 268, 33, -98, -230, -182, -56, 52, 139, 181, 193, 81, -4, -159, -278, -154, -43, 174, 289, 227, 63, -183, -220, -230, -60, 74, 165, 205, 171, 64, -1, -162, -261, -204, -40, 187, 258, 263, 0, -197, -254, -215, -54, 114, 189, 190, 119, 20, -131, -174, -226, -139, 23, 179, 334, 169, -2, -130, -218, -228, -29, 138, 258, 95, 90, 5, -147, -168, -174, -68, 32, 203, 262, 131, -6, -242, -304, -172, 15, 160, 232, 154, 39, 18, -127, -242, -196, -76, 76, 234, 210, 139, -35, -153, -253, -129, 11, 134, 215, 165, 135, -66, -115, -139, -136, -39, 84, 251, 270, 102, -108, -224, -259, -161, 7, 191, 200, 160, 3, -84, -153, -164, -154, -23, 143, 213, 235, 103, -94, -222, -198, -122, 75, 180]
4374A80K0p0j21j09o8j8L5K19J51K5n9j36k21o4QK27J15J28p7o5j27j39jK2O1
4399h4Q4J68M7n0j62j99k6K6J88P7J23j1p0j32j24j7m3J21J77J05L7j25j08q9
4423h7j40P6J18K14L9j9j16j27j02l2L6J20R7Q6P9q1j38j70j48J34J30K09M7m5
4447A80j75j42m7QJ05N5J42M3J6o4j58j29nOK06J54N7m8j73j59j11Q4Q2J03J45
4472A75L9lj67r0q8j03J06J55J99%r1j26j26r8RJ20J66N8N7p6p6j45j00m7J60
4497i2J85J23M1j31j28j17n8K1J31J12K0N0l3p5j36j32P2J15R9J52Qr0j63j46
4521a72ON3J21M6J16j4n7p8j19j18L6Q8J66J91o7p7k08j17N7J1J33J13K6M5o5
4546A16j12j42n5J0J66J10J60n1j57j39j11L8M6J72R5N5r7o1j08p6r9P1J82R5
$$ y = [180, 200, 130, 9, -100, -168, -186, -151, 68, 219, 244, 185, 49, -172, -236, -228, -1, 114, 242, 165, 100, -27, -166, -167, -145, -84, 0, 168, 215, 165, 3, -196, -222, -196, -8, 69, 192, 181, 111, -21, -145, -162, -205, -84, 93, 198, 235, 110, 2, -87, -227, -151, -33, 181, 220, 201, 85, -42, -144, -176, -140, -20, 77, 163, 242, 161, 23, -147, -295, -161, -31, 178, 225, 180, 5, -137, -184, -176, -71, -16, 126, 169, 185, 121, -37, -166, -171, -165, 41, 195, 252, 204, 31, -128, -239, -155, -73, 30, 175, 214, 211, 44, -46, -134, -237, -131, 24, 223, 223, 132, 6, -120, -218, -209, -89, 77, 135, 192, 116, 40, -105, -205, -252, -92, 93, 216, 257, 126, -2, -119, -177, -156, -25, 87, 107, 157, 124, 49, -87, -219, -147, -32, 67, 219, 227, 137, -26, -172, -166, -113, 8, 54, 170, 156, 99, 21, -98, -216, -180, -92, 74, 265, 198, 121, -87, -204, -147, -136, -3, 110, 136, 181, 116, 4, -138, -193, -183, -17, 93, 253, 202, 45, -94, -205, -167, -121, 51, 146, 201, 104, 43, -65, -141, -240, -169, 13, 108]
4570A08J19l5j90j06j15J0N4K20J03J1p6p4j35p3k5J21R0J52Q9n5j46j48r0J9
4594a72R1J81J01o0L4j60j07p6k2R9J10J35L7m5j20k04k1K5J59J22N5K4q2j65
4618f1p4q7M1O8J68J18L5p2j77j07q7Q7J75R5R8l8j69m9n1n1J1N8J58N3Q2j12
4644A12j82q8l0O4R7J63J6j5n8j25j16J5l5J56J18R7n4n5j58j86L5R5J32J72N8
4669B28j29o9j61o0P7K3J41P1N6K1j47j55p7mO8K02R9Pm7q8k00m1M5J05P0Q1J31
4696B47o9j44j79r4P5J08R8Q7O2j55j0j77l2k8J75N3J66k7J9j75r9j12J9K22P5
4721A05J28J3j14j43q4o8L5R9J28M3N6j03r9k14k7J03J12J14J05m2q8p7r9p1J11
4746g7P8R2M6L8q4j12j49k1O1Q0J73P4j9r8j83o1K3O0N9R7J14nn2j78r5m3Q4J51
$$ y = [108, 227, 192, 2, -104, -219, -209, -155, 65, 168, 179, 103, 29, -106, -179, -204, -83, 7, 159, 248, 193, 47, -101, -191, -172, -81, 100, 201, 141, 175, 15, -92, -168, -190, -91, 19, 154, 191, 146, 26, -178, -199, -174, -15, 107, 162, 186, 104, -61, -135, -222, -181, -113, 55, 173, 208, 136, -41, -148, -235, -148, 27, 122, 220, 182, 13, -36, -87, -138, -127, -69, 89, 142, 224, 112, -70, -158, -188, -124, -27, 136, 152, 137, 79, -46, -162, -147, -182, -26, 92, 189, 135, 80, -78, -264, -229, -134, -2, 170, 228, 99, 30, -131, -191, -114, -91, 50, 121, 177, 198, 51, -104, -181, -185, -117, 85, 184, 191, 144, 56, -144, -185, -140, -35, 35, 116, 247, 178, 34, -145, -239, -164, -56, 42, 129, 191, 36, 26, -151, -183, -211, -36, 17, 183, 156, 175, 0, -99, -211, -192, 30, 105, 233, 246, 132, -11, -95, -163, -128, -29, 99, 142, 198, 95, -4, -218, -245, -142, -30, 84, 189, 147, 59, -18, -117, -188, -77, 1, 93, 139, 177, 93, -19, -168, -189, -128, -48, 125, 199, 180, 82, -101, -162, -139, -79, -20, 77, 191, 186, 134, -44, -139, -182, -98, 53]
4774E3Q9OM9k04p0p5JP2J86m0K08Jk90n7q2J3o0K87P3O7j72m4j55l8K7J09P8P5
4802A07N1J5j30j90j2J9Q5J44J55l3o2j82j63k7J00R9J16jM9l1j13j05n0l9J42
4827e6J39J05K1j86r4p9m1M1J15J21P7m6k9r7o2j30O5O0J59J46m8p8j67r4L4K6
4853i8J96pJ19m5r4r3j49K1J6J08J61P3o3n0k10n4L1L7R7R7L3m0r3p7r8NO9P6
4881c2J93m0P0j65n3j47J6J12J17N0M2L6k06o1q7rM6J56J32K5o0j45j14n2LR4
4907g9P0J77n0l7m5p2q1o1Q9J31J06Nl6j64j9j56J02L8J49P4N8j45o1q3m6MR0
4934d2J14J08Mn3j94n6m2M2J37R0O9p6k9j16n2pm9Q8J16J12L7n7k45p4nN2J62
4961C4P5L4k9m6j43r5LM7R7J07R2j2m4j51j40k4Q0K05L6M6o9m8j17o7J5L0P9P8
$$ y = [53, 142, 148, 197, -7, -77, -152, -151, -79, 107, 67, 275, 276, -14, -71, -153, -140, -200, 87, 160, 227, 55, 11, -144, -182, -155, -46, 32, 107, 158, 173, 43, -147, -159, -140, -55, 89, 244, 211, 149, -33, -196, -223, -123, -24, 92, 91, 140, 109, -4, -109, -159, -198, -56, 83, 188, 209, 23, -71, -150, -191, -150, -35, 86, 163, 117, 88, -9, -71, -201, -136, -76, 83, 229, 181, 103, -64, -158, -124, -98, 98, 91, 210, 165, 71, -22, -171, -150, -134, -26, 135, 208, 145, 95, -115, -169, -138, -101, -4, 93, 126, 86, -7, -84, -182, -177, -108, -32, 161, 121, 191, 26, -27, -174, -158, -46, 71, 121, 163, 199, -7, -68, -155, -164, -118, 38, 170, 195, 135, -10, -124, -176, -173, -79, -9, 168, 118, 81, 36, -36, -117, -178, -89, 42, 148, 153, 117, -47, -66, -222, -120, -82, 67, 141, 199, 54, -7, -90, -136, -132, -42, 72, 180, 184, 131, -63, -119, -161, -119, 18, 108, 177, 101, 72, -44, -96, -103, -152, -64, 52, 164, 201, 144, -101, -175, -180, -128, 34, 109, 143, 114, 68, -75, -170, -167, -120, -23, 84, 176, 164, 120, -31, -171, -195, -115, 90, 126, 172, 103, 55, -62, -129, -114, -84, -5, 73]
4989G3J07rq7j90p2j8O4J64J05L6o7j18p9p3pJ03P5M8J34l5j11j04j16L0O2J37
5015E2J66m0j01q1p9n3N9P5R8LO7l7q7j57p7O2N2J83RL6o7j16r9m5O6J16Q5O6
5043A56l4m1j47l2q1K3J51Q9J20m9o3j75p6L7LJ10R0O2L6j26r5n2q2K4J96P5L3
5070A52m6o4n4j56kJ23N5O8P9k6n7r8j52j0M9J48J20M9j00q9o0n9j4Q0Q4N6QJ7
5098A01j03j03r2M1O4J51O5P1r7j08r5jL2O6J06K0L5p5q7p2r9M5R7R3J10K2j10
5125G7j32j04l5MJ42O4J37l6n6m4j47K%M8J81O3j2m9j26p9m3K8J84N3PL3j26m1
5153gq6m8N6L3J56Q3m4j01j07m6l4QJ49L6P4j2m5j12r7J1qJ26R3R9j1j64j07k4
5181a29k1N5R8Q6K1N9j31j03m3n3Q0M7J25Q5k7j66n3o0K8O4Q5M7j3J8q9p8o6l3
$$ y = [73, 180, 171, 84, -106, -178, -196, -132, 32, 137, 173, 106, -12, -91, -164, -171, -68, 7, 55, 189, 154, 43, -61, -177, -147, -85, 52, 218, 178, 77, -4, -83, -136, -77, -2, 96, 99, 166, 129, 42, -115, -192, -130, -78, 105, 114, 150, 83, -33, -132, -177, -111, 5, 90, 156, 122, 81, -66, -98, -179, -156, -5, 84, 204, 155, 92, -83, -159, -122, -119, -9, 81, 143, 179, 53, -42, -94, -176, -152, 44, 119, 152, 106, 42, -12, -168, -170, -47, 8, 76, 155, 129, 72, -26, -178, -188, -139, 9, 129, 178, 78, -11, -71, -130, -144, -64, 20, 76, 84, 101, -2, -105, -197, -156, -92, 59, 124, 195, 98, -10, -105, -106, -74, -8, 98, 118, 153, 78, -9, -81, -180, -135, -38, 55, 165, 187, 77, -55, -159, -194, -190, -48, 16, 153, 117, 61, 17, -130, -128, -128, -80, 101, 164, 152, 103, -23, -102, -145, -117, 67, 120, 127, 160, 34, -7, -93, -141, -85, -52, 104, 187, 143, 42, -65, -111, -145, -137, 12, 48, 122, 110, 65, -47, -144, -133, -141, -15, 78, 177, 166, 2, -105, -129, -150, -95, 3, 89, 110, 169, 38, -65, -108, -161, -81, -34, 91, 176, 149, -17, -70, -130, -102, -38, 47, 94, 81, 99, 10, -68, -134, -167]
5209a67J62R6K9L6n2j27j11%NR2R1R0n0l6j2j65K1j6J6J39R4K6m6j32m1r5N5J26
5237B8J01K4j5m4j22p0k5K0M7R5M1Q2j07n6j17n3L4J14J30Kj8m7j22L0n6J9M0
5264d5J39M1J0l5j52j20N4M9J03N4P5l9q3j07n9OL0N7P2J05n3m7j24p4m1P4J46
5291C6P2K4n1p8p7o7N5l8J73P6K6l0r3q2j20RJ36Q1Q0m9l5q4k8n4K0L3J39M6L
5320A23n5o7p9p8L8P5P6O3O7o6j21n8j5k0M5R3Q7j7n7j0j72j8N1J00J6J15M9q7
5348G8j14Jj22N8N3J00Q1m2jj42k2r8P7P8Q0O7l2j19n1q1K7J12kP0N9k1n3j10
5376f9p8j4M8J23R5M3p4k3j30l7K5M9M6Q5M2l1p7j2j46JK1R1R8R3p3o2n8j04J8
5405a10K4J43N6K1o8q4n0q1O0M2M8J37m2n5k4j21j6mR2N3K0P9j10N4j17p7PM9
$$ y = [-167, -5, 91, 120, 156, 104, -23, -134, -134, -129, -37, 54, 144, 94, 58, 46, -119, -98, -114, -98, 41, 135, 161, 115, -17, -58, -153, -98, 28, 129, 153, 138, 94, -28, -98, -123, -103, -56, 39, 80, 162, 55, -1, -118, -171, -137, -23, 107, 109, 91, 44, -78, -48, -104, -85, -45, 94, 135, 145, 110, -42, -162, -108, -59, 44, 98, 173, 134, 51, -56, -115, -109, -79, -22, 50, 155, 102, 55, -69, -143, -184, -110, 36, 108, 132, 81, 3, -74, -141, -86, -124, 49, 125, 151, 121, 28, -54, -174, -165, -29, 52, 132, 83, 48, -36, -64, -118, -98, -65, 74, 120, 123, 68, 1, -78, -156, -118, -43, 33, 96, 163, 97, -24, -82, -97, -117, -72, 21, 108, 91, 34, 24, -148, -166, -115, -15, 1, 116, 165, 78, -36, -35, -157, -99, -46, 54, 135, 93, 92, -50, -72, -170, -93, -15, 65, 132, 100, -19, -70, -151, -124, -12, -14, 56, 115, 94, 41, -69, -147, -161, -113, 10, 105, 148, 74, 51, -79, -116, -91, -42, 4, 89, 131, 100, 23, 11, -135, -134, -113, -22, 76, 169, 96, 34, -24, -128, -110, -86, 57, 113, 134, 66, -18, -68, -149, -89, -47, 1, 138, 96, 41, 17, -104, -120, -124, -32, 21, 41, 120, 10, 64, -53, -130, -123, -74]
5433g4J47K7J9l4j33k7n1NQ5R2N2M6n4j53o2lO9N1K8P1K9p2j26rk4K5M7J2J32
5462A15J1m5j37k8L2n4M6R6P9K1r2j12l8j6L2Q1K0N3K8l1q5p0m7M7J00P2N9n0
5490H7m4p9p2JJ2J35JJ32j35o9n8pjM5N3M3P6m0l9j44J6lrJ03J17q5O6r5q8L0
5520e1l2M9N7N3M3qn4j20l2q1K05L9L8l7L3r5j10kP7l6Q3R3NJ1j84j3m4L7K9Q8
5550D1N6J8o8r9m1n4J02O6MK9J8M3j41r2j3M7M8J10Jj6k5m2n6j2J4N3N4M6K5K1
5580A37j38r0o4J16MQ8O7K5j01q1j7n9OQ4J00K4kJ8j20j14j8R1K2P9O3m2l1r3
5608d6n0M1J0K3R2J7M4m6j52k7N7J0M4P5N6r9m2n9K6o6J8J25K7J1m4k4n6m7nK
5638h5R6N4K2J5r1r8n8M6N7P0Q6Kn6m4j20K7l4Q3P2N0L3p2l8q5l1O6j3Q4k5N6
$$ y = [-74, 73, 100, 119, 85, -48, -75, -126, -121, -36, 56, 108, 154, 100, -53, -115, -118, -49, 2, 30, 101, 130, 58, -68, -77, -101, -76, -29, -17, 115, 126, 81, -56, -84, -52, -106, -60, 36, 115, 136, 44, -68, -106, -122, -90, -9, 11, 64, 92, 61, -24, -94, -141, -94, 6, 78, 137, 87, 43, -36, -108, -107, -95, 40, 41, 173, 38, -31, -89, -96, -97, -52, 1, 44, 120, 80, 41, -103, -87, -90, -99, 4, 121, 36, 102, 7, -81, -51, -83, -34, 23, 76, 119, 111, 57, -63, -95, -176, 29, 68, 106, 69, 102, 7, -103, -105, -28, -64, 19, 112, 117, 128, -56, -69, -113, -76, -47, 41, 97, 115, 47, -52, -93, -147, -45, 21, 25, 54, 72, 115, -26, -118, -131, -84, -36, 74, 75, 59, 34, -8, -64, -76, -62, -9, 45, 91, 116, 137, -1, -91, -155, -39, -35, 53, 120, 145, 44, -37, -54, -113, -107, -23, 77, 101, 99, 117, -3, -117, -135, -44, -22, 57, 120, 78, 47, -46, -96, -55, -45, -22, 70, 87, 131, 85, -67, -94, -37, -27, 17, 92, 148, 49, 7, -52, -26, -92, -74, 51, 78, 89, 45, 21, -35, -82, -87, -85, 11, 65, 87, 102, 11, -87, -145, -99, -42, 28, 114, 116, 60, 16, -104, -77, -111, -28, 44, 94, 127, 55, 17, -68, -99, -33, -46, 38, 13, 69]
5668F9L3q1j30o5J02L6O8N9k9j1q0r0j0J5Q9Q8L2k0l4p3q7l0L7P0J20J1N0o5p4
5697@m7l7N0J00K4J8k7n5k1j00l4Q7OJ00J9j0k5j15j8n3O3Q3O7j6Jl2r4O1j00
5726a05N5J9J07Qmm5j11ln0J28M5N8Kk5Oj16m0j3R8m2J20M3o8r3k9j5pO7R7K5
5756A12K8q3p9m4n5J9J40mP8m4k9m7q4r0Q6R3J3L9K2lm4r3%oM8O1P8ln3k0j07
5787g1k5O6N2N5RJ6p6o0L7n5l8R2K8L2N1r1k0o3JJ2L8N1k2qK2p1o0j5L2Q8M0L9
5819H6j8oj28J0n2J08pJ23nj22N9o5p0QK4L3J03O5j20J8j02n5j2L0J00O6l6L1
5847F6q2j8p8L6P6QR5j9j6j10k3o1N9L4J03J5J9m4q4n8j6K8M3R7K1J9l2p1J0r0
5877g3M0L9M4P8J1j73Lm4k7N8M8N7J5M5o2n6j02l4N9K5R5O8q4j3o9k2l0K4O2N6
$$ y = [69, 102, 21, -109, -174, -72, -36, 32, 91, 62, 51, -29, -119, -129, -114, -25, 63, 95, 75, 41, -32, -119, -149, -112, -42, 78, 89, 139, 74, 0, -47, -84, -34, 66, 90, 108, 81, 26, 5, -95, -129, -42, -36, 64, 83, 73, 48, -67, -85, -138, -75, 8, 75, 59, 60, 28, -66, -5, -105, -50, -31, 76, 84, 80, 35, -76, -79, -129, -1, 44, 102, 104, 79, 85, -31, -71, -84, 14, -28, 92, 135, 67, -26, -55, -70, -77, -10, 87, 112, 140, 57, -22, -66, -121, -102, 38, 34, 112, 68, 39, -8, -92, -182, -96, -3, 10, 49, 71, 68, 24, -69, -69, -75, -27, 34, 112, 109, 56, 36, -71, -96, -30, 22, 77, 86, 102, 26, -34, 3, -52, -90, 2, 30, 62, 113, 22, 2, -61, -60, -48, -10, 41, 19, 11, 33, -38, -98, -113, -81, 7, 47, 86, 68, 62, -66, -56, -108, 0, -7, 116, 111, -11, 48, -17, -87, -79, -55, -22, 81, 146, 26, 44, -58, -113, -125, -95, 5, 71, 35, 66, -16, -34, -112, -76, 0, 8, 103, 84, 68, -42, -65, -126, -67, -33, 70, 85, 104, 60, -24, -82, -98, -70, -27, 70, 91, 110, 78, 7, 17, -73, -33, 6, 50, 128, 139, -34, -31, -75, -102, -44, 4, 61, 76, 121, 59, 3, -99, -133, -74, -49, 46, 114, 30, 17, -52, -74, -104, -80, -18, 38]
5907C8L7j3pm9m9k8lJ05L5K0Pm7l8o9q4Q6P3O4J9n2k2j4j07KL7P7K9j2N3p3p9
5938f4p0Q0kL3Q8n3J26j03q8n0M4J0R4M9pOq0o5k5ML9P6L3Om4k6n6l6oP6LL4L6
5971F2k3k6j17J0O7LK4L8oL0m0p4k2kO7M9l5P5o3m8m0k8L7N2%Q4k3Lj1p8j0j2
6003e7P7K2K7%n5r5kM3l1R3NM0Pm6o1l9nL7J2J01k3jm5m5n9O2j3R8J8L2q9k9n
6036b6j2k9M8J5J21L3j12m6l8n2L4M6P0P2l6kj05nq0N9N7K7M5Ll4o7p0j7K0qQ1
6067hJ04nk3n4n5k1RK9J02Ql4K0r3l0j0q5J93L7m3O4q3J2r0qM0rM3N6pj6j27m1
6099a25J8N6J9Q4J7n4k0n5ml7j4J10M7L5p5k3k0l5k2N2O6O3l1Pj7rm6n5M4N0k
6130B4M9Po6m7n9O5j4Q2MoK5m0l7m6J4L3pN5O6m8l3r3j0OJ10K8lK5r5%Lm5J4J9
$$ y = [38, 75, 62, 55, 6, -43, -71, -74, 31, 66, 86, 93, 46, 8, -61, -145, -59, 14, 78, 97, 45, 23, 9, -98, -96, -59, 18, 47, 35, 88, 15, -64, -134, -54, -56, -23, 65, 12, 138, 35, -53, -103, -59, -49, 45, 94, 87, 93, 13, -52, -77, -73, -34, 42, 75, 81, 37, 11, -45, -81, -87, -11, -8, 26, 62, 39, 13, -104, -94, -27, -24, 0, 38, 32, 62, 22, -52, -74, -76, -9, 40, 5, 80, 17, -31, -71, -99, -62, -10, -10, 74, 51, 54, 43, -35, -45, -57, 20, 42, 69, 69, 14, -81, -83, -40, -71, 22, 27, 67, 74, 28, -33, -72, -77, -40, -28, 73, 50, 49, 4, -41, -100, -38, -51, 47, 65, 97, 8, -21, -26, -38, -67, -19, -4, 117, 150, 38, -8, -46, -98, -64, -18, 52, 124, 88, 86, -19, -24, -104, -45, 12, 39, 84, 87, 53, -14, -84, -101, -81, -89, -8, 96, 91, 68, 14, -41, -62, -53, -24, 78, 86, 52, 72, -21, -51, -61, -146, 47, 84, 41, 105, 22, 34, -56, -64, -24, -33, 10, 66, 59, 43, -84, -125, -107, -51, -32, 52, 69, 15, -5, -60, -64, -101, -115, -5, 42, 77, 2, -21, -41, -76, -98, -46, 20, 83, 52, 59, 42, 33, -13, -68, -24, 26, 24, 73, 80, 14, -33, -92, -27, -41, 41, 45, 39, 64, 24, -13, -59, -45, -12, -19, 36, 102, 54, 21, -72, -82, -76, 34, 62, 59, 84, -11, -11, -8, -53, -39, -20]
6164b0P9J9k8k8p1j4j7M0jR9K8m2j5j9k1l9l1O6nN7N5q2M9j04k5l2N8K9K7L8k6
6195B4j10L5m2L4J08n4J04n8J4j07Nl4KJ11%lO2r5m8J1L2j8M8jL6mp5k4l4Pl6
6226a10J07J8P2j4o1k5l4j1j7J10lnRk4p1L4n3O2K5N4L3q5kn2l6J5Q2K7m8RO4
6257G0p8m2Ok4J03mJ7L1oq0r6K2lP1M3L1nL5j09or7N8L4L6M1J8m2m7l1m1O5qL3
6290eL4L8p7j6rk3j6J9J25K8j5j18nL2o6L8K5kP1J0j05L9o3j3J1N6J03Ro2j02
6320e9J7Rn1J6O4M1j5k1j4K1m2o4P8O1Lj8P1m1q8j9MO5J1Mk5P0n0l8m7K6mLJ28
6353I6o3Pj17M1j09Q2K8N6K3N%p1J2q7N3N5l1N5N4k5o6j9o2l5M8O1L9Pml9q0K0
6385f6K7N6MP9q8pJ1q2m0M1N3N5Pj0k9k3j4n1M0J1N9NMjq8l4oO8nR1j2%n6j5K3
$$ y = [-20, 59, 78, 50, 22, -49, -63, -80, -40, -41, 58, 86, 44, 29, 10, -11, -50, -81, -15, -20, 37, 92, 10, 59, -45, -70, -102, -44, -15, 12, 50, 24, -86, -51, -93, -59, 49, -5, 99, 41, 55, -52, -47, -81, -79, 32, 32, 29, 91, -4, -52, -41, -9, -27, 21, 20, 56, 52, -23, -47, -81, -74, -110, -3, 15, 87, 73, 12, -13, -47, -58, -75, 35, 32, 27, 36, 12, -59, -25, -78, -16, 9, 63, 96, 11, 9, -43, -79, -64, 18, 45, -3, 6, 70, -8, -50, -44, -68, 35, 31, 48, 79, 73, -7, -103, -81, -84, -13, 30, 61, 56, 91, -18, -24, -121, -63, -29, 7, 48, 66, 24, -23, -54, -95, -30, -38, -5, 29, 67, -10, -26, -35, -58, -74, -55, 70, 98, 83, -35, -40, -8, -74, -36, -11, -13, 58, 68, -37, 2, -61, -74, -63, -7, 96, 105, 43, -59, -42, -33, -84, -68, -4, 37, 22, 1, -13, 8, -34, -98, -20, 41, 44, 26, 97, 56, -32, -51, -47, 18, 29, 33, 8, 78, 28, -10, -57, -31, -35, -32, 96, 33, 40, -77, -36, -145, -63, -35, 21, 44, 49, 49, -22, -10, -97, -44, 11, -20, 35, 89, 64, -2, -21, -83, -118, -70, -9, 30, 37, 33, -6, -86, -66, -39, 17, 21, 100, 12, 5, 16, -66, -106, -65, -12, 43, 50, 40, 11, -12, -26, -77, -37, -26, 33, 38, 42, 41, -47, -81, -87, -19, -24, 67, 55, 55, -1, -16, 7]
6420Gm8J1Q9l2L2k5k5Oj07P0P1rL8l1k0m6n1Q2o5j8O7M1P8k0q2l3m0NK7J6M6O
6452D0l3k0m2j0J5K6N1L4M0j0q5j7q2N8M0K7J04l7m7l6l7m3J36m7k6P3n3J6m2
6481gj3p9M4Q1l4N8K1o4m0k4K8n5J30k9N9J3p2j8n6j4O2J2M3L3p5J2l1Qk9j4j8
6512f8J09O3o4n0l2l4K9L4K4LL6j7m3rl1l5Q4J6mJ9J4q2K7j8k1k9J01J4j0N2q9
6543a1l6J0QJ8J8Q0m4k4Pl8n5K3LM1K0J9m3m6OO1k0n2O8O2n4oj7m0l7N2K3M0J7
6576E3nl5Jn9J9mJ5K9P4n6nj0o8m2N7L1N6J7l9o3L1K7j08Q2qQ0l9L3l4n1q5N9
6608d7lM9Q9q0mk6J2k9jJ3J3k9P4M8j09L5n3k3Q1qM0O5j28L6j1o2m2J20K6kj9
6639B5n1N3m9k6QNN5P%o8L9p0K1M5K4j9Rj4L3p7J2J0oj4O3j5J7j9l0N7q4N3k8
$$ y = [7, -41, -30, 59, 27, 59, 34, 9, 15, -92, -22, 49, 40, 78, 47, 27, -19, -70, 12, -53, -71, -4, 37, 115, 95, 13, -20, -60, -55, -28, -12, 34, 40, 7, -13, -55, -65, -50, -24, 27, 61, 101, 91, 6, -11, -93, -35, 5, 32, 136, 99, 52, 16, -21, -64, 72, 25, -1, 72, 19, 35, -7, -20, -99, -55, 26, -8, 50, 71, 7, -33, -57, -29, -84, 46, 17, 76, 89, 17, -1, -57, -71, -9, 3, 46, 79, 4, 16, -15, -7, -36, -50, -68, 41, 104, 40, -10, -42, -76, -47, -13, 11, 14, 50, 33, -10, -19, -50, -85, -1, 15, 11, 30, 44, -38, -11, -29, -50, -79, 22, 36, 26, 78, -11, -47, -37, -29, -11, 7, 87, 43, 19, 26, -12, -67, -44, -41, 0, 20, 39, -4, -50, -44, 17, -3, -55, 13, 75, 21, 15, -2, -42, -79, -27, -4, 36, 53, 48, 13, 14, -45, -26, -30, -15, 14, 88, 32, 27, 17, -51, -93, -36, -5, 51, 68, 29, -34, -3, 24, -84, -2, -10, 70, 31, 64, 30, -21, -106, -47, -50, -1, 88, 8, 4, -22, -10, -39, -40, -27, -14, -43, 31, 79, -30, 5, -48, -71, 10, 2, 42, 107, -21, 15, 4, -58, -100, 20, 46, 44, 25, -26, 27, -22, -48, -40, -35, 20, 27, 27, -41, -2, -72, -51, -6, 18, -1, 8, -6, 27, -50, -38, -28, -34, -48, 15, 0, 17, -2, -32, 25, -59, -6, -34]
6672c4N1N2l7Om3m2K7m3J24%k8Rl8%m9L4k4L3k0Q7jLq9j9j2J5lJ01k6L9r6J7p6
6705h2lP9RP5j3l8m3rN1l1J8J1K7Nl0J4o0Lk9L2K7k7M8m0j1j9j2K7l6L0P6m5k6
6738b2L5o2jL4o8P9K2K0L2j15m6N8l3R6mlM9m9l3p5J25p0N7j3j0N1n8k2J7l3K1
6769b1NK7N7j6o4K6l5k8M5J1L1j2Nq9%pL3kM8kJ1L3n3lRo1M1J1N8om1L0m7kk5
6804c3L7nL3J08o8q6ll6N8J6Kl4K2Nn0j6KL9o2P0kJ8Lk6j6l5L2mJ7K2M9m9l4J8
6838hk9k1O7M1L1n0n0j6K2m2P9kJ9l6j7L3j1Lj8O0q3L8PL3k2p6J4rK3M2J1K8j16
6871e5M7l4J6M8rLM5ql6Lj6l6PP1q3J2Q3k1ln4l8j6J25Mqj7j3q1J04r3rQ6L2n8
6905bpN5m0j21M3P7m3N3Q7q3o1L7k6prLM2L2O5p4o9m2N0K2K0qJ01k8o0J0k5Qn2
$$ y = [-34, 17, 69, 32, 38, -5, -47, -20, -63, 61, 61, 33, 42, 4, 4, -45, -11, -35, -2, -22, 65, 64, 67, -22, -41, -53, -38, -41, 60, 34, 73, -23, -6, -82, -85, -6, 3, 78, 65, 27, -16, -25, 26, -5, 13, 24, 51, 56, 26, 40, -20, -17, -46, -14, 13, -14, 34, -6, -17, -36, -48, -21, -57, -27, 49, 4, -22, 13, -49, -50, -16, -84, -5, 17, 37, 69, -46, -92, -34, -67, 29, 25, 22, 71, 22, -11, -86, 39, -31, 26, 13, 3, 54, -4, -26, -9, -42, -21, -16, 11, 68, 52, -12, 14, -21, -49, -4, 7, 38, 26, 31, -58, -58, -65, -32, -34, 14, 12, 23, 56, 3, 0, 9, -52, -11, 0, 58, 52, 11, 41, -6, -8, -33, 4, -1, 32, 140, 72, -14, -17, -53, 5, 21, 23, -11, 11, 16, -34, -50, -48, -9, -71, -1, -3, 15, 18, -8, -24, -59, -27, -31, -14, 8, 57, 8, -26, -8, -37, -58, 9, 50, 81, 31, -19, -35, -13, -55, 24, 22, 41, 5, -12, 21, 10, 13, -5, 55, -28, 10, 17, 50, 28, -48, -34, -43, -20, 22, 33, 61, -55, -8, -42, -26, 22, 13, 16, 61, 53, 17, 20, 4, -32, -25, 46, -37, -25, 58, 37, 34, -20, -58, -74, 51, 55, 47, 30, 17, -64, 40, -53, -62, 24, 56, -2, -9, 46, 6, -115, -72, 5, -38, 15, 102, 19, -42, -5, -31, -38, -47, -44, -2, 30, 95, 21, -48, -90, -40, -18, 2, -6, 95, 67, 7, 17, -8, 0, -52]
6938e2N5L1J6k4j5o2K7j4nQ6n3Lmj8J3%l9M3K6K6Qn3%n8O1Rk6K5lM6l1J9l7p0
6972g0L3J3M5k1L2L6n7Kj5K0j6J1PJ8J5j09J0O0k0l0QL4J0L9p0l4qJ6L4JJ0LO
7005A3m9L8k8J7m0L8P1m7L9n4l0PK0K2L1m4pJ6l9L6n8N5k8L1oj7L5pj5K8r3O3
7037bj3O1K3m1p1J5QL6nll0RJ0K8Jj0mN5m3lK7o8J5k0O3p5M4JO2kn1k5L1l0N5
7072D8N3r3M0q0K4pL9o4P1L0k3Mp7L1n4M2ok2L8M1m6K7Jl3J0KL7J4k4K0n2kn4
7105f5K1N5j0L7j1J9l9m8N0k8NM2kk1N8p2k0K1K5m5k0M6K0K2j4p8o1J11l9K7K7
7136A3k2mJ0k8K4m3L5L7K0j2Q5r1Prl6j8P1Qko0K0j6olPK2O3n2j5p4mO1j5J23
7170I6m8k0j0nl3LjJ6m8M9N1n8K4p0P3j8nPpJ2J5Jp8P0l8M3j4oN4l4m8J2mm1J06
$$ y = [-52, 3, 34, 50, 26, 11, -51, -24, -38, -43, 43, -10, -7, -11, -29, -16, -16, -55, -12, 14, 40, 48, -5, -5, -63, -2, 7, -19, 6, 3, 49, 18, 37, 0, -70, -37, -24, 21, 0, 32, 68, 11, 13, -2, 18, 2, 13, 20, 38, 53, -56, -46, 14, -6, -36, -28, 6, 16, 55, -15, -49, -57, -41, -7, -6, 4, 7, 13, -36, 2, -26, -9, -49, -11, 60, 13, 52, -2, -32, -25, -5, 17, 48, 4, -3, 13, -26, 10, -48, 7, -21, 10, 4, -13, 22, 15, 0, 28, -65, -2, -15, 46, 69, 28, -43, -28, -20, 16, 11, 8, -22, -13, -3, 25, 26, 16, 12, 67, 24, 21, 48, -20, -5, -25, 38, -37, 7, 8, 70, 68, 17, -8, 23, -7, 48, 101, 8, 48, -32, -8, -15, 24, -40, 31, 61, 38, 42, -35, -4, -58, -16, -22, -44, -6, 35, -11, 16, 17, -16, -6, -4, 33, 47, 23, 43, -9, -11, -65, -44, 11, 1, 38, 27, 46, 7, -41, 9, -19, -14, 28, 26, 5, 63, -9, -29, -8, 17, -28, -48, -2, 18, 40, 26, -52, -113, -2, -41, -14, 13, -9, -13, -3, -31, -7, -50, -15, 22, 42, 30, 115, 24, 31, 22, -14, -32, 39, 47, 45, -15, 5, -11, -17, -20, -13, 9, 72, 20, 5, -69, -73, -12, -27, 96, 48, 28, 18, 13, -20, -17, -18, -2, -50, -1, 50, -8, 16, -54, 19, 1, -4, 3, -4, 8, 23, 24, -54, 16, -22, 21, 7, 1, 55, 21, -27, -15, -19, -60, 46]
7205D6n5J9k5k4L8nl7L3PJ1K5Mn7Mk2O2j5k5N0m7N0M4j39O8j1j4M3k4J2O3r5M0
7237B4n0l7J23p0MPnk7K7k3k8P5l7j0N6o0k6jO2k4nK9Ln5L1K7o4K0rP1n9J3J10
7270I2r4N9j7k7k9K5k9L7l2P7m7oj8n1K1L0P3o8M7o9M8j25P4Mj0K2kL0np7M0K3
7302dL9q3P0l2L8n1j6K9J8j1lL1m4M4j8J2n6M0J7l7LR6o2or3P5k3P5k4l8O0o4
7334a8qL7n1J8O3l5j4rN9n5k8K2n2Q5K1J4m0%j4MP7m6m8M2Rl4RJj3kL2J5j7Ln9
7369c2L0k2L6n7K1K3J9n0L4k4L9n8KK4L2k5NP9p8mLm4Q0k8j3J2k2k8N5n6M8pL2
7402B6K6%r0M6j8ML5j3j4JM5p2K0L2o0J2M9m6P3p4Q2j11O2k9j5j1L8J9j8l5O6
7433C0q9J3N5k3RK8J1o3K4NRK3kMK9l4k6k0j9K8qL0J1mo3J7Oj3O5m0k3J8j7NP
$$ y = [46, -9, 10, -15, -39, -1, -6, -43, -10, -3, 8, 33, 37, -20, -16, -38, 24, 9, -16, 34, -13, 37, 81, -58, 10, -1, -15, 28, 4, 16, 79, -16, 24, -26, -63, 60, -10, -6, 1, -4, -31, -4, -27, -55, 20, -17, -27, 29, -31, -57, -58, 4, -20, -25, 4, 7, -48, -17, 10, -54, -34, -43, 28, -31, -18, 92, -2, 57, 40, 13, -16, 9, -20, 17, -15, 62, 15, 9, -9, -60, -39, -9, 64, -4, 43, -26, 22, -103, -29, -25, -35, -13, -15, 15, 10, -67, -27, -4, 35, -48, 22, -10, 28, -23, -39, -10, 8, -3, -6, 25, -19, 25, 7, 19, -37, 3, 20, -17, -14, 82, 20, 14, -79, -4, -27, 48, 24, -14, 46, -18, -26, 11, -40, -22, 41, 6, -8, -17, 42, -13, -41, -19, -71, 14, 35, 49, 9, 9, -5, -1, 76, 30, -18, 24, 33, -1, 8, 9, -4, -6, 26, 41, 24, 27, -32, -2, -24, 12, -45, -24, -1, 18, -32, 2, -22, 17, -41, -39, -15, 17, -8, -3, 76, -2, -6, -3, -47, 33, 5, -8, 4, -18, -46, 9, -47, 1, -6, 26, 52, 52, -38, 8, -10, -6, 29, 16, 2, 3, 48, -24, -4, 28, -32, -20, 29, -17, 56, -18, 64, -47, 15, -14, -29, -40, -2, 17, -1, -36, 30, -59, -46, 9, -14, -5, 23, 34, -29, -5, 0, 9, 32, 30, 34, 63, 29, 3, -17, -36, -8, -16, 14, 25, 21, -42, -25, -19, -32, 33, -7, -30, -12, -29, -24, -17]
7468a7j8PM4K8q2L7O6m8l2J0k3M3k9m5O9nN3q6P1n9J2L1o3M2qk0J2p0M3M6j2N1
7500D8%m4n2k3P8m8L2L6k5M8l9N9j14J2L6l0J0J7JJ4L3m2Lrj1PJ2qJ7k0Orl6J9
7534b2K2J9jk9L1Rl2J5k7J9jj1Omm0kK8rK5m4O0k2nj3jL4J4n6O2Ml7M5jk1p2K7
7570c0K9K6Rj1JQn8J3j4L0N6o5Lk5M7m5P6p0LO2n6l8Q7n6K0Ro1K5mM6rn5M2nO
7605dk0L1pM3K2n4j2j2LMM4%j0k8m2j1N3j7oM9J4m3qmJ3l9L1k4L4mK7l4nJ9k8
7640b5oM3l8M3m1J4J6MK0o3L0l1N2k9k1qj2P1l7K7K4l7M6k2j2l9L0N0m5J3k7k7
7672c7L7J0l4k4JNM7MPPj4o2N7K7j0j8Kln1NP0j9j9M0K3l2k5j0J0M1j3m2O2k9
7706A3Qj2j0K4m3L6o1M8J1k7L0m5J6o0N3m0P1L2K2j26K5O6o3J8PLj4mK4J%k4j4
$$ y = [-17, -35, -28, 16, 44, -38, -1, 65, 17, -15, -5, -28, 15, -14, -59, 10, 5, 58, -28, 43, -16, -4, 27, -36, 6, -2, -22, -10, -80, -37, 9, -3, 48, 48, 4, -48, -71, 7, -41, -9, 27, 2, 50, 11, 70, -44, -32, 4, -26, -16, 1, 2, 16, 49, 7, 10, 1, -10, -3, 9, 1, 18, -2, 4, -5, -41, -22, 0, 19, 18, -11, 20, 29, -3, 12, -15, 4, 3, -8, -2, -6, -46, -48, -20, -29, -4, -48, 12, -10, -15, -28, -29, 5, 19, -37, 25, 29, -8, 37, 36, 15, -57, -30, -1, 25, 34, 23, 24, 32, -26, -13, -27, 3, 59, -6, -3, -28, 19, -26, 50, -20, -17, 45, -11, -49, 38, -18, 2, 11, -50, -25, -29, 17, 8, -47, -5, -10, -4, -24, 7, 0, 43, 65, 11, -1, -13, -10, -6, 38, 38, 28, 0, -42, -53, 0, -17, -23, 26, 40, -3, -11, -15, -2, -41, -10, -34, 0, -4, 23, -11, -16, 3, -25, -31, 12, -26, 17, -24, -10, 6, 10, 30, -33, -3, -34, 18, -11, -32, -40, -52, 19, -18, 9, 33, -4, 42, 20, 8, -31, -1, 49, 4, 17, -10, -37, 0, 10, -24, -48, -47, -42, 5, 9, 16, 23, 9, -53, 4, 31, 21, 3, 5, 2, -49, -44, 26, 7, -12, 28, 51, 19, -6, -16, -6, 35, 22, -20, 42, 13, 21, 9, -1, 23, -20, 16, -45, 3, 14, -13, 17, -28, -12, -72, -19, -59, 12, 44, 66, -60, -35, 31, -32, -14, -7, -4, -18, -22, 2, 3, 3, -21, -35]
7739c5M5j5M2m9O1o5j%L1k2L9Jk8jPm9L4o8N6NO4j18K8O6q2M0N0m0pJ5l8L8m8
7772d4L2j4PN5l8K5j5q8Q5j6L1l4L8L0n3PL5j6m0K1oK3n6K3Om5O2l6M8l3l0K9
7804gl8j1pL0J4L8j9JK6r3M7J8OL9pn1L8N5j09K4N5p2m9O9L9m6N2k4lk2JN3p1
7837b4M8m1j2K7jJ1m0K6K7m9L2LJ4k6J4k1L6j4k6M4l9Pkk0K8k3N3k1m8J0Q8o6
7869eRj1L6k7J4kk5j0j4L4j9N3Km0J4L2o5K2L6p9J9J3P7q1k5N6mQk2mj6J7K0j2
7903An4L1K7lK0K%l0k0L4Ml3MK1K4qJ0k1QMp7M6N4j0o2JOJl2N3oM2p0K4ojj9Q
7941b7M5n5O3j9jlm1L0Rk0J5k9O6L9q7O8om5L9l6l3K7j3j8M1p0N5PK8m9O5l4J
7974A2l3PK7n2L7K2m3J1L5n1K7k5M7L1n5oJPJ03j08rN1o5Q9p3J6Qm4K1Q9mnm4
$$ y = [-35, 10, -5, 37, -12, 49, -16, -17, -17, 14, -8, 31, 32, 4, 3, 10, -39, -5, -73, -17, -12, 52, -66, -38, 28, -54, -14, 36, -4, -11, 4, -34, 4, -44, -12, -26, -19, 36, -2, 23, 8, -80, 5, -11, 20, -14, 24, 54, 1, 8, 43, 27, -13, 8, 2, 25, -31, -8, -2, -47, 15, -21, 27, -6, -36, -7, -45, -56, -63, -33, -19, 19, 0, 1, 27, -66, -19, -1, 5, 44, 37, -14, 24, 79, -30, -6, 49, -23, -72, -3, 36, -10, 42, 18, 15, -7, -6, 47, -24, 24, -17, -29, -2, -3, 8, -32, -6, 21, -28, 4, 7, 21, -5, 9, -12, 24, 10, -16, 28, -11, -4, -6, -26, 2, -21, 32, 11, -37, -27, 61, -5, 4, -7, 29, 2, 16, 14, -11, -21, -35, -1, -20, 33, 35, -5, 9, 41, -24, -2, 34, -45, -26, -13, 64, -17, -42, 14, 10, 18, -4, -8, -24, -7, 13, 1, -53, -22, 5, 2, 22, 24, 24, -6, -26, 8, 12, -21, -17, 4, 28, 20, 30, 9, 17, 21, -56, -10, 44, 34, -28, -27, -21, -20, -52, 1, -5, 37, -33, -9, -15, -16, -35, -27, 18, -37, 26, 7, 6, 3, -38, -8, 1, -19, -4, -33, 33, 72, -15, 53, 47, 2, 41, 5, -28, -1, -14, -32, 9, -61, -6, 1, 29, -20, 45, 11, 12, -21, -14, 13, -39, -2, 20, -23, -12, 23, -28, -1, -26, 21, 52, -3, -9, -8, -1, 102, -6, -15, 36, -29, 60, -13, 3, 11, -33, -12, 77, 73, 68, 24]
8007B4rj2jk3J4J2M2m0o7N9l7N1m6j1N1pLj8Q4o6j7j7l7Q5k3qM1k5L4m2P4k7q8
8040d7R9m4K9nk0MLj0J7n8O6l8k0P5m8n1P8m5pPK4k1M7o7NK0M9j1m2Oj3J3K0j9
8074dQk1K6MN0nj0p7L8j1j0J9M2j1L0q5M0l4J7J0nL1j17O0O0j14L4RnO0k8k9K2
8107fj9N5k0k1Oj5j4N4l1nl3L8N7n3P4rq5N6Rl3j0j9L5m2O7l7L1m7%jMKL2m6M4
8142A8k0m5P3j3k8J7k2j5L8l2K6k3N9l6J6K1j6j1l2M2l3j8L3K7qj5k1K3j4opJ1
8174a1O8n7NlJ1k1j5J1j6O0k0j7MJ0rn9Q4
$$ y = [24, 15, 3, 2, -21, -7, 5, 47, 7, -60, -1, -38, 13, -33, -44, 7, 0, 3, -15, 69, 3, -14, -31, -68, 17, -6, -14, 27, 2, 36, -6, 68, 41, -47, 52, 8, 37, 32, 12, 16, 19, 9, 26, -32, 34, -4, -24, 51, 3, -48, 30, -15, -22, -15, 9, -12, 35, -32, -27, -7, 42, 31, -11, -5, -18, -5, 15, -4, 4, -17, 9, 13, 63, 58, 48, -29, 9, -2, -12, 7, 49, 38, 68, -17, 23, -11, 6, 16, 11, 42, -75, -15, 45, -69, -35, -26, -31, 29, 1, -28, -6, -25, 30, 10, -11, -5, -20, -34, 20, -11, -16, -49, -11, 46, -7, 67, 58, -27, 29, 38, 5, -5, -24, 11, -31, 36, -1, 30, -17, -17, -18, -14, -12, 20, -26, 18, -2, -47, 26, 13, -15, 2, -20, -35, 3, -29, -3, -26, 33, -3, 13, 34, 18, 7, -25, 17, -16, -34, -1, 26, 18, 3, -18, 5, -9, -15, -22, -11, 57, 0, 5, 2, 13, -8, -23, -12, -28, 32, 12, -5, -1, 9, 0, -59, 25]
8191B5
$$ Imaginary data points
##PAGE= N=2
##DATA TABLE= (X++(I..I)), XYDATA
0@%%%%%%%%%%%%%%%%qJ6j6J6j6J9k7L2l4M2m9N7o5P3q8J01j12J26j43J63j84K05
38A08k29K57k87L18l53L91m32M78n27N82o42P07p79Q59r47J044j152J274j414
57g44J574j760J975k233K549k940L445m127N103o624R342j5723N9939L9158r3712
72d778o0185k0121M6685M9167K7544j2714j4239j521J3537n348l2298m4168r634
85f8073M0479P1713M5485j5018o8067o7426k0991L5606N5163L4284l553k1172
97A8430j4441L78j844j7215k6426p429K9617N3612L8078r776n4488n9789k2539
110g3832K6356N1585L7602M195k0490k2057j0475m046q557j1038R47K3485L7712
123C1387K5647r636m2622m7194j9711J9781M2268L5669R628j4614k3103j8394
$$ y = [0, 0, 0, 0, 0, 0, 0, 0, 0, 0, 0, 0, 0, 0, 0, 0, 0, -8, 8, -8, 8, -8, 11, -16, 16, -18, 24, -25, 32, -33, 40, -48, 53, -59, 67, -76, 87, -97, 108, -121, 136, -151, 167, -186, 205, -227, 251, -276, 306, -336, 371, -408, 451, -496, 548, -604, 670, -744, 830, -930, 1045, -1188, 1361, -1579, 1866, -2261, 2842, -3782, 5560, -10163, 49776, 88934, -4778, -64963, -85084, -38399, 10768, 38312, 25598, 11359, 9838, 23375, 18027, -14271, -58439, -68073, -27594, 44119, 89604, 74586, 6519, -60907, -81898, -46292, 8871, 43155, 39602, 18430, 3989, 4367, 2523, -14692, -41118, -48547, -18930, 34682, 72760, 62984, 8496, -51293, -73832, -47476, 4109, 41711, 45906, 25416, 3359, -7116, -11162, -19719, -30757, -29810, -6325, 31387, 57034, 47398, 4776, -42418, -62129, -42348, -80, 35589, 45217, 30603, 7500, -10894]
135a0894j0843n727J17J0945K3708K6399J1783j4495l4811l3916j1278J7100L2581
148F69K7950R758q651j8653j9955j6175q023M511J9228K7371K1340Q47k2431l2853
162a5067k3217m18J9666K5746J7694M654n769j2023j6106j7664j2098L638K2785
175h179L2012K1091n424k9948l5219j6934R518K6024K2924Q811l902p207o618
188F949r030j4579j4093n33K1382L4069K3441o588l4498l9028j5685J6175L3197
201A179K4778K731j2967j2649m370r42p584j3261n112J5776L2665K6057l753l5239
215G309m2074j7833J8667L9010K9012P50k0221k0096n348M707Q31q558p189R168
229a1865K6599K5461n7l1018m1369k0323J6632M0380L2863L070k3156k6501j0361
$$ y = [-10894, -21737, -27464, -27347, -16402, 7306, 33705, 45488, 30993, -3818, -37734, -49012, -31912, 669, 28619, 38377, 29726, 11073, -8882, -25057, -33080, -28569, -9341, 18030, 39370, 40217, 17786, -15067, -38284, -38702, -19036, 6710, 24404, 29058, 23289, 11266, -4840, -22504, -34602, -30964, -8179, 23833, 44924, 39500, 9552, -25667, -42601, -33083, -7059, 15865, 24676, 20774, 13567, 6949, -2081, -16660, -30753, -31286, -9904, 24165, 47606, 41018, 6520, -32508, -48193, -32018, 1179, 25957, 28688, 15721, 3072, -1298, -2240, -9824, -23085, -28197, -12421, 20244, 46301, 42548, 7309, -34765, -52598, -33931, 5079, 34091, 34841, 14620, -5476, -10824, -6117, -5286, -13844, -21033, -11865, 14734, 40195, 40138, 9120, -32249, -52572, -35940, 4440, 37303, 40373, 17217, -9284, -19645]
242a9645O579Q564q61o014L096J8422K1551L104k4614l7622k1639J2864L8515
255B300L4857O324k2982l0773j5362N629J3768O628k271n04J0275J5212L553j8381
269H273l0729j9815R093L3354L3342R029j9708l0917j9384K145J4900J2662L427
282E672j75L756P099N07j3760k2494j4673P484K7112K8265R152j5790k7759k0045
296b5649j386J3206J5036Q489K262P53K54m426j2328j5655p785Q884K2352K1511
310B5518O019j3436k3046j7523k770J0046J4458J1139N507O96m172r671j3627
323a0862j1129n12J2680J9690J4542M05j3427j8116j2383j542P400J1006J0807
336H559P983K722n434j3608j6416r531M786J7702J9824R515o125j6226j5111o348
$$ y = [-19645, -13066, -4502, -5363, -11377, -8281, 10141, 31692, 34796, 10182, -27440, -49079, -36215, 2300, 37157, 43481, 20499, -10274, -25636, -20007, -6239, 389, -1882, -2386, 7889, 23101, 26654, 8273, -22456, -42271, -33178, 176, 33518, 42547, 22839, -8078, -27462, -25317, -10417, 2245, 5672, 5497, 9253, 16352, 16859, 3099, -19395, -34068, -26584, 528, 28793, 37945, 22155, -5604, -25649, -27035, -13829, 1207, 9696, 11958, 12711, 12965, 8539, -3789, -19444, -27229, -18345, 4007, 25518, 31537, 18101, -4945, -22468, -25238, -15192, -734, 10405, 15912, 16608, 12436, 2765, -10862, -21991, -22503, -9823, 9867, 24409, 24814, 11387, -6729, -19112, -20654, -13254, -2248, 8559, 16542, 19264, 13830, 222, -16194, -25725, -20939, -3237, 16587, 26102, 19977, 3751, -11360, -17708]
350a7708K603O788P032P218P862N161l643j4461j9123j0703P219K2025K2138P142
364B9550j1744k0639j4612j283Q284Q480M031K378N109O178n06j2732j9692j2590
378b9788O758K3821K4603P503j4763k4813j6602J301J3615J2539L527k337j5M660
392A0009K342q363j7737j3922M033K2919K6262R476j5205k7904j9568J661J7704
405h293J7321M988n790n640J245L638l646j3531j3467J148J9741K5487J1182j3214
419B1169k8226k1928j08J8967K1164Q093o478j0229l758K397k1p969j0150m46
433a7523J4996K1936J1366j0419k5716k2209k230J7763K2703J1083n078j2648
445D024q247m67J562k801n698p4J0953J6899R524q116k1976k0185l424J5371K1797
$$ y = [-17708, -15105, -8317, -1285, 5933, 13795, 18956, 15313, 852, -18271, -28974, -21755, 270, 22408, 29550, 17806, -2833, -17445, -18728, -10444, -1964, 2067, 4445, 9554, 15732, 15226, 2494, -17198, -29788, -23030, 791, 25394, 32897, 18134, -6679, -23281, -21980, -8365, 4174, 7701, 5364, 5349, 10009, 12351, 3988, -13749, -27671, -23638, -719, 25543, 35019, 19814, -8090, -27658, -25997, -8293, 9028, 14016, 8226, 2586, 3831, 7469, 3823, -9708, -23175, -22027, -2286, 23201, 34383, 21169, -7057, -28985, -29093, -10126, 11038, 19131, 12653, 2424, -1334, 1063, 1042, -6927, -17077, -17523, -2527, 19409, 30775, 20356, -5360, -27569, -29799, -12036, 10667, 21750, 16672, 4024, -4223, -4690, -3128, -5929, -11627, -11701, -748, 16151, 25675, 17559, -4417, -24602, -28026, -12655, 9142]
460I142J2808k958j2636j1257l934J176P52p08K063Q417J1537N535p350j7578
474d991j6108k858J2577J8763J2269p08j0731j1831o755r30J941L326N500Q003
488G467P262Q22q866j4468j1069j12J1296J5020R610o36q396j0195p276k961J143
503a1359N068Q425R299N168l473j1620j3414o706M100J1888J1851N487k333o743
517E638p333n944l982n59M809J0092J1102M808o195j4539j3798l943Q198J3979
531B333J0379J428n710o996m476k710k893k038K718R473J2300O205o590j6689
545c266j5675l311J1433J7193J0590j789r730q784k690J154j03k400N2P174J2013
560A1861P655n320j7023j7112l952J2552J9505J2118k801j3207j1609k668M302
$$ y = [9142, 21950, 18992, 6356, -4901, -8835, -7659, -6907, -7615, -5552, 2865, 14402, 19937, 12587, -4991, -21099, -23957, -11380, 7383, 19652, 18944, 8213, -3618, -10373, -11303, -9362, -6036, -536, 7467, 14729, 15551, 6685, -7783, -18852, -18964, -7668, 7352, 16962, 16326, 7930, -2265, -9541, -12502, -11359, -6291, 2134, 11433, 16601, 13128, 1508, -11906, -18612, -14512, -2624, 9227, 14714, 12381, 5638, -1695, -7639, -11621, -12180, -7371, 2721, 13823, 18631, 12436, -2103, -15901, -19844, -11646, 2333, 12712, 14140, 8430, 1434, -3042, -5752, -8645, -10683, -7965, 1508, 13808, 20013, 13423, -3266, -18941, -22252, -10819, 6374, 16964, 15175, 5445, -3339, -6029, -4875, -4978, -7378, -7326, -152, 11861, 19516, 14196, -2827, -19939, -23891, -11339, 8166, 20284, 17483, 4276, -7333, -10001, -5699]
573e699L319o76j582L887R224Q271l207j4905j7290n299J2001J9934J3926k425
587A9479j4788j4509m120N546P863J858k126N15O141O841r24j2379j5622o172
601b2397R808J9698J4771j078j5089j6463n922N907R821N415r63j704K284M335
615H423j95q770j2580n937P636J7116J4169L50j3203j6563p872M399J0679P990
629E642J414k234j031R78r42o069q659l961O344J3905J1759O88j1213j4850q272
644a6501K967R973R069L392j505k679j978k694m899n238r98O343J1020Q582m92
659A4362r555j2277o964K007Q311Q565M639k6k899m087m868m982k691K205P493
674g67R170N077k754r032r490m525K502O675O790M103J066j740m336o526o058
$$ y = [-5699, -2380, -3056, -4638, -751, 8473, 16744, 13537, -1368, -18658, -23957, -11956, 7978, 21904, 19479, 4691, -9818, -13938, -8392, -529, 1329, -797, -282, 5859, 12700, 11776, -603, -16225, -22397, -12589, 7109, 21880, 20802, 5713, -10750, -16672, -10765, -944, 4471, 3508, 1804, 4088, 8423, 8228, -542, -13122, -19059, -11423, 5693, 19862, 20212, 7009, -9554, -17426, -13027, -2348, 5642, 7056, 4822, 3791, 4769, 3827, -2242, -10901, -14862, -8518, 5387, 17146, 17834, 6621, -8229, -16501, -13534, -3561, 5508, 8900, 7395, 4716, 2738, 44, -4855, -10093, -11091, -4748, 6272, 14854, 14362, 4807, -7470, -14434, -12427, -4116, 4449, 9088, 9062, 6163, 2076, -2792, -7774, -10465, -8260, -767, 8403, 13480, 10726, 1694, -7796, -12321, -9819, -3144, 3646, 7749, 8815, 7075, 2739, -3787, -9845]
689i845j984M604R584Q989K340n863r905p585j244M381N922M312K287J132l08
704F817l367o794p263k348N819J1273R568Q79q345j1529o787J407O819O340K523
719E012j90j90L77j555n612p429l426N301J2042J0510J004r865j3387p315L148
734a1575R417P930J629k911k541J69K86l375o603m389L914J1540J1209J823j0019
749F504j4609q433L549J1412R872J845m808n297j142J320p71m555m241K141R584
764B371J0767K740q957j4527r265K779J2033J1537K928n541p489l302J251J361
778a314j820l057Q64P146R007K955p197j3163r352J860J1408J2018M227n243q722
793c83n275M49K459P19j206N51M841O601K334n836j1035q317J145J0034J1493
$$ y = [-9845, -11829, -7225, 2359, 11348, 13688, 7825, -2080, -9665, -10909, -6528, -606, 3706, 5993, 7125, 6817, 3450, -3344, -10607, -12955, -7136, 4137, 13705, 14584, 6239, -5290, -12077, -10670, -3851, 2489, 5012, 4822, 4632, 5009, 3454, -2158, -9587, -13013, -7712, 4330, 14840, 15844, 5979, -7408, -14723, -11575, -2158, 5772, 7401, 4490, 1949, 2118, 2404, -971, -7574, -11963, -8049, 3491, 14700, 16523, 6504, -8105, -16538, -12989, -1577, 8295, 10140, 5332, 35, -1107, 213, -558, -5113, -9354, -7213, 2371, 13138, 15878, 6921, -7606, -16871, -14092, -2059, 9478, 12406, 6865, -624, -3926, -2675, -1314, -3134, -6191, -5327, 1819, 10826, 13781, 6584, -6579, -15931, -14071, -2663, 9355, 13582, 8339, -383, -5658, -5209, -2750, -2031, -3237, -2686, 2155, 8756, 11090, 5254, -5781, -14098, -12953, -2919, 8574]
808H574M799m194q769o544j031K615K602J028J264L007L814P16m939q539o248
823a1845J210Q370R729M566l158p751o700k182J805L258K758K532K584J681j474
838E383n209o738l688K383P417P630K989k912o349n651k387R03K726L636L785
853C918K887L84l385o260n565j379M174P116N589J054l476n242m064j669L53J858
869c707L407M426L609J55m694p357n570K52O098P843M485j224n123m892k171M5
885d418O71Q03K113M071M226Q66m824q321o190Q27P624R065M114l079o856n341
901d649r47K108J772M08N74K809M193J622l994q369o736M64Q172R986M632l857
917H188q409o513n26L791L555Q90p24J019L105K186k627p369o943l44P708J0414
$$ y = [8574, 13373, 9179, 410, -6134, -7165, -4550, -1948, -920, 344, 3351, 7165, 7881, 2942, -5597, -11845, -10635, -2265, 7464, 12030, 8872, 1121, -5579, -7761, -5956, -2698, 60, 2592, 5176, 6857, 5383, 174, -6564, -10252, -7869, -452, 7178, 10167, 7255, 906, -4745, -7132, -6229, -3503, 133, 3918, 6805, 7189, 3804, -2456, -8021, -9400, -5226, 1890, 7479, 8533, 5057, -185, -4249, -5918, -5565, -3707, -300, 4126, 7735, 7890, 3196, -4161, -9731, -9479, -3381, 4462, 8947, 7723, 2600, -2292, -4463, -4418, -3747, -2944, -831, 3240, 7466, 8332, 3508, -4813, -11003, -10176, -2552, 6513, 10627, 7548, 692, -4649, -5596, -3488, -1716, -1308, -734, 2075, 6268, 7890, 3896, -4473, -11209, -10745, -2573, 7413, 12045, 8188, -221, -6734, -7260, -3469, 86, 976, 252, 1271, 4376, 6562, 3935, -3434, -10377, -10721, -3013, 7401]
933G401N335l721r372p703r62M983N450J837j353r34J534K033j302n781o344r36
949i835O688R823N741l083r356q506j630N138O746L148j115k230m05J072m98l813
965b115m831r71N144Q482N479k267q438q482k324M600P116M272k37k752k187j85
981C04m95k327k860l93M135O734M433j819p404p483k451L741O787M747N15k585
997C579k864j774j108j204j059P49L811M962K776k117o040o132j884L075N718
1012D88M607J035j840l197k652j888j015K18K224L996L788R69k991n547m386o85
1028f876L176M655L423Q51j309k382k728k537j609O07L417M866L332m88m447n495
1044c544l171J003L813L983K045r2j145j474k160k708k003L76L922N532L402j291
$$ y = [7401, 12736, 9015, -357, -8060, -9022, -4039, 1411, 3248, 1895, 961, 2495, 4528, 3226, -2555, -8899, -9835, -3147, 6676, 12417, 9334, -22, -8528, -10158, -5020, 1726, 4874, 3759, 1529, 1124, 2196, 1698, -2115, -6946, -7917, -2773, 5709, 11188, 8921, 483, -7999, -10323, -5723, 1393, 5665, 5428, 2676, 489, 304, -191, -2518, -5378, -5771, -1636, 5098, 9531, 7712, 308, -7175, -9626, -5885, 902, 5649, 6164, 3579, 715, -1059, -2167, -3371, -4430, -3681, 130, 5092, 7868, 5751, -289, -6421, -8305, -5230, 488, 5095, 6130, 4290, 1093, -1559, -3447, -4462, -4244, -2020, 1976, 5764, 6733, 3742, -1805, -6191, -6876, -3700, 955, 4378, 5229, 3920, 1538, -1190, -3727, -5336, -4729, -1312, 3554, 6886, 6398, 1951, -3544, -6715, -5712, -1899, 2084, 4129, 4037, 2892, 1418, -742, -3450, -5453, -5077, -1155, 4377, 7779, 6488]
1060F488n607o010k497K462M972L871P36j425j600q38j054k071k325j42L563N779
1076D302M011j408o333o873k440L467O308M295Mk937k627p13K64q16k094q54K575
1093a869N586M280q84o321p296k925L755P167N074j38l973l946j115J088N46j165
1109b136j133J593M531M145k70n647p205l331L342P488N746L02m505n104j904
1124d088J394J812J64q57O32L149L428Q7m594o514l358K754P002O090P65m390
1140C476n679k761J072K600J493j23J36J763K191%l484n302l001K221O273N642
1156F517J134l912n681l328N44K793K428Q68J48N36R64m18k988l855j972K072
1172d150N226M732R78l399m998l332J25K372K743J657O99J75j65j571k802k669
$$ y = [6488, 881, -5129, -7626, -5164, -192, 3679, 4415, 2990, 1390, 552, -502, -2573, -4898, -5040, -1477, 4302, 8313, 6905, 572, -6301, -8741, -5274, 1034, 5329, 5333, 2396, -231, -944, -680, -1496, -3590, -4444, -1869, 3717, 7997, 7113, 792, -6504, -9429, -5674, 1493, 6567, 6429, 2456, -1490, -2605, -1517, -971, -2136, -3269, -1676, 2855, 7000, 6730, 1083, -6122, -9453, -6111, 1377, 7123, 7425, 2920, -2184, -4088, -2694, -882, -718, -1575, -943, 2206, 5634, 5721, 1127, -5387, -8745, -5991, 1011, 7101, 7866, 3476, -2203, -4964, -3892, -1292, 201, 78, 214, 1977, 4168, 4168, 684, -4618, -7619, -5398, 875, 6517, 7651, 3739, -1942, -5270, -4726, -1933, 495, 1363, 1511, 2047, 3011, 2593, -395, -4250, -6222, -4150, 1076, 5808, 6786, 3387, -1611, -4943, -4818, -2446, 297, 1954, 2653, 2828, 2663, 1092, -1710, -4379]
1188d379o44K433M470L431K58k999m276k674p9J969K512K048J165J91q99k314
1204B13l078j963N50L202M011K316p82l173l428j750L01J566J947J730J471O87
1220C820j066k940l605j866J739M413L527J614j943l703l600l6J208J415J245
1235B22J019J096J090m08k858l787k272J601M620M800R44k707m600l095N09K287
1251a539K041P07l3L64J449j97k291m105k385J666M756N498O43l341m995l660
1267e422J108L025K789N41j215J96R54J69j974l065k676J176M809N178J704l658
1283C639n713l827O09L837L749Q37j096j760J96Q04r47k600k391J098L648M961
1299E044J859l151n862m087J78M642M100J448j411k247j386M17M91j922j316K79
$$ y = [-4379, -5023, -2590, 1880, 5311, 5569, 2570, -1706, -4380, -4459, -2490, 22, 2070, 3235, 3426, 2527, 213, -2865, -4828, -4278, -1076, 2935, 5251, 4469, 1296, -2132, -3882, -3581, -2015, -68, 1662, 3133, 3820, 2754, -186, -3791, -5657, -3918, 495, 4022, 5636, 3693, -10, -3610, -3646, -2438, -1023, 222, 1241, 2337, 3427, 3019, 161, -3626, -5898, -4297, 323, 5123, 6067, 3360, -1240, -4335, -3826, -1539, 502, 1209, 1176, 1540, 2989, 2792, 501, -3604, -5989, -4323, 433, 5931, 6574, 3233, -1762, -5422, -4314, -1289, 1500, 2041, 826, 1022, 1976, 2145, 171, -2894, -5570, -4394, 415, 5593, 7297, 3639, -2074, -5901, -5292, -1455, 2294, 3131, 2035, 275, 471, 1275, 328, -2272, -4663, -3565, 83, 5044, 6903, 3752, -2110, -6197, -6019, -1377, 2723, 4171, 2760, 513, -873, -456, 35, -1887, -3203, -2924]
1315b924L240L939J947k614n309m148J8L935M584J980j324k505j706l45K95o84
1331a621o48M28K645L043J010k178m558l572N5L526M277K228o84k826j993j035
1347a903p2j2L23P82K540J811M74j854l827k651k0K715L826K171o02j992k364
1364f55j648k54N64J063J115K056J082n9k546l346j741Q96K690K715J644k33j970
1381A373k029j331o78J61J160J992K542N55j222l017k828r36J554L071K332P75
1397C474j314j521j384q94n76j09J153K131K465J009k155l279l128l12K250L249
1413A059K403J1k383j339p93o43j13r0N82J603K940J188j728l964l317k55L080
1430a759M068K387j098k942j936q86J469m28j52p6J869K257J378j197m250l738
$$ y = [-2924, 316, 4255, 6202, 3588, -1721, -5869, -5851, -1916, 2668, 4648, 3324, 819, -887, -1232, -937, -1621, -2269, -1841, 804, 3847, 4857, 2679, -1879, -5451, -5396, -1870, 2407, 4635, 3951, 1125, -868, -1903, -1975, -1987, -1664, -882, 1658, 3469, 3943, 2089, -1738, -4389, -4409, -1694, 2132, 4303, 3701, 1709, -655, -2303, -2557, -1993, -930, 185, 2241, 3323, 3264, 718, -2628, -4369, -3473, -783, 1932, 3576, 3343, 1373, -656, -1987, -2665, -2504, -1344, 648, 3190, 3745, 2523, -494, -3322, -4258, -2704, 367, 2699, 3474, 2160, 639, -745, -1639, -2215, -2324, -1171, 960, 3425, 4434, 2279, -1000, -4128, -4440, -2190, 1059, 3462, 3473, 1090, -249, -1042, -1685, -1798, -1888, -1306, 297, 3237, 4425, 2697, -1267, -4584, -4839, -1759, 2309, 4696, 3598, 656, -1280, -2166, -697, -1125, -1277, -1353, 516, 2773, 4151, 2954, -1296, -5034]
1446e034l46L415M458K707j005l414k836m96J305J077j42kO20K278J021j307l185
1463h86l564n99K866M814K955j517l586l276n65J562J962O20n91L49J219J068
1479B831p88k805l134j236L158M511K648m09l994l405j410J948J985J104N79m50
1495A133N6M34m93k106k568o45K321M126K674r59k981l891j149J215K616J729
1511A512M39n91k18j82n17j548j894j55J999L399J998n69k949l252j405J010K400
1528e23K106O55l66n92p14j029j356r75M69K110K625J404q76k674k740j002R97
1545b481K015J885Q45j07p29j112j391j338m26J123K383K252O60j468k654k103
1561b646l71J174J739J392O72N9m82j085j709j571k39J621K779K131K7k208k734
$$ y = [-5034, -5380, -1965, 2493, 5200, 4195, 781, -2055, -2551, -1246, -169, -311, -313, 307, 2585, 3606, 2299, -886, -4450, -5049, -2183, 2631, 5586, 4069, 483, -2793, -3358, -1796, 166, 786, 195, 544, 1763, 2831, 2043, -762, -3896, -5132, -1974, 2537, 5185, 4776, 782, -2623, -4033, -2085, -100, 1004, 1583, 1133, 1189, 1623, 1130, -976, -3544, -4189, -1868, 2258, 4932, 3973, 992, -2899, -4048, -2833, -217, 1512, 1951, 1360, 1142, 960, 443, -1105, -2999, -3154, -1155, 2244, 4242, 3673, 724, -2528, -3933, -2923, -523, 1583, 2238, 1872, 1280, 566, -463, -1819, -2794, -2325, -215, 2410, 3814, 2938, 264, -2476, -3478, -2481, -466, 1419, 2264, 2157, 1428, 316, -1075, -2413, -2839, -1716, 667, 2919, 3579, 2111, -543, -2646, -3017, -1843, -104, 1288, 1960, 2019, 1537, 452, -1257, -2828, -3067, -1446, 1333, 3464, 3491, 1283, -1451]
1578a451j592L51J591J672P65J91jj79q69j717j636k98J813L108K144k57k654
1595I81l219j345R49K194J779L68m04m00K9n16j368j690n08J737L236K382l28
1612C877l045l516j450J359K827K004K08j098q59j25K3q54j488o55J327L041K470
1629D046k27k912l776j615J422L289K462J56j506j441m52K00j59r43o73Q96K589
1646A356K312j7k676l687j802J289L427K730M37j720k115q00K78K90l00m32O78
1663g52J999J885L2k389l350j708J091L261K837N89j637k298j268J43O03L05K3
1680f34N09J412J286j39j974k827j398R86K894K723O99j522k339j553j59P57P15
1697e64N11O17R45O84m81j803k231j005J096K582K279N54j395k074j543k99N89
$$ y = [-1451, -3043, -2692, -1101, 571, 1336, 1527, 1526, 1347, 478, -1239, -2875, -3173, -1360, 1748, 3892, 3635, 981, -2238, -3583, -2634, -440, 1339, 1707, 1303, 903, 932, 416, -952, -2642, -3150, -1413, 1823, 4205, 3877, 832, -2684, -4134, -2775, 52, 2056, 2264, 1166, 307, 182, 205, -649, -2137, -2792, -1465, 1576, 4046, 3819, 907, -2869, -4484, -3062, 227, 2689, 2845, 1339, -102, -554, -354, -513, -1456, -2129, -1233, 1356, 3668, 3651, 975, -2712, -4514, -3225, 202, 2932, 3369, 1649, -466, -1266, -988, -698, -998, -1430, -752, 1247, 3132, 3164, 775, -2575, -4283, -3192, 69, 2906, 3495, 1858, -440, -1708, -1565, -962, -657, -634, -125, 1287, 2573, 2434, 460, -2367, -3765, -2779, 115, 2838, 3537, 2015, -324, -1877, -2036, -1279, -564, -53, 564, 1509, 2193, 1712, -91, -2322, -3327, -2231, 351, 2630, 3184, 1789, -285, -1828, -2127, -1538]
1714a538Q77Q16R76P66J75j005j823j747m27J377K365J777J27j300j810j262k64
1731a920L43Q24J078J059Q35j48j409k048j524K36J800K278J234l36j482j564
1747g44q48j01M25N52Q89J244R38j95j725k244j394N42K269K500Q39q86j872j503
1765a314l66L85N34L00N95J055J067p5j667k463j534Q07K597K666P89j373k376
1782c73j534pQ49Q42K35K06O87R79R5j485k372j544O47K757K824Q39j649k695
1800f99j774J33J413J225L26k12K47O94K43j089k176j536N08K677K882R50j616
1817B196k987k020R3J734J679N08l60l13K86K41p79j689j385M21K327K749R98
1834C699j531k926k191pJ729K050Q97l75p03k67j8m53j190r73L13K013K353R77
$$ y = [-1538, -661, 155, 1131, 1897, 2072, 1067, -756, -2503, -2930, -1553, 812, 2589, 2716, 1416, -394, -1656, -1920, -1577, -753, 325, 1384, 2219, 2071, 662, -1386, -2910, -2674, -874, 1404, 2638, 2302, 820, -744, -1592, -1693, -1268, -716, 173, 1417, 2355, 2160, 435, -1809, -3203, -2661, -392, 2108, 2947, 2061, 189, -1314, -1680, -1295, -761, -461, 134, 1189, 2256, 2181, 514, -1949, -3483, -2676, -79, 2587, 3376, 2003, -373, -1907, -1914, -1065, -223, 12, 218, 905, 1884, 1979, 494, -1878, -3422, -2775, -18, 2806, 3645, 1996, -699, -2473, -2340, -927, 298, 624, 412, 659, 1353, 1596, 507, -1669, -3205, -2697, -20, 2862, 3812, 2196, -791, -2811, -2718, -984, 695, 1203, 843, 530, 816, 1057, 278, -1411, -2796, -2375, -48, 2701, 3699, 2168, -758, -2949, -2956, -1227, 823, 1720, 1345, 642, 375, 357, -96, -1286, -2259, -1946, 67, 2420, 3397]
1852C397j387k783k141j07J781K159J057k40r15o75k77m05q02m91O07J669J877
1869B324N35j200k457j931r1J545K079J158q4q72r35o48n16l80k1P95J553J342
1887B196J93j344k134j445M1J508J803J064o5p71r66p88o24l42L13J131J606J001
1905B377k90j616j907j001M48J440J547O79j32o36p51q56p73l57M76J393J737
1922A778P80o77j924j911o16Q70J739J286L45m85o12n39n78p60m67M23J430J887
1940A969Q20r63k164k027l49J308J948J251j05q35o97l41k92n60n53K78J393J920
1958B001Q11j009k374k074l32J625K268J297l42j244j042k79J62j59m03KJ134
1975D2J682R81q69k364k249l28J734K482J477m54j558j355l74M14J90r9l6Q18
$$ y = [3397, 2010, -773, -2914, -3021, -1240, 919, 1976, 1736, 821, 146, -131, -536, -1338, -1829, -1222, 447, 2324, 2859, 1659, -798, -2729, -2820, -1275, 804, 1962, 1878, 1006, 71, -577, -1093, -1473, -1494, -699, 854, 2196, 2389, 1045, -1089, -2534, -2493, -985, 818, 1882, 1817, 1046, 80, -708, -1332, -1674, -1361, -230, 1376, 2377, 2087, 471, -1436, -2437, -1989, -549, 998, 1677, 1545, 909, 158, -698, -1471, -1828, -1352, 41, 1778, 2558, 1881, -43, -1954, -2570, -1700, 39, 1325, 1670, 1185, 573, 34, -544, -1304, -1771, -1348, 82, 1969, 2789, 1826, -338, -2365, -2714, -1406, 542, 1793, 1688, 853, 156, -185, -477, -1037, -1590, -1312, 81, 2001, 2812, 1803, -571, -2645, -2977, -1352, 916, 2213, 1871, 627, -415, -694, -532, -691, -1094, -1092, 42, 1724, 2705, 1836, -528, -2777, -3105, -1371, 1111, 2588, 2134, 576, -779, -1153, -739, -549, -648, -684, 134]
1993A34J360Q85p13k146k149m10J614K670J521m18j767j654m86M42O68J73L9M54
2011B17R95P29n23j915j940m27J516K534J574l15j750j860p00N31R17N84R0L18
2029E75N11L97n67j521j511l82J418K189J516k27j732j880p48M18J002P91M74
2046G23J11L25n8p25j272j121J4J315J899J192l54j532j630q25L79R58Q95O21
2064I15K80ql61r32j125p39L29J421J720P14n03j494j385n99M00Q27Q70N64M14
2083A308On82j102j188m53O88J604J501L63r02j452j134k58N13P49O76M87M26
2101A250R7o95j237j203l09Q96J845J431P5j149j640r43L2Q09P35N16K45L47J11
2120A213n00j218j314l20J036K027J402qj531j828r35M45J081Q48L03m9J43O8
$$ y = [134, 1494, 2379, 1666, -480, -2629, -3039, -1425, 1245, 2766, 2348, 581, -1073, -1559, -1117, -449, -276, -237, 217, 1212, 1941, 1418, -497, -2437, -2864, -1348, 1186, 2760, 2445, 695, -1165, -1865, -1334, -417, 167, 257, 575, 1086, 1483, 916, -605, -2116, -2498, -1080, 1109, 2625, 2398, 666, -1214, -1962, -1544, -542, 249, 723, 834, 1159, 1101, 376, -896, -2017, -2003, -688, 1211, 2403, 2049, 517, -1113, -1938, -1559, -601, 294, 915, 1195, 1187, 826, -106, -1231, -1970, -1641, -220, 1500, 2214, 1711, 217, -1168, -1767, -1367, -540, 330, 894, 1308, 1314, 732, -370, -1558, -2011, -1323, 281, 1782, 2145, 1243, -209, -1343, -1601, -1088, -339, 337, 824, 1250, 1347, 652, -585, -1788, -2097, -1201, 644, 2075, 2150, 1001, -639, -1582, -1550, -741, -6, 510, 755, 1102, 1213, 713, -505, -1819, -2139, -1103, 924, 2326, 2318, 787, -1041, -1976, -1531, -450, 398, 701, 652, 795, 863]
2138H63k50j076j276m24J053K082J451j8j693k034r58O27J425J091J42l11k41
2155D53R0j81p32j110m78R75J922J508oj768k119j026O66J651J340K23n63o19
2173B26j55j0m98p55l95P01J750J401O2j626k141j149O93J814J406L06o20r24
2191H6l49p4j87m76j83P20J333J189q5j408j971r99N42J732J558L43o04j009o99
2210e41j28o0j16P3O18J071Q75k19j293j687q35N76J520J428N71o51r96q44l15
2229i53j5J27L62P17R20M68m07j252j411n24O11J405J295L39n64r16p89m92l4
2248a113K81N86Q12P94K16p20j337j144k32R06J348R35J69n94q28o72l95q1K03
2267h66O52R19Q11J09r74j422j009N1J128J331P87j06q02q03m75j50j25J76O43
$$ y = [863, 613, -463, -1739, -2163, -1110, 972, 2423, 2405, 712, -1322, -2280, -1653, -228, 863, 1005, 694, 453, 543, 362, -370, -1480, -1958, -983, 939, 2447, 2441, 673, -1446, -2472, -1806, -155, 1185, 1408, 845, 226, 71, 61, -437, -1192, -1587, -886, 864, 2265, 2327, 701, -1440, -2589, -1896, -82, 1324, 1630, 1010, 86, -263, -337, -524, -1000, -1183, -463, 870, 2059, 1974, 566, -1405, -2404, -1862, -130, 1428, 1771, 1167, 158, -541, -669, -729, -845, -772, -154, 917, 1792, 1573, 280, -1407, -2242, -1666, -146, 1282, 1853, 1202, 206, -638, -953, -968, -841, -479, 238, 1158, 1626, 1219, -33, -1444, -1968, -1357, 48, 1343, 1682, 1118, 202, -587, -1079, -1113, -832, -246, 566, 1360, 1576, 856, -481, -1625, -1857, -951, 397, 1332, 1501, 907, 79, -593, -988, -1069, -866, -214, 705, 1516, 1625, 651, -771, -1780, -1729, -601, 730, 1517, 1411, 609, -194, -669, -819, -944, -768, -125]
2286a25Q63R00p3j064j578r13L22J336J437O67n46r58p68k07Mk4J31L79Q89P31
2306A403J60j127j771p34K75J574J611N67p71j135r45j81L69K43J53J78P72P27
2324A368J05j026j528j081M13J525J752N16p05j482j019j12O34P51O3j1K90Q83
2342A336k65q12j253j264M69J715J453Q45j036j244j406J44P41N32J55K71M38
2359H19M19m00q88r63o20J25J658J066Q35o95j423j510M5R17N64O84M7r1j44J71
2379F16m99j061m91K12J399J281J92nk015q84m33O57J349J62M89n43O4np58o59
2399i32m19N93P08J652M15j167j216r25j9K40J296P02jk20m49o77j85l70q5P94
2419b65J057P41O4r61j067r14m2P72N47J018J4o4l02o77p35l99K1J026Q95P24
$$ y = [-125, 738, 1638, 1565, 501, -1077, -1990, -1668, -332, 1105, 1772, 1226, 268, -500, -707, -703, -727, -596, -217, 672, 1403, 1563, 436, -1335, -2069, -1794, -220, 1391, 1958, 1187, 52, -893, -1074, -705, -462, -309, -131, 641, 1368, 1473, 447, -1081, -2162, -1749, -224, 1528, 2044, 1339, -143, -1162, -1274, -640, 111, 174, 163, 453, 1336, 1071, 259, -994, -2258, -1789, -74, 1379, 2224, 1188, -56, -1462, -1318, -577, -45, 110, 381, 819, 1238, 838, -50, -1013, -1633, -1508, 150, 1216, 2051, 1356, -67, -1577, -1532, -615, -51, 633, 680, 589, 445, 616, 117, -944, -1435, -1223, 176, 1457, 1649, 1644, -371, -1255, -1688, -1031, 318, 480, 969, 426, 490, 485, -273, -932, -1351, -758, -50, 1602, 2017, 850, -366, -1291, -1310, -1070, 226, 928, 927, 707, 258, -419, -604, -974, -1059, -265, 792, 1533, 1597, 636, -431, -1345, -1387, -615, -68, 950, 964, 900, 598, -79, -814, -1213, -1192, -166, 729, 1453]
2439A453r5j155r42p11L34O54P51L65J83o8m22n11o61m62K55J037J010O35k07
2458A443j144j123n63M30R45M09L02j12N4l23n14m84m91M0J290R16O12n14j213
2477d0j251m08R04R11P29K80o24pk54l10o87k14Q6Q24J293O27p11j327j244k81
2497a704N84J534O91Ro07m12N2k45k28o12J51P09J157Q39o46j361j542j77O71
2516a137J488Q90J8o31q70j02Q1l44O6j6K98J545R8j97j503q90n89O97J578Q66
2536A346r4n91j002j59j69J38L11k34M92J064K81m55j145j282j16P50J299J130
2554A564j76p80r88m19N9N80l47L41N84O38j2o89p65r11j2O48J171Q77r1p00q93
2575c21n81N8O5L56N37M26M42j26l15j061n89k52Q63R74P90J90j156o15m30j10
$$ y = [1453, 1358, 203, -739, -1450, -1116, -462, 289, 654, 837, 769, 347, -164, -825, -1287, -1032, 5, 1015, 1650, 1443, 299, -824, -1387, -957, -12, 397, 699, 587, 641, 318, -196, -680, -1171, -1131, 159, 1075, 1687, 1173, -40, -1291, -1699, -795, 116, 845, 1125, 501, 494, 240, -70, -757, -971, -885, -61, 1232, 1859, 1148, -179, -1423, -1704, -1120, 414, 1105, 1114, 507, 95, 147, -98, -326, -938, -787, -78, 1079, 1918, 1272, -89, -1631, -1808, -1137, 351, 1241, 1259, 628, -242, -344, -263, -607, -541, -557, -259, 1286, 1384, 1187, -316, -1206, -1795, -1098, 480, 1346, 1252, 661, -341, -500, -669, -531, -220, -454, 38, 1102, 1383, 928, -217, -1499, -1615, -865, 434, 1564, 1388, 608, -380, -799, -740, -160, -507, -166, 418, 1056, 1044, 355, -410, -1321, -1333, -685, 486, 1363, 1272, 572, -321, -902, -844, -779, -423, 114, 540, 982, 856, 541, -520, -1109, -1361, -498, 476, 1266, 1456, 300, -315, -745, -855]
2595h55K35O71L21M56R7l25q27o73l38j06J151J027M53k54r40p63j90J52J18L52
2615b38M89N23J96j61j038p48l42L08R71R13M12m88p36m53o31J99M87O07P3M43
2635G86L68l10q91q27k99N56O33J189M33p27q60p87l48K66O24K38L76N14k12R1
2655H13j284n91o1M67J063J109J62r26r57p51l2M12O34P0K1N28K51m28o49q40
2675i89n18Q93J100Q02M11j269q88q48N23K05J139r8J74K6k28J61p72p54k29O75
2695d84Q62O76K33o57r27q81K36M07J148O0k66M1m73N6o81j98N9N42M00J190l07
2716A036o16j238n20K77P83O64N49J7n87k68k60p5l46l08M16J233L28L27j089
2735C23o07p27k50J103P89J33K4j34n49m5n82l12l4R45M52L38J08p30q30n19J09
$$ y = [-855, -620, 51, 372, 828, 925, 600, -227, -900, -1238, -1344, -193, 834, 1287, 1033, 93, -670, -860, -708, -590, -238, 251, 774, 970, 809, -229, -977, -1319, -1011, -40, 873, 1285, 797, 61, -392, -1023, -824, -337, 270, 343, 786, 1154, 844, -47, -874, -1173, -617, 16, 1205, 1638, 911, 51, -736, -1084, -818, -194, 44, 420, 934, 722, 813, -471, -1062, -1123, -656, 407, 1516, 1678, 752, -205, -956, -988, -576, 58, 128, 149, 677, 928, 500, -149, -989, -1507, -614, 486, 1288, 1699, 430, -458, -1306, -783, -578, 561, 463, 637, 663, 435, 596, -176, -930, -1159, -484, 378, 1054, 1287, 630, -297, -1178, -942, -535, 613, 673, 407, 448, -25, 31, -650, -848, -789, -247, 153, 1343, 1036, 420, -818, -1338, -1061, -278, 386, 935, 952, 365, 97, -163, -238, -584, -892, -476, 757, 1085, 1412, 323, -284, -1011, -1261, -158, 631, 764, 788, 654, 105, 60, -522, -834, -868, 77, 529, 867, 975, 245, -585, -1104, -995]
2756i95Q52P28L06n6m86l87j75l57j31J67N56O67M37k82p09q71l87K83P50N93
2776E03L06j21k99m53l59k71n4K82O37O47K84m10q41o81k38L76O88O28J82j58
2796F48m50k41l56k85p0M08O18O21J60m87q57o73j00M92P67M71N3k97k81k63l03
2817d25k04o9L42O12P00J11n55r24o81jO73Q52L93o6l73m34k02j34j09n0K54O47
2839C57N76J11n60r04p30JP30R54M26j84n42m92j36n9%K1K69M70N38J02m88r95
2861e35o50O4P97R36M38k05o47n86k08J05J09J84R7M70M24N0n58p87o69J48P56
2882b67Q89N10k54p40o09j93J29K92J57J70L08L13m2m46p56n20J17O94R07M31
2902A090k87o73o93j61J39L55K82K44J49J47j59l36o50m12K05O22Q44K79k17o91
$$ y = [-995, -143, 585, 891, 835, 349, -38, -213, -570, -701, -534, 22, 689, 1126, 844, 135, -736, -1123, -840, -90, 503, 809, 688, 389, -64, -423, -694, -748, -466, 171, 818, 1102, 692, -149, -830, -1068, -692, -4, 624, 806, 648, 198, -43, -399, -684, -754, -346, 272, 893, 1053, 566, -291, -964, -1064, -572, 195, 666, 719, 422, 141, -122, -425, -629, -698, -356, 256, 956, 1067, 512, -412, -1093, -1094, -421, 431, 824, 758, 385, -49, -251, -385, -494, -544, -290, 357, 933, 1044, 484, -420, -1150, -1149, -419, 535, 961, 777, 235, -257, -393, -452, -452, -431, -162, 308, 846, 948, 460, -535, -1185, -1121, -324, 612, 1050, 845, 198, -388, -596, -491, -382, -198, -101, 369, 793, 843, 285, -502, -1171, -1023, -267, 622, 1132, 878, 138, -471, -664, -535, -243, -86, 84, 392, 705, 663, 217, -539, -1059, -942, -248, 659, 1090, 803, 130, -563, -724, -585, -230, 52, 296, 445, 592, 433, 97, -553, -965, -760, -138, 706, 985, 768, 77]
2922G7n68l01J54M33L41K37J89jk07m88m52k97K66O05P50K34l31o30n83k34J78
2943f28M68M27J82R2nk98m61m69r4K71O81N80J20l34o15n62j25K93L35L66K11
2964D35K02j36l33n21m59K6M62O86M65R8n14o42m00j8K80L37K99J85J00o3l81
2985A08m72m62K4M71P61M83l6n76o81l75R5L86L95J80J18M7r4k45n32l43n8N69
3007b37P68M72j54o89o30l27J80M37M02J98ol6j13k36m18l25L9M21Q27M00j78
3028G95o20p41l73K52N02M82J86q7j32j19j80l42k52L8L91P25M57j48p28p37k72
3049i03K48O51M45J63j99k50j29j70k30j98J07L79N31M13j43o79p24k77L69N47
3069d9N50J30k06l33k40q9j76p0J27L62N30K67k04n73o58k72K77O58N53Q5j99
$$ y = [77, -491, -792, -638, -205, 136, 373, 562, 561, 354, -134, -586, -883, -617, -12, 738, 972, 641, 11, -572, -806, -628, -160, 267, 449, 541, 536, 238, -223, -692, -786, -515, 166, 746, 866, 532, -83, -645, -770, -477, -142, 224, 435, 637, 501, 168, -353, -812, -786, -324, 362, 827, 925, 411, -231, -631, -649, -369, -32, 267, 452, 552, 489, 108, -364, -826, -802, -331, 430, 913, 877, 301, -380, -755, -660, -274, 121, 301, 419, 466, 372, 127, -405, -748, -806, -237, 531, 1003, 849, 160, -470, -797, -617, -180, 222, 420, 414, 378, 265, 29, -389, -714, -675, -254, 573, 973, 795, 175, -566, -939, -687, -185, 297, 483, 396, 264, 145, -35, -377, -629, -591, -200, 525, 982, 834, 106, -631, -903, -655, -4, 441, 604, 405, 155, 26, -144, -374, -572, -465, -86, 445, 858, 715, 36, -688, -965, -596, -49, 501, 631, 425, 92, -148, -237, -413, -483, -356, 6, 536, 803, 599, 26, -632, -904, -627, 31, 584, 669, 470]
3090D70l57l43r2q9j5K14L92L65K54k60n94o02j94L39N92M82P8j44m82l06j50
3111d42k8N4K73L53L05Q5k60n58m88n5L23N79M03J24l13l32l41j80J5J27K91M00
3133C35K78Ml38n84m63Q6M01N59L17rk51l93k56r1j8J12L07L82K91p3m24n92l54
3156g74Q5N05N24L21j31l20l68k06j2K1J10K50L81K30o8m14n50l22L7N78N83K27
3178F87j14m89k94j96L9P2J45K25K62K71j05m84n32k91J93N66N64K15k63m30m07
3199c66j22J70J31J29J67J92K45r9m09m80l33K11N75N22K57k56o61k63j73K14
3219c49K45Q3L06O3J63q1m75m10k99L08M57O03K01k70o39m56nK64J60K23J83J02
3241C77q1j14k41l91k15K63M86M87J93l20m92m84m9K42L33K26J91q9l5j35l68
$$ y = [470, 113, -230, -322, -411, -426, -212, 180, 545, 799, 539, -55, -657, -851, -512, 80, 562, 640, 496, 14, -292, -442, -470, -416, -143, 210, 515, 600, 340, -218, -706, -761, -438, 141, 544, 668, 355, 23, -318, -498, -483, -356, -65, 335, 613, 617, 279, -305, -768, -682, -281, 278, 595, 586, 335, -58, -314, -405, -423, -311, -4, 378, 669, 596, 172, -420, -774, -689, -184, 340, 661, 530, 210, -158, -364, -376, -355, -245, 5, 386, 616, 548, 134, -416, -738, -701, -123, 460, 687, 573, 84, -210, -406, -367, -295, -150, 75, 337, 608, 503, 19, -513, -804, -611, -45, 519, 734, 471, 41, -366, -488, -318, -187, -58, 109, 301, 546, 447, 38, -442, -775, -564, 11, 533, 790, 534, -127, -390, -563, -349, -104, -21, 285, 348, 511, 430, -45, -455, -754, -446, 11, 614, 815, 545, -94, -550, -555, -291, -131, 92, 275, 377, 296, 182, -59, -450, -665, -402, 84, 571, 764, 444, -48, -532, -581, -339, -6, 220, 411, 322, 287, 152, -216]
3262b16k66r5K39N07M07J20k87n61l63n7K39L47K30J15J2j56k09k53k33l4K42
3283b72M67L80L0l01m92l37%K34L17L08N4l7j04k28k97j71p0L61M52K84ll98m02
3306b25l28k0L84L16K59K2q0j39k50k83j34Q4L68L98K66j26m53l55k61R6L17L23
3328A79J90kp0j40k68k62j59J09L86M89J90j61m60l71k19J61L09L15J79q9n0j62
3350I4k16k39r5J79K95L99J76j78l91m88j40K06L95L47j0j2k28j47j42j67l7J12
3372b87L24L71J91j40n05m94j16L51L54L51L3j71k21r2j18j37j4P8L50L62J02
3393E72j99m58m04j32L15M43K61J39k87k60j72o7o4N9N4L12K39J60k18m93l83
3414e83p8L68M13L19Q0k52k91j85j31M6Q2J60K16K20J08k67l91l09r9K71M89L04
$$ y = [-216, -482, -577, -338, 169, 576, 696, 409, -152, -515, -572, -333, 14, 244, 359, 371, 215, 6, -247, -480, -514, -272, 195, 575, 605, 304, -188, -525, -525, -291, 26, 334, 388, 351, 247, 19, -278, -449, -519, -158, 294, 578, 575, 177, -225, -553, -573, -189, 127, 386, 408, 328, 189, -61, -344, -478, -394, -26, 372, 638, 512, 59, -296, -557, -461, -144, 179, 369, 367, 297, 157, -111, -373, -532, -423, -37, 452, 642, 481, 21, -350, -569, -408, -99, 216, 395, 306, 256, 94, -122, -361, -456, -277, 18, 417, 593, 415, 24, -464, -604, -398, -3, 344, 334, 322, 94, -53, -195, -362, -399, -287, 37, 408, 599, 459, -46, -540, -656, -305, 49, 400, 433, 262, 41, -51, -169, -306, -320, -242, 108, 470, 572, 373, -85, -489, -621, -306, 137, 398, 537, 250, -10, -182, -249, -313, -254, -200, 112, 351, 511, 293, -200, -583, -661, -293, 120, 439, 519, 267, -24, -209, -340, -294, -212, -52, 164, 384, 492, 225, -166, -475, -574, -303, 186, 490]
3436D90k5k45l04k30J1Q3Q3J83K23J41J4k73l23l19j9L32L33L26nk79l02k55l0
3459c90J07J63K02J99Q0o8k12l81j72K5L46L59K14n8k48l10j91l3J46J26K57J68
3481C29O7j61k10l46j97J64L04L82R8r8k65j98j80l6J19J75J58K48l9m7l81j67
3503b81k52J79M9N56L87o7o37q1n07K02L1M63L04J02q9j96l1m86j09N9M52K96
3525C44J30k71j47m30J7m5J85J91K41k6J22k58j01l50j30L51M46K18k9q6n57j18
3547c03j58K66R2J21J31K67k73J94m95l9l71K83K69L54J19l04j36j91k93K47J53
3568f7J03M81n74L03l27L35o16J57L0K09N85j95l71m28Q0p7J15N85q5J44k32j08
3590D7j1k40k94J53L18L79Q1J4l30m56k10K12J43L67L12k88K6k13k79O0r1j35
$$ y = [490, 465, 220, -84, -314, -303, -220, -137, 46, 269, 410, 424, 151, -172, -491, -510, -178, 155, 481, 476, 197, -105, -360, -390, -283, -120, 82, 281, 361, 293, 81, -300, -472, -447, -101, 258, 472, 414, 166, -144, -335, -368, -222, -96, 161, 329, 396, 235, 25, -321, -518, -354, -50, 332, 430, 332, 67, -131, -311, -347, -228, -53, 105, 353, 314, 267, -114, -281, -533, -354, -305, 251, 638, 571, -66, -147, -654, -452, -421, 42, 346, 448, 359, 163, 132, -354, -463, -404, 48, 344, 474, 203, 56, -374, -357, -402, -217, -26, 215, 189, 311, 53, -48, -398, -528, -177, 269, 487, 458, 372, -185, -303, -461, -195, -103, 18, 149, 416, 143, 337, -158, -197, -568, -285, -16, 338, 457, 153, 17, -174, -467, -220, -67, 36, 517, -57, 246, -81, 254, -362, -205, -175, 34, 619, 424, 53, -375, -295, -372, -257, 328, 243, 387, 155, 47, 36, -204, -498, -345, -27, 352, 433, 447, 117, -339, -549, -337, -194, 173, 485, 197, 223, 10, -269, -209, -300, -435]
3612d35K02O12j32R7l26l18j79J15K03R2K15J16K2l05r0j12m4J21K3L36n0L16
3634D79n34j67j90P0L32J04K35l0j57J1k99l90M09Q8J24K14J70l05k68j03k98
3655e05J95K50K4L26l7j43k2k99J11Qn5K57N41k72Mn81l47l2K18L21K10K92l58
3678A06J14k95k7j87j6%P19k96J71k29J5m08l8L42R0j08O18m19R5l04J25n01K93
3701a40L14L97r7L25q47J29l35l23J79M68L74k16j53L3k54l37K94k90K75J85J03
3722H4M34k12l78m24K17L52J45Q5J11o2n16p8j70K63K29R1l28L55j55r2j70j85
3744d04q5N39m8M99k49l80j16m8m7NJ45N82k79L88l54J02l72l22P5J1L07M08k2
3767C35k03m19j39K35R1r6K95J46p7p5m9k63j73j7J97L70K30N0l54K7l62j22K83
$$ y = [-435, -233, 379, 247, 344, 18, -300, -479, -364, -161, -69, 146, 262, 284, -21, -111, -223, -267, -146, -123, 213, 163, 479, -55, -222, -412, -342, -10, 94, 329, 299, 142, 153, -146, -536, -127, -39, 85, 299, 469, 164, -104, -207, -505, -310, -60, -36, 290, 253, 110, 88, -211, -100, -92, -147, 110, 651, 379, 383, -198, -545, -577, -359, -38, 172, 464, 106, 220, -75, -102, -289, -305, -305, 414, 118, 289, 60, 75, -333, -371, -29, 61, -47, 571, 152, 247, -57, 68, -433, -140, 174, 571, 474, 799, -48, 81, -254, -577, -398, 70, 444, 228, 75, 108, -146, -483, -189, -479, -204, -19, 84, 518, 306, -72, -496, -279, 73, 218, 303, 414, 352, -164, -242, -412, -149, 80, 171, -157, 198, 43, -49, -219, -404, -489, 50, 2, 501, 252, -128, -244, -292, -339, -334, -189, 393, 114, 502, 148, 250, -122, -444, -369, -358, -51, 357, 335, 132, -287, -426, -191, -100, -196, 99, 245, 168, 93, 44, -219, -392, -409, -212, 158, 388, 438, 84, 111, -251, -373, -90]
3790i0J31P9J4Q3j78p3j77m8K3J80K48J55k9k61k79n9Q1O6J13J58J43k2j20j30
3814Hk43j17O5L19K31P4n6k66j92j95K06M9K47K3p1K24k17j50l58P7O4L35O6K48
3838C71j01l50j95R1q0J53J61J22J9J0j15k39j53j2J52K63K32O4j89k12j98m6
3860b52M8J27J52J35J1j6j01k60j41l3J92K36K30L0j79k70j64o7J06J68J43J47
3882B42l7l1j75j74r9PJ42L14J77J8k33l04j49j0J72J61J73N1o8p3p3j73j15k7
3906b84K06K92J59p6k30k41j51K1J44J82J61M2j27p6l6j87o2k0K31K47O4k1k02
3929C6k03j63M5J93K13J14m0k9j08j08j51p3J03K13J39J64l8k68k24j69N3K97
3951dJ22J24k4j03j16q7j37J8J1J68K63P8r9k06k39j35Q0K06K42M1J3j21j34q4
$$ y = [-90, 41, 120, 134, 217, 39, -34, -211, -259, -236, -56, 192, 347, 318, 57, -222, -281, -200, -134, -21, 137, 280, 258, 138, 8, -235, -352, -287, 32, 263, 337, 281, 15, -177, -372, -166, -117, 130, 153, 82, 306, 89, -61, -419, -342, -278, 57, 123, 371, 270, -80, -275, -184, -264, -111, 50, 172, 191, 201, 86, -153, -306, -318, -166, 97, 329, 393, 204, -8, -206, -252, -204, -77, 75, 210, 221, 205, 104, -156, -297, -330, -138, 98, 328, 358, 179, -91, -255, -322, -216, -48, 95, 242, 205, 174, -1, -175, -274, -267, -125, 189, 366, 384, 151, -153, -302, -312, -140, 21, 194, 245, 177, 104, 31, -142, -257, -284, -78, 214, 373, 297, 67, -174, -325, -304, -160, 22, 183, 225, 98, 22, -14, -201, -263, -283, -52, 195, 259, 238, 36, -167, -330, -285, -92, 121, 235, 195, 166, 58, -50, -201, -274, -171, 42, 181, 345, 307, 39, -185, -354, -301, -4, 118, 242, 218, 115, -1, -88, -225, -207, -196, -28, 235, 313, 214, 8, -231, -366, -286, -80, 162, 203, 216, 95, -39, -123]
3975a23q4j2J24J48J40R4r3k32j64j73J91J98J35J76q7j57j14j53l2J5J49J82
3997A28J13K0m3j77k80l7N2K97J11J17n3k03j56p6lJ7R4J75J47j8p6j82k45j8
4021b96J67K09J25J09j23j35j54r9oK4J67J24J83l5j39k61j55l2K04K97P6J4j41
4044A23j64q1m8k1J12J23O5J66o1j26k38j43M7J01K13K20o1j47j37j46l3P4M7
4067a15J78Q3Q5Pj72j91j60L0K21K07J00m4j05j63j81P0LR1J47R3pl6p4j86k04
4092c23J4J96L07J29j09j40k73m5O5N5J34Q0M4M8Lj54j61j34L2K03K26R5n6k01
4116C5j78q6pR8J73J45JL5o7j58j94o0J14J36K07Q3m4k41j92p9K7J44J52P0J02
4141B16jj45j60j34o9J73J44K02J04j59j31k24j04J22P7J25J45K8m3r1j80j24
$$ y = [-123, -207, -219, -95, 53, 193, 287, 194, -38, -202, -375, -184, 14, 149, 325, 238, 81, -33, -186, -218, -203, -54, 128, 241, 261, 218, 41, -239, -276, -224, 73, 184, 301, 248, 45, -111, -187, -190, -173, -79, 96, 243, 225, 149, -33, -278, -296, -129, 80, 205, 314, 191, 56, -98, -197, -203, -179, -12, 112, 295, 260, 121, -140, -295, -327, -123, 174, 250, 264, 123, -41, -122, -170, -191, -79, 44, 109, 275, 214, 88, -150, -293, -246, -145, 68, 288, 227, 80, -57, -203, -236, -162, -115, 63, 146, 231, 238, 66, -125, -285, -255, -34, 173, 273, 229, 124, -39, -220, -150, -147, -56, 91, 184, 177, 141, 67, -119, -323, -309, -113, 194, 323, 214, 74, -199, -244, -179, -124, 10, 90, 134, 182, 185, 31, -130, -264, -232, -29, 197, 292, 236, 35, -143, -229, -236, -138, 35, 180, 181, 216, 149, -9, -203, -263, -149, -13, 194, 277, 233, -8, -200, -279, -252, -108, 44, 114, 216, 215, 70, -90, -224, -293, -120, 24, 226, 330, 171, 40, -184, -288, -166, -89, 36, 181, 209, 166, 75, -105, -229]
4163b29lJ26J91J02K5j7j80k03r6R6J37J33J06J9q2j48j24r6rJ46K14J26K4p8
4187A80j71j71k2L3J68J34N5Jj03j56j07o5L5J09J91J12Q0k06k09r7PN8J74J56
4211A86N1n2r7j31r0j17L8J61J74J18k3o9l48l3j2J26J46J51N8q1j38p5p7j55
4235b89J66N0K81J08r8j30k01j37J5K02R2J31L0p1j12j01r5k3J9J25K39N2m9j44
4259F0k07j12pK21J95j2NJ3j70r0j18%J25J30J26P2l1j85j88p9Q1K12Q4J32j18
4284A39m2j20p8l2j4Q6J07J31R6q6j89j44j40J18J42J59J07q8o8j71q1n3M9J45
4308b7R0J76K1j28j63j72q9R1K43J60M9l3j84j40j32M5P3J69M4J20j8o4j83j51
4332b03J7O1J36J66R9q2j85q6o2l6O4J07Q2R0K7j47j12k11J9J36J96R1M5p1j83
$$ y = [-229, -232, -106, 85, 187, 212, 195, 15, -188, -284, -188, -51, 82, 188, 207, 125, -23, -147, -243, -252, -106, 108, 234, 258, 180, 9, -162, -184, -151, 17, 151, 206, 207, 104, -52, -159, -224, -189, -80, 111, 223, 303, 97, -112, -209, -202, -144, 30, 186, 237, 185, 88, -43, -133, -250, -212, -51, 123, 241, 218, 149, -199, -232, -244, -118, 28, 179, 237, 156, 18, -57, -134, -289, -123, -73, 208, 316, 218, 88, -113, -250, -235, -33, 59, 190, 220, 149, 37, -64, -159, -182, -163, -38, 201, 253, 204, 60, -147, -259, -266, -45, 150, 138, 143, 156, -14, -104, -222, -222, -97, 33, 159, 231, 200, 15, -173, -252, -171, 41, 125, 257, 139, 97, -23, -101, -133, -147, -61, 46, 177, 273, 187, -2, -146, -286, -168, -26, 133, 240, 152, 84, -87, -168, -221, -172, -27, 63, 239, 260, 132, -31, -203, -292, -201, 42, 202, 251, 218, 34, -106, -238, -193, -120, 49, 93, 213, 195, 131, -52, -203, -186, -125, 11, 177, 276, 194, 9, -77, -139, -175, -111, -4, 78, 168, 195, 48, -64, -275, -256, -120, 76, 167, 212, 141, -42]
4357d2j02p9J44N5M5O6J19k1j42k11o1NJ41K26R1J7j67q3j77J4L3P4R9J23O8o4
4383A71j52j95o3K1J47J93R1kj24j93q0l9J19L0J68L9R2o0j57j32j31J27R7K20
4407A87P7m1j48r2j62l3R0J50J17KO6j29j48j52l9N1J77J93P7k4j85j51r8M4J2
4432a59J44N8J17l1l9j53j43j8P3J58J81N3j09j09j68k0K9O5Q4J44M6J0j34j60
4456h1n8n6P9J78O2J07p7j69r7j57J14M2J62R8Pm3r6j17j65N5J11J56J16M0p2
4481A39j38k18LN7J33P8J32K5j25n7j26n0j8R4J84J03Kn3j76j60J7LJ68J61M5
4506B23k2m1k05m6j02j0J36J38J20%p1k16q6j6N8J57J41j9K1o7j34o0j12O5J68
4531B0J00J12l6j59j15j81K8J52J70L7N5k9j01j18j13O6k6J28J89P1l7j76j52
$$ y = [-42, -144, -223, -79, -24, 21, 87, 206, 185, 43, -168, -229, -224, -83, 143, 234, 251, 84, 1, -176, -162, -129, -55, 44, 167, 235, 171, 19, -176, -239, -218, -71, 122, 213, 211, 87, -106, -186, -225, -106, -76, 92, 131, 223, 163, 6, -126, -257, -130, -33, 187, 264, 223, 75, -17, -179, -212, -122, 28, 145, 147, 213, 84, -64, -216, -255, -204, -27, 166, 243, 219, 34, -117, -215, -171, -159, -15, 43, 160, 129, 90, -63, -206, -224, -151, 7, 188, 241, 132, 23, -145, -165, -136, -71, 13, 157, 203, 213, 79, -81, -139, -195, -116, 62, 124, 231, 154, -15, -112, -269, -155, -113, 49, 147, 154, 111, 15, -102, -267, -212, -101, 55, 171, 211, 139, 1, -217, -214, -157, -24, 54, 186, 211, 86, 29, -97, -147, -165, -71, 113, 216, 218, 165, -11, -171, -154, -151, 17, 178, 223, 201, 160, -45, -91, -193, -203, -67, 71, 191, 191, 120, -96, -182, -198, -140, 17, 158, 139, 160, 93, -41, -101, -213, -148, 20, 120, 232, 196, 37, -78, -259, -231, -79, 91, 128, 183, 154, 53, -65, -178, -112, -138, -10, 179, 250, 213, 37, -115]
4554a15o5MJ02J39O2Lnj32j38n9K7M0J54J04Q5k3j39k08n2k3K04R2J45k9n3j13
4580Gp1j19J0J35M5K01O2j01j89j43j7O4J18Q4J04n6p5q4j05p4j6J75J55M3L5
4605A88m2j64j63q7J15R4K11O0n8n4j29j32j7M5J02J14P2R0j30j37j49n6O3J75
4629A1J83J3Pj96q6n6k3k5J50J86K8nr3j85q6l6J22J35P9M7l7j07r9q4qM0J00
4656b5J35M2N6j67j44p8k1R2J86J08M9r6j66r5k3j0J18J3J71N8o9p0j88l8p2J52
4682h2J23J32O1j13k01r3K0pJ39N0J28K3j06m1j35j33K9R7K07J29qp4j60j19p8
4707b12J22P1J37L9No1j12j64l8R6Q2J65O2j1j19j45n5j8P3Q0R9N0Mo5j05j84
4733b04k9O4J51J79N5r5j13j15l6lO6P2J53N3l5o6j46q8l9Q4N5K50L5n4j79j01
$$ y = [-115, -180, -176, -74, 65, 127, 130, 125, -7, -145, -204, -177, -137, 17, 121, 206, 183, 44, -164, -216, -239, -35, 57, 202, 173, 120, 7, -64, -183, -173, -38, 7, 208, 270, 169, -20, -163, -180, -116, 2, 86, 190, 134, 59, -25, -130, -204, -220, -45, 110, 153, 188, 146, -18, -181, -268, -153, -59, 152, 212, 154, 100, -29, -161, -178, -133, -31, 83, 155, 245, 115, -22, -171, -227, -164, 11, 194, 207, 214, 18, -68, -124, -147, -172, -22, 164, 192, 187, 94, -91, -177, -213, -91, 44, 123, 170, 133, 26, -73, -157, -165, -125, -25, 110, 152, 208, 41, -103, -181, -202, -110, 76, 184, 233, 137, -29, -124, -147, -157, -39, -26, 145, 203, 134, 64, -124, -162, -234, -82, 41, 173, 234, 121, -80, -173, -153, -160, -21, 29, 157, 180, 74, 33, -102, -235, -206, -109, 98, 227, 219, 145, -15, -134, -212, -90, -19, 118, 157, 162, 101, -11, -175, -213, -117, -35, 130, 192, 181, 62, -83, -138, -156, -83, -3, 96, 146, 150, 85, -20, -204, -233, -169, -18, 161, 216, 121, 8, -107, -143, -146, -80, -8, 145, 198, 163, 97, -49, -137, -176, -92, -37, 213, 248, 194, 15, -86]
4759h6n4J7M9J45J02Kj3j30j55k5m7J01J24J61Qo6j44j22q5QJ53J14N4l5N2k12
4785h4p4K2PK7R3J17J02k1k43n2j19J50M3J09R9rk1j52o4p1J1O6J13J00N5r3j64
4812e3j53qM9J83L0R0Jo4q3j51k6L2J29J04J07J9j62j27j31L3L7J60J33L7o2n6
4838F8j01m4q1O8O6J68M3Mj26j93l4MN8J32J03L1k5j57q6o3QO1J00Q5R4j08lj86
4866a14q2J6J11J25R4N4j12q4r1m6j2L4Q7J44J00r4j10j93K4L6J15Q2P4J3q5n5
4892C1j31l9NPJ22J49K3j11o3j48k3lJ57J07Q3j0o5j42p8rm8J92Q4J06L6j35j05
4919hk31K8J25R2J08L3N9j45r0j00n7J16J8J34J12k2q5j04j31o8P0J59J32O4n2
4944A57j47o6j63N6P7Q3R5K7N3r1j63r6l7R5J48J32L3p0j54r2K5J6O4K1O3Q2J2
$$ y = [-86, -140, -123, -74, 71, 173, 175, 162, 32, -123, -148, -195, -94, 30, 191, 199, 133, -11, -133, -218, -210, -57, 57, 111, 76, 128, -84, -158, -136, -129, -102, -9, 108, 210, 189, -54, -106, -225, -75, -32, 77, 176, 167, 146, -6, -70, -141, -130, -64, 49, 149, 204, 111, -53, -206, -214, -165, 18, 48, 138, 139, 75, -8, -159, -185, -153, -24, 80, 187, 206, 44, -83, -214, -181, -144, 16, 149, 186, 124, 68, -33, -77, -158, -90, -24, 144, 187, 191, 65, -128, -162, -158, -100, 32, 135, 166, 141, -16, -102, -165, -157, -96, 4, 89, 183, 75, 72, -114, -196, -180, -69, 56, 150, 204, 92, 8, -83, -129, -141, -107, -20, 124, 224, 130, 20, -173, -149, -113, 2, 84, 158, 171, 86, 31, -100, -139, -134, -127, -5, 144, 167, 56, -7, -155, -178, -181, -24, 83, 166, 156, 91, -51, -129, -138, -186, 6, 90, 196, 232, 97, -8, -239, -211, -86, 6, 114, 147, 206, 61, -29, -129, -186, -70, -52, 82, 194, 172, 87, -17, -148, -216, -146, 13, 145, 209, 157, 10, -56, -219, -163, -86, -3, 92, 119, 172, 81, -82, -178, -215, -120, 28, 160, 193, 123, -31, -123, -98, -82, -18, 3, 66, 148, 160]
4971A60j06q2j61%J18R0J69M5j49r2p9q5L2O3N2J38P4r8p6j07p3m0J44J56J12
4996B05n3pk19n3k9nJ22J58mL7j0q0j55q7Q4Q7J13N4K5j29r2j23qP1P2Q3O6O1
5024A84o8j57n6q6L1J00J45L5J7j23j24r1N0J2J15Q9N1j7n0j13r1k0N0J21J14
5049A18N1J8j71j17m4j1Q0J04O7L8J5r7j11o9k6P0J14J28L1o4j50n2j20M3Q1P5
5075AJ04nl8o0o6j37P6M7J12R0P9p4r7j49n5M4R5J60lL8r0n7p6m8K5K8N1K03p8
5104A20%j38j49nM0J45L6O6N1o0j14q6r9JJ91O4R2K6q7j40o2k9kJ41J26KK1j06
5132D5j03m9m8Q4Q1J17K7L5j31r8j46K3R5O7R8O5l3p5q3j28mR0N7Q3J25r8l6j40
5160h0j17N4O7Q9O4O5o2j5j09j01O7j1Q7R3M6K5j25j16o2L7Q0N9P8N1l4j01j06
$$ y = [160, 54, -28, -189, -189, -71, 19, 188, 233, 84, -8, -87, -172, -140, -77, -25, 113, 187, 89, 13, -94, -167, -207, -63, 93, 205, 152, 145, -74, -127, -156, -161, -39, 119, 115, 152, 142, 62, -93, -180, -96, -9, 104, 158, 183, 54, -38, -161, -169, -98, -26, 57, 123, 184, 116, -41, -97, -183, -152, -52, 93, 128, 145, 22, -102, -193, -143, -131, -16, 73, 124, 107, 57, -56, -147, -167, -117, 4, 118, 169, 187, 16, -101, -145, -156, -76, 28, 95, 133, 148, 51, -60, -129, -155, -85, 29, 157, 188, 124, -26, -78, -198, -155, -74, 1, 105, 100, 62, 2, -64, -201, -125, -78, 34, 124, 203, 129, 32, -117, -172, -128, -33, 127, 124, 162, 72, 15, -61, -109, -84, -56, -5, 198, 120, 120, -18, -167, -172, -132, 13, 49, 115, 166, 106, -8, -94, -193, -192, -1, 63, 155, 181, 94, -46, -108, -137, -139, 2, 128, 130, 151, 45, -58, -107, -155, -71, 10, 127, 154, 189, 58, -40, -186, -163, -68, -1, 97, 162, 129, 54, -29, -157, -161, -71, -14, 69, 194, 96, 60, -80, -197, -143, -76, 13, 77, 142, 80, 65, -44, -145, -78, -89, -2, 91, 137, 162, 37, -79, -141, -104, -24, 35, 113, 164, 130, 29, -77]
5187g7j8m1J54K7N5R3q9k4j79n7L0Q1J21O9k9l4n0j54l7P4M1J08L9M2o0j35j23
5214a73M5j7R1K03m7M4l2j26q2n3O2P7J19L1K1q2j10j07n4J17N7J25K8M1j40m1
5240cr7n7O0K0J23R9l3k5j27l8l3K7J11O8M3l1r3q3o7qQ4J05O7j1%m2r7j07NQ4
5270e6J39N5rK1j35r9j01N8L6J07P7L2l4j28m2r7K0Q6J36K3j1L6j16o8n9QJ09
5297a2M4J26n8On0j67k8J4Q6J52jJ9m2j42n1k6N4RJ16O9nJq6j51l0M1N9J27J08
5326A82l6o9j57n4KJ8Q7J06nJ4l7o7q6o9L5J12J53Nl1o2j13l2J5J9J05N9Q3q1
5354I6j6j36k1p3R3P3O7Q7o3q5q7l7k6O9R8R0k5ro6q5o6kM9L4J52J3m2m9n9m4
5384g0l8P2J13L8qqj03n4k3j9O1Q5R2m8M1j69j9m1m5J11N9K0O1n9p5j7r2JK2J46
$$ y = [-77, -95, -136, 18, 45, 100, 193, 104, 80, -99, -156, -126, -45, 76, 145, 116, 82, 32, -122, -159, -85, -44, 64, 103, 145, 85, -50, -173, -128, -145, -54, 149, 102, 146, 114, -12, -94, -147, -85, -8, 111, 142, 163, 81, -29, -136, -190, -73, -16, 109, 137, 178, 38, -3, -100, -157, -97, -77, 46, 145, 112, 87, -40, -78, -111, -84, 27, 95, 138, 107, 14, -69, -136, -144, -60, 45, 112, 101, 101, 59, -38, -145, -140, -56, 83, 138, 129, 150, 15, -84, -185, -127, -91, 16, 93, 125, 91, -37, -79, -176, -156, -70, 66, 89, 78, 114, -2, -70, -129, -121, -12, 32, 158, 100, 106, 56, -111, -139, -125, -39, 113, 112, 131, 89, -53, -104, -130, -76, -67, 49, 118, 113, 114, 28, -123, -153, -112, -53, 74, 182, 146, 77, -80, -134, -132, -114, -27, 79, 74, 88, 51, -16, -102, -171, -136, -24, 129, 134, 103, 41, -72, -104, -89, -70, 35, 94, 177, 96, 80, -56, -77, -150, -57, 16, 83, 170, 107, 22, -65, -102, -128, -59, 39, 129, 104, 95, 29, -56, -122, -124, -75, -41, 111, 124, 82, 33, -26, -70, -108, -36, 77, 115, 107, 99, -4, -58, -81, -100, -39, 46, 138, 90, 131, -38, -57, -98, -143, -32, 27, 47, 108, 49, -26, -43, -135, -134, -112, 34]
$$ [...]
8191A
##END NTUPLES=NMR FID
##END=
