##TITLE=1H_LR-770-R2-K1A
 D2O
 8 sc, 
 30.10.2024
##JCAMPDX= 6.0         $$ Bruker NMR JCAMP-DX V2.0
##DATA TYPE= NMR FID
##DATA CLASS= NTUPLES
##ORIGIN= UXNMR, Bruker Analytische Messtechnik GmbH
##OWNER= root
$$ XWIN-NMR		Version 3.5
$$ Wed Oct 30 13:56:09 2024 Russian Standard Time (UT+4h)  she@DPX200
##.OBSERVE FREQUENCY= 200.1318
##.OBSERVE NUCLEUS= ^1H
##.DELAY= (6, 6)
##.ACQUISITION MODE= SIMULTANEOUS
##.ACQUISITION SCHEME= undefined
##.AVERAGES= 8
##.DIGITISER RES= 18
##SPECTROMETER/DATA SYSTEM= spect
##.PULSE SEQUENCE= zg30
##.SOLVENT NAME= CDCl3
##.SHIFT REFERENCE= (INTERNAL, CDCl3, 0, 15.7039)
##AUDIT TRAIL= $$ (NUMBER, WHEN, WHO, WHERE, WHAT)
$$ ##TITLE= Audit trail, XWIN-NMR		Version 3.5
$$ ##JCAMPDX= 5.01
$$ ##ORIGIN= Bruker BioSpin GmbH
$$ ##OWNER= she
$$ F:/spectra/data/she/nmr/H-F/1/audita.txt
$$ ##AUDIT TRAIL=  $$ (NUMBER, WHEN, WHO, WHERE, WHAT)
(   1,<2024-10-30 13:54:56.17 +0400>,<she>,<DPX200>,
      <created by zg, POWCHK disabled, PULCHK disabled
       configuration hash MD5:
       00 E9 B6 7A A2 85 ED C7 34 08 36 98 17 FE 4E 26
       data hash MD5: 16K
       9D 8F 9A A0 5F 5E EA 7F A2 5F E0 D5 F6 61 F4 63>)
$$ ##END=
$$ 
$$ hash MD5
$$ A3 B0 A1 BB C8 E7 89 C9 7E 46 D2 8D 76 BC DD 10
##$RELAX= 
##$RELAX= 
##$RELAX= 
##$RELAX= 
##$RELAX= 
##$RELAX= 
$$ Bruker specific parameters
$$ --------------------------
##$DU= <F:/spectra>
##$EXPNO= 1
##$NAME= <H-F>
##$PROCNO= 1
##$TYPE= <nmr>
##$USER= <she>
##$AMP= (0..31)
100 100 100 100 100 100 100 100 100 100 100 100 100 100 100 100 100 100 
100 100 100 100 100 100 100 100 100 100 100 100 100 100 
##$AQSEQ= 0
##$AQ_mod= 1
##$AUNM= <au_zg>
##$AUTOPOS= <>
##$BF1= 200.13
##$BF2= 200.13
##$BF3= 200.13
##$BF4= 200.13
##$BF5= 200.13
##$BF6= 200.13
##$BF7= 200.13
##$BF8= 200.13
##$BYTORDA= 1
##$CFDGTYP= 0
##$CFRGTYP= 5
##$CHEMSTR= <none>
##$CNST= (0..31)
1 1 145 1 1 1 1 1 1 1 1 1 1 1 1 1 1 1 1 1 1 1 1 1 1 1 1 1 1 1 1 1 
##$CPDPRG= <>
##$CPDPRG1= <>
##$CPDPRG2= <>
##$CPDPRG3= <>
##$CPDPRG4= <mlev>
##$CPDPRG5= <mlev>
##$CPDPRG6= <mlev>
##$CPDPRG7= <mlev>
##$CPDPRG8= <mlev>
##$CPDPRGB= <>
##$CPDPRGT= <>
##$D= (0..31)
0 1.2 0 0 0 0 0 0 0 0.06 0 0.03 0 0 0 0 0.0002 0 0 0 0 0 0 0 0 0 0 0 0 
0 0 0 
##$DATE= 1730282095
##$DBL= (0..7)
120 120 120 120 120 120 120 120 
##$DBP= (0..7)
150 150 150 150 150 150 150 150 
##$DBP07= 0
##$DBPNAM0= <>
##$DBPNAM1= <>
##$DBPNAM2= <>
##$DBPNAM3= <>
##$DBPNAM4= <>
##$DBPNAM5= <>
##$DBPNAM6= <>
##$DBPNAM7= <>
##$DBPOAL= (0..7)
0.5 0.5 0.5 0.5 0.5 0.5 0.5 0.5 
##$DBPOFFS= (0..7)
0 0 0 0 0 0 0 0 
##$DE= 6
##$DECBNUC= <off>
##$DECIM= 24
##$DECNUC= <off>
##$DECSTAT= 4
##$DIGMOD= 1
##$DIGTYP= 9
##$DL= (0..7)
0 120 120 120 120 120 120 120 
##$DP= (0..7)
150 150 150 150 150 150 150 150 
##$DP07= 0
##$DPNAME0= <>
##$DPNAME1= <>
##$DPNAME2= <>
##$DPNAME3= <>
##$DPNAME4= <>
##$DPNAME5= <>
##$DPNAME6= <>
##$DPNAME7= <>
##$DPOAL= (0..7)
0.5 0.5 0.5 0.5 0.5 0.5 0.5 0.5 
##$DPOFFS= (0..7)
0 0 0 0 0 0 0 0 
##$DQDMODE= 0
##$DR= 18
##$DS= 0
##$DSLIST= <SSSSSSSSSSSSSSS>
$$ [...]
##$SUBNAM2= <"">
##$SUBNAM3= <"">
##$SUBNAM4= <"">
##$SUBNAM5= <"">
##$SUBNAM6= <"">
##$SUBNAM7= <"">
##$SUBNAM8= <"">
##$SUBNAM9= <"">
##$SW= 24.0689170037331
##$SWIBOX= (0..15)
0 0 2 0 0 0 0 0 0 0 0 0 0 0 0 0 
##$SW_h= 4816.95568400771
##$TD= 16384
##$TD0= 1
##$TE= 0
##$TE2= 300
##$TE3= 300
##$TEG= 300
##$TL= (0..7)
0 120 120 120 120 120 120 120 
##$TP= (0..7)
150 150 150 150 150 150 150 150 
##$TP07= 0
##$TPNAME0= <>
##$TPNAME1= <>
##$TPNAME2= <>
##$TPNAME3= <>
##$TPNAME4= <>
##$TPNAME5= <>
##$TPNAME6= <>
##$TPNAME7= <>
##$TPOAL= (0..7)
0.5 0.5 0.5 0.5 0.5 0.5 0.5 0.5 
##$TPOFFS= (0..7)
0 0 0 0 0 0 0 0 
##$TUNHIN= 0
##$TUNHOUT= 0
##$TUNXOUT= 0
##$USERA1= <user>
##$USERA2= <user>
##$USERA3= <user>
##$USERA4= <user>
##$USERA5= <user>
##$V9= 5
##$VALIST= <valist>
##$VCLIST= <CCCCCCCCCCCCCCC>
##$VD= 0
##$VDLIST= <DDDDDDDDDDDDDDD>
##$VPLIST= <PPPPPPPPPPPPPPP>
##$VTLIST= <TTTTTTTTTTTTTTT>
##$WBST= 1024
##$WBSW= 4
##$XGAIN= (0..3)
0 0 0 0 
##$XL= 0
##$YL= 0
##$YMAX_a= 281865
##$YMIN_a= -245520
##$ZGOPTNS= <>
##$ZL1= 120
##$ZL2= 120
##$ZL3= 120
##$ZL4= 120
##$ABSF1= 10
##$ABSF2= 0
##$ABSG= 5
##$ABSL= 3
##$ALPHA= 0
##$AQORDER= 0
##$ASSFAC= 0
##$ASSFACI= 0
##$ASSFACX= 0
##$ASSWID= 0
##$AUNMP= <proc_1d>
##$AZFE= 0.1
##$AZFW= 0.1
##$BCFW= 1
##$BC_mod= 2
##$BYTORDP= 1
##$COROFFS= 0
##$CY= 11.3945322036743
##$DATMOD= 1
##$DC= 2
##$DFILT= <>
##$DTYPP= 0
##$F1P= 15.6554695791079
##$F2P= 12.8336369535428
##$FCOR= 0.5
##$FTSIZE= 0
##$FT_mod= 4
##$GAMMA= 1
##$GB= 0.15
##$INTBC= 1
##$INTSCL= 1
##$ISEN= 128
##$LB= 0.24
##$LEV0= 0
##$LPBIN= 0
##$MAXI= 10000
##$MC2= 0
##$MEAN= 0
##$ME_mod= 0
##$MI= 1.114404
##$NCOEF= 0
##$NC_proc= 0
##$NLEV= 6
##$NOISF1= 3.799351
##$NOISF2= 2.8
##$NSP= 1
##$NTH_PI= 0
##$NZP= 0
##$OFFSET= 15.70392
##$PC= 1
##$PHC0= -26350.96
##$PHC1= 13.58743
##$PH_mod= 1
##$PKNL= yes
##$PPARMOD= 0
##$PSCAL= 0
##$PSIGN= 0
##$REVERSE= no
##$SF= 200.130013532006
##$SI= 16384
##$SIGF1= 3
##$SIGF2= 2
##$SINO= 400
##$SIOLD= 16384
##$SREGLST= <1H.CDCl3>
##$SSB= 0
##$STSI= 0
##$STSR= 0
##$SW_p= 3612.71676300578
##$SYMM= 0
##$S_DEV= 0
##$TDeff= 0
##$TDoff= 0
##$TI= <>
##$TILT= no
##$TM1= 0
##$TM2= 0
##$TOPLEV= 0
##$USERP1= <user>
##$USERP2= <user>
##$USERP3= <user>
##$USERP4= <user>
##$USERP5= <user>
##$WDW= 1
##$XDIM= 8192
##$YMAX_p= 0
##$YMIN_p= 0
$$ End of Bruker specific parameters
$$ ---------------------------------
##NTUPLES= NMR FID
##VAR_NAME=  TIME,          FID/REAL,        FID/IMAG
##SYMBOL=    X,             R,               I
##VAR_TYPE=  INDEPENDENT,   DEPENDENT,       DEPENDENT
##VAR_FORM=  AFFN,          ASDF,            ASDF
##VAR_DIM=   8192,          8192,            8192
##UNITS=     SECONDS,       ARBITRARY UNITS, ARBITRARY UNITS
##FACTOR=    0.0002076,     1,               1
##FIRST=     0,             0,               0
##LAST=      1.7004516,     0,               0
##MIN=       0,             -245520,         0
##MAX=       1.7004516,     281865,          0
$$ Real data points
##PAGE= N=1
##DATA TABLE= (X++(R..R)), XYDATA
$$ [...]
2366a859J584R74N33j54k181p52J717J098N6o20k186p6K509L42j69j132j401J219
2384d98J621J26p70j278q63J630J717r25j056p34l42J868J215r97j677m23N84
2401h02J815O24j632j414K81J033J411M0j811j062J005J025Q17n51j725l98J195
2418a49J176J18r79j791K75J669J236k27j486j348Q48J639L62p72j739l52J533
2435A3J213P1j400j253M94J193J384j274j046q05Q21J721L33j107j702J67J115
2452f2J486Kj984r81N80J743Q32j018j903k68J273J435N7j141j580O9J897J076
2470A513m06j307j262J129J312M54q67j503n69J130J594K21j393j514j8K133J031
2487A678q69j827k10M90J777L52j177j671M47J296Q64L76j837j205N25J322J049
$$ y = [-1859, -275, 699, 1232, 1078, -1103, -1855, -138, 960, 1016, 396, -1790, -1866, 643, 985, 816, -316, -1717, -498, 1123, 1249, 479, -799, -1662, -32, 1685, 760, -296, -1030, -1372, 496, 1711, 714, -963, -1386, -802, 1013, 1637, 5, -1409, -1128, -95, 1316, 1356, -455, -1517, -512, 513, 1330, 779, -946, -1344, -149, 1027, 1145, 166, -1625, -1350, 319, 1555, 1328, -158, -1506, -658, 981, 1343, 571, -1168, -1520, 13, 1226, 1297, -103, -1356, -862, 331, 1715, 441, -605, -1410, -589, 1132, 1465, 358, -1344, -1177, -62, 1424, 1426, -558, -1539, -959, 784, 1616, 598, -1305, -1573, -300, 1135, 1192, 51, -1529, -1460, 437, 1513, 1107, -200, -1462, -333, 979, 1433, 566, -937, -1506, -376, 1218, 1439, 46, -1468, -1486, 647, 1678, 809, -1018, -1228, -738, 1039, 1391, 214, -1457, -1010, 286, 1150, 1526, -311, -1516, -991, 331, 1380]
2504A380m04j828o12J182J243L08r69j767K52J781N70n80o29j438M43K305n8q41
2522C38j080p09R66K050p18r22r95j97J599J507j010j768l60L01J701J336j931
2539A08j510J89R35J359N97k223j182J109J169N66k55j696q51J497J346J93j028
2556C23j979K26J632J188k70j520r24K47K203N08j037j179q29J363J210O4j222
2573Dj253J14J853N28o36r02j012O03J817K62j506p29o17J414J588o06j436k06
2591g20l12J246J768j372k239R19M57N20J889j979k152J727L63P36J112k160j848
2608b045K331N46o7P09k548j269K734Q71q50N21j850j180L287K31j380L85j928
2625a502J43K916M3k209j62k40k0K835n62k418J47N23K91J958p27k571L13R98
$$ y = [1380, 976, -852, -1464, -282, 961, 1269, 300, -1467, -1215, 566, 1136, 556, -73, -1511, -1068, 1237, 1179, 338, -742, -1451, -485, 1565, 847, -75, -1070, -1267, 332, 1839, 829, -939, -1299, -998, 703, 2039, 108, -1402, -1213, -278, 1081, 1678, -545, -1727, -618, 551, 1117, 862, -834, -1685, -188, 1158, 1351, 323, -1656, -1430, 202, 1390, 1120, -400, -1324, -1077, 1126, 1634, 597, -582, -1411, -48, 1162, 1226, 4, -1249, -1135, 718, 1246, 610, -292, -1304, -701, 1116, 1378, -128, -857, -1474, -60, 1528, 922, -514, -720, -1032, 214, 1982, 610, -1629, -710, -253, 267, 2156, 177, -1975, -248, 115, 851, 1963, -197, -2045, 286, 832, 765, 1474, -1074, -2343, 391, 1262, 412, 933, -917, -2097, 1190, 1421, 41, 426, -1502, -1359, 1557, 1600, -609, -771, -1011, -1031, 1804, 1242, -1176, -1029, -506, -215, 1743, 1016, -1555, -1242, -244]
2643b44O06J234j261k001Q52J102N58K80j335j251Q17J599K27o45j490n30J155
2660c27J648j28j001j399J89J197R86j37j716j188J700J053n3k44j523q98K334
2677D93O50q74P0j574k84K544M56j278j01j479l0L243j54k735Q82n91k41L074
2695B071p93k589P28j40J33K644j141l110J749P85k77K110j542l193K086J318
2711H39j149J823j195l092K623J570j484R46j113j844K365J778j860J11j159q20
2727a661K393J220k511m6K57r37K528O61k356l81j85L35K024r7k067l82O83Q49
2745C27J131q18j613l36P63J554N26j933o95l02J766J230o57j678n43J000Q07
2762E29J175j140k293J067Q15J77Q19r94j956J595J076o83J041j629j691K135
$$ y = [-244, 362, 1596, 335, -1666, -814, 288, 846, 1126, -209, -1460, -643, 956, 1183, 538, -952, -1482, -327, 1321, 1193, 192, -1207, -1018, 179, 1165, 1028, -688, -1876, -176, 877, 824, 580, -943, -1841, 493, 1143, 269, 339, -1235, -1519, 1025, 1481, 203, 102, -1377, -1407, 1836, 1682, -1053, -171, -762, -1003, 2071, 1278, -1311, -583, -723, -590, 2054, 913, -2197, -448, 337, 60, 2170, 628, -2565, -479, 839, -310, 1513, 318, -2774, -151, 1419, -65, 881, -232, -2076, 289, 2067, 207, 318, -841, -1661, 732, 1952, -559, -605, -348, -1285, 1243, 1904, -452, -833, -1018, -683, 1341, 1244, -823, -1205, -522, 327, 1458, 640, -973, -1309, -546, 1008, 1534, -399, -1094, -1396, 370, 1600, 943, -735, -1278, -278, 529, 1704, 564, -1729, -662, 153, 330, 1149, 155, -1801, -206, 870, 187, 1228, -401, -2092, 43]
2778D3J544j606P34q71k306K979J666k475N19n25j718K857J184k554K75l62q39
2795a455K817P52l071o0Q93q73K476O06l965R61J320p97J955q16k915J264J845
2812I37p93R32n46k196J210J577o77l0n59j372J314J643j134jn21j180J456J481
2830A541q43j054o22p6J581J101j348q10q61N74J928K23j591o30k09J314J436
2847A654j377r96m70L91J937L86j589m40m17L15K030K9k262k54J005j23J674j13
2865A380l122P21J614m80J262o74k719J086J796m57P72o98k574J243K075j165
2881F0O88r25k202J792K263j272o28l28j369K410J594k083o38L87j223K154J766
2898B446l016l70P09n07K026L83k549j03Q32J86J321m4k383k42J457J98R80o40
$$ y = [43, 1587, -19, 715, -156, -2462, 517, 2183, -292, 227, -298, -2016, 841, 2025, -529, -254, -616, -1455, 1362, 2114, -957, -1017, -124, -997, 1479, 2085, -1880, -919, 401, -396, 1559, 743, -2172, -908, 937, 144, 1076, 530, -1666, -456, 1121, 444, 414, -145, -1517, -203, 1440, 306, 305, -216, -1396, 60, 1541, 698, -356, -978, -1054, 527, 1628, 280, -530, -1391, -817, 1111, 1334, -257, -887, -1096, 218, 1654, 277, -719, -1189, -798, 1139, 1525, -64, -504, -921, -606, 1424, 1453, -809, -1063, -58, -181, 1493, 1380, -1742, -1021, 593, 113, 1375, 701, -2018, -932, 864, 407, 1179, 481, -2093, -850, 1225, 60, 748, -177, -2379, -587, 1676, 404, -224, -552, -1921, 489, 2083, 0, -638, -251, -1474, 680, 2446, -570, -940, -231, -738, 1288, 1671, -878, -981, -149, 37, 1358, 1314, -1069, -1311, 146, 344, 1324, 684]
2916F84k210M41J482J80K58q41j562Q45J815J77l61j676q46J860R97j31j054j225
2934a167mJ780P70j066o13j202O85J799n2l69j287j148J791J716r48j120m29m68
2952a332J867J526k089r70L28K0J424J285k476p22N74M88J105N29k678m04J415
2969a10P9P48K97k411L33J507K09K78l73k145K46K114Q9k3n84j884Q57K374n67
2988A034q57o43j084J413J702j257p67j63p10J662J252j450q50j2j73J774N06
3005A377j333j291O95M07J437l40j689l66J003N92Q01r88j356j25J334O11N86
3022A355j427r82L47O96P89J98j337j233J441Q44K10m29j440n94J404J122J9q44
3040A39j777P89J806K94j026r89m5K23J961o70p89p88l75J217J655n35j816j37
$$ y = [684, -1526, -1085, 397, 577, 835, -6, -1568, -723, 1092, 1269, 908, -768, -1614, 246, 1243, 1112, 58, -1167, -1171, 609, 1379, 313, -300, -1502, -817, 982, 930, 561, -726, -1874, -83, 1633, 685, -435, -864, -1332, 535, 2061, -28, -998, -670, -650, 774, 2059, -417, -1139, -565, -77, 1028, 1557, -1121, -1525, -110, -31, 717, 1014, -1397, -1064, 443, 652, 930, 557, -1588, -1342, 772, 861, 838, 254, -1630, -773, 1601, 1034, 177, -466, -1550, -137, 1565, 308, -459, -622, -1332, 330, 1582, 132, -718, -730, -903, 871, 1377, 44, -1247, -552, -145, 1292, 952, -737, -1103, -100, 492, 1293, 305, -1051, -1176, 158, 769, 1355, -72, -1054, -707, -11, 778, 976, -361, -1594, -153, 691, 901, 472, -968, -1562, -158, 964, 983, 139, -1638, -849, 957, 1251, 225, -764, -809, -586, 1375, 705, -84, -872, -1247, -30, 1625, 1090, -726, -863]
3058h63n7J451P50p74j639L7N95J476M82j751j108Q86L88J266J43k184m44R18
3076d28R04O18r04j454L2J437R53j22j033j426N28J288Q49o16j163p20J052J527
3094A322k99p79j311p1J257J329n75j102j045M49J523O24j053j202k06O23J374
3111H58N07j520r67j1J148J215o10j289k98L43J671J56r01j224R0R47J189J40
3129A444j826r13Q49Q88O57n31j176m66J046R26O2p16j411O6J497Q40n02j263
3147e29r63P31J726K82p94j289m00J168J069j94r71j163O37J248P90m57j354n47
3165a010M80J428j65p03r82l75J266J295J29j454j390N37J533M12o72j259m74
3182a404R35J681j46j285m17l95J346Q96n56r68o86L73J061J044j311q85j84M62
$$ y = [-863, -920, 531, 1281, 507, -1132, -1095, -500, 976, 1458, -293, -1401, -515, -127, 1139, 1282, -902, -1346, -428, 476, 1094, 190, -1264, -1232, 205, 1158, 1036, 3, -1423, -895, 393, 1242, 626, -537, -1257, -205, 1322, 1023, 244, -1067, -1138, 119, 1448, 873, -229, -1274, -825, 698, 1322, 269, -933, -1139, -516, 858, 1365, -155, -1122, -1133, 15, 1230, 620, -669, -967, -624, 1047, 1203, 302, -922, -832, 115, 1304, 1444, -382, -1295, -446, 442, 1099, 568, -608, -1074, -28, 898, 960, 244, -1167, -1101, 396, 1236, 734, -529, -1492, -761, 965, 1247, 453, -836, -1236, -68, 1001, 807, -164, -1327, -690, 558, 1348, 891, -463, -1010, -530, 898, 733, 30, -952, -1327, -61, 1234, 1363, -91, -1481, -944, 589, 1001, 329, -930, -1404, -469, 1212, 1066, -219, -636, -1031, 315, 1211, 655, -313, -999, -626, 435, 1479, 168, -717, -901, -439]
3200d39J466n5j058j130M16Q87O17J26j771n64J570Q01J67n48j512l41J539J103
3218A274q79m34q85K66J505L79q31r28l72M70J590J94j517j134L64J357P74n21
3236F72j253m59P25J130K38n22j201n70J266P80K82r62j182J20J183Q03p04j165
3254h19k24L41J516N11j330j311O27M79J547L4k074q43J596K82N39K48k522L07
3272a096J676M41j19o68j672K43K114j22n21j20j164L04J919m90r27j39p66N43
3290e64K245r90j803M44k07J024J807j499j347m1N51M48J270r31j715P12P91K16
3308D11P82j410j605J297J499k66lj357p98J538J390r51n82p66l44J508R02j391
3326a46o85J45K41Q68P47j227q07L11N45P93N49j383r73M88J016L79j86r17j292
$$ y = [-439, 1027, 972, -86, -1216, -800, 87, 704, 830, -941, -1505, 65, 866, 1033, 485, -1027, -1368, 171, 1274, 395, -39, -924, -658, 847, 1226, 395, -533, -905, -435, 1155, 1349, -168, -1302, -938, 419, 1193, 672, -581, -1040, -315, 815, 1053, 531, -670, -1240, 26, 806, 1088, 126, -1056, -936, 247, 1050, 346, -819, -1043, -702, 814, 1325, -5, -1316, -689, -210, 1337, 1371, -703, -1546, 50, 332, 871, 1119, -1403, -1096, 580, 1021, 902, 234, -1438, -1195, 919, 797, 276, 156, -1008, -704, 1215, 725, -202, -341, -1107, -564, 1681, 691, -1112, -668, -875, 149, 1956, 457, -890, -931, -380, 68, 1338, 407, -1308, -596, 195, 411, 1193, -217, -1822, -525, 974, 708, 705, -652, -1450, 88, 1478, 527, -55, -821, -1165, 343, 1245, -146, -831, -686, -445, 423, 1170, -57, -864, -553, -8, 785, 1334, -49, -1022, -534, 482, 861, 675, -242, -1534]
3345a534J372J217k63o73j056m63J430J598j163j034n46J26J539J164j608j370
3361a264O97L30J078O63k042q92J439J74M58M50j960p83J917K43m1K46j442j101
3379a830K438M30q45O3j121n10K228J22j241J45r78J11K204j92j208o09L72k20
3397f41J907Jk198n5P06O72R07r17k195R02J482M67m07o21j532P81J863l38o78
3416A06l90o83L95J399J59j244n7o41N94J475o4j449n49K16O50J337l87j849O5
3435i17R51L65Q34p38j744p7J930j80J03p09j398Q20K118m73r35m15p94R57K038
3454A736j012j364L79n08P02J606j297j197M56K79L58J450j214j613Q91N02J33
3471B87R40j318j416J053R04O0K63j206j097J313J213n15j03j182q11J701J394
$$ y = [-1534, -162, 1055, 792, 119, -937, -1400, 30, 1628, 465, -569, -1115, -989, 550, 1714, 106, -1264, -567, -237, 841, 1504, -538, -1430, 9, 183, 641, 1091, -869, -1652, 265, 508, 467, 713, -729, -1830, 608, 1038, 193, 256, -865, -1375, 853, 975, -266, -121, -1099, -988, 1216, 1024, -184, -793, -421, -641, 1266, 1267, -931, -986, -280, 392, 1299, 382, -1813, -911, 571, 1038, 631, 10, -1522, -741, 1122, 784, 106, -284, -967, -572, 827, 986, -258, -315, -956, -362, 1113, 1049, -400, -949, -733, -83, 1254, 867, -982, -917, 34, 399, 1233, 495, -1249, -1326, 604, 424, 527, -182, -1580, -760, 1358, 885, -50, -465, -1259, -302, 1736, 724, -640, -261, -769, -67, 1539, 242, -955, -499, -220, 138, 1588, 374, -1239, -348, 154, 287, 1227, -91, -1507, -454, 450, 510, 773, -433, -1530, -217, 996, 481, 378, -804, -1615, 86, 1480]
3488A480q86j250j01k0J573M10j339j130P75N90L52R62k099n67J228L13J94K42
3506G27j327m21R84R94q4k34j323m27J321J055j050k29o98k55J575O04j349m88
3524f25j03j72J442N11j240p40M02N56Q37m3j420n72R79P45J01m1k029L16J540
3543D44J52j8q73q49K98J773J30r90k55n69o9J627J1r13m80N3j62J372J37j483
3563f64k73N54L33J081p59j067m3Q68O89J80m37j724M19J323M12l06p57o96O26
3582b41R96K00j190k43j76P30Q45k69j181j95K15P71O46m05j710K61J012J48O56
3601H70p57j322P37P45J04K43o71j167N99J287K42p57l36p58P70J124j65n77q13
3620f02k11R95R38q99p68k89O33Q74N22j005j135M59L83Q88J83j493l11R97K07
$$ y = [1480, 594, -656, -757, -777, 796, 1206, -133, -1263, -488, 102, 454, 1416, -683, -1250, -22, 291, 485, 727, -600, -1021, -37, 957, 873, 639, -684, -1111, 210, 1265, 215, -14, -712, -967, 608, 1212, -137, -625, -728, -900, 542, 1053, -187, -927, -525, 31, 868, 825, -595, -1167, -188, 557, 658, 617, -1412, -1096, 444, 596, 578, -295, -1144, -846, 927, 1057, 67, -188, -757, -826, 801, 812, -101, -581, -528, -690, 682, 819, -664, -937, -383, -50, 1031, 272, -795, -838, 30, 719, 899, 462, -1262, -843, 480, 892, 586, -171, -867, -241, 755, 955, -235, -478, -654, 76, 921, 652, -529, -724, -509, 262, 908, 503, -1207, -946, 66, 214, 870, 113, -1209, -472, 273, 377, 620, -51, -1218, -619, 668, 910, 153, -183, -941, -171, 953, 788, 211, -602, -813, 182, 1120, 221, -547, -836, -203, 671, 1193, 188, -947, -488, -105, 783, 966, -527, -838, 159, 366]
3639C66N11k12j225m76J198N60O3o94p20P1M91Q10k00p48q57M88J025N46o44j252
3659h99J08O53J063k58q91o12N08O46N2J81j091l17N12J233j18r60n33q9R29Q86
3679A003k14j014n20m7J114N67r21o21j88O46O85L27j267p17Q40L38R55q5j398
3698e17o80R97N70K88l27j214j69J199M90R3r28q46L76J036L69n05n05o43N05
3717d11J138k26p91l42K50O89L39l41p30j07j36J413J15q35n49k10M43J130l57
3736D82o08q05N14P63L81o8j198l41O90R03L35r84j044J41J100N37j59q59p65
3755i85N57P24O33m76r71k67L90Q91K16o61p35k02J107O33m94n55o17J49R95N04
3775H36p26m58j35K48J112l10m27r94L07P41P16m96q21j32J44R30M16q41p00k14
$$ y = [366, 877, 665, -560, -1036, 162, 722, 785, 91, -629, -558, -67, 743, 543, -205, -1062, -574, 451, 997, 353, -899, -791, -138, 925, 667, -224, -836, -328, 318, 370, 551, -540, -857, -345, 888, 770, -190, -723, -812, 117, 1003, 789, -225, -745, -792, 322, 889, -32, -653, -841, -195, 490, 817, -450, -1167, -327, 11, 966, 881, -517, -1197, -200, 370, 658, 331, -883, -1052, 147, 637, 730, -198, -1044, -668, 368, 737, 232, -273, -916, -411, 727, 501, -290, -632, -382, 307, 646, 305, -425, -532, -668, 745, 860, 25, -524, -734, -291, 839, 482, -126, -931, -417, 346, 727, 659, -539, -880, -190, 713, 1048, 64, -980, -839, 261, 798, 639, -220, -985, -428, 296, 929, 453, -518, -785, -395, 496, 712, 51, -684, -886, 221, 854, 360, -195, -812, -663, 332, 836, 110, -348, -483, -235, 877, 567, 140, -854, -547, 194, 910, 414, -407, -539, -395, 535, 951, 110, -590, -804]
3795h04J045L08M0n24p61J11O57M52j12o86o47J051M18j39j56j062J26J141K83
3814G41k44r61m07L97J165p2p38l63l82O79J155k79o65p82J59O86Q57l48j315
3833g17l5N91P63J87m30j327M33K48Q00qp28n66L64Q57L39o32p93r2N60P67r0
3854D91n94n95j5J187M23l93q54l93N03O65L11l62p72q10R22R45j99n32q89N78
3874c83J053J47m31r59m86O01J009n7m72r52J63Q66Q02m76p89m65M08O01O28m45
3894C63q35k30N03O95j4m47p76K93R76N1l0q49p45R38R21j21n92m86m80Q54R07
3915H96j66j286J62n27Q87J049p03r09l8M21Q21M52r22p89R7N68K69O16j171o50
3935i23N49O11j03N08j272n57J226N85k93J9p43m43J045N20p36O1p90R9J326k5
$$ y = [-804, 241, 549, 589, 65, -696, -585, 72, 524, 412, -274, -921, 130, 548, 409, 253, -809, -683, 458, 741, 497, -464, -871, -474, 691, 619, -119, -482, -864, -185, 970, 691, 26, -756, -597, 89, 946, 598, -717, -752, -161, 602, 789, 359, -968, -535, -287, 513, 505, -223, -789, -425, 432, 771, 139, -654, -746, -186, 581, 491, -103, -698, -713, 474, 897, 504, -350, -743, -240, 425, 736, 374, -398, -1208, -286, 659, 460, -72, -961, -383, 670, 817, 386, -573, -1059, -458, 551, 494, 22, -930, -767, 99, 901, 425, -364, -829, -421, 180, 808, 363, -472, -702, -199, 496, 482, 35, -741, -448, 528, 579, 549, -300, -1045, -107, 814, 693, 101, -385, -865, -11, 896, 730, -556, -394, -921, -34, 1015, 312, -597, -635, -214, 607, 1059, 137, -652, -555, 13, 282, 898, -273, -923, -374, 237, 134, 642, -630, -1187, 39, 624, 331, 350, -393, -836, 209, 729, -7, 54, -736, -637, 689, 664]
3955F64o93m81j68K83J312m39q69k43J86O73M82l63j223L49L60N99J8l55r47M95
3975c60Q22J89k66l20p27L83O19K45o42k65l15N95N79L76j123n84M24M96L20N20
3995I66j560l24J217N7j17L16j499M11Q23L99l39k59n15k22J457J48j124K8m89
4014f26M53J097m21r82O42p08K44J532p79p18N33o92P8J294n07j251O21m8J1J230
4034A003p39j271J013M39l30P06q66j318J183Q65j94l1j048j94Q64P02m34p71
4052d21j12M9R08K16p49n32M06L0P87k26m96n00P01n7N78j19r22j98O40M68J78
4073F29o48l30k43K34J173m49l15k74n63Q24P81o05m82j69J72N62Q42j310p86
4092i57O91N14K05K19j087o90J447M89m80L00q74j035J609J04o12M32o04n49J401
$$ y = [664, -29, -510, -678, -395, 917, 478, -391, -634, -448, 225, 707, 344, -879, -530, -170, 429, 447, 92, -855, -360, 462, 651, 385, 65, -662, -279, 340, 585, -57, -322, -637, -42, 537, 913, -210, -794, -370, 126, 446, 966, -594, -918, 299, 356, 239, 555, -944, -533, 290, 689, 350, 91, -424, -646, 811, 959, -165, -137, -626, -173, 924, 503, -479, 163, -545, -301, 1231, 452, -266, 267, -425, -347, 947, 440, -811, -190, -238, -227, 1003, 264, -1007, 6, 445, 115, 821, -45, -1363, -180, 685, 491, 460, -588, -782, 82, 784, 350, -421, -533, -484, 424, 640, -109, -641, -235, -205, 582, 356, -140, -640, 61, 4, 582, 463, -459, -657, -17, 451, 629, -19, -349, -592, -358, 815, 366, 51, -223, -786, 38, 819, 214, -268, -437, -265, 297, 1139, -171, -957, -266, 248, 453, 672, -415, -1105, 342, 831, 351, 651, -223, -1258, 351, 455, -157, 275, -329, -878, 523]
4111E23K8r16L95k21p71J733M4j022K79l05n86J773K9j628L46K34j48Q07M0j229
4131e95M53L61k17Q59o32j012M61N20K07o3n57n02O45R93p53rk6r68J205M55o10
4152B15k67j82k64P77O28p39m74o0J26J92K79N5n57j98M22N41l02j96k70l44J128
4173E10Q0n25oo32M2J387j15r23m23L66J81Q42p8j121J9M88k64O55k73j080R53
4194H3m2J33M49p25q54Q15N58k57L71o64p73R32M44m29J93m92n87Q87N32o16M50
4215D08q04m83J540k57l64j59k63j58R54J44j220L63r3L50O48J85j328J57K72
4234a08J40N12k93o83j35J105m01k7L4p30L27M37K90l25m25l18K11Q21R3n80j63
4255b18l32O78M03J2o06n02M06N80J99l77p02l60O43Q34k44k47p60j5R15M07p91
$$ y = [523, 551, -365, 30, -191, -962, 771, 815, -207, 72, -233, -819, 954, 983, -645, -299, -65, -213, 594, 634, -595, -142, 219, 2, 861, 229, -783, -322, 198, 405, 342, -215, -717, -72, 921, 168, 159, 133, -835, 370, 825, 215, -52, -234, -498, 279, 907, 168, -306, -366, -240, -48, 231, 286, -271, -469, -47, 494, 192, -4, -274, -618, 510, 590, 65, 59, -573, -531, 856, 741, -182, -605, -239, -58, 784, 706, -415, -396, 92, -172, 483, 210, -870, 83, 41, 174, 623, -102, -956, -141, 417, 160, 531, -133, -906, 26, 470, 41, 234, -258, -845, 42, 574, -42, 408, -396, -879, 661, 404, 40, -119, -382, -540, 414, 558, -662, -299, -392, -42, 606, 791, -537, -380, -108, 32, 544, 251, -432, -567, 538, 137, 110, 144, -586, -259, 178, 468, 143, -282, -600, -389, 432, 525, -55, -218, -550, 128, 531, 543, -63, -565, -159, 421, 620, 243, -459, -819, -176, 658, 414, 167, -593, -608, 307, 714, -77]
4276g7m1m4l78P83L31o80m19J54j48Q52M15j130O6L10o5P22j62j021QO10j44P81
4298G23m15q50J34O13M6J59l19o43QJ266k60m8p54m88O99N30j25k29k44l11L63
4319a45N12l54n25K76k40Q08M08r08l98J42K71M41J6n13k87L62N15k84O8n83P7
4340c41L10L62Rl10j93j83K81P32k48m31n78N19J92K87m84l63J10M63O5J25l51
4361b7m19Q4O47K02l48o06j22M05Q26k23k22n45QM47M78k19n01k50j33J023j01
4382D04j25n63K15J89J5M11p48j61K90j47L58K8p65J94K04L49M02l97m66R3L33
4403A13M43l41j4m88MQ21l15r0m73PK94J51L81n28k36k18P70K20j25k00l77j48
4425c49M72O17k85p10j41J55Q32m61K2o04L53O25l66J0q39J41K57M63O2K72p69
$$ y = [-77, -118, -162, -540, 243, 574, -106, -525, -371, -519, 333, 748, -382, -316, -6, -71, 651, 489, -532, -524, 86, -58, 723, 308, -542, -408, 205, 251, 410, 91, -552, -544, 722, 462, 414, -340, -828, -129, 401, 276, 47, -197, -508, -145, 367, 13, -512, -236, -476, 332, 740, -168, -566, -424, -153, 288, 304, -209, -496, -134, 381, 97, 165, -418, -341, -31, 331, 340, 30, -163, -346, -65, 667, 419, -12, -590, -71, 121, 408, -76, -439, -329, 134, 199, 324, -27, -446, -362, 285, 487, 139, -467, -589, -184, 642, 419, 197, -348, -340, 107, 585, 366, -135, -385, -518, 505, 404, 279, -284, -69, 120, 135, 546, -202, -363, -73, -220, 138, 166, -599, -405, -201, 148, 550, 153, -313, -220, 113, 556, 215, 201, -287, -283, 538, 223, 133, -340, -333, -39, 112, 493, -35, -271, -489, 281, 501, 376, 176, -201, -349, 123, 740, 455, -255, -396, -241, 591, 130, 152, -452, -99, 526, 160, 170, -669, -528, -271, 192, 254, 526, -243]
4446b43K61k72O91k56l72l05L54K4K58J58k74n13N80L85J13m65n00o2K61N71K9
4467D23l89q09O76L61J41j23o04n3N39K44j42j59k44k17M68K93n52J46m04K8M77
4488A00M63m43k84j03K09N53l01j95o91M58M11K63k84m82M1J58O59l29j39m33
4508c69J61L81J19J24o88k56L23L24K30l63j68l2N9L92j74o2l07P7K29K53P9m28
4530i6j42J96P50p07J32n37L73R1M28l9p56J05r4N72L56n93m78J91N06k49L39
4551C48o85J02K36J57K90l68l56j7J49L36mJ12q01M22K66K48l36Lj88l29P70o2
4573B93k89K43n94K78N59k86k91k76J87M36l38L94p07k9L6N12K73l44m42r6M98
4594A7L45N1m60j3j63N63k12J54m6n00J41N26o44l3j56K19K00L31k12m74o4K34
$$ y = [-243, 18, -254, 437, 181, -191, -496, -142, -118, 140, 298, 24, -489, 91, 476, 589, 124, -376, -438, -177, 394, 423, 34, -775, -99, 262, 403, 280, -324, -377, 162, 406, 264, 105, -139, -356, 112, 405, -147, -1, -405, -377, 100, 563, 120, -164, -267, -58, 495, 194, -1, -692, -234, 177, 440, 156, -326, -285, -127, 532, 203, 64, -369, -208, 173, 292, 416, -272, -528, -205, 119, 349, -14, -182, -214, -155, 237, 63, 1, -306, -229, 0, 253, 332, -96, -238, -42, 708, 1, 133, -404, -31, 60, 488, 449, -307, -202, -296, 276, 632, 39, -439, -248, 258, 9, 348, -337, -235, 1, 158, 448, 80, -276, -293, -144, 192, 188, 300, -501, -79, 187, 435, 99, 102, -86, -415, 355, 293, 4, 247, -347, -69, 490, 204, -87, -363, -176, 260, -78, 316, -391, -420, -384, 128, 401, 57, -385, -481, 17, 362, 413, -47, -60, -223, 340, 128, 282, 236, -264, -123, 403, -241, -274, -430, -211, -11, 320, 108, -366, -430, -196]
4616a96J81N9O9n03m0N04j69L10j15m41J70K6K57L24p06n79P49K10J36j36L0j08
4638C2K3j36K81j70k72K62K95L78r91M63n39j7N57K2k1m04Q2J29J66R0m33J3j04
4661b94L91R9J73q18p3N41J37J12k34l75P0O03n7j47k71oj10N04j48n6m7j44j17
4684b67N32o8k25l11K21N3L10R1k29J30q1n6R9R5l78rM65j42l04N3l05L10K62
4707B46k99m6J38k40J11O32k56m68R3J12l25N02r8k73M0K37o8L12l32p00M94N24
4729C36j22n2K41j008J68K55P94m21l71k42L24L08m72L22q5j40L70j09K79m25
4749e0o2M07k48Q3j58K43L4k68Q1oJ42n44PN74k98K63k51m15M52K65j20K7p3l57
4773b72M3N18j01n84K89l15N48L00n46L4j2O3k0M01n85N2M15l10l1K84l78lL97
$$ y = [-196, -15, 44, 113, -390, -430, 74, -95, 215, 100, -341, -171, -145, 112, 436, -270, -849, -100, 110, 246, 110, 140, 32, 55, -81, 200, 30, -242, 20, 315, 693, -298, 165, -374, -391, 166, 188, 167, -237, -155, -26, 140, 230, -203, -190, -294, 97, 196, 369, -449, -522, 19, 156, 268, 34, -341, -271, 332, 275, 128, -143, -149, -259, 245, 97, 41, -6, -150, -267, 265, 197, -28, -339, -118, -65, 245, 336, 107, 237, 156, 100, 199, 294, -84, -93, 372, 230, -74, -21, -326, -16, 246, -53, -99, 39, -201, -90, 542, 286, -182, -89, 23, -302, 200, 102, -171, -131, 106, 38, 350, 18, -682, -188, 336, 214, 162, 403, -605, -437, -182, 612, 191, -180, -422, -98, 210, -262, 60, -25, -165, 205, 96, 375, -50, -112, 295, 47, 130, -28, 215, 249, -19, 62, 56, 198, -346, -339, 235, -63, 200, -51, -466, -14, 251, 131, 158, 85, -272, -229, 289, 188, -396, -107, -422, 126, 426, -120, -86, -98, -35, -55, 346, -239, -187, 228, -82, -113, 171, -207, -210, 187]
4796A87o0P4j40l83k8L97Q8j73j66K17lJ24K2q2J15k45k01K61J17j10j80p3O5
4819a77O44j12l81k27L31j35L33Jo45R2M39J58r9J18l64j84L03J58l18j70J03
4840a32L54l6r7j20M30m64q6L40J49o23J44K39j71O54l51j19k54j9N0J96m5jj8
4863B0p9n9O68o92J84p8K57j50l4j11j33j24P96m87n5N7j13J88L9l74K09QN0N2
4887C9J92k17M4k14L56l9l9j60k76K59K60j91k29K97m05L80j82J70l2j31J09m6
4909e5L11r7j38m18L58J29K50p6k81k28K81oJ32j60k7nK86J83k89r6Mm92M19J31
4933A16L53o32O4j04K75M03k91l45K29qoN5k43QK09m5K51O9o35K41j53K33J38
4956A82k31j79K33o4J20n1l73L45j43K33M22l37m63K58p1L52j43o1J86k83L66
$$ y = [187, 127, 201, 61, -322, -350, 47, 135, -38, -204, 13, 10, 134, 156, 74, 189, -56, -257, 4, 121, 11, -169, -242, -177, 467, 355, -26, -253, 78, -57, 276, 277, -368, -276, 163, 321, 222, 340, -24, -208, 95, 253, -65, -235, -132, 222, 186, 89, -31, 399, -65, -151, 189, 338, -285, -141, 98, -73, 581, 230, 111, -143, -162, -112, 84, 39, 38, 20, -59, -118, 550, -142, 42, -36, 221, 71, 37, -74, -207, -331, 465, -22, -77, -20, -133, 55, 94, -280, -71, -63, -13, 39, 231, 14, 58, -156, 200, 161, 122, -38, -314, -55, 205, 14, -215, 82, -323, 57, -125, 45, 13, -118, -9, -55, 256, 159, 21, -397, -39, 90, 340, 264, -17, -245, 36, 30, 162, 2, -25, -30, 256, 439, 150, 54, 58, -434, -15, 116, 469, -163, -99, -203, 72, 475, 184, -161, 68, 60, 54, 109, -134, -126, 83, 38, 289, 358, -277, -36, -189, 44, 182, -49, -228, 5, -59, 61, 10, -363, -18, -161, 72, 494, 157, -306, -48, -119, 233, 90, 29, 215, -68, 298]
4977B98n4j33q5o4Q5J60k7m23o0K39m9O6j34R4l9j65L10J46n4j53j07J88J47k67
5001h1J74l14J7M33k65L3K2r8K03l3M1k15L7k40L11NN2j5j21J48j81N5j18M2J84
5026G6J63R5l23M1j24K6j19K94k60J8L04o4q0J3K23m12j03L14M6j65r0J4R8J10
5050I5l36J36q5L77j15r3J44r5J00j13j67K01j32l4K28J9K26o10K84m2J04j48
5072e6J77M3j02j68P2j3K18k27M7P5o4K74j04j28p9L8k57K77j70K75M9l11J46
5095A2Q5rP9O2Ol61J61P5j36kJ87K8N4q6k19j2Q7j86K67j48Mk9o3J29j42L4L6
5122h7J02R3k7N7l03N5j3O9P2k59J59M39n83M25l11K6P2n3R4j33J97j41n6Q8J9
5147Al6O9J72l01J45j72J10J88k98J8K7K9k69L74p9o1K17j91k20M45r2k8p5j55
$$ y = [298, 244, 111, 26, -38, 47, 207, 180, -243, -303, -64, -113, -47, -181, -87, -126, -291, 19, 165, 111, -42, -149, 39, 186, -81, 93, -221, -204, 229, -36, -3, 19, -79, 124, 91, 132, -83, -46, -286, 25, 30, 82, 67, -54, 94, -87, -32, -150, -108, 76, 239, 334, 11, 52, -72, -46, -165, 129, -131, -113, 191, 127, 47, 60, 283, -129, -232, 82, 128, -37, -127, -113, -15, 95, -241, -105, -190, 187, 72, -21, 123, 28, 128, 15, -152, 49, -83, -117, 111, 130, 356, -254, 30, -12, 92, -56, 121, 164, 62, -106, -34, -47, 171, -56, -9, 66, 2, 276, 172, 44, -35, 3, -254, 23, -147, 128, 177, -134, 12, 97, 88, 167, 229, 235, -126, 35, 110, -26, -28, 159, 187, 241, 155, -64, -76, 11, -175, 92, -56, -52, -81, -144, -15, -157, -123, -87, 15, 108, 81, 138, -165, -110, -123, -54, 18, -241, -82, 357, -226, 199, -112, -86, -14, -67, 27, -106, 91, -50, -106, -18, 1, -35, 34, 206, -95, 50, -122, -12, 176, -122, -104, -77, -48, -317, 57, -22, -83, 134, -57, -277, 168, 76, 48, -27, -182]
5171a82J53L50m87j11N05P3l62K41k28K20j02j58J77l6O3l72J13J93k48K97q6
5192A3j09m6L52m21K55j34N3j19K25l8j57L11l06J70j82K62r4j17K71j81q5N1
5214b6P9j23K04m6j18j55J03J59k05L99l46K70j82oJ94n76J84J43j69J36K04k0
5236A03k03kq1N01k03n7lK59n67K27J09l01J72k03N74m98P4l0J62j43P1Nj88K07
5260a5o2j59K38M7K7k86L32R9l85L31j48l2K08K84m60k2j28L03m08L89l12J49
5282a0p8J13J99j11K01m29J89O8P1j41l66K7L25k4p8k09q7L20K30o1l56O3k09
5305c53K89O7J10Nq6j35J31k07K42k32p0L60P4k41KK01k44R6Q9M4J46l43M7K2
5329A4M82l71j21j8p3K55pm06K2M71lk44q3k04K43J51n2M5qj3R3j77K61m26o7
$$ y = [-182, -29, 321, -166, -277, 228, 301, -61, 180, -48, 172, 70, -88, 89, 53, 116, -256, -143, 50, -198, 99, 13, -96, -142, 210, -211, 44, -90, -37, -156, 69, 31, -126, 185, -121, 49, -133, 129, 35, -82, 189, 8, -77, -26, 53, -70, 134, 88, -30, -185, -82, 77, -128, 271, -75, 195, 13, 7, 201, -375, -191, -48, -217, -81, 123, 103, -100, -102, -183, 318, 115, 58, 55, 314, -253, -26, 83, -218, -46, -249, 325, -173, -99, -129, 33, -110, -39, -34, -222, -15, -77, -236, 2, 49, 76, -210, 122, 221, -164, 167, 19, -13, 195, 479, 19, -3, -131, 172, -236, 153, -159, -10, -88, 25, 224, 113, 314, -115, 74, 142, 213, 72, -294, -267, 58, 34, -44, -253, -340, -20, 210, 149, -207, -144, -353, -64, 3, 113, 118, 32, -103, 28, -179, 63, -169, -239, 121, 195, -46, -44, 157, -87, 9, 98, 142, 288, -55, -8, 14, 496, 125, 4, -14, -87, 168, 161, -245, -223, 248, 245, 1, -82, -286, -43, 108, 56, 101, 93, 80, 173, -4, 257, -169, -236]
5354b36K03n4J02J85r0k57l3Q2J57k51K6J78J54m1k50Q4j82L41k06J79Q5j95m92
5377e11L91O0M9j66N8K6j18K75k63o6M8K51j74N10k78k76N7K08k19M75n26J16
5399g3k52J37J87L01l99O2J42j84J67k57K46j57O8L08j90l5J91n30M42O2j51J21
5421B06j80j54N44n5m02j8J88k25R3P3K4j22J36k38K60p7k94o3L09L34n35L46
5443A50o17L39K74K78k37j82m1k37M65l03K17k53J57J03L44l28l74J1M11r0L0
5464A17o4k15j32K14j60L71J1m20k24O78j93J36j58m8l2L67k69K28n8j97M0L60
5486C52m18r8J46l44M04l4K7n5J72k05M7M36n69Q1kK57Q8k91J63m46K16NM21l17
5510C6J93m84N15j61k9m4j92n5K92J13k26j95L27l16J26N14n38n4l2K3J84L57
$$ y = [-236, -33, -87, 15, 200, 110, -147, -180, -98, 59, -192, -166, 12, 166, 125, -125, -41, -223, 118, -88, 91, 176, -19, -511, -120, -60, -11, -177, -119, -93, -211, 64, -199, -265, -217, 34, -140, 370, 92, -184, -127, 81, -138, 337, -189, -73, -325, -188, -1, 300, -99, -37, 105, -79, 88, -169, 77, -80, -12, 296, 106, 71, 262, -268, 174, 236, 85, 206, 26, -128, 416, 361, -41, -59, 129, -96, -3, 70, 94, -28, 108, -130, 130, 53, -241, -304, 5, 339, -196, 150, -467, -128, 146, 424, 187, 5, -36, -273, 192, -111, 106, -147, 10, 113, 457, 129, -245, -234, 177, 87, 117, 53, -162, -294, -80, -240, 131, 142, -278, -502, 176, -17, 119, -39, -87, -119, 248, -21, 207, 149, -48, -8, 352, -66, -164, -18, -362, 42, 8, 35, -20, 152, -53, -6, 430, -139, -58, -60, 197, 285, -6, 157, -289, -73, -68, 353, 36, 229, -255, 260, 99, 70, 26, -166, -221, 71, 184, -42, -237, 90, -226, -100, 414, -124, -178, -210, -187, -3, 354]
5532C54m94q6L28j17L69l4l55m52M74M10m3m47j7j91K18J64j58j30n0R1L78j57
5554E5Q0m13L7L87j74K50j24k14l67M17P5M65l96k72j98O07R3l24k14L3P6L62
5576B41j60j95J34l10J89N43j75m17J89l33L27j04o5J20k11nM05J92k41n51K15
5597b12J26M9L60k19k31K84J08O2n5n84K90q9K55K7j31j48l6N86k48j77k26K66
5619E7j9K78l26K35m2k4k19J52j52l20L17k12L36k00K05m16K88O5J48P8j75r6
5641d2J76J01k33M47n77k26N16R7k45k34q9J58R4L41m56K11j97q3L90j3l3j39
5663c6j45J35J54k75m7M4NL48L6j90k22J84L3l2j38N32n15k36M90K1p2R3l57J51
5687c9O4L59k24n6l70K92j01M77j59k19N6Q0K48p1l99l56N24l9j03M17p68M22
$$ y = [354, -140, -226, 102, -15, 354, 320, -35, -487, -13, 397, 354, -93, -110, -301, -83, 81, -77, -207, -257, -166, 212, 55, 135, -278, -241, 146, -28, 222, 98, -116, -483, -66, 9, 474, 78, -194, -392, 215, 308, -16, -230, -197, -121, 241, 81, -114, 20, -290, -101, 442, 267, -150, 39, -294, 33, -71, -136, -16, -227, -232, 173, 365, 124, -427, -212, -86, -37, 323, 104, -127, 157, 265, 327, 272, -312, -22, -111, 144, 171, 40, -108, -144, 442, 194, 17, -209, 57, 38, 316, -10, 225, 183, 159, -60, 92, -60, -380, -63, -275, 61, -139, 66, -350, -62, 3, 151, 229, 54, -42, 134, 235, 2, 449, -128, -354, 162, 259, 14, -220, -309, -151, -57, 284, -172, 39, -158, -241, 149, 136, 103, -36, -181, -46, 108, -167, -214, -170, -165, 183, 219, 29, -193, -9, 24, -8, -146, 386, -129, -365, 125, 146, 74, 167, -190, -39, 25, 384, 160, 104, -266, 26, -75, 402, 243, 24, 80, 160, 408, 337, -62, -418, 106, 67, -36, 381, -387, 35]
5709C5J44j7pj46k70J54N53j55l26L3r2P8j06NK26k98O4N0K77K47o31j3K25P0
5733A00J78k07l37M32j29J13j3j57j51J24k7J30Qj59J6L47j40j04k41K59o75P42
5755A09L18k86m90qM88j21K64j53l28J3N8M1O5R3P0k13J64J24j49j89M6J92J21
5778B29J48l85m28J9J26P04l16J19j49j06j77L53n0j16m54N47k9J03m8l86K72
5799b4L1K53J04k40l57J00M83k75O7m40QK69L6L49m95j09J66M27j81l6l22j17
5821c03M5K24K82k25l37K70J22Q2L3k96n6O8J17J41N1m88j2K33L51j72j98K14
5843A46l82K86M2J93j17j13N0O3K40j82k06l36J11K23R4O1o2r8J25K85k75l11
5865a63N2j06K83J91l05K2r9O1M1J83k32L6J46j24P2j16K3k02L06l16M99k90j24
$$ y = [35, 179, 162, 155, 9, -261, -107, 446, 291, -35, -2, -94, -16, -122, -117, 109, -189, -125, -75, 202, 449, -182, -195, 30, 100, 278, 71, -266, 166, 37, 150, 137, -20, -171, -47, -74, 56, 64, -95, -79, 268, 128, 24, -217, 42, -633, 109, 427, 141, -349, -357, 131, 10, 274, 121, -207, -194, -136, -95, -30, 63, 133, -80, 84, 208, 59, -130, -84, 108, 229, 377, -8, -436, -417, -291, 413, 97, 216, 67, -39, -216, 137, 87, -29, -483, 64, 35, 138, 90, -296, -24, 7, 260, 364, 124, -233, -133, 350, 75, 142, -298, -290, -21, 15, 364, -131, -240, -74, 353, 172, 136, -186, -303, -258, -34, 248, 23, -314, -44, 78, 160, 193, -103, -159, -91, 26, 167, 218, -270, -282, -49, 302, 130, -68, 146, -236, 50, 92, 285, 168, 55, 105, 168, 408, 226, 20, -316, -205, 18, 112, 173, 111, 13, 138, 423, 148, -163, -111, -217, 66, 257, -48, -26, -125, -64, -23, 160, -72, -36, 110, -14, 58, -58, -35, -237, 69, -247, 252, -38, -162]
5888a62K31k96M45l39L58l22j34q6M02K25o65K56R0K38j63k65j79L34L68r1Ml32
5910h3J88j71k8O01n13M7l09K61J41J54m95m4J02K81J85jo39J65r1L43o2J85m01
5933a84J07P6j78J00O6k84J38L13rq9k32k13j91P51m1r6J81n57M88q7J89k73m13
5956d38K24L68M32m33k86J01J62K57P0l57k82k0K16L22l5l87k02M30j3m0J9k62
5978a54k02N75L0K9j42l54K89K09m7j26r6k99n2Q87l28l60j91K14J96j97M79m05
6000d5j61M03j30K5l7k55J47j15K37l02M56l28M0N37r6k58j53J70j43P9J94k95
6022c0Rj32l8L33L47n84k03M23k13O48n74j20r7M57K9J43l50k00J08J86n6Nk25
6045a34k91J69N58j63J74k27p6j60O06k34m01K63m02K07M97m7l75l7j41N58r2
$$ y = [-162, 69, -227, 218, -121, 237, -85, -219, -305, 97, 322, -343, -87, 3, 241, 78, -187, -366, -32, 336, 245, 249, -83, 105, -66, -94, 507, -6, 41, -268, -7, 134, 288, -207, -251, -149, 132, 317, 316, -323, -158, -249, 94, 32, 217, -184, -77, -1, -179, -79, -13, -297, -159, 154, 145, 56, -176, -389, -580, 171, 130, 34, 215, -342, 146, 59, 248, -25, -438, -214, 154, 586, 153, -133, -32, 130, 387, 457, 100, -182, -202, 14, 336, 301, -86, -288, 142, 129, 89, 108, -154, -356, 219, 249, 278, 136, -218, 71, 280, 233, 107, 11, -288, -340, 547, 219, -141, -332, -118, 78, -119, 360, -45, -206, 197, 67, 92, 55, -200, -53, -168, 69, -233, 223, -105, -65, 472, 376, 118, -35, 135, -8, 71, 265, -30, -21, -153, -191, 142, 489, -95, -298, 125, -88, 560, -14, -134, -231, 226, 255, 398, 48, -152, -44, 142, 86, 91, -134, -425, -256, 302, 139, 313, 86, 10, -150, 456, 222, -179, 84, -318, -111, 386, 339, -36, -73, -214, 344, 252]
6066B52j16o28N05L62k75N9m47J49J84n7K8J50j64l64M70J75l67K03j09m90L05
6087a75M56j82l50J49j84J33L56J01o55K34J2nL21l07l69M58K04j71P8n42n4O67
6109A75P6K14o38J82m93N48L13n03j8J23j95L52P63j260O5k8K99L60L08p32m39
6130e28L26L43j9J94j91l27O03l0j91k35l41L05J55J84m1k69k88J20M99lk25m4
6152cO5m47Q45j61l05j02j18K43K44l42n15M03M6P8L47j41l16m8K38O1J8l02m74
6175f86L38N08J78k65K7k50j28O50Rn66L50l97K16K34Q2m57k30J49M26K20k04
6196B04n52M75j11L13o6j99o09M07N89m74L54m92n8L98j91L57l70J65l66J76M38
6217C88n20j01K01p4P38l66m74O4K48j15P6J20j03l58J73J10J99k48q0KJ09p9
$$ y = [252, 136, -492, 13, 375, 100, 159, -288, -139, 45, -12, 16, 166, 2, -362, 108, 283, -84, 119, 10, -480, -175, 281, 99, -251, -102, -286, -153, 203, 304, -351, -117, -105, -110, 211, -96, -465, -7, 197, 26, 104, -438, -492, 175, 251, 465, -173, 9, -484, 64, 377, -126, -144, -21, -216, 136, 899, -361, -296, -324, -25, 335, 643, -89, -528, -202, 141, 122, 316, 125, -202, 401, 371, 180, -55, -396, -91, 64, 248, 207, -62, -350, -230, 269, 266, 41, -3, 62, -385, 460, 299, -6, -108, -226, 17, 261, -81, -596, -193, -147, -69, 278, 137, -179, -227, 11, 72, 90, -212, -686, -348, 160, 338, 73, 100, -150, -278, 372, 381, -185, 165, -232, -16, 218, 300, -157, -387, -238, 188, 408, 204, -348, 127, 16, 329, 263, 64, -545, -138, 451, -23, 331, -161, -219, 179, -12, 345, -25, 140, -226, -50, 388, -132, -233, -32, -106, 632, 266, -208, -144, 104, -11, 65, 185, 82, -276, -103, 7, 206, -42, -122, -120, -11, -90]
6239i0J0L01k92J1j16K90j16k22J27l44M60L15k84K09p1k40K67L07r17L70o0J6
6261f9M10L27q75O6K89j97N6J92o53K41M87N7p1j02l71K23K65k96L09m94K5J50
6283c1M25l27j46j69O9J51K41j42l04J93j7L18j50o8m15j12M16j28M94k97l37
6304c36K74J41K11l5l47j36j55N69P0l8m52oJ43K76k18j60p3J75k3M00J99r11
6326d32kM06K37K53n14l1l28K67J01L14j74j20j39K43J80k8n02J28L3O25l69R0
6348B38k72l78M33J25K0k08J53k58L89k2j83k94J04Q4J93K84k33l17j81N68k76
6369c1J97n96L92j8K16k82Q3k12j80J24M87JJ60o67l3O61k59M4n18q2N37o2K74
6392B36j49k55M0K92r3K73l40m59Q4O12J3l97j69J92j6J11M39o68K35n2L09O2
$$ y = [-90, -80, 221, -71, -60, -176, 114, -2, -224, -97, -441, 19, 334, 50, 259, 188, -52, 215, 522, -395, -25, -85, -69, 341, 668, -207, -141, 148, -49, 7, 199, -454, -213, 274, 331, 260, 158, -213, 10, 275, -21, 288, -206, -181, -31, 394, 67, -79, -248, -179, -28, 213, 71, -233, -40, -57, 261, 111, 43, -372, -484, -68, -196, 298, 1, -336, -62, 79, 290, 255, -92, -228, -383, 186, 256, 218, -234, -240, -97, 179, -39, -199, -272, -97, -120, 280, 479, -432, -434, -28, 209, 462, -52, -83, -411, -144, -43, 271, 97, -23, -162, 81, 261, 233, -269, -141, -108, 517, 148, 238, -34, -412, 21, 146, 166, -42, 111, -147, 242, 220, 37, -257, -153, -69, 124, 408, 175, -142, -323, 245, -31, 166, -430, -38, -56, 160, -122, -39, -251, -431, -307, 180, 181, 341, -326, -359, 302, 43, 87, -431, -513, 24, -38, 236, 87, -168, -128, 164, 71, 344, 4, -455, -371, 241, 254, -143, -312, -120, -136, -25, 414, -254, -19, -71, 238, 300]
6414C00k67k05p6L25J19O9l48j43n6k9M77k5l10k5K28L23j45m8m69L4J3M35j73
6437Dj04q5j0K6L00l54j42J00K04K87k28L20n38J29j70L02j5P1m63K46M96k1k49
6460A06n65K40M0L29K6k02l99K45J6K60L08m53J03j63K53j76L27k06k40J77M1
6481F7K06k28l01R8K22l4J06m17M8p5M15L28j74j65m66L38J85j98P4k69k87N14
6503a3N68n17J85l82k75L36L96J62n16l95L11P55m52j62p6m29M64M83m16l10L75
6524I2L2M7p8j30J0l22M17lL92o42M6L86J2l06M7k21l8J29J91K45m64n3N1K01
6548D1m1j62j84J94K2K64N26o89j05j15jO65k75l56LL84P5K3j13r0l1P5J86k52
6572D4R8l89J7p5K02J67R5l57K52J91J3k20j75j44M17OJ58k46l43K47J0M23k00
$$ y = [300, 33, -172, -248, 77, 196, 265, -83, -226, -282, -311, 166, 141, -169, -194, 34, 357, 212, 164, -305, -271, -258, 177, 4, -100, -185, -195, -169, 131, -223, -365, -265, -61, 226, -2, 318, -220, -91, -261, 41, 26, 97, -366, -120, 376, 355, 106, -459, -219, -179, 150, 176, -26, -425, -180, -164, 96, 404, -49, 54, -109, 144, -32, 295, 89, -151, 26, 67, 273, 45, -256, -158, 64, 30, 136, -281, -233, -308, 107, 435, 261, 96, -370, -32, 153, -45, 29, -240, -527, -13, 555, 38, 223, -159, -434, -98, 298, 460, -56, -451, -140, 615, 163, 1, -75, -504, -40, 443, 27, -283, 92, 124, 171, 93, -37, -27, -349, 68, 65, 457, -185, -139, 247, 259, -47, 0, -221, -259, -130, 61, 306, -158, -211, -160, 41, 0, -162, -346, -152, -130, 134, 660, -29, -134, -249, -250, 415, 140, -216, -213, 171, 246, 269, 156, 66, 35, 110, 296, 44, 142, -247, -230, -305, -103, 64, 159, -198, 54, 245, 258, 38, -137, -281, 136, 142, 300, 54, -289, -42, -32, 391, 191]
6595A91j35k14K08L3q0J17n36L52J29l66N79k41k42J84o4L79M2n14J09j88N47
6616B90K7k97k29n1J88n6M32m57r2l2J71M49j69j88l93O48j43n9L64q36M21J84
6638A72j61N5l4m08L82j41J64o4j62J91j45N72n94n5J46j91L04K66N8p53P20n14
6660a92M63K56n21j08P5K80n05L19m36j0L5O52n5P1n02j11M86P5j00j71ml9J85
6683A43K89m13j96j90K98J05L02k84j76jJ67L27j03m35l18N65k38L18j23k70j07
6704c40O13k75Q6o0m5J17j56M54l31K5l28JM66L8n40L0L00k06M53j12n34M78j75
6727d1K63j1k21j25r4J24P5L3Q0o36L18N89m02J1K07m25Q3M31p0j15j14j51K43
6750E2O5j2k66L76k40j98P28j28o71J52J20J03K04l26oj37L38k48L15j22m23K1
$$ y = [191, 56, -158, 50, 83, 3, 120, -416, -64, 65, -301, 278, 37, -205, -21, -85, 294, 336, -178, -69, -257, 290, 317, 20, -209, -260, -72, -128, 304, -153, -245, -277, -106, 343, 174, -14, -407, 241, 98, 39, 403, -433, -12, 172, 11, 66, 32, -376, 6, -135, 29, -35, -197, -6, -151, 421, -173, -228, -82, -273, 31, 297, 355, -398, 322, -192, 271, 527, 6, -102, -27, 253, -252, 67, -369, -379, -344, 308, 253, 324, -178, -289, 197, 272, 172, 1, -3, -42, 143, 432, 19, -177, -367, -69, 36, 338, 54, -122, -123, 44, 371, 268, -167, -485, 80, -158, 160, 37, -233, -340, 273, -2, 84, 24, -21, 96, -60, 394, 63, 88, -240, -239, 227, 265, -275, -245, 55, -151, 302, 190, -344, 134, -41, 222, 211, -10, -135, -229, -105, -30, 3, 83, -553, -235, 354, -48, -37, 170, -255, -172, 259, 189, 74, -40, -191, 52, 117, 105, -161, 215, -25, -223, 505, 377, -294, -142, -22, 81, 285, -41, -47, -184, 154, -94, 221, 99, -324, -303]
6772c03N05P3m7j17k10K09L79m63o4k7k70M78K05k75l60j45K24K76K31k52L9j30
6794d4J43o3J19j22l21L54j02K83l1j17l54K24R6K19J6l38k57N69l5n68N4n9J02
6817b32M65m4j25l49j8K54M10J17n61j90J08L10m5R1k30l31L67K36P9J79n18j94
6839b21J67L55j14J52l45k46N49p6l13J92N4l27N36m84k34J47K86j54J44J20n3
6860A35m05l9N17M3oo82J75L12p0Q8J70j93k04N6K18l24l7k41J17Q50k88K88m97
6883a7j01J5L68j70j48k03qQ3K57P5o93M85j34J87J63j77k05J47J17O4J01l14
6905a08J00k63L86J48l94j00o9K42L7J10l8j81j08P9P94p44m8K66k67J07R8N0
6927I7j36l4J71o8J21m9m90K30M72Q8j45k64k19o8O44j74l63J41j18K78L09m77
$$ y = [-303, 202, 275, 228, 111, -99, 110, 489, 26, -38, -65, -335, 143, 348, 73, -287, -432, -208, 68, 299, 47, 86, -44, 99, 36, 155, 33, -288, 66, -36, 247, 216, 99, -255, -31, 65, 284, 300, -38, -295, 274, 239, -329, -275, -334, -232, 233, 189, 64, -285, -303, -49, 361, 478, -83, -273, -165, 145, 100, 191, -39, -370, -3, 233, 312, 491, -27, -221, -54, 301, 187, 339, -6, -252, 297, 221, -92, 100, 154, -173, 363, -121, -355, -208, 78, -76, 68, 188, 135, -270, -309, 208, 251, 245, -437, -262, 50, -20, 68, 238, 45, -159, -103, 115, -209, -246, -487, -370, 480, 192, 480, -17, -118, -103, 265, 95, -53, -256, -264, -181, 76, 151, -542, -57, -191, -4, 159, -18, -223, -76, 41, 105, 206, -108, -8, -271, 115, 263, -131, -231, -300, -58, -21, 89, 51, -130, -238, -159, 635, -109, -157, 109, -158, -51, 47, 97, -39, -73, 98, 30, 151, 102, -388, -158, 314, 402, 257, -7, -226, -294, 350, 176, -187, -46, -164, 114, 423, -54]
6949e4pk44Q4N00k28M3k24J7k33L87J89k39n61K68J93J77Q7J55n79o0N31j64K04
6972B42l60j44M18O6j2n9n97K37M19j13j92j51P2M1L06M4k93J60q6q8L99l34N2
6995B7j33J30L48j51l24J94m64N75J29k89J4k16O9M71r5K86r04j0M56J86j00q3
7017A16q6q7q4J13J89j20j83L19K80m54Q21j111J84O7N9J62j59m37M28j5J46M6
7039A94k49J9j28J59L10l80j19k65K37P1K46j43l54J79J94J43j06O1j59J22M43
7060D75l47k88j9K67J61j44Ll91j86M50k36M45j72k31L6J86R6r2J49k48l15K05
7082a96N31k5m17m92P10J61j28m9l7j91L41l8K74n08l98M54l18P45k38k29j53
7103b01M96k73k03j18K55j91L77J16M6m68J21k09N6K46N8l93L06k11n2M43j05
$$ y = [-54, -61, -305, -221, 279, 51, 94, -130, -113, -346, 41, 230, -9, -570, -302, -109, 68, 155, 310, -269, -329, 202, 38, 242, -118, -262, 156, 222, 210, 151, -446, -209, 210, 97, -95, -246, -174, -133, 173, 217, -76, 84, -2, -90, 309, -25, 27, -106, 24, 372, 221, -103, 91, -373, 202, 331, 42, 56, -160, -91, 380, 285, 571, -333, -343, 113, 299, 199, 116, 30, -57, -141, -28, 161, 41, -142, 177, 457, 3, 824, -287, -103, -36, 23, 185, 26, -411, 17, 2, 148, 194, -55, -36, -164, -5, 305, -75, -194, -459, -222, -151, 95, -48, -402, -223, -29, 114, 8, 69, -90, 32, 475, 128, -160, -179, 88, 249, 105, 108, -283, -469, -19, -255, 190, 18, -213, -177, 9, 105, 13, 162, -86, -401, -196, 335, 310, -107, -599, 111, 272, 144, 95, 58, -133, 208, 170, 444, -64, -462, -8, -326, 419, 181, -48, -201, 295, 22, -181, -299, -44, -235, 142, 258, 304, -164, -43, -252, -196, 50, 108, -285, 21, -190, -242, 201, 96]
7124I6l08j91K79L69j34k18K03n24O89j13k2m24L9K16L69l20j0m30N15qL16l76
7146A3k24J32j95L33o9K59l55Q4NK09k91k45o8K97J7K80j2m66M00j00k19K60j34
7169h9j36J72K07j58J09k84J46k86N96k61J80j34L4l51M45j69j81L0j4K38o2P1
7191A03N7p11N76J2j87L14l58J04R6Q3L4m9k64K70N3j23R1Ln00J48K83J37k05
7214c3J42m44L21K25J5l63J6Nj5N44m30j29J59J80j38PJ04j41N5K85l64K08l60
7237a51N9J46K8QK31o33P3L23K49L9m96k28L35K8km0k98N25m16O36m19M0k34K70
7261G3MK42n1n61L7N12M29o74j87M8j01K68J63N5l96J41j00J13K13K67l91k37
7283a33K39j46M34l57l42k32O04K28l0k81r0K04j97K6L08k73k48L09J98l76j2
$$ y = [96, -212, -403, -124, 245, 111, -107, 96, -428, 261, 148, 126, -298, -259, -43, 326, 6, -4, -434, 81, 73, 389, 13, -211, -79, -274, 59, -10, 249, -106, -22, -17, 192, -99, -344, -412, -115, -98, 182, 170, -296, 104, 4, -215, 45, -89, -225, -53, 154, -4, 105, -179, -33, -319, 277, 16, 196, 62, 96, -255, 190, 21, -160, -130, -144, 94, 32, 103, 160, -551, 25, 37, -150, 164, -194, -90, 6, 89, 123, 74, -190, 80, 133, 10, 101, 104, -396, -248, 35, 172, -33, 109, -335, -14, 211, 226, -137, -121, -116, -131, 413, -17, -146, 13, 193, 55, 62, 166, 25, 80, 365, 1, 209, -151, -92, 54, 82, 90, 321, -312, -239, 84, 333, 372, -124, -352, -17, 11, 9, -31, -329, 196, -220, 416, -3, 37, -197, 73, 77, 319, 268, -293, -256, 256, 685, 11, -176, -128, -229, 39, 202, 257, -139, 2, -98, 15, 228, 495, 104, -133, 106, -40, 394, 37, -305, -537, 67, 295, 265, -16, -106, 98, -99, -73, 235, -38, -286, 23, 221, -155, -167]
7304a67M0l7K69p4jj42k82J88L11l11J85o4o7q8L28P4l82J24J0N60n12O37r33
7327c34L19j50L31l88j65K08l7K37K79o1j74k33Q6L44m5j89K96o88K23L39R2m26
7349a36J23j56j04N09k31M8j83M78m63N19m37j97K62K82k42K45j62m58J11M47
7369B55k73q7j83K71Q4L07l49Lj77oN39J7j04l25N4N2q6K29J3n26O43l47Q4K37
7393C25l82k99K93j4J53O9m16j88L45J92j11O9l51K17K70R1O7o28M40l57J62L28
7415B75J28k63j64n6K21K60n81P6L59m16M2M93o11K54J20Qj88N11q27o1K48K04
7437C2k66M00l61j93M96J07k85K81l81j2M89j3l88l64O33k77K49j26k07pL17k15
7459i1J31K28k68o6R4j90O23m07K9m50L08L64k84j7j54L50Q8N9n81O3r2J81L35
$$ y = [-167, -127, -164, 105, 31, 30, -112, -394, -206, 105, -206, -21, -85, -152, -240, 88, 162, -220, -96, -86, 474, -38, 599, -334, -15, -165, 166, -222, -387, -179, -216, 21, 300, 239, 65, -168, -82, 262, 217, 28, 324, -364, -141, 198, 290, -136, -13, -169, -273, 236, 5, 53, -130, 348, -115, 404, -33, -230, 32, 314, 72, 317, 155, -303, -192, 255, -18, -105, -288, -17, 67, 374, 25, 28, -149, -155, 384, 401, 297, -28, 26, 78, -8, 221, 234, -292, 351, 4, 88, 325, -57, -356, -63, -77, 76, 145, -271, -459, -114, 78, -33, 36, -315, -98, 172, 263, 330, -298, 142, -215, -53, 275, 403, 140, -24, -80, 141, 401, -180, -104, 255, -161, -119, 374, -237, 17, 137, 145, -43, 468, -359, -420, -172, 32, -234, 166, -195, -388, 108, 215, -70, 211, -170, -182, 307, 294, -94, -458, 175, -102, 147, 21, -186, -193, 124, -91, 40, 268, 0, -66, 28, -162, 461, 54, 83, -367, -59, 305, 21, 4, -150, 200, 288, 347, -234, -171, -263, -82, 253]
7482B53j62l37nl1M42Mj58K43o80M14l5J08J38p00J23M83R6J08l06j72j50M71
7504A47m63M42m47K02L53K26o74J78K47o04N23j53M8q2j7K79j74%N7k49L23Q0
7526B42k91J54q0k35K59J22MJ65k95l7j86M07k15j41R4m28M33Q6K01m39K43k20
7548a57J1N18l55l16J17K09k37K12j0q1p4Q0K07L0J0k20j36M29J70l79j91l09
7570d72L91K68K1j04j18k12K04j3j29r2K83J42k53K08j38j40K54qL14l49j49L0
7592f2M79l12l82L32l09qL95O5j30m31M24m31L40n8L3m0Q7J13p0Q5J85m44j38
7615b77O50j66N1o0q8k65k7N86n03k40M23k12J91k6K42k80LJ33K6j8j71m7M7K29
7639B01K3k56L3k86J92J28m10L92j30K16k65K77K36q50N04J80l97N52p9k10O5
$$ y = [253, 91, -246, -251, -282, 160, 164, 6, 249, -431, -17, -52, 56, 194, -506, -383, 100, 196, 304, -2, -174, -324, 147, -316, 126, -321, -119, 234, 460, -214, -36, 211, -393, 130, -23, 25, -57, -74, 205, 31, 31, 88, -161, 162, 242, -49, 105, 25, -210, 49, 171, 175, 340, 45, 8, -178, 229, 14, -127, -33, -461, -28, 58, 259, -180, 63, -157, -146, 372, 17, -299, -182, 27, -210, 2, -8, -89, -163, -83, 124, 154, 164, -56, -192, 237, 407, 28, -163, -472, -81, 187, 208, 104, -14, -226, -22, -35, -164, -256, 27, 169, -84, 124, -14, -154, 100, 92, 406, 57, -92, -62, 417, 105, -277, 55, -254, -262, 133, 198, 68, -363, 61, -370, -30, -88, -55, -95, -8, 105, 35, 120, 305, -139, -277, 373, 207, 258, 198, 110, -155, -182, 404, -99, -339, 84, -128, 63, 37, 279, -1, 2, 135, 161, 143, -28, -75, -28, 201, 224, -32, 1, -285, -93, 35, -375, 17, -113, 103, -162, 115, 351, -499, 5, 185, -212, 340, 261, 51, 116]
7660A16l20K20K22n93L60L8n3O1q2r6j20K48L09k31k54K45m37K40M26k32k5p7
7682c5j43j19M04K02l76Jj84L48L4r2l04J51L8L2J24m69J21M56j88q3j87K33K6
7705a0j60L21J03j73o85M11L35%L5q3l50L54l5K51m05QM05k2l91J71J33k65j19
7728a71J18J68J45l49j21J18L12j56Pk53J73j5J94k73L39k31l03K96k13K90j23
7749d8j47K26p1J78k35M1rK90q5L11o14J61L57j30j37q0k82J63K90j04p8P7k54
7772a80j17K20p6L22m15K58K28p5l8m5k20q3J89N18l95r8j29M09k55J40r2n8k5
7795a7L13j68N0l20j5L85j15J25K4m81j22J75o4K49K14k16k44J94j33L88n9l65
7817b02J24J07Q7j00j88O5M10n13L61o2k1N2l48K87rj67k1j1L17k5j70j81j05
$$ y = [116, -204, 16, 238, -355, 5, 43, -10, 51, -31, -127, -247, 1, 310, 79, -175, 70, -367, -127, 299, 67, 42, -35, -178, -297, 107, 309, -67, -66, -250, 98, 132, 40, -264, -113, -75, -43, 81, -388, -267, 189, 1, -82, -269, -36, -10, -170, 151, 254, 81, -604, -193, 142, 142, 177, 94, -256, 98, 63, 314, -91, -83, 322, 300, -91, 80, 213, -52, -171, -53, 115, 260, -89, -210, -92, 220, 64, 71, -182, -9, -24, 170, -103, 236, 5, -298, -2, -215, 75, -48, -195, 31, -40, 138, -97, -56, -65, 225, 140, 451, -163, -2, 355, 225, 88, 8, -274, -111, 179, 75, -3, 74, -180, -297, -77, -153, 169, -246, 12, 240, 165, 127, 82, -138, -221, -32, 486, 91, -7, -136, 273, 18, 158, 66, 8, -17, 296, 128, 178, -142, -157, 228, 113, 238, 262, -219, -341, -166, -230, 19, 233, 17, -227, -33, -166, 222, 163, -202, -78, 29, 116, 16, -172, -107, 303, -210, 151, 89, 68, 120, -228, 59, 50, -117, -138, -149, 168, 143, -27, -208, -313]
7840c13M49j11k3q5j52M3M63k40k48K19K6j18K21r5K20m93K21J15m9K09l98r5
7862b34j43K19M04kj24j52k15L42r2o9Ok34L29M8m40Q6J79M1k80N54k30r4K50
7885A49l4J4K6lo00L99J50J8O4o48J36L28J05j75M75n65k27O44j36j69n1qJ66
7908E8K9l5K05k59j31K93J60q3l52j28J4N3M95j90j16j89J33O05k87j62k55J48
7930FJ99K00l21j1p1j80J82j85L75m78L68l16M41j13p1J22k49M42j52o1k44L5
7952h2Oj49J17p4P1O4J75Pj95K82m41K47k6pJ99k71p6J65J57j50o3k04k51M86
7976a3K4L0j28n6m2n2P78n88N0j28J13j3K47l0j85P4l6K45l82n9L41l01L47k68
8000c2J90l9n05L71K71k12k02N3J19j18J95j52N8j01N1L01k6l70j20J9M36j03
$$ y = [-313, 136, 25, 2, -83, -235, -192, 271, 31, -217, 2, 28, -90, 131, 36, 256, -237, -16, 99, 50, 259, -139, -234, -377, -158, 246, 244, 120, -32, -247, 95, 3, -66, -60, -294, 35, 83, -357, -271, -92, -51, -331, 223, -7, -101, 149, 115, 129, 155, 152, -448, -49, 101, 119, 183, -465, -329, -1, 104, -71, 404, -161, -388, 256, 120, -49, -100, -108, 58, 87, 52, 257, -2, -133, 160, 320, 237, -115, -243, -229, -176, 319, 129, 13, -176, -43, 562, 275, 113, -142, 6, 205, 405, 84, 73, 2, -178, 4, -181, 194, -284, 84, -232, 209, 96, 25, 147, -102, 340, 188, 127, -117, -82, -76, -225, -108, -182, -111, -47, 128, 135, -60, 222, -219, 28, 2, -5, 194, -77, -153, 12, 169, 19, -44, -248, -499, -13, 11, 41, -87, -143, -185, -237, 541, -47, 3, -125, -12, -25, 222, 192, 7, 81, 45, 290, -92, -151, 190, -111, 236, -32, 158, 119, -386, -15, 256, 44, -158, -105, 14, -104, 91, -61, -3, -104, -53, 248, 222, -148, -268, -249, 187, 84]
8022H4l2j61M3J82L5L24k97j67j37K61L8o8N2k48N3k9L41l68J12k26k4K65j33
8045a00kj3J2L58l84Q8k35L86J01k04K4q7j40j7J28K74l52J26J03K4MR2M5k88
8069e7J44MM7o2J25l11j29O0L81Q3j44k37L15l74oK17j20j10N2K70m8J89j60j55
8093b6K74j62m17J17r3L25J10j31K85m00K7O2O7K0j0j34l8j16L28jk08N8p9L80
8117B38j8k50j58JQ9J08N1j94J10Q0L38o28J69O5j5M7k06j3K63k87l9K77J50K
8141A80p8O4j0l89P19m16j27J5l97L30K33o4k58L11j49J56j09k15k25L28j27K48
8163B0nJ77j12j09K59k80O0J60l78K36K85k88k16j04L46q0J21J13m08L25m08N89
8185C03q3k52j8K79k26j82
$$ y = [84, 52, -109, -66, 116, 151, 475, 178, 11, -126, 135, 173, 105, 157, -91, -38, -67, 274, -94, 18, -208, -232, 33, -100, -102, -115, -103, 255, -129, -41, -276, 110, 211, 7, 31, -56, -196, -213, -85, 189, -163, -37, 66, 90, 94, 186, 231, -57, 87, 91, 138, 76, 201, -110, -239, -179, 202, 285, 141, -96, 219, -155, -161, 56, -64, -174, -122, 148, 100, 289, 129, -26, 248, 86, -331, -214, -307, 18, 128, -3, 282, -118, -91, -29, 38, 58, 48, -86, -124, -240, 88, 87, -121, -63, -142, 238, 220, -30, -188, -187, -98, 10, 61, -133, -23, 57, 395, -233, -64, 1, -14, 33, -173, -186, 77, -210, -249, 28, 178, 180, 102, 166, 156, -233, 486, 70, -57, -42, -439, -109, 124, 60, -198, 113, -36, 120, 11, -204, -429, -101, -228, 20, 15, 192, 80, -29, 230, -50, 10, 170, -208, 28, 313, 25, -191, -295, 51, -29, 92, 205, -203, 122, -286, 303, 220, -32, -50, 229, 3, -179]
8191a79
$$ Imaginary data points
##PAGE= N=2
##DATA TABLE= (X++(I..I)), XYDATA
0@%%%%Qj6J6j6J6k4M0m8N6p2Q8j04J25j49J76k08K41k81L29l79M34m97N66o43
28c42P31q26R29j045J171j310J465j635J819k019K240k482K749l044L369l731
44a961M134m583N091n669O329p091P989r061J0369j2009J4126j6978K1053k7377
58a5638L8560o3995K16040K5312m24782K11868n2097n901L29373j83642l20618
69b45520K48456M325k7428K20607k20315j91633K85816o4712o5453K45951j99609
80i515k04726K70785j4749o8025J76781j80327j66589K31291L4020k8735N6401
91I6612k11923l9028K51687k5335m6846L0287j98206K2644K59301n0371r4295
102e473r325j19630R1198J88543p7945p9844o1183o9025K05803J11860j94247
$$ y = [0, 0, 0, 0, 0, 8, -8, 8, -8, 8, -16, 24, -24, 32, -40, 48, -56, 69, -80, 96, -112, 129, -152, 177, -202, 232, -265, 301, -342, 389, -437, 492, -553, 618, -692, 773, -862, 957, -1062, 1178, -1304, 1445, -1599, 1770, -1961, 2173, -2410, 2681, -2988, 3341, -3750, 4239, -4822, 5547, -6462, 7664, -9314, 11739, -15638, 22922, -41073, 174967, 200279, -224503, -12635, -64732, -70633, 258740, 75098, -245520, 2936, 7261, -20167, 200440, -19875, -211508, 74308, 9596, -55857, 190094, -9515, -214241, 56544, 41795, -26230, 150551, -29776, -196365, 34926, 68946, 40211, 96612, -115311, -154339, 97348, 72013, 25167, 55454, -142752, -120108, 139193, 88822, -5473, -14798, -134428, -43230, 145313, 67368, -12476, -73659, -142684, 63119, 174979, -19268]
113a9268l9572K716l9440K09194L9424k43722J2095O4851k1435J52118m1365j93358
125a17762R8269K2179n9909J84275o1334k07314J41893J3394q4143K13661o3662
136G9547k55747J43397P4325n3229J56634j30906k25919K15418Q9728q4509R8813
147A07552j61869j59969K95946N8562j79579P7767r1745j08289K74169K0706k05732
158g2481P1226l8553o3924K23988k3511j82816Q2036l2484m1025K10296n3848
169G8904j87013R1763j058k6550J70601p0346j74734Q8194L2428n82J09620j00449
181A0778j27844R9632L2451J2001P1248j27141r1714J22713L7040M006K5304j33836
193f5362m5304J38670L5317j1796l1772j24350L5397J43479j4843l4312m2887
$$ y = [-19268, -58840, -56124, -95564, 113630, 153054, -90668, -78573, -13722, -35157, 116961, 75596, -117762, -19493, 2686, -57223, 127052, 65718, -141596, 297, 13691, -70452, 143209, 79547, -176200, -32803, 41522, -11707, 144927, 14021, -211898, 3520, 93248, 8739, 107552, -54317, -214286, 81660, 140222, -39357, 38410, -53335, -161624, 112545, 133251, -72481, -1255, -39808, -103732, 120256, 96745, -86071, -4035, -36519, -77544, 132752, 78904, -108109, -16346, -17404, -43954, 126647, 56301, -118433, -30239, 2189, 1607, 111227, 10778, -117066, -17434, 15017, 27018, 98266, -28875, -120589, 2124, 39164, 43170, 68474, -65362, -110666, 28004, 63321, 51525, 19753, -104597, -69200, 74279, 59436, 25124, -17763]
204a7763r2621R3911J21274p6427l9895j5241n7537J03594P7806j00295j5066
215a8260l189n3337J11756N6181j13574l73m152m8306J33553M3996j47643m749
227d8097K2634j5834J30362j012j72335K1685O5859l819R0829m5305j57841P0654
239d2220Q3055k9242N3528n0727j25953R2511P7400m6948L3739m8638j02713J02049
251d159P5530n4155Q295n5144o8501J22618O2010p9624j4225l7480k3110J22603
263E4658K6132r9052j1511p653L101R7973m685r2276L53K163J6202Q3855k4324
276D4936q8589K767J4340L8310O7995n7735q9146K3226M1994M5706K4843q8343
288a9696n9125O0099M6820K0156j1139q4398j5936P4622K3496j88j8001o9382
$$ y = [-17763, -110384, -16473, 104801, 28374, -11521, -26762, -84299, 19295, 97101, -3194, -18260, -21449, -74786, 36970, 93151, -20423, -20796, -24948, -73254, 60299, 104295, -43348, -48097, -25463, -41297, 89065, 88053, -84282, -62597, 3262, -557, 90272, 44967, -112874, -42220, 40835, 11593, 65121, 14394, -111559, -19048, 58352, 11404, 45143, -3495, -106208, -4159, 71371, 17216, 25511, -29633, -98134, 24484, 86494, 6870, -7355, -44835, -67945, 54658, 80790, -18262, -29773, -37426, -34325, 63648, 58963, -33313, -32960, -30797, -14595, 69260, 44936, -43653, -40886, -26546, 11764, 79759, 22024, -67122, -43896, -1902, 43804, 68647, -19696, -78821, -18722, 28098, 48254, 37115, -47283, -63219, 11403, 34899, 34711, 16710, -52672]
300e2672N478P1629J0631m984k6071o6718K4581P9884K091k4612m0452m8791N7421
313a2585P9184k9403m7449k9379j2946P2682N1049n9694m3850l241Q135O2291
325C4794K4733o7143l1791J1457J5360N5292Q690p2664k6543K4966L0364M6114
337E3629j7144q0375q489M9047L5519J8350m3433o6788K1942N9914J7916r561
349C0527m6984l9761L9789N1657K70k1869m1563k1403M7542M4483r922l3245l9608
362d0087j624N8230L4817k8678m4930k5572K5110O1088J0906m9059l9659P59M1292
375B593M5226j5116n2663k2263J9863M2118K5698k9331m7231q070L0813L9767
387C1404R543l9543m2210O368M2670L3858j0939m9304k9335K7428M8650J5465
$$ y = [-52672, -47194, 24435, 35066, 30082, 4011, -62707, -38126, 41758, 43849, 19237, -21215, -70006, -12585, 66599, 37196, -10253, -39632, -52578, 20104, 71153, 11459, -32391, -35632, -27497, 34794, 59527, -7616, -39407, -27950, -12590, 42702, 51392, -21272, -47815, -22849, 7515, 53629, 36485, -43890, -52379, -3332, 32187, 50537, 7104, -59684, -37742, 22172, 40088, 30527, -16457, -56218, -16429, 35228, 35498, 13629, -27934, -49337, -1795, 42688, 32766, -479, -40087, -41711, 16519, 51336, 22658, -22272, -47844, -22734, 38354, 49260, 201, -39458, -38699, 2593, 47819, 32703, -19960, -42223, -22360, 19758, 45456, 16125, -31106, -39176, -8363, 31404, 40947, 1404, -40806, -34438, 8232, 42090, 31151, -18153, -47488, -20060, 28590, 44055]
399D4055l2764m6369o816M2374M0258p160m3228l1463J4078M3599K5494k2823
411A9235m3367j5256K6783M0698J1235l3979m0487O99L7083L5392n338m5158l1137
424d3597K1044M3660K0161k3754m7709j1873L8771L7562j16l5593l7796Q456M5439
437A4655K3059j6925l6644k4388K3154M4695P644k7722l3351j2176L4936M1800
449C8737r422l7373k6174M511M3990L0892l0194l9967r252K0447M2967J1962m4329
462c205l1917J0579K7154L2076m086m9464j7935K4344K6300K0953j5423m9802
474c0426n496L6247K4027P810k7076m5519J0335M7135J5236j1028l3485l1863
486d4103K9308M7423k041k6253k8832j2322L9092L6986j8524l0967j8142L470
$$ y = [44055, 11291, -35078, -41894, 480, 40738, 33578, -9650, -41113, -27035, 16564, 42058, 19235, -24132, -39388, -12605, 28093, 39328, 5349, -35138, -34439, 2644, 38036, 32698, -12460, -43597, -22553, 21107, 41268, 17514, -30195, -42068, -3297, 34265, 34149, -1444, -39240, -30784, 14655, 37714, 20789, -15855, -40243, -17089, 27606, 35250, 7528, -25823, -37999, -3063, 38737, 29315, -8058, -34232, -29721, 14269, 45161, 14967, -25000, -34252, -13805, 29162, 41124, -3205, -35122, -24543, 2611, 34687, 30601, -18863, -36798, -12454, 13846, 34799, 19376, -30426, -35922, 325, 24352, 32162, 5086, -40433, -30098, 17037, 32273, 21245, -12240, -44103, -14795, 32628, 30587, 4334, -24498, -36820, 2272, 39258, 20734, -10233, -28375, -24905]
498b4905L9614K3921k8098l1166q138J5942L8110R622l5991k8313L539K7786L2006
511C3929q444m0367j8666J6723L3964J8978k5377l7197l335K5195L1928N115l7867
524e421k7756J2355K7931K5793q341m6026j3768K8131K5712J3610k0774m5889
536c4443L821M1188J4486k053k5598l7008K0535M4462j598j4573k0315k5578K8946
549g728M1338j5586k0147j2749j6763L2814L8123k6503k5727n562n983L5796L1494
562D2817l8299l0609O788P613L4275J7663m9436k7992K4442J8608K1881K68n1340
575b3321j5463L9401J9496L581j3047m0933j142M5200J3725j3927j7937k5085
587b9452J0316M0946N315k4114j7458r285J4928L2522Q54k8680j7499L576J8978
$$ y = [-24905, 14709, 38630, 10532, -20634, -28772, -12830, 25280, 34902, -1089, -29402, -25863, 1923, 33929, 25485, -14882, -33548, -16825, 17139, 36117, 10740, -26457, -29792, -4597, 27331, 32446, -5421, -33177, -20822, 7109, 32902, 24561, -21465, -35233, -7102, 18610, 32220, 11446, -34443, -30622, 10566, 25052, 22999, -2599, -39607, -19072, 25390, 23792, 9219, -11096, -36674, -7728, 33610, 18024, -2123, -14872, -31635, 1179, 39302, 12799, -12928, -18490, -24473, 11323, 42817, 4518, -26091, -19303, -11690, 22585, 40248, -9188, -37180, -12738, 5870, 27751, 28019, -23321, -38784, 617, 20113, 23694, 10647, -30286, -31428, 13772, 27497, 13570, -4367, -29452, -19136, 21810, 27125, 3011, -14447, -23732, -8804, 23718, 24572, -4108, -21607, -18031, 947]
600I47K3733k754l2413j8488J6503K5752J2158j0544l4872j3901L3602K8151o858
613B1016k0532k8102j710M4997K0898k9482k2981r052Q672M3382O981m4639j3696
626b4248J0448J1143L1238l809m7399j870K4303M687J8946o196m4786M845L1531
639H833j55Q989n662m1384P423L7713j443j371p818l7657J3023M4125m397j5482
653D737j1279k6273K1918M7109j5110l1440q042n208K7202L6496k7062l9951N288
666b1615J6243K1760J5624l2843l3016J9532K5778O596q48k6367k0775K4692K4784
679A9545o593q393j3032j5266J9584K6685r542j5692o845j0636J6409L1324j1945
692A5603k8111l917J083K0444K8650k3261l8243R279J7627J5453J6479l3184l7255
$$ y = [947, 24680, 21926, -10487, -28975, -12472, 13280, 25438, 14894, -19978, -33879, -277, 27874, 21016, 484, -27618, -29328, 15669, 36567, 7085, -15896, -24948, -16276, 27106, 34087, -10552, -24248, -13800, -2657, 28581, 24772, -22627, -24497, -194, 4493, 23439, 17243, -27543, -22698, 8833, 8678, 17667, 12005, -29379, -21956, 15757, 14314, 12943, 5125, -32532, -19509, 24616, 20219, 4737, -6542, -32815, -10897, 36212, 21102, -10338, -18380, -23588, 3614, 40110, 13048, -26903, -21615, -5372, 16388, 32012, -831, -33847, -14315, 11463, 18059, 17211, -9156, -29931, -5239, 19545, 12952, 4559, -8473, -23739, -4155, 22530, 12988, -2704, -9549, -20185, -3776, 27548, 15603, -12508, -16425, -15342, 5102, 33752, 10491, -27752, -18473, -846, 14607, 31086, -2098, -39353]
705c9353K8585K8864k296O94k8004k6615L9258K8437j9280r352j6228j3119L9576
718A1167K0246l1259q638l436p393L4969J4027l7490p071R623o338K5232J3252
731B6891l6660r441J5285n33J9364R001l5858j2130K0482Q792J4195p55l9854
744b1221q047L4581J4093k617j3387l0926L588M2457J0741k5543j9496o499J5599
757f677L0765j460l2007j2223J1680J5752J4103p486k7117l440J7936O969N814
770A2609r77k6258o406K5778P787l547m12k4092r030L4743J1173j5790p169j7387
784a8978p38L8894N254k8258o106p600O195L8988m901m0541J926Q659M668L0678
798B8140j1198m4386Q994K3203L070J4145j6711l6810J9625K7237n321K013j5128
$$ y = [-39353, -10768, 18096, 15800, 16494, -11510, -38125, 1133, 29570, 10290, 938, -15290, -28409, 11167, 31413, 154, -8484, -11920, -19313, 15656, 29683, -7807, -14878, -5255, -11593, 13639, 26891, -9769, -19210, -3925, -4458, 14906, 23907, -11951, -24081, -3599, 5193, 19388, 18633, -21221, -29268, 5313, 19406, 16789, 3402, -27524, -23936, 18521, 29262, 3719, -15777, -22276, -6677, 24088, 22628, -9379, -21602, -9922, 5830, 19933, 12447, -14670, -18110, -174, 6795, 12609, 11632, -14626, -21032, 4746, 12533, 8986, 8574, -15518, -24548, 10195, 21368, 5578, -1591, -18978, -19716, 19178, 24432, -3826, -9932, -17532, -11337, 27651, 22750, -17791, -15865, -7206, -2538, 28140, 16942, -27444, -18450, 4753, 7823, 21968, 5257, -31553, -11928, 15309, 9988, 12001, -3127]
811c127k5936K6284K4222j6290k387n756j9890K1103K3457j5873p605m237j2987
824a9022J9233K2335j3954j5948o899j263K5713J6491k3840k1526K948J2785K1498
837A8551K846k9416j7122J5936K1752O731j2539k0465n872J8211K0194m139j9067
850d399j0644L382J4937J4977q354k0288l210O902J2389J4752j4913k3151O177
863a1443J1773P315J0578j6760k4693J4318J8506J36L397j7211k0798K1321J9325
876A5764o215k713j6183j5264K8288J8490j6450p001j1632p298L1717J4506k6982
889i73j0294q15J610K7876M618l1764o068R717N356J8686l930k9701J463J4415
903A96L176J1368o131k5174L501J6529L676N576q788k2620O389K0079M472j202
$$ y = [-3127, -29063, -2779, 21443, 5153, 2766, -2990, -22880, -1777, 21680, 5807, -1798, -6035, -19022, 211, 22546, 8592, -7356, -14255, -15518, 10195, 26686, 2846, -18680, -15732, -2947, 18551, 21397, -8019, -25141, -9205, 12547, 19278, 6739, -13726, -19598, -1387, 18807, 14668, -4399, -15043, -11661, 3276, 18253, 9899, -10389, -13599, -6697, 5692, 20444, 5531, -17620, -11443, 330, 7645, 18223, 1463, -23230, -8912, 9594, 9730, 13127, -4084, -24882, -3561, 15764, 9549, 6836, -9347, -24611, 3677, 22167, 5717, -1284, -12916, -20214, 11503, 26009, -973, -11267, -12082, -10472, 17404, 22022, -9742, -15810, -6093, -737, 17949, 14019, -15682, -14219, 196, 3372, 14740, 8609, -16565, -13064, 3465, 7141, 12717, 3929, -18691, -12302, 7777, 12249, 11047]
917A1047j5518j6598J4228K1273J16j1536j6369m740K0959J5190p823j5922j0340
930a6033O479J9865N497j2082j3317n451J2199J6638j898j2927j0658k331J6618
943B599J4742r026j4539p301L627J9575R103j7812j3323M79Q592J7596O58k2109
957g139p508R300P918J1672l615k2371j944J2554O797Q204p518k1537K049J7116
971C978O082K535j2846j9488J0327K1124J171o956j3922j0671J7486J8241q258
984H803j0980q424k254J7735J1193j1927j0180m149J465J6637P108j3540j0608
997i121j868O479J7352J575j8307r738M273J2660J3192q037j9620k983J1860J2085
1011I802L516j2963j4337M412J3015P436j582j3459r373P906J1523N119l898j4736
$$ y = [11047, -4471, -21069, -6841, 14432, 14548, 3012, -13357, -18097, 2862, 18052, 10229, -5693, -16033, -9554, 10311, 15808, 3726, -9591, -15042, -2843, 13795, 11897, -1030, -11688, -14019, 2599, 17341, 8315, -6224, -13525, -9898, 9677, 18780, 968, -12355, -11876, -3284, 14312, 14970, -7139, -14647, -5347, 2571, 14243, 10628, -11743, -13687, -1133, 5664, 13868, 6350, -15187, -13138, 3978, 10060, 12595, -251, -19739, -9412, 11712, 12883, 5927, -7995, -18666, -1180, 17061, 8803, -2177, -10601, -12855, 4880, 16073, 4146, -6034, -10183, -8718, 7919, 15027, 1487, -9121, -10989, -4510, 12842, 14417, -3890, -13628, -9355, 3305, 16497, 8460, -11160, -14143, -2283, 9802, 13318, 355, -13982, -9570, 3445, 10881, 9299, -4160, -13533, -5627, 5896, 11015, 7117, -7619]
1025g619o677J2042J2432J505j0231j5285R37J7947R101o818j3200q878Q924J7023
1039A1203Q42j1281j0288k073J1911J2084l835j1707o597J274J1693R972p288
1052E910j2791m974O503J3830N701j2934j3164J174J1797J1983l067j5872p901
1065a3805Q235J2907M613q057j3474j842J1239R379L02r887j0155J717J2044P911
1079A1127l610j1564q366O426J3831M483r246j3040j891J1574J2362k251j3569
1092c734q813N115J3334O390p747j2780k911R274J0130J670q991j0858Q68J0727
1106A674Q319j790j0767r540N297J2982N025o374j2622n054J1095J3144j432j1096
1120a139r611J658J3015Q706p532j1381l958N724J1862L808j0724r060K76P473
$$ y = [-7619, -14296, -2254, 10178, 11683, 1452, -13833, -12896, 5051, 14152, 7334, -5866, -14744, -5820, 11203, 12045, 764, -9524, -11597, 314, 12398, 8563, -3144, -9741, -8467, 3226, 13198, 5910, -6881, -11855, -5352, 8478, 14179, 1245, -11919, -10745, 1052, 13035, 9968, -5904, -13805, -5570, 7337, 11950, 3893, -9581, -11423, -184, 9195, 9497, -390, -10545, -8828, 3216, 11127, 7517, -4047, -12413, -5987, 7844, 12327, 3081, -9959, -11850, -276, 12086, 9835, -3734, -12547, -7432, 5902, 12292, 4545, -8235, -11146, -1872, 8258, 9928, 937, -9921, -9053, 1674, 9993, 8203, -2564, -12104, -6807, 6175, 11200, 4826, -7796, -12850, -1755, 11389, 9957, -1139, -10750, -9092, 3923, 12629, 5097, -6284, -10242, -4518, 7344, 11152, 428, -8632, -8356, -883]
1134h83J0343j1j2464p428L995R628Q069m487j4237l975R241R928L380r686j2848
1149a1435K508J1986P166k636j2117p150P616J0718K416n352j0859k884R769P922
1163G668M56p211j0744O85J3222N469l636q927r686P040J5151N34r212q170m028
1178a1389J1590J3470p420j1078k894M04J1415Q740j1526q970K113J081J0533
1191F069O003j3679q015N757K469R338L559j7432o070J0633M109O284r87j9052
1205a1014j159J6012K470N85m372j5380M368J6294q51l999l810j1141P049J5623
1219A0675l692o748l887p710R694J4604o810r769l373j422J2487R674j1655j0106
1233h038J046L943J1171K066j3294n972M829N245P103k182j1060j904L672N712
$$ y = [-883, 9460, 9449, -3015, -10443, -6448, 3180, 11249, 6762, -7475, -11450, -2209, 7719, 11099, 1413, -11435, -8927, 3059, 10225, 7589, -4528, -11678, -4062, 6656, 9072, 3720, -7139, -10023, -254, 7668, 8124, 913, -9831, -9146, 4076, 9545, 5909, -3018, -12704, -5664, 9487, 10021, 809, -7361, -11389, 201, 13671, 6251, -4827, -7721, -7317, 4098, 12838, 1312, -7658, -5545, -4464, 6069, 12072, -1607, -9622, -3865, -1396, 7942, 11501, -5931, -12001, -1368, 2741, 9025, 8038, -11014, -12173, 3839, 6309, 6894, 2522, -12858, -8490, 7804, 6953, 2954, -856, -11997, -4948, 10675, 6983, 235, -3652, -11362, -1668, 12936, 6126, -3643, -7016, -8438, 4049, 13723, 2068, -8038, -6992, -3049, 8122, 10188, -3106, -9078, -4249, 996, 8099, 5917, -5143, -7047, -3375, 2337]
1247B337P087n881j0732J17M339Q473N451j1412j1145O215P261O346R33j6503
1261g114o212J3870N593J218k417j6236J187J6926p98l011l51j3889L560J8416
1275A0742n570n519J251j1906N677J8833q866q521L005r278P786J8038j3343r807
1289g478O779o785Q198J5610j6922j0455J0477l141N578J2719j7227r895J2484
1302e8k9M645Q185j9519p208J7164J340Q98K456j8704k062K0636K98n917r50j1961
1318a0786L657J6665k692p568j711o398O904J1587o110n520q15m008O766Q819
1332H790n414n792k844r87J0000N277p369n399m934M628J4484k224j1521k048
1346e353j554O471J3672q847j3031L541J957O291J0073j4492j0681J1012N13M188
$$ y = [2337, 9424, 3543, -7189, -7072, -2733, 5740, 11191, -221, -11366, -5151, 2110, 8456, 9389, -7114, -13326, 544, 6137, 7355, 4938, -11298, -10111, 6815, 6017, 3006, 2655, -11234, -7674, 10742, 5172, -347, 904, -11002, -5325, 13508, 4642, -3879, -874, -10152, -2366, 15672, 2329, -7478, -699, -7484, 714, 16324, -598, -11053, -576, -3717, 1861, 14580, -2647, -12542, -58, -87, 4558, 12743, -6776, -13984, 3180, 4520, 5418, 7874, -10830, -12892, 7744, 8042, 2125, 1175, -10786, -7129, 9536, 6844, -724, -2435, -8833, -1929, 9658, 3548, -1972, -2787, -6795, -29, 8790, 3376, -2416, -5260, -6247, 3753, 9030, 1661, -3738, -8672, -4044, 10440, 8216, -3305, -5353, -6907, -436, 13236, 4389, -8642, -5101, -3144, 3147, 13220, -1272, -11953, -941, -428, 3760]
1360C760Q374j7442p658J7058j141j635Q370j6559o107J9790k204m771O874j4648
1374g939k818K0569n192o474P644j4444j886K2667o273j0289Q254j1853p92K2645
1388A3819o805j4141O526o727L339J9728j1916j4544Q487k073N268J4273j5710
1401d76j3564J3682K260O41P980j4417q444J4559K319j912K400j0964k578J2194
1415C680J10j106Q48j0300K10J0949l12j170j955r023L504R707N55k083p536o098
1431a0020J0963O608m296j364q399k956J5144L520r478j456n051L69J6013k437
1445G160j1684K080l456K595J5594p701j3475P906j933O98J4812j0059j4077J1536
1459dP00k393J2151j0321j2153J3731P76l690J1144j1401j1499J6045Q70n253
$$ y = [3760, 12134, -5308, -12966, 4092, 2951, 1316, 9686, -6873, -12980, 6810, 4606, -165, 6709, -7939, -10757, 9812, 4620, -1854, 5790, -8654, -10540, 12127, 5854, -4435, 3819, -8034, -8826, 13819, 7014, -7127, -601, -7328, -3989, 15739, 3823, -10721, -2234, -4307, 961, 15234, -476, -14040, -358, 1902, 2543, 10523, -3894, -12338, 2221, 4540, 2628, 5028, -5936, -8514, 3680, 3790, 2684, 3532, -6768, -6558, 4391, 4079, 2909, 954, -8069, -4565, 5142, 5697, 3614, -3922, -10020, 943, 7551, 3255, 1891, -6508, -9464, 5680, 9200, -278, -1734, -6785, -6416, 9597, 7160, -4524, -2444, -5900, -3305, 12289, 4588, -8887, -981, -2914, -2216, 12596, 2537, -11540, -4, 696, -1697, 10454, 133, -12020, 1711, 2487, -1203, 9941, -1460, -12959, 3086, 3956, -1297]
1473a297R985j1926j0476J9014J382p509N591j0539o079J9950L55j0982K792o748
1487f487p73J8178l672j3293M567k457P09J3906o557j1645N363L08J452R396p162
1502A833r089N551R99K338O776r010p050N790K427L655K448j0646l269O947K458
1517B158L362j836j0241J183P097J572K342m798r933N789Q115j479P20o152p823
1532i924R935O967m907R7n873n508J2760M187q450P96l876l505J3761J260j1306
1547c586K116j382k551J3015q93j2495L633K72k076J2020k268j3307M910K039
1561e53j256J0797n686j2857P202M436j451O718o666j1217R711N421l422M362
1575E539p789p857J1502M809n237J670o330m157J1527K449o165P10n148j333J1246
$$ y = [-1297, 8688, -3238, -13714, 5300, 6682, -827, 4764, -5775, -11854, 8096, 8451, -2531, 261, -6487, -7260, 10918, 7246, -6047, -1480, -3937, -3228, 10678, 4121, -7524, -2161, -1853, -401, 8995, 1833, -7256, -1705, -706, 1632, 8408, -602, -7652, -1862, 565, 4220, 6668, -3978, -7247, -300, 2158, 5520, 3684, -6557, -5374, 1723, 3295, 5637, 839, -9094, -3305, 4810, 3331, 4051, -2101, -9924, 11, 6978, 2071, 2168, -3705, -9213, 3547, 7734, -716, 80, -3796, -7301, 6460, 7720, -3586, -1470, -2852, -5403, 7612, 6719, -5776, -2143, -1871, -3947, 8073, 5805, -7502, -2592, -553, -1809, 8988, 3302, -9555, -2353, 2083, 632, 7350, 684, -10533, -822, 4599, 1177, 5539, -2250, -10107, 1395, 6204, 967, 2637, -3693, -7850, 3677, 6126, -39, 671, -4477, -5810, 5436]
1590E436M07o959o27k903J812R340k026p297Q9j356L675P725m906o340P78N16
1606b636M657N121o879n492K406J868N071K103q841k916M579K181L637p58r188
1621e087j84O162J250K365k771q376K781O566k08R64l520p026N445O354j955q45
1637A915l788n196P104O207m349j645l022l142Q107M326n867k433j418q66P903
1652C836K180p752j703R88L25O950L02q678l30K353J837N484k925p875J094L905
1668iJ823L371m381o854K985N034R03R91m885n236M999M567j63j085m662k946
1684e548O148L716j846k002m673J36O121K598k915k875l434K180O445J18m437
1699b68k459j291L498N514k034m960j424M17M081M344m007m621k45K224M388J493
$$ y = [5436, 5843, -1116, -1743, -4646, -2834, 6506, 4480, -2817, -2728, -4084, -409, 7316, 2410, -3930, -3152, -2636, 2021, 7142, 263, -5229, -2823, -955, 4116, 6219, -2622, -5538, -959, 1222, 4859, 4101, -5087, -5271, 891, 2141, 4506, 1735, -6641, -3860, 2706, 2498, 3462, -58, -7084, -1639, 4715, 2760, 1915, -1873, -7069, 35, 6242, 1893, 248, -2774, -5916, 2191, 6517, 650, -1783, -3201, -4067, 3836, 6016, -1736, -3439, -2451, -2126, 4824, 5126, -3552, -3882, -1529, 308, 5792, 2867, -5008, -3914, -9, 1814, 5185, 804, -6050, -3065, 1969, 2872, 3863, -1022, -6258, -1259, 3308, 3145, 2060, -2602, -5548, 600, 4316, 2470, 468, -4205, -4069, 2052, 4650, 1735, -1140, -4574, -2394, 4051, 4169, -268, -2727, -4018, -520, 4994, 2960, -2000, -3424, -3007, 1074, 5418, 1411, -3210, -3455, -1231, 3157, 4650]
1715D650m737m024J670K701L412k1n652k783L614L106J893j800n458o87M589K856
1731C329j41l406m421K101M389K058j823l440l070K766M848N46l028l295j310
1746c897M043M083j348l978k591P41M717K634k968l895j291K372M562O49l855
1761b2l492Q12L250L228j080m231k199K307L754J698k641l901j272L111M045m33
1777B934l182l270L78M444K760k203l862j694K243L910J065l208l233Q4K943L325
1793C434j67m354k478J478L458K154j686m419j198L325K973J168l046m123M36
1808c045M059K100q47l574k602J840M325Q69k474k590j662L227L693j024k769
1823d74k354J96L785K308j493l363j850J290M596J076l240l062m68K985L543r40
$$ y = [4650, -87, -4111, -2441, 260, 3672, 3651, -2001, -4784, -1170, 1936, 3829, 2029, -3429, -4116, 473, 3329, 3188, -218, -4639, -2538, 1851, 3909, 2086, -1354, -4424, -1658, 3190, 3736, 708, -2587, -3897, 146, 4229, 2881, -1097, -3688, -2947, 1770, 4404, 1436, -2459, -3750, -1378, 3184, 3833, -22, -3514, -2702, 548, 3776, 2696, -1535, -3734, -1427, 2327, 4025, 1384, -2517, -3789, -678, 3367, 2934, -248, -3518, -3140, 1304, 4064, 1861, -2001, -3695, -1452, 2458, 3523, 315, -2918, -2834, 109, 3434, 3267, -1087, -3565, -2087, 1371, 3525, 1839, -2580, -3778, -453, 2520, 3688, 642, -3481, -3045, 1014, 3114, 2267, -1307, -3909, -2069, 2256, 3125, 651, -1939, -3601, -374, 3319, 2295, -474, -2828, -2632, 1153, 3461, 1968, -1395, -3245, -1955, 2641, 3717, 477, -2585, -3053, -68, 3475, 2535]
1839B535l484k103J147L330J950k386l371m19J711L283J177l480k888J113J852
1854c3K773k0m105j905K224K078K039j142m674m87L686J797P05k355m578J572
1870b425M608P48j680j770l244K241M672j007k116j263k054K758M561k344k596
1885i11q91o74L058L629k959l526M47M84L001K249m186l013J841J600K264M59
1901B872m306k302K997K118N81l62l640j308L784J760k64j047l527K16L609J668
1917B849j328k578j714J201L675J015k767k989O3K805K382l52l137k121J417K825
1933A246J003q54k594j724K064K990k22j583j577j646K740L443j534k611j118
1948a977k41L365K749l324l174J053O76K690J832m533k539K786J052J168J349
$$ y = [2535, -949, -3052, -1905, 1425, 3375, 989, -2382, -2801, -1090, 2193, 3370, -110, -2998, -1885, -33, 2740, 2720, -1385, -3290, -1066, 1012, 3051, 1909, -2765, -3252, 434, 2231, 2936, 581, -3997, -2425, 2183, 2931, 1251, -519, -3763, -1522, 3150, 2143, 27, -1236, -3290, -532, 4029, 1685, -911, -1802, -2476, 582, 4211, 1252, -2274, -1827, -1343, 1658, 3907, -279, -3292, -1451, 149, 2413, 2872, -1434, -3736, -739, 1379, 1960, 1598, -2042, -3350, 434, 2194, 1930, 883, -2644, -2428, 1181, 2849, 1521, -1057, -2771, -1570, 2105, 3120, 353, -2636, -2573, 232, 2614, 2262, -875, -2996, -1579, 1246, 2249, 1395, -1199, -2923, -859, 2131, 1909, 326, -1251, -2897, -157, 3286, 1752, -859, -1977, -2218, 1147, 3896, 572, -2602, -1549, -873, 1817, 3649, -884, -3423, -637, 415, 1583, 2932]
1963B932m882j604M197N18L15L49m191r56M253J392j312j09l521m59N281L1k247
1980a3k3k512P29M932n61l332l29n87L98M352q81m081M40N14J028L013j149m787
1998b849P83J856J197J792k539l668J501L302P27p98j690k728K119L298n33j741
2014B9j198q63J944K475r33k378l27j41J374K687j298k994m89J644R20K095j168
2031A379m284N41L530J11O39j723l603J675L808J21j479j512j909J864L941j672
2047A427j943m16j506J931L825k089l378J037l53J580L450k896l310J343J064
2062b34J093J807k815l174K791J532MR66k527k733L114K266j288l6j368k698L006
2079b94K755j270j211j249j215L203K495l074j588O5l4L080J835m039k121K020
$$ y = [2932, -1950, -3554, 643, 1161, 1476, 1825, -2366, -3322, 931, 2323, 1011, 902, -2619, -3078, 2203, 2234, -13, -36, -2548, -1819, 3113, 2552, -780, -1109, -1696, -1298, 3054, 2173, -1908, -1468, -954, 74, 3087, 1938, -2849, -2066, -210, 987, 2779, 240, -3428, -1927, 1375, 2102, 1304, -386, -3114, -995, 2303, 1770, 29, -1169, -2032, -88, 2387, 1454, -924, -1251, -1392, -18, 2669, 1371, -1623, -2112, -468, 452, 2547, 1379, -2905, -2364, 1166, 1277, 1916, 193, -3410, -1735, 2073, 2194, 715, -797, -2706, -842, 3099, 1427, -516, -932, -2438, -507, 3318, 1229, -2149, -1112, -1465, 115, 3565, 669, -2641, -1298, -234, 859, 2666, -149, -3323, -532, 1000, 1004, 1970, -557, -3290, -176, 2090, 802, 766, -602, -3300, -294, 2461, 1191, -20, -1269, -2484, 719, 3214, 140, -1448, -1383, -1417, 1663, 3498, -541, -2662, -642]
2095f42O53J469R31l581j585K641J350k24J25k225j179K726J310q86k12k034j383
2112b746L953R66j899o79j213n32L266J967l290j563O60K59K506R47l582j200
2128b180J795O26J485P9l658j08K478J76P65l75l204o5L237N19r11m92k186J31
2146a888L218N61j933p51j496J437K877l46k351o46K18Q94K518o84k955l23J134
2163e16J080J250n36k915k61K082J603k79j303k309j73L160J234j634j362j404
2179b283J051L398l70k447k00l80O94K975p24l426M15R66J93K112m19l202J77
2196a470J562L41J537q38l555R00K547r7L43r52l460K206L191j252o83p09k185
2213b574K021K923j330j260n81r24J930K447k537j055l55n9K206J599k301j865
$$ y = [-642, 11, 1480, 2411, -1170, -2755, -114, 1236, 1012, 1137, -1088, -2267, 459, 1769, 883, 671, -1363, -2746, 1207, 2173, 274, -405, -1618, -2150, 1116, 3083, -207, -1770, -1110, -851, 1655, 2602, -980, -2180, -385, 241, 1726, 1805, -1853, -1961, 517, 693, 1458, 1083, -2121, -2186, 1051, 1570, 659, 167, -2019, -1888, 1330, 1891, -42, -793, -2289, -852, 2025, 1679, -672, -1318, -1100, -206, 2312, 1628, -1327, -1650, -516, 564, 1814, 1278, -1637, -1898, 184, 1787, 1508, 205, -2104, -2277, 883, 2117, 483, -879, -2283, -1232, 2166, 1796, -651, -851, -1231, -537, 2438, 1714, -1712, -1297, -331, -138, 1974, 1555, -1647, -1470, 92, 433, 1970, 1132, -2423, -1523, 1024, 927, 1270, 318, -3142, -936, 2255, 1003, 320, -389, -2574, -553, 2370, 1040, -220, -801, -1725, 205, 2652, 115, -940, -1295, -1354, 852, 2451, 150, -1715]
2229a715N58P45J883P57k856j443J036J802Q51o65j990o46J419J191N69j237j652
2246a393k97J833J323o5j794j239L65K086J096j323k133o6J075J727M39j433k122
2263a921M51K149R62q94j181j729J411K304m44p66r82j401K026K043j180j195
2279c47n72o92K054J529j445j410j31N0K037J175k506j307O64Q40J269M36k817
2296a173q20J943O19O81L80k809m69J984O73L08p12k213K50K035P07m33p56k211
2314b016O44K594J07r75j368p50J344K495j025j291j002L0J323J972j369j413
2330g00o05O41J869M27j271j844M20J002J378L58k197j142R41J281J199q82k245
2347a370J0J129R66O74r40k377P30J619P06j65j387j359J259J273J73k5k020p48
$$ y = [-1715, -1157, -412, 1471, 2228, -628, -2071, -1035, 767, 1618, 953, -1037, -1683, -264, 927, 1496, 259, -1393, -1690, 143, 1466, 1401, -393, -1632, -1267, 819, 1915, 592, -1541, -1607, -532, 1195, 1634, 201, -1921, -1470, 679, 1641, 747, -434, -2163, -752, 1552, 1108, 342, -640, -2041, -15, 2028, 848, -347, -919, -1611, 443, 1972, 527, -883, -1014, -964, 1073, 2248, -258, -1565, -901, -61, 1208, 1644, -1173, -1993, -50, 569, 1250, 1630, -1179, -1648, 336, 1009, 1317, 605, -1608, -1358, 677, 1384, 951, 195, -2016, -1372, 1222, 1329, 354, -1014, -1764, -420, 2075, 1050, -241, -1243, -1213, 110, 2082, 713, -700, -1305, -664, 1205, 1632, 361, -1483, -1063, -61, 1317, 1675, -522, -1664, -723, 558, 1757, 875, -1370, -1360, -231, 735, 1409, 469, -1908, -1178, 441, 1147, 982, -405, -1764, -505, 768, 941, 916, -1104, -1852]
2365a852J511J544K1j007j600j53K107R58r14j293j000J182J926K77j637j179
2381a109o41J845J318l85j529p07L55J220R57o29j858j15N51J339J085j288j743
2398a334J50J545R53O5k027o10M95J461O15m50k008l73J183J688j00j197j644
2415a588K30J794R73l43j640j067O13K141K8n82j476p35J715J253J52j814j203
2432a549M09J701J163r31j555q42J191J195P78j143j536k23J359J620k23j750
2448c36j076N59J240J013o72j649n15J018J490L26j158j370J93R80J393p21j520
2465h05o98O83J755N56j314j222m51J559J166l52j006j223N1J542J567j075j565
2482h32o75J076J307M57r20j612K28R03J229m3j388j186Q92J294O78j039j077
$$ y = [-1852, -341, 1203, 1224, 217, -1383, -1536, 571, 1529, 615, -678, -1678, -496, 1430, 1707, 70, -1109, -1750, 95, 1413, 1028, -501, -1208, -853, 367, 1324, 695, -1163, -1278, -727, 612, 1697, 409, -1334, -1184, 361, 1314, 1379, -648, -1258, -763, 698, 1313, 863, -1145, -1518, -335, 1353, 1253, 56, -1588, -1358, 436, 1409, 1066, -574, -1641, -1028, 1113, 1141, 559, -917, -1652, 63, 1316, 1468, -346, -1549, -1140, 561, 1724, 793, -762, -1604, -413, 782, 1560, 417, -1119, -1342, 17, 1637, 1414, -336, -1412, -853, 387, 1400, 728, -921, -1436, -418, 1072, 1398, 240, -1130, -937, 43, 1436, 715, -805, -1503, -820, 935, 1491, 177, -1045, -1496, 63, 1229, 877, -129, -1352, -1301, 241, 1808, 733, -832, -1507, -431, 876, 1333, 413, -1199, -971, -68, 1161, 1118, -270, -1456, -564, 730, 1408, 369, -708]
2499g08q49J352J555m90k50k005P6J646J125r73j147p96M33K105P15j394j390
2516i95k88J073J671j50j546q68J27R64J605j053j528J27O07Q20J039j096k090
2533a581O59R38Q10O42j546j709Q49J525N43j48j529j502J849J480m66o10j198
2550i94m37J705J360r10j261p73N39J580N75j258r20n07J102J460J77j621j202
2567a385K33J604P78l63j509r71R96J745L94j512j084k52J107J509J47k399l00
2584a262L13J175J453j139k058M66R01P77J088j370j943O96J492k23J052j727
2600c09k071K154J262l39K54j529j593K367J706j013k72j492j455L241J088k299
2616c00m2l51q31K956N84k854K52R3p76K806K64k575n39J068j0J727J27l339N41
$$ y = [-708, -1557, -205, 1350, 860, 610, -1395, -1319, 327, 1452, 479, -668, -1464, -1031, 1074, 1789, 395, -995, -1283, -210, 1461, 1311, -235, -1103, -976, -12, 1593, 540, -988, -861, -254, 566, 1605, 509, -1581, -922, 16, 826, 1468, -78, -1787, -938, 587, 1130, 982, -547, -2049, -200, 1280, 814, 204, -994, -1431, 274, 1634, 724, -537, -1310, -771, 809, 1384, 126, -794, -1301, -199, 1261, 1438, -183, -1385, -1152, 452, 1230, 867, -642, -1613, -617, 1128, 1522, 10, -1074, -1326, -219, 1290, 1437, -962, -1262, -949, 226, 1679, 540, -1518, -1052, -151, 626, 1714, 344, -1599, -903, 589, 366, 1418, -309, -2380, -226, 1036, 697, 951, -578, -2171, 196, 1902, 889, 617, -875, -2330, 911, 1999, -300, -342, -693, -1524, 1432, 2016, -838, -586, -493, -1269, 1537, 1801, -774, -1313, -245, -255, 1472, 1599, -1740, -1199]
2635a199J748j26J150p61k729J009J478K79J29p41k033J053J845l66m69o86j316
2652a735J532J414q4j168j005J40J458Q78q30j252r04P25K071l00p22j185n74
2669a541J786J372o84q69j183m39K353N87j249p94k47j61K383P81k884K4N41m93
2687g17K441j12l144M25R04k86K081m35k975N71J940q60J712p56k705J127J784
2704I95r54J113o91k860J941K691j954r7j72k384K544K435k380o44J57j369K194
2721E65J977k691r78Q60j213K293J317k659p54P82J70J230P61k623m40J322L37
2738B56N97M09k426l17J439R54K95r13j562K62J605K32J76j696p84Q94J429N64
2756A414j125j772M83J490N16j09q23j918J337J738m08j2r23j902J599K071r05
$$ y = [-1199, 549, 423, 1573, 812, -1917, -908, 570, 849, 978, 237, -1796, -743, 1102, 736, 267, -419, -1735, -203, 1211, 1127, -41, -1046, -906, 552, 1430, 600, -652, -1556, -831, 1240, 940, 218, -967, -1541, 245, 1617, 933, 64, -1119, -1558, 795, 1382, 133, -661, -908, -1069, 1314, 2095, -789, -765, -224, -717, 1724, 1612, -1532, -1107, -203, -489, 1592, 1157, -1818, -1247, 693, -167, 1545, 789, -1916, -789, 995, 41, 1154, 463, -2397, -456, 2235, 281, 184, 12, -2372, 172, 2607, 227, -417, -260, -1629, 565, 2542, -149, -1127, -267, -1480, 813, 2130, -529, -1283, -501, -331, 899, 1660, -963, -1403, -81, 256, 853, 1262, -1164, -1481, -42, 912, 1207, 294, -1268, -1006, 599, 831, 1007, -689, -1473, -579, 850, 1414, 289, -1483, -1000, 490, 1006, 897, 74, -1844, -507, 1231, 823, 811, -112, -2014, -415, 1656, 751]
2773G51n89m07j464K155J646k103k44k20j367K410J630k838j41P48j228K109J487
2790B335l545m1J678j290K032J123l926J95K146j254J730K65l454M37K592m86
2806E37M54j00k893N19L171q01n77k11j884J314K280j289o15k9j561J623K156
2823B094j683q41j09m78J256J430j573j138R9J19J543Q54j688j119O57N61J189
2840A173j40k011l15Q22J407M73j393j008J07Q47J371J81k370o59J304J82J087
2857A058L29k429l57K302l26N82j63k739N01K009pK2l07k275Q18K732j248p8L2
2876D56k226J069K679j462r83K29j333J392K541k404r87O16o15J809J396k388
2892b11j347R69L97Q07J190k505j157K012O0N05Q44k728j05J531M59P0n8k238
$$ y = [751, 162, -245, -1709, 446, 2092, -11, -255, -475, -1842, 568, 2198, -640, -781, -33, -1261, 848, 2335, -1210, -1251, 427, -863, 1169, 2292, -1634, -1439, 707, -547, 1183, 1448, -2006, -1569, 1023, 537, 991, 891, -2002, -1483, 1688, 887, 310, 99, -1785, -471, 1809, 520, -95, -124, -1685, -62, 2094, 411, -430, -539, -1017, 239, 1669, 96, -1042, -943, -824, 719, 1573, -115, -1234, -577, -16, 1173, 1033, -978, -1293, -471, 936, 1409, 16, -992, -885, -38, 1333, 1514, -856, -1515, -211, -29, 1058, 1387, -1042, -1399, 903, 577, 1159, 996, -1743, -1242, 767, 760, 782, 475, -1800, -982, 1750, 502, 424, 456, -1770, -701, 1978, 516, -467, -238, -1571, -179, 2362, -42, -1029, -413, -1028, 781, 2177, -211, -1558, -589, -192, 615, 1805, -700, -1857, 155, 215, 720, 1564, -1164, -1269, 262, 721, 791, 733, -1505]
2910a505L75K048k31m8l66j924P78K328o89l27r33r95J093J840n12q25j281L98
2928g76J267Q12o58j107o35J94J912N54j574n62l02Q59J467m82j571l06J8R55
2946F5J807j259j948N21N70O49J433j669k126J387P34R62K17k164p86J900L81
2963F74L35N1k231k79J856O91m51l28j841J84K501j76n40k23j409K18K671o90
2981A013p06r27m53P68J903j000j374k4k49J205J357j433j147J01N87J003Q68
2998A492j608j354P52O83J171J98j853r43J434M16P90l35j878k04J146P16K28
3015H51p07j766P32R66J147n25q82j109J005J168j9n33j041o34J502J020l30q05
3033D0j120J49J742K51q18r05n04R99J456M8j754q41O21M90J651n61j702j19M21
$$ y = [-1505, -1130, 918, 687, 639, 273, -1651, -873, 1455, 766, 439, -494, -1489, -396, 1444, 932, 107, -1174, -776, 491, 1303, 645, -462, -1097, -903, 1009, 1563, -11, -573, -875, -16, 1451, 969, -602, -908, -890, 65, 1872, 613, -1335, -814, -244, 405, 1838, 169, -1957, -570, 164, 1126, 1343, -821, -1607, 293, 674, 1009, 1060, -1171, -1450, 406, 1097, 646, 318, -1523, -1339, 1162, 986, 446, 223, -1186, -968, 1703, 1013, 307, -620, -1073, -305, 1598, 598, -776, -800, -1049, 156, 1513, 80, -1067, -966, -379, 624, 1492, -116, -1470, -718, -35, 1136, 1334, -519, -1462, -28, 388, 1178, 843, -1035, -1239, -93, 623, 851, 144, -1622, -890, 76, 1223, 698, -184, -1293, -288, 880, 861, 328, -713, -1347, 155, 1175, 845, 40, -1080, -931, 811, 1062, 244, -661, -1165, -166, 1290, 1338, -416, -1257, -636, -146, 1505, 944, -758, -877, -456]
3052d56R23J165j205j591J99N96R31P62j205j849J222O58J058l1j649j126J253
3069c45J454k9p20j424j31J389J065n68o19j336M67J376M85n37j143m25P59J569
3087A287M0j283q47j47J030J354n92j635n07Q49J560J34j332p09k15R24J229k17
3105I23j348p18K27J307P71n76j336n62Q26J228N83p07j677J81J357R62k69j337
3123a65j004O40J131N94p10j212k31J009J027k10r37j089L42J247L65Oj041r68
3141a206N28J311Q05j189q83n36Q18J447O5j079p38k37J472Q08q28j430k96R26
3159b42J106L82j040j080j95R63J225m0j308r98M29J553L57m66j583p02J257J356
3177I74L6j340r39N05J063J226j153j293j08M05J187J054j268j378J57Q61J093
$$ y = [-456, 467, 1632, 427, -1164, -965, -369, 562, 1324, 119, -1730, -508, 150, 1208, 1177, -472, -1598, -345, 1109, 1080, 360, -1064, -1195, 194, 1259, 691, 72, -1264, -797, 579, 1064, 527, -616, -1041, -282, 1287, 1327, 44, -803, -950, 80, 1434, 842, -793, -1300, -451, 1109, 1243, -89, -798, -1013, -89, 1140, 923, -425, -1143, -916, 391, 1162, 586, -750, -1312, -486, 742, 1325, 618, -1059, -878, 479, 1441, 1172, -165, -1169, -529, 602, 1196, 486, -726, -957, 52, 1079, 869, -68, -1157, -815, 432, 797, 803, -238, -1206, -678, 633, 1438, 249, -634, -1170, -352, 1095, 1160, 81, -657, -894, 578, 1386, 558, -872, -1168, -242, 864, 1246, 206, -874, -1069, -106, 1119, 1079, -229, -1227, -798, 755, 1112, 646, -937, -1639, -382, 974, 1010, -330, -1269, -764, 299, 1525, 372, -921, -1029, -624, 563, 1617, 349, -1029, -872, -11, 1082]
3194A082O4j143j296O86Q83M30R8j207j439J632J046M0n30j447j6J328J039l85
3212H65j269m80j25J942L94j278p06n10P14J319M36j583q23O37O68R73j84j723
3230g33m31J023O55O72o68j485J27O91J321l67r15q26Q5J285Q25q99q69m38K14
3249g33J572J55r88q57O7Q38J033Q4j521q63O47J030P64l86j688p23J912R87k96
3268A034p63j912O48J693K90r86m1r51L42J843K17j836O9m07J26K070k14k222
3286a000J57K28N31J297j25k458Q07O13K39J064q53k048P85J294L7K79r49j519
3304a621J049J915n46l16q09j004J098J551o41n37j014l85J808J206j262j319
3320h27J5N5J284P94j062j100J85O74P16K44j230j162Q63Q71M43j92j063p96J278
$$ y = [1082, 1146, 3, -1293, -607, 276, 706, 804, -403, -1842, -210, 836, 876, 346, -1101, -1117, 211, 1250, 865, -404, -884, -1009, 933, 1327, 49, -657, -1167, -453, 866, 1302, -281, -1104, -467, 201, 1174, 990, -733, -1164, -141, 514, 1186, 518, -967, -840, -149, 1172, 805, -110, -936, -851, 434, 1259, 360, -509, -947, -733, 839, 994, 6, -851, -784, 54, 1087, 1171, -350, -1213, -566, 464, 1228, 842, -846, -1569, 343, 1330, 1034, 271, -1641, -993, 700, 990, 4, -37, -988, -646, 1197, 1414, -422, -353, -760, -634, 1436, 1222, -1000, -843, -615, -84, 1213, 1088, -1370, -563, 50, 289, 1353, 500, -1548, -763, 531, 568, 847, -102, -1621, -572, 1343, 797, 481, -328, -1332, -234, 1317, 676, 139, -875, -1260, 548, 1754, 492, -827, -812, -757, 527, 1321, 259, -841, -656, 18, 734, 978, -252, -1414, -551, 320, 763, 571, -492, -1288, -10]
3339a0R58k08m31j427j71J325J470j351o20l36l3J040J493j453j591P53N08P61
3357F77M85j498j029R78O96N75l15j192j317K172Q55o59J32j131j182K413K06
3374H66j135J53m27q94J993P98j433J2n07pJ581N63k031m63M34l0J443N78k715
3393a221p4R86J29J280j85k188K32J466L52Ql19k162J106J671p3j230m63o99Q53
3412e31K262n09j438j68m73N07J418m35j359n1P26pJ371o65j413j30Q94N30M58
3431I87k80j883J76J680L36m04l88j610M65K085m57p73k99r08J180J506m17j670
3449f74j16N28K76J540q65k332J095Q60j06J249j144j965J409Q07l84O69r91j564
3467a708J648Q48l53K10r02j129J250J284n45n27m95p43J368J106j141n77m87
$$ y = [-10, 948, 740, 309, -1118, -1289, 36, 1506, 155, -465, -801, -834, 206, 1699, 246, -1345, -592, -84, 677, 1162, -336, -1365, -387, 309, 884, 569, -623, -1940, 232, 1087, 428, 560, -571, -1753, 660, 866, -269, -116, -543, -1437, 556, 1354, -79, -67, -574, -581, 1000, 1563, -468, -931, -497, -527, 916, 1494, -1221, -1295, -309, -180, 1100, 915, -1273, -1041, 425, 777, 785, 466, -1696, -590, 1081, 1008, -222, -685, -1384, -531, 1731, 1222, -216, -384, -857, -350, 1068, 633, -726, -777, -51, -58, 1313, 648, -765, -895, -1, 529, 987, 707, -1176, -1000, 680, 1016, 612, 224, -1386, -921, 1164, 707, -66, -365, -1273, -93, 1413, 996, -674, -790, -262, 14, 1554, 689, -1643, -548, 312, 206, 1455, 311, -1654, -245, 562, 178, 847, -144, -1708, -60, 788, 435, 645, -257, -1386, -136, 1148, 603, 76, -419, -1162, 206, 1312, 171, -406, -893]
3484h93o3J336J321j606j622Q99K71J196O58j948j013J139J159j57L8j667m73
3501a425J609P41o51Kj073p9J123R83p32p00l30k60J428M23q31p85m2L03R55J75
3521H34j154p83R73K54R13r8j523j053J503O87k20Q9j177n29J869P04p36l65j138
3540i50k28J908M48j475k63m11K59J662O5j472k60K24L20J085n3j812R9P62J06
3559A4Q43k82j540L4J063L18L59l67j240J99J115J7l03n38q73N87J392Q1r71o28
3579g20j98P00J243j32j420k27J70J105N27p37q96qO31K10O54r69r72M18R23L30
3599F32o5m50j021L21J227L56r14j1r30N98J590o92r44k82l94Q50J134r28o75
3618e98o2J06J256O38j026j642R69J49J017j12q87r79P54J008J76p3j385m85J266
$$ y = [-893, -956, 380, 1701, 95, -1527, -628, -357, 839, 1497, -451, -1464, -325, 834, 677, 715, -952, -1425, 184, 925, 274, 276, -797, -876, 247, 1230, 498, -202, -532, -792, 636, 1059, 228, -557, -599, -296, 659, 834, -320, -1103, -130, 124, 1037, 939, -584, -1637, -134, 553, 333, 422, -755, -1284, 585, 1289, 553, 188, -950, -1178, 730, 1178, -297, -560, -971, -712, 950, 1015, -457, -717, -493, -173, 912, 859, -953, -854, -92, 14, 857, 575, -965, -931, 132, 450, 809, 442, -798, -599, 516, 533, 230, -308, -1181, -594, 798, 879, -92, -720, -918, -218, 1025, 893, -527, -754, -584, 521, 1048, 311, -585, -593, 38, 248, 902, -67, -1039, -621, 302, 632, 567, 117, -904, -583, 644, 1000, 86, 75, -855, -257, 1333, 641, -303, -585, -979, -129, 1005, 77, -598, -660, -554, 702, 1340, 314, -1328, -359, -210, 807, 695, -192, -1171, -417, 591, 767, 694, -691, -1176, 90]
3637I0R95n74k31j074k68J446M92n27n75q01M96J000N39r26p76q8N15J391l35
3656G89j051n72K32N79R00j37j318l78N91J143kn55j072j55J235P92j00j391n85
3675a055K98R01P32o49r08J8M07R98L2j180m53rJ058P18j2j280n86Q26P24L55
3695I35p99j045M2Q42Q15j84r30l08j3J277L85j154m31k81M68J405q5p62p06j8
3715e47M59Q06j39q96n06J34R32P08n79r20j2M06P21L73p52r67L33R37L53l71
3735D73j075P0K40J037J51q45p10m85J322Q17j43j037p35L57J214J82m62j079
3753g08k98O29R47J45o70j008J68Q45Q14m07q87k57K87J226j50k65o64p39P45
3772b47P09K24o50r47M69N44N35jj287j75M99Q49L24p88o69j87R46Q70k99q92
$$ y = [90, 1085, 511, 280, -794, -1062, 384, 876, 349, -226, -1027, -531, 469, 1008, 82, -694, -782, -267, 1124, 789, -262, -834, -602, -23, 877, 740, -578, -956, -365, 778, 776, 221, -851, -1006, 229, 1021, 921, -470, -1055, -757, 144, 876, 227, -681, -663, -256, 742, 774, -406, -859, -868, 190, 908, 896, -384, -970, -144, 580, 935, 136, -909, -867, -25, 790, 606, -324, -632, -645, 632, 1017, -137, -568, -849, -381, 1024, 939, 177, -529, -547, -88, 718, 579, -317, -823, -689, 243, 951, 372, -548, -560, -154, 567, 940, 188, -779, -446, 491, 844, 473, -602, -532, -292, 745, 896, 51, -659, -1144, 178, 995, 852, -185, -920, -563, 651, 833, 371, -708, -1006, -377, 570, 715, 45, -963, -795, 50, 864, 457, -430, -687, -400, 826, 676, 411, -253, -992, -247, 462, 686, 36, -911, -442, 102, 637, 636, -651, -826, -327, 522, 846, 58, -611, -798, 148, 1018, 719, -173]
3792a73r69Q70J211l27k42j272l07R92R40P6o35r88J53N21Q45k65q96j17j19J056
3812C54P92q58j069k60J034J018r7j014j088O07M78N44P1j154m49P67N59P23q17
3831A41p59N2N18P64j71n95r18K96J154J55n98n59k85O80Q73o6n42n24k80P96
3851A32O28k13r36k28L13R71j4n17j011K50L59Q32J59n88r74N53Q33L19j98r41
3871b71p38Q85J076l66l91p11j17N55Q58j76r72k86N56L80O20m63j163K01J34
3890c89R26M9o54n75Q9P51K40q0n83n33L61J083k74j62o73k89Q23Q13m21o05n36
3911f39J54O93Q36r90p15L98o7R50M72r58j050M90P49NN57j264p11J134M14j80
3931B78K60p35q02J242O22p58K17p50l61J284O4n37P7p80o8J467K28j069m96R1
$$ y = [-173, -1142, -272, 939, 612, 370, -902, -1209, -217, 723, 799, 164, -824, -671, -150, 695, 430, -466, -583, -702, 354, 1146, 288, -781, -1041, -7, 1011, 914, -100, -1188, -581, -103, 441, 512, -642, -1091, -324, 235, 958, 141, -618, -566, -48, 716, 545, -50, -968, -672, 482, 637, 39, -520, -805, -125, 748, 682, 140, -384, -664, 132, 760, 547, -389, -617, -304, 667, 653, 136, -875, -625, -266, 566, 725, 137, -837, -284, 549, 868, 670, -271, -1009, -124, 952, 586, 195, -516, -633, -78, 780, 604, -368, -654, -98, 282, 902, 439, -724, -523, -389, 537, 586, -68, -643, -554, 197, 437, 357, -226, -759, -398, 685, 411, 249, -424, -713, 110, 923, 502, -103, -639, -485, 208, 1044, 54, -661, -263, -330, 620, 1092, 134, -916, -426, 323, 328, 885, -379, -1090, 44, 458, 278, 538, -197, -999, 243, 865, 107, 324, -426, -787, 497, 561, 24, 101, -679, -747, 720, 948, -121, -617, -526]
3951e26R6J447p9j593j39M00O73L84j69j347K81Q90K82k73l66n48r8J084L16n91
3971A24m52l27J74J312M3j138k44k47O02O65k29j95j060O49N24M33m31n03n21
3990h21P21M95J40l66q53l15J060N75l31n90l01L9J084L77r26l89J45j46J459
4009A057j08j446M49k27P4J161m93j454P12O18n16J082m30j468P71L77j40Q34
4027H53p11j074O62Q65m62N64n88j510J112J296o02j11n10q09J031J186j466P7
4045a97J23n37J319N44j351m34L05k16R98L68r65p84N72L08L50J41j356n0J103
4064B41o6J5l2j017L73O27R0R4n49l20k2P78P01l37p39l56L67L51L76o21o71K54
4086d63M11L99L12n67j294R46J087o62K60j007l10J036P26r65K06m54l83J258
$$ y = [-526, -430, 1017, 938, -655, -794, -394, 279, 663, 494, -853, -572, 318, 600, 327, -39, -587, -685, 399, 715, 124, -328, -655, -481, 831, 874, -264, -508, -755, -153, 512, 283, 88, -972, -323, 201, 634, 203, -300, -821, -100, 395, 535, 169, -684, -999, 61, 636, 305, -285, -586, -547, 537, 914, -12, -401, -256, -402, 1057, 949, -497, -48, -275, -201, 960, 467, -987, -275, 343, -173, 909, 479, -989, -218, 159, 19, 853, 142, -932, -270, 595, 133, 697, 109, -1401, -289, 1007, 405, 294, -216, -1025, 6, 1192, -274, -197, -74, -611, 708, 1252, -99, -533, -228, -444, 554, 922, -43, -827, -255, 53, 403, 544, -812, -862, 241, 175, 190, 158, -859, -486, 141, 231, 325, -224, -544, -566, 212, 913, 576, -163, -519, -152, 199, 575, -46, -717, -463, -52, 347, 659, 92, -1202, -256, 831, 169, 429, -578, -888, 148, 874, -91, 115, -339, -722, 536]
4104E36M85j167L1n2k32J030L00j456J72O32r76J438k14j239M33L29r1O16J28
4123G03j598K97M06L57N94j43j450N01Q73m53K42k68j138O12J427p59j36m29m62
4142h24Q40P46l59q20L03k90M03J029r24p19N55J5K12L36l98o16K46j9N18j64
4162G0j60m32J23K79P03k58p75j45M87M91K01n69m00j0N01M35j72r56R0N28J52
4183A83L80r1j466N38P81m56Q11o85o07L06Q84p53J68l5q32P53P88m54j79n1r75
4204i92Q63J050p70l45O1p12R26P08j012k79K65k31O74Q92j328n35Q43j11M31
4223C98M67j378j95R62m6L37k6j180o9J046q7l09L62r56J24J216k50R2l37l84
4243b13K07R61m24n19j34j06M31N22m13n62n8K24K39O14n56l75m24K90P08j54
$$ y = [536, 1021, -146, -115, -167, -399, 631, 931, -525, -353, 279, -697, 741, 527, -712, -279, 50, -41, 575, 703, -895, -598, -192, 165, 759, 616, -834, -333, 540, 87, 329, 61, -1077, -465, 962, 203, 67, -362, -824, 16, 762, 403, -417, -114, -404, -1, 1028, 104, -615, -60, -45, 167, 503, 105, -511, -265, -284, 234, 70, -90, -522, -399, -120, 583, 325, -450, -595, -108, 383, 584, 15, -385, -395, 106, 541, 369, -587, -497, 31, 183, 563, 472, -994, -456, 325, -131, 680, -5, -612, -306, 578, -175, -7, -42, -874, -121, 667, 213, 34, -17, -992, -129, 921, 151, -194, -133, -845, 81, 789, -223, -502, -237, -468, 206, 1098, -230, -765, 78, -33, 398, 865, -513, -708, 254, 208, 545, 519, -661, -730, 316, 229, -80, 282, -674, -550, 666, 416, 508, 171, -213, -6, 955, 531, 12, -122, -228, 203, 725, 312, -250, -308, -84, 155, 769, 213, -162, -586, -296, 412, 258]
4263B58l16q0m41P11O20p89p7n44K43P54M09q28l02J50K87M31L9r91Q1M26O5M32
4285E38Q6r27k41P19J43k07K27r69O0R40l34M33o81r55Q70P95l38k83k93j93K97
4306c13J252p82k53m28J8O22L91l38m39J86j73N61M66p42n17k8N28L83K00j154
4326e60O0K08M25K50j78n80L17J77j20M06j69j037J63R25J55j11n95r9M65j3M72
4347E61m04k35l86L67M50l14J36n37k60Q80L78j054M28o01M67N06j18j37m23j03
4367c99N95O04p08l56K77l47L68M96m02m97j46M03P46Q6p06m90J33N05K8L16p14
4388b08l38N38L36K9k01k54l62N58L81k8k57l27k17Q02J04m86k31l42L55O17j96
4409B73k19k01l61N34L49n2n00k70L70K70K02l96n11mK71M87N4k96k94k72N01
$$ y = [258, -58, -138, -579, 132, 752, -37, -114, -658, -415, 339, 748, -80, -382, -232, 55, 486, 525, -466, -385, 41, 106, 538, 624, -303, -544, 175, 318, 111, 338, -631, -571, 369, 35, 468, -213, -1168, -298, 497, 159, -124, -417, -610, -313, 939, 157, -96, -524, -506, 116, 507, 169, -270, -84, -257, 304, 770, 28, -489, -517, 11, 394, 594, -560, -500, -292, 133, 383, 205, -375, -58, 119, -1, 405, 236, -801, -638, 287, 442, 331, -264, -363, 102, 89, 561, 157, -78, -464, -97, 353, 39, 175, -362, -622, 258, 636, -418, 10, -591, -124, 382, 264, 127, -296, -399, 196, 800, 92, -264, 13, -334, 34, 530, 128, -369, -515, -112, 634, 720, 14, -476, -343, 162, 190, 506, -208, -546, -8, 328, 357, 156, -98, -460, 98, 479, 451, 194, -133, -350, 452, 556, 70, -161, -503, -148, 469, 273, 54, -147, -508, 26, 375, 323, -177, -447, -77, 193, 395, -1, -512, -516, -245, 242, 296, 0, -294, -566, -65]
4430f5O43m68r5k79K17J48M45r77m5K40l7O15N6n72m31K84L01L90m26j20j58O01
4452B67K12j71q0l24r3n7P82j69n44k83K48P04j98l16l38K15K58K90k32k31k85
4473c45q4O38P9k28j81J01l27M32M04l26q09N34J93M7K49n03l84J97J64M68k87
4494C2m57K17J93M22j82m20K19k13N22k9j90j45k39r7M63J78r5r5o06L68K37M55
4516E38n98j49j01K15P59m36o75N8N26n8J44j57p81M37K91K20J24n54m22L55K04
4537f0L40m81J08k7m1N70K68q64l5j59L65J96j8j21m10J94K20j08K31n16k67O72
4559E7J19j33l37J88L1L31P8k38m55N7L56J87J9n37j1J36J48L17K22o93N9J2J44
4582E7K39r1o23K25L00l37M20k90l92K30M40o0L4q1l87K43N58l00j51j75j66K09
$$ y = [-65, 578, 110, 15, -264, -47, 101, 546, -431, -476, -236, -273, 342, 398, -174, -605, -321, -20, 370, -56, -176, -334, 267, 479, 308, 228, -96, -189, -246, 536, 367, -177, -460, -212, 492, 294, -22, -360, -145, 113, 403, 171, -60, -345, -429, 209, 288, 60, -121, -20, -347, 85, 489, 163, -646, -112, 81, 128, 377, -126, -510, -313, -149, 319, 32, -425, -208, -15, 407, 225, -195, 24, -189, 333, 304, 114, -31, -270, -367, 96, 274, 179, 84, -522, -154, 83, 538, -60, -209, -310, -95, 664, 228, -447, -389, 137, 79, 223, 66, -715, -278, 13, 233, 357, -197, -619, -264, -60, 280, -201, -93, -120, -161, 409, 677, -187, -222, -381, -16, 180, 162, 41, -369, -175, 45, -63, 168, -348, -615, 57, 176, 43, -294, -106, -75, 256, 334, 96, -359, -302, 54, 241, 260, -277, -288, -152, -4, 313, 535, -158, -99, -87, 57, 296, 205, -418, -193, 107, -230, 190, -100, -492, -262, 178, 118, 152, 71, -316, -73, 485, 185, 34, -141, -307, -98]
4604i8N43m45j9k73M78j71K94n30k89L46R2J10K29k75o34N75J58M0K80l74k73
4625b36jK08O25l34l52l79J41O95K88m64P9l17O3K27J47m58k21J37k3N08m42k76
4647c85J33R3M24J35m51m90O55m75P64l54k35J08J88M10l31m34l2O8K65L34l16
4668G4J01k08l58P12L0l41p8m4K00j87K24p2k26j86J00L18L68p68k12O22j85K84
4690A68R3l88P2J02L11m93k43p8l7Q51j81j85l83p1K68O04k60l97K44L1K9K81
$$ y = [-98, 445, 0, -19, -292, 186, 15, 309, -221, -510, -164, -72, 38, 267, -8, -642, -67, 91, 131, 411, 37, -236, -237, -29, 596, 262, -90, -469, -328, 367, 655, 191, 270, -47, 16, 243, 390, -68, -289, -152, -175, 333, -109, -385, -252, -159, 265, 400, -51, -541, 114, -361, 403, 49, -186, -78, 110, 520, 189, -245, -277, -209, 56, 390, 74, 175, -33, -391, 321, 351, 10, -68, -112, 88, -99, 125, 53, -173, -359, -259, 59, 427, -341, -553, 69, -116, 168, 261, -127, -55, 47, 358, -135, -378, -456, -493, 358, 177, -8, -391, -462, -194, 410, 150, -247, -3, 28, 57, 338]
$$ [...]
8191A79
##END NTUPLES=NMR FID
##END=
