##TITLE=1H_LR-768-C2
 CDCl3
 8 sc, 
 11.7.2023
##JCAMPDX= 6.0         $$ Bruker NMR JCAMP-DX V2.0
##DATA TYPE= NMR FID
##DATA CLASS= NTUPLES
##ORIGIN= UXNMR, Bruker Analytische Messtechnik GmbH
##OWNER= root
$$ XWIN-NMR		Version 3.5
$$ Tue Jul 11 14:24:11 2023 Russian Standard Time (UT+4h)  she@DPX200
##.OBSERVE FREQUENCY= 200.13135
##.OBSERVE NUCLEUS= ^1H
##.DELAY= (6, 6)
##.ACQUISITION MODE= SIMULTANEOUS
##.ACQUISITION SCHEME= undefined
##.AVERAGES= 8
##.DIGITISER RES= 18
##SPECTROMETER/DATA SYSTEM= spect
##.PULSE SEQUENCE= zg30
##.SOLVENT NAME= CDCl3
##.SHIFT REFERENCE= (INTERNAL, CDCl3, 0, 15.7039)
##AUDIT TRAIL= $$ (NUMBER, WHEN, WHO, WHERE, WHAT)
$$ ##TITLE= Audit trail, XWIN-NMR		Version 3.5
$$ ##JCAMPDX= 5.01
$$ ##ORIGIN= Bruker BioSpin GmbH
$$ ##OWNER= she
$$ F:/spectra/data/she/nmr/H-F/1/audita.txt
$$ ##AUDIT TRAIL=  $$ (NUMBER, WHEN, WHO, WHERE, WHAT)
(   1,<2023-07-11 14:22:57.14 +0400>,<she>,<DPX200>,
      <created by zg, POWCHK disabled, PULCHK disabled
       configuration hash MD5:
       00 E9 B6 7A A2 85 ED C7 34 08 36 98 17 FE 4E 26
       data hash MD5: 16K
       22 34 CD BA 07 58 2D 10 38 0A 7F 33 85 2D 0F BA>)
$$ ##END=
$$ 
$$ hash MD5
$$ CE CE E3 E3 7E DF 8B 0B EA 0A 83 70 89 94 0B 9A
##$RELAX= 
##$RELAX= 
##$RELAX= 
##$RELAX= 
##$RELAX= 
##$RELAX= 
$$ Bruker specific parameters
$$ --------------------------
##$DU= <F:/spectra>
##$EXPNO= 1
##$NAME= <H-F>
##$PROCNO= 1
##$TYPE= <nmr>
##$USER= <she>
##$AMP= (0..31)
100 100 100 100 100 100 100 100 100 100 100 100 100 100 100 100 100 100 
100 100 100 100 100 100 100 100 100 100 100 100 100 100 
##$AQSEQ= 0
##$AQ_mod= 1
##$AUNM= <au_zg>
##$AUTOPOS= <>
##$BF1= 200.13
##$BF2= 200.13
##$BF3= 200.13
##$BF4= 200.13
##$BF5= 200.13
##$BF6= 200.13
##$BF7= 200.13
##$BF8= 200.13
##$BYTORDA= 1
##$CFDGTYP= 0
##$CFRGTYP= 5
##$CHEMSTR= <none>
##$CNST= (0..31)
1 1 145 1 1 1 1 1 1 1 1 1 1 1 1 1 1 1 1 1 1 1 1 1 1 1 1 1 1 1 1 1 
##$CPDPRG= <>
##$CPDPRG1= <>
##$CPDPRG2= <>
##$CPDPRG3= <>
##$CPDPRG4= <mlev>
##$CPDPRG5= <mlev>
##$CPDPRG6= <mlev>
##$CPDPRG7= <mlev>
##$CPDPRG8= <mlev>
##$CPDPRGB= <>
##$CPDPRGT= <>
##$D= (0..31)
0 1.2 0 0 0 0 0 0 0 0.06 0 0.03 0 0 0 0 0.0002 0 0 0 0 0 0 0 0 0 0 0 0 
0 0 0 
##$DATE= 1689070976
##$DBL= (0..7)
120 120 120 120 120 120 120 120 
##$DBP= (0..7)
150 150 150 150 150 150 150 150 
##$DBP07= 0
##$DBPNAM0= <>
##$DBPNAM1= <>
##$DBPNAM2= <>
##$DBPNAM3= <>
##$DBPNAM4= <>
##$DBPNAM5= <>
##$DBPNAM6= <>
##$DBPNAM7= <>
##$DBPOAL= (0..7)
0.5 0.5 0.5 0.5 0.5 0.5 0.5 0.5 
##$DBPOFFS= (0..7)
0 0 0 0 0 0 0 0 
##$DE= 6
##$DECBNUC= <off>
##$DECIM= 32
##$DECNUC= <off>
##$DECSTAT= 4
##$DIGMOD= 1
##$DIGTYP= 9
##$DL= (0..7)
0 120 120 120 120 120 120 120 
##$DP= (0..7)
150 150 150 150 150 150 150 150 
##$DP07= 0
##$DPNAME0= <>
##$DPNAME1= <>
##$DPNAME2= <>
##$DPNAME3= <>
##$DPNAME4= <>
##$DPNAME5= <>
##$DPNAME6= <>
##$DPNAME7= <>
##$DPOAL= (0..7)
0.5 0.5 0.5 0.5 0.5 0.5 0.5 0.5 
##$DPOFFS= (0..7)
0 0 0 0 0 0 0 0 
##$DQDMODE= 0
##$DR= 18
##$DS= 0
##$DSLIST= <SSSSSSSSSSSSSSS>
$$ [...]
##$SUBNAM2= <"">
##$SUBNAM3= <"">
##$SUBNAM4= <"">
##$SUBNAM5= <"">
##$SUBNAM6= <"">
##$SUBNAM7= <"">
##$SUBNAM8= <"">
##$SUBNAM9= <"">
##$SW= 18.05172834244
##$SWIBOX= (0..15)
0 0 2 0 0 0 0 0 0 0 0 0 0 0 0 0 
##$SW_h= 3612.71676300578
##$TD= 16384
##$TD0= 1
##$TE= 0
##$TE2= 300
##$TE3= 300
##$TEG= 300
##$TL= (0..7)
0 120 120 120 120 120 120 120 
##$TP= (0..7)
150 150 150 150 150 150 150 150 
##$TP07= 0
##$TPNAME0= <>
##$TPNAME1= <>
##$TPNAME2= <>
##$TPNAME3= <>
##$TPNAME4= <>
##$TPNAME5= <>
##$TPNAME6= <>
##$TPNAME7= <>
##$TPOAL= (0..7)
0.5 0.5 0.5 0.5 0.5 0.5 0.5 0.5 
##$TPOFFS= (0..7)
0 0 0 0 0 0 0 0 
##$TUNHIN= 0
##$TUNHOUT= 0
##$TUNXOUT= 0
##$USERA1= <user>
##$USERA2= <user>
##$USERA3= <user>
##$USERA4= <user>
##$USERA5= <user>
##$V9= 5
##$VALIST= <valist>
##$VCLIST= <CCCCCCCCCCCCCCC>
##$VD= 0
##$VDLIST= <DDDDDDDDDDDDDDD>
##$VPLIST= <PPPPPPPPPPPPPPP>
##$VTLIST= <TTTTTTTTTTTTTTT>
##$WBST= 1024
##$WBSW= 4
##$XGAIN= (0..3)
0 0 0 0 
##$XL= 0
##$YL= 0
##$YMAX_a= 344109
##$YMIN_a= -370291
##$ZGOPTNS= <>
##$ZL1= 120
##$ZL2= 120
##$ZL3= 120
##$ZL4= 120
##$ABSF1= 10
##$ABSF2= 0
##$ABSG= 5
##$ABSL= 3
##$ALPHA= 0
##$AQORDER= 0
##$ASSFAC= 0
##$ASSFACI= 0
##$ASSFACX= 0
##$ASSWID= 0
##$AUNMP= <proc_1d>
##$AZFE= 0.1
##$AZFW= 0.1
##$BCFW= 1
##$BC_mod= 2
##$BYTORDP= 1
##$COROFFS= 0
##$CY= 11.3945322036743
##$DATMOD= 1
##$DC= 2
##$DFILT= <>
##$DTYPP= 0
##$F1P= 15.7292609196834
##$F2P= 12.9074282941183
##$FCOR= 0.5
##$FTSIZE= 0
##$FT_mod= 4
##$GAMMA= 1
##$GB= 0.15
##$INTBC= 1
##$INTSCL= 1
##$ISEN= 128
##$LB= 0.24
##$LEV0= 0
##$LPBIN= 0
##$MAXI= 10000
##$MC2= 0
##$MEAN= 0
##$ME_mod= 0
##$MI= 1.114404
##$NCOEF= 0
##$NC_proc= 0
##$NLEV= 6
##$NOISF1= 3.799351
##$NOISF2= 2.8
##$NSP= 1
##$NTH_PI= 0
##$NZP= 0
##$OFFSET= 15.70392
##$PC= 1
##$PHC0= -20984.67
##$PHC1= 5.25272
##$PH_mod= 1
##$PKNL= yes
##$PPARMOD= 0
##$PSCAL= 0
##$PSIGN= 0
##$REVERSE= no
##$SF= 200.130013532006
##$SI= 16384
##$SIGF1= 3
##$SIGF2= 2
##$SINO= 400
##$SIOLD= 16384
##$SREGLST= <1H.CDCl3>
##$SSB= 0
##$STSI= 0
##$STSR= 0
##$SW_p= 3612.71676300578
##$SYMM= 0
##$S_DEV= 0
##$TDeff= 0
##$TDoff= 0
##$TI= <>
##$TILT= no
##$TM1= 0
##$TM2= 0
##$TOPLEV= 0
##$USERP1= <user>
##$USERP2= <user>
##$USERP3= <user>
##$USERP4= <user>
##$USERP5= <user>
##$WDW= 1
##$XDIM= 8192
##$YMAX_p= 0
##$YMIN_p= 0
$$ End of Bruker specific parameters
$$ ---------------------------------
##NTUPLES= NMR FID
##VAR_NAME=  TIME,          FID/REAL,        FID/IMAG
##SYMBOL=    X,             R,               I
##VAR_TYPE=  INDEPENDENT,   DEPENDENT,       DEPENDENT
##VAR_FORM=  AFFN,          ASDF,            ASDF
##VAR_DIM=   8192,          8192,            8192
##UNITS=     SECONDS,       ARBITRARY UNITS, ARBITRARY UNITS
##FACTOR=    0.0002768,     1,               1
##FIRST=     0,             0,               0
##LAST=      2.2672688,     0,               0
##MIN=       0,             -370291,         0
##MAX=       2.2672688,     344109,          0
$$ Real data points
##PAGE= N=1
##DATA TABLE= (X++(R..R)), XYDATA
$$ [...]
2016a651M09K366R57j121o5J787R90k315j725O88R67j856j665J332J766o23j647
$$ -1651 -1242 1124 2081 960 895 2682 3672 1357 -368 320 1287 -569 -2234 -902 864 241 -1406
2033a406J39J185o8j998k17J500M64j127q56K620K071r27j109J400J555j306k488
$$ -1406 -1267 -82 -150 -2148 -2365 -865 -401 -1528 -2384 236 2307 1380 271 1671 3226 1920 -568
2050e68J13K084o82j403L30K370k35k226j342J460J94k589j019J997J251j059
$$ -568 -455 1629 947 -456 -126 2244 2009 -217 -1559 -99 95 -2494 -3513 -1516 -265 -1324
2066a324q54J678K200q75j497N99J672o98j712K13J993M50j026JJ918o2k047j665
$$ -1324 -2178 -500 1700 825 -672 -73 1599 901 -811 -598 1395 1845 819 820 2738 2676 629 -1036
2084a036N82K91j503j440J148K186k68j454M04J520j23j800o5J712M85j348m58
$$ -1036 -454 -163 -1666 -3106 -1958 228 -40 -1494 -1090 430 307 -1493 -1558 154 639 -709 -1167
2101a167K205J591j230q02J181J212j937k209K18J245p67j185P48J868K8j685
$$ -1167 1038 2629 1399 597 1778 2990 1053 -1156 -938 307 -460 -1645 -897 971 999 -686
2117f86j040J463P3j917r76K329J407j166m16J777J425p16j398Q52J126p42k211
$$ -686 -1726 -263 -190 -2107 -3083 -754 653 -513 -929 848 2273 1557 159 1011 2137 1395 -816
2134h16J49J341N82j386m31J639L12j528j581M75O39j236j177J550J938J2j036
$$ -816 -667 674 1256 -130 -561 1078 1390 -138 -1719 -1244 -605 -1841 -3018 -1468 470 482 -554
2151e54L52J973l11j806m29J728N34j513l75J519J111j332r31J030N44j474k204
$$ -554 -202 1771 1460 -346 -775 953 1487 -26 -401 1118 2229 897 -34 996 1540 66 -2138
2168b138M05Q86n50j127J003J980K4j364l02J372J91j468m41K005J292j320k01
$$ -2138 -1733 -847 -1397 -2524 -1521 459 483 -881 -1183 189 380 -1088 -1529 476 1768 448 247
2185B47J368J253j390j296M44P41j023j844J81J437l11j190K87J294K79j712o59
$$ 247 1615 2868 1478 182 626 1367 344 -1500 -1319 118 -193 -1383 -1096 198 477 -1235 -1894
2202a894P69N58j210n37J719J713q3o88R48R60m65j723l71J241O50j582k86J281
$$ -1894 -1125 -567 -1777 -2314 -595 1118 1035 347 1295 2255 1790 67 -304 937 1587 5 -281 1000
2220A000N40j453j024P50L48j170j455M39J190n01j154J129K422J45j460J85J160
$$ 1000 1540 87 -937 -187 161 -1009 -2464 -2025 -835 -1336 -2490 -1361 1061 1206 -254 -69 1091
2237A091J30j896kJ451J069p69n87J029R89j416k007O28O36o11j761M89J092k44
$$ 1091 1221 -675 -677 774 1843 1074 487 1516 2505 1089 -918 -290 346 -265 -2026 -1537 -445 -689
2255f89q70K84J813l20q95o78R04O53q41o18J435J807m31p16P26J004r89j890
$$ -689 -1559 -1275 538 218 -677 -1355 -451 202 -639 -1257 178 1985 1554 838 1564 2568 1579 -311
2273c11m63J363R3j549l83J825N59j565j093J229N89j316j097Q84R27k71r43J203
$$ -311 -774 589 682 -867 -1250 575 1134 -431 -1524 -295 294 -1022 -2119 -1235 -308 -579 -1522 -319
2291c19J756Q1p94k80J440l81j669p28J306P80o64r05J144P74j503r71L44N69
$$ -319 1437 1518 724 444 1884 1503 -166 -894 412 1192 528 -377 767 1541 38 -933 -589 -20
2309b0j004p88K64J409Jj160N70J506L16j167l93J150K03p96q57J211J144m58
$$ -20 -1024 -1812 -1548 -139 -138 -1298 -728 778 1094 -73 -466 684 887 91 -766 445 1589 1131
2327A131r30L82J026r25j807j56R96j68j138n7J826N42j388p11J301P34r59p90
$$ 1131 201 583 1609 684 -1123 -1279 -283 -451 -1589 -1646 180 722 -666 -1377 -76 658 -301 -1091
2345a091Q52J169n10q49P54J918n83j389K45R25o26j759j30Q30L66o31o91J335
$$ -1091 -239 930 420 -429 325 2243 1660 271 516 1441 815 -944 -1074 -244 122 -509 -1200 135
2363A35Q67j292j379O86P32p20q22R89J368N81j169K63J565n2j288m18Q90M81
$$ 135 1002 -290 -1669 -983 -251 -971 -1793 -804 564 1145 -24 239 1804 1752 464 46 936 1417
2381A417j503j068J301R36r83p19P98O50p93j823Q8P69K23r92K46J921N22j099
$$ 1417 -86 -1154 147 1083 100 -619 179 829 36 -1787 -1699 -930 -707 -1699 -1453 468 990 -109
2399a09l38J033N16q62r39R51J418q14j255R36J334n31j335J46O64p19j504l07
$$ -109 -447 586 1102 240 -699 252 1670 856 -399 537 1871 1340 5 151 815 96 -1408 -1715
2417a715J091K85q68j29J358Q00j094p60N79R29p29q68P90J687m63m71K11J105
$$ -1715 -624 -339 -1207 -1336 22 822 -272 -1032 -453 476 -253 -1121 -331 1356 893 422 633 1738
2435A738l87j094j73O09p6r73p82O14R09l79j004R43N38p25j049K5R46O3p98Q5
$$ 1738 1351 257 84 693 617 -356 -1138 -524 385 6 -998 -55 483 -242 -1291 -1266 -320 -257 -1055 -970
2455i70J707N52q91k36J104K78j355p55Q33O55o82p52O92O97l09j194P8Q32o25
$$ -970 737 1289 398 162 1266 1544 189 -566 267 922 240 -512 180 877 568 -626 -548 284 -341
2474c41r83l85J261J22m76Q4J319N94q42p45M43O80p07o81N68J165P7r47l9Q86
$$ -341 -1324 -1709 -448 -326 -802 -718 601 1195 353 -392 51 731 24 -657 -89 1076 1153 206 167 1053
2494A053k37j318l56Q58j64p95k42O65N95m00n23R44O10m22j038K65J022l35p62
$$ 1053 816 -502 -858 0 -164 -959 -1201 -536 59 -341 -864 80 690 268 -770 -505 517 182 -580
2513e80O12J228L10q63m28N04M7j195m79L96P42p27o69O05R20o29p37J81R42n0
$$ -580 32 1260 1570 707 279 783 830 -365 -844 -448 294 -433 -1102 -497 423 -206 -943 -762 180 130
2533A30j111R3J007L15n84J73J178O47j073m84K34L10j134j23K33P41Q8q31L7
$$ 130 -981 -888 119 434 -150 23 1201 1848 775 291 525 835 -299 -422 -189 552 640 -191 -154
2552a54Q24o51q42q79J195N47j191j81J174O22l33l22O97Q04m14j114J71R12l72
$$ -154 670 19 -823 -1702 -507 40 -1151 -1332 -158 464 131 -191 506 1310 896 -218 -47 865 493
2571D93j022O41R07K02j060k09M70M0j366o86N17Q05m70m66P67Q00m28n81K85
$$ 493 -529 112 1019 1221 161 -48 422 462 -904 -1590 -1073 -268 -738 -1204 -437 363 -65 -646 -361
2590c61Q24p0q40J50O81K00m01L48N01N98q43n67J45L74j112o72K59O22P9p42
$$ -361 463 393 -447 -297 384 584 183 531 1032 1630 787 220 365 739 -373 -1045 -786 -164 -85 -827
2610h27L20P64l56o82n63R46L90q16L6R85Q81n14n58O13P41m52j010M19M15n52
$$ -827 -507 257 -99 -781 -1344 -398 -8 -824 -788 197 1078 564 6 619 1360 908 -102 317 732 180
2630A80r14L17J185q7r80k20O17N6j140o03R17K77r0k09O55P48j78q01N46P78
$$ 180 -734 -417 768 681 -299 -519 98 154 -986 -1589 -672 -395 -485 -694 -39 709 531 -270 276 1054
2650A054m48o22J46P40K3r02k52Q29K30p07o88P66N8r11q62Q71N10j67k43L01
$$ 1054 606 -16 130 870 893 -9 -261 568 798 91 -597 169 227 -684 -1546 -675 -165 -332 -575 -274
2670b74J040m41q01o5P11P0j61l32J100O00q59m50M57N44r92o53J07O25l15j170
$$ -274 766 325 -476 -541 170 240 79 -253 847 1447 588 138 595 1139 147 -506 -399 226 -89 -1259
2690a259O56O91j8p85p1P36K80j135l92J111N37l94k49Q72R61n04q74K76M55o34
$$ -1259 -603 88 70 -715 -786 -50 230 -905 -1297 -186 351 -43 -292 580 1541 1037 163 439 894 260
2710B60q59K18O54J08p63m4N65L13p62n47N21K99r02l98M53R56O0n58O33R11k56
$$ 260 -599 -381 273 381 -382 -426 139 452 -310 -857 -336 -37 -939 -1337 -884 72 132 -426 207 1118 862
2731H62q65N4N17K30q69l70J329J09q78l17L40L04j001o48M63M63l72n08K47P50
$$ 862 -3 51 568 798 -71 -441 888 997 119 -198 142 446 -555 -1203 -740 -277 -649 -1157 -910 -160
2751a60K64o31J87J161m59l86n20P54L45m83J4N63P15l90q06L35Q1m46p95J26
$$ -160 104 -527 -340 821 362 -24 -544 210 555 72 86 649 1364 974 168 503 584 138 -657 -531
2771e31M49j44m69j01P24O0l79p46Q93L50m31j60K26P90k29m8M13N14M9j267M
$$ -531 -82 -226 -695 -796 -72 -12 -391 -1137 -244 106 -325 -485 -259 531 302 254 667 1181 1230 -37 -33
2792c3M74p9p47J46M53M37r04m85N16N28q82k85J38M69j64k14J63Q85j07l84k03
$$ -33 441 362 -385 -239 214 651 -253 -738 -222 306 -576 -861 -723 -254 -418 -632 -469 416 309 -75 -278
2813b78R06N4p01J13K37L53n70nO55J66o31o17J35K77p45m49J79M92K20m4k54
$$ -278 628 682 -19 94 331 684 114 109 764 930 299 -318 -183 94 -651 -1100 -921 -429 -209 -253 -507
2834e07M78K32l82m61P43M32q09K29L93L12k6n97L42O56l57p77j97K29P0o68l5
$$ -507 -29 203 -179 -640 103 535 -274 -45 348 660 634 37 379 1035 678 -99 -296 -67 3 -665 -700
2855g00O62N01q89m53J017K68p41m29L52R18l86n92O04O08o5o19K35M69J91j175
$$ -700 -38 463 -426 -879 138 406 -335 -764 -412 506 120 -472 132 740 675 56 291 760 951 -224
2875b24K67k5J59n54k02N46P51n61l93m1Q3p5p79J28P85L58o46L13P71J59n53
$$ -224 43 18 177 -377 -579 -33 718 157 -236 -277 -194 -269 -1048 -920 -135 223 -423 -110 661 820 267
2896B67j57K22K64o23k67L35M17j67q13M90P78o98m73k05L97Q0p18p0Q35K05k27
$$ 267 110 332 596 -27 -294 41 458 291 -522 -32 746 48 -425 -630 -233 -153 -871 -941 -106 99 -128
2917a28j80N05L18q58p7K01Q06k71l45J28Q88l98o81J03N02k98n84k06M88p3p00
$$ -128 -308 197 515 -343 -420 -219 587 316 -29 99 987 589 -92 11 513 215 -369 -575 -87 -160 -860
2938h60l60P56N68k86l13J47M17j25o96K86J056k27l61L98M78j31m66j70J59M24
$$ -860 -1220 -464 104 -182 -495 -348 69 -56 -752 -466 590 363 2 400 878 747 281 111 270 694
2958F94p06m54O48L00m59k88J45K18j4r46L95M25j82o95N54M53K80n51P1P46P0
$$ 694 -12 -466 182 482 23 -265 -120 98 84 -862 -467 -42 -224 -919 -365 88 368 -183 -112 634 704
2979G04m07o50K57P37l59m69M97O0k7o69L98k4j06q65L00O74j68n82jP80j7q4
$$ 704 297 -353 -96 641 282 -187 310 370 343 -326 72 48 -58 -923 -623 51 -117 -699 -700 80 63 -21
3001b1k58L07M94l39n21K73P14l11n5j10O24j29p41l56K79J99l93m86P02N80m84
$$ -21 -279 28 522 183 -338 -65 649 338 283 173 797 668 -73 -429 -150 49 -344 -830 -128 452 -32
3022c2m70K63N19p15r7L5P43j83l49n4R49l9m64M8L73J53p21m67N78L54n29l79
$$ -32 -502 -239 280 -435 -532 -497 246 63 -286 -340 609 570 106 154 527 680 -41 -508 70 424 -105 -484
3044d84P71K54p43k81J78J74K02m18j61N97J7k90k72P59L77o06p9M19mk74n04
$$ -484 287 541 -202 -483 -305 -131 71 -347 -508 89 106 -184 -456 303 680 74 -5 414 410 136 -368
3065c68K26O47l85m28J98P18m63q55J56K95J37n65k1L19Q20m05k75M45L62n48
$$ -368 -142 505 120 -308 -110 608 145 -710 -554 -259 -122 -687 -708 -389 431 26 -249 196 558 10
3085A0o0JM10j23k94o8P31j03n42J29L99k12m61k87L15J3l56mJ96M73m00k26L24
$$ 10 -50 -49 361 238 -56 -124 607 504 -38 91 490 278 -183 -470 -155 -142 -498 -502 -306 167 -233 -459 -135
3108a35J62k67l2JO41J29n41J66L65J74l81m8p0L29j73l55j27P2r0q2j5O38k46
$$ -135 27 -240 -272 -271 370 499 -42 124 489 663 282 234 164 493 320 -35 -162 -90 -180 -262 -277 361 115
3131A15n49P0K41J29m93j82O79L42k7k69L57J13j69l55o1Q26m75n27L24L81l01
$$ 115 -434 -364 -123 6 -487 -669 10 352 325 56 413 526 357 2 -59 767 292 -235 89 470 169
3152A69l16l52R24k80n76k01K41O5m40L59L85J21l57J74K32o1J20q43P51M09l91
$$ 169 -147 -499 425 145 -431 -632 -391 -326 -766 -407 -22 99 -258 -84 148 87 207 -636 115 524 133
3173A33m1J33L16P9n1o80j27P39p98j08j48P82m99j2J02K45l4n86M08O5K97q47
$$ 133 92 225 541 620 569 -111 -238 501 -297 -405 -553 229 -270 -282 -180 65 31 -555 -147 -82 215 -632
3195f32K10M63J89j61J01N50M5m96m25K14L05m02l69N1L72j31m95M36P9l4k58
$$ -632 -422 41 230 69 170 720 765 269 -156 58 363 -39 -408 -357 15 -116 -611 -175 -96 -130 -388
3216c88O0k2K88j34j65O02K93p9k20K2O8j63j29j32N28j09k75m9K84L39q47k64
$$ -388 -328 -350 -62 -196 -361 241 534 455 235 257 325 162 33 -99 429 320 45 -4 280 619 -228 -492
3238d92L29J43l02n02N76R4J21k68j25Q30k12k30Q0R4L18n17j82L31L69k98j80
$$ -492 -163 -20 -322 -824 -248 -154 -33 -301 -426 404 192 -38 42 136 454 -63 -245 86 455 157 -23
3259b3O25k22k60j49k64K34m0n17K70K05J6k03N9N05j77l13J4J04K90j98j09L65
$$ -23 602 380 120 -29 -293 -59 -99 -616 -346 -141 -125 -328 -269 236 59 -254 -240 -136 154 -44 -153 212
3281B12O23l17k38j95N98m57j45l09K85J6k35M9K12l5m89j18l1L77P9l16K67M12
$$ 212 835 518 280 85 683 226 81 -228 57 73 -162 -113 99 64 -425 -543 -574 -197 -118 -434 -167 245
3303B45j1l97L84K58k35M9l42M88j6n71K97K18P1j99m63K33L26l93m29K05K88
$$ 245 234 -163 221 479 244 293 -49 439 423 -148 149 367 438 239 -224 9 335 -58 -487 -282 6
3324Fm12j38K56K75LQ4l5m0K04k80J15M4L60k94j08M57j45k5l47k4Q1P4l84q8
$$ 6 -406 -544 -288 -13 -10 74 39 -1 203 -77 38 82 442 148 40 497 352 327 -20 -44 37 111 -273 -361
3348c61K50j93k26K95M60r2m03n8K98J35m86M9M10L32k52k42N21k49K69k62k69
$$ -361 -111 -304 -530 -235 225 133 -270 -328 -30 105 -381 -332 78 410 158 -84 437 188 457 195 -74
3369g4M81j83l04j77K95L27o79J82K58j15l75J00j7j6m1J44K38K14J26m08K26
$$ -74 407 224 -80 -257 38 365 -314 -132 126 11 -364 -264 -281 -297 -338 -194 44 258 384 -24 202
3390B02n6J21l10K40l1K12m71l23M81K89n65pR8N14m88j89M8K32j86M9r9J42J10
$$ 202 146 267 -43 197 166 378 -93 -416 65 354 -211 -218 -120 394 -94 -283 -235 -3 -189 -140 -239 -97 13
3413A3L33m88K67K80k39j46J42P8J86p49P06j62j98q2k95M26mm00K15j44J75l24
$$ 13 346 -142 125 405 166 20 162 240 426 -323 383 221 23 -59 -354 72 68 -332 -117 -261 -86 -410
3435d10j1L91L16k37k85N9R0Q9j26N25Pk84j1J17M4j28m96L81o8L4k79J89J55
$$ -410 -421 -30 286 49 -236 -177 -87 2 -124 401 408 124 113 230 274 146 -350 31 -37 -3 -282 -93 62
3458F2j11Lk84q6O17o5l74r9M23M2k12J65K40J61k20l03L26q2j32j93J69K80m05
$$ 62 -49 -46 -330 -416 201 136 -238 -337 86 128 -84 81 321 482 262 -41 285 203 71 -122 47 327 -78
3481g8k41K50J39K2l62k1J36R8j96q9L27J22k85mN17L05o91L2m5K45j13k31L80
$$ -78 -319 -69 70 92 -270 -291 -155 -57 -253 -342 -15 107 -178 -182 335 640 -51 -19 -64 181 68 -163 217
3504B17K22m9j10j49n0J87o47J79M73j45k54l60K27M77k82k05J38L27l84J85o4
$$ 217 439 390 280 131 81 268 -379 -200 273 128 -126 -486 -259 218 -64 -269 -131 196 -188 -3 -67
3525f7J64N9r1J73l5L5J58k24J69j42m48j03L00J70j12j91K31j55K91n99k4N46
$$ -67 97 156 65 238 203 238 396 172 341 199 -249 -352 -52 118 6 -185 46 -109 182 -417 -441 105
3547A05j51l0o2L48l73L11m67J078n37j69N0Po6j35q7M29o8k91J28l68K64J75
$$ 105 -46 -76 -138 210 -163 148 -319 759 222 53 103 110 44 -91 -178 251 183 -108 20 -348 -84 91
3569I1l18k41K59Q3p3n9J41L39n62NL50J25J03k33j01M69J6m67q6K10K91n98p4
$$ 91 -227 -468 -209 -126 -199 -258 -117 222 -340 -335 15 140 243 10 -91 378 394 -73 -159 51 342 -256 -330
3592c30M03K01l84k86L22J13o4l2m2ML10n46M94j02J91k27O7K74j25k28K66J62
$$ -330 73 274 -110 -396 -74 39 -25 -57 -99 -95 215 -331 163 61 252 25 92 366 241 13 279 441
3614D41l82j27J20N9j76o1j39J85N3o4L2j71L67J1m11q5L05J07O4j70J19J56m7
$$ 441 59 -68 52 111 -65 -126 -265 -80 -27 -91 -59 -230 137 148 -263 -348 -43 64 128 -42 77 233 186
3637A86n38M23L36m8m68J62L59l94j29N0K74k07k04Q3j5L66n00k36O11N9k76J21
$$ 186 -352 71 407 359 -109 53 412 18 -111 -61 213 6 -198 -115 -130 236 -264 -500 111 170 -106 15
3659A5M22j23k85j15J89M8l55J86R0J61J67m67K8J17p5j53K04j19J81m34m9J74
$$ 15 437 314 29 -86 103 151 -204 -18 72 233 400 -67 -39 78 3 -150 54 -65 116 -318 -367 -193
3681a93J05p5j60L68K35j65m92J76J62L84l26r0M85j11k22k11L18J8o2m28K06
$$ -193 -88 -163 -323 45 280 115 -377 -201 -39 345 19 -71 414 303 81 -130 188 206 144 -284 -78
3702g8Q0j68N5L16l5m33n5R6K55K8o48L39K97L9j77l53N37K24j14l70L50J71j40
$$ -78 2 -166 -111 205 170 -263 -318 -222 33 61 -587 -248 49 88 -89 -442 95 319 205 -165 185 356 216
3725B16m40J11L58j72r5k49J52J78l4l38P3L25j97p3J15R0K35n11L73Q4O8k96
$$ 216 -224 -113 245 73 -22 -271 -119 59 25 -313 -240 85 -112 -185 -70 20 255 -256 117 201 269 -27
3747b7j75M24j28j10OK15K99l92j92L10j54k86j74J90J21Q2k49l5J68J65l45J31
$$ -27 -202 222 94 -16 -10 205 504 112 -80 230 76 -210 -384 -194 -73 9 -240 -275 -107 58 -287 -156
3769a56L87l10j76K14K44j18M2l74L87O4K3l09K95k04j04l04J43K72M12m75j33
$$ -156 231 -79 -255 -41 203 85 127 -247 140 204 227 -82 213 9 -95 -399 -256 16 428 -47 -180
3790a80M44l04N0m80N37N6j58J20k7J38J78m58P5J86N3k62j14L19pl33lP9M2K96
$$ -180 264 -40 10 -470 67 123 -35 85 58 196 374 -84 -9 177 230 -32 -146 173 166 -167 -170 -91 -49 247
3814B47l12k89L63j88o2%L65j70l2N2R3k1k30L99L6n2l20N0L96l44j37P2L29J59
$$ 247 -65 -354 9 -179 -241 -241 124 -46 -78 -26 67 46 -184 215 251 199 -121 -71 325 -19 -156 -84 245 404
3838D04l94j66j22K93m38j0N8K51k08l3Q3L30P9k62R3j88L67J13j75J97j06J8
$$ 404 10 -156 -278 15 -423 -433 -375 -124 -332 -365 -282 48 127 -135 -42 -230 137 250 75 272 166 184
3860A84r9j73J71J95n78M98l1m37R1q8M20j2k08Q9j89O1j38o9M2O41l31k05J77
$$ 184 85 -88 83 278 -300 198 167 -270 -179 -267 153 141 -67 22 -167 -106 -244 -313 -271 370 39 -166 11
3883A1K18r0j86L49J13j83m55L32j54J4j63o1J38O3l8l7j16K24j26k08L62j69
$$ 11 229 139 -47 302 415 232 -223 109 -45 -31 -194 -255 -117 -54 -92 -129 -245 -21 -147 -355 7 -162
3905a62P8J45l66M24j20M6j01M33j25l70L92j97R6k42K64j13l0P8k97K4j58P7
$$ -162 -84 61 -305 119 -1 45 -56 377 252 -118 274 77 173 -69 195 82 52 130 -167 -143 -301 -224
3927b24J08j04M04j28o3Q8j52J11r3m2jK65k9P5k63K91N9m21K1L39m34p4J50K06
$$ -224 -116 -220 184 56 -7 81 -71 40 -53 -95 -96 169 140 215 -48 243 302 -119 -98 241 -193 -267 -117 89
3951H9j03k21O9L68r4k37J9j92L19q5j70M06k8K4J3rK25j71l28J49K12m57J62
$$ 89 -14 -235 -166 202 108 -129 -110 -302 17 -68 -238 168 140 164 177 168 393 222 -106 43 255 -202 -40
3974d0j15J95J17j98R5J95r9k41l64L59JK15k76k29L82J88l09K34o9J90j09k45
$$ -40 -155 40 157 -41 54 249 150 -91 -455 -96 -95 120 -156 -385 -3 185 -124 110 41 231 122 -123
3996a23J52Q7j21j23K87J58k10l18L89j98MJ00q6k30O1J64j8k61L06j43J8K52
$$ -123 29 116 -5 -128 159 317 107 -211 178 -20 -16 84 -2 -232 -171 -7 -25 -286 20 -123 -105 147
4018A47K4k08k26N21l29K32k93J15M14j43m45P4M4j46J19L4L04k02m0l49J17J68
$$ 147 171 -37 -263 258 -71 161 -132 -17 397 254 -191 -117 -73 -219 -100 -66 238 36 -4 -353 -236 -68
4040f8m7K26K3k43L44l47L09K1j43k81K34L88j40k80J9k4j05r7j19K66K80j51
$$ -68 -115 111 134 -109 235 -112 197 218 75 -206 28 416 276 -4 15 -9 -114 -211 -330 -64 216 65
4062F5Om36O28m15j38L84k55J70q2Q5J83Q3l85J93M4K01k90K33k04o6L11m02j06
$$ 65 71 -365 263 -152 -290 94 -161 9 -73 12 195 278 -107 86 130 331 41 274 70 4 315 -87 -193
4085a93N12j87q1j28K6M1J28k73j6J83j25n5j63M54r5j56K78O7L4j71K3L8j89
$$ -193 319 132 51 -77 -51 -10 118 -155 -171 12 -113 -168 -331 123 28 -128 150 217 251 80 103 141 -48
4108d8P6j26M33k59r3q4K76m9R6l35j18N23n17L62k13J03m2k40J40J07P4j54J60
$$ -48 28 -98 335 76 -17 -101 175 126 222 -113 -231 292 -225 137 -76 27 -15 -255 -115 -8 66 -88 72
4131G2K52R2m33J70M0Q8k69j4j27K07p6J49k02K09j48k46J53j10J36k97K05R9
$$ 72 324 416 -17 153 193 281 12 -2 -129 78 2 151 -51 158 10 -236 -83 -193 -57 -354 -149 -50
4153e0L35l40J04M8J21Q3k53k0R7R6l35K5L79j15o5m15J07j5j23Q6K4K68O7k00
$$ -50 285 -55 49 97 218 301 48 28 125 221 -114 -89 290 175 110 -305 -198 -213 -336 -250 -226 42 109 -91
4177i1j47K61P3l70J52M28m51M01m46M50k45LJ24j1K31n07q2K73Op3l18K13J70
$$ -91 -238 23 96 -274 -122 306 -145 256 -190 260 15 18 142 131 362 -145 -227 46 52 -21 -339 -126 44
4200D4o4j83j2L3K50m64K99R7J13j00j14J90M89o80K30j01M4M0k37l4P3Q1O3O8
$$ 44 -20 -203 -215 -182 68 -396 -97 0 113 13 -101 89 578 -102 128 27 71 111 -126 -160 -87 -6 57 125
4224A25j22k61K25p2K72o5k95j8L1K89l41K18o8K60o9j75j85K73J34P4k23K68
$$ 125 3 -258 -33 -105 167 102 -193 -211 -180 109 -232 -14 -82 178 109 -66 -251 22 156 230 7 275
4246B75j50k23q0K69j54lq6K12k30J61m5K13k02J15j43K7J11j16K36m34J52J35
$$ 275 125 -98 -178 91 -63 -66 -152 60 -170 -9 -54 159 -43 72 -71 -44 67 -49 187 -247 -95 40
4268D0n9k33N80k10p4L2l3j57J69k66K60r3J26j67P3L1mj79j41M09Mk8k76K03
$$ 40 -19 -252 328 118 44 76 43 -114 55 -211 49 -44 82 -85 -12 19 15 -164 -305 104 108 80 -196 7
4292GJ1m5R8N6M8k01k0J38K65j79r3np1j91K69j85P0j11J40k17J89j8j05K56n0
$$ 7 18 -27 71 127 175 -26 -46 92 357 178 85 80 9 -182 87 -98 -28 -139 1 -216 -27 -45 -150 106 56
4317E6R6j42j88K66lP6j20K05k4j45j17j41L14Q7o1k00j40L5J28J3k33L22j77
$$ 56 152 10 -178 88 85 161 41 246 222 77 -40 -181 133 220 159 -41 -181 -146 -18 -5 -238 84 -93
4340i3P7j10L73lk54j62K67r8M7J23j24J39j82J67N8p4j88L58k28k1j21J23m63
$$ -93 -16 -126 247 244 -10 -172 95 -3 44 167 43 182 0 167 225 151 -37 321 93 72 -49 74 -389
4363c89L09j1k26J76J72m7j07J48N5K20m71R5L06k48M9o5J48K77l32Lj91M87l53
$$ -389 -80 -91 -317 -141 31 -16 -123 25 80 300 -171 -76 230 -18 31 -34 114 391 59 62 -129 358 5
4386EK63k45N8j88j67M7J79L8k59%k1J51L6P1j60L34j10J9j51J42L1O5k68M01
$$ 5 268 23 81 -107 -274 -227 -48 -10 -269 -269 -290 -139 -103 -32 -192 142 32 51 -100 42 73 138 -130 271
4410B71j22k59J76n0j3M8m12K77j1M2Q5J00k19K4J00p7O6j53j3K79j63K64j13
$$ 271 149 -110 66 16 3 51 -361 -84 -95 -53 32 132 -87 -63 37 -40 26 -127 -140 139 -24 240 127
4433A27j34RK20q8r1J48Q1k47j55L3Q5j15j9l3k2M70m49J20J22J5R4l19L6J40
$$ 127 -7 2 222 134 43 191 272 25 -130 -97 -12 -127 -146 -179 -201 269 -180 -60 62 77 171 -148 -112 28
4457B8M8j94K43j05j87J40L8K76j46p0j14J9J40j74k39K18J52J10m00Q5R1j1Q9
$$ 28 76 -118 125 20 -167 -27 11 287 141 71 -43 -24 116 -58 -297 -79 73 183 -217 -132 -41 -52 37
4480C7o1j3K63j30j25K24n2j33J63r6N7j70J1M3J32j12J21m6J15Q8m57l0j1Q2
$$ 37 -24 -37 226 96 -29 195 143 10 173 77 134 -36 -25 18 150 38 159 113 228 316 -141 -171 -182 -100
4504a00M7j66J29K0M2J48N1Jq2j59K65r7K31j06l97M5K60pj65j9R5N0r0m2N0K7
$$ -100 -53 -219 -90 -70 -28 120 171 172 90 -69 196 99 330 224 -173 -128 132 125 -40 -59 36 86 -4 -46 4 31
4530C1j25j6J84j13J6J28k33j82L62l29L88n0o9L22k33r4J73q2k41Q7J87n6m3
$$ 31 -94 -110 74 -39 -23 105 -128 -310 52 -277 111 61 -8 314 81 -13 160 78 -163 -76 111 55 12
4553A2j16J95j43Qj72J29M0k72K28J73k17L36P1k28J3j00R7J05p0j10M9P2j82
$$ 12 -104 91 -52 -44 -216 -87 -47 -319 -91 82 -135 201 272 44 57 -43 54 159 89 -21 28 100 -82
4576h2N8L2k17J28m6N6J35Q4j80j54J97j89m1K4Q4l5K39L6j84O2JQRJ58k62K20
$$ -82 -24 8 -209 -81 -127 -71 64 148 -32 -186 11 -178 -219 -195 -111 -146 93 129 -55 7 8 16 25 183 -79 141
4602A41j85l9J29k20L64L1m04M0n2M6L25k72l1l3J87j47L1N3J20K4j56R3O8m2
$$ 141 -44 -83 46 -174 190 221 -183 -143 -195 -149 176 -96 -127 -160 27 -120 -89 -36 84 108 -48 45 113 71
4626G1J30R2l64J35N1q2m8M8r0N2k32K60l7l07L58Lj25j33J01M8J60l72J30O6
$$ 71 201 293 -71 64 115 33 -15 33 -57 -5 -237 23 -14 -321 37 40 -85 -218 -117 -69 91 -281 -151 -85
4650h5n6M0j19J66K55j86m5q3J88o7k54M57k35jJ18o8J77k34j25J16K30J68k25
$$ -85 -141 -101 -220 -54 201 15 -30 -113 75 8 -246 211 -24 -25 93 25 202 -32 -157 -41 189 357 132
4673A32J3q4n1r1J3p7M20l80J97l27K47J24l87M40P8k55k27K59l05L12k36n6Q7
$$ 132 145 61 10 -81 -68 -145 275 -105 92 -235 12 136 -251 189 267 12 -215 44 -261 51 -185 -241 -154
4696a54M32l88K32m5J11k2m75J33K76k40N5Ol1L00j36l24L08L6j74%J94k10J61
$$ -154 278 -110 122 77 188 166 -309 -176 100 -140 -85 -79 -110 190 54 -270 38 74 -100 -100 94 -116 45
4719D5j14j09J30l7j98K8J85j26J41pk8R2j52oL00P0k32J83k04jk9K68k40p4J23
$$ 45 -69 -178 -48 -85 -283 -255 -70 -196 -55 -62 -90 2 -150 -156 144 214 -18 165 -39 -40 -69 199 -41 -115 8
4744HJ07j78K74j10o3l38m0N27k82J90p0L0Q7p7l20K45jq9L99N9k46M3m7m9J81
$$ 8 115 -63 211 101 38 -300 -340 187 -95 95 25 55 142 65 -255 -10 -11 -100 299 358 112 155 108 59 240
4769B40k84j59J96k1q4K54l79L95l14q8L69j20l22L05J09k49K53k47K12k75K98
$$ 240 -44 -203 -7 -28 -112 142 -237 158 -156 -244 125 5 -317 -12 97 -152 101 -146 66 -209 89
4790H9j61m2o6K10J09N3j36r5J50k89j0L42m40L33J0J3k81j54L92J79j8k29N2
$$ 89 -72 -114 -180 30 139 192 56 -39 111 -178 -188 154 -286 47 57 70 -211 -365 27 206 188 -41 11
4813A1Q6n2lj58m9K93j51J37j71J05j8n5M6j9p0r1J73k04K54k98L8K16jL8j61
$$ 11 97 45 42 -116 -165 128 -23 114 -57 48 30 -25 21 2 -68 -159 14 -190 64 -234 -196 20 19 57 -104
4838a04r1M60j80J04j60n1J09p0k61J83Ll0j28K43M3j90R0N6j20K39m06K27J13
$$ -104 -195 265 85 189 29 -22 87 17 -244 -61 -58 -88 -216 27 70 -120 -30 26 -94 145 -261 -34 79
4861G9j59j15K29M8O8j94j30M1J90J4l04M79l05J16j45j36J43K6K01j7N7k58P5
$$ 79 -80 -195 34 82 150 -44 -174 -133 57 71 -233 246 -59 57 -88 -224 -81 -55 146 129 186 -72 3
4884Cj64K13n4l9Q2n8j44K25l2p0j67J15M14k26m53M22Mm27M27k7MJ1k0P2K9k81
$$ 3 -161 52 -2 -41 41 -17 -161 64 32 -38 -205 -90 324 98 -355 67 71 -356 71 44 48 59 39 111 140 -141
4910a41K06m8j62J36O8J50J7q3k05o6K83j35K8j38L02J56m98K86l12M9P0N0K42
$$ -141 65 17 -145 -9 59 209 226 143 -62 -128 155 20 48 -90 212 368 -130 156 -156 -107 -37 13 255
4933B55l96n9M5J74j74J6J79j75k06M47j80J54k21j25J61K76k46K99j31k1M3k83
$$ 255 -141 -200 -155 19 -155 -139 40 -135 -341 106 -74 80 -141 -266 -105 171 -75 224 93 72 115 -168
4955a68J84k1K44j36K35k51m6K4j3m7J72k76j08K02K50r6m35K00j44J53K92l05
$$ -168 16 -5 239 103 338 87 41 65 52 5 177 -99 -207 -5 245 149 -286 -86 -230 -77 215 -90
4977i0j92L34n0J21j4M0l30j04N41j13p5J14LJ30J8m72J95j76N9q8RR1j59K22
$$ -90 -282 52 2 123 109 149 -181 -285 256 143 68 182 185 315 333 -139 56 -120 -61 -149 -140 -49 -208 14
5001A4J3j66L32J36m48P2K37l28L11k00P1M1q4k41L98J37l72L15k03l30J36L4
$$ 14 27 -139 193 329 -119 -47 190 -138 173 -27 44 85 1 -240 158 295 -77 238 35 -295 -159 -125
5023a25P4L07k8k83K31j19j06K0j25q5M17n2R8k14L0j13K55n0m39M18k32K47n
$$ -125 -51 256 228 -55 176 57 -49 -29 -154 -239 178 126 224 10 40 -73 182 132 -307 111 -121 126 121
5046A21k85N2J42p5k4J70j54Pr3K78J19l70K93k46K17l24J45J66Lk93J33O4j20
$$ 121 -164 -112 30 -45 -69 101 -53 -46 -139 139 258 -112 181 -65 152 -172 -27 139 142 -151 -18 46 -74
5069g4q3O3J09J24n6M2J7n3l28L08j18j78J21M81l14J33j00m24N78R1k97k04L00
$$ -74 -157 -94 15 139 83 125 142 89 -239 69 -49 -227 -106 375 61 194 94 -330 248 339 42 -162 138
5092A38j32j79J27J55J07k49q6J23m8k9O0l59M91J19k86k82K38KP4k31K01J39
$$ 138 6 -173 -46 109 216 -33 -119 4 -44 -73 -13 -372 119 238 -48 -330 -92 -90 -16 -247 -46 93
5114I3j26R9j84K92j83k17L75j28J92j72L3P6k98K60l22L91k46J55p5p0J02j4
$$ 93 -33 66 -118 174 -9 -226 149 21 213 41 74 150 -148 112 -210 181 -65 90 15 -55 47 33
5136C3O0k42K79k03k2J07J42k63ML32l01r1K98j73m3K21l28M79k26O3M2r3n1Q2
$$ 33 93 -149 130 -73 -95 12 154 -109 -105 227 -74 -165 133 -40 -83 138 -190 289 63 126 168 75 24 106
5160A06OJ90k73R6p9J47k66j03J17mJ10n3j85PL31Rl91M53l2j55r1o4r2K81j18
$$ 106 112 302 29 125 46 193 -73 -176 -59 -63 47 -6 -191 -184 147 156 -235 218 186 31 -60 -124 -216 65 -53
5185e3P3j33L6M31m14J4J9K54j82Q2Mk60j3J24N3L07j00j60k10J93q6K41n19M29
$$ -53 20 -113 -77 354 -60 -46 -27 227 45 127 131 -129 -142 -18 35 342 242 82 -128 65 -21 220 -299 130
5209A30n2l5P0j48J09j48K26k63j47M10k72K13k34L5K13p5q2L31k42j52J83Q7
$$ 130 78 43 113 -35 74 -74 152 -111 -258 152 -120 93 -141 -106 107 32 -50 281 39 -113 70 157
5231A57r1r0J09o4K9o1j40K64k57L23j1k82p1K28K6mO7o8j65L56j55k13N8o9L16
$$ 157 66 -24 85 21 50 -11 -151 113 -144 179 168 -114 -185 43 69 65 132 64 -101 255 100 -113 -55 -124 192
5256A92l61J45Q7R6l21J92j49J68P5k12q7J38m7J3J97j54K6ooJ37o6M0q3k23K59
$$ 192 -169 -24 63 159 -162 30 -119 49 124 -88 -175 -37 -84 -71 126 -28 -2 -8 -14 123 57 97 14 -209 50
5281E0n3J4N7O8N0j88J47K1k72K83j27k62OK23j95P5K69m8r0J8Q2l05K31k73K58
$$ 50 -3 11 68 136 186 -2 145 166 -106 177 50 -212 -206 17 -178 -103 166 118 28 46 128 -177 54 -219 39
5306C9R0p8n8j14J85J77j32k23J57L2o6j33L74m09J61j75J28P0k85J4K05J2J22
$$ 39 129 51 -7 -121 64 241 109 -114 43 75 9 -124 250 -159 2 -173 -45 25 -260 -246 -41 -29 93
5329I3j07k06L91k08J02l85L40K25J40m68J64k25J06k2J10Q8l68j43J58K02l03
$$ 93 -14 -220 171 -37 65 -320 20 245 385 -83 81 -144 -38 -60 50 138 -230 -373 -215 -13 -316
5350c16L27J46k41K92k28J99j84j03n4j06J72m1Q0Q8M3lJ18m01K68K79P3m17k10
$$ -316 11 157 -84 208 -20 179 -5 -108 -162 -268 -96 -137 -57 31 74 71 189 -212 56 335 408 -9 -219
5373b19K34j68M15l57l9J50r3j6k08M44j70R8K10j95l9k13L09l4l60K44%L4J5
$$ -219 15 -153 262 -95 -134 16 -77 -93 -301 143 -27 71 281 86 47 -166 143 109 -251 -7 -7 27 42
5396D2J18q8%J85n02K78k91M4K72j17J25n9J02k56q5K41k22R2J03L29l59Q2J28
$$ 42 160 72 72 257 -245 33 -258 -214 58 -59 66 7 109 -147 -232 9 -213 -121 -18 311 -48 34 162
5419A62qk53K42k72O1Q4N8j46L1J54k9j44j04J78m9J04R2j46J5K10o0Rl49K23
$$ 162 154 -99 143 -129 -68 16 74 -72 -41 113 84 -60 -164 14 -35 69 161 15 30 240 180 189 -160 63
5443F3k17K33J0kP1m3j15O6j45J07J75j05J1l61J29J81q0J99k29n6Q0o5K61m09
$$ 63 -154 79 89 87 158 115 0 66 -79 28 203 98 109 -252 -123 58 -22 177 -52 -108 -28 -93 168 -241
5467b41M47m21N49m57Q4j2Q6m0J21J36j32q9j07O7L1J5%J61j07J11m21N5J76j71
$$ -241 206 -215 334 -123 -39 -51 35 -5 116 252 120 31 -76 -9 22 37 37 198 91 202 -219 -164 12 -159
5491a59Q3M9j11K74k39K20j65J19l46K52J78l59J64J73j70J59m05K54J03o3k45
$$ -159 -76 -27 -138 136 -103 117 -48 71 -275 -23 155 -204 -40 133 -37 122 -283 -29 74 11 -234
5512b34L50k01R0R9l26K32j96J18J71k98L49k3l70J09K22K39n44J86M3k09J19
$$ -234 116 -85 5 104 -222 10 -186 -68 103 -195 154 131 -239 -130 92 331 -213 -27 16 -193 -74
5533g4J5K49K07j41k64o7OK39m9p0j00K48l49K53j06j17J24qJ61j66n8L11k02
$$ -74 -59 190 397 256 -8 -75 -69 170 121 51 -49 199 -150 103 -3 -120 4 -4 157 -9 -67 244 42
5556D2J90k98K43K3j68l4N6J52p5l34L09J76r5k2k2r9n0Q5k71Q8J57L8%Nrl01
$$ 42 232 -66 177 200 32 -2 54 206 131 -203 106 282 187 165 143 44 -6 79 -192 -104 53 91 91 96 87 -214
5582b14J83J87n2K3j23j95K91j76L9j2Q2J6n4J0K14j57L3k55N20k54k96J61J34
$$ -214 -31 156 104 127 4 -191 100 -76 -37 -49 33 49 -5 5 219 62 95 -160 360 106 -190 -29 105
5605A05Pj93J52k4K32j33k2k20K92j70L07l88K22k13J34K5k79K95J10k64qp5k42
$$ 105 112 -81 71 47 279 146 124 -96 196 26 333 -55 167 -46 88 113 -166 129 239 -25 -33 -108 -350
5628c50L77j8p9j41K85J20j06r6J61q7j03K70r6j3j08J60l4j52n6M71m84J26M3
$$ -350 27 9 -70 -211 74 194 88 -8 153 66 -37 233 137 124 16 176 142 -10 -66 405 -79 47 90
5651I0k20l7R0J62k21M47l47m6%J7m6N0K48M2k19O0j62q4K51j47P5J65l26J68
$$ 90 -130 -167 -77 85 -136 311 -36 -82 -82 -65 -111 -61 187 229 10 70 -92 -176 75 -72 3 168 -158 10
5675A0j25K57m9Ok99J18J94R5k02k04M42k37j6l05P2K17j36N6O3J78n1j55Q1J7
$$ 10 -115 142 93 99 -200 -82 112 207 5 -199 243 6 -10 -315 -243 -26 -162 -106 -43 135 84 -71 10 27
5699B7J14j79p0N1J25l03M41jj48r3j79J51K62j98j71O9K18Qj18j82K76l7j61
$$ 27 141 -38 -108 -57 68 -235 206 205 57 -36 -215 -64 198 0 -171 -102 116 124 6 -176 100 63 -98
5722i8L71m38K2k7m3O6K70n5j60Q6J56o5K5rk52K11m6Kj34J60j30K0l1l7Q8K43
$$ -98 273 -165 -143 -170 -213 -147 123 68 -92 -6 150 85 110 101 -151 60 14 16 -118 42 -88 -68 -99 -136 -48 195
5748A95k53r1J13L9q0Q0k69K36qM9k2q4J20J8j2J88k2k39K77l26J75n7J47j09
$$ 195 -58 -149 -36 3 -77 3 -266 -30 -38 11 -11 -95 25 43 31 219 197 -42 235 -91 84 27 174 65
5772F5k57q6P84m64k13O5L87J5l39m1N7nL5m4q9PK85k79j7K11k69L59k25J14k73
$$ 65 -192 -278 506 42 -171 -106 281 296 -43 -84 -27 -32 3 -41 -130 -123 162 -117 -134 77 -192 167 -58 56 -217
5797b17J94J44k68R7J63j70J19l78J97J76M7k6k48K63j54j42J34l5o2K11j22j09
$$ -217 -23 121 -147 -50 113 -57 62 -316 -119 57 104 78 -170 93 -61 -203 -69 -104 -166 45 -77 -186
5819a86K17R6O7j69j91K71q3J08j84J03O2j35N7j36J69K0pKn5l9n6J57j73K1j53
$$ -186 31 127 194 25 -166 105 22 130 -54 49 111 -24 33 -103 66 86 79 81 26 -13 -69 88 -85 -64 -217
5844b17J05j01K35Q3l91J87J69P4m05K57J45j84j20O1K88k50K76j47l21N29l05
$$ -217 -112 -213 22 105 -286 -99 70 144 -261 -4 141 -43 -163 -102 186 -64 212 65 -256 273 -32
5865c2J00mj54lN7j12K63k0m93K10J83J25l97L07P6J23l05K69m81K11K24m29J85
$$ -32 68 64 -90 -93 -36 -148 115 95 -398 -188 -5 120 -277 30 106 229 -76 193 -288 -77 147 -282 -97
5888i7J36kj26J88n6K74k86mk07N5NK00o0K32k48l8j5K8K46k99M8m8N8m9n2K05
$$ -97 39 37 -89 99 43 317 31 27 -180 -125 -120 80 20 252 4 -34 -49 -21 225 -74 -26 -74 -16 -65 -117 88
5914H8j65L4R4J8j36J51j9r3kJ89j03nk72K48k2j98J53k13NJ41l3rJ41k0J88l13
$$ 88 -77 -43 51 69 -67 84 65 -28 -30 159 56 51 -221 27 5 -193 -40 -253 -248 -107 -140 -149 -8 -28 160 -153
5940a53L37j27j94lQ8o0O0K19k45L1j4l1Jl1n4L28j58j6m5j96N1O7P0R4k0K2R5
$$ -153 184 57 -137 -140 -52 -112 -52 167 -78 -47 -61 -92 -91 -122 -176 152 -6 -22 -67 -263 -212 -145 -75 19 -1 21 116
5967A16j37J52k72J45j73L99l38O9j25j01K3L25K10k77j71J81J30lj3l16J92j50
$$ 116 -21 131 -141 4 -169 230 -108 -39 -164 -265 -242 83 293 16 -155 26 156 153 140 -176 16 -134
5989a34Q3p2N1O5J48o2p8j23R5m9l4J72j62j14j7R8K84o9K11k88r3p2K11N7m9
$$ -134 -51 -123 -72 -7 141 79 1 -122 -27 -76 -110 62 -100 -214 -231 -133 151 82 293 5 -88 -160 51 108 59
6014E9J71l65J46p4Q9N9k05K79pl64J41j06L36m2m7q0J30q2J72m17K05r2m1M1
$$ 59 230 -135 11 -63 26 85 -120 159 152 -212 -71 -177 159 117 70 -10 120 38 210 -207 -2 -94 -135 -94
6038i4J12poK99m61R0J25J9l86K86o6K2J08J54r0L4l86K8lR2K04Mk17J71j72J02
$$ -94 18 11 5 304 -157 -67 58 77 -309 -23 -89 -67 41 195 105 139 -247 -219 -222 -130 74 78 -139 32 -140 -38
6064c8K70N4j57j0k7j39l8nn6N6m6J75N8k08MM0K4k61L13M2J7jj75J51j46k3l4
$$ -38 232 286 129 119 92 -47 -85 -90 -146 -90 -136 39 97 -111 -107 -67 -43 -304 9 51 68 67 -108 43 -103 -126 -160
6091a60K87j30k03J55J83o9P1k7J23l09K32j84o7J60J6k01j17m9L13j93N5J19
$$ -160 127 -3 -206 -51 132 63 134 107 230 -79 153 -31 -98 62 78 -123 -240 -289 24 -169 -114 5
6113Ej17n5K11k36J23J45M8j59P2L4k71J85L7R8M2j85m5j81K1J21o4K60k62O9
$$ 5 -112 -167 44 -192 -69 76 124 -35 37 71 -200 -15 22 120 162 -23 -68 -249 -228 -107 -171 89 -173 -104
6137a04L12m86L07K80k16l2J83k05Q3k06J44q8n8k04K56j94Q0J19o0K14n5O1j44
$$ -104 208 -278 29 309 93 61 244 39 122 -84 60 -28 -86 -290 -34 -228 -148 -29 -89 125 70 131 -13
6160a3j94L64k99J43o3J34j51K76J52l43p6j87M04k69j6j92K98k4k6k7j15K96
$$ -13 -207 157 -142 1 -62 72 -79 197 349 6 -70 -257 147 -122 -138 -330 -32 -56 -82 -109 -224 72
6182G2K24l01l11L23m08N10J89k74J25j47J76k67P4K56l26k01M97j54J47k92J02
$$ 72 296 -5 -316 7 -401 109 298 24 149 2 178 -89 -15 241 -85 -286 211 57 204 -88 14
6203A4M9L9k57M34m97K22j12k02J94K17l05J12P3k04L58q1q5m2O7l62K21Q2r0
$$ 14 63 102 -155 279 -218 4 -108 -310 -116 101 -204 -92 -19 -223 135 54 -31 -73 -6 -368 -147 -65 -155
6226a55K48q0M2N4Lk10M53k41j29R5l57J56L6L2n6J05J1J3K5j2n1k09L15p4J44
$$ -155 93 13 55 109 112 -98 355 114 -15 80 -277 -121 -85 -53 -109 -4 7 20 45 33 -18 -227 88 14 158
6251A58k21oO2p6J27l81K86l5J58m2k93L08p0j24J97j49J44Pj53P6J10M5l9k9
$$ 158 -63 -69 -7 -83 44 -337 -51 -86 72 30 -263 45 -25 -149 48 -101 43 50 -103 -27 83 128 89 60
6275F0r1j1J90n7J32k20o6J24k62K36j76j26J79R1J93j43Q7J5p3p5rj07K22L4
$$ 60 -31 -42 148 91 223 3 -63 61 -201 35 -141 -267 -88 3 196 53 140 155 82 7 -2 -109 113 147
6299A47p6j94JL30k21j65Q6r1M82j59Q6p2k58j55K22j58M12j04l24L94k11q2J62
$$ 147 71 -123 -122 208 -13 -178 -92 -183 299 140 226 154 -104 -259 -37 -195 217 113 -211 183 -28 -110 52
6322E2J30m27K07J47K50m31j11K23O1k12N5N2k9K06k56J09l0j82K24L8j06j44
$$ 52 182 -245 -38 109 359 -72 -183 40 101 -111 -56 -4 -33 173 -83 26 -4 -186 38 76 -30 -174
6344a74K37j75N1o4PJ75l4J22J0k11K30j33K63k62j59J25r9K92m00K91k36M1K2
$$ -174 63 -112 -61 -125 -118 57 23 145 155 -56 174 41 304 42 -117 8 -91 201 -199 92 -144 -103 -81
6367h1K02k22K53k4j9j25M6J35j93j45L98l95J80P1p2k26J63O2k44L77j37n7M7
$$ -81 121 -101 152 128 109 -16 30 165 -28 -173 225 -170 10 81 9 -217 -54 8 -236 141 4 -53 -6
6390fn7L36k99J24N1l0k66O6J97K27l30p9j76J20J87q4J68l08lK59k40J08J14
$$ -6 -63 273 -26 98 149 119 -147 -81 116 343 13 -66 -242 -122 65 -19 149 -159 -162 97 -143 -35 79
6413G9j20kJ1P3k38O1j6K09j84L01k23mk02K67o7j04K9q4J63Q0l7O9o3J40J27
$$ 79 -41 -43 -32 41 -197 -136 -152 57 -127 174 -49 -53 -255 12 -55 -159 -130 -214 -51 29 -8 61 -2 138 265
6438B65Jl19R5k08L62o1j62J13nj10J09j77K56o5kj70J04K63l33L84l34J09p5
$$ 265 266 -53 42 -166 196 135 -27 86 81 -29 80 -97 159 94 92 -78 26 289 -44 340 6 115 40
6461D0k6J13k73k3K21j41m8J91j61j45M92l14j3J11k31j7K30k59L42j91K18j19
$$ 40 14 127 -146 -169 52 -89 -137 54 -107 -252 240 -74 -87 24 -207 -224 6 -253 89 -102 116 -3
6483cK36k61R0K6O9j21j69K04J0j48R8j84K2J06rJ86k62J1L05Q5k99o4J64J28
$$ -3 233 -28 62 88 157 36 -133 71 81 -67 31 -153 -131 -25 -34 152 -110 -99 206 291 -8 -72 92 220
6507B20j62l44R1J39k16O8K64j49P9j10L06m44L6J03K02m0O6J27m45J32J71J60
$$ 220 58 -286 -195 -56 -272 -204 60 -89 -10 -120 186 -258 -222 -119 83 43 109 236 -209 -77 94 254
6529B54m15J84kk3k47J42lK51J32l42m9L02l34J36j6J21j66o6P1k0J41R9l16J83
$$ 254 -161 23 21 -2 -249 -107 -110 141 273 -69 -118 184 -150 -14 -30 91 -75 -141 -70 -90 51 150 -166 17
6553A7O3j78o9K35k78j15N09k26L16k83j33n2J31K81m48K64j54j09J86J56l18
$$ 17 80 -98 -167 68 -210 -325 184 -42 274 -9 -142 -194 -63 218 -230 34 -120 -229 -43 113 -205
6574b05J60P8j32J04J59l7k49Q0J19j43k3j50M59N0j16j74n1J30P1j53J23K3L
$$ -205 -45 33 -99 5 164 127 -122 -42 77 -66 -89 -239 220 270 154 -20 -71 59 130 -23 100 123 126
6597A26mk18K21M2k95k9J64L3j4J65k59j54M49m18K53n2J22N2n8j2l84R4K6K49
$$ 126 122 -96 125 167 -128 -157 7 40 26 191 -68 -222 227 -191 62 10 132 184 126 114 -270 -176 -150 99
6621I9j0l6J31j02k18J17j20L91l73K69j02K4l5o4l7Q9J63k35l2L42l10J55j11
$$ 99 89 53 184 82 -136 -19 -139 252 -121 148 46 70 35 -29 -66 23 186 -49 -81 261 -49 106 -5
6644el9K98l26O1k00K11MJ81k58J8J31k6j70M4L18k43QP0k54J63J88J3j8ml6k80
$$ -5 -44 254 -72 -11 -211 0 4 185 -73 -55 76 50 -120 -76 242 -1 7 77 -177 -14 174 187 169 165 129 -151
6670a51J81r4j64K30J4J16k19J0K40k02J13J21n7m8j75L01j88p0J89r0J76k42
$$ -151 30 -64 -228 2 16 132 -87 -77 163 -39 74 195 138 90 -85 216 28 -42 147 57 233 -9
6692ik52K23K06j18j64K26L6l50K24j0j35L12j32J12j39q3M7KJ3j44K97Rl04K97
$$ -9 -261 -38 168 50 -114 112 148 -202 22 12 -123 189 57 169 30 -53 -6 -4 9 -135 162 171 -133 164
6716A64n99L77J04N9J9n1k08J70n9N5p8L22j73j1J04MJ2K23m75K79m70J90n0K85
$$ 164 -435 -58 46 105 124 73 -135 35 -24 31 -47 275 102 91 195 199 211 434 -41 238 -232 -42 -92 193
6740A93k04r1l3J28N6j70K60r1p9n3o9J3K18k38L81l71J66q2J03k81L22N7k4j99
$$ 193 -11 -102 -135 -7 49 -121 139 48 -31 -84 -153 -140 78 -160 221 -150 16 -66 37 -244 78 135 111 -88
6764h8N8l0M2j10P2o2Q1qJ29m6J44l81K63k42m3L66p4l19K93l18J14N7n6J25J05
$$ -88 -30 -60 -18 -128 -56 -118 -37 -45 84 38 182 -199 64 -178 -221 145 71 -248 45 -273 -159 -102 -158 -33 72
6789G2Q6k08R8m6J5R3p9r4J34j09N8P3p1ll4%K67k29J1m4J23k51N2O0J68k14K37
$$ 72 158 -50 48 2 17 110 31 -63 71 -38 20 93 22 19 -15 -15 252 23 34 -10 113 -138 -86 -26 142 -72 165
6816A65l80K20j77L28j03r6pqM8k4O3j01K16Pk7j1j14m4k4j4p2R6j81M79k12k87
$$ 165 -215 5 -172 156 53 -43 -50 -58 -10 -34 29 -72 144 151 124 113 -1 -45 -69 -83 -155 -59 -240 239 27 -260
6842b60K35lN3M2l86N27r6k61O6k4n0K36K2j50j79L06J38j93P0n9q7J93k9l04
$$ -260 -25 -28 25 67 -319 208 112 -149 -83 -107 -157 79 101 -49 -228 78 216 23 93 34 -53 140 111 -193
6866a93J29J76l65OM22j38j36k0p5L00n5K49o2j52j12j24rj98K96K1j03J57L08
$$ -193 -64 112 -253 -247 175 37 -99 -119 -194 106 51 300 238 86 -26 -150 -159 -357 -61 -40 -143 14 322
6889C22o01K35j30J09M76l34k25K41r9j5J17k51J30kJ71n25L25j25M76k14l82
$$ 322 -279 -44 -174 -65 411 77 -148 93 -6 -21 96 -155 -25 -27 144 -381 -56 -181 295 81 -301
6910c01J22J3K77j83L22P5m41K8l8K09n3J84l12K40k06r1P8N1J40j15j55R4K83
$$ -301 -179 -166 111 -72 250 325 -116 -88 -126 83 30 214 -98 142 -64 -155 -77 -26 114 -1 -156 -62 221
6933B21k33R6k36L1K96k37L0p3O3k05L35l1k96J22K88j84k53K73j9K03j84J95
$$ 221 -12 84 -152 -121 175 -62 -32 -105 -42 -247 88 57 -239 -117 171 -13 -266 7 -12 191 7 202
6955B02m52M69j5j3k48l4L4M6J16p5M5p8k06j67L18O1J06n0P7j71q1JJ18J01k13
$$ 202 -250 219 204 191 -57 -91 -57 -11 105 30 75 -3 -209 -376 -58 3 109 59 136 -35 -116 -115 3 104 -109
6980a09L6p3P5K19j88J97k05L69n84K77j8l4J43Q2j51J49k8k53J75q3k20J89p2
$$ -109 -73 -146 -71 148 -40 157 -48 321 -263 14 -4 -38 105 187 36 185 157 -96 79 -4 -224 -35 -107
7003a07M6K75k08m3j50M6J59O6R8m06R8L5k1R9m4J01k11K59j85M3j13J18J53j40
$$ -107 -61 214 6 -37 -187 -141 18 84 182 -224 -126 -91 -112 -13 -57 44 -167 92 -93 -50 -163 -45 108 -32
7027c2K88l86Q3K11k91L11q6MK3m7k3RJ26k05P3r7J03p7k13L23l00K81p4m1r4
$$ -32 256 -130 -47 164 -127 184 98 102 125 78 55 64 190 -15 58 -39 64 -13 -226 97 -203 78 4 -37 -131
7052a31M9J3P8m6j20J77j07K36k66J99l32Q4K46n4M2J4n3j32j3K61p1j79K36k03
$$ -131 -82 -69 9 -37 -157 20 -87 149 -117 82 -250 -166 80 26 68 82 29 -103 -116 145 74 -105 131 -72
7076g2L12m45k5J57J24o0k74K41J48j05o9k1J09j64J60r5K0k13J93K05k6k12j35
$$ -72 240 -205 -230 -73 51 -9 -283 -42 106 1 -68 -89 20 -144 16 -79 -59 -272 -79 126 100 -112 -247
7099b47O0K23n0j96L56j51k8J09l25J58J62k86M76k68m5K09l39R6K0q1K91j72
$$ -247 -187 36 -14 -210 146 -5 -33 76 -249 -91 71 -215 261 -7 -52 157 -182 -86 -66 -147 144 -28
7121b8j79L02J74j22k30J15o0J30J4l25j2K91m8p2K9M3r1M3p1K52k55Pj6J67K96
$$ -28 -207 95 269 147 -83 32 -28 102 116 -209 -221 70 22 -50 -21 22 -69 -26 -97 155 -100 -93 -109 58 354
7146C54n53K58n0n4K7k5J73j95K3LJ64n5O7l39L4J99k34l2P7K54k83K21J18K06
$$ 354 -199 59 9 -45 -18 -43 130 -65 -42 -39 125 70 137 -202 -168 31 -203 -235 -158 96 -187 34 152 358
7170C58m92J20j9K15k12J33k26K60m47L7K59r7N2L01j59O4j42J71l02Lk10N58
$$ 358 -134 -14 -33 182 -30 103 -123 137 -310 -273 -14 -111 -59 242 83 147 5 176 -126 -123 -333 225
7192B25Q1j59l29%K77j37K10j24j21K51r4l05J04K69r3J74k13K26m82N64k22j94
$$ 225 306 147 -182 -182 95 -42 168 44 -77 174 80 -225 -121 148 55 229 16 242 -240 324 102 -92
7214i2K55j13J23k17r4J57M2mJ6J99m61PJ71p6J05Ko9n1K3R1n5J14j32J51j72
$$ -92 163 50 173 -44 -138 19 61 57 73 272 -189 -182 -11 -87 18 20 -49 -100 -77 14 -41 73 -59 92 -80
7239h0o4K29m5K1L5j11q7J20m7K8k73J48N7R3m5N2L9K1l32N92l19k7m2j22P0J00
$$ -80 -144 85 40 61 96 -15 -102 18 -29 -1 -274 -126 -69 24 -21 31 70 91 -241 351 32 5 -37 -159 -89 11
7265A1RJ08l09K82J14l49k4J49l35L12m7P8J68j48J06k20J60n7O7l0k10O2K13
$$ 11 20 128 -181 101 215 -134 -158 -9 -344 -32 -79 -1 167 19 125 -95 65 8 75 45 -165 -103 110
7288A10l21L23j61O9j70j57M70r6k16J43l3M25k97M2l48K13Lj56J60l9L14k77
$$ 110 -211 112 -49 20 -150 -307 163 67 -149 -6 -39 386 89 131 -217 -4 -1 -157 3 -36 278 1
7310Aj05K03R2j94j98L39N4l31J11K40l48K32q6k12M56k09k85J83K03J10l63K12
$$ 1 -104 99 191 -3 -201 138 192 -139 -28 212 -136 96 10 -202 254 45 -240 -57 146 256 -107 105
7332A05R6j26k03rL5J70j19J46jk54K20J5q1pj28J19L2j63R6j9J29j67J89J16
$$ 105 201 75 -128 -137 -102 68 -51 95 94 -160 60 75 -6 -13 -141 -22 10 -153 -57 -76 53 -114 75 191
7356A91l17K75M8o2k14K51l7k33qJ20M3q2M5R3r3J61l23J26j74J34P7O6l63M27
$$ 191 -126 149 197 135 -79 172 135 -98 -106 14 57 -25 20 113 20 181 -142 -16 -190 -56 21 87 -276 151
7380A51k44J45o5j38J25k00L75j18J56m0M6k32P4j7J37j68q1Q6K26l08R4j30L0
$$ 151 -93 52 -13 -151 -26 -226 149 31 187 147 193 -39 35 18 155 -13 -94 -8 218 -90 4 -126 -96
7403i6P1q1n3K4m3j28M09K23l29n6k32J81kNK96j80J22J5k43p3PK87N6m30J3Q5
$$ -96 -25 -106 -159 -135 -178 -306 103 326 -3 -59 -291 -110 -112 -107 189 9 131 146 -97 -170 -163 124 180 -250 -237 -152
7429a52L00k01m8j07K73J99n35K50j98J80K0P8j74L77k43j23K65l01K15k57J20
$$ -152 148 -53 -101 -208 65 264 -271 -21 -219 -39 -19 59 -115 262 19 -104 161 -140 75 -182 -62
7450f2Q5k05L58j23K25m24L2K1K58j33k36M37l42J12o8m8k3K05k18J72j02O6k53
$$ -62 23 -182 176 53 278 -146 -114 -93 165 32 -204 233 -109 3 -65 -113 -136 69 -149 23 -79 -13 -266
7473b66J59q7J12N3R7P1K18l95L1q3k1J13N1r9j71K62n8k8J35q3L8J10k11R4j34
$$ -266 -107 -194 -82 -29 68 139 357 -38 -7 -90 -111 2 53 -46 -217 45 -13 -41 94 11 49 159 -52 42 -92
7498i2J03RJ19o5p7m15J66K7M24k34J72p6lj21K18j20j9n0q0J53j14N5j0j42L2
$$ -92 11 20 139 74 -3 -418 -252 -225 199 -35 137 61 58 -63 155 35 16 -34 -114 39 -75 -20 -30 -172 -140
7523a40L4J41q7j4l1M43n34l5L88j42j7N5l5J5p8k5k1J62n5K14l70Q6r0n6PK49
$$ -140 -106 35 -52 -66 -97 346 -188 -223 165 23 6 61 26 41 -37 -62 -83 79 24 238 -132 -46 -136 -192 -185 64
7549F4j32k7O2K32m25J50j6L56k41k9J35k72P2r7K07j77K45j36j8L8j54J94j01
$$ 64 -68 -95 -33 199 -226 -76 -92 264 23 -6 129 -143 -71 -168 39 -138 107 -29 -47 -9 -163 31 -70
7572g0J14j29J81N5j08K20k04l53K41J10Rj72R8R5k06K83j63l08L67j6m5K63k24
$$ -70 44 -85 96 151 43 263 59 -294 -53 57 66 -106 -8 87 -119 164 1 -307 60 44 -1 262 38
7595C8no1K56l68L80k42m6q8J84J67k64J73r6j01j35M38j54l9j25P8p7J10j51
$$ 38 33 -28 228 -140 240 -2 -48 -136 48 215 -49 124 28 -73 -208 230 76 37 -88 -10 -87 23 -128
7618a28J18j20J12m1K63k86J91j40L8J09q6J70j54k15R2J56Q7R9k83J52k48k13
$$ -128 -10 -130 -18 -59 204 -82 109 -31 7 116 30 200 46 -169 -77 79 166 265 -18 134 -114 -327
7640c27M12o2Q8j04o0J97k36q9K78k08J68p8q7mN7k22L50k84K46l8j65J97j92
$$ -327 85 23 111 7 -53 144 -92 -181 97 -111 57 -21 -108 -112 -55 -277 73 -211 35 -3 -168 29 -163
7663a63K93l3O4o8k54L7JJ71k25L33k24J1K39k83J8J57p5Q6o5L9M2j39K08j18
$$ -163 130 97 161 93 -161 -124 -123 48 -177 156 -68 -57 182 -101 -83 74 -1 85 20 59 101 -38 170 52
7687E2j45K43k49J24n0n6J74m5n8N0m3J3J86j23Nj46l6J57j8L05o01M45k04J79
$$ 52 -93 150 -99 25 -25 -81 93 48 -10 40 -3 10 196 73 78 -68 -104 53 35 340 -261 184 -20 159
7711A59k95J71k9Q2n1m4k99L49Q4L5k94L9J17j32k42L16J69m64P05k84j38L8J09
$$ 159 -136 35 6 88 37 -7 -306 43 127 162 -132 -93 24 -108 -350 -34 135 -329 376 92 -46 -8 101
7734A01k35K59k49J55j66K37Q7k24k20J31l8P1J02J25O2k67J10j6OJ40j74j23
$$ 101 -134 125 -124 31 -135 102 189 -35 -255 -124 -162 -91 11 136 198 -69 41 25 31 171 -3 -126
7756a26N3L7j43L26j50M9k11L3J03R7p0J14j08k44J24j82L38m9k9m4n0m2P8k1
$$ -126 -73 -36 -179 147 -3 46 -165 -132 -29 68 -2 112 4 -240 -116 -298 40 -9 -38 -82 -132 -174 -96 -117
7780a17J43j26Q1k18K54N6k02P5J80l7k37J05K87m13K17j25L4Q9P9k07K4J50j59
$$ -117 26 -100 -19 -237 17 73 -129 -54 126 89 -148 -43 244 -169 48 -77 -43 46 125 -82 -58 92 -67
7803f7j0P9K04m20R6O09n53l01M02k20qL50l36K0M02k52J14l30Q5J53m7L87m64
$$ -67 -77 2 206 -214 -118 491 -62 -363 39 -181 -189 161 -175 -155 247 -5 109 -221 -136 17 -30 357 -107
7826a07J72K31k5l99K60k87L42l7j48m6M5J41j92J90J48k89l09J68J42J64n2l35
$$ -107 65 296 271 -128 132 -155 187 150 2 -44 1 142 -50 140 288 -1 -310 -142 0 164 112 -223
7848b23K77j7k93N60l84J60k50K56j30N0K88k35k62J99j88L66l8o4K76m04J64
$$ -223 54 37 -256 304 -80 80 -170 86 -44 6 294 59 -203 -4 -192 174 136 72 348 -56 108
7869A08J08j00m49K52n1K86l11Q8J16R0q8l9K74m97J82K13j51l2L7M5J30l41J06
$$ 108 216 116 -333 -81 -132 154 -157 -69 47 137 49 10 284 -213 -31 182 31 -1 36 81 211 -130 -24
7892b4P0k40L19k73q5N60m33Q8k30P2L47q5j88P4K10j7k83o1M19k3p9l42K42o4
$$ -24 46 -194 125 -148 -233 327 -106 -18 -248 -176 171 86 -102 -28 182 165 -118 -179 240 217 138 -204 38 -26
7916b6K83k37N1k90J42k51L70J9j42L12l62L2kL8q7L34l27K74j8K9j54P8j82J85
$$ -26 257 20 71 -219 -77 -328 42 61 -81 231 -131 -99 -101 -63 -150 184 -143 131 113 142 -12 66 -116 69
7940F9O2k51L75m32K50j07R5k31M4L40j25j29J98k79J26j16K20q8J32O3k72J28
$$ 69 131 -120 255 -177 73 -34 61 -170 -126 214 89 -40 158 -121 5 -111 109 21 153 216 -56 72
7962G2r4J37k25J81j29R6J6j14Q2k0o5j0j8K32j74K7K7J53k11J95k25q1n0L16
$$ 72 -22 115 -110 71 -58 38 54 -60 22 2 -63 -73 -91 141 -33 -6 21 174 -37 158 -67 -148 -198 118
7986A18j73M73m63K77l67Q3J93l19L01J0j88k11L92p8m3L9k72J56J33l52L10m4
$$ 118 -55 418 -45 232 -135 -52 141 -178 123 133 -55 -266 126 48 5 44 -228 -72 61 -291 19 -25
8008b5J58j47l6j43J98r9j45L36j62j17J08l1K57J04j25n1j2l24L38q4j68L14
$$ -25 133 -14 -50 -193 5 -94 -239 97 -65 -182 -74 -105 152 256 131 80 68 -256 82 -2 -170 144
8030A44Q9j88j64j0L9r5lM26l61j05J49rJ13l9P5n3J5Q2P5j47N3m1m5r4J75j29
$$ 144 233 45 -119 -129 -90 -185 -188 238 -123 -228 -79 -88 25 -14 61 8 23 105 180 33 86 45 0 -94 81 -48
8056d8O7m2k5j45K5j7K52mj98j32L13l06M38k47J04J56k86J28l5K03k21P5jJ01
$$ -48 19 -23 -48 -193 -168 -185 67 63 -135 -267 46 -260 178 -69 35 191 -95 33 -2 201 -20 55 54 155
8080A55j13q3J3O5J27j01o2J33M1j40n7J31k12LM6P1K11L4l13J77n4j83J16J05
$$ 155 42 -41 -28 37 164 63 1 134 175 35 -22 109 -103 -100 -54 17 228 262 -51 126 72 -111 5 110
8104A10M1o0k48J12O5K63j04k35J99j59j9K76j61j45J19J34l23K40l10K28N0k05
$$ 110 151 91 -157 -45 20 283 179 -56 143 -16 -35 241 80 -65 54 188 -135 105 -205 23 73 -132
8126a32J70q5K05k37j09K19j61K33k29JL03j56J30j95Q1J7k91N0K85o9OQ6k39
$$ -132 38 -47 158 -79 -188 31 -130 103 -126 -125 178 22 152 -43 38 55 -236 -186 99 30 36 122 -117
8149a17K31j91K29k11kP5k31K11J62q2q9O3Pj68K92j56N0j20k08L46l84R0J00
$$ -117 114 -77 152 -59 -61 14 -217 -6 156 74 -15 48 55 -113 179 23 73 -47 -255 91 -293 -203 -103
8172a03j42J69J14j10K6J20Kk50J78J12l85Q0O0L08j60r7L7J12n
$$ -103 -245 -76 38 -72 -46 74 76 -174 4 116 -269 -189 -129 179 19 -78 -41 71 66
8191F6
$$ Imaginary data points
##PAGE= N=2
##DATA TABLE= (X++(I..I)), XYDATA
0@%%%%%%%%Qj6J6j6K4l2M0m8N6p2Q8j12J36j60J92k24K64l12L60m16M80n52O34
$$ 0 0 0 0 0 0 0 0 0 8 -8 8 -8 16 -16 24 -24 32 -40 48 -64 72 -88 104 -120 144 -168 192 -224 256 -296 338
31C38p23Q25r36J058j192J339j504J684j879K093k328K585k866L171l506L871
$$ 338 -385 440 -496 562 -630 709 -795 889 -990 1103 -1225 1360 -1506 1665 -1841 2030
47B030m269M706n185N711o290O932p647Q446r342J0356j1517J2858j4428J6297
$$ 2030 -2239 2467 -2718 2993 -3297 3635 -4012 4434 -4908 5448 -6069 6789 -7639 8658
61H658j8565K1389k5017K9872l6743M7296o5760J07417l75216l7912L64473l22212
$$ 8658 -9907 11482 -13535 16337 -20406 26890 -38870 68547 -306669 -344581 19892 -302320
73c02320J83691K25938j11077m9109J41480j12056M6725J26188r8236l1601K33783
$$ -302320 -118629 107309 -3768 -52877 88603 -23453 23272 149460 51224 19623 253406
84B53406K1578q1163K8775p236p7891m3763j29790m7807N3416p8436r6810O9966
$$ 253406 274984 193821 222596 215360 137469 93706 -36084 -83891 -30475 -108911 -205721 -135755
96a35755J1553k7165L4677r408J4846O7799j00163o1726J71816N8134o9831J30408
$$ -135755 -124202 -151367 -116690 -126098 -111252 -43453 -143616 -205342 -33526 24608 -45223 85185
108H5185J06416o2431M5532L1440j09304N8396N7027k01738l5852J59532j03054
$$ 85185 191601 129170 174702 206142 96838 155234 212261 10523 -25329 134203 31149
119C1149j22924J14718o180j12645J4943m5419p4595Q3770P569r6241Q5426J16364
$$ 31149 -91775 22943 16763 -95882 -80939 -126358 -200953 -117183 -109614 -205855 -120429 -4065
131d065m5834M608R2442K8923p27j6955k2921O4532L6228o5511J8510O8099m4315
$$ -4065 -49899 -45291 47151 76074 75347 58392 35471 100003 136231 70720 89230 157329 113014
144A13014n1892r833l6997m021j8913r9710n559P0939o0057n6235Q5472L3755
$$ 113014 61122 51289 14292 10271 -8642 -108352 -113911 -42972 -103029 -159264 -73792 -40037
156d0037m3024J7073J1192K42N8285n882m1347R0294O8490o8336Q925Q5500j6272
$$ -40037 -83061 -65988 -54796 -54554 3731 -2151 -43498 46796 115286 46950 55875 141375 125103
169A25103m6119o209k5413o802p81o4367k3505N3680j9587p1000J1654L9256j3732
$$ 125103 78984 72775 47362 40560 39779 -24588 -48093 5587 -14000 -85000 -73346 -34090 -47822
182d7822l1206j2628K6286L3101k7729j6108O8685M7920j9524Q625M0855J9683
$$ -47822 -79028 -91656 -65370 -32269 -59998 -76106 -7421 40499 20975 29600 70455 90138
194I0138l949l2905j8367L3212n134o4544P21M7053j9610m1281m37Q5r320k1024
$$ 90138 86189 53284 34917 68129 62995 -1549 -828 46225 26615 -14666 -15103 -15018 -24338 -45362
208d5362m0329K676M1804j7313l3238M6101N4485n785n387K5610K4870M978k6883
$$ -45362 -85691 -83015 -41211 -58524 -91762 -45661 8824 3039 -2348 23262 48132 53110 26227
221B6227j9521L1791K2146l4822j2431M2424J5705l7436k9788M583K451l6366
$$ 26227 6706 38497 60643 25821 13390 55814 71519 34083 4295 8878 11329 -25037
233b5037m5023M103L0839q106k3048J9583L9287Q214j9321m097K8020J5074k8315
$$ -25037 -70060 -65957 -35118 -43224 -66272 -46689 -7402 812 -18509 -22606 5414 20488 -7827
246g827j5335L7365L0841j1825n474K7416K1633j9147m0695j3114J2339j7626
$$ -7827 -23162 14203 45044 33219 27745 55161 76794 57647 16952 3838 16177 -1449
258a449m3277j304L6842N037k6138j654K4179M484k8847j9422J9671K3526j1484
$$ -1449 -44726 -46030 -9188 -4151 -30289 -31943 -7764 -3280 -32127 -51549 -31878 -8352 -19836
271a9836j1538L0897M0112o96j7679J2125K3743j1918l7894j1791J9182K485k5906
$$ -19836 -31374 -477 39635 38939 21260 33385 57128 45210 7316 -4475 14707 17192 -8714
284h714o924K8062J5191k7354k7544R683J0308k7358k6693J8038L2633J674j2564
$$ -8714 -15638 12424 27615 261 -27283 -17600 -7292 -34650 -61343 -43305 -10672 -8998 -21562
297b1562J5505L4812M793k8552o837K6896M212l0774q957K9087J6425j8290j2635
$$ -21562 -6057 28755 33548 4996 -1841 25055 29267 -1507 -10464 18623 35048 16758 4123
310D123J6861J3781k4104l6293j834J6359j3353k4949J3060L6038P783j7593N43
$$ 4123 20984 34765 10661 -25632 -27466 -11107 -24460 -49409 -36349 -311 7472 -10121 -9578
323i578K2076L943k5061j3569K0559K0032j0654j0913K0978K6146j0340k6812
$$ -9578 12498 16441 -8620 -22189 -1630 18402 7748 -3165 17813 43959 33619 6807
335F807K148J6842j4601l6131n945K1255K360j9993j622K9141J7248k0513j9674
$$ 6807 8955 25797 11196 -24935 -30880 -9625 -7265 -27258 -28880 261 17509 -3004 -22678
348b2678J6239J5414k2495k0365K2452L1276k314j3295J4046K5085m932l0993
$$ -22678 -6439 8975 -13520 -33885 -11433 19843 17529 4234 18280 43365 38433 7440
360G440j0101J7554p64l0906j1999K4137J2583j9712j1638K0047J5475j8522k3865
$$ 7440 -2661 14893 14129 -16777 -28776 -4639 7944 -11768 -23406 -3359 12116 -6406 -30271
373c0271O847J7906p181j8885J3243L5506R667j6126K698K3276Q15k8600j5366
$$ -30271 -23424 -5518 -12699 -31584 -18341 17165 26832 10706 13404 36680 37495 8895 -6471
386f471J4365R947j7631j4762J6385J9805j4270k5054N681J6528j3686k8233n17
$$ -6471 7894 17841 210 -14552 1833 21638 7368 -17686 -12005 4523 -9163 -37396 -37913
399c7913K1951M008j5605L685L1555J8505j4868j0674J8587J2800k2057k0318
$$ -37913 -15962 -11954 -27559 -23874 7681 26186 11318 644 19231 32031 9974 -10344
411a0344J5558K3088q166j7361J0265K1075j0058l2217q470J4166m754k8290p196
$$ -10344 5214 28302 20136 2775 13040 34115 24057 -8160 -16630 -2464 -7218 -35508 -42704
424d2704K4474J2671j6823n344K5316J6498j4311j4592J1266J5978o158j5270
$$ -42704 -18230 -5559 -22382 -27726 -2410 14088 -223 -14815 -3549 12429 6271 -8999
436h999J0454L0002N667j8881L57J9589n825l1165j4900Q434L478j5093j2971
$$ -8999 1455 31457 37124 18243 18600 38189 32364 1199 -13701 -5267 -1789 -16882 -29853
449b9853J3654K0938r419k4090O809K1519j0569k3821P877K6249M573j2308O522
$$ -29853 -16199 4739 -4680 -28770 -21961 -442 -11011 -34832 -26955 -706 3867 -8441 -1919
462a919K9038J5166j7073j2846J4440P702k6068k1904J4698J7490j3291j7211
$$ -1919 27119 42285 25212 12366 26806 34508 8440 -13464 1234 18724 5433 -11778
474a1778J0795J5882j2869k6010m224J0787k953j7416j083K5373J8693r685n150
$$ -11778 -983 14899 2030 -23980 -28204 -17417 -20370 -37786 -38869 -13496 5197 -4488 -9638
487i638K3541J5530j5988j2930J2937J1033j0391j2439N460J8875N439j7762r466
$$ -9638 13903 29433 13445 515 13452 24485 14094 1655 7115 25990 31429 13667 4201
500D201J3619l801l3859j5596J5444M656j5895l707J8811J6726l656j2201N369
$$ 4201 17820 14019 -19840 -35436 -19992 -15336 -31231 -34938 -16127 599 -3057 -15258 -9889
513i889J8502l704k0792N435K7960N050j5051N514K3576L164j9746r764Q306l82
$$ -9889 8613 4909 -15883 -10448 17512 22562 7511 13025 36601 39765 20019 10255 18561 18179
527A8179k1390k0559L502J4780m547j6017R155K1760r352k6118L186J9034m162
$$ 18179 -3211 -23770 -20268 -5488 -10035 -26052 -16897 4863 -4489 -30607 -27421 -8387 -12549
540a2549j1877R026J9650J2395n26m052J2211J6356j3332k3985Q280J4380j7601
$$ -12549 -24426 -15400 4250 16645 16119 12067 24278 40634 27302 3317 11597 25977 8376
553H376j8702J0819J1627q508j2600k010P357J92j9490j6565J1773J2247j1701
$$ 8376 -10326 493 12120 3612 -8988 -10998 -3641 -3449 -22939 -39504 -27731 -15484 -27185
566b7185k791K6623K0020q952q380J2562J2357p340j1961L354J3973K006j4119
$$ -27185 -29976 -3353 16667 7715 -665 11897 24254 16914 4953 8307 22280 24286 10167
579A0167l489J7341M416k3598j4241J2194j490k5304j0297J1603N153n497k443
$$ 10167 6678 24019 28435 4837 -9404 2790 1300 -24004 -34301 -22698 -17545 -23042 -25485
592b5485Q341J7784M592j6147k721J9793J057j7671Q272K6472M417r599P43Q038
$$ -25485 -17144 640 5232 -10915 -13636 6157 7214 -10457 -2185 24287 28704 19105 19848 27886
606B7886J753j1486j6962j361Q856j1021k1737M887J7955n875j6264N141J3673
$$ 27886 29639 18153 1191 -170 8686 -2335 -24072 -19185 -1230 -7105 -23369 -18228 -4555
619d555m285j4511k494J2275Q927n153j886J9183K0932m655j2367R137J2018j5403
$$ -4555 -8840 -23351 -25845 -13570 -4643 -9796 -11682 7501 28433 23778 11411 20548 32566 17163
633A7163j9452O863J2242o415j2085r9Q950N98j5452j2458P959N641j9107j2389
$$ 17163 -2289 4574 16816 10401 -1684 -1783 7167 7765 -7687 -20145 -12186 -6545 -25652 -38041
647c8041J7360J4349p302j621J6853J4774k235j0570L01J1726r1j4991l89J9853
$$ -38041 -20681 -6332 -13634 -15255 1598 16372 14137 3567 3868 15594 15503 512 123 19976
661A9976O494j4091m039J1118j247j9758j4052L280M561r143j1521O839J6149
$$ 19976 26470 12379 8340 19458 18211 -1547 -15599 -12319 -7758 -16901 -28422 -21583 -5434
674e434L19j0857M854J6899o56j6237q75J5292N071p783J006J6709J2070o852
$$ -5434 -5115 -15972 -11118 5781 5125 -11112 -11987 3305 8376 593 1599 18308 30378 23526
688B3526j1782L150N549j3564k0203J742J2658m500j3220L949J4195j071j4767
$$ 23526 11744 14894 20443 6879 -13324 -11582 1076 -3424 -16644 -12695 1500 429 -14338
701a4338n067J0818L876j1735n492J4968J4119m805m155J5652J4511p427j2948
$$ -14338 -19405 -8587 -4711 -16446 -21938 -6970 7149 2344 -1811 13841 28352 20925 7977
714G977K236P073p824j4622m69J2682L705j2157n033J0195J177j7577j1393P673
$$ 7977 10213 17286 9462 -5160 -5629 7053 10758 -1399 -6432 3763 4940 -12637 -24030 -16357
728a6357O506p647n606J1541J6144J06q812N854J4592n89j3974j718J2516K886
$$ -16357 -9851 -17498 -23104 -11563 4581 4687 -4125 1729 16321 15732 1758 40 12556 15442
742A5442j2066l016J3687Q016j2130j1107N287L045j4920j5742L774J1916k339
$$ 15442 3376 360 14047 22063 9933 -1174 4113 7158 -7762 -23504 -19730 -7814 -10153
755a0153r845O373J6572J06j3311O53J2923K077r766j872J3613J0112o226o469
$$ -10153 -19998 -13625 2947 3053 -10258 -9605 3318 5395 -4371 -6243 7370 17482 11256 4787
769D787J0106J0999r987j4557K500N635r653j4468K86J1256K182j0521j680J1636
$$ 4787 14893 25892 15905 1348 3848 9483 -170 -14638 -14352 -3096 -914 -11435 -13115 -1479
783a479K771j4311p404J0186P867n716l222J1858J5183j136r632M573J1821m029
$$ -1479 1292 -13019 -20423 -10237 -2370 -8086 -11308 550 15733 14597 4965 9538 21359 17330
797A7330j4949j937R351Nj2542m613J0998O575j1435j0135P231M430j2878j2053
$$ 17330 2381 444 9795 9800 -2742 -7355 3643 10218 -1217 -11352 -4121 309 -12569 -24622
811b4622O137J1971o71n930P738J6986R71j2304o2J1179L18j1462j972J1078O995
$$ -24622 -18485 -6514 -7185 -13115 -5377 11609 12580 276 214 11393 11711 249 -1723 9355 16350
826A6350q052o757P703P254j0622j3620K100N232r010j1052J964J1588M127o417
$$ 16350 8298 1541 9244 16498 5876 -7744 -5644 -412 -9422 -20474 -18510 -6922 -2795 -9212
840i212P30J2484M237j1903o220Q719O449n852l355J0265J2721k656r823J710
$$ -9212 -8482 4002 8239 -3664 -9884 -1165 5284 -568 -3923 6342 19063 16407 6584 8294
854H294Q366o313j5627k875Q327o46j1200k727J1501O886r321o256Q687N576j0829
$$ 8294 16660 10347 -5280 -8155 172 -474 -11674 -14401 -2900 3986 -5335 -11591 -2904 2672 -8157
869h157q803P377J0727o62l698P432J4387J75j2280k233P817k974j2727k626Q245
$$ -8157 -16960 -9583 1144 482 -3216 4216 18603 18778 6498 4265 12082 9108 -3619 -6245 2000
884B000M584o928n667O056O181q482j1486L038P028n303q874M564J2365M141m731
$$ 2000 6584 -344 -6011 45 6226 -2256 -13742 -10704 -3676 -8979 -17853 -13289 -924 3217 -1514
899a514J804J1433L937j0785p246P151M683p380n171Q818R221n041r908N08N703
$$ -1514 290 11723 15660 4875 -2371 4780 9463 2083 -3088 5730 14951 9910 2 510 6213
914F213o613j3611j519R313O29p943J91J1938N932p188l794Q998N487q048o777
$$ 6213 -400 -14011 -15530 -6217 -5588 -13531 -13340 -1402 4530 -2658 -6452 2546 8033 -15 -6792
929f792P062R206j524n161N190J0343j940j2849l781N556l632j2587j867Q860
$$ -6792 270 9476 7952 2791 7981 18324 16384 3535 -246 5310 1678 -10909 -12776 -3916
943c916L951n862l635N949N200o385r020M382R191l049o375O250J1660J867n233
$$ -3916 35 -5827 -9462 -3513 1687 -4698 -13718 -9336 -145 -3194 -9569 -3319 8341 10208 4975
958D975J677Q613P62j0128o918N147K532q425n370P593P523o042q941K214M806
$$ 4975 6652 15265 16027 5899 -1019 4128 6660 -1765 -7135 458 7981 1939 -7002 -4788 18
973A8o494j0307J405R232K236n369J871J1865N715o993l840Q839M637r180o163
$$ 18 -6476 -16783 -15378 -6146 -3910 -9279 -7408 4457 10172 3179 -661 8178 12815 3635 -2528
988b528O803N637m207m952M262P037k625j1395m172N448k799j1929j273J0800
$$ -2528 4275 9912 5705 753 5015 12052 9427 -1968 -6140 -692 -3491 -15420 -16693 -5893
1002e893L690n038k05P970M495m953o267L863P892k311p037M789J1098j60p611
$$ -5893 -2203 -7241 -7446 524 5019 66 -6201 -2338 5554 3243 -3794 995 12093 11933 4322
1017D322J626P413j678j0712n280L662L14q081m716P392P850l852o604M512O358
$$ 4322 5948 13361 11683 971 -4309 -647 -333 -8414 -13130 -5738 2112 -1740 -8344 -3832 2526
1032B526o107r186L522R540N56m225L632R692L410o126m040N927L187r783q126
$$ 2526 -3581 -12767 -9245 295 851 -3374 258 9950 13360 7234 3194 9121 12308 2525 -5601
1047e601N890N349p004n822N779O591m161p910m72M592j964q909n56J0415N740
$$ -5601 289 5638 -1366 -7188 -1409 5182 1021 -6889 -7361 -2769 -4733 -13642 -14198 -3783 1957
1062A957m288N37R748M161p283n380M544M106m408n363L295P430j027p756o79
$$ 1957 -2331 -1794 7954 12115 4832 -548 3996 8102 3694 -1669 1626 9056 8029 273 -406
1077d06O473j463j1080m544O043Q40q047j422R039O245k150l095M421N999l724
$$ -406 6067 4604 -6476 -11020 -4977 -4137 -12184 -13606 -4567 1678 -472 -3567 854 6853 3129
1092C129r120K052R970M73o625M253R807n31q856k912L578j214q288n498M026
$$ 3129 -5991 -3939 6031 6504 -121 4132 13939 13408 4552 1640 5218 4004 -4284 -9782 -5756
1107e756N151m519n745N778Q069m094p107K559N979k945o456K638Q928M539k505
$$ -5756 -605 -5124 -10869 -5091 2978 -1116 -8223 -5664 315 -2630 -9086 -6448 2480 7019 4514
1122D514rP064L800p802p902K821L692o788n444M598O152k854o383P7M778j608
$$ 4514 4505 11569 15369 7567 -335 2486 6178 -610 -6054 -1456 4696 1842 -4541 -4464 314 -1294
1138a294q208l211O406L567o232j124J0643P028m340k084N872L853n359p054J578
$$ -1294 -9502 -12713 -6307 -2740 -8972 -10096 547 7575 3235 1151 7023 10876 5517 -1537 41
1153D1O244m07n771J296Q617p34r928l194M471k043q724k687N745M210l439k518
$$ 41 6285 5878 107 1403 10020 9286 -642 -3836 635 -1408 -10132 -12819 -7074 -2864 -6303 -8821
1169h821N695P089k184n440K320O478k011o860J833Q548J682l979L46N804R41
$$ -8821 -3126 3963 1779 -3661 -1341 5137 3126 -3734 -1901 6647 8329 4350 4696 10500 11441
1184A1441p221o810J158K265n103o099M461P451k507n782J832N896j841o419o45
$$ 11441 4220 -2590 -1432 833 -4270 -10369 -5908 1543 -964 -6746 -4914 982 -859 -7278 -7923
1199g923O183L061m321j323Q712N852m263l676N400L927o988p310J356M537k308
$$ -7923 -1740 1321 -3000 -4323 4389 10241 5978 2302 7702 11629 4641 -2669 -1313 3224 916
1214I16n723K254O835m80p945k215M081L0p272j603P097M593k825j589O204N452
$$ 916 -4807 -2553 4282 3802 -4143 -6358 -2277 -2247 -9519 -11122 -4025 568 -2257 -3846 2358 7810
1230G810k620n012K127M822k157o316j55O520J229n593p91N568J047p443n784
$$ 7810 5190 178 2305 7127 4970 -1346 -1501 5019 6248 655 -136 5432 6479 -964 -6748
1245f748J831K127m061m285M671Q000m18n004K535O120j208o839Q5O335J946m253
$$ -6748 -4917 -2790 -6851 -11136 -6465 1535 1117 -3887 -1352 4768 3560 -3279 -3194 3141 5087 834
1261H34j720P090L618n219l606L643K219o251p345J040M359k420m828L344P150
$$ 834 -886 6204 9822 4603 997 4640 6859 608 -6737 -5697 -1338 -3758 -8586 -5242 1908
1276A908j54n574q83M079L83n655j289O878N350k118j820N109M533m028n409Q30
$$ 1908 1754 -3820 -4703 -624 -241 -5896 -7185 -307 5043 2925 1105 6214 10747 6719 1310 2140
1292B140L359k967o418j02N398K72n094m81N222R56o240m251K638K634l109k824
$$ 2140 5499 2532 -3886 -3988 1410 1682 -3412 -3893 1329 2285 -3955 -8206 -5568 -2934 -6043 -8867
1308h867N367P989r2l565K578M867k245o104p07M781J006m781j207N716K464n814
$$ -8867 -3500 4489 4397 832 3410 8277 6032 -72 -779 4002 5008 227 -980 4736 7200 1386
1324A386l939L097J395n417n791K029L960j407l692L978P428L81m358p7M472m26
$$ 1386 -2553 544 1939 -3478 -9269 -7240 -3280 -4687 -8379 -4401 3027 3408 -950 -1027 3445 3019
1340C019n449r94N768M059k522j699M078L425m989n725N78K429l063n600K32N134
$$ 3019 -2430 -3424 2344 6403 3881 2182 6260 9685 4696 -1029 -451 1978 -1085 -6685 -6453 -1319
1356a319N36m455K45N487J689n227k483L521K441l087k601N446O446m45l694K389
$$ -1319 -783 -5238 -4993 494 2183 -3044 -5527 -2006 435 -2652 -5253 193 6639 6194 2500 4889
1372D889M246l676o675n41L965l45m581p13N017J768n611k599L370K180n303l384
$$ 4889 9135 5459 -1216 -1757 2208 1863 -2718 -3431 1586 3354 -2257 -4856 -1486 694 -4609 -7993
1388g993L303M219j666k838M022O297K06m067J09L921r27n865j609M843K726l474
$$ -7993 -4690 -471 -2137 -4975 -953 5344 5550 1483 1592 5513 4586 -1279 -2888 1955 4681 1207
1404A207j782M045K220m712n516J116K629k952m156K061N096R81l486N82N715
$$ 1207 -575 3470 5690 978 -4538 -3422 -793 -3745 -7901 -5840 -744 237 -3249 -2667 3048
1419C048J126m468j827L783J733l970j670M454M508j663l354J371L010l671o759
$$ 3048 4174 -294 -2121 1662 3395 -575 -2245 2209 6717 5054 1700 3071 6081 2410 -4349
1434d349q40L806l43m171R54N714J224m147j707L486K140m103l110L785M433j730
$$ -4349 -5189 -1383 -1726 -5897 -4943 771 1995 -2152 -3859 -373 1767 -2336 -5446 -1661 2772 1042
1450A042k203L881M889q13m676K68K729k639n767j367L717J890l009r67L572K585
$$ 1042 -1161 2720 7609 6796 2120 2388 5117 2478 -3289 -4656 -939 951 -2058 -3025 547 3132
1466C132m611m309J583K613k352k607K636N324J434k363P01M764P30m932k170
$$ 3132 -1479 -5788 -4205 -1592 -3944 -6551 -3915 1409 2843 480 1181 5945 6675 1743 -427
1481d27L683R90n010j849L868L305k571k891J539K368l469o484j58M300m34l482
$$ -427 3256 4246 -764 -2613 1255 4560 1989 -902 637 3005 -464 -6948 -7106 -2806 -3240 -6722
1497f722K021O113J681l754o77L696J078l669k188L455L820k107k649K909L887
$$ -6722 -4701 1412 3093 -661 -1338 2358 3436 -233 -2421 1034 4854 2747 98 3007 6894
1512F894j856m598o3K303k557n220r15L473R33k042m12L866K837l251l721J808
$$ 6894 5038 440 377 2680 123 -5097 -6012 -2539 -1606 -3648 -4060 -194 2643 -608 -4329 -2521
1528b521K953k066k377L367M725L78k413O43L290l55m278k460K829J275n017k580
$$ -2521 432 -1634 -4011 -644 4081 4459 2046 2689 5979 5624 1346 -1114 1715 2990 -2027 -4607
1544d607M081K497k625k918K309K687l088m461R54L414K02k786K100N881J613
$$ -4607 -526 1971 -654 -3572 -1263 1424 -1664 -6125 -5171 -1757 -1555 -4341 -2241 3640 5253
1559E253l751p74L435M92m106k287K908K620k216k483K098K726j785m361k54K951
$$ 5253 1502 728 4163 4655 549 -1738 1170 3790 1574 -909 1189 3915 2130 -2231 -2485 466
1575D66j644m737l85M112J376k072L79M210K332k778k647J591K096j798l056K622
$$ 466 -1178 -5915 -6300 -2188 -812 -2884 -2505 1705 4037 1259 -1388 203 2299 501 -2555 67
1591F7M788K18l947K64L095j047m954k046K656L59l177j835L525L545k724k317
$$ 67 4855 5073 1126 1390 4485 3438 -1516 -3562 -906 -547 -3724 -5559 -2034 1511 -1213 -3530
1607c530L053L424k964l866J410L387o60k153J864M853J437l374j237K306j08
$$ -3530 -477 2947 -17 -3883 -2473 914 254 -1899 -35 4818 6255 2881 1644 3950 3842
1622C842n208k341K578K044k212k026K664K528j824l499P02K047n99l184j8L793
$$ 3842 -1366 -3707 -1129 915 -1297 -3323 -659 1869 45 -3454 -2752 -705 -1304 -4488 -4506 -713
1638g13K147k133M19M464K261l283k481J119J348k783k829J526L509q8l369J97
$$ -713 1434 -699 -280 4184 6445 3162 681 1800 3148 365 -2464 -938 2571 2483 -886 -689
1654f89L317j370n014j536K947N24k986k39L897K734j582j446L067K744k060l472
$$ -689 2628 1258 -3756 -5292 -2345 -1821 -4807 -5046 -1149 1585 3 -1443 1624 4368 2308 -1164
1670a164R13L172j160k803J670M382Jl429j242J894o06m782k462K663J926j602
$$ -1164 -251 2921 1761 -1042 628 5010 5011 1582 340 2234 1628 -3154 -5616 -2953 -1027 -2629
1686b629j268K560L009j674k589P34K688q46k365O58L770R17j772k24L421J651
$$ -2629 -3897 -1337 1672 -2 -2591 -1857 831 -15 -2380 -1722 2048 2965 1193 969 4390 6041
1702F041l214k869J368Q96l247k845J844L057o09k178M06K265n39m497r04L264
$$ 6041 2827 -42 1326 2222 -1025 -3870 -2026 1031 422 -1756 -1350 915 376 -4121 -5025 -1761
1718a761R23k312N83L821K508j863j590K347J550k194l049J474J913j040k694
$$ -1761 -838 -3150 -2567 1254 3762 1899 309 2656 4206 2012 -1037 437 2350 1310 -1384
1733a384J028L365k76l109q91J805n08l888j314K348K050q13q62K689K902j361
$$ -1384 -356 3009 2733 -376 -1267 538 30 -3858 -5172 -2824 -774 -1587 -2449 240 3142 1781
1749A781k929J012K257j219k158Q46K940M63k180l03K628O63k976k831J556O33
$$ 1781 -1148 -136 2121 902 -1256 -410 2530 2993 813 510 3138 3801 825 -2006 -450 183
1765A83k905j964K216K951o59j530J239K365r40l565j77K909N13k007N01L595
$$ 183 -2722 -4686 -2470 481 -178 -1708 -469 1896 956 -2609 -2786 123 636 -1371 -870 2725
1781B725J704k574j341J858J128k948k940J459J759j641k277J425K837j03k443
$$ 2725 4429 1855 514 2372 3500 552 -2388 -929 830 -811 -3088 -1663 1174 1071 -1372
1796a372j52K169l17l579r38K851J951j170k30K969K336j682k408J99K020j721
$$ -1372 -1524 645 328 -3251 -4189 -1338 613 -557 -787 2182 4518 2836 428 627 2647 926
1812I26k758O97K865m21k454L20J825L92k614j819J885Q67k587j551K508K496
$$ 926 -1832 -1135 1730 1309 -1145 -825 1000 1392 -1222 -3041 -1156 -289 -2876 -4427 -1919 577
1828E77k03j082J489K945j114l316K07J948Jk252M26L063J058k566j394J307N42
$$ 577 374 -708 781 3726 2612 -704 -497 1451 1452 -800 -374 2689 3747 1181 -213 1094 1636
1845A636k525k533J192J808j248k099J449K988j11j989O50K122m0k705m59J966
$$ 1636 -889 -3422 -2230 -422 -1670 -3769 -2320 668 557 -1432 -782 1340 1300 -1405 -1864 102
1861A02J571j214k62K668J812j990k553J66J320j924k516O94K488K1j961OJ985
$$ 102 1673 459 197 2865 4677 2687 134 300 1620 -304 -2820 -2126 362 383 -1578 -1572 413
1878D13K61k448j086J713J409k396q13K227L036j202q28J583K142j079l007m64
$$ 413 674 -1774 -2860 -1147 262 -2134 -2947 -720 2316 1114 286 1869 4011 2932 -75 -539
1894e39J882o77k113M79K925O87k590j008J426J63k597j953J508J977o62j185
$$ -539 1343 666 -1447 -968 1957 2644 54 -954 472 635 -1962 -3915 -2407 -430 -1092 -2277
1910b277J400K842j65k061K88J969m69k278n24K264O37j370l29K162J576k402
$$ -2277 -877 1965 1800 -261 27 1996 1527 -751 -1275 989 1626 256 -73 2089 3665 1263
1926A263k147K19Q47j683k510J207K701N01j959P27K102J76k203j112K018J039
$$ 1263 -884 -665 182 -1501 -4011 -2804 -103 398 -1561 -834 1268 1444 -759 -1871 147 1186
1942A186j747j224K452K153j028j679J650J794j818l137o6J539j086j789O49K630
$$ 1186 -561 -1785 667 2820 1792 113 1763 3557 1739 -1398 -1464 75 -1011 -2800 -2151 479
1958D79J007k156o59J811L42k603j490J897K093r55n84J838K081o70j917K13J527
$$ 479 1486 -670 -1329 482 824 -1779 -3269 -1372 721 -234 -818 1020 3101 2431 514 727 2254
1975B254k82k863o08J625M08j464n08J848J502j523k353O84J148j505j844J250
$$ 2254 1972 -891 -1499 126 534 -930 -1438 410 1912 389 -1964 -1280 -132 -1637 -3481 -2231
1991b231K509O73j469O41K288K37k661r38K193R81k076j263K216J396j683j702
$$ -2231 278 951 -518 123 2411 2648 -13 -951 1242 2223 147 -1116 1100 2496 813 -889
2007h89J561J437j652k822J58J497m01k316Q94K648P91j403l10J995M55k194j117
$$ -889 672 2109 457 -2365 -2207 -710 -1111 -3427 -2533 115 906 -497 -807 1188 1643 -551 -1668
2024a668J633J825p49j099J683J881j458j975K03J443p68k573m85J724M36j752
$$ -1668 -35 1790 1041 -58 1625 3506 2048 73 276 1719 951 -1622 -2107 -383 53 -1699
2040a699p52K067J313j380j844J619Q69j273j353J270K578K01j204Q65J841j77
$$ -1699 -2451 -384 929 -451 -2295 -676 193 -1080 -2433 -1163 1415 1616 412 1277 3118 2941
2056B941k523o50J488K35j896q11J652J054j623j138R05J374j609k337P01J629
$$ 2941 418 -232 1256 1491 -405 -1216 436 1490 -133 -1271 -366 1008 -601 -2938 -2237 -608
2072f08n47k058J416K848M53j533O05J237M16j790j280J298J071o98j159J587
$$ -608 -1155 -3213 -1797 1051 1504 -29 576 1813 2229 439 -841 457 1528 830 -329 1258
2088A258J718j254k010l29J254j064k028j80J872K11j255l15K499P91j365r19
$$ 1258 2976 1722 -288 -617 637 -427 -2455 -2635 -763 -552 -1807 -2122 377 1168 -197 -1116
2104a116J407J015j444j713J581K180j69j035M75J822l94k668o81J046j26k080
$$ -1116 291 1306 -138 -1851 -270 1910 1741 706 1181 3003 2609 -59 -740 306 180 -1900
2120a900o26K357Q62j119j277J201J118j294j579Q15J483l79j003P68K295M63
$$ -1900 -2526 -169 693 -426 -1703 -502 616 -678 -2257 -1442 41 -338 -1341 -573 1722 2185
2136B185j466J10J857n70k144q96O92P47j047n91J176J492j035j688j97J240p31
$$ 2185 719 829 2686 2116 -28 -924 -232 515 -532 -1123 53 1545 510 -1178 -1375 -135 -866
2153h66j810M26J910M35j078K34J967Q78j349m22P56J028j498j560R94J632n73
$$ -866 -2676 -2250 -340 95 -983 -749 1218 2096 747 325 1081 2109 611 -949 45 1677 1104
2170A104j338J041J156r74k130p71J049J3j506j00J806J038j003q07J470P36n98
$$ 1104 -234 807 1963 989 -1141 -1912 -863 -850 -2356 -2456 -650 388 -615 -1422 48 784 186
2187A86j079Q83J208n65q17Q10J716k51j171m05J265p7k056j413R51L63r72n48
$$ 186 -893 -10 1198 633 -184 626 2342 2091 920 515 1780 1703 -353 -1766 -815 -452 -1424 -1972
2205a972J400J195q05j428J67J092m73j274P89J416J125q20j67J983K73j201j165
$$ -1972 -572 623 -182 -1610 -1443 -351 -824 -2098 -1309 107 1232 412 245 2228 2501 1300 135
2222A35J121N76j590j352R76R15o09j095N20J291n47k068m87J286q1j608M08K149
$$ 135 1256 1832 242 -1110 -134 781 172 -923 -403 888 341 -1727 -2214 -928 -1009 -2617 -2209 -60
2240f0J131r91m16J371R71j287j216P35J425o28j169O71J364k85j713R4R45j87
$$ -60 1071 80 -336 1035 2006 719 -497 238 1663 1035 -134 537 1901 1616 -97 -3 942 755
2258G55k083q41R00L45p09m26J482J254l80j260O20J243q83j243L59J756M38n46
$$ 755 -1328 -2169 -1269 -924 -1633 -2059 -577 677 297 -963 -343 900 17 -1226 -867 889 1327 781
2276G81l5J196M16j844r40R48M51j467j136O93Q52j32j252O24J351p2j846j10
$$ 781 746 1942 2358 514 -426 522 973 -494 -1630 -937 -85 -217 -1469 -845 506 434 -1412 -1522
2294a522J215r5r70P6K119Q15j015k54J602K28j525j195N96Q77n15j232N96R69
$$ -1522 -307 -402 -1372 -1296 823 1638 623 369 1971 2199 674 -521 75 952 437 -795 -199 770
2312G70j68j512L4J057n8j595k19P80N37p90p4J209J367n67q01O40R16n99j603
$$ 770 602 -910 -876 181 123 -1472 -1691 -911 -374 -1164 -1238 -29 1338 771 -30 610 1526 927 -676
2331f76K55J642J94j206J20J234j72j797p58N70O18j446q34J173J294q92m50L66
$$ -676 -421 1221 1415 209 329 1563 1391 -406 -1164 -594 24 -1422 -2256 -1083 211 -681 -1131 -765
2349g65K055o35j326K53J411l88j156K32J432P75j032l06P33K95j759r59N90O18
$$ -765 1290 655 -671 -418 993 605 -551 -319 1113 1888 856 550 1283 1578 -181 -1140 -550 68
2367F8o02r53O99J000K53j763K67J086J6j294j19J336M63p27j22J526J096q91
$$ 68 -534 -1487 -788 212 465 -1298 -1031 55 71 -1223 -1342 -6 457 -270 -392 1134 2230 1339
2385A339r70N68P06q57j603J00J248k42r61J40J119k74j235r21J000M63j085n36
$$ 1339 369 937 1643 786 -817 -717 531 289 -672 -532 587 313 -922 -1843 -843 -380 -1465 -2001
2403b001J371J153m30o15R74J352n01j470K39J181o27j284N02J026O50j140l63
$$ -2001 -630 523 93 -522 452 1804 1303 -167 72 1253 626 -658 -156 870 1520 380 17
2420A7R78k17j325j376P22P62l25p78N10J403J3r58K94P98J37j297j60J482L72
$$ 17 995 778 -547 -1923 -1201 -439 -764 -1542 -1032 371 384 -574 -280 518 655 -642 -802 680 1052
2439A052r87l16J186J037j104q59R36m3r07j225j29J401j54j079L07J254J19j337
$$ 1052 65 -251 935 1972 868 9 945 902 -5 -1230 -1359 42 -112 -1191 -884 370 489 -848
2457h48o40J013P24r85l01R29J225o37n96J002Q69o41j244K15P24m62j338L61
$$ -848 -1488 -475 249 -736 -1037 -108 1117 480 -116 886 1755 1114 -130 85 809 347 -991 -630
2475f30J042O1o03m36P68J32j088n50K02J053n78k73O21J488m61n77l30J365n80
$$ -630 412 473 -130 -566 202 334 -754 -1304 -1102 -49 -627 -900 -279 1209 748 171 -159 1206 626
2494F26q21j86J133M14r31n71P25M99o00p96L33N67r11r27J23J122L9q59O36J277
$$ 626 -195 -381 752 1166 235 -336 389 888 288 -508 -175 392 -519 -1446 -1323 -201 -162 -1021 -385 892
2514H92j03r52l76Q65M85j269k6J135J098j072n49R32L0m21j409N63L05k93q70
$$ 892 789 -163 -539 326 811 -458 -484 651 1749 677 128 1060 1090 669 -740 -177 128 -165 -1035
2533a035l90J124L96o90j85J012Q8n36p26P16L19M9n89O84J218j43r99r4R47l49
$$ -1035 -1425 -301 95 -595 -780 232 320 -216 -942 -226 93 142 -447 237 1455 1312 313 219 1166 817
2553H17j455j64Q75l4n69L9L52K17l66q12Q10N27r40p59M16Q52K22m27O07J040
$$ 817 -638 -802 73 39 -530 -491 -139 78 -288 -1100 -290 237 -703 -1462 -1046 -194 28 -399 208 1248
2573A248L80j330j99N65J59j049l03J124P18q47o94P07N0o46j108M53M46m10m29
$$ 1248 1628 298 99 664 823 -226 -529 595 1313 466 -228 479 529 -117 -1225 -772 -326 -736 -1165
2592a165J4J210k01j20m5Q33K80p43k91P15K16o92j73P62Q88o38m67k61M64l60
$$ -1165 -1151 59 -142 -262 -307 526 806 63 -228 487 703 11 -162 600 1488 850 383 122 586 226
2612B26j059k95Q42M20j046k55J148M4j93p86O32O87n34n71N83P85K69j021L94
$$ 226 -833 -1128 -286 134 -912 -1167 -19 25 -168 -954 -322 365 -169 -740 -157 628 897 -124 270
2631B70J229n0j191n12R06q1j074l67R65M79o77o77P43M99o74j065J98R36k64
$$ 270 1499 1449 258 -254 652 571 -503 -870 95 574 -103 -780 -37 462 -212 -1277 -1079 -143 -407
2650d07m28M99P40M6m93J64Q32J04q93l37P42P9r19j11L74J090m56r48o8M71l79
$$ -407 -835 -336 404 450 -43 121 953 1057 164 -173 569 648 -271 -382 -8 1082 626 -322 -390 81 -298
2671b98r20j73Q76K54l83J82Q38K61o05j91O61J38q05k94N80J065l83r00L54P07
$$ -298 -1218 -1391 -515 -261 -644 -462 376 637 32 -159 502 640 -165 -459 121 1186 803 -97 257 964
2691I64N0j490J55O88p75p05r9Q68M54m72k68Q05N64p95r38O86O50l28l18M84
$$ 964 1014 -476 -321 367 -408 -1113 -1212 -344 110 -362 -630 175 739 -56 -994 -308 342 14 -304 180
2711A80J056k49n18l99Q57K18j058n87R5N94n99o02N07Q20k8r30L54O33q20p80
$$ 180 1236 987 469 70 927 1145 87 -500 -405 189 -410 -1012 -505 315 287 -643 -289 344 -476 -1256
2731a256M57M01O46n00K07R94M27o27p12N58J73l16r09N92N81j21j254O87L77
$$ -1256 -799 -398 248 -252 -45 949 1376 749 37 595 768 452 -457 135 716 595 -659 28 405
2750D05J8q26n35N39p5p83p5O77P43k82J11N34M94o44p08L65Q67l24p70O35N79
$$ 405 423 -403 -938 -399 -474 -1257 -1332 -655 88 -194 -83 451 945 301 -407 -42 825 501 -269 366 945
2771I45j73n27j17M88R2j223j68O69p6n58o01R39L92l26k61p8R86n55o85R2J321
$$ 945 772 245 128 616 708 -515 -683 -14 -90 -648 -1249 -310 82 -244 -505 -583 403 -152 -837 -745 576
2792E76j26l41M1P46K87o66m23L55K85p46n61N51N01m78r11O02O14n91l52k17
$$ 576 450 109 150 896 1183 517 94 449 734 -12 -573 -22 479 1 -910 -308 306 -285 -637 -854
2812h54N94J8m67l94Q43P78k89l6O66K62p93l32J09L97m52o8J84M11Po91k11L71
$$ -854 -260 -242 -709 -1103 -260 518 229 193 859 1121 328 -4 105 502 50 -18 166 577 584 -107 -318 53
2834E3K67j157j34O54K35n26O8M00M62k09m63M73M05k93o17J70O88l8l24J08O06
$$ 53 320 -837 -971 -317 -82 -608 -540 -140 322 113 -350 123 528 235 -382 -212 476 438 114 222 828
2855H28J90j022n88O19M52r73l70O73J33K2o30L20P08k08q59L78N93O6o57O6Q80
$$ 828 1018 -4 -592 27 479 -494 -864 -191 -58 -36 -666 -346 362 154 -705 -327 266 332 -325 -259 621
2876F21P8m99j13N54K26n18q53K52L43l22l89K79M42Ml34j74M24K6o42l55O37
$$ 621 699 200 87 641 867 349 -504 -252 91 -231 -620 -341 101 105 -229 -403 21 47 -595 -950 -313
2897c13L24j09k94K79Q19om93M5M78k05p93K72L04N7p51O8Q96k25m22m28L50R3
$$ -313 11 -98 -392 -113 706 700 207 252 730 525 -268 4 308 365 -386 -318 578 353 -69 -497 -147 -54
2919e4n74n49P12O00n78J53L67M18k56l70K17N16j2n63j17P12L0n84q5L16N09
$$ -54 -628 -1177 -465 135 -443 -290 77 495 239 -131 86 602 590 27 -90 622 652 68 -17 299 808
2940H08o25n31K25k25l0l99K28Q93j68p87K78N72J95p09k28O65O37n15k83M43
$$ 808 183 -348 -123 -348 -378 -777 -549 344 176 -611 -333 239 434 -275 -503 162 799 284 1 444
2960D44O53l56o47K80J60j72p80K72N33m27m18j39N85L46p57j58L24K76n15n62
$$ 444 1097 741 94 374 534 362 -418 -146 387 -40 -458 -597 -12 334 -423 -581 -257 19 -496 -1058
2980a058N40J014m89j85M10N85n18m00L16J81K12o87N7O03j00m80k85N37R0p08
$$ -1058 -518 496 7 -178 232 817 299 -101 215 396 608 -79 -22 581 481 1 -284 253 343 -365
3000c65l33K99J22m26l0M80L86J30j91k34M09R9q86JO34K75l81pO32P0l47p53
$$ -365 -698 -399 -277 -703 -733 -253 133 263 72 -162 247 346 -540 -539 95 370 -11 -18 614 684 337 -416
3022d16K68M20n28m38M67P5J67m48O6O38qm31qL34J45m69l47N88M8K69m72N76
$$ -416 -148 272 -256 -694 -227 -152 15 -433 -367 271 263 -168 -176 158 303 -166 -513 75 123 392 -80 496
3044D96K48m06n22J57J56j97m29J37N45l24j62J91j8J01k7n70N20R3m40n6N58
$$ 496 744 338 -184 -27 129 -68 -497 -360 185 -139 -301 -110 -128 -27 -54 -624 -104 -11 -451 -507 51
3065E1N80k11l46K7Q52l86r47K56K72J16n56R5N84k33l93J0j67N06k39p08N36
$$ 51 631 420 74 101 953 567 -380 -124 148 264 -292 -197 387 154 -239 -229 -396 110 -129 -837 -301
3086c01L81j22m40M85M22j27j09J74M07O6j053L80n1M49m83k0L77K10o38o35K33
$$ -301 80 -42 -482 3 425 298 189 363 770 836 -217 163 112 561 78 58 435 645 7 -628 -395
3107c95L78j99m24J13P17k49j47m99N28N86l51m24L31M89k62k96L58K48L17q57
$$ -395 -17 -216 -640 -527 190 -59 -206 -705 -177 409 58 -366 -35 454 192 -104 254 502 819 -38
3127c8M70N11m57l34l54J82j70j94j23P39j22l63l87K65J36k03j85L47O23k13
$$ -38 432 943 486 152 -202 -20 -190 -384 -507 232 110 -253 -640 -375 -239 -442 -627 -280 343 130
3147A30l26J52O27q4n53K59L51J30p66k18J23M82j48l95L26K20o23j20R4M3n1
$$ 130 -196 -44 583 499 -54 205 556 686 -80 -298 -175 307 159 -236 90 310 -313 -433 -339 -296 -347
3168c47k96L5Q95Jp9l49L94J99l58j73K29M26k00o07N20L79k29m20j8M25k46o33
$$ -347 -643 -608 287 288 209 -140 254 453 95 -78 151 577 377 -230 290 669 440 20 2 427 181 -452
3190d52j05K56K58l46j83Q39j19l66j26L24J44k41j75K00N96m15k99K50M26R5
$$ -452 -557 -301 -43 -389 -572 267 148 -218 -344 -20 124 -117 -292 -92 504 89 -210 40 466 561
3210E61n09L7K51k02o12O8M37j78J06k08K24M10l26m25J15j2k8n9J25N66k28q4
$$ 561 52 89 340 138 -474 -406 31 -147 -41 -249 -25 385 59 -366 -251 -263 -291 -350 -225 341 113 29
3232B9J04J72J57k41n73L52K03j55k36K55L30l55n28K08R9K48o46L83R5K65n56
$$ 29 133 305 462 221 -352 0 203 48 -188 67 397 42 -486 -278 -179 69 -577 -194 -99 166 -390
3253c90L2O65K42m10j90L85J99l32k98N4O08k85l18rL73j4q33L35K22k59k87J19
$$ -390 -358 307 549 139 -51 334 533 201 -97 -43 565 280 -38 -47 326 312 -521 -186 36 -223 -510 -391
3275c91K8L09l53K66O6M08o6l46L19o4l12J19K41J03rN5n72O59R7n57k51N0L89
$$ -391 -363 -54 -407 -141 -75 333 267 -79 240 176 -136 -17 224 327 318 373 -199 460 557 0 -251 -201 188
3298A88l24j68J0M12l17k53J21J30J55m08K35K50J22m35J00M14K84j16k82M23
$$ 188 -136 -304 -294 118 -199 -452 -331 -201 -46 -454 -219 31 153 -282 -182 232 516 400 118 541
3318E41j09l57k76R0L47j92k71Q1N48n81j37j50M13k72j88k21O60O0O1l38M35
$$ 541 432 75 -201 -111 236 44 -227 -146 402 -179 -316 -466 -53 -325 -513 -734 -74 -14 47 -291 144
3339A44K20q9q8r4K95k33m02L67J40L07l63J5K41k72m45m3k7L43k49l57M99J99
$$ 144 364 275 187 93 388 155 -247 120 260 567 204 219 460 188 -257 -300 -327 16 -233 -590 -91 108
3361A08k7l49K40K32P5n42J71K90p8j98Q4L37P5j22m46N71K0l71n14K39J70o0
$$ 108 81 -268 -28 204 279 -263 -92 198 120 -78 6 343 418 296 -150 421 441 70 -444 -205 -35 -95
3383i5k04L3L87j62k39J60Q7l26m0K86K88M2l22RO11M8k73l30J3M35l51j85k37
$$ -95 -299 -266 121 -41 -280 -120 -33 -359 -399 -113 175 217 -105 -96 515 563 290 -40 -27 408 57 -128 -365
3406c65K90l5q7J4K40K01m13k39o7M14j85l73Q39j30J36l36K78P5k0j61k29N68
$$ -365 -75 -110 -197 -183 57 258 -155 -394 -461 -47 -232 -605 234 104 240 -96 182 257 237 76 -153 415
3428D15r1m62o8P84m28l19j08L84J13p03O8J40L3K08l21L30J77j67p4l3J27l3
$$ 415 324 -138 -206 578 150 -169 -277 107 220 -483 -415 -275 -242 -34 -355 -25 152 -15 -89 -122 5 -28
3450b8j88K27M60l67j0j37K39K06n82l0L58k45K52m53NK35q6j75R5M70k94k22
$$ -28 -216 11 471 104 94 -43 196 402 -180 -210 148 -97 155 -298 -293 -58 -144 -319 -224 246 -48 -270
3472b70j26K78j0j25J92K35M73l65j59L9K05j38l95N0M03j75m37q7N88O4l09j58
$$ -270 -396 -118 -128 -253 -61 174 647 282 123 162 367 229 -166 -116 287 112 -325 -412 176 240 -69 -227
3494b27M43j90m23j4o3N00j08p6J56L29N9m36K08K0L43q25K01M54k10O2l74J17
$$ -227 216 26 -397 -411 -474 26 -82 -158 -2 327 386 -50 158 178 521 -304 -103 351 141 203 -171 -54
3516e4J21p7k80J63Q4n7m27M71j08J13j99Q4L35N0l17j00M12k44j83l6P79k46
$$ -54 67 -10 -290 -127 -43 -100 -527 -56 -164 -51 -250 -166 169 219 -98 -198 214 -30 -213 -249 530 284
3538B84j75n0M32j80j04m85L09J37j90j68K24K54j76j47j92L07j5k69N0J15J67
$$ 284 109 59 491 311 207 -278 31 168 -22 -190 34 288 112 -35 -227 80 65 -204 -154 -39 128
3559A28k01j75L10J25M3j58J48%l57k58R1N00J61l59j46J73k41pO3K76K02m29
$$ 128 -73 -248 62 187 230 72 220 220 -137 -395 -304 196 357 -2 -148 25 -216 -223 -160 116 318 -111
3581a11l03L59J45J01j95j42N51q4l16L2J01J73n25Q2K60O7j46j42J84J75l70
$$ -111 -414 -55 90 191 -4 -146 405 321 5 37 138 311 -214 -132 128 195 49 -93 91 266 -104
3602a04k15j53O28k31l40L14K87k76J36k78L74N7m28O4N43k2l60J84j89M00l56
$$ -104 -319 -472 156 -75 -415 -101 186 -90 46 -232 142 199 -229 -165 378 356 -4 180 -9 391 35
3623C5k30L53M7k17k65l2M30J89n58K04N5J86M2m45j29O97l29j57L46L04k85m29
$$ 35 -195 158 205 -12 -277 -309 121 310 -248 -44 11 197 239 -206 -335 362 33 -124 222 526 241 -188
3645a88J94K96k9k51j40K10k25O7l63O06o2j53k35K41j10k99N1P0q3M27j36J04
$$ -188 6 302 273 22 -118 92 -133 -66 -429 177 115 -38 -273 -32 -142 -441 -390 -320 -403 24 -112 -8
3667hJ93j19l6J17P6O0q8k02K80K2m62O9J59J30l5j88j28J95k20l00r7L73J00
$$ -8 185 66 30 147 223 283 195 -7 273 295 -167 -98 61 191 156 -32 -160 35 -185 -485 -582 -209 -109
3690a09N2k07K81L04o17L13R3Q6Pj20j10K33nj49k9J03lk16j89K84K33n80q2L13
$$ -109 -57 -264 17 321 -296 17 110 196 203 83 -27 206 201 52 23 126 123 -93 -282 2 235 -345 -427 -114
3714a14J35j83N4K42r3k68r4K00l8M50l69R7R9Qj15j0N8J35p9R3j00j01j20j28
$$ -114 21 -162 -108 134 41 -227 -321 -121 -159 291 -78 19 118 126 11 1 59 194 115 208 108 7 -113 -241
3738b41M21ol70o5M02n5j60l91K00L83q4j89K0J48K21k11l3O9L9K2n3M5L38k72
$$ -241 180 174 -196 -261 141 86 -74 -465 -265 118 34 -155 -135 13 234 23 -10 59 98 120 67 112 450 178
3762A78p7OJ34k35j52J58o0K14n24L07L18l62R4p9K81j12J34j47Q8qj20j92L07
$$ 178 101 107 241 6 -146 12 -48 166 -358 -51 267 -95 -1 -80 201 89 223 76 164 156 36 -156 151
3785A51k29K40N2l91M54k56m59O2J96J79j48p5J05K26k54kJ40m9O0j64K09k8j01
$$ 151 -78 162 214 -177 277 21 -438 -376 -180 -1 -149 -224 -119 107 -147 -149 -9 -58 2 -162 47 19 -82
3808h2K20O2J75J06k82l05K99j99k19R0J90J61k15j79j61L60k06K4j6M7J64k01
$$ -82 138 200 375 481 199 -106 193 -6 -225 -135 55 216 1 -178 -339 21 -185 -161 -177 -130 34 -167
3830a67Q1L31j55J76k49K11J29m98M01j67j6K50p43M29K46m25%K33j93k90r9J85
$$ -167 -86 245 90 266 17 228 357 -141 260 93 77 327 -416 13 259 -166 -166 67 -126 -416 -515 -330
3852c30L50j09l0k15K82K8m6K0N9J57K3j13k00K45R5j84j12M10J32j82m53L27
$$ -330 20 -89 -119 -334 -52 -24 -70 -50 9 166 189 76 -124 121 216 32 -80 330 462 280 -173 154
3874A54o5j88j55J98J77j94j36M2j26M03k66k6M27j90k54L37k7k6Rk04K85O6n1
$$ 154 89 -99 -254 -56 121 -73 -209 -167 -293 110 -156 -182 245 55 -199 138 111 85 94 -110 175 241 190
3897A90l73L20q2l3k17L14L0j56k79n1J85j73K62N6r4L13k77q8K32J27j76J76
$$ 190 -183 137 55 22 -195 119 149 -7 -286 -337 -152 -325 -63 -7 -101 212 -65 -153 79 206 30 206
3919B06j47M7J3l06J48K01q6l2k72N86l10n4l4j98M51m20O7K29L7k36j52L74Q0
$$ 206 59 106 119 -187 -39 162 76 44 -228 358 48 -6 -40 -238 213 -207 -140 89 126 -110 -262 112 192
3942A92j60J17j68L3K90j98l11M54J38m31j07L10J2l3q03O33n0k58K09K0K52N4
$$ 192 32 149 -19 14 304 106 -205 249 387 -44 -151 159 171 138 -665 -32 -82 -340 -131 -111 141 195
3964A95j01k21K40j77j2m9J91Q5M1k79J67J16j17l1j39K44k17J0j84L07l72R6
$$ 195 94 -127 113 -64 -76 -125 66 151 192 -87 80 196 79 48 -91 153 -64 -54 -238 69 -303 -207
3986b07R7J55j27J66l0j27R9k16q6j21M65k31K61J30R1k09j64J21M5k28MJ36J59
$$ -207 -110 45 -82 84 54 -73 26 -190 -276 -397 68 -163 98 228 319 110 -54 67 112 -116 -112 24 183
4009A83j60J78l16K01j24m9K1Ok21N6j72K33L77p4j26J93J38m29K13j44J96j61
$$ 183 23 201 -115 86 -38 -87 -66 -60 -281 -225 -397 -164 213 139 13 206 344 -85 128 -16 180 19
4031A9m0j18J54K68r2l06J45J13m59j04j1K52Ll0K09k17J60N0j35L70k21Rk5O
$$ 19 -21 -139 15 283 191 -115 30 143 -316 -420 -431 -179 -176 -206 3 -214 -54 -4 -139 231 10 19 -6 0
4055@j34R1O1L55l44L41l47k05J61l0J21l1r1J71k95j20L08j26k68K24q9M10r2
$$ 0 -134 -43 18 373 29 370 23 -182 -21 -51 70 39 -52 119 -176 -296 12 -114 -382 -158 -247 163 71
4078G1k45L02J96l49P7K45j68r9j0k47M6L41j61K41k15J78p0l40J62j25Q9j53
$$ 71 -174 128 324 -25 52 297 129 30 20 -227 -181 160 -1 240 25 203 133 -207 -45 -170 -81 -234
4100b34m2K80Q0k84k73O98p0j47k06K92J02m19L35N0R4l56K65j98J95K6l33QJ42
$$ -234 -276 4 84 -200 -473 225 155 8 -198 94 196 -223 112 162 256 -100 165 -33 162 188 -145 -137 5
4123Ek00m4J10M5M4j25J55K27k38k25L45j21J07j83Q5L77j39j27j60l0M03k88
$$ 5 -195 -239 -129 -84 -40 -165 -10 217 -21 -246 99 -22 85 -98 -13 364 225 98 -62 -92 311 23
4145B3k10J11q5j2P1M6p0K77p4j07P2J09j58rL6j1M9k7J83P2k79Lp0L2L19l53
$$ 23 -187 -76 -161 -173 -102 -56 -126 151 77 -30 42 151 -7 -16 20 9 58 31 214 286 7 10 -60 -28 291 -62
4171f2K3J46Rj35j19l0L57m50J21R1l6j64J93j28J75M9l18N05k30J40k40J35J5
$$ -62 -39 107 116 -19 -138 -168 189 -261 -140 -49 -85 -249 -56 -184 -9 40 -278 227 -3 137 -103 32 47
4194D7J6J19k67J9M53l78K1l25L40j19k7J40l8k25J13m6J88%o0k50L86k15q0J54
$$ 47 63 182 -85 -66 387 9 30 -295 45 -74 -101 39 1 -224 -111 -157 31 31 -29 -279 107 -108 -188 -34
4218c4j31L82J08k87o1J42j91N2k15M78j76K5m04K78p3P7k35J61Q0k12k98L76
$$ -34 -165 217 325 38 -23 119 -72 -20 -235 243 67 92 -312 -34 -107 -30 -265 -104 -24 -236 -534 -158
4240a58j27L93k47m7L01k6j22j01N58l59R2k70K52M2l77J03J10J4j52m5J31N3
$$ -158 -285 108 -139 -186 115 89 -33 -134 424 65 157 -113 139 181 -196 -93 17 31 -121 -166 -35 18
4262A8J1j11J23k28K18m0j84M44l52K37k18LK07m01J14J98J04j1p5Q3Q0k1l17
$$ 18 29 -82 41 -187 31 -9 -193 251 -101 136 -82 -79 128 -273 -159 39 143 132 57 140 220 199 -118
4285a18J2nP7j57K54k17M23l84m0k8J89J83k36N0j04J0n5k2L22J44l97P0J50k74
$$ -118 -106 -111 -34 -191 63 -154 269 -115 -155 -183 6 189 -47 3 -101 -91 -146 -168 154 298 -99 -29 121 -153
4309a53O3o7K86pq9qp7Q8L0j70k47Q2M03j77j09M96l56m4k74K09K66j09l34K74
$$ -153 -90 -157 129 122 33 25 -52 36 66 -104 -351 -269 134 -43 -152 344 -12 -56 -330 -121 145 36 -298 -24
4333b4J25k31J4K21q5rm2%n9LP0k51K40mn9J26j2n9l7J87J30k83R7j00J17K97
$$ -24 101 -130 -116 105 20 11 -31 -31 -90 -87 -17 -268 -28 -32 -91 35 23 -36 -73 114 244 -39 58 -42 75 372
4359C72m28M7L19l28Mq1L17n0k17l80L58o4J05j79P3J18J3n7j05K23l6O9p2R9
$$ 372 -56 -9 310 -18 -14 -95 222 172 -45 -425 -67 -131 -26 -205 -132 -14 -1 -58 -163 60 24 93 21 120
4383A20p9K9q1L1P9J02j66r8J31m4k7j71M48l82k7l6P4K78l65o5O9M7nj56K66
$$ 120 41 70 -11 20 99 201 35 -63 68 24 -3 -174 274 -108 -135 -171 -97 181 -184 -249 -180 -133 -138 -294 -28
4408b8J48l7J78j55L53m38j93J21M33j81J05l21o6L45n3m30K93Q5k45j91K8K56
$$ -28 120 83 261 106 459 21 -172 -51 382 201 306 -15 -81 264 211 -219 74 159 -86 -277 -249 7
4430Gj49K46l88L16R6k13o4J61J92J24l48R0P0j02j48O16l18r9J21l02r9N7J09
$$ 7 -142 104 -284 32 128 -85 -149 12 204 328 -20 70 140 38 -110 506 188 89 210 -92 -191 -134 -25
4453b5l21L91j51Pr7J20K66l99J94J3j5J43j12J07o4j79K45J48k65N0j52J04j30
$$ -25 -346 45 -106 -99 -196 -76 190 -209 -15 -2 -17 126 14 121 57 -122 123 271 6 56 -96 8 -122
4476a22J92l29J46MK66q0l92J01L26q0j53R3r2j34K35O8j2R9N5j39J1k1n1j06
$$ -122 70 -259 -113 -109 157 77 -315 -214 112 32 -121 -28 -120 -254 -19 49 37 136 191 52 63 42 -9 -115
4500a15P4K53j55j87k02L4K54K91n43J57L38k07j05J68J35l16K85k1p4P4k06K70
$$ -115 -41 212 57 -130 -332 -298 -44 247 -296 -139 199 -8 -113 55 190 -126 159 138 64 138 -68 202
4522B02o7r3j99M56k12j21O0J57j28q1k66J56qK40m15j53N13k07K59l7N9J54j79
$$ 202 135 42 -157 299 87 -34 26 183 55 -26 -292 -136 -144 96 -319 -472 41 -166 93 56 115 269 90
4545I0p9j70M49j99O3M4p3J5j90q0L47P6m73K45o0K12m22J76O9o0M8k65o2L27
$$ 90 11 -159 290 91 154 198 125 140 -50 -130 217 293 -180 65 5 217 -205 -29 40 -20 28 -237 -299 28
4569B8p2K39J04k18Q6k10j95j46O69m3k69K46j48l86K49L42l21K32j92j68j45
$$ 28 -44 195 299 81 167 -43 -238 -384 285 242 -27 219 71 -315 -66 276 -45 187 -5 -173 -318
4590c18K44M2l7p1r9M01m21J10L15L8j63k55L90j63K6oj20J74O2k29p6L78k30
$$ -318 -74 -32 -69 -140 -239 162 -259 -149 166 204 41 -214 176 13 39 33 -87 87 149 -80 -156 222 -8
4613hR8J35l2m44P8q9L52j73j5J68r4kJ13j10R5R4k45J36k32K30j28L13j77q3
$$ -8 90 225 193 -251 -173 -262 90 -83 -98 70 -24 -26 87 -23 72 166 -79 57 -175 55 -73 240 63 -20
4637b0N0q9mK59k83L0J65L4l03Q8j27K84j84Q1N8J29j77r7o2R7J43j02J83k08
$$ -20 30 -59 -63 196 -87 -57 108 142 -161 -73 -200 84 -100 -19 39 168 -9 -106 -168 -71 72 -30 153 -55
4661e5J65k6K5K01j04k63P9J7k3L7m7k3j22K01Rk71J12J41j26N7k42J43Q0j36
$$ -55 110 84 109 310 206 -57 22 39 16 53 6 -17 -139 62 71 -200 -88 53 -73 -16 -258 -115 -35 -171
4685a71Q8K30k15qK40j36j6p6J47k65K50k84k2K89O6l76q7R8L51o4j60J93q1N8
$$ -171 -83 147 -68 -76 164 28 12 -64 83 -182 68 -216 -238 51 117 -259 -346 -248 103 39 -121 72 -9 49
4709D9k35J07K5p5J89k90J94J45K1l5R3O7k07j04r4K69m1j69p8N51k98k60K17
$$ 49 -186 -79 -54 -129 60 -230 -36 109 130 95 188 255 48 -56 -150 119 78 -91 -169 382 84 -176 41
4732D1M2O4m15L56l17L25M9k74L67o3j78r9P0MO23q21p7N16O3m11J79N0j70j60
$$ 41 83 147 -268 88 -229 96 145 -129 238 175 -3 -102 -32 -28 595 -226 -303 213 276 -135 44 94 -76 -236
4756b36J40J22J0j41P2N4j43L67l84P2J96j64K48l85J04K2K50l52J93j65N2K04
$$ -236 -96 26 36 -105 -33 21 -122 245 -139 -67 129 -35 213 -172 -68 -46 204 -148 45 -120 -68 136
4778A36j81K92q4m10pL98k35j26P6M20k94j58R8K35J7k34o7K74j68M6P8lk3j70
$$ 136 -45 247 163 -247 -254 144 -91 -217 -141 279 -15 -173 -75 160 177 -57 -124 150 -18 28 106 103 80 -90
4802i0j96L67k24M93l96j3LK43p0r7k75N3L52n1K0j33q0M1J8L5K20k54R5Q2j04
$$ -90 -286 81 -143 350 -46 -59 -56 187 117 20 -255 -202 150 99 119 -14 -94 -53 -35 0 220 -34 61 143 39
4827C9l0j8r4N5J08M4l49N35m85L79j18k54J40LJ3M2k50K91p5J38k24M3J8L57
$$ 39 9 -9 -103 -48 60 104 -245 290 -195 184 66 -188 -48 -45 -32 10 -240 51 -24 114 -110 -67 -49 308
4851C08N8j55l60r6M43k32o2J70k38J01J71j66K58k32j89K47j30K43j64k89K11
$$ 308 366 211 -149 -245 198 -34 -96 74 -164 -63 108 -58 200 -32 -221 26 -104 139 -25 -314 -103
4872a03O3K18l57j25K13J46k46L18P5J65l97J32j45k1o2K73j37n5J02j51p0J30
$$ -103 -40 178 -179 -304 -91 55 -191 127 202 367 -30 102 -43 -64 -126 147 10 -45 57 -94 -164 -34
4894c4m3J42j23J68l61K00j11K11l9j55Q7j3L9J3j23L04j65M2J34j50j82K20l39
$$ -34 -77 65 -58 110 -251 -51 -162 49 10 -145 -58 -71 -32 -19 -142 162 -3 39 173 23 -159 61 -278
4917b78J88j27J85J9j22m2J31m7%j36J09K68p4j53J62M7k39O7M5NMN7j62R9pQ8
$$ -278 -90 -217 -32 -13 -135 -177 -46 -93 -93 -229 -120 148 74 -79 83 130 -109 -42 3 8 12 69 -93 6 -1 87
4943H7JR6j93j87J72r2j4j39Q9j5K50q9o9n7K68O9n8J77m11M8J79K26o38L74o
$$ 87 88 184 -9 -196 -24 -116 -130 -269 -180 -195 55 -34 -103 -160 108 177 119 296 -115 -67 112 338 -300 74 68
4968F8J5J53k28N4M0j03J17j35R7q0L9r5K87l11Qq1n1M19m0p0m0q4k04K28J21
$$ 68 83 236 8 62 102 -1 116 -19 78 -2 37 -58 229 -82 -74 -155 -206 213 173 103 63 -21 -225 3 124
4993A24j6k44L91l79O0K91k44j49K26j83K89j60j55K23k64J25J71J8l09K67l50
$$ 124 108 -136 255 -124 -64 227 -17 -166 60 -123 166 6 -149 74 -190 -65 106 124 -185 82 -268
5014b68L61N1q0k92L12k64L35p1j96R9mr2l6J41P3jj62j78J70p4K1J46L25m10
$$ -268 93 144 64 -228 84 -180 155 84 -112 -13 -17 -109 -145 -4 69 68 -94 -272 -102 -176 -155 -9 316 -94
5038i4R3K06j35j77J4K54l04K33j42m2J15K2J01M5rk64j4J3j71J86J05l42L84
$$ -94 -1 205 70 -107 -93 161 -143 90 -52 -94 21 43 144 189 180 -84 -98 -85 -256 -70 35 -307 77
5061G7P4J6j42J49k86L18j90j10K89m02L02j98k34L37oR5r0j15K34j22o9K92k35
$$ 77 151 167 25 174 -112 206 16 -94 195 -207 95 -103 -337 0 -6 89 -1 -116 118 -4 -73 219 -16
5084a6j98L10Q7k27K3o5k07M95l66J39O7kj10K41k78J55k81K57k22K20N9M2k71
$$ -16 -214 96 183 -44 -21 -86 -293 202 -164 -25 42 40 -70 171 -107 48 -233 24 -198 22 81 123 -148
5107a48L18l07J41k72L91j53N2l5J43M6r3k6j1J3j57L68k59K54k38j18p1L9K14
$$ -148 170 -137 4 -268 123 -30 22 -13 130 176 83 57 46 59 -98 270 11 265 27 -91 -162 -123 91
5130I1k05J11Q3N9k41j0M2K40L6k78N2o2J29r3J9mj1J98k55Q3q7J73J4j38k9R2
$$ 91 -114 -3 80 139 -102 -112 -70 170 206 -72 -20 -82 47 -46 -27 -31 -42 156 -99 -16 -103 70 84 -54 -83 9
5156IJ35pl30J39%J44o1m1n7j90L23m8j0pM3n7j50K73l01j6M20k09J95l72Q6N4
$$ 9 144 137 -193 -54 -54 90 29 -12 -69 -259 64 16 6 -1 42 -15 -165 108 -193 -209 211 2 197 -175 -89 -35
5182c5j42R1K86O8m91J21Q4j5M8k08J15K84j97L4j69J8m9J72L6J63k43o8K02l9
$$ -35 -177 -86 200 268 -223 -102 -18 -33 15 -193 -78 206 9 43 -126 -108 -157 15 51 214 -29 -97 105 66
5206F6J80k35j30L01j75O9j88O4K4R0j51k76M79q5J96j94L1j80P7N5K08m13J45
$$ 66 246 11 -119 182 7 76 -112 -48 -24 66 -85 -361 118 33 229 35 66 -114 -37 18 226 -187 -42
$$ [...]
8191A43
##END NTUPLES=NMR FID
##END=
