##TITLE=1H_LR-768-C1
 CDCl3
 8 sc, 
 6.7.2023
##JCAMPDX= 6.0         $$ Bruker NMR JCAMP-DX V2.0
##DATA TYPE= NMR FID
##DATA CLASS= NTUPLES
##ORIGIN= UXNMR, Bruker Analytische Messtechnik GmbH
##OWNER= root
$$ XWIN-NMR		Version 3.5
$$ Thu Jul  6 13:59:20 2023 Russian Standard Time (UT+4h)  she@DPX200
##.OBSERVE FREQUENCY= 200.13135
##.OBSERVE NUCLEUS= ^1H
##.DELAY= (6, 6)
##.ACQUISITION MODE= SIMULTANEOUS
##.ACQUISITION SCHEME= undefined
##.AVERAGES= 8
##.DIGITISER RES= 18
##SPECTROMETER/DATA SYSTEM= spect
##.PULSE SEQUENCE= zg30
##.SOLVENT NAME= CDCl3
##.SHIFT REFERENCE= (INTERNAL, CDCl3, 0, 15.7039)
##AUDIT TRAIL= $$ (NUMBER, WHEN, WHO, WHERE, WHAT)
$$ ##TITLE= Audit trail, XWIN-NMR		Version 3.5
$$ ##JCAMPDX= 5.01
$$ ##ORIGIN= Bruker BioSpin GmbH
$$ ##OWNER= she
$$ F:/spectra/data/she/nmr/H-F/1/audita.txt
$$ ##AUDIT TRAIL=  $$ (NUMBER, WHEN, WHO, WHERE, WHAT)
(   1,<2023-07-06 13:58:11.89 +0400>,<she>,<DPX200>,
      <created by zg, POWCHK disabled, PULCHK disabled
       configuration hash MD5:
       00 E9 B6 7A A2 85 ED C7 34 08 36 98 17 FE 4E 26
       data hash MD5: 16K
       27 79 68 EB 17 CA F3 3D 68 90 F9 23 FE 6A D0 8A>)
$$ ##END=
$$ 
$$ hash MD5
$$ 5E 2F 20 CC 95 E5 5A 8D 7E 1D A2 F7 DB 41 F0 95
##$RELAX= 
##$RELAX= 
##$RELAX= 
##$RELAX= 
##$RELAX= 
##$RELAX= 
$$ Bruker specific parameters
$$ --------------------------
##$DU= <F:/spectra>
##$EXPNO= 1
##$NAME= <H-F>
##$PROCNO= 1
##$TYPE= <nmr>
##$USER= <she>
##$AMP= (0..31)
100 100 100 100 100 100 100 100 100 100 100 100 100 100 100 100 100 100 
100 100 100 100 100 100 100 100 100 100 100 100 100 100 
##$AQSEQ= 0
##$AQ_mod= 1
##$AUNM= <au_zg>
##$AUTOPOS= <>
##$BF1= 200.13
##$BF2= 200.13
##$BF3= 200.13
##$BF4= 200.13
##$BF5= 200.13
##$BF6= 200.13
##$BF7= 200.13
##$BF8= 200.13
##$BYTORDA= 1
##$CFDGTYP= 0
##$CFRGTYP= 5
##$CHEMSTR= <none>
##$CNST= (0..31)
1 1 145 1 1 1 1 1 1 1 1 1 1 1 1 1 1 1 1 1 1 1 1 1 1 1 1 1 1 1 1 1 
##$CPDPRG= <>
##$CPDPRG1= <>
##$CPDPRG2= <>
##$CPDPRG3= <>
##$CPDPRG4= <mlev>
##$CPDPRG5= <mlev>
##$CPDPRG6= <mlev>
##$CPDPRG7= <mlev>
##$CPDPRG8= <mlev>
##$CPDPRGB= <>
##$CPDPRGT= <>
##$D= (0..31)
0 1.2 0 0 0 0 0 0 0 0.06 0 0.03 0 0 0 0 0.0002 0 0 0 0 0 0 0 0 0 0 0 0 
0 0 0 
##$DATE= 1688637491
##$DBL= (0..7)
120 120 120 120 120 120 120 120 
##$DBP= (0..7)
150 150 150 150 150 150 150 150 
##$DBP07= 0
##$DBPNAM0= <>
##$DBPNAM1= <>
##$DBPNAM2= <>
##$DBPNAM3= <>
##$DBPNAM4= <>
##$DBPNAM5= <>
##$DBPNAM6= <>
##$DBPNAM7= <>
##$DBPOAL= (0..7)
0.5 0.5 0.5 0.5 0.5 0.5 0.5 0.5 
##$DBPOFFS= (0..7)
0 0 0 0 0 0 0 0 
##$DE= 6
##$DECBNUC= <off>
##$DECIM= 32
##$DECNUC= <off>
##$DECSTAT= 4
##$DIGMOD= 1
##$DIGTYP= 9
##$DL= (0..7)
0 120 120 120 120 120 120 120 
##$DP= (0..7)
150 150 150 150 150 150 150 150 
##$DP07= 0
##$DPNAME0= <>
##$DPNAME1= <>
##$DPNAME2= <>
##$DPNAME3= <>
##$DPNAME4= <>
##$DPNAME5= <>
##$DPNAME6= <>
##$DPNAME7= <>
##$DPOAL= (0..7)
0.5 0.5 0.5 0.5 0.5 0.5 0.5 0.5 
##$DPOFFS= (0..7)
0 0 0 0 0 0 0 0 
##$DQDMODE= 0
##$DR= 18
##$DS= 0
##$DSLIST= <SSSSSSSSSSSSSSS>
$$ [...]
##$SUBNAM2= <"">
##$SUBNAM3= <"">
##$SUBNAM4= <"">
##$SUBNAM5= <"">
##$SUBNAM6= <"">
##$SUBNAM7= <"">
##$SUBNAM8= <"">
##$SUBNAM9= <"">
##$SW= 18.05172834244
##$SWIBOX= (0..15)
0 0 2 0 0 0 0 0 0 0 0 0 0 0 0 0 
##$SW_h= 3612.71676300578
##$TD= 16384
##$TD0= 1
##$TE= 0
##$TE2= 300
##$TE3= 300
##$TEG= 300
##$TL= (0..7)
0 120 120 120 120 120 120 120 
##$TP= (0..7)
150 150 150 150 150 150 150 150 
##$TP07= 0
##$TPNAME0= <>
##$TPNAME1= <>
##$TPNAME2= <>
##$TPNAME3= <>
##$TPNAME4= <>
##$TPNAME5= <>
##$TPNAME6= <>
##$TPNAME7= <>
##$TPOAL= (0..7)
0.5 0.5 0.5 0.5 0.5 0.5 0.5 0.5 
##$TPOFFS= (0..7)
0 0 0 0 0 0 0 0 
##$TUNHIN= 0
##$TUNHOUT= 0
##$TUNXOUT= 0
##$USERA1= <user>
##$USERA2= <user>
##$USERA3= <user>
##$USERA4= <user>
##$USERA5= <user>
##$V9= 5
##$VALIST= <valist>
##$VCLIST= <CCCCCCCCCCCCCCC>
##$VD= 0
##$VDLIST= <DDDDDDDDDDDDDDD>
##$VPLIST= <PPPPPPPPPPPPPPP>
##$VTLIST= <TTTTTTTTTTTTTTT>
##$WBST= 1024
##$WBSW= 4
##$XGAIN= (0..3)
0 0 0 0 
##$XL= 0
##$YL= 0
##$YMAX_a= 203844
##$YMIN_a= -247483
##$ZGOPTNS= <>
##$ZL1= 120
##$ZL2= 120
##$ZL3= 120
##$ZL4= 120
##$ABSF1= 10
##$ABSF2= 0
##$ABSG= 5
##$ABSL= 3
##$ALPHA= 0
##$AQORDER= 0
##$ASSFAC= 0
##$ASSFACI= 0
##$ASSFACX= 0
##$ASSWID= 0
##$AUNMP= <proc_1d>
##$AZFE= 0.1
##$AZFW= 0.1
##$BCFW= 1
##$BC_mod= 2
##$BYTORDP= 1
##$COROFFS= 0
##$CY= 11.3945322036743
##$DATMOD= 1
##$DC= 2
##$DFILT= <>
##$DTYPP= 0
##$F1P= 15.7292609196834
##$F2P= 12.9074282941183
##$FCOR= 0.5
##$FTSIZE= 0
##$FT_mod= 4
##$GAMMA= 1
##$GB= 0.15
##$INTBC= 1
##$INTSCL= 1
##$ISEN= 128
##$LB= 0.24
##$LEV0= 0
##$LPBIN= 0
##$MAXI= 10000
##$MC2= 0
##$MEAN= 0
##$ME_mod= 0
##$MI= 1.114404
##$NCOEF= 0
##$NC_proc= 0
##$NLEV= 6
##$NOISF1= 3.799351
##$NOISF2= 2.8
##$NSP= 1
##$NTH_PI= 0
##$NZP= 0
##$OFFSET= 15.70392
##$PC= 1
##$PHC0= -20632.66
##$PHC1= 13.65272
##$PH_mod= 1
##$PKNL= yes
##$PPARMOD= 0
##$PSCAL= 0
##$PSIGN= 0
##$REVERSE= no
##$SF= 200.130013532006
##$SI= 16384
##$SIGF1= 3
##$SIGF2= 2
##$SINO= 400
##$SIOLD= 16384
##$SREGLST= <1H.CDCl3>
##$SSB= 0
##$STSI= 0
##$STSR= 0
##$SW_p= 3612.71676300578
##$SYMM= 0
##$S_DEV= 0
##$TDeff= 0
##$TDoff= 0
##$TI= <>
##$TILT= no
##$TM1= 0
##$TM2= 0
##$TOPLEV= 0
##$USERP1= <user>
##$USERP2= <user>
##$USERP3= <user>
##$USERP4= <user>
##$USERP5= <user>
##$WDW= 1
##$XDIM= 8192
##$YMAX_p= 0
##$YMIN_p= 0
$$ End of Bruker specific parameters
$$ ---------------------------------
##NTUPLES= NMR FID
##VAR_NAME=  TIME,          FID/REAL,        FID/IMAG
##SYMBOL=    X,             R,               I
##VAR_TYPE=  INDEPENDENT,   DEPENDENT,       DEPENDENT
##VAR_FORM=  AFFN,          ASDF,            ASDF
##VAR_DIM=   8192,          8192,            8192
##UNITS=     SECONDS,       ARBITRARY UNITS, ARBITRARY UNITS
##FACTOR=    0.0002768,     1,               1
##FIRST=     0,             0,               0
##LAST=      2.2672688,     0,               0
##MIN=       0,             -247483,         0
##MAX=       2.2672688,     203844,          0
$$ Real data points
##PAGE= N=1
##DATA TABLE= (X++(R..R)), XYDATA
0@%%%%%%%%%%%%%%%%Lj1J6j6J6j6K1k9L2l5M3m8N4o5P4q2R4j07J19j35J52j69
38h9J86k08K32k55K83l14L48l84M23m67N15n66O23o87P57q35R24j024J139j273
58f72J428j614J839k118K475k949L612m599O218r310J7153p0743j32766J88696
72c350N4380o0198J21141R1871m7593L8544O693r1700l567l317j15336k7451M7248
85G365k4950k3036N304k6040N090q111o6849p910K3957m3931O733P4368L0020
98d7990M0923O3598J3900M1329M4090o3074l7890M7339k0987l0926M9114k921
110I6505l3371K0325n2692p7965L9360k0398j21726R411N5058n2543N084P1605
122f1347k440K0344N3549l6084j3229O8453o548l1830O3405N1239p946J1441J2009
$$ y = [0, 0, 0, 0, 0, 0, 0, 0, 0, 0, 0, 0, 0, 0, 0, 0, 0, 3, -8, 8, -8, 8, -8, 13, -16, 16, -19, 24, -24, 30, -35, 39, -43, 51, -56, 63, -72, 80, -89, 97, -111, 121, -134, 149, -165, 183, -201, 222, -245, 270, -296, 327, -360, 397, -438, 486, -538, 601, -672, 756, -858, 981, -1137, 1338, -1611, 2001, -2598, 3620, -5690, 11463, -59280, -192046, -3350, 51030, -9168, 111973, 203844, 156251, 194795, 201488, 109788, 106221, 102904, -12432, -39883, 7365, -17585, -40621, -35317, -61357, -56267, -64378, -131227, -139137, -115180, -159111, -152378, -78010, -47990, -7067, 56531, 70431, 111760, 155850, 92776, 54886, 102225, 81238, 50312, 99426, 96505, 63134, 83459, 30767, -47198, -7838, -28236, -149962, -140551, -85493, -138036, -132952, -61347, -63787, -43443, 10106, -25978, -39207, 29246, 22698, -9132, 54273, 105512, 97566, 109007, 121016]
135A21016q083j0668n0006n0290M345j5316m1607N208J0263j6958k421j3620j6376
148h4513K6884N64l8555K2991M4755p034J2202M5118K0476K1740J4725k5503M389
161E8239K7364l4517k7599L8418M268l7412n062m721k3491j0086k8283l3346J6073
174f0155R615k7912Q630L7051J964p879J0573J6422J7143L201r885J8925L0430
187D8123l235l781K0275P350j0290j5535j9377l492j43k8032j7174J8868J261
200e182k6393j0525J426n507n651o755M833K7588J4301p579J5872L1801K239j2134
214A8334L730R828M114o137p237J1587J4679j2961j6936M437m78k4207k6793q077
228c6117L337l210j0829M962K1941P819j1246p95J2255M494p154k096J5499K2250
$$ y = [121016, 112933, 102265, 52259, 1969, 6314, -9002, -50609, -45401, -35138, -52096, -54517, -68137, -84513, -57629, -57065, -95620, -72629, -27874, -34908, -22706, 22412, 42888, 64628, 79353, 53850, 58239, 85603, 51086, 23487, 61905, 66173, 28761, 23699, 18978, -4513, -14599, -42882, -76228, -60155, -50540, -78452, -69822, -32771, -30807, -38686, -28113, -11691, 5452, 8653, -1232, 17693, 48123, 44888, 41107, 61382, 68732, 58442, 42907, 23530, 20038, 19895, -8137, -25311, -6443, -5182, -31575, -42100, -40674, -46181, -51832, -58587, -53754, -26166, -11865, -19444, -3572, 28229, 30468, 18334, 22064, 31892, 36006, 29869, 22632, 34219, 48898, 35937, 19001, 23438, 22960, -1247, -28040, -36117, -32780, -35990, -46819, -41857, -19916, -12097, -23343, -24138, -11883, -7389, -14543, -16639, -1140, 21110]
242B1110N753k255J3401J6669p978k0966q282J30j0107j8450n589J4142Q937r935
256c420q309O472n87k1434j8530L250J1334J544J454J7971K6200Q763p541r71
270A6196Q577k938j7611p280J3477J0379n931j932J2839P672j3818k0915o742
283h027o95j3024j7515M762J8902P868l759M768J2395O1j4829j0784N898Q861
297e118k055k36J7319J9646J338r383k97M302r723k0764q801R326M471q294M63
312g806J6070Q428j2332j3907R98J005j4002j2083R133J7843M723j281R069J3212
326A9070j005j4443q641O038L347r546k286J5939J2483n216p118M407L551j1091
340E489j6868k842Q404J2q828L301J6342N161j1270n954N825O67j3044q129R444
$$ y = [21110, 26863, 24608, 38009, 54678, 46700, 25734, 17452, 17582, 7475, -10975, -16564, -2422, 6515, -3420, -11729, -5257, -5844, -27278, -45808, -42558, -31224, -29680, -28226, -10255, 15945, 24708, 17167, 16196, 24773, 21835, 4224, -3056, 10421, 20800, 14869, 12937, 25776, 33448, 19630, -1285, -8027, -8722, -21746, -39261, -34499, -15597, -7729, -11488, -6720, 5675, 5736, -9093, -19877, -13979, -5118, -7173, -7409, 9910, 29556, 30894, 21511, 21214, 25516, 15793, -4971, -13772, -4446, 25, -8269, -7806, 8264, 16692, 4360, -9547, -8549, -7544, -21546, -33629, -24496, -6653, -1930, -3211, 5858, 19070, 18065, 3622, -5019, 1019, 4366, -5180, -7466, 8473, 20956, 15740, 8622, 13029, 16580, 5489, -11379, -14221, -5817, -5805, -14633, -11332, 5010, 10171, -1099, -7053, -1228, -561, -13605, -21734, -12290]
355a2290J3262k92l614R855J2349m198j3406k384Q238j515j1050o42J4001N704
369A4018q892m974P225L771j1647j1523L627P130n773q662N132J1771m27r078
383h302L8R353J152r916l055J1671Q286n533l603R157P770p276r659K552P520
398A0155k064r933n7R860J83j3002n453P534J521j0983n235R793P580n111o243
413a1455O288R532l113j0199L479J2619Q58q452L585J3115J691q587l861M833
427A0333O21j1285r597M411Q175l991p939M646Q885n527j2805j213O994j663p183
442a7138K585J3452R700j307k675P202P166q836j2676M596R070n518o875P193
456E939R698j350r966o937J580j532j4881r780J0313R332n159n06J3704Q178n770
$$ y = [-12290, 972, 680, -2934, 6921, 19270, 15072, 1666, -718, 7520, 6005, -5045, -5687, 8314, 14018, 5126, 152, 7377, 11148, -499, -12022, -8395, -1265, -7038, -15700, -10568, 1203, 776, -8302, -8264, 1089, 2241, -7675, -10730, 941, 9227, 3694, 91, 9248, 17018, 9742, 83, 2635, 10155, 8091, -1842, -1899, 7961, 8144, -4858, -10311, -2777, -1256, -12239, -17474, -7681, -101, -5212, -11455, -5167, 4365, 1252, -8947, -5468, 7151, 8009, -443, 3142, 16257, 17948, 9361, 5500, 10333, 10954, -331, -9928, -5517, 2658, -1333, -9272, -4626, 4259, -1268, -14073, -15286, -8292, -9955, -17138, -14553, -1101, 8599, 7292, 4617, 11819, 18985, 10149, -2527, 2069, 11139, 5621, -1254, 5939, 15637, 14287, 4321, -2616, -1036, -2568, -17449, -27229, -16916, -7584, -12743, -13249, 455, 8633, 2863]
471B863p105J297N450q08p474K621J5367P338m658J69Q440j480j5518j2996M92
486f002J437p188n489O772R773K40o660j700N243k219j4062m156J3676R157k754
501c932M951J5312Q041m047o785q78K921p169j3936J111J4032k72r771K783P555
516I916m540j4242j0171P18J848p219k877J3503J3647q70k739Q150Q554k778j0790
531A10j709R617K406n584M961J2813J588q495o136j453k313j0892j4697m88J0324
546i948j089o662O833R879l684q990l97N954L173m416j70J3002J2118k245k321
561A1037P993O823o963j0992r07M386o352j1354J724R468j595r153l893J533l16
576h561q834q470O965J0438m284j930J4243R685m030j603K829M433L153l337l865
$$ y = [2863, -4242, -2945, 2505, 1697, -5777, -3156, 12211, 19549, 14891, 15060, 23500, 22020, 6502, -6494, -6002, -4565, -11753, -17242, -10470, -697, -457, -7117, -8817, -3574, -5793, -19855, -24011, -10335, -1178, -3932, 1019, 16331, 24372, 20325, 13540, 12662, 15583, 8414, -5522, -4411, 9621, 9349, -422, 2361, 9916, 5376, -8866, -19037, -18319, -16471, -23690, -26567, -13064, 583, -287, -3026, 5124, 13678, 10900, 110, -1599, 8018, 10424, 4840, 9801, 22614, 24202, 15707, 9571, 8118, 5805, -5087, -19784, -20272, -9948, -11037, -17699, -10866, -987, -4671, -13661, -14058, -8104, -4931, -9347, -9517, 3485, 15603, 13358, 11037, 19030, 25853, 18890, 7898, 6991, 11377, 5025, -6329, -4605, 4863, 3268, -5885, -9778, -8245, -8561, -17395, -25865, -18900, -8462, -12746, -14676, -433, 9252, 5222, 3619, 6448, 10881, 14034, 10697, 6832]
591F832Q163N173j1441n939R445J300j2526p057J242j117n708o030K22P228K542
606g671o955L16J0965L074q994N65J3125N913n392J099Q167K374m427l702M74
621H931M381j159j0849k501Q691l598j5559j512P777m118o299K360L266K509L17
636g363l436L880J1853r97r215N498J1514k806m789O009O773j309m476l574j29
651G433j27q719r952L926P841n901p202N847O176p014o089L045L728n30j579J914
667g203Q940Q546k581l311R008N924r852p058M923M91o947k452L800M106j60o282
683a08n638K099o94j1393n112Q755N093l917K444J0357N175k794k927J692L314
698F346n51n628J60R890L151o856J219P243k231j1127n681K9j689n574m182M165
$$ y = [6832, 14995, 20168, 8727, 2788, 12233, 13533, 1007, -6050, -4808, -5925, -11633, -17663, -17441, -10213, -7671, -14626, -14310, -3345, -271, -9265, -8700, 4425, 10338, 4946, 6045, 14212, 16586, 12159, 8457, 8931, 13312, 12153, 1304, -1197, 7494, 3896, -11663, -13175, -5398, -9516, -15815, -13455, -10189, -7680, -7363, -10799, -6919, 4934, 3937, -5278, 220, 11734, 8928, 4139, 10148, 16921, 15612, 11136, 7562, 7433, 7306, -1413, -11365, -7439, 402, -5499, -12701, -6854, -678, -7692, -13781, -10736, -7008, -7538, -9117, -7203, 1737, 10283, 7702, 4391, 13399, 19323, 9471, 2413, 7336, 7827, 880, -1572, 2228, 6334, 6174, -108, -5746, -3647, -4341, -15734, -20846, -12091, -6998, -10915, -8471, 1886, 7061, 4267, 1340, 3032, 6346, 5795, 167, 327, 10217, 13368, 6512, 7731, 14974, 12743, 1616, -4065, -4036, -5725, -11299, -15481, -11316]
714a1316Q720N16n249L046O450m104q966J609P566J441j378L876Q995N507l578
729A3135m618J594J346q106q357J586N873k445n011K510O634k323q009l331K151
744g371p82n073j751P505R196q75j483O811O323n011o928J263M005j509m391J441
760A370P578K820o359l834L722j050r603o031L460L072k756k763M807P389o97
775A125n856J383N677j617n990K17O649M044k337j141O515M318n549o576J210
790B072K615n096n732J446O496O54o211m55O174k46q394k152N415K218l826k004
806g026N806O224k126m924M064N790l358o161Q02N222o34n002k06N517K604o093
822D99l798M918J862n790m269L611M258k290m292J974N950p20n926M81O377N43
$$ y = [-11316, -2596, -2080, -7329, -4283, 2167, -1937, -10903, -9294, -1728, -287, -1665, 2211, 11206, 16713, 13135, 8517, 10111, 11457, 3351, -5006, -3420, 2453, 8, -5003, -2493, 4141, 1818, -6191, -9522, -7371, -8153, -13226, -14977, -7472, 1724, 849, -634, 6177, 12500, 7489, 561, 1824, 5829, 4320, -71, 1370, 8948, 11768, 5409, 1575, 5297, 4247, -5356, -11387, -7927, -4855, -7611, -10374, -5567, 1822, 1125, -4731, -3348, 2329, 712, -5278, -5061, 1588, 5632, 3295, 2154, 8669, 12987, 7438, 862, 2072, 4687, -409, -6141, -4695, 1801, 2455, -3756, -4211, 1963, 1717, -6677, -8829, -3414, -1196, -5022, -7026, -1220, 5004, 2878, -2046, 2018, 7808, 4450, -1711, -909, 4313, 3679, -1323, -1529, 3988, 6592, 499, -3299, 1619, 3481, -2309, -6578, -2967, 1291, -999, -5291, -3317, 2633, 1913, -4013, -3532, 2845, 3388]
838C388n562j850N118K301m377k939M740N144k890m769K797M766l266n900J47
853c152N589M57n722q37O320J879n739k377M898J873m739m678K722M446k174m114
869e348L178O706n85n286K41M034m85n388j627N258L856k883j823M234L958m434
885C606n425N44L350k612n589J034N837J373m422j026N455J320o117m001L744
900b929K821l152k672N362P206q76l757J233M388k773p410j081M887J375m454
915a832m91N838K286m907m294J596J329m367m894K474N957J48k486K453O735K49
931E794n052j649L473L99m418j216M858N067j488l534J971L388m418q134j124
946f083L851j573m838J538O362K184l404k156L537K863m675m537M178O024j818
$$ y = [3388, -2174, -4024, 1094, 3395, -982, -3921, 819, 5963, 3073, -1696, 1101, 5867, 2601, -3299, -3152, 2437, 2894, -2828, -3665, 2655, 4534, -1205, -3582, 1316, 3189, -1550, -6228, -3506, 940, -1234, -5348, -2170, 4536, 3951, -1335, -1094, 2940, 2455, -2933, -4560, 698, 4554, 1671, -152, 4082, 8040, 3606, -1819, -1275, 2075, -537, -6126, -5092, 745, 2118, -2304, -3330, 2125, 3445, -2672, -6673, -2929, -108, -3260, -5932, -570, 6636, 5760, 2003, 3236, 7624, 4851, -2559, -3640, 1247, 2622, -1832, -2323, 3515, 5801, 894, -3400, -1804, -475, -4842, -9736, -7262, -1305, -1157, -3643, -1190, 5545, 5794, 742, -907, 2566, 2965, -1453, -2669, 2189, 7256, 5768, 2234, 4205, 7593, 3175, -4959, -6083, -2232, -3805, -8643, -7105, -743, 1441, -1963, -4119, -582, 2281, -2394, -6931, -2753, 3271, 1453]
961A453k049M974O221j588m311o86K202j697o758l505M236L245l940k450M403
976b50K265n388m885K011K385k280k188K355O252L095j725m62N835K716n335l293
992A108M028J619m670k137L730K675j778m598j160K301j661q277k784N874J079
1007d651n361J338P657J531l058m15L584K783n77l138K087N915J81m542K306N497
1023A1137k426o093p92J772j735n291l328J212K008j854l757K596M917k507n191
1038i332K788N571j074k362L037N752J986j107j15K837L409l233n226K794K696
1053H421n529n575K662J971l749l692n4J896p28l941k421L812L174l971o85P515
1069h94M851k574k30M322K635j661k383J003L439o47m504j208M104J88o688k552
$$ y = [1453, -596, 4378, 10599, 9011, 4700, 4014, 6216, 4519, -2239, -5744, -1508, 1737, -2203, -4653, -250, 2015, -3373, -8258, -6247, -3862, -6142, -8330, -5975, 277, 3372, 1647, 1185, 7020, 9736, 4401, 1108, 5136, 6755, 2085, -52, 3678, 6353, 4575, -23, -1183, 1118, -543, -8820, -11604, -5730, -4651, -10012, -8674, -1017, 514, -2544, -2959, 625, 3408, 2831, -307, 1780, 7695, 7876, 3334, 5640, 11137, 8711, 2618, 1826, 3598, 1863, -3428, -6756, -5544, -3536, -5390, -9147, -6551, -1634, -4141, -9332, -6544, -973, -2047, -4409, -1372, 4380, 6366, 5259, 5144, 7981, 11390, 8157, 2931, 5725, 8421, 2892, -2683, -21, 1950, -1799, -5491, -5545, -3649, -4377, -8318, -10739, -6927, -3753, -7724, -8409, -894, 3957, 1383, 1153, 5475, 8110, 6449, 4066, 5069, 8508, 7861, 3357, 2149, 6253, 6441, -247, -2799]
1085b799K461p06n639l214J768K080j978j284L163N354R67l370Q10N629P82m102
1101g8R28N534K128k695k4L173P17m162m586q9J743l726n866K06L961j415l211
1118g462J173L914k59l610q87L899K492j799m65N317N021k28j787K006K429k482
1134G272n245o59K765j113m727p45L168L85l977l231J455J225l294l413K756M087
1150c291j20j740M250O066L30k847K53L183k37l553r02L408J713k147k617J884
1166C633J714m640o115O66J684k690l284J154L721Q82q79J50M267K288l124k242
1182b815M180L177k072r14L964L566j107l431o4J510k155o064k250L182L41m443
1198e395j215L939J326l364k098L000J821j947j905K850M582Q73j470J638N245
$$ y = [-2799, -338, -1044, -6683, -9897, -8129, -6049, -8027, -9311, -6148, -794, 173, -3197, -2387, 3242, 4024, -78, 850, 6384, 8512, 5817, 5793, 8966, 9683, 5521, 935, 846, 2589, -1137, -7003, -6797, -2836, -4251, -7462, -6289, -2375, -2634, -6244, -7131, -3232, -740, -2539, -3004, 2313, 7334, 7106, 5319, 7325, 9754, 7272, 2027, 1368, 4133, 3020, -1707, -2452, 716, 1101, -2876, -6107, -4652, -3427, -6721, -10134, -7378, -3291, -3411, -5151, -901, 5165, 5495, 2648, 2901, 6084, 5847, 2294, 1392, 4800, 6513, 4366, 1749, 3633, 5347, 707, -5408, -4742, -3058, -5748, -9032, -7878, -4157, -3275, -4154, -4004, 263, 2551, -573, -2815, 1365, 4542, 2470, 1556, 5520, 9086, 7979, 4548, 4484, 5994, 3839, -2225, -4475, -1293, -952, -5395, -6610, -2671, -1345, -4709, -6807, -3807, -1986, -3933, -5838, -2988, 1594, 2467, 997, 2635, 7880]
1213G880J116m515q41K811j194m505j305K423P93k224k823K96J922k256n092O9
1229g445L390q68k809K161M354J862j295L24L482K869k247l113K634L077k555
1244C821k791K473L070j728l863p64J908j956n116j887K646Q41k016j728L835
1259c255L342j919k537K601L681j753k096K118L739K11j261J54L421P66l422l019
1275G71K080L01m804k769K177J982k135j993J252L055j012m018n89M019M74l223
1291d432J045M955K473k037n45K789K519k908l668J280K254k080l327Q74L290
1306B482l64l454r81K633o41m307j687K942J833j799k56L618L038m90k928J037
1322F76K903j261l400P09L306K23k287l68K395J504l559k770J176J333l267l001
$$ y = [7880, 8996, 4481, 3640, 6451, 5257, 752, -553, 1870, 2663, 439, -2384, -2088, -166, -2422, -7514, -7445, -4055, -4923, -7732, -5571, -1217, 645, -650, -326, 3156, 6025, 3778, 665, 3299, 6376, 3821, 1030, 3503, 6573, 4845, 982, 218, 2126, 170, -4946, -6833, -4187, -3346, -5362, -7090, -3255, 87, -1832, -4369, -1768, 1913, 160, -1936, 182, 3921, 4132, 2871, 3025, 6446, 7212, 3790, 771, 2851, 3152, -1652, -4421, -2244, -262, -2397, -4390, -3138, -83, -1095, -5113, -5702, -1683, -1209, -4432, -3387, 1568, 4041, 2004, 1459, 4248, 6767, 3859, 191, 1471, 3725, 1645, -1682, -808, 2482, 2118, -1336, -2317, 316, -325, -4632, -6319, -3377, -1544, -3343, -3599, 19, 3057, 2567, -361, 676, 3579, 2318, -1082, -373, 2933, 3156, 869, 501, 2896, 4400, 841, -1929, -753, 580, -2687, -5688]
1338e688J830L340l39j678Q72L652L02l913o53L112R01l267M72L348K235j523
1354C003k408J709J799k758l836R10K469j519l228Q87L044O67k547p02K706Q64
1370A060k940j996K907K178j035j150K218L401n58l565L6K559j244l850k98K941
1386F64M57j836j395K604J554k815k706J692K464k216k637J809L264L18k065R35
1402I1L421K10l132j304K425M28k658j345K717K229j873k240J021K133k059l242
1418c178O3K558p0k516L31L092J475k188j005K663J308j912k477J019K358r41
1434E80j872J354L216k78k876n86J873l98l228j132K396J603j708j212K207K750
1450B689j792k803J197K304j459k699P74K856L29j768kK727P14k763j975J636
$$ y = [-5688, -3858, -518, -857, -2535, -1663, 1989, 2291, -1622, -2275, 837, 1738, -1529, -1057, 2291, 4526, 3003, 595, 2304, 4103, 1345, -2491, -1581, 888, -631, -3859, -2972, 72, 739, -1808, -2510, 196, 1060, -1880, -3876, -969, 1209, 174, -976, 1242, 4643, 4085, 520, 556, 3115, 1871, -1979, -2277, 664, 1121, -715, -2110, 494, 2048, -767, -3473, -1781, 683, -1533, -4170, -2361, 903, 1221, -844, 91, 3512, 3722, 590, -714, 1711, 2139, -519, -1864, 853, 3082, 1209, -1031, -10, 2123, 64, -3178, -3115, -557, -627, -3143, -2812, 280, 1755, -433, -1438, 1225, 2533, 621, -1856, -837, 1521, 580, -1292, 62, 3278, 3000, 124, -462, 1411, 1013, -2215, -3347, -951, 652, -1056, -2268, -61, 2689, 897, -1906, -709, 1595, 136, -2563, -1789, 1067, 1396, -372, -374, 2353, 3067, 304, -1671, -35]
1466c5J021k531j581J831L011q29j849J075K344r62k783p71K522K00j946o31K982
1483A068J962k090j517J967J291k577k908R65J764p14j854R83K843Q07k279j123
1499a412K471j16k546j359K421J899q88q48K000K092r14k706l3J617j025k943
1515b290l02K597Q46k265l51K231P08k303j673Q66J166o88j654J314L516Q04k098
1532D24O74K500o53l012n22K025K49j599q93J413K155j429k810O78J738k357k814
1549d233J056K208p48j403J230K469J166j120j459J762J464k120j718K329K362
1564C245j404j309K102J250j628k291p76O18O6k376j330K279J792k252j278K999
1580b93J384k450j449J388J821n93j142R03K539J479j792m57K540L4l725j452
$$ y = [-35, 986, -1545, -3126, -1295, 1716, 887, -962, 113, 2457, 1495, -1288, -2059, 463, 663, -1283, -1914, 1068, 3030, 940, -577, 1390, 2681, 104, -2804, -1839, -75, -789, -2643, -1660, 1183, 1990, -289, -1412, 1059, 943, -1603, -2962, -541, 1358, 470, -378, 1622, 3714, 2800, 94, 61, 1678, 653, -2290, -2592, 5, 851, -1414, -1765, 466, 1174, -1129, -2802, -1936, -770, -1458, -3112, -1798, 1718, 2522, 424, 1098, 3598, 2945, -67, -589, 1436, 1685, 86, -807, 606, 2761, 1332, -1478, -800, 938, -1419, -4233, -3177, -969, -1717, -3120, -1890, 579, 1745, 625, -834, 928, 2392, 272, -1446, 883, 3245, 1841, 532, 2634, 3884, 2256, -35, -811, -193, -127, -2503, -3833, -1554, 238, -2014, -3292, -293, 1091, -1359, -2808, -1420, 401, -192, -1334, -431, 2108, 3587, 1795, 1338, 3878, 3912, 187, -1265]
1596a265K585mk475o11J594J016r54j958K39J455n14l190N16L243K03j941P47
1613a314K933Q24j405r5J161Q26j043k249O84K321q84k863J388K265j471k780
1629a702m20J407q32j345j044K135J799r35j740K479K595j320j889J462K213j529
1645A334j552O77J894M20j451j100J949O45k768k319Q62J297k345j245J991J546
1661a65q73p46K68J740M51k118n31K625J308j917o9K484J461j806p62P33P39j795
1679A027k629J50J910n15k328L52K116L51k477j228K229O58k593l68K521K255
1695A431q27p56J592K083J9k455J37J380o24k356L2J985L89j865r51J322M32j988
1713a020k563P01J103r50j351J876K613L70j151L5J823N89k202n57K173R56j102
$$ y = [-1265, 1320, 1316, -1159, -1770, -176, 840, -114, -2072, -1833, -378, -892, -4082, -3566, -323, -120, -2061, -1314, 1619, 2443, 1038, 943, 2104, 2930, 1887, -362, 322, 2643, 1759, -1104, 284, 2549, 1078, -1702, -2122, -715, -1547, -2892, -3936, -1801, -2, -937, -2677, -198, 2397, 1077, -812, 650, 2863, 1334, -218, 459, 2353, 2773, 1322, 222, 2171, 2816, 48, -2271, -1409, -112, -2457, -3702, -1711, -165, -1038, -1784, -1516, 224, 675, -1443, -1974, 651, 1959, 42, -27, 2457, 3918, 2112, 1350, 2083, 2822, 1027, -1602, -1452, 458, -57, -2385, -2033, 83, 434, -2043, -3271, -1042, -384, -2977, -3345, -824, 1431, 604, -152, 1440, 3523, 3542, 1087, 1224, 2604, 1980, -376, -344, 1641, 2030, 165, -786, 536, 968, -1020, -3583, -2882, -1779, -2729, -4080, -2204, 409, 779, -372, -337, 1486, 2075, -127, -684, 1489, 2445, 1343]
1730A343o96J959J391j584j912j1R46j347l052k30K114j62j357K45K178N94j331
1747i12j391J171J045j248j302K287K667k53j034J130J412m62k592n49J426k80
1763A115j812o78J742P91j435j456J083P44j488j843O61J426r4j433J495K472
1779A290O79j616J77J410L96j768j343J577J476j231r21J180J599j654k167J32
1795g84R33n92k330r3J978P33j612J18J647J115j260j465J426J293j053j519J356
1812a09J864L75j497M45J309j68k616p61J607K47j753q44J544R33j163j166Q53
1829i00J545p42j834M97J675J31j475K98K214M14j590l58J449M93j623j521J184
1846a43J539j091j702J301J446r07j518j04J552k92j407n37J413J064j465m42
$$ y = [1343, 647, 2606, 3997, 2413, 501, 490, 1436, 89, -2963, -3193, -1079, -1241, -2598, -2353, -175, 419, -912, -2303, -1132, -87, -1335, -2637, -350, 2317, 2064, 1030, 2160, 3572, 3110, 518, -31, 1395, 1115, -697, -1375, 367, 1158, -277, -1733, -650, 94, -1394, -3237, -2576, -1150, -1244, -2677, -1182, 1290, 1969, 353, 530, 1940, 2336, 568, -775, 802, 2278, 1047, 126, 1306, 2905, 1251, -916, -784, 149, -443, -2773, -2866, -888, -155, -1767, -1649, -2, 1113, -147, -1612, -186, 1107, 54, -1465, -109, 1755, 2130, 633, 1078, 2387, 2219, -397, -1158, 449, 696, -1057, -1901, -357, 576, -587, -1753, -900, 645, -97, -1931, -1434, 241, 372, -1103, -805, 1409, 1823, 233, -125, 1324, 1817, 194, -1327, -143, 1396, 305, -1397, -96, 1350, 443, -1075, -1179, 373, 81, -1326, -1863, -450, 614, -851, -1293]
1862a293J475J897j170j332O20J128n40j821K69J651L9j336K11J547K51j742j367
1879a513J354O71j700r90J120J783q64p11M63J696k49j677j42J379r3j684j53
1896a310J960R33r17q80J118O06j075k117O86J234o95j395R12K203k74j572j22
1913g05J212J21j587q26J609J117j405k99R87J732k94j803R3J504q71j908J17
1930a206J607N39j390L39J379P17j761j562P13P78j301q96J064J774m43j006P15
1947F0J262m91j411o53J096M91j408m8J775J001o89r68J102Q96j752j315p6J423
1965B95l36r94M17K006K07j716j054J091L42j779o58J107J265l64p84J307J363
1982A715n53j363k28J281p0j830k68K337L69j003q5J190O73j974j273L13Q49q07
$$ y = [-1293, 182, 2079, 909, -423, 197, 1325, 785, -1036, -767, 884, 923, -413, -202, 1345, 1596, -146, -1513, -159, 512, -1188, -2178, -1058, 725, -139, -850, -387, 1309, 1060, -617, -759, 620, 527, -1157, -1310, 650, 1583, 666, -214, 904, 1510, 435, -1682, -996, 238, -457, -1852, -940, 1263, 989, -583, -705, 507, 628, -959, -1785, -176, 941, -464, -763, 224, 1956, 1662, -141, -48, 1456, 585, -1323, -1206, 401, 940, -450, -111, 1268, 1985, 224, -1338, -625, 153, -1148, -2044, -980, 794, 351, -655, 60, 1322, 831, -580, -1233, -137, 354, -1054, -1102, 673, 1674, 985, 17, 1119, 2015, 263, -1052, -1128, 295, -41, -1035, -618, 1388, 1595, -121, -1175, -84, 258, -1521, -2179, -1072, 193, -171, -955, 352, 1715, 1162, -201, -429, 852, 782, -1048, -1316, 1021, 1390, 387, 302, 1492, 2165, 191, -1082, -769, 80, -727]
2000g27j298J044J591j09j236k12J403l03j402l73J487N68p74k60J108J568p98
2017A277q92N93R81p99j820K45J098P2j345rJ125N91j211j382O86N37j407r82
2035b642J503J266l44p89R57J089J7j607J44J626l3j148J66R68N82j326k80J045
2053A194K27q91j335J10O99p38r62L33J467k45j383L32J121M27j173n82J354R77
2071I32o05j015J241J614r31q57N04J031o34j739j53J156o2j397q40J576Q89j299
2089e89j035J150P07j344r03J081J453m30o90M59J353L75r64k57J215K4j531m13
2107c39Q80N99j272m91N73Q62o34j095k68Q39k68j413J4J691M96r70L42J274L88
2126A208o50p79L53R37l58j249P12J514k23j512J02J516p25j703m36M35J24p51
$$ y = [-727, -2025, -981, 610, 501, -735, -947, 456, 153, -1249, -1622, -135, 433, -341, -601, 507, 2075, 1277, 385, 978, 1959, 1160, -660, -415, 683, 755, -590, -599, 526, 1117, -94, -1476, -790, -253, -1660, -2642, -1139, 127, -217, -1006, -49, 1040, 1057, -550, -406, 1220, 1187, 39, 205, 1173, 1755, 429, 149, 1194, 1421, 530, -805, -695, 4, -734, -1696, -1363, 104, -141, -1524, -1192, -71, 356, -817, -1399, -45, 932, 327, -688, 553, 2167, 1236, 379, 883, 1914, 1280, -459, -612, 544, 482, -915, -1755, -179, 710, -589, -1624, -474, 233, -1111, -2014, -933, 520, 90, -600, -141, 1212, 1587, 623, 366, 1581, 1605, 74, -339, 541, 1140, -132, -623, -50, 812, 178, -917, -1185, -346, -614, -2027, -2013, -322, 174, -796, -454, 820, 1208, 558, -221, 132, 1069, 711, -538, 174, 1688, 1465, -47, 55, 1571, 846, -857, -1293, -858, -734, -1485]
2144a485l54R66J209n12r90Q69J214n98j394O26R32K84n86M23J121M19p35j255
2162A54P02K66j368j446Q07J051q40o04N11J157p68j196KO88M54j008l29K083
2180C16J036o91k96J508N87j391j152O37N43o64n58P7J340M1j549o62O88Q4j475
2199a581q36R03M95l78l6Q13J263n1q02K62J217m12j056J08J470M34r47R2R20
2218A878J86j501r09N3K65r13j247O41J123k95j148Q89Q14k93o56j98R23O08m25
2237b05k75J269J341j113qL77R09j160j324L08J011o19j302J64R58o4j122o00
2255a455N35M10j266k20Q46J026j89q14P80J553j06r74M80Q93J4j000m3M95N86
2274A551q58r42R15K78r93q31o6N29l44q27J85R89Kp81R0J573K61j126L4J025
$$ y = [-1485, -1839, -873, 336, -176, -1166, -297, 917, 319, -1075, -449, 483, 767, 181, 604, 1725, 2144, 1409, 154, 856, 1122, -246, -1692, -885, 166, -674, -1278, -767, 390, -378, -1574, -1572, -884, -430, -1438, -1767, 316, 1352, 661, 365, 1873, 2460, 1069, -83, 554, 1097, 433, -125, -48, 1292, 1333, -216, -878, -190, -106, -1581, -2417, -1514, -1019, -1397, -1433, -620, 643, 592, -210, 52, 1269, 857, -199, -91, 1379, 1813, 866, 958, 1878, 2064, 563, -346, -293, -28, -941, -2188, -1547, -424, -719, -1867, -978, -164, -457, -1113, -1311, -388, 220, -205, -480, 789, 2130, 1017, 1009, 1386, 2295, 1135, -189, 119, 1130, 511, -791, -627, 331, 267, -855, -1455, -920, -510, -1776, -1996, -1150, -124, -313, -1127, -347, 1206, 1100, 126, 606, 1499, 1513, 513, 470, 965, 1551, 693, -249, 666, 944, -49, -880, -946, -417, -761, -1588, -1403, -414, -412, -1193, -1103, 470, 731, -395, -361, 664]
2294F64M20n40n86Q31Q13p67o87M32P93o75j416Q6N94r8j193J98Q93L1n36m46
2314a189O37Q15p30l99N90J072l91p45O33J043O6j225N7J192l22j283n56P95M10
2333D70j049o22J121N79n77q16K8R38m10r43J25J499J29o99R5J326L17r06l63
2352B42M03O18r21n88N16O82o99o56L20L29k31o68p34P36L06j223J87Q78Q32j53
2372A76n64R57N58m33r43J96R77k07r39L13J158Kj128k14N33M0j441l61N51N69
2392b00q23l41R87R24o23p27P41M35j96r31PJ248M00m18K09P09O1q32m97K17N6
2413D06o01p43K93Q24k60r32M40L93j37o10l36N25N23m58l39J033R39k71n94M60
2433E55P96n93j277N82O63m8p00j47J151j22q40n32O98j67q72n33N55O39j42n95
$$ y = [664, 1084, 544, -42, 789, 1602, 835, 148, 580, 1373, 698, -718, -632, -38, -136, -1329, -1131, -238, -207, -743, -1189, -552, 263, -467, -866, -276, 796, 405, -340, 293, 1336, 1402, 177, 234, 1426, 1104, -179, -735, 60, 470, -579, -1201, -80, 499, -78, -894, -866, 72, -338, -1281, -1156, 343, 472, -227, -132, 1194, 1511, 605, 242, 645, 1263, 342, -246, 270, 952, 253, -403, -83, 246, 15, -653, -1387, -651, -345, -1568, -1381, -503, 329, 176, -388, 569, 1127, 694, -249, -53, 924, 717, -222, 91, 1249, 1251, 123, -91, 442, 482, -959, -1320, -769, -200, -1023, -1364, -377, 547, -76, -803, -62, 373, 177, -754, -747, 501, 901, 483, 692, 1401, 1462, 630, 133, 350, 406, -195, -938, -645, 179, -81, -1013, -573, -180, -317, -927, -1263, -738, -215, -673, -1012, 21, 960, 689, 95, 555, 1351, 758, -519, 63, 726, 678, -22, -169, 982, 860, 20, -512, 186, 19, -853, -1386, -831, -192, -334, -929]
2453i29O48R26l09p07L7P78J36j023r5J159J59k06n52M19O66p58r01L71L34m43
2473b90n13M26O48J78q92p3Q29J01q48k29O07N19o13l72P30P50l82o14J23N61
2493F46k13j237L24P42m8n24k38R88N1p47l47O10j08j73n03M60R59k71n88L18
2513A01N65J16q61l06Q87j80p55j57M83O20p21m87P78M37m24r70P26O29o33k99
2533d51J58O37K78n82l14N73M97m05q55R02R8n40o09K33R67l90p15M03L93j05
2553A73r68o7N73M15o74k11R46N40o74m03M20O90l21p16N7O57j21n99J16M50M45
2574G28p23l74O38Mj048k60O33K87k84k65M40L61R4n78q6R44l91o43mJ024K37
2595G34m34l35P00O28q71o81K21M15n46o58L56Q03j5p19K2P68k00o17j80N16L85
$$ y = [-929, -281, 645, 336, -371, -334, 444, 580, -443, -538, 621, 780, 574, 22, 441, 1107, 349, -552, -181, 153, -290, -803, -377, 271, 449, -443, -516, 313, 414, -434, -663, -56, 463, -150, -522, 208, 958, 576, -38, 85, 646, 433, -804, -480, 262, 214, -310, -548, 440, 491, -256, -603, 7, -101, -274, -777, -317, 642, 371, -217, 101, 666, 782, -79, -385, 502, 322, -433, -590, -107, 513, -208, -695, 83, 520, 96, -874, -148, 481, -152, -451, -293, 344, 622, 40, -274, 299, 796, 391, -464, 438, 536, -4, -613, -380, 587, 197, -518, -115, 278, 173, -795, -862, -289, 126, -548, -759, 187, 727, 53, -350, 70, 760, 439, -277, -220, 437, 316, -283, -167, 283, 728, 5, -369, 269, 273, -775, -1035, -402, -115, -399, -664, -224, 137, 231, -347, -433, 511, 120, -523, -527, 497, 734, 300, -35, 665, 1293, 422, -259, -38, 377, -169, -827, -471, 332, 317, -402, -380, 388, 188, -429, -609, -93, 292]
2616B92n99l6M41N83j36o62N55L31m92o77J6N42J24m36Q0M73J38o66l68L44J08
2637d5k05r20R64L31q9l0K51N04k76k83m95O42K19r07k42J064L50p13j21M14l8
2658C75m97n32k92Q40O7p52L27R62J05m35k03P75Rp39l67N00M09k68m22J03J012
2679I77l46q57o9L51m20p62K63O64Q2l59k62Q86K03n85n7K70K32M2o54M79N54
2700F32J47o18k7P81o1q76j55L84K07o57o05M95N39m46k59L86J56j04q79L32Q19
2721A91Mn66P8P73K87m35k44N24K15o06m80N87L92o01k19k52P17l93k21l43M36
2742a56K3o36J30M42Q7R9p71Q44J56k17k34J79O59l01m74J91P27k10o58J01O51
2763F32nn01m07M24K36o94k56M54P9j92m90M83O33n67k66J16L25J50k34k15P85
$$ y = [292, -307, -343, 98, 681, 545, -117, 438, 769, 277, -400, -384, 158, 282, -154, -74, 399, 537, -129, -497, -153, -45, -250, -1170, -206, 125, 36, 6, 257, 761, 485, 202, -293, 349, 568, -339, -581, 483, 833, 120, -1, 413, 375, -122, -654, -946, -106, -39, -791, -464, 498, 603, 168, -35, 740, 749, 10, -357, 143, 552, 284, -138, -35, 977, 631, -226, -295, 56, -364, -1126, -863, -199, -117, -476, -738, 148, 351, -234, -291, -21, 211, 253, -401, 78, 632, 779, 161, 134, 915, 854, -22, -177, 207, 414, -243, -848, -353, 186, -260, -519, -133, 23, -81, -960, -628, 191, 195, -371, -293, 480, 767, 332, 88, 612, 827, 221, -259, 328, 720, 119, -100, -352, 365, -28, -249, -592, -156, -133, -769, -639, -197, -110, -11, -782, 62, 218, 1, -233, -54, 605, 304, -170, 21, 748, 538, -120, -19, 632, 627, 126, -281, 143, 379, -315, -571, -117, -38, -230, -720, -237, 396, -171, -437, -321, 4, 154, -80, -295, 490]
2784D90j23k22j35K49N17m51p35K78L91m01n38J12P53j55m23J68K50q7o93J70
2804e85M80J97j60l21O44M08n66l19K38L65q2n53j49M89J39m86J0N27L54q15m1
2825b26n1L05n37J7o2P40J42m90O8P69k43n05K4M51j60n20o0M91L99m04l79K89
2847E8J78k48p80L03M39k1l49K83L19K11m61j34N44K41o91m52O92L27k37l96N47
2868C73M79k54p07L76m4O7r02j17O28L64o99k16O42M25m27l92K34R5L1j87J77
2889e4M43j90k05J52O12l02k98m41N75K80p22l10M44K20j15m08K69K77n17m13
2909g03J47P03k20k98M0N22p2m0j16J82K22q4l91m3R46j69o73K30M21j38o92%
2931b26M36j69o11QJ54M15k58k67O28pj90k34K06M23k15k81J22P50k28k73k63
$$ y = [490, 367, 145, 10, 259, 776, 325, -410, -132, 259, -142, -680, -568, 185, 30, -393, -225, 25, -62, -755, -585, -105, 92, -68, -389, 255, 663, 97, -222, 16, 381, 299, -254, -403, 86, 225, -261, -251, 276, 630, -185, -226, -277, 28, -509, -492, -554, 186, 328, -162, -94, 675, 432, -73, -49, 402, 242, -278, -338, 153, 552, 148, -231, 58, 236, -12, -792, -489, -50, -71, -420, -137, 182, 393, -68, -202, 342, 583, -108, -560, 132, 459, 222, -174, 373, 852, 598, -109, 267, 223, 290, -612, -729, -101, 263, -436, -652, -10, 415, -12, -404, -170, -75, -44, -231, -54, 389, 199, -6, 146, 758, 456, 158, -283, 292, 572, -150, -460, -16, 204, 89, -319, -50, 227, -290, -703, -556, 147, -73, -371, -331, 191, 119, 79, -37, 145, 367, 283, -108, -151, 795, 626, -47, 183, 604, 466, -226, -226, 210, 41, -570, -562, -408, 7, -251, -518, 110, 103, -87, -321, -115, 308, 93, -188, -66, 684, 456, 183, -80]
2952h0M14L8l03m18J59L53l25o6M39J98m52p3R4J96J17o69l37R89K05p20j53L61
2974c3M34n01k39M18J82q4m94J47L85k7l24O6K82M4l47l3J19L66m14j48J74Q8
2996F1Jl07L35K46m7n38N6L69j00l4l81N27Jj33m17K23M80l15l86M05K71n28J95
3019a6j5O64l27k37J98L29j26n75J29j16Q39j113J83R1L08k30l70N75n2j92m23
3040d76K19L97l6k22j57L78L68m69k24M79J04j50m24L05R7O2m91K24N57j80o24
3061b63N0L96j22l15l42N42K16j53k86K48L46m50j10L48P4r0q7j77O63j40l96
3082d8j7M40J4m84k13JO37o26o8J34M38j06k75j04M43m1n35J66L76k8m30N47P8
3105B99r6k91j5K67n0j25l45J86K30K88p94L19L57Jm83k62N70n4l16l31J019q2
$$ y = [-80, 334, 372, 69, -349, -190, 163, -162, -228, 211, 409, -43, -116, -22, 174, 291, -378, -715, 274, 479, -241, -394, -33, 401, -100, -339, 79, 261, 177, -317, -170, 215, 188, -136, -70, 212, 256, -91, -124, -5, 361, -53, -201, -27, 61, 62, -245, 90, 336, 289, -249, -193, 176, 76, 42, -339, 188, 189, 56, -361, -138, 342, 27, -359, 46, 317, -211, -16, -31, 633, 306, 69, 267, 596, 470, -105, 24, -92, 747, -366, -183, -92, 216, -14, -384, 191, 139, -53, -476, -257, 140, 104, -118, -275, 103, 471, 2, -222, 257, 361, 211, -213, 92, 189, 251, -240, -16, 541, 361, -263, -213, 183, 61, -254, -596, -54, 162, 9, -277, -29, 317, -133, -243, 105, 179, 89, 2, -175, 488, 348, -48, -65, 375, 389, -95, -308, -307, 330, -296, -364, -230, 208, 102, -173, -277, 166, 125, -410, -244, 132, 104, -326, 221, 299, 203, -88, -103, 164, 114, -11, -356, -170, 60, 348, -446, -127, 230, 231, -252, -514, 56, 2, -314, -645, 374, 292]
3127B92k31m0k55O31k08n29J45L24J10m59J02M91j84j64j42K50J44m09k52O7L95
3148G8j58k75K82O92n07k28J7K62O2k76j62M58j87J22o7K34J16l10p90O27J73
3169A63k39k93J84J65K33l87p1J99J57m39O0M02J95n27P2M52J04k45n4m1L96m69
3191A7j84J13J25r3k27M4K34N1l07j14J80K54k19j57N5O62m23j58K10J06N1k37
3213a7j03N46r4j99m6J99j44l5m03P2M83j8m57k37K01J32j50K01J99j19k84J58
3235a15K71j11K17l03L06l8m43L91j3L35j3m44j5N57m48n15m5K13K49n85J06K44
3257a99N4j48qK15L81k5p36M04K19J01l71k4L33J42l81L1Q2J2j09l27M45P6l49
3280a82p8L06QJ48l37p7L90j53l15J10K24J92k93P8K55J80j59n12M69j82J98o05
$$ y = [292, 61, 21, -234, 397, 189, -340, -195, 129, 239, -220, -118, 373, 189, 25, -117, 133, 277, -132, -384, -317, 78, -80, -355, -73, 619, 112, -116, -99, 163, 225, -51, -213, 245, 58, 180, 113, 347, 463, 153, -637, -10, 163, -76, -369, -185, -20, 213, -174, -245, -46, 111, -328, -268, 134, 329, -198, -126, 326, 430, 185, 131, 90, 486, 17, -167, -54, 71, -22, -249, -205, 29, 80, -227, -341, -161, 93, -126, -283, -228, 434, 11, -147, 63, 169, 220, -17, -120, 426, 332, 133, 87, 286, 142, 107, -296, -224, 259, 241, -216, -453, -252, -120, -270, -69, 130, 11, -273, -115, 156, 45, 262, -41, 265, 227, -216, 175, 162, 497, 484, 40, 25, 582, 134, -381, -426, -213, 36, -549, -443, -199, -145, -293, -301, -86, 295, 270, -466, -62, 157, 258, -113, -137, 196, 338, -43, -12, 70, 82, -27, -354, 91, 167, -182, -260, 46, 54, 202, -135, -212, 178, 25, -290, -180, 44, 236, -57, 21, 276, 456, 297, -215, 254, 72, 270, -335]
3302c35J81L43r6l88L3K52J34k95m20M65J73k43k5K43K60k31k22J08N44l81n3
3323D7j09L37L7m64J03N86n33j34j98L95l8k87J5j16K11r7q5K06M12k13k31J21
3345c5J40J22k05p4M48n4j01P9l82L00j04j76L8K53l34l24J03K51j31k50J61R2
3367a83K89l48o9M8N95l29m2K5M26j82k65K83J2J4m82r7N04k48q0j71N29l75j4
3390a60j04K22om22j20K02O19j97j99J11K19q7l5o6L29n0k02j92L71j51j15L2
3412aJ41O3k68k59O2L09p6k36R7k5p2L3K39l6j31K60j61n0L58j17l6L6J92m5l36
3437e9J53K47l30k01K0L32l4j21Q4Q1J48m23j21L4j3P5P2mJ3J60n6L4J00j13m8
3462C0q8K56m7n5P9j92Q3j03j37p1K14j49l15j0O46k33k99N50j45K63k17l11M33
$$ y = [-335, -154, 189, 93, -295, -262, -10, 124, -171, -591, -126, 47, -196, -221, 22, 282, 51, -171, -63, 481, 100, 47, -62, 275, 312, -152, -49, 537, 4, -130, -328, 67, 29, -258, -243, -359, -148, -245, -330, -124, 288, 75, -156, -35, 105, 227, 22, -52, 396, 342, 241, 320, -62, 238, 134, -42, -4, 249, -85, -409, -306, -55, -186, -436, -275, -183, 106, -242, -311, -263, 332, 3, -39, -14, 412, 230, -35, 248, 260, 274, -208, -305, 199, -49, -129, -300, 229, -146, -160, -264, -42, -48, -470, -590, -388, 231, 34, -165, -54, 165, 78, 43, -23, 306, 256, 54, -138, 233, 82, -33, -1, 140, 203, -65, -324, -262, 47, -29, -265, -168, -193, -265, -232, 7, -29, -160, 100, -61, -111, 247, 130, 94, 130, 322, 277, -59, 94, 341, 11, -190, -170, 162, 128, 7, 91, 172, 320, -103, -224, -190, -203, -128, -56, -60, -47, 113, 57, 91, 191, 78, 30, -58, 198, 151, 96, 175, -17, 66, -37, -174, -245, -31, -180, -495, -505, 141, -92, -391, 159, 14, 277, 60, -251, 182]
3485A82k95K18j54N4K37l25l9J57K77j62j98N6K5J38l84N5l2J17q6j56L07N6O0
3508A08m2M5O6J3m52K56K7r5J17l69K83K78k38j30N5j5j76K06j79K35j15LNL04
3532A90J5l01j00L31j15J11l98M03L7m8O9K72m77J05q9L5j5q7l56L52K10j06j07
3555f9j53K60Q1m17J07J42Q1q9L4J10L33m66j19M81o5K21o09P9L05j80N3o9M7
3578I8P2q3m77L55j73J69j39j74M55k72J72r2J13K83k17l27K81J32l19k4K54L90
3600D77k89l85Q0K55j18k31j6P2O7m1P8K79k73k58K10R1K35j19l89N59J08j50
3622B42k41K43m1K30n43K01j77J27%j44L47j87j23l4j23L30L5m98M39K22m84P9
3644a00r4L57j97M0N0Q3j65J59j60j61K05qq7KK32l51Q4K12J05j20l86Q9J29l0
$$ y = [182, -113, 105, -49, 5, 242, -83, -122, 35, 312, 150, -48, 8, 33, 171, -213, -158, -190, -73, -159, -315, -8, 48, 108, 66, 111, 177, 190, -262, -6, 21, -74, 43, -326, -43, 235, -3, -133, -78, -93, -269, -63, -242, -7, -122, -119, -114, 190, 205, -96, -196, 135, 20, 131, -267, 136, 173, 125, 194, 466, -11, 94, 5, 40, 25, -62, -418, -66, 144, 38, -69, -222, 38, 119, -298, -191, -49, 32, -57, -23, 87, 420, -46, -165, 316, 251, 472, -137, -58, 247, 67, 120, 51, 98, 170, 87, -390, -35, -208, -39, -178, -352, 103, -169, 3, -89, 24, 307, 90, -237, 44, 176, -143, -167, 87, 477, 188, -197, -117, 138, 20, -211, -227, -155, -88, -129, -51, 228, -45, -303, -93, -2, 233, 114, -275, 284, 392, 242, 1, 244, 203, 433, -110, 91, -86, 41, 41, -103, 244, 57, -66, -100, -223, 107, 142, -356, 83, 305, -179, -100, -194, 163, -34, 6, 56, 139, -26, 133, -27, -188, 17, 9, -78, -76, 156, -195, -111, 101, 206, 86, -300, -211, -82, -112]
3668a12J10k16K38r8J17K03j73r9K14k25L8K2J03n6j12L42l10j87J21N5R9m84
3690d10L86J38m2m01L08k11L09j90O7m6J49K29j64j74N2J44Nj85J99l2j87l3K60
3713A71k70o0j98M40k65K8r7J26jJ35j27K1Q4PJ1k6J61p5j58L06j37j20M1L68
3737C65j06m14n0NJ77L42Q1n53J74M0j24J86m86K83K74j06j81n6L16r4k99L11
3759H5n2J99k11j79P3J15j7kJ40R4m30j42K86R4k01R4K08r8J34m23J57J68N4l23
3783a77J66N7K97l97K13j37pJ6k34K36J47Q1p92M98R2k24r3K88P1k24J83j05K0
3806b5k1m9k70M17k23K45j61J98j6L62o41K55q2Q6p0p8P7R3j1l99L63J15k74P7
3830c2l8J37k64m5K60J86j37j06M3O1o6j94L3J31L54n43J57K22j79k7K33j63J88
$$ y = [-112, -2, -218, 20, -78, 39, 242, 69, -30, 184, -41, -3, 19, 122, 66, -46, 296, -14, -201, -80, -25, 74, -410, -24, 114, 72, -329, -21, -232, 77, -113, -46, -92, 57, 286, 122, -52, 0, 144, 149, -36, 163, 131, -56, -89, 171, -99, -159, -357, 83, -182, -154, -251, -125, -126, 9, -118, -97, -13, -6, 5, -21, 140, 65, -93, 213, 76, -44, -3, 365, 259, -155, -205, -200, -23, 319, 400, -153, 21, 61, -63, 123, -363, -80, 194, 88, -93, -149, 167, 73, -226, 85, 33, 232, 21, -158, -85, 30, 13, 11, 151, 245, -185, -327, -41, 53, -148, -54, 154, 56, 190, -233, -76, 92, 146, -177, -11, 46, 343, -54, 159, 22, 15, 31, -203, 33, 180, 261, -531, -33, 59, -165, -258, 30, 101, -123, 60, -45, -25, -46, -95, -365, 52, -171, 74, -87, 111, 95, 457, -184, 71, -11, 75, 5, -73, 4, 97, 86, -313, 50, 165, -109, -32, -70, 67, -197, -242, 18, 204, 67, -39, 4, 65, -1, -195, -162, -31, 323, -220, -63, 159, -20, -47, 186, 23, 211]
3853B11m45r0L41M4n0k9O6K6j71J70K67l17K25j50k28J62k36M70l75m5J76J75
3875A97k62Mj3o5r9K48K8l0K71m53J07K89k00n3j74K43J57j13m9j84J39J35k57
3898a34L11M8q2k46O5Q9k55J62j88K89o1o9o3M1P6j48J49k04L84j87O0QQJ27j41
3923C9J40j44N0j50l0L51k18k7j01J15J05k54J33n9J55j39j07L29k48O2p0R2K74
3946B98k04l9J13j54N9j56J36J69J08j80p2Lm4q4j03K58Qk75r5oM42j45o4l8M9
3971a6j15J93Rl8J89n19K84J7J86l16K04p9K30M2l77J97k28KK8M5j30K72J75l65
3995a10L08k00J36k81J71j22Q0j02L2K69j5l52J74J29o1L00m74M0k7P2M1J49K12
4018C69j64k50K05K8j95Ll87N37k35nJ48O2k3r3q2R6K4m44K69j20K60Q2qk55K73
$$ y = [211, -234, -324, 17, 61, 11, -18, 48, 74, -97, 73, 340, 23, 248, 98, -130, 32, -204, 266, -109, -154, 22, 197, -65, -61, -74, -139, -238, 10, 38, 8, 279, -174, -67, 222, 22, -31, -205, 38, 195, 82, 33, -151, -12, 123, -134, 177, 225, 143, -103, -38, 51, -204, -42, -230, 59, -2, -71, -134, -93, -17, -165, -16, -220, 164, -23, 37, 45, 53, 180, 39, 179, 35, 85, -65, -95, 256, 38, 11, -90, 25, 130, -124, 9, -50, 105, -34, -141, 188, -60, 2, -68, 24, 298, 94, 55, 168, 14, 73, -83, 53, 222, 330, 150, 78, 81, 37, -47, -150, 108, 116, -159, -254, -260, 182, 37, -27, -65, -16, -131, 62, 71, 33, 222, -297, -13, 4, 190, -126, 78, -1, 229, 271, -106, 91, -137, -135, -107, -62, -192, 80, 255, -110, 198, -2, 134, -147, 24, -98, -18, -120, -88, 181, 166, -186, -12, 117, 56, 356, -118, -78, -105, -33, 8, 157, 369, 205, -45, 160, 188, -7, -4, -391, 146, -89, -94, 54, 116, 93, 0, -82, 14, 38, -406, -137, -257, 3, 85, 77, -178, 95]
4043I5k92J33j28K1J16o1K4o3J17MJ20J27j15l3l4J90o7k47K9j04Q7M08l05j56
4067a34R9K01m73J50N4J24m4k01J12J01KJ19oOj3K0j35K24j53M4n1n8O0j93j93
4092c38L77P3P7l66L69k51K53k82k49L11J23j81m0N3m4M8J83k86J47J24j20J20
4114A01Jk00Q9p3M2J57j45P5k03J28K02o8k52J94jj14q4J45L9J15j69L66j57l83
4138a95q7K3K29n1J06m3J75j9k11J31M0k58J32M34n03K46J31o28L58J54k4k2M5
4161A63j73R6O9j79kj06L6O9q7K29j02K10o5Q6k71K18J8J6k78K01j29RO2J01j79
4186A2k06K81l7j49q0O9P4J0m4KL3M2L15j06k4j54J95j89m8j69O7J41j38m5k8
4211a76K57k91L72j15J45j44M0j06R6j17J4j6r2J71N2P0l66J95K6j1K34m71K02
$$ y = [95, -197, -64, -192, -171, -55, -116, -92, -155, -38, -34, 86, 213, 98, 65, 31, 221, 154, -93, -64, -168, -81, 327, 22, -134, -35, 166, -307, -157, -103, 21, -23, -224, -112, -11, -9, 110, 104, 110, 97, 117, -18, 206, 53, 97, 46, -12, 48, -145, -338, 39, 112, 189, -177, 192, -59, 194, -88, -337, -26, 97, -84, -124, -71, -115, -67, 116, -170, -23, 101, -19, 101, 102, -98, -9, -82, -40, 117, -28, 47, -156, -28, 174, 106, -146, 48, 47, -67, -151, -6, 33, 148, -21, 345, 188, -195, -282, -259, -30, -81, 25, -18, 157, 138, -73, 58, 98, -160, -28, 406, -97, 149, 280, -348, 10, 164, 140, 118, 163, -10, 86, 155, -24, -26, -132, -96, -27, -114, 115, 13, 223, 158, 244, -27, 191, 209, 225, -53, 148, 19, 28, 90, 191, 12, -194, 87, 50, -99, -179, -110, -36, -26, -70, -68, -35, 7, 322, 216, 192, 38, 233, 44, -4, -173, -106, 35, -103, -148, -176, 81, -210, 162, 47, 192, 48, 88, -18, 78, -39, -25, -41, -133, 38, 90, 160, -206, -11, 15, 4, 238, -233, -31]
4234c1J27j28J22O4m09M92k01L2J19m58K56lJ36q1P3k03K15j99K06j32k41M74
4256B30n16J99q8K62j80L3k2J94j76K46k49M0j58K16L1m8J84n39M83j55J07K23
4278C17n00L16j43j30J72o7Op9L10j58k38K08j6O3j9n8J16K0Kj14pj78K60o1l3
4303a1j96L44k33l53M26J47J5l41J73P0R1k18l8K96m7j84J35N5j43J96k6n0K3
4326A31k1m41M16kk94L41j11k0M7j90K24K4j82L3P7O1M4l46K96K01m03O9L2J15
4350A01q9k2j59O6j7J89q7M30j58r8k32K08k45J57j05J41k44K61j69m8J18K26
4372B24m4m88L60K37j50j37K7N1J21l16j6J07L11n11K25N1j26J74QJ54k16K01
4394B47k20j34K53j05n5M1K04l83K55J25m24J12j37L58k14J80j39k6r7K52J57
$$ y = [-31, 96, -32, 90, 154, -255, 237, 36, 68, 187, -271, -15, -18, 118, 37, 110, -93, 122, -77, 129, -3, -244, 230, -286, -87, -175, 87, -93, -60, -82, 112, -64, 182, -67, -27, -185, 31, 62, 14, 198, -341, 142, -13, 94, 317, -183, 133, -10, -140, 32, -35, -29, -108, 202, 44, -194, 14, -2, 61, 42, -16, 100, 120, 122, 8, 1, -177, 83, 22, -11, -207, 137, -96, -449, -23, 124, 139, -202, -29, 41, 132, -86, -124, 172, 125, -59, 76, 131, -12, 184, 158, 108, 131, 110, -331, 85, 83, -211, 130, 19, -1, 46, -144, 80, 104, -78, -45, 32, 93, 137, -209, 87, 288, -115, -46, -14, 101, 12, -10, -169, -103, -120, 69, -18, 412, 254, 156, -76, 132, -113, 44, -61, 80, -164, 97, -72, -120, -2, 224, 180, -308, 52, 289, 139, 2, 29, 80, 201, -115, -131, -24, 287, -224, 1, 52, -74, 100, 108, 262, 46, 247, 27, -107, 146, 41, -14, 27, 231, -152, 103, 228, -196, -84, -221, 137, -77, 103, -36, -62, -159, 93, 250]
4415B50k40P4j27J79k56L03l0O0l60J13p9P5P9k24K04K22m20L21j93Q2J41l36
4437a62J05l9J43q0L1n7j81K98k16K39l31k8M80m54K24kL5l37L84R6k39J14q6
4460f3J29j07J37k12L20p3l03K84n31K68R6o8L30j34j62J95k8j91j6RP5O5r9J74
4484I5l34Q0J6J21K12k89J86k51K61q9J41%n7n6j47M4jR7j47J27J6J4k74L20K86
4509C71n86O0L59m36J56n6L44l29M2J38K9R0k3Pr3P4k74Q9rR1M2j05p1J88k63
4534a65K26l0j14K74l2k01Q7J32j10n6M8j34R4l7p4M7k55Q0L16k23K42J9l56K90
4558F8p6N2r1J79l17L82j19l11K99j03J56j83J34K2k19J75J93k86O3O4N4r5k5
4581A6J95k37N7J81j92J27j93m4p1J74K6l7j43J95l1K7J71j89k78L69k51P7O5
$$ y = [250, 10, 84, -43, 136, -120, 183, 153, 213, -147, -34, -113, -38, 41, -183, 21, 243, -177, 144, -49, 33, 174, -162, -57, -96, 47, -33, -2, -59, -240, 58, -158, 81, -250, -278, 202, -252, -28, -30, 5, -332, 52, 148, -91, 23, -63, 66, -41, 96, -116, 204, 131, -172, 112, -419, -151, -55, -123, 207, 73, -89, 106, 78, -113, -129, -120, -45, 20, -79, 95, -239, -159, -143, -22, 190, -99, 87, -164, 97, 8, 149, 149, 92, 36, -111, -67, -68, 29, -118, 9, 25, 39, -235, 85, 371, -215, -155, 204, -232, -76, -132, 212, -117, -75, 63, 92, 182, 159, 166, 73, 147, -127, -38, -47, 44, 86, -19, -90, 98, -165, 61, 31, -83, 191, 159, -42, 45, 177, 67, 11, 59, -75, 19, -18, -92, -45, -300, -220, 96, -127, 115, 134, -222, 68, -8, 44, -47, 132, -185, 197, 78, -233, 66, -37, 119, -64, 70, 92, -127, 48, 241, -45, 18, 82, 136, 41, 16, 211, -26, 31, 212, 20, 147, -46, -90, -161, 13, 39, 2, -141, 54, 23, 50, 221, 32, -246, 123, -128, -51, 14]
4604A4k8j8J96k65K18j91L41k32k13L42k52J17j02R0J1k85K1N76k18l4j7j04J19
4627H6m9n6K35l73J12J58j93j4J71j54Q2q1J5Q7Q3j89J21k11K98k16K31k73J68
4650C8J69m5j06l2J50j01Q0j73j11k16L83L3q1M5L2j51K54l55JmM9Q8K23m8j27
4675eq0K64j70J43k04o8J70j47K14l16J49j67J97j12n2J74JJ23j60p5L10l05K76
4698A60n46J91J65k54L62n0p6J87l01K6K03l72J99Qk83L31j25K89j11R9O7l16
4720a47K5n8l5J11K09P5j06r7j01R7Mj14J69l29K74k16K28K66k03q9n1n0M18l09
4744b9K61p4J20p3k39m2L7J49r4J83j75k37L72j99J25Qk26Q0J52k46j6R8K32k24
4768e7O0j00k09J73j08K54J29j97N8K7l0k67L61J1J38j41k68O7j55J39J7J78j11
$$ y = [14, -14, -32, 164, -101, 117, -74, 267, 35, -178, 164, -88, 29, -73, 17, 28, -257, -236, 340, 122, 88, 71, -33, 86, 37, -19, 216, -157, -45, 113, -80, -94, 77, -77, 5, -76, -61, 26, 109, -80, 41, -170, 128, -88, 143, -130, 38, 207, 162, 56, 24, 174, 73, 153, -20, -131, -347, 36, 69, -12, 33, 65, -86, 168, -187, -186, -190, -141, -53, 170, 122, -5, -85, 179, 9, 152, -52, -120, 50, -97, 117, -199, -50, -217, -20, -132, -184, -10, -9, 114, -46, -121, 189, -116, 160, -386, -195, -30, -284, 78, 28, -48, 139, -162, -136, 67, -305, -106, -98, -381, -50, -175, 114, 3, 102, 169, -147, -122, -180, -215, -104, 105, 180, 74, -23, -124, -27, -23, -137, 32, -297, -23, -239, -11, 255, 52, -37, -88, -138, 280, -29, 232, 158, 278, 205, -34, -76, -39, 110, 16, 199, 24, -213, 159, -40, 85, 93, -133, -53, 99, -147, -163, -65, 167, -57, 3, -97, -306, -133, -241, 13, 142, -55, 3, 30, 0, -267, 94, 105, 243, 102, -166, -99, -254, -115, -98, 80, -31]
4791c1J60l14M50l65l2J32j3j72J27J35k5N3J18j58J04j98j98K20k65L02kl0k9
4814c1K91O9l53J67J0k32j79J35n6J85j42L43j69j67O0k3K12k79M86l43j58K21
4836D7kj56J07lk8%l6n2J04K01l6j97Q2%o3j92K27K3m8q4Q1l10L73j39J91J86
4862B76l02J21PJ1L4k33L7j06J71N3k30k2M31l80J89j16L48l28J24m07J19N54
4884C51l60Q1j35Lo9j2J5N6j43J85J71k92m8M6RO2J50q5K78k94n0N5n4K39j70
4909a1l3nQ9O3k57L03J3j84J12n9j17q9R3J88l9m3J3j9J67j4j9j99PN5J6J26k40
4936h3L5k7Q5j38K22Mj43J16r9K57k59m3Q1J50qKk42J30KO8J04j0m27K0L5K5J40
4963cn2M3j7r2L50j14r4p4j35P1K03m80K42M72k22o2O4j38j3oK8J07l41L33j68
$$ y = [-31, 129, -185, 265, -100, -132, 0, -13, -185, -58, 77, 52, 105, 223, 65, 169, -29, -227, -7, -272, 30, 28, -2, -31, 260, 329, -24, 143, 153, -79, -258, -123, -179, 6, -136, 207, 38, -129, -69, -92, 120, -159, 327, -16, -174, 47, 45, -111, -4, -7, -35, -35, -71, -123, -19, 182, 146, -51, 31, 31, -32, -224, 3, 26, -22, -106, -25, -335, 38, -101, 90, 276, -26, 95, 102, 113, 147, -86, -49, -155, 16, 69, -161, -183, 248, -132, 57, -59, 289, -39, 85, -322, -203, 351, -9, 72, -63, -60, -129, -141, -126, -70, -213, -28, 143, -149, -197, -151, -142, -80, 70, -15, 263, -31, -81, -26, -80, 159, -11, -44, -49, 40, 103, -154, 149, 162, -22, 90, 31, -86, -175, -82, 106, 67, 24, 37, 18, 185, 171, 152, -47, -40, 15, 31, 157, -83, -48, -75, 10, -128, 94, 98, -45, 71, -28, 229, -30, -73, 8, 158, 150, 152, -90, 40, 42, 110, 214, 204, -223, -203, -168, -143, -3, -55, -12, -29, -121, 229, 115, 21, -53, -188, -117, 86, -394, -152, 320, 98, 36, 100, -38, -51, -57, -29, 78, -263, 70, -98]
4988i8R0J43Om3k4Q5k13K79k48m6J82r1kk77M42k29nk02L31K9l34K50m5j08K6
5013a02J49K73l38k1J81K82m55R3k67P6J08O0Q5j30J75j38R7l67K19K99p7j24
5035G8m55M33K1N5k51J94M6j64J0j46K80p0j5j36L15r0n0Q6k86M2L10j61k96K59
5059Ij32J00j21K20j54K05j56j12j9K69l07J40Q4k30Q5L11j65j76R3J42PM4Ol19
5083a76N80k46k09K6K9ok21L78j89K7k2K17j15j43K14j77J09j2r1J27j61P3m6
5106c4J01o8r8J90k27N4p7L00k31J55pj28p0J91j34KL21oj89N9k9k23L47k88P7
5131a2K18k07j96O5Q8rP5j7j63J8O5J4q5J84J5PK06Q2l96O5Q9k39K15j56N8q9
5157a05K1m3O0P6J19k78M02j35j76J83K9j88J65k28l2K71k23oQ3j05K88k13J86
$$ y = [-98, -8, 135, 141, 98, 74, 159, -54, 225, -23, -69, 113, 22, 20, -257, 185, -44, -49, -251, 80, 109, -225, 25, -20, -128, -102, 47, 320, -18, -39, 142, 424, -31, 62, -205, -129, -21, 39, 124, -6, 169, 31, 128, -239, -20, 279, 202, 78, -377, 56, 77, 132, -119, 75, 121, -43, -33, -179, 101, 31, 16, -120, 195, 105, 55, 141, -145, -103, 207, 46, -250, 9, -123, -23, -144, 76, -78, 127, -29, -141, -160, 109, -198, -58, 26, -204, -119, 192, 27, -149, -56, 86, 93, 137, 143, -176, 404, 158, -51, -25, 4, -2, -223, 155, -34, -7, -29, 188, 73, -70, 144, -33, 76, 64, -27, 100, -61, 12, -34, 67, -1, -99, 91, -136, -82, -159, 141, -90, 65, 58, -70, -140, 51, -83, -81, 240, 234, 45, 104, 75, -148, 199, -89, -12, 206, -1, -197, -132, -44, -53, 22, 5, -158, -140, -75, -61, -146, 38, 53, 60, 266, 348, -48, 17, 106, -133, 82, -74, -16, -105, -84, -127, -67, 9, 128, -150, 252, 117, -59, 124, 153, -35, 130, -98, -130, 141, -82, -88, -5, -110, 178, -35, 151]
5180A51J19l77K9l6O0J38J14k20j39J22j6N3j93L12r4l17J98K32j13Mp2L32l91
5203a04O8M3J53j76j14J14J37m02M13m15N45k21j64J82mj70N5J84k56J22J66o5
5225I1k15j93N03j13j24mK14j49M9j07o9L27l2n42N75j43l02K40RJj19rL40l34
5249a06K15k86R1m9K5L16k81L5k00L76M4k78M9P9j00J51k24J58m8j48J33K01l35
5272a82R9O2nj1N9j71J32M0J02j16P3k2j95j17L83K7k59J03Q9J07k20OK88k70
5296Bk36K16J02j24q9K37k82L85m10M5J30J43o7j22K21l5j79J16k05L40r8O1k74
5319a23K0L72k09P5o3r8J24R5m46L75j16j38JK60m35M33j7r5M6Q5L9j85J0J05
5343A15l11J41J78P0o1p6j63j0J46j52M5J6K96k76lJ3j53k4N57m14n4M24l17J76
$$ y = [151, 270, -107, -78, -114, -54, 84, 198, -22, -161, -39, -55, -2, -195, 117, 23, -294, -96, 136, 23, 27, -45, 287, -104, -36, 7, 160, -16, -130, -16, 121, -281, 132, -283, 262, 41, -123, 59, 55, -115, -60, 124, -132, -10, 156, 91, -124, -317, 186, 73, -51, -55, 159, 10, 59, -48, -117, 210, 178, -364, 211, 68, -234, 6, 15, 16, -103, -112, 228, -106, 109, -177, -86, -135, -110, 206, -75, -40, -240, 136, 180, -98, -49, 30, -70, 81, -143, 15, -33, -181, -48, 153, -182, -83, -21, -26, -37, 22, -149, -17, 23, 125, 9, 82, 60, -135, -252, 131, 158, -101, 2, 91, 198, -22, -16, 272, 2, -234, -18, 84, -40, -129, 108, -174, 211, -199, -154, -24, 119, 52, -70, 151, 116, -63, 53, -152, 188, 90, 151, -123, -103, 269, 60, 135, 72, -26, 98, 193, -253, 122, 6, -132, -131, 129, -306, 127, 110, 15, 61, 146, 185, 0, 10, 115, -196, -55, 123, 193, 132, 56, -107, -117, 29, -123, -78, -62, 234, -42, -45, -32, -185, -209, 348, -66, -120, 304, -13, 163]
5367A63r0j89M0j97K95l61J52K31J11l8j74j07J68J99j44K5q8J3Lo1M2J21l71
5390b57M52r2M3k82J20k42M56q6l66K03j78O79n66O0N2J71k57L06j69k01o0PM38
5413B31M0l45J57j90K5J89J6j70J75j25j86N51m56J51m4p9l9R6M2j8J42o8j89
5436i4q9R1M8jo8J11Q8j56j7K88k36J58N6j48p8L6j8j19r8M18j13J4K17j53l4
5461A03J24j46p2L1K1j44j21P9j68K53J99q9M4j66N5j53L2R0N7K14J9k28j87j23
5485b76M29j79q9J0J63j97k04L66n2J51j99OL4K01k07K08k10q6R9O0j27J43J87
5508B31l13m5K07R2k55N7o3J61k20J91r3M1k7L8J7k51L83k03J51R1k32lJ15K46
5532C16k60L1j16m7J24p8j57K55P5q3j49P7L02k13j12J68j35J22%k26J76l07K95
$$ y = [163, 73, -116, -76, -273, 22, -339, -187, 44, 155, 117, -57, -164, 4, 203, 59, 84, -4, 9, 12, -49, -7, 114, -257, 195, 103, 146, -136, -16, -258, 198, 112, -254, -51, -229, 450, -116, -56, -4, 167, -90, 216, 47, -154, -214, -207, 231, 271, -74, 83, -107, -82, 107, 123, -47, 128, 3, -183, 368, -88, 63, 19, -60, -99, -3, 39, 21, 163, 95, -94, -183, -92, -44, -45, -113, -2, 86, -70, -87, 201, -35, 123, 179, 31, -47, -11, -29, -148, -246, 172, 59, 73, 290, 137, 103, 227, 81, 9, 40, 61, -83, -204, -125, -293, -40, 159, 70, 114, -52, 3, -150, -118, -28, 29, 243, 262, 34, -153, -276, 153, -26, -115, -105, 58, -139, -343, 23, -29, 122, -77, -71, -37, 164, -43, 165, -45, -131, -32, 28, -99, 44, 231, -82, -127, 80, 172, -83, -26, -89, 72, -148, 43, -50, -9, -36, 2, 19, -232, 151, -52, 99, 190, -42, -45, 70, 316, 56, 87, -29, -76, 48, -30, -187, 68, 143, 60, -89, -12, 290, 77, -35, 133, -2, 120, 120, -106, 70, -237, 58]
5555E8Oj41J60J17l89K31J69m74K59k4j17K94k05L7O5j22K49r6m4K24k78k65M9
5578b37L98k48o9J59j57P2J32QJ01L0k63K01k79P6K19j61j73K54p0p2K87k40Q5
5601E3J44K08l27J78l93K66o2pj95L46l06L24j67K6K53r4k9l48P8j60J20L67j95
5624H0p1j61J78R2o3N6j96K3j99K40K6q8J01L0Mk6J74l39J72j24K61Q5l81m2L37
5649A69m30J49J67j23L17j91lj03K48l72K71j3O0k7k75q4K04J48M9k72J30J62
5671A81l82K71k02K26j54j22Q6J61j10J03j92J51O6o6J38p9J20j67J96j44L2k46
5693a33L10l50p7M27l76K30J87j55R2k88L1M2R8q5J43j21Q4m62J62K3L57j85P7
5716C1k55K47R5k47K76M9J46r1k69O2P0K0k55k01L39n3m5J91j3J26m6j77m7j94
$$ y = [58, 64, -77, 83, 200, -189, 42, 211, -263, -4, -28, -145, 149, -56, -19, 46, -76, 173, 77, 33, 257, -21, -286, -237, 161, -87, -156, 3, -154, -82, 50, 58, 159, 189, -74, 127, -152, -76, 143, -18, -191, 63, -7, -79, 208, -32, 53, 197, 405, 78, 256, -137, 129, 67, 60, -135, 211, -95, 229, 62, 88, 341, 247, 218, -130, -52, -212, -92, 275, 80, 9, -152, 26, 118, 55, 111, -85, -62, -261, -21, 5, -83, 18, 48, 52, 26, 200, -139, 33, -91, 170, 255, -126, -168, 169, -261, -112, 55, -68, 249, 58, 55, -48, 200, -172, 99, 86, 146, 119, -156, -240, -36, 112, 161, -111, 19, 181, -201, 70, -132, 94, -60, -182, -96, 65, -45, 58, -134, 17, 83, 17, 155, 76, 196, 29, 225, 81, 113, -133, 177, -173, -250, 177, -199, 31, 218, 63, 155, -133, -102, -60, 38, -47, 96, -25, 59, -403, -241, -218, 139, -46, 31, -224, 23, 118, -129, 147, 196, 342, 251, -18, 44, 114, 134, -121, -322, 17, -36, -81, 110, 97, 223, 177, 0, -47, -241]
5740b41K30K51j3l56k9O5J39m1J19j00n9J76k95L34j31j22J49jj79P9M9O3k28
5763a41L22m19q1J30M8K66m57L42K45j8j73k07K01p2M74o18L14lj81J01j86J43
5785C0j33J7n8J0K18n4j1O9M1j59J45l21K51j56k22J70J83K2l3L6j24nK7J69l7
5810G5k05J41lk37J43p6K33J41k75kJ90m68J67p5N94k20k92j11M17k20J54qk11
5833a48j27K57NK23j93M1k7j41J13r0J25R6j71OJ77J4n7j16J98P9l02j79K93K2
5857I8%rk52L48m54M88m1l96L2j04P4K80K5k18J41o3J8k19K99M6M6r6j21k98O08
5882B32j83j52J07J22j11Nk2JK36m5j70J02k41J3n3L4K10l02P7J15J96k45K21
5905A47k26L46r8j90J6k52K94j16j4L5o8K45o6q4J49k8m2r3Q5KO6j39k9K64k10
$$ y = [-241, -11, 240, 227, -129, -158, -93, 46, 5, 124, 24, -35, 141, -154, 180, 49, -73, 76, 75, -104, -25, 24, 87, -141, 181, -238, -319, -189, -141, 125, -332, 10, 255, 237, 64, -143, 58, -14, 460, -158, 156, 153, -28, 73, -113, 30, -103, -86, -144, -134, 84, 30, 19, 88, 129, -30, 115, -206, 45, -111, -333, -163, 20, 42, 9, 45, -79, -84, -57, 112, 75, -130, 11, 8, -229, -86, -162, 71, 212, -63, -65, 125, -343, -176, -251, 343, 123, -169, -280, 137, -83, 71, 63, -148, -275, -18, -13, 210, 17, 58, 31, -110, 3, -87, 38, 134, -37, -31, 146, 160, 103, -13, 185, 264, -38, -217, 76, 98, 98, 89, -163, 185, -269, 219, 178, -218, -186, -290, -216, 64, 89, -129, 12, -51, -33, -252, 47, 93, 139, 43, -78, -376, 232, 49, -103, 4, 126, 15, 20, -2, -1, 235, 190, 20, 122, -119, -106, -159, -125, 85, -217, -140, -25, 171, -74, 147, -79, 267, 169, -21, -5, -257, 37, -79, -93, -58, -126, 119, 53, -31, 118, 90, 48, -45, 40, 42, 108, -31, -60, 204, -6]
5930fK72k75L14j39m82L89l3l4J33k1q7k1rQ9P5j24J1j22k5k22L21K24j92M1l1
5955D6J15P2k60R2k03J94r5L08k04l54M01k59Q7J23j03j13K34j88k5R6J68j16
5977A6j3K47k78j17K69j58K01k94K14k68L94k37j08Q8o3J10k06J53j56J50k47
5998c03O97j77k41J67j26J1j68J79J1Q2l48L36m53M85J75m26j8O3j49J65k55K91
6020bl29K56J00k72J34J02q7j83J03L32l90J80Kp8K62j13J81l34K84j36j93J48
6042c3n4K78K3p9k90J77R3j06j01K64j22k65J00j41N45k62j50K8J78j85P3P7o2
6065a4Kj82R5K46j18l6k04M32l90J90K7k35K10o7J00J17M5j17k99J18k02K41O1
6088B0k71J01Q5K21O4j85k8K31m89N7K93r8K44j1k49J4r4J66J65k32p6o4J18R1
$$ y = [-6, 266, -9, 305, 166, -316, 73, 40, 6, 139, 118, 31, 10, 1, 90, 165, 41, 52, -70, -95, -317, 4, 228, 36, 77, 46, 161, 233, -27, 65, -138, 56, -39, 269, 65, -289, 112, -147, -60, 63, -40, -153, 81, -107, -132, -36, 132, 16, 3, 250, -28, -145, 124, -34, 167, -127, 87, -181, 213, -24, -132, -44, -107, 3, -203, -50, -206, -56, -303, 394, 217, -24, 143, 17, 28, -140, 39, 50, 132, -216, 120, -333, 152, 327, -99, -117, -54, -203, -38, -293, -2, -331, -75, 25, -247, -113, -11, -98, -281, -178, 154, -236, -56, -54, -132, 130, 17, 198, -136, 148, 12, -181, -33, -87, 191, 214, 135, -155, 22, 115, 9, -92, 172, 50, -215, -115, -256, 289, 27, -123, -95, 83, -102, -29, 48, -14, -12, -194, -99, 147, 29, -7, -211, 221, -169, 21, 48, -187, 23, -44, 56, 173, 218, 101, -198, -80, -282, -41, 20, -251, -150, -65, 156, 220, 35, 7, 238, -251, -194, 99, 1, 245, 234, -15, -1, -95, 71, 236, 4, -72, -136, -18, 73]
6112G3j18M9K5J36k80J90r2L40r8k33J05j27J44j23J28j5o0j60K46j53J85k51
6134h9k75O51l13j15K54J2q1oK26Nk9l82J75K13m11K04k65N8n6K54M1K02l89L02
6158A86j55J80k7K9l30j55K66P8j81j71L87n32O52l23j13K07J52K6j96j45L50
6179A85p8O4k2lk16J69N7k12j10R3R8m5J98k12M2J26j05j16%j1J50J62l26K17
6203A05K0j04K0k07J88K67j17j34L9k50J68R2J53m46J16j86J25L02k56n8J12J67
6225A16k08j1J36k3J47r6lm4j40K81q7j3k57n7L89k50L75j16k90j7P6p6Lo2J84
6250d3Q5n9l02L17J2M7p4rL64l24M5j90J79k17K19M05m97J5K8o5K06j9j28j43
6274a48Q9pK31m01J27J34qK46Q6n09K31R0j93j22J22k9k57J58J60J71J32l10o0
$$ y = [73, -45, 4, 29, 165, -115, 75, -17, 323, 225, -8, 97, -30, 114, -9, 119, 104, 44, -116, 130, -23, 162, -89, -364, 287, -26, -141, 113, 125, 44, 38, 264, 269, 240, -142, 33, 246, -165, 39, -226, -168, -224, 30, 71, 273, -116, 186, 31, 211, 184, 213, -117, -272, -6, 72, -109, -280, 107, -425, 227, -96, -209, -2, 150, 176, -20, -165, 185, 107, 171, 149, 146, -70, 99, 156, -56, -166, -73, 25, -20, 178, -34, 8, 134, 29, -87, -87, -98, 52, 214, -112, 105, 125, 21, 41, -166, 22, 289, 172, 38, 77, -173, -5, 87, 240, -206, -90, -276, -151, 151, -105, -163, -51, 116, -92, -103, 33, 10, 157, 61, 58, 14, -126, 155, 68, 55, -202, -259, 130, -120, 255, 139, -151, -168, -92, -168, -165, -227, -43, 42, -17, -319, -2, 10, 57, -17, -26, 338, 14, 59, -131, 48, -169, 50, 455, -42, -27, 1, -64, 142, 123, -5, -148, -59, -66, 165, -236, -109, 25, 17, 263, 349, -160, 71, 161, -32, -154, -32, -61, -318, -160, 0, 171, 303, -7, -67]
6297f7KQ4j09K65j32j21M48n92M39k65O1O3p6J29jO4q7l17K14J8j99J00J02k7
6321dj4R1m7l5M3n4J68k4J48j55k9j35r1J67q5O1O0j72l9J94O6r9J93j42k11L63
6347B18m25L30l3n9j09j81l6M53k41K69k78p2J5K98r6q6L2K00j58j34J56J03n0
6370A16l06L01J6Q7P9k63J47k32k00R8oJ32j3J09j18n1p9K1M56l42J49j76P1L5
6394C1J01j31j19K90l62P9K56k5j6l90K91R9l9k7q4r2P9K52k97j9J89j57J1M2
6418c8k70L35k01J86j14L5K31j55M5k14J25j10R6P8L39n41k7M63j09j35L5k7J9
6441D6l66L07j32n5N3p3K35j78J78j22O2l37M34M6l16K06m1K5M3j9L7k3r7K33
6465A46l99R2K07k96L18j4j74K4K99j5k93R0Q8j37k3J42k09n8J59n3M1J56nr6
$$ y = [-67, -65, 19, -90, 175, 43, -78, 370, -222, 217, -48, 13, 76, 0, 129, 128, 192, 105, -212, 2, 20, -179, -79, 23, -4, -18, 73, 26, -9, 34, -20, 148, 124, 272, 117, 88, -47, -138, 29, -56, 5, 65, -107, -146, 48, 114, 15, 208, 66, -145, 218, -207, 123, 90, 31, -78, -259, -295, 158, -83, 186, -92, -164, -149, 149, 53, -33, -1, 199, 41, -93, 63, 166, 116, -190, 111, 127, 214, 293, 30, 177, -55, -255, -157, -163, -31, -44, 65, -53, -104, -183, -162, 294, -48, 101, -75, -4, 31, 132, 1, -118, 172, -190, -111, 145, 120, 104, -286, 5, 104, 65, 38, -46, -138, -59, 193, -104, -123, 66, -91, -80, -38, -308, 27, -174, 12, -102, -67, 164, 9, 54, -160, -35, -145, -49, 29, 368, -173, -200, 263, 154, 19, 54, 27, 46, -320, -13, -145, -200, -147, -220, 15, -163, 15, -107, -45, -382, 52, 98, -218, -12, -53, -28, 15, -4, 33, 10, -87, 146, -253, -161, 46, -250, 68, 54, -120, -96, 203, 188, -105, -15, 73, -64, -87, 55, -154, -212, -53, -106, -65, 91, 86, -10]
6489a0J55p5j69J6L15k16J85n63K41K00j37J33r0j37L67l44Q7J27l61M06l45J19
6511i6Q4J3j77L56l08rJ55k41L22m16J42K17m0q8J76q2M7k4Mn4Lj26J67O7%k77
6537a85K29j11N7j06J73j31K54k36j1L4m36N84k6p5j43RJ67K4k16k0K31J99j22
6560A43j25n2M8Q8j92P3j38m9J51m9J76q9K43j60N5J83l90q8q6K74k58P8K85J80
6584C01j46m6L5j74J24p9J6K8j65K44k22j21L56j14J25j75L6m1LRN3n7j55K5L03
6609A63p9K1k07j19K9J51n4J20K63k21m9J54k56L76l88J99j71j08J72n7J56N9
6631A54j27J7j9L2Jj40J63j14J42j69k93M22j45Q8K2K7r5J14k41m4K87j00M9n0
6655a9J34l55J87L11k14l9j89L90k64m2L25k85P1j39J72J03l6j86l5rr2J88j14
$$ y = [-10, 145, 70, -99, -83, 232, 16, 201, -362, -121, 79, -58, 75, -15, -152, 215, -129, -42, 85, -276, 130, -215, -96, -12, 1, -176, 180, -128, -137, 18, -223, 99, -317, -175, 42, 2, -86, 90, 8, 55, 31, 35, -19, -16, -142, 25, 92, 92, -185, 44, -67, -10, -116, 57, -74, 180, -56, -67, -33, -469, 115, 89, 14, -129, -120, 47, 71, -145, -165, 66, 265, 143, 18, -34, 14, 102, -90, -17, -155, -204, -53, -102, 74, -15, 228, 68, 123, 306, -84, -172, -258, 16, -242, -164, 121, 301, 155, 109, 144, -30, 94, 15, 31, 59, -106, 138, -84, -205, 151, 37, 162, -13, 23, -18, -15, -6, 47, -10, -165, -140, 163, 84, 105, -102, -221, -192, -41, -95, 25, 288, 67, 18, 172, -84, 292, -96, 103, -68, -176, -4, -61, 95, 154, 27, 44, 25, 57, 58, -82, 81, -33, 109, -60, -353, 69, -76, 12, 34, 61, -34, 80, -161, -205, 82, -18, 31, -19, 115, -240, -53, 258, 44, 5, -184, 206, -58, -100, 225, -60, 11, -128, 44, 147, 111, -75, -110, -119, -211, -23, -137]
6678a37MJ13J01k28L5K54q3Q7l6J5k12J92j84K69j87r7J76j44L09r2k88N1M3K22
6702A83l69M06q7n5l80J07J53P4L8J26j48j83K44k62PJ17J27j08J65P4k84K94
6724B39k8k0j12j68J54k67K8J01J50r7l85J54J72O5j53K24J22m57M75j07j75K
6746h3J17J19k55P1K2M6K6J30l29J01K39k35o4Q8M5Mj41J19j24L15m31J91K60
6769B31k9j36n3k24K85j15L13j46l23L06j5J03j69kj94K7K78j09n9R7J95k79q3
6792a01J6M38k38k69r5K15R8O7k80J22MJ53l6l36K43k78J54L95l60J53K07m15
6814a43Q1J57l82K67l4L3J08j10k11K13k3O0J17k20J4oj52J04K48o1j73K59k17
6837g1j06r6M84k89k60O31m35J50K31j23k05O7J31k67K1O5j62L50jRk19O7m5L48
$$ y = [-137, -133, -20, 81, -147, -112, 142, 59, 146, 110, 125, -87, 105, -79, 190, 3, -94, 82, -62, 247, 155, -133, -82, -39, 183, -186, 220, 133, 78, -302, -195, -42, 32, 70, 196, 48, -135, 109, -153, -146, -29, 98, -10, 155, 229, -55, 239, 211, 191, 79, -89, 65, -202, -174, -73, 77, -20, -405, -251, -79, -14, -167, 57, 179, -278, 197, 90, -85, -83, 34, 153, -102, -31, -9, 37, 63, 193, -136, -35, 204, -31, -95, -7, 38, 42, -99, 20, -104, 211, -220, -29, 231, 202, 66, 13, -211, 74, -41, 272, 126, -197, 109, 94, 197, 28, 26, -168, -141, 137, 28, -31, 66, 261, -18, -101, -85, 353, 115, -154, -249, -34, 64, 131, -149, -27, -23, 130, 94, -242, 1, -277, -123, 272, -88, 65, 272, -143, -62, 95, -287, -20, -54, -21, 87, -23, -234, -21, -44, 16, 133, -87, -73, -79, -231, -127, 121, 60, -113, 146, -71, -177, -273, 211, -78, -338, 293, -142, 8, 239, 116, -89, -22, 109, -158, -137, -72, -234, 116, 115, 124, -95, -28, -73, 275]
6861B75k36j07L5P3j73K67o5k04Q5J20J71l07J52j59LN5r6Q0J50k22J48j09J90
6884A26k14J0J72k23K51j01J18j84j18j47K34J15J00l68M18m0m4m7k54K79p8j23
6906a18oJ98K47k50j88P5J16j10l9j2J23P6J0k26J26m07L84q9J74k57J51j01K13
6929I0j32K16k27J65j82K34k04k9J22L4J61l55n4L74l46j21J34J88l0p5J33j44
6951d8K58k24J04k72L92k5m03K40k05Q0j9P5J41q6m4L03m56K32k20J25K17m4n1
6974G0j18M87n55J60j3j86m6qM08k68K62J65l31K9%J22j46J1J51l88J17n4j7L5
6998a13L62k12l2L6J23j98J69j18n2j27q6M42Q0k13l3K1J33l56J43K25j01J0k3
7021H0q9J12j29M5j76K40K37j57j83o4l5J83j58k74M91k35K72k74N6K52k51K83
$$ y = [275, 39, -68, -33, 40, -133, 134, 69, -135, -50, 70, 241, -66, 86, -73, -70, -15, -111, -31, 119, -103, 45, -64, 126, -88, -78, 94, -129, 122, 21, 139, -45, -163, -310, -76, 39, 139, -229, 189, 149, 105, 58, -196, 83, 5, -118, -124, 74, 321, 71, -117, -42, 74, -36, -75, -87, 36, 112, 122, -104, 22, -385, -1, -90, 84, -173, -22, -123, 90, -42, 174, -53, 112, -70, 164, -40, -69, 53, 87, 248, -107, -161, 213, -133, -254, -120, 68, 38, -37, 96, -48, 210, -14, 90, -182, 210, 185, -218, 22, -183, -103, -122, -47, 94, 8, -36, 267, -189, 43, -177, -52, 165, 121, 70, -48, 439, -116, 44, 31, -155, -201, -209, 199, -69, 193, 358, 27, 56, 56, 178, 32, 43, 194, -194, -77, -131, -148, -113, 249, 37, 5, 41, 164, -34, 135, 17, -35, -162, -248, 194, 274, 61, 28, 49, 182, -174, -31, 194, 93, 103, 80, -9, 103, -26, 19, -157, 83, 320, 163, -20, -84, -119, 64, -94, -368, 123, -112, 160, -114, -58, 194, -57, 226]
7043B26j92j40J46K6Q4K03p3j37m99M16k08M88k22j23n8J14O8k83J41q2K22k7
7065I0o9RJ37r0k23K12m6K7p1j12K29J2k43n8J77pj17J19J37j05o2K06O2j88o7
7090d1j97K97j68L3J2j58M34mj85j03J67m3j96J35L9k8J63j11J31L3k69J29K6
7113I6l29K85k21K16j35L2K15q9j71L6J05K6L9l91K66J03J45k18Qk39M09j56M2
7136G4L3O0k72m6L09k39K19m76M55j05L1R4l26R5qJ2K06k07P5r5J07J03j75l15
7160c91N45L1l9k53K50o2j10O7k12M76k99J20k7M1k00M4J59ompj51J26n0M5j36
7185d3lJ01k39J68j07R5Q7k7N8r1k56L71l8k12m4O6r4L96j05j97MJ76J35k95K94
7210B00r5N4k09P8k56J06L88k68O6p8j34K04l4o6R2P1l27m2M55l70Q1K69j82k87
$$ y = [226, 34, -106, 40, 66, 150, 353, 280, 143, -356, 60, -148, 340, 118, -5, -63, 51, 119, -164, -23, -105, 117, 90, 21, 30, 167, 77, -146, 66, 20, 47, -24, -136, 93, 105, -138, -196, -19, -26, -143, -24, 113, 8, -54, 152, 214, 26, -41, -238, 59, -109, -76, -64, -222, 212, 208, 23, -80, 87, 44, -152, -17, 22, -6, 157, 46, 177, 210, -59, 70, 96, -233, 52, -169, 47, -88, -56, 159, 70, -101, -65, 40, 66, 105, -286, -20, 83, 228, 10, 18, -221, 188, 32, 74, 107, 167, -105, -151, 158, -81, 138, -338, 117, 12, 43, 137, -189, -94, -102, -90, 116, -91, -16, -111, -4, 99, -76, -391, 154, 185, 146, -107, 143, 81, -29, 38, -174, 302, 3, 123, 96, 137, -63, -19, 140, 134, 130, 123, -28, 98, 48, 93, -43, -46, 55, -184, -16, -123, -28, 59, 32, 90, -1, -257, 114, 76, -136, -180, -114, -208, 188, 83, -114, -110, 66, 201, -94, 200, 105, 159, -50, 28, -228, -122, 266, -2, 64, -14, -148, 56, 22, -44, 48, 119, -208, -250, 205, -165, -84, 185, 3, -284]
7234b84N66k05j17K7j80K64k9j84J33j07J02P7k65L62k8N6Ro0q7k6J15l48K01
7257hL0j76R7R8j36J92j22O1j02J77o6j16J96r5j19M52m81M00j11j12j01RO3j88
7281a58L06j99K63k58k62O38k56o9j28J41j06J3R6p6J90k09j67L44j15J13k71
7302a70J91J01k32O7M5J09k39K91K7k94qL57k40N0J24j55j08R8p7K12k16J97J91
7325C21l26j60P8K65j39j95M59k09j3L8r7J57p3j28K1j10J03P0j1k30J89L6j74
7348a28J68K28k96Q6L1L6l03N6L21k07jK72k81k00L72k60J57Rj23l4l0K91q9M
7372G9J71j11k20J7j2K33m43J08L25q5L58n38j77J87J72J94j55j24L6O2j72K02
7394A07k71L46j29Q1L40m34R9L1k38J59P5J5j96R4k9j41J95k61q5k1L76k75j5
$$ y = [-284, 282, 77, -40, -13, -193, 71, 42, -142, -9, -116, -14, 63, -202, 160, 132, 188, 197, 137, 50, 24, 139, -209, -8, 22, -154, -57, 41, -95, 97, -25, 36, -66, 111, 45, -71, 125, 30, -89, 363, -118, 282, 171, 59, -42, -33, 30, -158, 148, -51, 212, -46, -308, 330, 74, 5, -123, 18, -88, -75, 21, -55, 135, -74, -241, 103, -12, 101, -170, 21, 122, -110, -43, 2, 111, -128, 163, 190, -104, -112, 245, 5, 55, 179, 24, -84, 14, -63, 149, -67, 130, 321, -5, -165, -87, 178, 39, -156, 303, 94, 81, 119, 22, 179, 106, -22, -1, -111, -8, 62, 51, -179, 10, 46, -128, 40, 268, -28, 58, 89, 125, -178, -122, 199, -8, -9, 263, -18, -218, 154, -106, 51, 60, -63, -97, -127, 164, 75, 79, 250, 139, -81, -64, -76, 157, -286, -178, 147, 62, 420, -118, -295, -108, 64, 258, 103, -21, 15, 77, -95, 107, -164, 182, 53, 134, 474, 40, 139, 170, -68, 91, 166, 181, -15, 79, 50, -91, 104, -157, -242, -263, 113, -162, -177]
7417a77K88jL4j58j86J95K5M8J57j38l17M78m40M84l56L28l30Q4P1Jl88L87j32
7440d3L43k31k6j98K73j81m3J50j1K54m55L40N4k43J83k43J8K6K16j35j43rK9
7463g5R2p1RoJ8K9P5J82k85J19J95p7j07l5j15l7j25K32J93k19K02qj33q4r6J1
7489a16n9J13p5J84r5J59j1j51K80L6j62j15k68N31j79K37l59k04L59M9j45j18
7511a09Q5K28j47k01l1K83P2k02k35K42R2J23pk87J59j28N7R5n6l15L04j18L23
7534B27j69k73J83l28L64j08R2K9M3J47k72J68j94j06L01Jr4j06J79K20p9k13
7556A2K7j88J96J60j71j40m6L58l02o1N5L54k01j8N3j58Mn9K19n7j80K55j19L5
7580B8R2j4k7l08J69j37J72p9j34J91J84k24J62j70P3J94k2J8l1K0j27Oj30L37
$$ y = [-177, 111, 110, 144, -14, -200, -5, 20, 68, 225, 87, -230, 248, -192, 292, -64, 264, -66, 18, 89, 90, -298, 89, -43, 300, 69, 43, -155, 118, -63, -106, 44, 33, 287, -168, 172, 226, -17, 166, -77, -59, -33, 183, 48, -95, -104, -75, 17, -54, -45, -51, -33, -4, 71, 253, -32, 87, 282, 205, 98, 63, -52, -89, -214, 18, 211, -8, 194, 186, 53, -31, -127, -116, -175, -62, -137, 47, -48, 111, 100, -51, 229, 265, 103, -12, -280, 251, 72, 309, -50, -254, 105, 154, 9, -109, -24, 204, 57, -144, -175, 108, 180, -22, -257, -15, 77, 200, 193, -94, 65, -63, -6, 89, 33, -282, 22, -96, 227, 58, -215, -32, -360, 4, -104, -12, 17, 60, 207, -65, 103, -91, -197, 104, 105, 11, -95, 84, 304, 225, 12, 39, -149, 47, 207, 36, -104, -150, 208, -94, -155, -100, 254, 53, 35, 88, -70, -66, -125, 94, 37, -143, 112, -7, 28, 120, 106, 79, -229, -60, -197, -25, -104, -238, -47, 137, -87, 75, -95, -22, 172, 150, 168, 137, 157, 30, 36, -94, 243]
7604B43j65p0j0J52k64r1jK12r9M10l55L06k16j78K92m08L7O18m30J57N5l21J38
7627A2k13K61N5n7j81K64j66K23j14k57J81l34L52p2K48k2l03K81k4k09P7J64
7649A66n1l14J03J10Q1j47P6m6q0J47J61k83K18n4k18Q9m8q0l5J52J45K8r3Q9
7673A16L1q2k09J58K60j34K9l12K15k39R7o4J45N7j95L21k06o7PJ59l3j39K7J42
7697H4l14L13k36J91K38k33j76l7K22J84m6j21q3O5M6p1J97k95O3j72L38m6l61
7720b50K79j68n3J53L24l32j15j1J08J04j32J12O7l8l31J36J33J87k13J24n0k31
7742a97K41J4P3k64J89R9p5j04J58K8j20j5K63k49n7m6Q9J54k32J82J0q5k84J06
7766a22R7j53J86N1n7J02J62k30J7rL8n5k24L38k53j15L55j29Q4K8k23J2J65j23
$$ y = [243, 78, 8, -2, 150, -114, -205, -206, 6, -93, 317, -38, 268, 52, -126, 166, -242, -205, 413, -17, 140, 195, -126, 12, -201, 60, 115, 58, -123, 141, -25, 198, 84, -173, 8, -326, 26, -46, 202, 180, -123, 158, 134, -75, 2, 166, 115, -199, -96, 14, 95, -52, 24, -22, -102, 45, 206, -77, 141, 87, -131, -42, -90, -170, -205, -53, 92, 120, 27, 116, 147, 65, -144, 14, 274, 140, 169, -143, 72, -167, -70, -134, 11, 68, -127, 194, -12, -79, -72, 87, 54, -85, -58, 84, -230, 83, -153, 38, 276, 43, -133, -170, 52, 236, 190, 69, -14, 51, 97, 26, 223, -72, -9, -181, 157, 111, -250, 29, -139, -192, -39, 285, -47, -162, -173, -65, 39, -93, 19, 86, 48, -283, -147, -14, 173, -40, 84, 34, -197, 44, 58, 131, -133, 56, 155, 80, -24, 134, 162, 42, 27, 290, 41, -16, -62, 27, 181, -51, 131, 141, 56, -228, -122, -25, -178, 8, 59, 2, 104, 266, 36, 53, 44, 82, 27, -197, 141, -112, -227, 128, -1, 83, 111, -112, -100, 65, -58]
7790e8R2m4J70k32O0P7j77P1J0K50k10j75N0J97p0K25k30J09j44nJ5k04L22K8
7814A27q0o2N7j53J58k6M45m69K78j03j39K44l51j53K55k80K20j33J68J7J97n0
7836A67k38P3J73k56J82k41j27Q6R7K3K71j41l19Q2J82R1j02J3J19r8j8j35K36
7859A20j80M0J0k8J31j58o6J47J64l42J42O1Rk18J84P3m6j35J20p7J04L1k28R8
7883d4R5r1K94j48j48lM51j76qk04Q8k16J22n3N8m08M19k1k35J2K56m1M9Kr8j64
7909b12M67k14l06L05P7j5j77K3L7k3K21j51l6j87J4K93n8J03L0m38J53J89qo4
7933B3r0M4Q3J76m85N18k82o1K03L3l28k4L95j35O7k12K16j38l4n0K6N6r0J35
7957D6K8m12K04L01ml3o6q0K27r7j56M0J8j98K75o1K1J37k90n3M6J11P9j91L20
$$ y = [-58, 34, -10, 160, -72, -12, 65, -112, -41, -31, 219, 9, -166, -116, 81, 11, 236, 6, 115, -29, -34, -19, -223, 99, 127, 47, -15, 42, -111, 47, 21, 466, -3, 275, 172, 33, 277, -74, -227, 28, -252, -32, -165, 3, 20, 217, 167, -71, 2, 175, -81, 101, -140, -267, -181, -84, -61, 210, 69, -250, -168, 14, 105, 3, 16, 135, 37, 19, -116, 120, -60, -20, -10, -38, 93, -65, -131, 16, 180, -162, -20, 41, 50, -168, 16, 89, 43, -92, 28, -49, 55, 86, -142, -44, 51, -40, 254, 106, -42, -45, 406, 230, 222, 18, 106, -110, 12, -41, 17, -391, 28, 7, -228, -216, 40, -1, 48, 50, -48, -212, 255, 41, -265, 40, 117, 102, -75, -52, -15, -38, 183, 32, -4, -191, -177, 116, 58, 161, 191, -247, -94, 95, 87, 23, -67, -23, 60, 236, -249, 269, -13, -74, 129, 162, -166, -190, 205, 70, 137, -75, 141, 3, -31, -81, -55, 1, -89, 46, 74, -338, -134, 167, 163, 130, 64, -16, 211, 114, -42, -2, 16, -182, 93, 32, 53, 190, -100, -153, -107, 4, 83, -108, 212]
7982B12j99J24l96K96n9n3L13l41q5L51J67l65K28m93L76J28k33N3qk95R3L28
8004A42l4Q7N5j19l05J11L27l93L81j82M1j80j08q4J87mK20j82j82K23k20K71
8026E2r8R4K89m67J89l15N84m93j44M6K98j78J28j05J87j28o9K89N3j34oK0N6
8049A48j77n0J95j97L07j78j57J61J05k53J0R1K7k5j39L67l39K10k94L71j59k28
8071b04J92j3L49j46k25k50M88k49N4J47k68o6L92k00J87q9j83q4K83k88J49K30
8093B06k68O2K28%k45J60j04r9j76K57J7R0n14M06m9Q1l3J02j4J58j94k77K41
8116C5J1J58l38K34Ll20O9J85p5j84j7N9J20O0N6K34k54j12k8K75l04K58k01K55
8140A79j57pp6J21J61m38J39K70k08K67m14K43j77qK78k46J51L8j70q7J35Pj09
$$ y = [212, 13, 137, -259, 37, -22, -75, 238, -103, -188, 163, 330, -35, 193, -300, 76, 204, -29, 24, 16, -279, -186, 142, 108, 195, 250, 131, -174, -63, 264, -129, 252, 70, 111, -69, -177, -261, -74, -78, 142, -40, -222, 1, -219, 52, -46, 48, 337, -130, 59, -256, 328, -165, -309, -263, 35, -143, -15, -120, 67, -61, -130, 159, 212, 78, 72, 92, 148, -29, -79, 116, -81, 226, 48, -109, 52, 157, -96, -86, 5, 32, 7, -132, 235, -104, 106, -188, 183, 24, -204, -12, -25, 324, 178, -47, -297, 191, -58, -4, 143, -125, -191, 201, 1, 188, 99, -84, -168, 115, -173, -24, 206, -62, 0, 228, 228, -17, 143, 39, -60, -236, 21, 38, 128, -386, 20, -29, 52, 19, 121, 107, 265, 71, -206, 35, 46, 204, -134, 100, 103, -217, -148, 37, -38, -222, -239, -180, -60, 0, 56, 290, 36, -76, -104, 171, -133, 125, -76, 179, 22, 15, -61, 60, 221, -217, -78, 192, -16, 251, -163, 80, -97, -105, 173, -73, 78, 116, -54, -141, -6, 1, -108]
8163a08p4l3j17L84j18k0J94m7q9K8j89N51m13K40k43o7L71n94N25j40k02K9n9
8186a91r3L97R4k63j36
$$ y = [-108, -182, -215, -332, 52, -66, -86, 108, 61, -28, 0, -189, 362, -51, 189, -54, -121, 250, -344, 181, 41, -161, -132, -191, -284, 113, 207, -56, -192]
8191a92
$$ Imaginary data points
##PAGE= N=2
##DATA TABLE= (X++(I..I)), XYDATA
0@%%%%%%%%%%Qj6J6j6K0k8L2m0M9n7P2q8J04j27J51j76K05k36K71l11L59m09M64
33B47n27N94o67P52q45R46j057J177j308J452j610J780j968K175k398K643k915
50a529L211l536L899m301M749n253N822o474P229q112R164j0441J2030j4073J6811
65I196k0693K6670l7177O1134k19589o7024J85637j27380J10590R8712m1609o608
77b8141P1142n6698L1453O7814k6589P321J12657M398l1679K188k4705l8277k2036
90F8848q2216l8441J2841m5552l2242N1332k110k3952J5101j6828j3501K7191
102g9529l9103j7684R4920N1851l63P8645M4039k7422K1768q581o2043L5746J6965
115A09209j01737j036P7776n1440m4219M5448l1810n4858N676n3722n2035M9960
$$ y = [0, 0, 0, 0, 0, 0, 0, 0, 0, 0, 0, 8, -8, 8, -8, 12, -16, 16, -24, 25, -32, 40, -48, 56, -71, 80, -96, 109, -127, 144, -167, 192, -217, 247, -280, 314, -353, 399, -446, 500, -557, 620, -688, 764, -846, 934, -1034, 1141, -1257, 1386, -1529, 1682, -1854, 2045, -2256, 2493, -2760, 3062, -3412, 3817, -4295, 4869, -5572, 6458, -7615, 9196, -11497, 15173, -22004, 39130, -180459, -247483, -61846, -189226, -78636, 20076, -21533, -28141, 43001, -13697, 17756, 85570, 58981, 66302, 178959, 183357, 151678, 153866, 129161, 90884, 68848, -13368, -51809, -38968, -84520, -116762, -65430, -67540, -91492, -76391, -93219, -106720, -79529, -118632, -136316, -41396, 10455, 10092, 88737, 132776, 105354, 127122, 118541, 56498, 92244, 109209, 7472, 6436, 84212, 32772, -11447, 34001, 2191, -52667, -46991, -100713, -152748, -102788]
127a02788P267l9052N9316O6710j3334O766L2200O660O663m031o620M3350L1597
140I4704j7562J2603K1253k7043k5164j9599l3357l132j2410n4190l957L2417
152c5437k4267k0565K7529K929j0391L942j6599O706M7054K693n109O2334L7400
165G8219k4608O931K1050j1990o713r883k3682J0884R139l7361j5490J6679k0919
178g744l8218p554J853l314p070j2053J3799L0287P04m615K5880J7924l474J336
192G741P643J6505K1177l987m731K4760M903l3044j8086j095j3285j6820j2245
205b0564n742Q862j328k3568l140J7761p810j9946O041J8705J0915M565P060K1976
219A3787K2170l370r531J2184R514j5478j4302N902J1993j024j2483l749O487
$$ y = [-102788, -95521, -134573, -75257, -8547, -21881, -15115, 17085, 23745, 30408, 26377, 19757, 63107, 94704, 77142, 89745, 110998, 83955, 58791, 39192, 5835, 2703, -9707, -63897, -67854, -35437, -59704, -80269, -52740, -49811, -60202, -56260, -72859, -66153, -19099, -16406, -21515, 40819, 78219, 53611, 60542, 81592, 69602, 62889, 53006, 29324, 40208, 49347, 11986, -3504, 13175, -7744, -45962, -53516, -51663, -54977, -62047, -74100, -60301, -30014, -29310, -33925, -8045, 9879, 6405, 7741, 15384, 31889, 53066, 49079, 44348, 69108, 74011, 40967, 22881, 21786, 8501, -8319, -20564, -26306, -17444, -18772, -42340, -45480, -27719, -35529, -55475, -49434, -30729, -19814, -15249, -8189, 13787, 35957, 32587, 23056, 35240, 44754, 29276, 14974, 20876, 32869, 31845, 19362, 15613, 22100]
232B2100j0237k9205j6446K666l896j2068j836J5997J8996K922n479R771J4674
245G959o549j4572M740J6714N825j795R068K1663R771j3595j4796n14o492k3298
259e871j8053O898J0966k846o007O632R695p992k0352p338P588J647p838N893
273b6978K5487J8353p52R1J2768N217j5250j7363P39Q656l670p786R943J8097
287B7552p23j5993q155l04j0756k0410r852R265J2243M12O58J4455J4331n804
301F919j3089n20O514l299j0008M410J9785J2167n496l04J2288O70j9617j6619
315f199J270L126r484o937J2598J6330j825j0729l83L849q162j7013m691J1949
329a6301R272k854K581J7579J1104r187j0327L745L627r363j0441M712J4311L892
$$ y = [22100, 11863, -17342, -33788, -31122, -35018, -47086, -48922, -32925, -13929, -11007, -16486, -6715, 7959, 1410, -13162, -8422, 8292, 14117, 12322, 21390, 43053, 52824, 39229, 24433, 23919, 17427, -5871, -23924, -17026, -6060, -8906, -14913, -8281, 1414, -6578, -26930, -34268, -26680, -25033, -32871, -26978, -1491, 16862, 16110, 16201, 28969, 34186, 18936, 1573, 2312, 10968, 7298, -488, 9455, 27552, 26829, 10836, 2681, 2377, -8379, -28789, -38641, -29376, -17133, -16721, -16063, -1608, 12723, 6919, -6170, -6690, -176, -3475, -13483, -9073, 10712, 22879, 17383, 17079, 29367, 30037, 10420, -6199, -4929, -1803, -11287, -18224, -5626, 10704, 8879, -1850, -2233, 1616, -6546, -23559, -28250, -16301, -7029, -9883, -7302, 10277, 21381, 12194, 1867, 5612, 9239, -124, -10565, -5853, 8458, 12350]
343A2350p040K850J2114j780j7199r535M596L54j1020m910J2549J2318l781q012
357f146M828O904q324j3742R21J1773K992o822L820J4907N437r983n595P580L434
372A1984j0175q149P630R800m576q201M758Q586m685j2759k781O660j040j0553
386a3501k774J1035O721p245m906Q309O355p116o821O555J0867k83o667K902J1229
401A4660J42j1784l535R616K370j0615m429R167M351r791r593L053N314o320j1363
416a8757L010J2699J29q770M055J2910R30r309j396Q035L777n903l226R944J0917
431A9045l143q622K297N671q681j4877q14P005k266p700J497J0394L332q079p428
446a2369L314M644p653q306J0119J5514o9l188R839J0654l881j0728m151L340
$$ y = [12350, 5310, 8160, 20274, 18494, 1295, -8240, -3644, -3290, -14310, -19220, -6671, 5647, 1866, -6146, -1318, 5586, -2738, -16480, -15559, -3786, -794, -7616, -3796, 11111, 16548, 6565, 970, 8550, 11984, 1809, -6340, 1290, 11090, 6514, -1687, 3071, 11657, 6972, -5787, -8568, -1908, -2948, -13501, -16275, -5240, 1481, -5764, -10670, -2361, 3994, -3122, -9943, -3388, 7479, 7196, 529, 3431, 14660, 14802, 3018, -517, 9099, 11469, 854, -3575, 5592, 9943, 152, -9441, -6388, -1074, -7394, -18757, -15747, -3048, -2919, -11689, -7634, 5276, 6206, -3103, -4499, 3536, 7313, 1410, -1816, 8128, 19045, 15902, 7280, 9577, 15248, 6567, -8310, -9124, -2119, -4385, -12085, -10588, -194, 3138, -4941, -12369, -9055, -4411, -12064, -20370, -10251, 5263, 5194, 2006, 11845, 22499, 18618, 7890, 3739, 7079]
460G079P82r703m776J2047R110r156p083O013R3j4285j1640J047N416L82l657
475a8331N976J5710O636o903j480Q022k98j1599m412R885R791j260j515P688O053
490B3963o600j2996o850j05n033j3141l068J3908P831p288j110R748J622r418
504h537p019K368P357J207l459R961J9820L931r997J796P084p377j4731o802M049
519c49L268n140l667Q174O178j1026j1552J245K594p536r902K622J3964P682j560
534e005P034J3676J529r213k357L840K335m430n226N972J3153r14j1232L01K794
549A2257j1676j5317l157L826k10n494j038J0463Q496n702n002P445P211n001
563b899n606O592J1557J150l970P890J1901k070j0863m577J030k678q727p946
$$ y = [7079, 7861, -1842, -6618, 5429, 14539, 5383, -1700, 4313, 4406, -9879, -21519, -20472, -15056, -14674, -18331, -12355, 3355, 9991, 3088, 1608, 9630, 9332, -2267, -6679, 3206, 12997, 11737, 10222, 17910, 23963, 17363, 4367, -2483, -2588, -7621, -20762, -23830, -9922, -2091, -9379, -10489, -741, 881, -8537, -15556, -13188, -5831, -4624, -8083, 1878, 21698, 25629, 15632, 17428, 24512, 17135, 2404, -4398, -349, 2919, -2221, -5888, 2286, 8464, -2562, -14114, -12869, -10275, -17811, -27713, -25091, -11127, -3445, -5005, 2029, 15705, 17234, 8021, 5664, 9504, 11839, 7409, 2183, 8155, 21308, 20394, 9162, 9463, 12257, 581, -14736, -17893, -14067, -14277, -19771, -20809, -10346, -1850, -7552, -12554, -5109, 2102, -2899, -8505, -1913, 9644, 10794, 6824, 14714, 26615, 24545, 13682, 9105, 10135, 7457, -1270, -9216]
577i216M487O957p604q985O932M100j1019o862L965M704K658L88M11R899R232
592A0047n951k050J3512N053j0156l690O221J385m942m114K73L448j872j0919
606c755n280N250j747j2352k731J1093L551q137q10R278L272l012M53O000P502
621H575K673m903N86J0820j73j3090qJ0199l504r316J54J484l608m306n820j220
637a1457N918l465j1433L798J2320j925n402P870Q658r14k937J181L422L667k618
652F683l528P311R256n432r561L356L290j0589r812J594K448l928l467R16N650
667e813L928n487m775O439O075p635m542J0484P254k399K085P912M439j437o614
682I914n012J454k91r101m310Q905L888p722k845M886q97q535n954J460L719R67
$$ y = [-9216, -4729, 2228, -5376, -14361, -7429, -3329, -14348, -21210, -17245, -12541, -9883, -9495, -9084, 815, 10047, 4096, 2046, 15558, 20611, 10455, 6765, 12986, 14371, 9429, 5315, 5588, 9036, 7164, -3755, -9035, -3785, -5532, -17884, -20615, -9522, -5971, -14108, -14918, -5640, -2368, -5380, -4927, 1073, 8575, 11248, 6345, 6931, 17751, 17578, 4488, 4480, 14679, 11175, 1859, 2013, 3497, -111, -4417, -10237, -11457, -5539, -9004, -20437, -16639, -4319, -6244, -11646, -3776, 4882, 3968, 1031, 2212, 5634, 9301, 6683, 3155, 10466, 19722, 14290, 4729, 8085, 11375, 786, -9026, -7432, -4984, -8912, -12379, -11463, -5813, -1885, -7372, -12147, -5708, 367, -7268, -11810, -1326, 5928, 3529, 5614, 13526, 17965, 16528, 9914, 4902, 6356, 6065, -3036, -7346, 1559, 5447, -2275, -5120, -234, -1131, -9666, -15620, -14160, -10441, -9474]
698i474k328M009J1645N117n009K41Q591j493r595k223N851K139k448r56M279
713H346N217l745j0535k629K536p203j0044K246Q682J199k934L392O930K220n362
728a684m341L295M090k795k426P409R562m0m909K391M525n313j0153l202K287
743a304l53m979j138N871N172m367o422K746L258o887o805M477P477J632p55M206
759A829Q184K329o411l343M529L98p537k826O117M548l222l769K522L202m742
774A808r088o73L992k087n902J462Q148L062k780j067N167L400n845m914M061
789a256N479k310k790M545O740m59o955j520M391j529q574k198N751J761m480
804c404k211M729M213m438n575K654N173k943n867L077O683j5l492R67O021J941
$$ y = [-9474, -11802, -7793, 3852, 8969, 3960, 4201, 12792, 11299, 1704, -519, 5332, 7471, 5023, 4067, 8346, 13563, 9818, -717, -3346, -810, -8013, -18057, -15811, -7129, -5930, -8864, -5472, 1458, 3678, -1684, -6025, -2730, 1360, -1435, -3861, 3548, 13110, 13070, 8161, 10552, 15077, 9764, -389, -3591, -1304, -1657, -6636, -7774, -1903, 3269, -1098, -7520, -4774, -1516, -8403, -15208, -10731, -3254, -1622, -2377, 1829, 10013, 12342, 5931, 2588, 7117, 7515, -22, -2848, 3269, 7817, 4595, 826, 3348, 6550, 1808, -7280, -7953, -3961, -6048, -11950, -10488, -2340, 722, -2058, -3125, 2042, 5442, -403, -5317, -1256, 4223, 1913, -877, 3668, 10408, 9949, 2994, 1474, 5865, 4336, -4238, -6436, -685, 1076, -3404, -5615, -886, 3327, -1111, -6686, -4032, 1141, -1802, -7669, -4592, 2091, 2076, -1416, -449, 5572, 7513]
820G513o132l685N139K513n641l375M756M086l082m474J610M543j428o466J06
835d017N725j68o006r88N045K616m260k398M723M782l949n106L005M316k416n206
851d302J385O522J37m654l60N946J324o092k467M760J850n830l095M009M437k710
867H60l844K379N018k341o696l26M009l89m591J45O357L718l179k671L455L518
883E422m513m812K501M920j474l738K367N896J10n535j796L955l37o986l606L951
899c675L719l101k596N242N117l115n735R30L818j740n592K135P452K647l473
914B033J19N542J241o409m529K637J850l829l733L124N486j120m705L34L491j654
930a22p028j670M369J701k390P86O190M923j590l697J232L706l480o181J656O347
$$ y = [7513, 1381, -2304, 2835, 5348, -293, -3668, 1088, 5174, 2092, -2382, -772, 3771, 2343, -4123, -4017, 1708, 1540, -4466, -5454, -409, 2207, -2053, -4451, 272, 5054, 1105, -4001, -996, 3320, 904, -4302, -2917, 3605, 3742, -912, -1272, 4674, 5998, -94, -2561, 2199, 4049, -1781, -4876, -867, 3570, 860, -2984, -605, 4413, 2072, -4624, -4950, -941, -1330, -5921, -5776, 581, 4299, 1120, -1551, 1904, 5422, 909, -3903, -1402, 3518, 2044, -1694, 673, 6569, 6679, 1144, -652, 3303, 2966, -4020, -7626, -3675, 44, -3057, -5653, -411, 4706, 1591, -4144, -3214, 604, -1136, -6728, -4593, 2859, 5506, 2033, 2152, 7694, 8935, 2526, -2003, 634, 2484, -1345, -5078, -1954, 3532, 2412, -2293, -1959, 1532, -122, -7150, -8820, -4451, -2750, -5140, -4354, 1836, 6759, 5169, 1472, 2704, 6410, 2930, -3251, -1595, 4752]
946D752Mm007J392N011r30o429l814J452Q54n507m022M724O233k052k930M628
962f41M580k527m511R58L639K95k864P95O565M451l664l106L243Q82p000n628
978d533J916K170l204l023K159M093K95m665k011L616J422n377j503O308M481
993B144k537M42N866M315k170l299O9K369r33o360j118N670Q20o895o31M850k297
1010C05o674k583K358J018k147k249K363O636O65l330L002O777r50m793K178M895
1026G471p8k985n86L000K281k456m613R7K186m619p482P65M083l142m556K532
1042h102M260r0k431J4L441L346j494k055M742N715k268l060N583M421l446l267
1058E309O77J317k627m779k893J700J125n177k912M479J919n267l132L597J963
$$ y = [4752, 4756, 749, 2141, 7152, 6222, -207, -4021, -2569, -1715, -7222, -11244, -6520, -287, -2339, -5269, -641, 3939, 1412, -3099, -2141, 1498, 1793, -1071, -276, 6289, 10740, 7076, 3970, 7213, 8095, 1095, -4533, -2617, -447, -3651, -6674, -4515, -422, -127, -4792, -6803, -3187, -1765, -7142, -8645, -2337, 2144, -393, 49, 5915, 10230, 8060, 4761, 4830, 7199, 6266, -94, -1212, 4458, 5278, -1617, -2248, 2602, 305, -6369, -8952, -6594, -5576, -7723, -9972, -7609, -973, -308, -3638, -636, 6141, 5191, 398, 2576, 7471, 7393, 4408, 3822, 6822, 9103, 6647, 2034, 2131, 4317, -302, -7784, -7019, -2936, -6078, -10634, -8102, -3842, -3932, -6363, -6349, -2908, 438, -1056, -3111, 1631, 7346, 5078, 2018, 7601, 12022, 8576, 5309, 5986, 7303, 4676, -103, -2996, -1296, -171, -5348, -8260, -3781, -1862, -7129, -10261, -6664, -4701]
1073d701j480p96L255M710J878j610J375N820K056m588j696L974M58m796k901
1088I58K555J070l399l358P61J668k494o722r08L656j14l943J124O532K713k103
1104b004Q49M670J704k541j388L008L779j491l470J578M401j418n363n06J310
1119C118l168n595k087K222R41l017j133M083L982j812k672J992L147q10k617
1134c426L101N988J252k452J218L895K79m546l250P55L32l870m054J898L014k460
1150b326l755J595L275k246m861J51L865Q92j718J804N582L689j314j225K868
1165F276K464l411m187J628L060k396l680J586K218j772l760k312J421l57m415
1180g637k958L831L518j604q37N105M032j428j804J165K947j88k906O60M887J663
$$ y = [-4701, -6181, -6977, -3722, 988, 2866, 1256, 2631, 8451, 10507, 5919, 4223, 8197, 8655, 3859, 958, 3513, 4583, 1184, -2174, -1413, 255, -2239, -8961, -9869, -6213, -6327, -10270, -9146, -2614, 99, -2004, -1155, 3515, 5219, 2678, 1290, 4298, 8077, 6586, 3116, 4694, 9095, 7677, 2314, 1808, 3118, -50, -5645, -7732, -5510, -4569, -7586, -8719, -4636, -654, -2466, -5138, -3146, 1, -809, -3426, -325, 5663, 6915, 4463, 5681, 9576, 9855, 5309, 2059, 2814, 3146, -724, -4778, -2880, 134, -2326, -6081, -4486, -1211, -3457, -8318, -8167, -4302, -3410, -5128, -3324, 2258, 5947, 4633, 3408, 6276, 8740, 5329, 1142, 2770, 5830, 3434, -246, 1340, 3558, 1786, -1974, -4286, -2865, -3222, -7637, -10595, -6764, -3246, -4850, -5687, -582, 3450, 2022, 218, 1383, 4330, 4142, 1236, 1896, 6783, 8446]
1196H446l809j618L035k56n278l644J298K91l667k733J856L045m52k349J145M123
1212e67L05l949j39M987J662k456J610M726K015j816j809O62J260k152n448J0
1228a099L050j505m170L18K716o49l710j107J586J498k174k545L566M519o68j229
1244a603L906M250o55l336O94K684q40m214j74L392Q51l112k499J794J176m026
1260a712m606J249K573k619k895K617M273k59j745J454L416J502k745j434L236
1275B305K496k982j112M193K012j977k887L61R80k010n239o67L254m75l470M61
1291d757L702J191k809j647K693K127k317k403L169L831o67j737K348L562l89
1306E897l619q77K382r54m754j114L336J002k333j459K203J503k548l256M06L044
$$ y = [8446, 4637, 3019, 6054, 5798, 520, -3124, -1826, -1535, -5202, -7935, -6079, -3034, -3486, -5835, -4690, -567, -262, -4211, -4350, 637, 2299, -157, 1453, 6179, 8194, 6378, 4569, 5231, 6491, 4339, -1109, -1099, 1951, 446, -3724, -3406, -690, -1339, -5049, -6156, -4570, -3072, -5246, -7791, -4225, 294, -374, -1603, 2303, 6553, 5898, 2562, 3256, 5940, 5100, 886, 712, 4104, 4955, 1843, -656, 1138, 2314, -1712, -6318, -5069, -2496, -5115, -8010, -5393, -1120, -1379, -3124, -1670, 1746, 3248, 503, -931, 2305, 4801, 1819, 707, 4900, 6912, 4935, 2048, 2409, 3389, 1379, -3860, -4527, -1273, -1748, -5218, -4757, -1055, 136, -2673, -4320, -1627, 500, -1817, -4220, -1051, 2780, 2113, 376, 2724, 6286, 5897, 2278, 1401, 3783, 2829, -1925, -3039, 297, 1299, -1034, -2493, -290, 1213, -1335, -4591, -4185, -1141]
1322a141j092k538K245M193Q10k102N55K774O37k852k240J762K070k223k644K867
1338A081K465j736k512l27K010j207m280p32L304J122k405L90L970K063k423k135
1354a352J902K446j975k850J540L615p16k838J406K588n32l582j437J685L89l418
1370c129j758K807K690j615j337K093K440j460l099M57K764K09k669J215L462
1385C070Q61k376r68K056J045l059k815R89K313j844k799J831L201q13l148Q27
1401a629K146P9l492p34L124J627j883m41L299K158k023k451R92K022j569l238
1417b013R30L037p60k351L29K016M84k387j781J639J046k219j961K222K789p53
1433B67j606J698K912q67l134k63K428L0k485o73L179J223j771j291J257J607
$$ y = [-1141, -2233, -4771, -2526, 1667, 2477, 375, 930, 3704, 4341, 1489, -751, 1011, 3081, 858, -1786, 1081, 3546, 1810, -702, -1029, 981, -226, -4506, -5238, -1934, -812, -3217, -2827, 1143, 3206, 783, -1352, 550, 2996, 1021, -1829, -289, 3326, 2610, -228, 1178, 3766, 3234, -348, -1785, -100, 289, -3129, -4887, -2080, 610, -1005, -2342, -249, 2191, 731, -2368, -1911, 853, 1062, -1607, -392, 3070, 3931, 1555, 587, 2643, 3688, 629, -2186, -1197, 1116, -728, -3527, -1696, 1505, 692, -2456, -1629, 517, 596, -2896, -3630, -506, 1121, -762, -1203, 2096, 4254, 2231, -220, 772, 2794, 1225, -2013, -1083, 1954, 1194, -1157, -828, 1188, 1672, -715, -2496, -857, 189, -2030, -3991, -1769, 1020, 267, -1339, 359, 3271, 2404, -730, -993, 1435, 1465, -1020, -1693, 1486, 2709, 938, -353, 904, 2511]
1449B511k465k851J119K251j341k281J507K954J69k147PK524J56l083j729K455
1465b44J233j747q11K407K335j500k478M00J622r72k928l1K617Q39j905k13K975
1482A599J511k358j886J859J479k676j850J371K686n80j675Q46K334k98l534j528
1498b700K404O6k687o43L054J936j735o17J585J479j634k191O31K354j12k064
1514h74N80L156N15k246p22J625Nk879j924J346O32l43j709J017L080j03k878
1531a722l71K518r29k691M27L160J192q08j94J876K039j470k977O53K001j797
1547I07k940J288K879j304k412O22K147p57k529j528J076J149j494q74K952L023
1563B205j519j280K044J847j982j838O58J506O09j435m04K101J241k854k196K120
$$ y = [2511, 46, -2805, -1686, 565, -776, -3057, -1550, 1404, 1573, -574, -567, 1957, 2113, -970, -2699, -244, 989, -758, -1569, 838, 3173, 1673, -805, -405, 1217, 245, -2683, -2714, -97, 742, -1163, -1376, 1599, 3110, 752, -1134, 725, 2204, -472, -2322, -951, 1735, 1155, -520, 326, 2660, 2362, -1172, -2700, -296, -230, -2917, -3560, -506, 1430, -305, -922, 663, 2142, 508, -1683, -1052, 1302, 1190, -874, -294, 2862, 3377, 1131, 409, 2034, 2039, -840, -2764, -1418, -786, -1129, -2838, -1821, 1259, 1156, -1722, -2093, 425, -504, -3195, -2768, 392, 1584, 776, 582, 2458, 4497, 3027, 50, 703, 2704, 907, -2033, -745, 2134, 830, -1582, -960, 1187, 430, -2099, -3627, -2551, -1402, -2896, -3770, -818, 2205, 686, -594, 1450, 3297, 1315, -523, 135, 1641, 2250, 815, 411, 2512, 3753, 899, -1297, 823]
1579H23K89l155j923J644J318r25j216J047K094J013k272n18K649O95l317k01
1595a955L805J353j609j74J656Q02j478k119j74J280j183k804K27K787l64k897
1611b847M93K495m75j984l59J398Q32n54q88J534K939l40j976J402K399j533k422
1628A14JJ425l80j618j82J127Q82j664k106J025J831j782k721J313K079p56j122
1645b534J714K189L08r54m46J778J076k286j969K184J819j871j358J997R57j933
1661F71k104K35O05k37k371m75K100J004j786k5K739J097j552r31J653J176j025
1678G74j406J333K402N17k285J10K069r11k942j093Q01J85k330l90K138J438j413
1695a003j444P92J538p69k080P98K459M90j819J452K644O39j676n08J321K5k168
$$ y = [823, 1112, -2043, -3966, -2322, -1004, -1929, -3145, -2098, -4, 1009, -1263, -1781, 868, 1563, -1754, -1955, 1850, 3203, 1594, 1420, 3076, 3878, 2400, 281, 107, 1387, 204, -2600, -2373, 414, 50, -2847, -2354, 141, -334, -2318, -2677, -1279, -447, -1001, -1889, -355, 2584, 2244, 268, 1670, 4069, 2536, 114, 115, 1540, 1160, -458, -640, 487, 1369, -295, -2401, -1376, 455, -1327, -4048, -2735, -656, -1412, -2534, -820, 1369, 1677, 723, 277, 2055, 3131, 845, -1124, 1060, 2879, 1008, -350, 1647, 2604, 671, -1433, -1198, -593, -830, -3201, -3676, -1576, -572, -2358, -2383, 356, 1453, -99, -1030, 623, 1799, 774, -632, 701, 3103, 3620, 1335, 1445, 3514, 2603, -339, -1432, -631, -446, -2776, -3166, -1028, 410, -1003, -2447, -1655, -117, -886, -2966, -2168, 291, 781, -1038, 414, 3058, 3697, 2021, 1513, 2834, 2859, 691]
1712F91j797P52J809j372j535Q84J750r97k734j23R13k75j567j75K533J575p35
1729d03l41K316J417j413j609R16J670q97j969P00K431j40j805j48J334q89k608
1746a438j732J043Q98j655q40K078K273r54j500J021J382o20j535L88K361N40
1762A710r65J49K304N36j511j412M94P16k018j936O55K000r48j743P91J626m45
1779Ck143o91J515M30j096n66K440J795q20o50J271J585j281j876M47J592o56
1796A299j766M34J645K50j963q61J428K05k482j194J236J208q94q51J260K006
1812I60m17j064j43J923k15j763j64K112Q95j660o51J872N34j651j402R52R49
1829A067j216j927K86K154k70j608N8K135L30k001o86J832Q09j758p28J760J638
$$ y = [691, -1106, -354, 1455, 83, -1452, -568, 1182, 185, -2549, -2672, -1759, -2034, -3601, -3776, -1243, 332, -403, -744, 1572, 2989, 1576, -33, 883, 2553, 1656, -313, 387, 2818, 2678, 873, 725, 2059, 1170, -1438, -3170, -2127, -1229, -2884, -3724, -1646, 627, -327, -1827, -806, 576, -44, -1579, -1191, 1170, 1710, 745, 894, 3198, 3734, 2223, 811, 1305, 2021, 3, -1933, -1278, 722, -226, -1969, -1178, 448, 3, -2140, -2831, -1316, -886, -1982, -2548, -108, 1687, 867, 217, 1488, 3073, 1792, -84, 363, 1955, 1299, -467, -33, 1612, 1862, -101, -962, 466, 671, -1811, -3005, -1769, -561, -1455, -2306, -1046, 960, 543, -521, -664, 1259, 1044, -719, -883, 1229, 2124, 464, -187, 1685, 2219, 568, -834, 118, 1067, -149, -2076, -1790, 364, 94, -1514, -1456, 679, 1009, -992, -1678, 154, 963, -795, -1523, 237, 1875]
1846A875j115r84P28J741j043j953M90J294l26j613m61J737K55j447l48J337P28
1863H95j460r85O41J434p73j274P36K036L2j289L78J274j44j689o65R47Q36j409
1881d79n24Q96J503r85j465O98J188q69j778pJ606M03j401J26K323N36j564o57
1899d50J208L20j134j258Q69J616n49j083O21J925o50k129m45J323k03j292m04
1916a715J359J196j151l81Q59J030j039j405K16J417m93j498R01K024K75j277
1932C18L61J014j68j664j282J212P89r51n51R92J554p76j401M23R14p71j751j6
1950a754J327O06j050P2J573Q70j126j416R61N13j091j116J030J577k31m37O27
1967I35J212l02j764j233P06J146j827n54J727J120j042p60L90P87p96j747L23
$$ y = [1875, 760, -224, 504, 2245, 1202, -751, -261, 1033, 707, -906, -1367, 370, 625, -822, -1170, 167, 895, -565, -1550, -909, 525, -248, -1522, -786, 1250, 1282, -7, 371, 1645, 1501, -188, -853, 94, 930, -479, -1003, -107, 1396, 411, -1054, -356, 832, -37, -1815, -1822, -216, 187, -1214, -1088, 1235, 1771, 207, -450, 758, 1078, -56, -1314, -445, 1171, 622, -461, 160, 2085, 1435, -694, -1139, 184, -19, -1311, -1715, -356, 840, -311, -692, 167, 1197, 158, -1247, -1031, 386, -107, -1605, -704, 1320, 1595, 318, 679, 1693, 1525, -139, -1421, -209, 580, -371, -922, 70, 1624, 848, -553, -130, 784, 13, -1738, -1754, -427, 179, -871, -799, 774, 1644, 518, -898, 63, 576, -515, -1631, -601, 976, 745, 308, 935, 2147, 1845, 81, -1152, -446, 700, -1127, -1681, 46, 1166, 124, -636, -246, 541, -255, -2002, -1679]
1984a679J497J74j410M46J817O26j007o98J140N25j595q46P39J387m06j065Q27
2001D72J493m74j902l31R38m88j619j55J548P26j004n05J105J032j033j292O67
2018h22J108k30j106Q06J676M98j399o1J558j2j750j181J306O54j557p36J236
2035a2J236j178j275L03J308j143j336K06J277M36j049J06J589O89p27n05J224
2052A149P48j069q69N64R69n15r52J85J075k29j532l94Q60k47j312n72J326J063
2070B48q82j085J087R94n76r81Q12J545k78j286L00J374M5q26j80J296O05j652
2088E60j182R39J92j184j068Q68J092o64r22K12J121J05j358j78J491L37j119
2105g58l05K122O37j078m37J308L25o80j191J65N47q1j624J55J360J04j357j51
$$ y = [-1679, -182, -8, -1418, -972, 845, 1471, 464, -234, 906, 1431, -164, -1010, -271, 1116, 710, -355, 472, 1965, 1491, -411, -742, 196, -292, -1911, -2066, -518, 208, -796, -1301, -196, 836, -197, -1489, -822, 286, 56, -1050, -244, 1432, 1930, 531, 470, 2028, 2016, 266, -915, 391, 1045, -512, -1248, -12, 1224, 46, -1229, -926, 382, -761, -2097, -1891, -614, -178, -1227, -1121, 468, 1157, 430, -75, 1149, 1897, 828, -41, 523, 1492, 977, 25, 210, 1285, 1056, -476, -870, -10, -257, -1569, -2141, -815, 248, -634, -1719, -632, 362, -214, -1195, -383, 1162, 884, -402, -102, 1272, 1317, 491, 311, 1607, 2212, 560, -622, 317, 509, -675, -1743, -875, 217, -447, -1369, -1157, -36, 69, -1289, -1467, 24, 361, -758, -1063, 1059, 1696, 618, 181, 1489, 1814, 1134, -57, 108, 655, 574, -1050, -895, 465, 569, -788, -939]
2123i39P71J89j155q53P42J113j70p38J088J391k01j284L80J248j04j799l8J553
2141A194J8j016k73N97O81j118j497J51J231j211j541J105J530m5p35O39J036
2158G46l1r20n13J083J034j170l42J333J098q40j174Q69N81j360j436r5M30l71
2176a078q12L35J293P32j053r53J243M38j075p18J226Q78L13l02N12J474j10j461
2194H82n49J180m71j373n92J441J25j287l57J001K58j027j204J89R09k88q02M39
2212a526J894N93j141M35J094K79j196m83P72Q14m88o71O16J133r56j236o9M28
2230B92m90j325m68J311P4r98m9R64N88l13n04Q22P94q35q20J405J060o8o97L36
2250A079J080j27j577m10L07J04j025o72R33L01n83j043P29L13j21r29L94R79
$$ y = [-939, -168, 21, -1134, -1987, -1245, -132, -302, -1040, 48, 1439, 1238, -46, 334, 1582, 1478, -321, -359, 1194, 1212, 196, -77, 520, 1201, 83, -1414, -1263, -32, -1243, -2784, -1679, -149, -194, -929, -290, 746, 715, -205, -718, 365, 1399, 229, -113, 1220, 2318, 1478, 304, 1173, 1754, 394, -1042, -1137, -707, -1078, -1890, -1555, -262, 470, -583, -1536, -293, 145, -930, -1648, -422, 456, 769, 467, 979, 2453, 2343, 882, 333, 1513, 1042, -331, -923, 518, 643, -644, -1001, 0, 258, -769, -1973, -1784, -875, -1163, -1965, -1526, 368, 961, -180, 255, 1349, 1628, 432, -51, 721, 1535, 1047, 376, 992, 2125, 1169, -67, -136, 292, -198, -1523, -1991, -680, -606, -1604, -1653, -689, -101, -414, -918, -96, 698, -137, -957, 448, 1508, 1440, 743, 1079, 2159, 2032, 455, 45, 352, 456, -569, -1241, -308, -7, -590, -1633, -904, -591, -712, -1641, -1247, -268]
2268b68L6m49J0J368N95q69K14N50N45r28q05O54O29p27r72L40R81o42j242o9
2288a049Q29l10j082N6P74M89o97j10P70J140m76o63P21P26l68r60K69J099J58
2307A316j381O6Q07Q1r47n44M07L45p91j129Q93R15p58m06K03J221j0r22L7J167
2327E70M20j026j05J073M67j032k24Q16L20n19j006q6N36o38q91K76R30J66j181
2346a134k0J185m5r94OO50J079q37l3Q50P28l06p41N83L95l14j463K3P14M2r59
2367e91m53J010O46j053o49N76K54o70q09O42J215q7l99L72J392j51r55P8O44
2386A012J1r31m20R27N43p09o54O78M46j062j073J76M76k06r33M39J125K15l24
2405b64n10J049J74n76n81P95O82M9p74O49R78n65o79m5M56m28j121m81J048J08
$$ y = [-268, -232, -681, -671, 697, 1292, 423, 637, 1187, 1732, 804, -1, 653, 1282, 555, -417, -77, 904, 262, -980, -1049, -220, -530, -1612, -1556, -782, -293, -990, -1100, -330, 810, 334, -329, 392, 1118, 750, -210, 59, 1158, 1316, -65, 1, 808, 889, -58, -602, -195, 150, -641, -1770, -877, 38, -720, -1126, -923, 298, 288, -634, -597, 570, 990, -36, -141, 932, 1399, 367, 143, 959, 1279, 760, -246, -332, 204, -434, -1325, -1049, -119, 47, -1134, -1154, 31, -14, -1008, -1002, -352, 727, -110, -143, 707, 1435, 1129, 388, 971, 1366, 1052, -411, -388, 326, 368, -591, -1044, -34, 612, -441, -1090, -514, -260, -930, -1739, -1097, 118, 31, -368, 4, 1396, 1245, 290, 368, 1012, 1023, 92, -328, 599, 1142, 433, -221, 457, 903, -159, -1232, -1056, -580, -786, -1719, -1280, -155, 60, -264, -774, 275, 449, -127, -708, 87, 769, 818, 44, 693, 1671, 1106, 427, 382, 838, 410, -711, -1192, -144, -36]
2425c6q29p6P12P79q71p84M30P07n11r51R12J001Rm87N60O80n1j362j48O01L43
2446F28o98k82O34O28n49p75J85O16n92r04J87O54j6o37J84J000O45j005k50P60
2466D13J05l26o79L91Q82j18p66J25R07k01r38k12M39J85j075k08J150K3o22k45
2486g70N45Q02n74o28M53M55j50p86M30R24Kn57k18O90J23j074m05Q52j3m84q9
2507d72J45P71j84o83L09M01N03j219j8R57j77o96p2R69L61l57r36L13P77o66
2527B6r44L65R14l47r35N56Q48m74m38J46N66J51q11n4L60O80n12j48L14O74o19
2548C18n68O35K96k12q14j61N29K03p66r3R48j27n83n63M32M51k26o05N43P49
2568C86M7o03J73O32r2m70l02O43K13j109Q4O14M79o03m89K89P17p67p81L89P64
$$ y = [-36, -865, -941, -229, 550, -321, -1105, -675, 32, -479, -1430, -518, 483, 492, 5, 565, 1245, 1194, -168, -316, 285, 628, -70, -352, 282, 910, 361, -414, -229, 387, -205, -1109, -922, -268, -284, -921, -737, 263, 908, -97, -347, 413, 518, 192, -487, -96, 786, 668, -98, 27, 934, 733, -205, -417, 22, 207, -868, -1076, 74, 97, -525, -770, -225, 577, 3, -625, -172, 283, 133, -653, -223, 701, 703, 146, -72, 618, 741, -333, -738, 114, 101, -383, -472, -327, 444, 260, -423, -114, 287, 790, -429, -447, 510, 333, -363, -435, 534, 895, 538, -398, -85, 692, 26, -918, -553, 361, 14, -921, -365, 483, 9, -429, -283, 283, 434, -377, -431, -71, 609, 97, -51, 263, 937, 318, -250, 385, 681, 469, -345, -506, 23, 226, -540, -633, 315, 188, -395, -958, -526, -75, -301, -906, -363, 386, 433, -170, 3, 635, 543, 73, -229, 414, 627, -482, -398, 216, 695, 92, -397, -108, 609, -158, -939, -550, 214]
2589B14l23q63J19J036L30n89k70O39K26n84m78O32O60m19k71K15L75o3q11j3
2609b38O04j78o54m80P57L87k45n64R10K23o07k71K80L95n74l25L42O45J90n53
2629D4J39M77j62m29q45P57L6j80q35R45O65m28p28M56M24k26o57k43P37J87l81
2650b47K39L99M43m26m69M07J13l84n48K69N85l21n86J14N65J84p06l04P87r0
2670B4o16J66L58K99j22m43Q68L05j58q11P4P21m56n48K38N38M2l74l16J55K43
2691A87q11k20L45O65n11l96P22J58q6m58K44M69J58p13J58M84K63l10l90N96
$$ y = [214, -109, -972, -853, 183, 513, -76, -346, 293, 519, -65, -543, 89, 749, 330, 59, 274, 649, 586, -225, -238, 366, 188, -466, -946, -189, 198, -47, -611, 299, 522, -85, -356, -76, 319, -255, -580, -238, 407, 597, 44, 183, 660, 498, 69, -776, -19, 17, -163, -998, -53, 612, 184, -544, -88, 336, 110, -547, -790, -53, 134, -247, -8, 391, 834, 408, -61, 346, 459, 75, -473, -204, 381, 60, -526, -412, 153, 337, -369, -673, 114, 24, -592, -426, -68, 231, 109, -334, 534, 839, 681, -130, -56, 665, 209, -339, -101, 437, 479, 105, -211, -56, 187, -624, -844, -499, 166, -345, -741, -19, 139, 53, -405, -161, 308, 466, -247, -89, 395, 658, 348, -42, 554]
$$ [...]
8191a17
##END NTUPLES=NMR FID
##END=
