##TITLE=1H_LR-767-2-CHL
 CCl4
 8 sc, 
 10.5.2023
##JCAMPDX= 6.0         $$ Bruker NMR JCAMP-DX V2.0
##DATA TYPE= NMR FID
##DATA CLASS= NTUPLES
##ORIGIN= UXNMR, Bruker Analytische Messtechnik GmbH
##OWNER= root
$$ XWIN-NMR		Version 3.5
$$ Wed May 10 16:22:44 2023 Russian Standard Time (UT+4h)  she@DPX200
##.OBSERVE FREQUENCY= 200.13135
##.OBSERVE NUCLEUS= ^1H
##.DELAY= (6, 6)
##.ACQUISITION MODE= SIMULTANEOUS
##.ACQUISITION SCHEME= undefined
##.AVERAGES= 8
##.DIGITISER RES= 18
##SPECTROMETER/DATA SYSTEM= spect
##.PULSE SEQUENCE= zg30
##.SOLVENT NAME= CDCl3
##.SHIFT REFERENCE= (INTERNAL, CDCl3, 0, 15.7039)
##AUDIT TRAIL= $$ (NUMBER, WHEN, WHO, WHERE, WHAT)
$$ ##TITLE= Audit trail, XWIN-NMR		Version 3.5
$$ ##JCAMPDX= 5.01
$$ ##ORIGIN= Bruker BioSpin GmbH
$$ ##OWNER= she
$$ F:/spectra/data/she/nmr/H-F/1/audita.txt
$$ ##AUDIT TRAIL=  $$ (NUMBER, WHEN, WHO, WHERE, WHAT)
(   1,<2023-05-10 16:21:33.32 +0400>,<she>,<DPX200>,
      <created by zg, POWCHK disabled, PULCHK disabled
       configuration hash MD5:
       00 E9 B6 7A A2 85 ED C7 34 08 36 98 17 FE 4E 26
       data hash MD5: 16K
       7B 76 9F C0 9F 93 08 D8 4D 8A 9B 59 ED BB C3 EB>)
$$ ##END=
$$ 
$$ hash MD5
$$ DC D4 0D 23 09 E7 4C 8F 13 D9 21 27 2B 1C 6C 28
##$RELAX= 
##$RELAX= 
##$RELAX= 
##$RELAX= 
##$RELAX= 
##$RELAX= 
$$ Bruker specific parameters
$$ --------------------------
##$DU= <F:/spectra>
##$EXPNO= 1
##$NAME= <H-F>
##$PROCNO= 1
##$TYPE= <nmr>
##$USER= <she>
##$AMP= (0..31)
100 100 100 100 100 100 100 100 100 100 100 100 100 100 100 100 100 100 
100 100 100 100 100 100 100 100 100 100 100 100 100 100 
##$AQSEQ= 0
##$AQ_mod= 1
##$AUNM= <au_zg>
##$AUTOPOS= <>
##$BF1= 200.13
##$BF2= 200.13
##$BF3= 200.13
##$BF4= 200.13
##$BF5= 200.13
##$BF6= 200.13
##$BF7= 200.13
##$BF8= 200.13
##$BYTORDA= 1
##$CFDGTYP= 0
##$CFRGTYP= 5
##$CHEMSTR= <none>
##$CNST= (0..31)
1 1 145 1 1 1 1 1 1 1 1 1 1 1 1 1 1 1 1 1 1 1 1 1 1 1 1 1 1 1 1 1 
##$CPDPRG= <>
##$CPDPRG1= <>
##$CPDPRG2= <>
##$CPDPRG3= <>
##$CPDPRG4= <mlev>
##$CPDPRG5= <mlev>
##$CPDPRG6= <mlev>
##$CPDPRG7= <mlev>
##$CPDPRG8= <mlev>
##$CPDPRGB= <>
##$CPDPRGT= <>
##$D= (0..31)
0 1.2 0 0 0 0 0 0 0 0.06 0 0.03 0 0 0 0 0.0002 0 0 0 0 0 0 0 0 0 0 0 0 
0 0 0 
##$DATE= 1683721292
##$DBL= (0..7)
120 120 120 120 120 120 120 120 
##$DBP= (0..7)
150 150 150 150 150 150 150 150 
##$DBP07= 0
##$DBPNAM0= <>
##$DBPNAM1= <>
##$DBPNAM2= <>
##$DBPNAM3= <>
##$DBPNAM4= <>
##$DBPNAM5= <>
##$DBPNAM6= <>
##$DBPNAM7= <>
##$DBPOAL= (0..7)
0.5 0.5 0.5 0.5 0.5 0.5 0.5 0.5 
##$DBPOFFS= (0..7)
0 0 0 0 0 0 0 0 
##$DE= 6
##$DECBNUC= <off>
##$DECIM= 32
##$DECNUC= <off>
##$DECSTAT= 4
##$DIGMOD= 1
##$DIGTYP= 9
##$DL= (0..7)
0 120 120 120 120 120 120 120 
##$DP= (0..7)
150 150 150 150 150 150 150 150 
##$DP07= 0
##$DPNAME0= <>
##$DPNAME1= <>
##$DPNAME2= <>
##$DPNAME3= <>
##$DPNAME4= <>
##$DPNAME5= <>
##$DPNAME6= <>
##$DPNAME7= <>
##$DPOAL= (0..7)
0.5 0.5 0.5 0.5 0.5 0.5 0.5 0.5 
##$DPOFFS= (0..7)
0 0 0 0 0 0 0 0 
##$DQDMODE= 0
##$DR= 18
##$DS= 0
##$DSLIST= <SSSSSSSSSSSSSSS>
$$ [...]
##$SUBNAM2= <"">
##$SUBNAM3= <"">
##$SUBNAM4= <"">
##$SUBNAM5= <"">
##$SUBNAM6= <"">
##$SUBNAM7= <"">
##$SUBNAM8= <"">
##$SUBNAM9= <"">
##$SW= 18.05172834244
##$SWIBOX= (0..15)
0 0 2 0 0 0 0 0 0 0 0 0 0 0 0 0 
##$SW_h= 3612.71676300578
##$TD= 16384
##$TD0= 1
##$TE= 0
##$TE2= 300
##$TE3= 300
##$TEG= 300
##$TL= (0..7)
0 120 120 120 120 120 120 120 
##$TP= (0..7)
150 150 150 150 150 150 150 150 
##$TP07= 0
##$TPNAME0= <>
##$TPNAME1= <>
##$TPNAME2= <>
##$TPNAME3= <>
##$TPNAME4= <>
##$TPNAME5= <>
##$TPNAME6= <>
##$TPNAME7= <>
##$TPOAL= (0..7)
0.5 0.5 0.5 0.5 0.5 0.5 0.5 0.5 
##$TPOFFS= (0..7)
0 0 0 0 0 0 0 0 
##$TUNHIN= 0
##$TUNHOUT= 0
##$TUNXOUT= 0
##$USERA1= <user>
##$USERA2= <user>
##$USERA3= <user>
##$USERA4= <user>
##$USERA5= <user>
##$V9= 5
##$VALIST= <valist>
##$VCLIST= <CCCCCCCCCCCCCCC>
##$VD= 0
##$VDLIST= <DDDDDDDDDDDDDDD>
##$VPLIST= <PPPPPPPPPPPPPPP>
##$VTLIST= <TTTTTTTTTTTTTTT>
##$WBST= 1024
##$WBSW= 4
##$XGAIN= (0..3)
0 0 0 0 
##$XL= 0
##$YL= 0
##$YMAX_a= 916997
##$YMIN_a= -804532
##$ZGOPTNS= <>
##$ZL1= 120
##$ZL2= 120
##$ZL3= 120
##$ZL4= 120
##$ABSF1= 10
##$ABSF2= 0
##$ABSG= 5
##$ABSL= 3
##$ALPHA= 0
##$AQORDER= 0
##$ASSFAC= 0
##$ASSFACI= 0
##$ASSFACX= 0
##$ASSWID= 0
##$AUNMP= <proc_1d>
##$AZFE= 0.1
##$AZFW= 0.1
##$BCFW= 1
##$BC_mod= 2
##$BYTORDP= 1
##$COROFFS= 0
##$CY= 11.3945322036743
##$DATMOD= 1
##$DC= 2
##$DFILT= <>
##$DTYPP= 0
##$F1P= 15.7292609196834
##$F2P= 12.9074282941183
##$FCOR= 0.5
##$FTSIZE= 0
##$FT_mod= 4
##$GAMMA= 1
##$GB= 0.15
##$INTBC= 1
##$INTSCL= 1
##$ISEN= 128
##$LB= 0.24
##$LEV0= 0
##$LPBIN= 0
##$MAXI= 10000
##$MC2= 0
##$MEAN= 0
##$ME_mod= 0
##$MI= 1.114404
##$NCOEF= 0
##$NC_proc= 0
##$NLEV= 6
##$NOISF1= 3.799351
##$NOISF2= 2.8
##$NSP= 1
##$NTH_PI= 0
##$NZP= 0
##$OFFSET= 15.70392
##$PC= 1
##$PHC0= -19820.79
##$PHC1= 10.4008
##$PH_mod= 1
##$PKNL= yes
##$PPARMOD= 0
##$PSCAL= 0
##$PSIGN= 0
##$REVERSE= no
##$SF= 200.130013532006
##$SI= 16384
##$SIGF1= 3
##$SIGF2= 2
##$SINO= 400
##$SIOLD= 16384
##$SREGLST= <1H.CDCl3>
##$SSB= 0
##$STSI= 0
##$STSR= 0
##$SW_p= 3612.71676300578
##$SYMM= 0
##$S_DEV= 0
##$TDeff= 0
##$TDoff= 0
##$TI= <>
##$TILT= no
##$TM1= 0
##$TM2= 0
##$TOPLEV= 0
##$USERP1= <user>
##$USERP2= <user>
##$USERP3= <user>
##$USERP4= <user>
##$USERP5= <user>
##$WDW= 1
##$XDIM= 8192
##$YMAX_p= 0
##$YMIN_p= 0
$$ End of Bruker specific parameters
$$ ---------------------------------
##NTUPLES= NMR FID
##VAR_NAME=  TIME,          FID/REAL,        FID/IMAG
##SYMBOL=    X,             R,               I
##VAR_TYPE=  INDEPENDENT,   DEPENDENT,       DEPENDENT
##VAR_FORM=  AFFN,          ASDF,            ASDF
##VAR_DIM=   8192,          8192,            8192
##UNITS=     SECONDS,       ARBITRARY UNITS, ARBITRARY UNITS
##FACTOR=    0.0002768,     1,               1
##FIRST=     0,             0,               0
##LAST=      2.2672688,     0,               0
##MIN=       0,             -804532,         0
##MAX=       2.2672688,     916997,          0
$$ Real data points
##PAGE= N=1
##DATA TABLE= (X++(R..R)), XYDATA
0 0 0 0 0 0 0 0 0 8 -16 16 -24 32 -40 48 -64 80 -104 128 -160 192 -232 272 -328 384 -451 528 -616 713
28 713 -824 949 -1089 1241 -1409 1596 -1805 2033 -2285 2563 -2869 3203 -3565 3964 -4398 4870
44 4870 -5389 5955 -6574 7248 -7986 8799 -9689 10669 -11753 12961 -14308 15819
56 15819 -17530 19489 -21750 24396 -27539 31346 -36067 42097 -50104 61300 -78167 106781
68 106781 -168187 542092 -534531 -379114 631830 -456241 656780 -437911 -216641
77 -216641 628951 -94571 -210874 -231887 485591 202327 -446001 178223 -95714 497371
87 497371 -262392 -403208 749809 -225681 4815 -117009 -176459 762342 -484503 -118951
97 -118951 281231 -57870 293890 -568889 318363 430245 -474936 238830 -248909 268346
107 268346 287450 -560383 277967 112715 14529 -152054 -130181 493674 -225089 12997
117 12997 -33773 -73580 508529 -454909 53831 324686 -253968 225587 -314464 169992
127 169992 316335 -385461 160675 -66537 129137 66286 -247136 296844 -72144 49116
137 49116 -32482 -162289 421590 -216445 -49379 152550 -167429 241458 -192363 35091
147 35091 183504 -150966 128234 -172639 148639 147248 -234785 203567 -97825 27376
157 27376 108673 -206663 219241 -40943 -49378 46367 -96500 182082 -76197 19498 45035
168 45035 -71570 156690 -157614 86761 110993 -162450 159504 -136361 16034 158233
178 158233 -170377 113462 -16916 -32071 72420 -79492 106001 -11980 9950 4452 -67870
189 -67870 125188 -68824 21205 44606 -84103 91400 -75164 13173 92814 -71875 66395
200 66395 -53964 16370 68297 -69220 83019 -35753 -1783 27821 -72935 79124 -1874
211 -1874 -25018 29721 -41185 39177 -2364 9121 32674 -19499 30702 -50934 36798 30205
223 30205 -42426 52039 -47042 -3049 35294 -48680 54794 7022 -31319 27581 -21176 26587
235 26587 13837 -1293 9582 -12947 996 -18212 22310 12154 -19875 9468 -20409 10635
247 10635 13475 -7813 32110 -9683 -7001 1877 -6149 31544 -9556 -10861 9417 -24706 8339
260 8339 -1781 2277 23027 -19106 -9705 10997 7393 8253 7804 -7193 3314 -7236 -13566 13134
274 13134 11863 -14615 -5498 -8334 -2356 17989 -9759 13164 7047 -13610 -1509 4424 9192
287 9192 9233 -14664 -8874 1789 -11137 5193 1195 4656 -1604 -13544 -1006 15944 2546 3582
301 3582 292 -8744 2183 -9675 1476 11899 -9200 -12419 -3481 -6472 9797 2450 -4310 9054
315 9054 -7510 -9457 10906 3295 1638 -1161 -16395 -2403 1436 -9805 5633 3227 -12637
328 -12637 -2468 -4988 5339 11234 -1892 -4883 2003 -8369 -3788 5123 -1238 -2184 -10669 -10247
342 -10247 -1359 6722 -6093 5198 -338 -7560 -30 381 5856 4754 -8119 -9830 318 -7613
356 -7613 -667 -1039 400 -7980 -5695 -5846 6449 10232 -10342 5349 -3176 -7844 4990 -6117
370 -6117 2912 5038 -24089 -1161 283 -3872 4501 -6717 2290 -3024 -2822 -4043 8261 10950
384 10950 -19643 553 -2196 -11588 14692 -21604 3531 9709 -29606 8782 -636 2713 10220
397 10220 -19920 7342 -1796 -244 -3437 -9128 21051 -29023 -2574 1312 -14078 27612 -29341
410 -29341 -1625 19029 -25059 17790 -12486 8280 14270 -37188 19952 -18525 11433 3927
422 3927 -38668 36124 -25416 -6213 15689 -25744 37688 -22446 -13389 21954 -20865 27877
434 27877 -33606 11694 11522 -42405 36787 -41675 21639 21357 -65106 53479 -24988 -6287 35627
447 35627 -52737 48335 -20702 -18735 23171 -31602 40983 -43235 3963 19832 -47831 54539
459 54539 -48839 15454 37018 -73657 62948 -34663 2698 35431 -69106 61994 -41035
470 -41035 -6513 34489 -64140 71769 -52413 -9548 55482 -74700 67937 -35806 -9016
481 -9016 49030 -71514 51580 -27199 2614 21622 -66289 72920 -56662 6634 40817
492 40817 -83315 101741 -70651 -14173 83459 -95323 73501 -37367 -23298 70782 -87711
503 -87711 47633 -17338 -2409 31205 -84641 85746 -40980 -3294 40117 -85622 110040
514 110040 -64679 -29685 78983 -81446 76331 -64712 -17545 89290 -99162 61501
524 61501 -41993 7527 69728 -125689 86645 -11040 -20557 48354 -104363 100632 -22249
535 -22249 -52359 51575 -58252 86882 -71992 -25959 85040 -70154 67413 -75955
545 -75955 10310 103271 -132911 64185 -14119 -7496 66591 -137678 86864 13067 -45782
556 -45782 31296 -74618 107570 -37002 -60690 71022 -44750 74806 -75924 -30995 112784
567 112784 -83840 32621 -47285 15617 84631 -132594 57071 7308 -686 37150 -121016
578 -121016 108713 6300 -66435 46645 -64214 97835 -41127 -79789 91123 -32389
588 -32389 31689 -59783 -7545 95316 -77239 19811 -26121 30340 60191 -133691 69725
599 69725 19777 -28659 29632 -95881 95618 7513 -83027 48601 -23184 60422 -41510
610 -41510 -53125 85771 -26922 11193 -47820 10423 77028 -87488 14714 3009 11471
621 11471 34242 -99152 59109 27103 -35189 16096 -51447 80500 -15458 -61862 50277
632 50277 -20177 38670 -40428 -36836 77712 -34842 -6373 -12015 8568 49272 -64069 12789
644 12789 14757 9301 6842 -62318 55491 4933 -33344 14310 -30164 52701 -16846 -48263
656 -48263 49786 -10589 11525 -20396 -13096 49266 -26807 -6849 -3804 11333 19279 -46267 15319
669 15319 11327 -4010 4248 -33389 36894 3353 -24967 13616 -8233 24704 -15456 -21348 27777
682 27777 -9389 3313 -14582 -3091 27522 -24489 1020 3450 4667 9561 -22127 11302 8759
695 8759 -5190 -1021 -10770 16209 -4154 -12838 6776 -4854 12881 -12991 -4575 16253 -7589
708 -7589 3558 -3559 292 10918 -10344 -2040 3857 479 -667 -8697 6273 -1832 553 -753
722 -753 -3247 10119 -4067 -1120 4052 -1142 3861 -4067 -2118 4186 -4365 -391 -2708 1915 -154
737 -154 -1712 1836 -1185 4291 -362 -1836 3814 -1445 -316 205 -1589 482 -2853 983 -3452 1317
753 1317 930 -2855 3815 -853 146 2995 -1508 1126 1027 -2253 1072 -2114 237 -1766 1131 -2396
769 -2396 -440 3168 -3893 3950 642 -1670 4403 -1672 -1467 4178 -3860 230 -680 -1643 -256 -252 -412
786 -412 -1394 3641 -2343 1372 2850 -1537 2091 736 -3095 3278 -2329 -1851 1462 -2347 -389 -205
802 -205 530 -810 2396 193 -417 2882 -195 -712 2769 -2876 920 69 -2744 1294 -1291 -995 635
819 635 -103 -155 1757 47 815 1107 836 -1222 1989 -1696 -792 985 -2648 359 -969 -529 528
836 528 366 194 1596 -362 2326 -1022 1427 72 -996 875 -1893 327 -1541 -610 -149 -163 12
853 12 532 -356 2535 -1334 2309 -65 -663 2764 -4350 1965 -832 -2519 1378 -2420 409 1528
869 1528 -2430 2449 -793 2941 -571 -1072 3933 -4077 3327 -2293 -2682 5093 -6197 697 1571 -3972
885 -3972 5354 -5215 2691 2549 -3070 3750 -4327 5308 -1117 -4601 5191 -5696 4178 -1755 -7394
900 -7394 11160 -7759 2215 1449 -3663 10119 -8618 2652 2542 -2764 6077 -11129 6508 2693
914 2693 -9908 8952 -10825 9171 834 -12324 14189 -6782 5470 -1058 -7762 15543 -10471
927 -10471 896 1033 -6420 14903 -18845 5682 6436 -10228 12768 -16372 10837 7013 -15005
940 -15005 11876 -9137 10437 -1167 -16662 19950 -13060 5668 -2163 -12943 26537 -19567
952 -19567 1835 8208 -9987 19605 -20947 5511 12757 -15556 12624 -18170 14102 4414 -21866
965 -21866 18804 -14206 13179 -1089 -21668 30697 -15893 2464 4287 -15983 30145 -24711
977 -24711 1800 10670 -14552 21417 -27424 10789 14070 -23080 18962 -17537 13446 9243 -27944
990 -27944 26448 -13737 7925 800 -22520 32677 -21546 2253 5288 -16483 31266 -28014
1002 -28014 4174 17636 -22357 25200 -24256 8854 17247 -28558 21742 -16391 9148 6755
1014 6755 -27092 27877 -16138 5229 6068 -22610 34099 -22751 3116 12678 -21906 29873 -25987
1027 -25987 3922 16354 -26193 24637 -20597 5708 15330 -28317 26525 -16071 5234 10901
1039 10901 -24713 27687 -17916 3243 9940 -22868 26521 -20411 3270 13074 -25127 27815
1051 27815 -19145 3980 14456 -25338 26860 -15866 -78 13553 -22393 23160 -15892 -1426
1063 -1426 15161 -21383 20413 -16149 3811 13899 -22336 20209 -12654 5243 9085 -23368
1075 -23368 23399 -11467 -924 8233 -20777 26438 -15711 -4808 14763 -15758 20057 -15955
1087 -15955 -1359 18547 -16769 10078 -10186 4876 11048 -22452 13452 -5268 5076 2087
1099 2087 -19883 23916 -6640 -4569 5312 -10974 21691 -13485 -8427 15110 -8177 8586 -15581
1112 -15581 2503 15422 -14828 3828 -5438 8837 6720 -19851 11474 3516 -577 -1463 -12593
1125 -12593 18542 -3997 -9028 1677 -1022 13194 -14711 -3987 13168 -2721 1834 -10613
1137 -10613 5464 13713 -14873 -435 1973 6441 -834 -14083 8463 5298 -1968 -7839 -1460
1150 -1460 14544 -5265 -7454 3495 3448 6867 -12813 -1727 11503 -2457 -5067 -5154 7257 4531
1164 4531 -9370 -2410 5624 5952 -5687 -6538 8657 3424 -2980 -6377 2883 8160 -6066 -6035 2200
1179 2200 6591 -1483 -7599 3044 6292 -616 -5038 -1731 9174 -840 -6193 -267 4592 2660
1193 2660 -7565 -823 4174 2204 -3691 -4735 6688 3290 -5084 -148 768 5838 -3688 -5540 5071
1208 5071 713 -418 -5360 865 4721 -3150 -1714 -437 3793 2229 -6746 3957 2153 -820 63
1223 63 -4668 5836 -772 -4162 567 -333 3087 -3568 -1790 4750 -1574 1742 -2717 1256 4453
1238 4453 -4615 1308 -558 857 884 -4907 2641 653 -1387 618 -2436 4759 -1753 -1074 2747 -2212
1254 -2212 3552 -2949 -1002 3112 -2671 382 -898 -859 2432 -3122 1784 -154 263 1678 -2892 3586
1270 3586 -1046 -408 1000 -2105 1693 -1107 -1743 1894 -1951 1508 -1221 -118 2090 -2077 2472
1285 2472 -1483 484 1400 -2321 1528 -634 -1400 1619 -2454 814 16 -888 1447 -747 1511 -688
1301 -688 1048 106 -1007 1549 -882 -556 1324 -2359 979 -328 -948 1507 -1243 1178 55 454
1317 454 492 53 823 -599 -347 905 -2060 1037 -938 -904 1206 -1403 887 219 146 606 586 182 93
1336 93 367 635 -1187 1225 -1298 -782 993 -1891 1328 -24 -640 1011 58 44 816 -107 578 -736
1354 -736 873 -1162 -38 970 -2491 1766 -877 -639 1643 -1257 727 1207 -961 1283 -825 885
1370 885 -462 -313 669 -2425 1606 -1601 -785 1702 -2211 1272 721 -1333 2504 -2000 1606 -202
1386 -202 -514 1164 -2589 2473 -1708 -951 1848 -3246 2176 -273 -2336 4339 -2589 1784 51 -1064
1402 -1064 3349 -3192 1784 -1257 -195 2210 -4756 3347 104 -2348 4315 -4815 4241 420 -3417
1417 -3417 4456 -3227 3094 -2063 -2286 4041 -4166 2251 -1784 -1822 6369 -7331 3516 914 -2493
1432 -2493 5310 -6772 4514 1310 -3728 2883 -4904 5386 -1508 -5211 6497 -5443 4679
1445 4679 -2531 -4033 10069 -6785 2235 -62 -1840 6867 -8780 2261 2406 -3266 3996 -9217
1459 -9217 7610 1352 -6880 6401 -5655 7439 -1363 -7540 9695 -4066 2147 -2470 -4124
1472 -4124 10668 -9130 1172 214 -1735 8242 -12626 5551 4745 -5740 5307 -8641 7712
1485 7712 3097 -10842 6839 -4103 5662 -3228 -8022 12263 -5680 1931 -2436 -2435 12983 -11467
1499 -11467 688 4538 -3370 7451 -13060 5544 6350 -8686 4590 -7279 9063 1047 -11258
1512 -11258 9670 -2681 4402 -2237 -8528 14834 -6585 -2103 705 -2637 10500 -11924 829
1525 829 5862 -3167 4936 -10935 7511 6168 -10739 6265 -5090 7029 436 -12450 10779
1538 10779 -2684 30 -1838 -5608 12435 -7068 -2317 3250 -1796 8945 -11301 2268 7270
1551 7270 -6333 3761 -7988 5598 4298 -10444 5228 -1793 3938 -96 -8604 10641 -2962
1564 -2962 -447 553 -4156 9927 -7031 -2212 4736 -2840 4137 -6860 1026 6135 -5839 3054
1578 3054 -3405 4117 2612 -7441 5897 -1636 815 275 -5762 6811 -2360 -2922 2807 -2671 4870
1593 4870 -3403 -312 4015 -2176 2736 -3041 1383 2602 -4200 2649 -1391 -96 1555 -4248 3637
1608 3637 -1111 -682 1834 -1799 2895 -1482 -29 1936 -2262 1148 -688 -674 1464 -2785 1351 213
1624 213 -1140 258 -336 1506 -162 -946 801 722 -186 -1117 -227 1821 -1429 -1125 273 670 952 -2328
1642 -2328 -260 3156 -582 -1569 620 699 2177 -2813 -1225 2755 -350 -1673 -1549 1192 2069 -3010
1658 -3010 -554 1240 1701 183 -3839 3289 1251 -1814 -755 -1030 3379 -908 -3944 2382 555
1673 555 939 -2961 -1037 5021 -2189 -606 -590 1743 2932 -5352 647 2565 -1011 9 -4157 3329
1689 3329 1898 -3870 1028 -3 3583 -1900 -3019 4286 -531 65 -2192 -1031 5248 -4142 -1074
1704 -1074 1337 -216 2697 -5126 1783 3092 -1684 507 -2536 3826 752 -4548 2687 -1041 1975
1719 1975 -1676 -3743 4929 -1919 -309 -482 -434 4367 -3621 60 2313 -668 1870 -4068 2012 1918
1735 1918 -3641 1915 -2587 2345 238 -3561 3062 -188 586 -365 -1894 4072 -1859 -546 322 -951
1751 -951 2715 -3907 423 1612 -1574 1444 -2038 1189 1856 -2770 1561 -1106 1137 219 -2680 2575
1767 2575 -1498 329 -195 -1790 2799 -1419 -287 1446 -1208 2288 -1591 293 1507 -1468 1323
1782 1323 -1721 848 152 -2134 1204 -859 446 926 -1694 1664 -655 -138 1040 -1074 1708 -1316
1798 -1316 -192 87 -964 761 -1059 118 737 -1377 1463 -604 240 1055 -1217 1158 -550 101
1814 101 46 -780 447 -724 -535 448 -1385 1277 -728 -34 1401 -726 1426 -512 288 247 -552 465
1832 465 -276 -139 246 -998 1025 -635 94 1037 -870 1354 -457 197 659 -665 406 -254 -314 353
1850 353 -1239 701 -669 -166 696 -947 1087 -529 168 932 -513 648 -333 -370 672 -1389 664
1867 664 -930 -168 699 -1269 1426 -594 -60 930 -846 1093 188 -533 1230 -1365 955 -836 -442
1884 -442 756 -1508 1469 -878 229 869 -1302 1561 -655 -580 1557 -1634 1305 -690 -490 1200
1900 1200 -1819 1514 -906 -231 1450 -1660 1899 -530 -698 1998 -2203 1698 -587 -1111 1544 -2546
1916 -2546 1948 -1112 -664 1578 -2147 1963 -706 -636 2658 -2862 2104 -730 -851 2207 -3412 2252
1932 2252 -913 -893 1684 -2579 2574 -645 -1165 2616 -2387 2739 -1058 -1298 3431 -3423 1915 -1159
1948 -1159 -730 2903 -3701 1976 -160 -852 2661 -4220 3449 -6 -1694 2571 -3608 3650 -1206
1963 -1206 -2783 3329 -2641 2082 -1726 -1752 4572 -3683 1655 -738 -48 3872 -5401 2685 836 -1596
1979 -1596 1990 -4365 3833 116 -4004 2893 -2612 3845 -1650 -3014 5503 -2539 1746 -2169 -935
1994 -935 5324 -5244 528 548 -630 3132 -6196 3092 2059 -2320 1842 -3973 5143 -149 -4605
2009 -4605 3384 -1486 2949 -2417 -3744 6365 -2966 -7 -1100 -282 5654 -5730 317 2183 76
2024 76 1759 -5354 3691 2697 -4139 1000 -2672 4604 -793 -5545 4542 -85 1201 -2543 -1981 6663
2040 6663 -2381 -2018 235 782 4189 -6399 397 3663 -1358 222 -4450 4124 2137 -4808 1080
2055 1080 310 3533 -1428 -4755 4896 -26 -765 -2442 -550 5457 -3479 -2263 2054 1335 1629 -4808
2071 -4808 895 4728 -1775 -1148 -1586 3736 1173 -4766 978 1307 1455 -2498 -2700 4497 638 -2304
2087 -2304 -782 897 3601 -3154 -2078 2564 953 -805 -3266 926 2778 -1982 -1803 613 2409
2102 2409 589 -3206 1417 2154 -505 -1662 -663 2570 -1 -2725 -279 1698 283 -1894 -1212 2508
2118 2508 735 -1882 -874 1404 1458 -1542 -1251 1642 773 -1108 -1240 85 2258 -1606 -1162 1356
2134 1356 956 512 -1522 648 1815 -1044 -123 -620 934 916 -2612 1337 248 -172 -83 -1457 2206
2151 2206 -238 -992 993 -678 1717 -1261 -849 2084 -1803 860 -1095 -343 1494 -2431 1139 -111
2167 -111 -577 1398 -2279 2103 -347 -860 1731 -1828 1773 -1102 -771 1689 -2134 1067 -652 -721
2183 -721 1935 -2528 1891 302 -1159 1982 -2380 2028 -591 -1181 1575 -1566 1556 -897 -1188 2548
2199 2548 -2235 1215 -69 -474 2751 -2930 1702 104 -948 1257 -2338 1716 -49 -1842 1613
2214 1613 -1636 1666 -218 -1755 2525 -1724 1267 -532 -654 2441 -2196 653 235 -672 1586 -2670
2230 -2670 1393 864 -1414 1769 -2057 2249 104 -1453 2081 -1092 1082 -344 -1502 2310 -1834
2245 -1834 397 -167 -873 2243 -2575 1060 642 -507 1255 -1967 1269 783 -1746 1306 -1299 856
2261 856 -183 -1837 1599 -1229 1154 5 -355 1997 -1435 422 325 -768 1384 -1650 363 479
2277 479 -1024 945 -1341 815 30 -954 1279 -610 614 94 -1305 1422 -1133 202 158 -936
2293 -936 1221 -1075 149 186 -706 814 -563 434 569 -800 915 -727 621 330 -1170 914 -782
2310 -782 244 -184 -863 864 -199 151 649 -394 1068 -517 152 447 -699 727 -688 419 30
2327 30 -503 294 -451 161 415 -673 1052 -404 281 268 -707 748 -530 161 -28 -347 429 -597 176
2346 176 345 -479 879 -232 155 372 -457 740 -434 52 -119 -317 392 -457 2 459 -700 844
2364 844 -433 75 687 -446 1101 -448 274 -32 -705 554 -204 -146 358 -623 617 -601 2 408
2382 408 -709 836 -333 283 527 -618 434 -699 -202 318 -1025 932 -492 -48 679 -805 1217
2399 1217 -493 -32 372 -661 912 -566 -93 620 -1247 380 -807 76 771 -957 1357 -669
2415 -669 186 543 -1089 1341 -415 -272 490 -1369 961 -922 -331 890 -1034 1162 -880 283
2431 283 733 -834 1464 -688 -96 812 -1495 1049 -964 -542 539 -1534 1698 -926 53 844 -941
2448 -941 1567 -735 85 897 -1582 1328 -1166 -83 833 -1890 1781 -592 26 653 -1433 1356
2464 1356 -745 -209 1183 -1209 1504 -945 -249 1021 -1765 1177 -1111 5 737 -1680 1645 -475
2480 -475 -255 1362 -1581 1842 -1141 -371 1380 -1527 1659 -1555 -133 1204 -1582 1139 -779 -2
2496 -2 1151 -1786 1546 -189 -99 763 -1887 1846 -708 -629 620 -1133 1530 -1176 -676 1539 -963
2513 -963 967 -908 451 1691 -1898 641 -398 506 445 -1900 1370 36 -672 -23 -1148 2029
2529 2029 -590 -900 775 -307 1195 -1534 -213 1659 -1149 -330 -942 668 1413 -2222 512 891
2545 891 649 -2 -1874 1737 491 -821 -449 -153 1462 -1248 -1184 1112 304 234 -1509 212 1854
2562 1854 -785 -396 -226 1515 351 -1724 390 1228 128 -1261 -1078 1511 350 -1194 -647 911
2578 911 1099 -1446 -581 968 942 -829 -1067 907 994 -742 -1111 373 1444 -713 -1321 475 979 114
2596 114 -1467 475 1514 -201 -1368 -408 1496 70 -1687 271 823 681 -1314 -717 1799 134
2612 134 -706 -855 1244 1410 -1633 -582 315 727 -432 -1963 1138 704 -725 -692 -271 2268 -902
2629 -902 -1128 688 80 541 -1506 58 1785 -1016 -299 -722 845 1307 -2395 858 430 711 -128
2646 -128 -1642 2072 -61 -1050 348 -791 1489 -1243 -1098 1624 -745 543 -1363 51 1717 -1566
2662 -1566 361 -72 478 877 -1952 1215 225 -562 526 -1617 1862 -644 -798 1138 -855 1475
2678 1475 -1244 -516 1414 -1166 596 -785 195 1221 -1925 1106 -429 44 876 -1711 1650 -219
2694 -219 -599 1065 -1085 1680 -432 -447 1356 -1107 1264 -1051 -308 1131 -1796 898 -478 14
2710 14 1273 -1467 1095 -116 -429 1302 -1207 1132 -606 -770 1015 -1430 953 -544 -397 986
2726 986 -993 931 -289 -342 1219 -1288 1084 -519 -397 769 -1283 949 -574 -498 912 -1046
2742 -1046 902 -181 -220 1079 -1224 831 -510 -138 754 -1368 679 -492 -380 587 -896 817
2758 817 -21 -439 935 -1134 907 -329 -438 655 -744 596 -571 -220 816 -843 574 53
2774 53 -396 684 -1024 612 -291 -257 536 -643 431 -267 -319 765 -862 272 -39 -277 869 -677
2792 -677 420 85 24 691 -848 201 115 -296 231 -626 570 -192 -163 578 -456 570 -98 -340 445
2811 445 -373 445 -259 -178 420 -749 261 -115 -318 531 -660 487 27 -448 301 -320 164 191 -594
2830 -594 357 -574 149 -111 -287 476 -175 310 -164 -85 123 10 271 315 2 294 -284 239 121 -519 263
2851 263 -298 -99 136 -278 275 -244 -174 258 -358 441 -425 89 193 -208 580 -434 63 65 -143 287 -148
2872 -148 124 211 -208 656 -114 99 223 -357 304 -457 117 6 -288 269 -55 232 243 -34 436 -393 362
2893 362 159 -491 431 -644 220 24 -224 90 -603 323 204 -31 322 -417 362 272 -353 389 -119 360
2913 360 31 -413 489 -394 151 -296 -397 261 -43 141 175 -269 365 -267 243 58 -321 305 -554 265
2933 265 -78 -473 500 -522 327 -31 -242 675 -531 384 -77 109 161 -694 456 41 -411 377 -787
2952 -787 231 225 -390 556 -373 365 -313 -110 313 -484 254 -331 -294 329 -491 -120 16 -24 365 -391 -63
2973 -63 68 -24 234 -378 537 -266 -337 417 -350 410 -387 -535 301 -242 427 -261 -240 561 -465 -7 -12 169
2995 169 228 -618 165 16 -129 284 -404 524 -117 -170 454 -137 382 -287 19 256 -276 582 -239 24 235
3016 235 -834 308 -276 75 120 -177 412 -386 55 34 -280 268 -320 266 277 -314 -51 -390 227 -144
3036 -144 -53 350 26 138 -91 65 381 -378 -66 84 6 362 -575 572 225 -264 304 -282 618 11
3056 11 -125 713 -135 338 -300 -624 463 -631 146 -515 275 436 -678 337 21 -66 304 -644 643
3075 643 93 -211 168 -548 1027 -457 -403 395 -328 619 -676 246 701 -612 262 -763 758 533
3093 533 -1106 805 -3 47 -296 -886 956 -482 -316 438 -322 1058 -740 -160 1042 -682 712
3110 712 -1044 142 869 -898 382 -304 515 434 -899 919 -196 101 256 -748 1417 -355 -544
3127 -544 451 -591 1100 -926 -185 790 -634 533 -619 316 500 -1227 739 -260 578 -88 -1146
3144 -1146 1322 -601 -327 275 -758 1178 -585 -190 825 -585 1060 -1189 215 863 -1196 783
3160 783 -704 449 476 -1616 727 -379 418 428 -1039 1538 -529 -81 327 -263 1306 -726 74
3177 74 873 -883 638 -1057 259 893 -1218 908 -639 396 336 -1229 723 101 -140 228 -739
3194 -739 920 -695 -209 586 -845 1032 -890 -114 861 -761 490 -554 299 809 -1053 531 -29
3211 -29 2 353 -961 841 -403 -53 317 -670 929 -588 6 615 -627 353 -689 94 640 -744
3229 -744 445 -558 524 489 -813 437 -279 94 402 -779 828 -452 -391 329 -923 463 -598
3246 -598 95 446 -599 436 -397 -62 454 -638 439 -85 154 510 -697 482 -196 -247 331 -665
3264 -665 460 -250 -106 272 -143 250 -244 68 332 -442 278 -270 38 126 -462 189 -293 109 220 -376
3284 -376 294 -100 -235 291 -256 236 -267 -281 336 -283 172 -146 296 252 -243 345 -63 -98 459 -203 381
3305 381 -103 -74 216 -238 82 -384 -102 167 -229 212 -39 -286 409 -203 362 -8 -67 381 -329 100 -86
3326 -86 -311 141 -296 -278 -43 -263 391 -28 313 -29 -83 550 -75 -3 -54 -187 -65 -132 25 -57 -180 382
3348 382 -72 162 123 137 115 -132 354 133 -168 15 -229 222 -84 -103 110 -127 346 112 -109 282 -178
3369 -178 101 139 -200 99 -91 98 -289 -42 192 -119 -13 167 -65 293 265 35 -11 98 292 -125 124
3390 124 -177 -83 234 -318 43 27 -41 3 -185 150 323 148 100 64 96 -246 -74 19 -178 266 -118 8 -194
3413 -194 77 -147 33 133 213 -187 231 -192 -20 -131 -221 304 -164 87 149 -138 218 -56 75 97 128 73
3435 73 109 -94 130 -57 195 -96 130 6 -56 -140 -172 117 -183 -80 -27 365 -112 150 -56 294 -194 117
3457 117 -57 55 198 -47 -48 22 74 83 -228 52 -90 -243 30 -68 13 -254 -243 -20 136 95 -392 72 43 -191
3481 -191 88 80 -126 24 -289 -13 197 -10 -354 -279 75 -319 -178 -2 -51 136 -204 9 383 -7 385
3502 385 -176 142 150 -239 127 -112 292 6 -266 168 -175 -26 -33 -51 294 -378 -51 -158 -174 103 -233 210
3524 210 338 -218 155 -265 23 286 -200 308 -58 161 -357 -450 313 -205 88 125 -270 235 -293 -12 99
3545 99 -344 82 -307 580 202 -233 138 -311 387 206 -547 501 -389 219 120 -394 236 -219 327 -43
3565 -43 -149 512 -372 163 189 -144 185 -345 442 64 -243 667 -39 147 -91 -281 342 -465 225 -230 -294
3586 -294 406 -597 -29 -60 -429 431 -483 296 -167 -234 877 -327 342 -55 -497 613 -549 8 -5
3605 -5 -568 299 -573 367 247 -292 534 -339 169 232 -518 485 -309 328 71 -410 536 -596 76 -71
3625 -71 -194 685 -525 126 177 -468 435 -771 255 74 -545 509 -569 485 68 -488 394 -603 215
3644 215 -249 -436 528 -562 246 145 -590 569 -470 -88 -55 -357 468 -743 197 318 -526 683 -109
3663 -109 361 38 -722 618 -280 155 22 -266 563 -465 -50 24 -304 295 -448 184 627 -172 512 -655
3683 -655 504 310 -575 572 -491 26 162 -110 553 -242 -217 235 -267 582 -390 104 299 -473 137
3702 137 -477 256 135 -446 463 -196 203 451 -691 512 -399 394 -58 -505 555 -471 -72 265 -14
3721 -14 348 -390 -67 296 -291 181 -237 224 270 -232 155 -113 -105 144 -350 430 -44 265 174 -191 515 37
3743 37 40 191 -238 200 9 -184 247 -174 351 -309 288 -32 -422 110 -149 194 261 -113 269 -251 58
3764 58 77 -283 38 -368 -116 -5 -137 245 -184 58 373 -297 -101 -187 43 176 -193 -67 -107 51 84 -114
3786 -114 333 -90 -127 -114 86 184 29 -68 -2 -277 28 -272 226 103 -485 17 -75 -149 -60 -553 -57 -172 -118
3809 -118 11 -27 148 -111 -149 50 254 42 -78 33 -161 -249 216 39 -13 3 58 -129 102 -236 171 36
3831 36 15 135 60 3 64 -68 210 35 236 -69 129 45 -277 309 -35 103 -115 85 308 -37 31 -204
3853 -204 -50 96 -240 53 225 98 -12 -133 235 -152 -135 -120 -149 -1 -95 -123 8 50 -78 -195 -126 83
3875 83 -183 156 3 -136 155 -121 74 1 -227 -42 -9 -13 -104 17 92 21 -39 75 253 27 44 137 -49 -210
3899 -210 99 150 -111 143 -154 65 38 252 -87 107 243 -69 164 5 238 -23 -89 80 79 -5 -142 -124
3921 -124 58 -224 -255 -73 -90 -28 -158 -126 -55 55 47 -114 -128 -140 -72 20 -9 171 161 113 -14 -53 -282 77 -152
3946 -152 53 -160 -33 -177 48 -115 -61 271 -24 -70 56 277 19 65 87 35 23 186 -151 135 35 -157
3968 -157 118 142 -133 11 58 290 76 -107 123 201 195 17 -111 168 83 184 -184 62 52 221 232 -38 181
3991 181 232 109 157 -214 59 -169 -58 25 -192 159 8 -265 49 -663 196 371 -39 14 -349 150 -145
4012 -145 -145 162 -281 -99 -174 125 6 78 -146 43 -71 205 -342 232 90 -107 114 38 -80 -297 -74 9
4034 9 -43 49 291 54 79 3 -33 125 70 501 -230 -91 162 -366 237 -253 -34 -298 -58 -57 -297 147 273
4057 273 -90 437 -210 -179 -331 -182 309 -440 96 149 -238 295 -395 8 122 -45 233 -200 109 142 -220
4078 -220 202 -158 201 -244 38 180 -262 24 104 -35 404 -190 208 172 -198 152 -389 375 -221 -217 328
4099 328 -292 248 -110 12 506 -480 -69 -137 -205 177 -143 176 138 -361 115 -258 -328 -62 -374 305 -266
4120 -266 91 -81 -100 379 -316 -6 217 55 182 -82 -39 -20 -221 108 -236 -223 86 -41 124 -364 32
4141 32 32 -243 160 -470 -53 198 -156 122 -567 60 97 -59 442 -430 34 125 -256 435 -87 135 67 -211
4163 -211 320 -389 36 147 -104 461 -199 151 -22 31 295 -65 50 18 -245 395 -114 -86 103 -325 262
4184 262 -142 15 4 -237 275 64 179 130 -435 327 -207 201 178 43 255 -274 144 139 -330 274 224 35
4206 35 121 -103 160 -118 184 219 -102 401 -53 211 29 -381 316 -306 -131 -29 -385 33 -266 -57 282
4227 282 -127 102 -398 203 -118 -130 -8 -233 113 217 -329 192 -147 -41 91 17 356 -227 -221 2 -193
4248 -193 222 -117 -65 254 32 90 -26 -40 -14 -101 -7 -88 150 -146 -175 167 -127 -403 163 -255 191 -110 178
4271 178 295 15 19 115 22 234 -199 229 97 8 116 -316 -59 36 238 36 96 37 -198 -111 -26 -34 143 63
4295 63 198 -32 -103 295 15 69 103 -17 40 122 113 0 38 133 97 -38 226 -279 -314 -97 -150 -120 -82 144 -373
4320 -373 97 -150 126 -124 -8 38 -314 -33 174 86 -99 301 -38 -29 -39 65 -264 152 37 65 -81 -99
4342 -99 -38 100 -10 -24 7 75 223 -138 -39 33 121 5 221 233 -178 250 118 -243 82 288 -183 -103 233
4365 233 14 100 17 21 227 -196 -183 103 -167 184 -45 -26 58 -2 -112 -187 -189 -27 -20 -192 -162 -5 -20 21 -145
4390 -145 -54 -99 67 -106 -52 -86 -16 -67 -138 76 -145 28 -174 47 -160 -96 -124 102 -2 31 7 32 -33 102
4414 102 36 -50 -310 -97 -115 -59 -32 -95 -149 272 52 47 -73 97 106 -23 -63 -160 5 151 119 16 222 53 -135
4439 -135 139 82 -345 -47 -54 138 -87 74 137 71 87 114 -131 167 250 131 0 -240 46 43 18 -79 -35 23 -80
4464 -80 -94 125 168 172 -28 -213 -97 -312 -160 -92 17 -147 -186 -44 -73 -177 66 -23 -14 29 -229 62 -51 -96
4488 -96 -105 51 -107 -172 22 242 -71 212 58 122 113 314 13 -95 257 -227 84 146 -42 194 -23 -180 131
4511 131 -139 443 45 -245 367 -68 -99 77 139 285 -251 -121 100 -234 142 -188 25 -152 -135 326 -69
4532 -69 35 96 -109 322 112 -67 17 37 97 -248 -110 74 -137 312 -136 107 191 -19 97 -59 370 119
4554 119 -8 155 -68 364 46 7 229 -205 193 315 -105 253 -299 68 -45 -239 216 -409 -6 225
4574 225 -209 -10 -199 148 62 78 254 -288 370 40 -141 152 -119 108 91 -242 32 41 -194 200 -122 133
4596 133 22 171 -79 -153 359 -44 281 115 -236 83 -52 -133 292 -21 442 -155 89 151 -33 179 -333
4617 -333 82 111 -141 75 -302 161 4 -318 362 -19 299 90 -396 249 -384 178 -1 -251 348 -350
4637 -350 -2 136 -40 327 -39 184 306 -105 243 3 80 207 -326 23 -294 12 -15 -215 187 9 -77
4658 -77 -115 50 297 -82 -102 141 -186 276 -277 -93 390 -80 299 -180 32 74 -266 33 -91 -17 34 -216
4680 -216 350 162 -69 90 -304 151 -424 152 301 -365 161 -169 190 342 -54 459 -84 248 218 -369
4700 -369 125 -229 115 130 119 53 -266 17 126 43 181 88 -90 189 -246 205 -123 96 155 -111 119 -132
4722 -132 -33 87 -120 218 101 185 113 -153 217 -371 172 -131 60 -33 -58 -224 158 -220 199 46 -180 193
4744 193 147 83 342 214 147 -176 194 -150 -28 211 -181 113 -3 193 45 -80 136 -71 -144 -70 44 188
4766 188 -124 -218 164 -209 -170 -218 -92 -366 184 -242 -89 61 -116 -39 176 49 27 -48 -243 47 -204 19
4788 19 29 -60 324 -17 -53 168 -35 -27 -45 13 179 -49 232 -103 -105 -66 -105 12 -56 -229 88 -10 31 37 42 -137
4814 -137 158 50 3 -66 -174 -223 -64 -251 81 -70 19 16 140 75 202 105 98 20 26 -75 -92 45 0 157 -17
4839 -17 -16 267 -111 -21 -34 -52 44 -195 -116 99 -276 -78 -204 -223 265 208 1 -38 93 130 -68 -25 168 104 58
4864 58 -63 23 53 24 65 -107 68 -86 -70 74 -40 -119 -131 -194 -118 -86 -140 147 -10 144 89 -8 220 50 -65
4889 -65 159 18 21 40 -238 246 65 -191 24 -84 29 -6 -170 -191 -23 168 -86 -78 -112 -92 -72 151 20 345
4913 345 -154 225 19 111 214 -58 -225 19 73 -225 203 265 243 -98 55 -159 18 143 -137 137 121 -133
4935 -133 34 252 -42 -110 49 46 138 -98 -70 47 327 -147 159 196 277 21 96 -29 21 134 30 -81 264
4958 264 124 109 70 112 -62 103 83 -59 -234 -13 -82 33 -376 -224 2 -210 -29 52 -111 -113 -151 28 59
4981 59 -135 85 -119 165 3 -57 100 63 182 38 -187 118 33 -205 110 -10 109 -171 -60 -61 34 105 14
5004 14 23 -117 34 357 -165 126 109 1 262 -3 -78 -91 -95 25 -235 159 117 37 248 44 113 383 -227 -30
5028 -30 -74 151 30 -283 56 -57 35 -30 -287 156 105 -10 -140 18 66 4 -278 -103 -207 239 -67 81
5050 81 -54 -70 150 -98 271 -23 -202 158 -76 131 79 -217 209 -180 18 85 26 -91 -564 131 171 167 113
5073 113 -248 140 -154 -51 144 49 125 -81 -50 256 -41 -9 -268 -320 156 146 0 -222 -168 273 -78 281
5095 281 87 -134 344 141 158 34 -238 297 -224 287 51 -377 99 -240 126 18 -118 111 -469 -111
5115 -111 98 -264 1 -207 208 217 196 120 -248 77 -88 18 100 -299 82 -85 -67 -2 -47 126 -36 -24 0
5138 0 -311 304 284 -189 241 -323 81 140 -130 490 -149 -141 -72 -17 276 129 46 188 -214 292 -160 -40 155
5161 155 -23 438 -266 -136 -116 -115 218 -22 39 -68 -201 27 16 155 -49 -90 423 -175 174 5 -191 293
5183 293 -124 332 9 -72 365 -78 27 122 -299 216 68 285 127 -98 74 -135 62 89 -104 92 -117
5204 -117 -39 -90 -63 88 -364 -112 128 25 28 -69 -18 242 89 197 -150 79 -22 -37 96 -48 340 -162 124
5227 124 219 14 54 -176 131 -11 -292 272 -161 -158 162 -97 67 -95 -394 278 -17 316 49 58 221 -109
5249 -109 -40 -111 -89 90 -11 -245 80 -12 48 -45 368 31 109 4 80 40 91 -26 -1 1 253 215 77 272 -98
5274 -98 49 -60 21 -85 -209 202 147 119 79 -128 211 69 -57 11 -10 -14 57 238 237 289 -121 153 233 -167 -24
5299 -24 -4 -27 -114 132 24 38 205 12 -188 -90 -126 -147 -62 -167 -109 219 97 -123 69 -248 245 -122 47
5322 47 3 37 272 -160 129 93 -133 56 -76 -144 -219 -97 234 -10 59 -104 75 32 135 25 -340 -45 381
5345 381 -180 7 -177 -70 1 -25 82 63 47 183 10 81 -59 -156 -198 -160 -32 -13 218 7 38 -115 -70 44
5369 44 43 -221 9 -304 -72 -74 8 89 -173 -17 -138 130 -162 -144 -47 -46 38 40 -104 -84 -207 48 -61 46 -48
5394 -48 31 -33 419 83 -9 149 -27 34 -107 -111 127 -155 514 -118 25 19 -77 248 -126 -24 -29 -79 97 -1 -31
5419 -31 15 327 -11 -83 11 104 -191 138 -25 -4 268 -271 -216 62 -7 405 -10 217 217 -76 -48 -366 273 96
5443 96 114 198 141 247 8 -98 47 118 42 -21 16 98 -62 -71 21 -71 91 30 74 13 -18 116 -224 240 156 160 372
5470 372 9 11 -81 -78 352 70 118 3 13 335 -234 75 115 -95 71 -247 182 1 -145 -14 -7 59 -127 -99
5494 -99 241 -96 -32 -54 -60 224 -23 26 -92 -105 -30 1 17 33 -48 95 -61 97 -38 -159 166 -261 -59 -87
5518 -87 -88 -121 92 121 156 -20 -196 -123 -62 94 -214 582 -216 16 -114 141 346 -274 86 146 -114 -63 -300
5541 -300 222 -155 -300 1 -223 82 -22 -188 -171 -91 121 -219 -87 242 -281 244 -120 -25 266 -10 28
5562 28 -93 81 17 -29 107 7 151 75 -206 285 -12 27 178 -66 120 197 -78 296 -166 127 -63 23
5584 23 336 -93 285 -270 -120 126 -131 77 -107 83 23 -351 0 292 -18 330 -29 184 231 -30 315
5605 315 -281 56 51 -181 145 40 -112 -7 -39 62 -256 105 -292 36 188 -144 29 -44 2 31 34 318 0
5628 0 108 36 -145 212 52 -88 169 -343 121 62 -193 15 -399 199 -25 -49 -31 73 45 -222 -165 -92 -192
5651 -192 126 69 31 172 -171 32 -39 254 193 -130 19 66 50 219 -376 95 206 -77 74 195 -91 -11
5673 -11 75 -123 -116 55 -181 181 380 -217 52 -98 298 33 -11 92 -74 -212 191 -127 106 20 -68 170
5695 170 97 -38 -70 -90 -5 194 -86 57 14 43 -140 24 -94 101 -108 -134 -78 160 51 160 -18 27 114
5718 114 -346 155 145 -202 83 -115 44 11 -103 -195 34 275 230 -29 -112 53 -4 -184 264 -125 21 -27
5740 -27 -97 279 98 -32 -168 204 18 -64 42 12 -2 105 102 1 -135 -32 231 -61 -122 105 -255 64 -148
5763 -148 -74 54 -276 -26 -138 -87 -130 99 99 -104 192 99 -62 21 -216 97 -47 300 -32 -64 -81 -226 24
5786 24 -42 320 142 71 35 14 136 4 -48 159 43 -123 245 -210 -147 -38 106 258 101 164 8 207 33
5809 33 177 -82 -191 145 199 13 29 55 -25 -170 -270 59 -23 86 -343 -38 5 2 -42 -198 -103 15 -74 -109
5833 -109 137 137 61 -43 82 175 18 -13 113 -329 168 -19 185 -224 3 -163 -174 -186 209 52 395 -136
5855 -136 71 -70 13 206 -311 38 23 49 4 -29 40 170 -214 30 -19 96 11 -65 189 64 -188 26 36
5878 36 -73 100 -66 2 16 -1 -36 151 19 -311 190 -264 -64 165 -151 203 97 69 112 -250 -3 116
5900 116 126 41 -30 -20 49 -39 -115 -130 78 -20 -50 17 -176 153 34 -265 57 -193 96 -87 50 218 -230 234
5924 234 -27 81 223 173 -123 96 -126 182 -47 -31 -84 1 -98 -223 147 9 101 99 -339 168 16 162 -126
5947 -126 -384 -184 -7 126 110 -122 -49 -128 -141 87 99 36 -85 93 -138 170 134 -134 -58 -34 -90 211 20
5970 20 12 207 -274 65 -246 -274 73 -50 -204 110 130 40 52 280 28 160 -186 -112 74 -142 224 266 -249
5993 -249 -29 -103 -118 -177 -117 23 -134 222 -158 69 223 -38 -121 243 -101 -37 -35 -2 129 -38 85 -30 213
6016 213 24 -67 168 -52 92 46 -208 -24 -50 -33 142 171 -46 -106 -239 95 62 63 66 -164 5 -206 18 -11
6040 -11 -89 4 -104 384 -61 -244 -27 -172 -67 -48 -79 -47 -286 102 166 -7 107 -215 -8 54 -62 181 24
6063 24 74 35 -193 91 -238 11 -43 -130 -58 1 251 92 40 225 -180 185 142 125 -36 -31 164 -100 -81 -51 -191
6088 -191 133 103 43 81 -134 -15 -100 261 -73 -7 251 51 62 178 -113 82 -86 17 131 -124 98 119
6110 119 -209 -67 12 82 -16 69 -111 117 -51 -151 65 -190 19 -123 120 19 204 -116 230 -174 323
6131 323 66 -88 -59 -116 -36 98 -221 64 -87 53 -180 -211 -95 -17 69 19 -211 166 -34 -209 67 39 135
6154 135 -128 23 153 250 167 138 -8 -99 -157 356 -183 79 -42 -103 -214 -175 -183 -180 323 -125 -53 144 106 145 3
6179 3 247 -95 -274 76 -167 -125 41 15 -20 256 156 73 -279 -43 75 -138 172 -50 127 226 138 295 -313
6202 -313 86 -11 15 64 80 33 49 -140 134 12 207 37 163 -76 146 -38 -269 66 -71 -55 -23 -4 133
6225 133 29 -52 71 24 -93 110 -284 65 42 -94 39 108 287 137 -90 174 -61 -25 -57 -138 21 -20 -93
6248 -93 -33 164 181 1 -54 196 184 183 24 55 48 -164 158 397 113 23 53 -200 16 107 -20 -59 -165 213 112
6273 112 145 36 104 147 -20 -19 250 6 -138 -72 33 -145 257 -327 -206 -118 90 26 -253 61 -202 -40 -85
6296 -85 207 124 -40 -21 31 -26 -16 -33 24 120 114 -2 13 -133 -34 49 106 32 -171 -200 -42 149 -271 -139 -95 -114
6322 -114 -76 -227 84 -34 123 -207 -45 -104 107 50 -124 58 49 -76 24 -3 -106 -120 -29 109 -55 93 162
6345 162 60 43 -40 170 -123 -63 -306 -23 -46 33 -129 -81 -103 62 4 -111 -185 1 190 -41 -85 -140 -17 62
6369 62 56 -152 91 30 -48 -335 15 -220 301 141 110 -248 32 -7 116 -230 131 -75 230 -2 -475 186
6391 186 21 -59 -195 40 128 -326 9 69 302 -318 66 -46 -43 74 46 246 174 -124 -125 -23 -214 -35 31
6414 31 -204 7 46 62 272 -293 139 -68 74 19 -78 199 85 99 -82 -148 113 -260 -134 118 1 -87 -263
6437 -263 134 -96 158 -27 -44 -47 69 -386 265 -173 41 -36 -129 -88 96 -3 190 -216 260 -230 -17 18 86
6460 86 -189 -6 55 -134 220 16 32 -221 114 -60 86 -67 171 174 -35 -107 -60 -15 -42 128 -40 -28 -61 69
6484 69 159 77 148 154 -4 56 -198 15 -18 40 -122 249 -18 45 -72 -88 -172 100 143 93 -4 98 -124 -107 -53 124
6510 124 -64 25 208 65 73 39 17 44 -13 95 128 -142 317 62 -167 37 -95 -125 156 184 233 135 -324 46
6534 46 48 136 -219 -29 -65 -259 165 -92 193 -354 -191 -79 -112 -291 116 -194 124 120 46 -61 74 26 102 -249
6558 -249 99 -342 -60 18 71 -178 -134 35 32 73 185 -33 188 -160 -44 -44 -93 -78 -129 -13 237 87 41 -97
6582 -97 -30 -137 -137 219 -155 224 154 400 -92 81 78 133 -185 -63 -51 -107 71 -172 0 -99 -86 -34 31 -32 35
6607 35 -56 82 -47 87 -40 190 195 -96 43 122 -38 -39 66 40 137 -97 -339 350 166 -140 86 -20 5
6630 5 165 160 -20 97 27 140 6 -16 -74 -86 92 68 118 20 -145 54 -65 -102 133 237 59 -107 -136 -182 -4
6655 -4 -2 -236 223 -123 -119 13 246 -101 10 51 -159 -28 28 179 168 27 123 113 30 -74 -118 -250 -21 -79 -45
6680 -45 4 -20 229 28 46 -115 107 223 -89 261 -65 -57 185 -148 -127 25 -225 81 65 46 175 -170 -111
6703 -111 75 139 -28 -194 -43 -47 1 192 -30 -97 -16 113 -158 -83 18 13 48 160 127 -97 153 63 -6 -100 -189
6728 -189 268 -157 -134 140 109 -7 272 -335 -99 -191 4 30 -273 67 161 388 -108 -226 -37 -34 -134 -155 62
6751 62 65 165 93 -190 -60 24 190 0 -180 53 -1 107 60 -61 -117 61 109 2 -184 -40 -117 137 -127
6774 -127 -206 -132 60 -1 157 70 -196 172 -73 -287 450 0 -236 139 -109 88 86 192 -22 -167 -265 -260 -232
6797 -232 92 274 48 58 -13 43 -217 164 -72 -239 -325 -101 34 94 -162 -202 -276 434 183 -77 -86 -50 58
6820 58 156 130 -8 104 -31 -112 -60 210 -120 37 75 -13 -17 140 136 -63 -68 60 83 27 -210 -118 118 -115 -93 -10
6846 -10 97 -38 -166 -34 -66 -85 -68 242 36 -96 -151 107 16 99 13 -253 168 -27 -73 7 -123 -257 -179 -301
6870 -301 101 33 -313 46 -16 -169 -60 154 -39 16 215 23 32 146 -119 -23 12 277 -87 -81 -18 -120 -36 -160
6894 -160 45 -11 102 50 96 -91 -7 126 -123 -223 31 -44 -203 -179 -133 143 -30 205 63 -112 -71 -136 189
6917 189 273 31 -107 -126 108 32 5 431 22 10 -59 61 190 -47 -211 178 -164 145 -114 192 24 -309
6939 -309 235 50 -12 -87 -128 203 -221 -36 214 -55 -72 122 25 -186 -72 124 -155 34 201 -102 22 105
6961 105 61 94 -114 300 9 -180 -34 3 -177 -151 -59 -46 -113 167 -197 -338 10 -129 243 -74 -44 0 164
6984 164 100 159 -102 119 -88 -203 -20 -229 57 -116 193 -41 51 -203 -39 143 -257 12 -344 190 142
7005 142 -117 -151 -67 -123 -119 -154 -166 37 131 42 -73 34 63 -77 -53 -72 47 -110 173 280 365 -80 210 111 -100
7030 -100 4 113 -143 -372 168 7 -160 160 44 -36 74 -40 36 -276 -443 -126 -40 213 50 -58 255
7051 255 -33 -54 224 -127 -50 -163 -356 -127 -122 -15 10 194 -17 -22 -288 58 115 201 -4 -93 66 -25 35 -89
7075 -89 101 69 45 -194 -178 36 -140 -153 -191 -78 92 -102 -173 -82 -119 118 -62 -255 -152 372 -25 -317 -69
7098 -69 -90 322 -123 -50 39 64 -3 -127 -118 -27 -136 156 25 50 78 -83 88 -264 183 34 132 -3 -26 17 -24
7123 -24 -173 86 -256 178 58 132 30 42 237 169 -370 -82 -117 -105 -28 -28 -10 -171 78 -214 135 41 -162 -106
7147 -106 5 6 -19 -5 -35 -183 -66 -41 56 -31 -21 14 95 -188 -88 167 -9 -229 -63 -27 -38 -137 -97 71 120
7172 120 136 103 -236 69 -62 111 -39 -16 -56 -46 -94 45 220 -153 -92 63 -206 -22 -1 -18 -189 -19 -52
7195 -52 65 -41 47 298 66 -129 -128 -155 -185 11 74 138 104 28 74 221 -51 42 -103 -81 -129 234 -231 -61 -1
7220 -1 -10 -153 -223 -89 60 -2 124 34 -143 26 -209 -151 -86 207 48 -27 61 -38 154 17 19 69 -5 -118 73
7245 73 -124 311 -71 -83 -125 -120 147 -94 -118 -88 -22 60 -63 -7 -161 -29 -96 -129 37 112 33 -100 -142 -159 82
7270 82 -17 62 43 -52 82 -69 -39 -242 110 186 24 131 -100 74 -146 -189 302 -10 59 32 -2 16 -104 141
7294 141 267 -101 72 -139 -116 -187 -223 57 -123 150 193 -51 -108 114 49 181 159 -56 -204 69 -47 140
7316 140 56 107 250 -101 -210 0 -109 83 197 -48 -148 -149 -83 -20 -197 9 -164 160 13 202 -1 57
7338 57 -126 -119 -79 118 134 163 164 -86 95 -22 -14 -131 -65 -135 -107 68 -59 91 139 -61 -84 -31 71 38 166 -46
7364 -46 56 55 -23 299 88 -327 182 -56 72 52 -152 105 190 -88 80 50 -178 281 -122 -137 -4 120 51
7387 51 -17 52 -61 -24 -134 71 -50 -193 -159 -175 38 -132 41 -108 214 231 -142 32 -96 156 74 -179 -98
7410 -98 -95 77 21 -58 -74 -98 83 67 245 -54 308 -39 -123 140 -145 26 113 45 141 86 0 -18 120 -113 356
7435 356 -324 -152 56 -106 258 105 50 -163 -75 -27 50 -19 -41 14 -187 -331 -41 42 -18 -2 -121 6 278
7458 278 -70 69 -225 22 -81 -161 -110 13 144 -198 188 191 -51 122 -55 -107 113 47 50 250 -118 -95 28
7481 28 -149 -181 -86 67 -88 64 200 -53 -43 -104 52 125 -183 67 -24 51 -94 12 -179 -158 20 74 -96
7504 -96 137 175 29 28 79 72 -281 72 -140 -93 -145 98 272 227 -69 96 -52 -13 66 -140 22 112 162 -5 -55
7529 -55 -304 235 81 4 -211 540 -116 -139 66 78 12 72 -104 142 297 179 -40 23 -21 -51 235 164 69 127
7553 127 10 -30 81 184 -160 205 76 -309 85 -150 32 223 -106 -140 -119 -25 -36 -57 166 251 50 -164
7575 -164 -2 142 259 -213 190 -24 119 -323 -76 -188 180 -113 -81 152 -237 -62 -58 -281 -188 -115 91 -121
7597 -121 -198 -260 -357 -88 100 180 -5 -157 -63 169 48 -124 -77 110 83 217 58 -64 -202 -3 -249 -117
7619 -117 262 119 3 104 2 -82 29 -87 5 32 -103 213 -139 -91 89 -38 -104 25 -74 -179 -26 172
7641 172 -99 -63 -28 -27 -143 35 -315 -89 77 152 79 -172 109 -65 -78 98 0 -22 -66 -31 -201 6 -111 5
7665 5 62 -103 -275 -126 212 102 51 55 -29 -66 395 205 49 -66 -48 339 -140 -82 13 47 53 -137 54 -56 46
7690 46 -114 30 210 -56 -129 -105 -40 192 -28 -244 -192 -60 -82 29 22 28 -105 -312 159 111 156 -88 64 -167
7714 -167 175 -12 91 -23 44 -39 -142 -48 -249 58 254 113 77 52 46 11 -2 114 296 53 106 281 -182
7737 -182 -19 91 20 -171 -189 -100 14 222 -9 -153 -4 72 159 -105 -77 67 -11 68 -121 -216 72 -158 232
7760 232 -24 211 87 150 9 150 178 276 176 -188 75 -51 118 94 67 232 -74 27 -111 -163 -2 9
7782 9 177 -87 144 111 64 -217 -32 -143 18 -83 17 -124 -82 132 70 -75 102 -141 96 -9 18 -69 64
7805 64 -127 15 -101 35 38 -91 44 465 38 -465 -68 76 -7 -99 -127 -290 -21 -78 38 -320 -30 -240
7827 -240 -4 -222 -65 75 -97 -99 47 48 -166 17 35 320 52 21 5 -90 93 -127 -83 76 239 191 147 -293
7851 -293 149 161 111 87 13 220 -42 89 127 -122 6 71 -122 87 -192 -50 -361 19 -22 196 -225 -29
7873 -29 28 0 63 216 -119 41 69 -227 28 205 -57 114 15 -59 5 -303 -38 100 55 140 147 44 -127 -127 -17
7898 -17 -36 187 -426 -95 -324 34 246 -201 -122 180 122 -126 -215 -90 -129 368 40 122 -245 -209 -122 51 -57
7921 -57 7 42 -16 -60 -22 72 -86 -226 -291 77 194 30 -30 -169 -115 17 -246 123 -12 143 4 -162 35
7944 35 -83 65 -214 -8 -56 73 260 -32 -211 158 187 184 -163 -35 47 -55 42 -72 8 -56 -25 -38 262 -20
7968 -20 103 -405 -41 269 52 -61 156 146 205 43 14 75 8 141 123 33 -168 -167 246 37 -220 134 141 71
7992 71 -16 -45 34 -98 -356 99 91 67 30 28 -141 16 -115 -299 -252 -208 59 -168 -4 -133 -50 -54 34 124 131 -92
8018 -92 143 24 -21 266 -35 -99 141 -267 -5 -55 83 120 -27 103 68 72 126 65 93 66 -88 171 -14 20
8042 20 -25 -96 205 -30 -28 -258 7 126 96 58 -60 81 -11 -26 -95 192 8 49 51 50 -68 55 123 -120 -111 22
8068 22 153 133 151 -1 98 23 -21 -44 113 64 -3 -163 -454 -2 -30 -24 51 168 172 20 114 -210 13 -48 -211 88
8094 88 -157 -184 170 238 71 45 85 -62 -23 55 163 241 73 150 111 -241 183 -265 144 41 174 -66 -75 -32
8118 -32 -180 1 121 91 150 -112 -44 114 -240 -28 -85 86 151 109 -340 -59 63 26 5 225 28 -82 -192
8141 -192 -184 -62 124 -150 -313 -122 274 55 90 335 -81 -130 140 73 -90 85 -38 -198 -37 256 80 -185
8163 -185 -116 234 -101 -239 -32 64 89 -194 -182 218 -325 -112 128 -209 -34 -10 70 116 -8 92 -65 111
8185 111 -187 -2 65 194 -97 3
8191C
$$ Imaginary data points
##PAGE= N=2
##DATA TABLE= (X++(I..I)), XYDATA
0 0 0 0 0 0 0 0 8 -8 8 -8 8 -8 15 -16 24 -24 31 -36 44 -48 58 -68 76 -86 100 -116 132 -152 170 -192 214
31 214 -238 267 -298 330 -364 406 -448 491 -541 596 -650 714 -782 857 -940 1029 -1127 1239
49 1239 -1360 1493 -1646 1820 -2016 2247 -2518 2841 -3228 3700 -4292 5049 -6046 7398 -9318
64 -9318 12177 -16734 24727 -41004 84810 -401972 -804532 916997 -413320 72745 204572
75 204572 -566768 579892 -105816 -267832 -8124 147502 286358 -494224 113653 15932
85 15932 53599 157597 -587946 535974 -2866 -358680 254238 -372534 518876 -77798
95 -77798 -509822 441378 -189817 187408 -225201 -186616 614691 -492595 23124 42128
105 42128 -146552 501597 -511483 -34640 310957 -156676 14030 -261123 345239 -5064
115 -5064 -278616 130298 -229418 420312 -168591 -384926 479124 -240237 51474 -76502
125 -76502 -169861 497506 -367835 -94700 127060 -54109 197677 -345860 116346 126262 -163371
136 -163371 56326 -245118 322605 10111 -365917 243042 -121166 117267 -47076 -217626
146 -217626 306705 -158370 -39032 -50291 -18457 266601 -316708 20165 108921 -128784
156 -128784 145197 -222576 105712 125165 -237363 67192 -60074 114416 -22420 -165079
166 -165079 131065 -85783 51395 -79173 -56242 219791 -223794 16201 41307 -103671
176 -103671 181360 -182156 1818 112278 -155293 52985 -46052 43114 14766 -118135
186 -118135 54425 -57605 53819 -30104 -67743 109372 -118055 5031 17683 -52099 93617
197 93617 -109827 -798 30659 -80419 64595 -65576 33783 77 -99662 65222 -44259
208 -44259 13919 12547 -69688 44421 -45122 -25518 29396 -19246 13615 -61933 6709 -3073
220 -3073 -25709 34486 -58097 32895 -20530 -69565 59452 -25896 -4477 7254 -62461 30692
232 30692 -18491 -27343 24155 -13555 -9002 -38421 -2556 8342 -4992 -1994 -31914 9397 -15721
245 -15721 -28961 21330 -9112 -229 -26010 -29625 19881 -15835 -2797 -2802 -20604 4034 -33159
258 -33159 -4096 22826 -19909 -5214 -21272 -12639 5662 -12871 -6030 6759 -19056 -23871 -2324
271 -2324 -3400 4316 -5503 -20143 -6676 -3423 -21841 12244 -1287 -12494 -8199 -24420 2638
284 2638 1987 -10771 -2402 -6587 -19351 -5428 -9064 8236 300 -18801 -7779 -8117 -6291 -152
298 -152 -3041 -4425 -4898 -24713 -2694 4050 -5538 -1678 -12611 -10859 -1652 -12011 482 9134
312 9134 -15126 -10215 -8801 -7997 7021 -5341 -11448 1967 -15474 -13070 4815 -1410 -1849 -4799
326 -4799 -18409 -586 140 -8340 3947 -2622 -12119 -9614 -6800 -1586 6744 -10510 -8806 -4825
340 -4825 -7180 -6091 3753 -1068 -4921 -5941 -15480 3690 1065 -4782 -3538 -5218 -11131 -3210 -4767
355 -4767 1314 1756 -9959 -8917 -4590 1135 -4270 5996 -9753 -4364 -3190 -13650 7978 300
369 300 -10385 2826 -15199 -5454 8056 -10015 6336 -5304 -7860 -2922 -2773 940 -2479 5831
383 5831 -14635 -8419 6833 -15117 12681 -5678 -16516 17388 -23041 1249 11315 -12329
395 -12329 11626 -15859 -6307 8006 -7759 5963 -15133 11685 -10266 -17760 19090 -19065
407 -19065 19275 -8271 -26226 29175 -19145 2372 6853 -17129 25204 -32665 3133 9292
419 9292 -13349 24355 -42049 18544 7750 -30706 30026 -23370 15032 6128 -40439 32973
431 32973 -13649 8422 -5220 -23444 38758 -43653 19157 -1199 -20674 50989 -64520 20508
443 20508 26886 -46251 49541 -41241 10308 25479 -53632 39520 -21684 15401 -3895 -37040
455 -37040 51742 -44611 25007 2370 -38102 69226 -68745 20610 28574 -50893 61267 -60603
467 -60603 21703 22525 -58440 63528 -51507 26169 14716 -68996 85090 -54909 12664 30610
479 30610 -64308 73263 -54266 6563 32248 -46694 49731 -59936 34440 14037 -59770
490 -59770 81466 -73874 42310 18786 -92103 117323 -68028 1115 44720 -81253 87963
501 87963 -55171 -10784 51051 -53958 54388 -66133 34336 36299 -75064 76830 -70204
512 -70204 45894 24595 -104446 111733 -54011 3969 24866 -83071 116068 -68888 -10394
523 -10394 48043 -62632 95220 -94478 14337 78951 -89367 67391 -67157 29472 60759
534 60759 -112854 73043 -27612 21048 8874 -89661 117303 -50011 -1688 14669 -62938
545 -62938 130550 -99529 -15938 82977 -75896 78925 -90420 10044 98769 -104323 45042
556 45042 -36339 39421 38472 -116074 89312 -13057 3097 5096 -86964 130100 -50270 -39567
568 -39567 39382 -44857 101809 -98704 -10445 90910 -63406 50888 -80873 36263 86496
579 86496 -122946 55126 -17887 21674 34620 -122956 96955 5292 -31978 5785 -48367
590 -48367 105970 -52210 -35656 43944 -24036 74791 -101261 5470 96254 -82254 36132
601 36132 -51303 28349 72582 -118767 47121 17798 1258 12071 -81660 86986 1756
612 1756 -38705 5564 -24774 85029 -63310 -31849 59113 -25456 38551 -67964 9993 80604
624 80604 -70263 18273 -19906 30192 35157 -94038 54430 9157 -8692 4355 -58914 75684
636 75684 -6389 -46350 24953 -9940 47428 -43399 -19653 51786 -17383 12968 -46281 24806
648 24806 43212 -60680 19920 -8221 17187 18260 -66784 47356 13722 -21562 6744 -25381
660 -25381 47158 -11257 -29706 18851 -1172 20527 -34843 -3371 35317 -20114 6072 -20347
672 -20347 16380 25900 -40417 15803 4499 5468 2427 -31420 28672 1799 -14195 2458 -11739
685 -11739 27858 -14802 -13940 19365 -4014 9951 -16047 1753 19330 -12071 -431 -5198 7941
698 7941 5960 -20055 10110 71 3025 -1319 -13232 20222 -4100 -4564 4982 -3834 10217 -6111
712 -6111 -6984 9031 -1893 -845 -6774 3383 4159 -4964 3774 -3852 7725 165 -5920 6849
726 6849 -860 768 -686 -4594 5175 -2719 -2595 1291 -475 2310 -2973 2826 138 1826 1957 -3151
742 -3151 3481 747 -2588 1293 -1796 751 -1651 -318 -128 -1307 3670 -3170 3180 1526 -1505
757 -1505 3491 -639 -728 2203 -2930 590 -944 -1344 41 -843 712 -2326 4525 -2464 1255 3294
773 3294 -3046 2942 568 -3432 3927 -1968 -2803 2022 -2920 663 -911 770 -1337 2755 -116
788 -116 -1035 4143 -1416 233 2303 -3006 950 363 -4146 2611 -2170 -579 359 269 -155 1234 1268
805 1268 -786 2205 813 -1715 2219 -1095 -1951 1507 -3641 507 4 -1680 933 596 -403 1520
821 1520 626 -44 1130 811 -1047 355 157 -2619 1926 -2213 -401 440 -688 477 832 -63 1761
838 1761 464 1065 402 -743 1655 -2582 1154 -1524 -367 -694 -1199 338 -94 211 1072 -1 1743
855 1743 78 -664 2255 -2757 2704 -3166 -558 1682 -3552 1278 -587 -1302 2830 -1938 1131 1593
871 1593 -485 1637 -3163 3973 -2392 -886 1472 -4868 4605 -2890 -3429 5498 -4571 3192 -357
886 -357 -2583 6824 -4837 2485 -1165 178 2949 -7519 4291 -1755 -2181 4064 -9177 8627
900 8627 -239 -6218 8710 -6585 7694 -2913 -4292 8448 -6112 3947 -5184 -2049 9623
913 9623 -12837 5982 -935 -2766 11055 -15813 11011 1941 -5948 7734 -11359 11691 -1966
926 -1966 -9973 9929 -9576 10083 -6970 -7956 18726 -14353 8291 -3803 -3496 17959 -18730
939 -18730 6568 2400 -4181 9710 -20616 14605 518 -11521 12472 -17550 19972 -4003
951 -4003 -16040 21821 -12965 10864 -4875 -11858 24569 -18601 4089 -1756 -4673 19018 -27079
964 -27079 13216 2701 -7131 15353 -25855 22133 3222 -19722 19797 -18653 18327 -4191
976 -4191 -21052 27455 -18814 11411 -6919 -11080 30732 -26333 8581 3776 -9251 24149 -30527
989 -30527 14229 8190 -16408 17654 -26426 22166 -4 -21505 23868 -20118 19113 -4787
1001 -4787 -20335 34549 -23367 9621 803 -16568 32403 -29866 7808 6926 -13800 21716 -28062
1014 -28062 16125 6924 -18324 22491 -23970 20428 1467 -23722 29698 -23758 14622 -1367
1026 -1367 -21341 32321 -25911 9171 4928 -18087 29795 -26949 11043 8632 -18737 25248
1038 25248 -25166 13723 4476 -20054 24414 -22807 12725 2693 -19787 28009 -24125 12539
1050 12539 5625 -20298 28538 -24834 11030 6948 -21752 24823 -20210 7541 5857 -20379
1062 -20379 25085 -17731 6202 5543 -15606 25167 -21302 7346 6993 -14053 19694 -22440 10292
1075 10292 8026 -19556 18771 -17568 12279 5537 -23053 24865 -12940 5747 2642 -16840
1087 -16840 25526 -14275 -2594 5837 -8967 17575 -19998 3496 10552 -10051 11174 -18433
1099 -18433 14324 8399 -19103 12944 -8528 10005 932 -20883 20254 -5209 -1840 -1778 -8240
1112 -8240 21387 -13267 -3733 6298 -784 10854 -17786 3717 13513 -9962 1726 -9837 10898
1125 10898 5418 -18095 7147 308 7687 -6035 -11080 17698 -2052 -4084 -2152 -1034 15506
1138 15506 -13031 -6835 9446 139 1364 -12715 5595 10097 -6300 -4105 -1461 12592 -1319
1151 -1319 -12464 7015 3442 2504 -7943 -6477 14034 -2649 -7534 -1342 5701 6285 -9197 -2924
1165 -2924 7814 4017 -4518 -7649 7815 4857 -6732 -4233 1343 8178 -5414 -6712 4307 5984
1179 5984 -1386 -7042 2794 7670 -2153 -4944 -1238 7149 738 -8870 1174 4240 2211 -6630 -1702
1194 -1702 6242 1121 -3039 -3646 5571 5091 -6686 -737 2737 2229 -987 -7568 5135 2243 -2927
1209 -2927 -2371 90 6169 -2651 -3002 2366 2260 2521 -5982 780 5484 -4086 454 -3479 2761 2296
1225 2296 -6052 1869 1468 1734 -736 -3264 5569 -137 -1243 418 -1779 4977 -4339 -1523 2165
1240 2165 -1560 1664 -3365 1121 3218 -2545 1772 -1119 2328 1422 -4406 3852 -1958 657 -256
1255 -256 -3839 3843 -1969 -1395 1611 -1404 2635 -1359 -198 2630 -1595 2515 -2512 1149 962 -3062
1271 -3062 1830 -1679 -28 700 -2590 2159 -441 -183 1338 -1701 3089 -1643 914 498 -1511 1729
1287 1729 -2578 78 1061 -2125 1725 -575 -482 2164 -1493 1981 -140 570 129 -717 940 -1445
1303 -1445 577 -447 -1779 1445 -1307 -305 1936 -1731 2125 -420 298 758 -519 102 -667 113
1319 113 -303 -1119 606 -1180 -319 1305 -1822 2020 -554 5 1451 -653 643 200 -86 -314 -404
1336 -404 23 -948 57 416 -1815 2251 -1321 224 1368 -1049 970 517 -713 228 -156 -118 -243
1353 -243 -344 -231 -1341 1799 -2003 865 1108 -1455 1988 -345 -259 1487 -1329 518 127 -809 470
1370 470 -1694 1709 -1481 690 596 -1964 2791 -1328 -46 2177 -2038 1826 -478 -1245 1678 -2232
1386 -2232 1546 -1750 516 839 -2726 2908 -1357 401 2387 -3529 3580 -635 -1651 2631 -3276
1401 -3276 3012 -2077 -998 1271 -2347 3052 -2808 571 3845 -4324 4060 -1213 -663 4142 -6290
1416 -6290 3659 -981 -1197 1696 -4655 4372 -1822 -1432 2720 -3809 6195 -3426 -2036 6742 -5577
1431 -5577 4466 -3391 -1124 5515 -6728 2813 -1798 445 3230 -7636 6386 -788 -1776 3939
1445 3939 -7541 8845 -2717 -4965 5763 -5285 5494 -4388 -3601 7909 -5644 3440 -3741
1458 -3741 570 8153 -10370 5652 -689 -124 4597 -10781 7764 743 -5363 3455 -6595 8853
1472 8853 -3159 -6085 8221 -4968 7337 -6467 -2296 11956 -9555 2898 -2363 -815 9057
1485 9057 -13247 4549 3053 -2524 4136 -10738 10956 315 -6423 4921 -5829 10694 -5254
1498 -5254 -7914 11286 -6080 3665 -5349 -3052 13328 -11126 2125 20 927 7681 -14026 6860
1512 6860 4016 -4854 4019 -10298 10655 564 -11145 7513 -4178 7555 -5050 -6718 12254
1525 12254 -5115 1769 -3653 -222 11997 -13045 1990 3063 -1992 6317 -13672 7568 4611
1538 4611 -7159 3690 -5740 9018 -304 -9274 8598 -2832 4474 -4765 -5731 12567 -7895
1551 -7895 211 -936 -1067 8927 -10716 1964 4747 -2484 4014 -8902 6895 3501 -7769 4507
1565 4507 -4732 6261 -1512 -8284 8252 -2520 822 -1195 -3413 8938 -5304 -401 1697 -1114
1579 -1114 5481 -8383 2628 3165 -4077 3229 -5286 4009 2173 -6510 4686 -1387 1939 412
1593 412 -4198 5720 -2315 -322 -315 -1828 4000 -4199 179 1980 -2236 3141 -3207 1141 2151 -3077
1609 -3077 2956 -1562 930 387 -2127 2449 -1648 -420 589 -1774 1568 -1710 60 2400 -1869
1624 -1869 1053 117 639 531 -1626 686 490 -986 -1098 -464 1561 -670 -1915 1101 986 1035 -1274
1641 -1274 -455 3054 -67 -2814 991 470 901 -1654 -2210 2968 103 -2227 -607 1311 2032 -2034
1657 -2034 -1310 2633 475 50 -3259 1553 2703 -3297 -516 -241 2109 336 -4506 2501 2342 -699
1673 -699 -704 -1926 4813 -1363 -3369 1495 -46 2800 -4048 -1710 4924 -1875 -449 -1391 1111 4058
1689 4058 -4859 912 1621 1081 -10 -4594 3994 964 -2442 -19 -1705 4482 -1655 -3856 4101
1704 4101 -838 2195 -2683 -802 5117 -3256 -284 -511 1128 2489 -5407 1360 1709 -928 1131
1719 1131 -4221 4483 1055 -2953 2067 -1208 3469 -1911 -2746 3716 -1524 390 -2242 -977 4375
1734 4375 -4087 781 364 -2 2429 -3990 2253 1926 -1739 1011 -2368 2580 207 -3248 2409 -1679
1750 -1679 2072 -1645 -1845 4099 -2066 910 147 -904 2741 -2564 163 1372 -904 1580 -2860
1765 -2860 1567 409 -1826 1740 -1846 2022 239 -1738 2399 -936 520 62 -1628 2297 -1788
1780 -1788 253 -409 -758 1666 -2043 1090 573 -734 1684 -1377 923 988 -1796 1613 -1276 398
1796 398 187 -1069 1287 -1080 649 8 -486 1499 -807 484 898 -1086 1514 -1375 295 581
1812 581 -978 453 -1173 259 131 -576 773 -390 557 735 -1001 1526 -924 7 128 -1007 517
1829 517 -666 -217 78 -548 466 -486 187 642 -576 1532 -680 572 378 -737 825 -492 -413
1846 -413 272 -811 550 -391 -16 408 -429 1350 -672 477 631 -857 1066 -548 -17 144 -1063
1863 -1063 695 -466 -126 267 -870 1349 -1024 330 657 -974 1357 -1108 -132 465 -1500 600
1879 600 -560 -604 857 -1430 1493 -698 595 698 -980 1630 -1145 501 827 -1812 1430 -1158
1895 -1158 -445 1062 -1795 1620 -1386 376 774 -1553 2011 -1242 257 987 -2072 1745 -1362 -515
1911 -515 1518 -2563 1907 -1326 107 1203 -1819 2158 -1226 378 1302 -2119 2604 -1767 -440
1926 -440 1682 -2980 2416 -2204 -10 1934 -2763 2082 -1378 423 1925 -3018 3246 -1145 -177
1941 -177 1738 -3698 3541 -1933 -752 1631 -2748 3543 -2108 -671 2710 -2550 2726 -2095 156
1956 156 3064 -4565 2923 -1713 268 1788 -4807 3500 -642 -582 1693 -3104 4758 -1634 -1688 2955
1972 2955 -2505 3877 -3484 -837 3890 -3927 2054 -2275 641 3600 -5407 2740 59 138 1892
1987 1892 -5215 4942 -569 -2033 1292 -2994 5099 -2987 -2542 4072 -2193 2907 -3275 -572 5822
2002 5822 -4370 1364 -1173 1458 3172 -6444 2929 612 -661 784 -4964 5639 -218 -3724
2016 -3724 2417 -1700 5021 -3189 -2732 5082 -1923 711 -3137 158 5336 -5809 387 380 1021 2032
2032 2032 -6892 3824 2528 -1899 -178 -2847 5582 -511 -4686 2718 -477 2869 -3574 -2705 6404
2047 6404 -2349 -747 -1915 1786 4831 -5645 -133 2582 687 155 -5277 3690 2448 -3737 -266
2062 -266 -1326 4814 -1704 -4456 3658 724 574 -3194 -877 5270 -2411 -2052 408 1785 1998 -5252
2078 -5252 599 3105 -221 -1281 -2533 3929 1786 -3773 88 910 2611 -1787 -3509 3302 854
2093 854 -1427 -2061 1065 3451 -1843 -1894 1805 1626 310 -2768 439 3124 -1406 -1431 -737 2511 240
2110 240 -2794 -169 2357 61 -1608 -723 2129 1142 -1934 -125 1201 1020 -1656 -1817 1503 761
2126 761 -1790 -651 1 1503 -624 -1898 1596 465 -81 -863 -194 2144 -798 -1115 653 91 895
2143 895 -2263 534 1669 -1272 532 -1333 1605 775 -1988 1540 -19 178 272 -2035 1888 -1215
2159 -1215 -452 404 -1296 2183 -1525 -53 1527 -1098 1285 -929 19 1438 -2339 1772 -1095 -279
2175 -279 923 -1921 2204 -1164 -32 1450 -1652 2009 -1158 -314 2138 -2594 1594 -1122 -14
2190 -14 1292 -2720 2161 -795 -220 585 -2118 2459 -953 -1101 1779 -1717 2086 -1729 -553 2203
2206 2203 -1992 1267 -1508 98 1949 -2515 1646 -191 -221 1673 -2873 2512 -317 -1050 1280 -1741
2222 -1741 2095 -1427 -1062 1828 -1421 1097 -1235 -223 2835 -2360 1371 -498 -67 1814 -2357
2237 -2357 1507 -214 -751 816 -2051 1824 -150 -1452 1715 -1348 2164 -953 -1069 2111 -1534
2252 -1534 875 -848 -252 1813 -2149 617 -131 -717 1401 -2171 1655 142 -724 1055 -1474 1819
2268 1819 -561 -864 1137 -1307 764 -812 -1035 1496 -1612 604 -313 -280 1593 -1273 919 51
2284 51 -510 529 -1515 891 -112 -1172 1140 -1062 940 -205 -828 1430 -534 512 -49 -479
2300 -479 937 -748 399 -113 -557 877 -1204 356 -79 -538 741 -680 686 173 -487 871 -372
2317 -372 229 11 -406 736 -784 332 -96 -595 405 -837 491 -24 -516 881 -405 131 153 -489
2335 -489 596 -475 498 -292 -513 718 -331 341 197 -289 375 -280 262 394 -403 962 -883 329
2353 329 16 -295 323 -535 306 -134 -236 326 -362 444 314 -358 673 -734 412 99 -592 412 -804
2372 -804 229 91 -656 389 -453 191 272 -674 847 -640 415 287 -635 850 -720 70 407 -498
2390 -498 666 -644 294 588 -833 839 -709 703 366 -612 961 -770 161 -182 -790 1072 -874
2407 -874 178 546 -857 1433 -938 512 439 -692 1045 -1043 717 327 -766 809 -951 -130
2423 -130 131 -1106 1430 -951 511 492 -1075 1654 -1243 534 813 -1086 1391 -1266 188 736
2439 736 -1245 1761 -1223 684 335 -1009 1625 -1010 550 47 -1127 1539 -1051 57 483 -1140
2455 -1140 1597 -1263 704 534 -1168 1614 -938 706 788 -1369 1477 -1248 181 413 -1423 1555
2471 1555 -1528 739 660 -1132 1656 -1069 602 981 -1509 1382 -1031 344 348 -1950 1441 -1192
2487 -1192 199 281 -1221 1680 -1315 7 796 -921 1493 -1519 60 1109 -1512 1205 -1386 723
2503 723 726 -1900 1334 -625 573 58 -1438 1948 -483 -49 7 -538 1936 -1470 -279 889 -865
2520 -865 866 -1601 532 1259 -1239 493 -604 1058 463 -2093 1396 -66 268 -423 -1266 2103
2536 2103 -665 -949 195 165 1455 -1618 -399 1574 -303 582 -1309 1189 1011 -1750 40 277
2552 277 993 -528 -1810 1376 662 -624 -818 -190 2207 -814 -1206 352 626 526 -1645 37 1059
2569 1059 -391 -1260 -610 1187 661 -1469 1 1016 1047 -1317 -820 1137 772 -633 -1330 568 1020
2586 1020 -952 -1285 674 1064 -476 -1482 963 1150 139 -1339 -51 1681 -663 -1058 -221 1253
2602 1253 72 -1610 190 1132 357 -820 -1105 1698 416 -1181 -79 350 1630 -1651 -817 1222
2618 1222 125 -405 -1408 800 1557 -1364 -137 -63 1595 216 -1889 1427 55 -6 -1088 -985 2070
2635 2070 -869 -909 610 -9 1306 -1726 61 1643 -516 233 -1235 934 777 -1932 640 -218
2651 -218 626 128 -1797 1756 -288 -165 138 -753 2337 -1247 -308 912 -624 912 -1714 297 1305
2668 1305 -1398 526 -1143 643 729 -2153 1535 -569 220 171 -1344 1733 -866 -427 248 -1119 1709
2685 1709 -1436 -89 936 -1330 1183 -911 612 734 -1508 946 -788 256 589 -1410 1425
2700 1425 -813 16 547 -1348 1576 -827 -189 826 -913 1266 -1136 -70 955 -1443 1288 -841
2716 -841 176 699 -1611 1177 -618 136 704 -1286 1266 -905 47 982 -1272 1296 -696 -286 540
2733 540 -1334 1131 -701 -23 841 -1035 1153 -380 101 755 -1134 1331 -604 -268 479 -984 903
2750 903 -645 -89 758 -1085 898 -406 -28 736 -1097 931 -465 -227 602 -1079 985 -693 -152
2767 -152 698 -855 856 -480 -33 732 -658 805 -458 -174 618 -892 459 -515 12 122 -896
2784 -896 745 -251 -188 352 -712 820 -426 -75 808 -486 557 -529 -48 404 -678 184 -183 -77
2802 -77 376 -247 433 -97 70 584 -504 436 -275 67 336 -385 351 -111 -220 472 -658 516 -167
2821 -167 -144 646 -254 401 -1 -24 110 -438 98 -186 -223 10 -470 488 -59 -159 204 -259 528 -105 -123
2842 -123 276 -345 303 -208 -249 141 -620 392 235 -1 135 -196 243 -133 -71 413 -109 115 -28 -396
2862 -396 243 -318 -165 -16 -291 564 -364 375 80 -12 249 -196 385 167 -301 303 -709 61 -134 -144
2882 -144 237 -268 321 149 -175 -127 -177 192 -77 -82 219 -359 272 -287 -286 254 -292 449 -20 -209 529 15
2904 15 432 189 -109 419 -506 367 -52 -52 153 -579 337 -24 -26 161 -218 191 -13 -122 678 -347 267
2925 267 -308 -169 390 -384 230 -104 -135 263 -522 290 64 -341 297 -408 260 22 -334 119 -563 134
2945 134 -283 -498 617 -375 311 -93 -29 648 -381 538 -269 61 543 -658 387 -61 -9 226 -718
2964 -718 618 -228 -540 236 -435 333 -261 7 576 -318 230 -359 149 339 -596 247 -6 -41 319 -502
2984 -502 777 117 25 102 -229 552 -503 96 259 -210 270 -393 24 539 -238 287 -357 49 274 -77
3004 -77 506 -242 63 115 -369 333 -378 -118 103 -27 461 -279 314 210 -157 576 60 126 -206 -427 248
3025 248 -254 -41 -155 -154 201 -721 34 25 58 315 -211 241 350 85 283 -486 238 60 -357 390 -374 479
3047 479 -104 -42 272 -335 222 -228 164 -1 -402 538 -77 -28 114 -953 604 -235 -104 231 -318 750
3067 750 -560 -67 421 -44 147 -478 379 340 -762 316 -480 547 -111 -745 785 -307 362 -350
3085 -350 -358 1021 -442 -320 340 -262 709 -853 515 551 -685 289 -964 660 251 -1206 513 -183
3103 -183 519 -104 -935 970 -341 -53 -213 -404 1204 -1147 111 429 -164 887 -1172 468 815
3120 815 -790 551 -797 492 -6 -1203 1122 -481 558 -312 -638 1415 -602 -322 156 -283 1249
3137 1249 -1233 290 497 -477 420 -813 934 429 -972 808 -533 754 130 -1240 987 -596
3153 -596 223 -31 -637 1242 -876 96 172 -310 1050 -1428 179 549 -471 841 -910 634 327
3170 327 -1179 1003 -759 598 -333 -1007 1193 -632 224 35 -390 1325 -1007 -136 567 -491 1077
3187 1077 -1181 352 298 -578 543 -815 581 328 -1122 960 -269 327 124 -780 1316 -528 327
3204 327 286 -538 995 -814 114 468 -511 820 -860 292 519 -393 745 -491 547 212 -620 446
3222 446 -572 239 21 -626 651 -577 233 305 -158 966 -896 262 364 -581 422 -612 466
3239 466 268 -810 734 -581 291 201 -705 828 -392 187 311 -212 564 -421 -109 269 -571 303 -682
3258 -682 133 102 -502 457 -387 164 81 -595 291 -280 107 503 -510 467 -313 179 116 -503 583 -155
3278 -155 41 362 -471 287 -271 -53 95 -225 431 -163 -65 242 -396 103 -39 131 -161 -40 290 -10
3298 -10 129 357 -376 212 -169 194 212 -510 310 -81 93 172 -156 50 -172 56 452 -266 391 6 93
3319 93 244 -516 285 -245 -273 13 -457 260 122 -31 215 -48 356 -77 -122 74 -221 354 -49 66 71 -321
3341 -321 345 -17 7 102 -112 308 16 127 206 -184 7 -520 -63 244 -155 28 119 -180 96 -311 240
3362 240 -234 260 70 -401 181 28 -108 -52 -176 -32 -158 154 150 -438 145 -97 15 40 -90 -233 119
3383 119 217 31 -283 80 -187 105 -83 -80 -125 165 -46 87 -18 118 84 205 111 -20 109 -159 93 39
3405 39 -50 88 -33 -161 268 -114 230 57 90 10 83 280 244 -35 390 -213 155 -341 -39 136 137 216 -120
3428 -120 114 -74 -185 -91 -26 45 23 -337 75 34 -146 -8 184 111 -361 -62 149 -54 62 -271 58 123
3450 123 -212 151 6 112 -107 -356 167 171 269 -162 -181 172 -171 -96 200 -134 43 177 56 -58 -78 -38
3472 -38 -141 17 53 65 -61 90 217 -153 -231 108 -32 -138 -274 -20 40 -37 179 -257 73 61 -373 -141
3494 -141 119 70 -84 181 -21 89 55 38 -192 378 -191 -194 105 171 241 -407 273 361 -401 89 -137 247 15
3517 15 -353 550 -191 200 -66 -135 645 -153 17 119 -120 162 -309 234 102 -161 -10 -486 349 -164 -131
3538 -131 279 -184 395 -119 -178 398 -237 291 -15 100 358 -185 155 -124 -173 490 -368 510 -140 -1 528
3559 528 -321 314 1 -158 419 -219 230 -177 -311 341 -443 29 -196 -173 467 -370 374 -20 -327 518
3579 518 -304 368 -26 -303 494 -460 293 -76 -164 399 -743 589 -206 -307 427 -573 534 -188 -39
3598 -39 399 -583 472 -191 -330 406 -724 369 -58 -149 585 -578 308 -187 23 669 -460 313 99
3617 99 -329 426 -760 416 169 -227 411 -503 649 -175 -489 464 -355 450 -416 -272 738 -752 18
3636 18 71 -252 563 -722 532 249 -268 272 -398 427 71 -304 475 -662 732 -97 -445 584 -468
3655 -468 304 -137 -27 582 -389 318 -30 -172 324 -499 464 89 -331 485 -611 622 -80 -366 714
3674 714 -122 371 -16 -95 539 -492 58 107 -328 620 -695 222 203 -122 329 -498 382 110 -110 270
3694 270 -357 539 5 -405 583 -407 405 -237 7 540 -506 277 44 132 651 -644 281 263 -527 308
3714 308 -382 593 -5 -232 369 -326 112 124 -346 335 -131 67 28 -283 409 -552 165 56 -339 304 -417
3735 -417 151 180 -57 371 -421 157 4 -246 403 -210 34 32 -262 381 -324 -31 -39 -87 399 -379 181 169
3757 169 -194 358 -138 20 287 -138 166 -126 63 -31 -88 132 -357 -11 44 -403 156 -170 -105 154 -239
3778 -239 391 -186 -97 223 -214 189 -302 90 51 -214 69 -152 253 -127 -421 -13 179 115 208 -28 57 11
3800 11 -66 95 -114 -128 -544 102 -12 -125 88 -256 129 38 94 140 -66 89 -54 -193 194 254 -29 -57 -140
3823 -140 370 -20 -46 71 -36 -97 -271 19 50 -7 200 -8 -118 288 -221 -67 215 -18 200 -105 33
3844 33 94 160 59 -229 95 -50 -31 -6 -64 -27 54 5 100 37 122 -23 -169 12 80 116 192 -13 -282 -240 -359
3869 -359 74 -230 118 -4 -280 -34 20 -152 -286 95 62 200 -98 -6 -88 123 -186 160 67 -6 207 -114
3891 -114 189 -118 100 -56 -183 34 -188 -277 -102 47 125 59 139 9 1 124 146 -7 220 -131 -32 96 -202
3914 -202 -113 205 -142 -21 -154 -11 38 195 -99 -8 148 1 -14 -230 30 -6 85 231 84 189 188 53 21
3937 21 -221 73 -185 -38 30 287 -100 -156 -26 -122 -48 -314 -317 -237 96 36 25 87 47 -18 -119 -64 -69 26 -57 -14
3963 -14 186 -14 -308 -3 31 -21 -44 -24 46 59 1 234 62 -32 -126 -53 -243 170 -149 94 -48 -56 118 -159
3987 -159 311 95 -15 -42 153 209 -204 -28 40 26 -116 -54 -56 188 -181 -9 -85 53 200 -301 316 117 -115
4010 -115 -101 -162 399 52 -6 358 -304 440 -66 -52 192 -64 233 -153 -362 283 -32 247 -16 -24 306 -286
4032 -286 177 290 -145 -286 -345 423 -115 -182 131 -318 237 -115 -251 326 -571 159 -218 53 291 -227 148
4053 148 -281 23 368 -211 423 -84 28 -72 -193 56 19 -284 211 -197 246 55 -32 318 -76 433 -175
4074 -175 -22 424 -386 86 67 -267 108 -482 143 33 -264 183 -190 272 -52 -326 183 -196 71 -19 3
4095 3 215 -236 -44 -165 -5 86 37 -53 -11 -26 218 -163 319 -39 34 262 -611 141 35 -130 494 -264 119
4118 119 -91 -114 225 -632 188 -175 -170 180 141 35 49 -71 392 -255 268 32 -221 240 -327 218 -228 -67
4140 -67 399 -309 125 -230 -302 331 -123 281 32 -212 383 -412 292 -4 -269 332 -336 177 51 -252 200
4161 200 -249 311 30 -163 251 -404 125 82 -62 243 -114 211 158 -166 89 -199 -2 192 -23 504 -119
4182 -119 -60 -63 -221 424 -187 437 272 -83 210 -427 118 164 56 334 -161 144 -66 156 434 -542 122
4203 122 -72 -280 377 -238 -56 186 -160 63 -174 108 283 -178 414 212 82 -287 -175 320 -25 26
4223 26 66 -106 207 -144 99 56 -53 156 -120 -143 212 -66 -30 46 -27 30 -39 -43 -51 126 149 -375 -60 -44 43
4248 43 151 40 267 -147 -105 13 -453 72 -188 -121 -107 -346 96 -294 -100 231 69 130 -177 -96 -24 -221
4270 -221 158 0 74 -164 -3 201 1 -45 26 -51 325 -17 129 -167 -70 205 -110 295 256 -58 146 -222
4292 -222 -89 -2 52 90 -81 31 166 -173 -143 235 222 242 -287 -22 -233 -195 39 -258 62 -4 80 54 -157
4315 -157 213 196 -88 226 17 56 -41 9 23 21 -47 54 237 -101 -247 -96 84 33 -75 -93 96 24 24 -115
4339 -115 -311 -267 94 39 101 -13 -56 -172 159 97 -80 102 -102 221 -114 187 269 150 -230 192 -214 66
4361 66 -89 -44 -140 -159 -154 -94 -39 75 262 4 -69 -361 -7 -360 133 -276 237 60 -8 214 -48 -100 -147 0
4385 0 -143 223 -89 206 -81 44 -241 -121 301 -102 13 -51 249 -324 -181 -156 64 -35 -208 -97 -36 33
4407 33 20 141 106 108 91 116 202 95 128 -173 0 165 -125 -127 17 -111 -336 108 73 42 270 -17 51 -115 -154
4432 -154 124 11 -180 120 184 73 256 155 -142 -143 -64 -117 129 331 409 219 37 -125 64 84 -67 -290
4454 -290 -19 -279 -158 -2 30 10 -61 119 91 -219 -28 223 -82 -31 -61 -50 154 135 -121 -67 183 183 -32 238
4478 238 -117 201 8 -236 76 -70 -105 89 -89 149 -386 34 46 -115 -2 37 172 -41 -61 231 -127
4499 -127 -43 -96 -7 343 -227 83 -39 -79 -209 -69 175 90 -187 50 -275 1 36 -120 111 -138 214 -76
4521 -76 6 231 -153 301 -85 23 39 35 -30 -136 -83 129 -328 243 -128 92 262 -336 199 11 -30 104 -162
4544 -162 87 -115 -78 224 -253 120 -144 -143 79 -341 195 87 -56 307 -186 34 51 -156 132 -149 83
4565 83 87 -56 336 -200 -154 189 198 283 -78 153 97 105 248 -195 0 31 -53 101 -166 217 -32 -2 21 80 -56
4590 -56 -25 -163 334 -90 316 -187 -167 176 -431 -144 -189 -108 61 -147 -3 -77 -205 397 -48 258 32 -45
4612 -45 347 -196 139 -25 -310 404 -73 177 152 -310 133 -347 269 -256 -81 359 -94 85 109 -367 20
4633 20 14 153 139 -297 483 -237 205 94 7 104 -186 62 183 -85 43 -426 -101 -55 -364 66 -162 132
4655 132 -181 -313 172 -229 87 -202 -53 203 -448 136 -21 -228 247 -222 -179 -18 -218 180 -309 61
4675 61 -102 -284 459 -55 234 134 -334 148 -191 158 -112 -227 81 -172 96 332 -240 64 -114 322
4695 322 -55 -157 346 -452 -13 119 109 -58 -7 105 -1 113 198 -451 -178 42 -75 103 -251 93 -61
4716 -61 -231 -170 88 160 -83 -197 -19 -199 261 30 -275 272 -234 267 -179 -169 3 -18 -53 -45 -111 73 -183
4739 -183 203 -6 158 -187 -197 -19 184 111 -19 -180 29 -35 -56 232 -127 -220 24 99 201 -26 -98 -116 170
4762 170 41 -92 96 -83 -413 -91 -136 -66 18 43 74 -70 -131 189 -114 -41 -278 -78 160 -162 211 27
4784 27 -113 17 -43 -161 35 -156 131 -176 14 92 -23 48 -93 -27 -167 -25 -155 -49 131 -8 78 206
4806 206 -166 71 122 52 11 -142 -102 28 193 -7 -24 181 -72 17 -9 41 10 -71 114 252 -178 75 -54
4829 -54 137 2 -22 -38 -39 152 -77 -83 -187 -40 211 -1 -9 -15 102 -151 50 -131 -67 252 -264 7 80 -143
4853 -143 6 164 -64 -50 190 83 -157 155 -98 -40 -53 -160 -278 218 -135 -12 -143 -129 -23 82 -259
4874 -259 17 1 147 110 113 -166 -8 -12 -261 -99 -18 -151 2 -8 -11 -234 132 173 210 214 -26 -190 254 -106 -2
4899 -2 161 10 246 -82 -169 -176 282 -192 51 42 -5 -113 -101 -128 41 -125 -187 70 -124 -36 -34 16 115 -193 329
4924 329 359 66 118 -92 -33 99 -102 -149 89 -84 -47 -107 66 96 96 -39 0 49 -19 -346 -57 122 -207 -171
4948 -171 -49 1 -18 88 -181 -4 -103 -95 -66 -172 107 25 -72 276 -27 -153 47 2 158 -268 106 193 -84
4971 -84 58 -187 -63 -122 -16 119 33 73 30 -88 -51 -125 170 59 -167 -67 -141 24 203 144 148 8 105 -123
4995 -123 15 182 -114 -173 258 -106 199 55 -106 -83 -11 282 -311 127 44 -179 -39 -117 15 214 66 96
5017 96 -209 -373 117 34 318 104 -238 51 35 -35 -25 -125 150 -574 -101 10 -62 -56 -110 80 -27 -181 19
5040 19 -224 318 -169 -135 -87 118 160 -163 -173 39 -45 159 191 -10 72 -238 -67 -239 -50 -19 -293 138 -126
5063 -126 5 -3 -183 329 -174 -277 38 -255 51 -120 4 207 -489 143 152 86 51 -229 171 213 -135 18
5085 18 -341 321 55 77 405 66 53 9 46 -3 -154 -3 -204 44 410 35 231 164 92 120 -274 44 -98
5108 -98 -185 51 -136 75 -211 25 248 -8 153 52 -59 131 -178 87 162 -26 -7 78 66 -100 -59 94
5130 94 -154 289 -164 -89 339 -94 77 13 57 280 -273 88 136 -159 0 -269 186 49 -158 387 -259 151
5152 151 219 -52 40 -300 273 -44 -164 341 -256 71 -169 -115 102 -273 108 -119 -101 114 -79 180 56
5173 56 2 105 -343 165 -184 -261 212 -120 301 -100 -86 -39 -124 81 65 72 172 -130 282 160 -154 31 -3
5196 -3 146 -265 -177 147 -58 -12 11 -51 -32 -183 -87 -330 -106 277 -16 145 117 -35 -26 -87 -128 -101 118 -111 -100
5221 -100 99 -186 73 287 -287 119 -87 61 212 -39 195 25 -81 -12 -244 89 144 -183 58 61 17 -90
5243 -90 -322 -252 -59 -284 -21 124 -122 -170 -123 -83 18 217 81 -22 -177 -135 16 -150 -29 33 207 -170
5265 -170 -57 105 -84 -301 51 52 -185 -171 32 215 175 69 -158 -42 47 79 -50 -49 -75 -210 263 250 -136
5288 -136 -91 -25 85 -132 34 138 230 -136 99 340 -29 242 222 67 6 2 -230 -9 31 22 -29 -307 157 119
5312 119 -169 36 94 128 212 -174 -211 83 123 272 -126 62 36 37 -109 -97 -107 -1 175 -73 123 -152 44
5335 44 63 -282 -117 -61 -136 -100 160 -143 114 -162 -124 325 -238 287 -126 145 -133 -60 -61 92 -202 135 -151
5358 -151 61 189 23 -127 -123 285 -178 -103 -176 -123 4 18 224 76 -115 -191 -6 -205 -20 -201 89 191
5380 191 167 34 -262 18 42 -129 -57 -126 -98 210 -41 -84 -53 112 -39 -14 -34 111 221 -142 -85 87 -147
5403 -147 297 34 -54 74 -201 92 -317 -119 26 6 36 -226 -103 107 -27 109 270 -62 322 -205 24
5424 24 47 58 -81 149 -69 158 271 -18 -35 140 -276 -189 106 -82 213 52 39 132 -352 104 -189 118
5446 118 20 -61 -74 159 216 121 44 173 74 138 -76 -107 99 -62 -25 159 -136 15 -101 216 39 -117 84
5469 84 -33 134 -66 -227 292 -92 29 78 82 14 -151 48 -37 -138 -37 148 -3 -98 -215 118 -165 -99 -62
5492 -62 -250 131 -92 -124 179 -204 239 -14 174 308 91 231 -116 -18 164 -72 114 -29 -67 125 128 -8
5514 -8 -221 28 46 -113 78 -147 27 394 70 -110 -143 -56 278 -197 148 -117 -156 69 -37 141 53 -79
5536 -79 1 32 -61 118 -182 128 -160 130 -84 -87 226 81 121 -131 32 168 -429 372 -44 -79 224 -59 173
5559 173 -48 -116 180 -194 70 -42 -86 2 -132 -5 -82 72 171 -310 204 0 134 12 -144 261 -207 -235
5581 -235 111 -360 250 -150 16 227 -187 -1 86 -8 186 -263 240 -244 59 180 -10 269 -134 364 -31
5602 -31 -575 274 -52 -164 -24 -196 -18 -88 -11 -46 146 78 88 -186 179 -136 -143 -66 299 161 -222 273 -9
5625 -9 -84 -279 -279 342 -61 24 58 -120 81 42 -8 -38 -123 137 -222 -39 37 88 -84 -131 -60 -92 -143 86 118 -13
5651 -13 -11 -86 123 -181 -42 -175 -125 40 47 5 -64 30 134 -235 143 -38 -86 41 97 -165 43 -10 -9 -480 -24
5676 -24 270 -183 -132 120 -117 164 30 -8 -80 156 -140 -123 36 205 123 300 -309 -126 -138 105 108 69 -217
5699 -217 110 -70 72 68 181 110 112 76 -134 246 30 -120 -73 -240 -101 189 78 -2 130 -219 -34 22 -93
5722 -93 125 13 13 -244 118 -64 6 -257 -114 -66 109 61 -224 -47 145 237 -47 61 -43 -101 -123 49 -32
5745 -32 74 -121 -54 113 -85 -13 -74 37 12 280 135 -28 5 19 101 188 65 190 94 95 247 13 125 23
5769 23 -57 38 -111 -92 227 202 -70 82 37 54 176 -63 195 -274 22 32 141 -78 89 105 166 253 114 117
5793 117 -326 -47 -115 130 30 -74 -44 0 -206 -97 100 0 159 258 261 -32 -138 80 -22 -76 1 186 85
5816 85 -278 -343 -160 56 126 -266 51 -27 -71 55 60 -119 16 275 73 -156 173 86 13 104 26 -82 -12 -53
5840 -53 2 -76 232 -74 151 15 -93 129 107 -59 93 158 -100 -103 -37 172 79 -87 -152 -17 274 74 -62
5863 -62 -144 7 238 -97 -301 66 -21 129 -186 -270 143 -165 31 -5 34 21 30 114 -126 -43 -26 35 -127 -88 31
5888 31 -117 -288 48 24 110 -103 192 -194 -194 41 -91 122 87 181 -162 -37 173 144 -90 -32 -146 122 116 -56
5912 -56 -1 289 244 -49 81 -89 71 -67 248 -13 -88 159 24 250 101 26 49 -238 -11 -118 -136 178
5934 178 -3 104 -59 -38 82 -348 -70 67 8 169 -3 -96 -38 111 -35 -115 4 -108 122 -45 45 172
5956 172 -87 -165 23 -240 68 29 -210 -169 -105 222 -256 126 -145 205 127 29 -42 -12 33 95 -11 -208 13
5979 13 52 89 32 10 83 -331 -213 -25 -53 -6 17 117 -78 143 76 -143 -118 -182 -143 -24 -78 132 -28 -224 62
6004 62 22 222 -248 -75 -54 -324 196 -226 87 -108 -222 -67 -176 -3 86 -40 102 -30 98 -146 -30
6025 -30 210 44 -110 79 -158 267 84 295 139 47 163 -85 -37 -164 32 371 24 -195 -208 36 130 -163
6047 -163 225 131 -42 117 86 58 113 -508 273 -217 -190 121 -187 81 -74 74 268 -4 91 -128 -78 -67 -27
6070 -27 34 -217 80 42 -70 -2 176 352 -41 -111 573 104 79 28 17 52 -156 -337 -59 -66 -182 -113 149 -156
6094 -156 -156 117 -120 -156 -65 -218 -62 79 222 -97 62 -259 102 217 -84 26 419 164 -90 -81 -305 113
6116 113 -335 51 158 20 -168 -279 110 -251 -160 -23 -28 232 103 -172 213 213 11 169 82 196 -35 212
6138 212 172 -42 6 22 -235 51 -117 232 61 -14 173 -57 78 -76 7 -74 -178 118 106 39 -53 -132 0
6161 0 -244 172 -218 131 -84 -193 183 50 63 -180 198 109 -105 -72 22 142 325 -21 2 -43 271 -167 -29
6184 -29 135 -25 79 154 5 -92 -425 13 -296 0 -136 -275 210 -26 -26 -118 45 66 73 -89 54 -192 -184 14
6208 14 61 117 141 -13 -160 -178 -54 10 -26 -265 -61 -217 101 98 -14 -10 173 34 -94 -35 61 74 -51 173 -33
6233 -33 145 -4 82 -220 134 7 151 94 32 161 -150 36 -40 -233 -129 96 94 145 1 -30 14 221 -127
6256 -127 176 1 -60 224 -51 -49 15 19 32 -153 294 218 -58 -139 -50 -104 33 -221 -112 -39 29 -72 -94 -213 2
6281 2 -78 87 -296 72 241 45 184 -195 72 126 -287 61 104 28 -42 -142 67 -138 100 -18 69 -135 -82
6304 -82 -137 232 -45 125 -186 -60 -47 -76 122 118 -78 30 26 -59 1 29 -43 2 -136 -93 117 76 159 96 368 -32
6330 -32 -28 -33 236 -158 -47 107 7 284 -196 4 183 52 -35 -31 32 -263 -42 -32 12 -2 -48 18 -155 -175 113
6355 113 -122 -203 -188 -235 67 -75 -54 -19 -181 -135 163 97 293 -44 -62 -117 -196 108 31 -69 205 -240 -178 61
6379 61 -73 36 -315 -104 -160 18 -173 78 -128 -193 -20 -46 -197 -116 31 38 198 109 -57 -146 7 171 135
6402 135 189 -11 57 3 -153 -81 65 175 -128 -98 16 -43 179 -32 -36 -113 -213 -68 -51 -113 -21 -188 -11 -78
6426 -78 -46 -153 110 -82 -163 185 75 -144 121 54 -8 87 -417 75 -38 -141 205 -13 185 -157 -35 288
6448 288 -107 22 31 -48 112 -194 102 -164 79 -107 53 34 -56 188 -8 46 52 15 -116 193 164 187 -149 -164
6472 -164 199 -284 -295 36 52 -139 -9 137 41 -66 -162 222 59 -130 43 47 133 179 5 85 156 25 15 37
6496 37 -229 -256 -273 98 -152 -17 32 -262 115 5 44 77 -131 -41 -29 68 202 10 -135 -157 -83 -78 193 219 9
6521 9 -194 104 -8 150 -89 -61 248 12 -52 265 65 27 70 14 35 -125 -66 -211 -65 -58 82 324 -96 186
6545 186 68 17 151 99 -163 20 -182 125 -100 126 7 -82 16 -201 -226 -15 -166 61 -148 -97 259 -107
6567 -107 -34 31 60 -239 -8 -62 -89 27 -99 -49 160 12 98 -96 -135 -238 -31 -26 187 -148 -130 278 122 -137
6591 -137 -154 204 -89 -54 199 36 -175 -77 160 134 -18 -140 109 -157 -132 -248 147 -84 16 87 -38 129
6613 129 76 -11 -5 137 74 -96 181 -176 108 105 -114 -238 -1 -81 -124 157 60 -245 149 -181 -143 -203 290 198
6637 198 -132 -132 344 0 -76 266 205 -38 11 119 -45 -95 275 154 -90 -174 -153 -77 234 26 86 -56 -48 264
6661 264 -14 28 -65 -20 8 249 69 6 108 149 248 85 132 -193 -88 164 -201 -3 304 -33 225 131 -328
6684 -328 -51 105 251 56 232 205 -65 -167 -88 -127 -24 128 -96 -63 -50 -38 83 141 195 -26 -46 -128 -52 -37
6708 -37 45 106 45 -263 236 201 205 217 -339 -239 116 26 226 119 -150 121 59 6 369 -86 -11 166 -51 144
6732 144 -89 -85 98 -35 232 81 -36 -82 -88 324 184 23 -43 35 211 256 24 83 -146 -4 48 -171 -152 -115
6756 -115 148 -112 114 -26 -165 59 14 114 123 -223 -70 40 -163 161 -55 -306 56 -161 224 -145 0
6777 0 -138 -111 -87 -231 -72 -103 -155 -9 46 -315 -335 94 -297 -247 26 -10 -27 176 -32 156 -164 -54 229 -34
6801 -34 99 -108 -137 257 274 5 150 -99 -139 86 105 202 53 -69 -78 83 -17 123 140 -53 285 -98 44
6824 44 -222 110 269 -152 119 91 -316 44 -216 -114 26 -41 25 -21 -147 196 22 6 19 44 -96 34 -9
6847 -9 98 -192 -231 61 -218 -143 183 70 -183 -176 139 198 26 -76 -47 -83 -52 -237 -328 110 -290 103 95 -30
6871 -30 -73 135 -41 119 51 205 43 -158 -201 364 -145 -2 63 -39 -192 -44 24 92 -65 -152 19 -58 215
6894 215 299 -45 -179 -5 -37 210 -119 -96 -208 107 100 -282 -23 61 -138 -54 -111 -52 230 -219 132 35 149
6917 149 -19 68 -58 56 -1 -135 -41 -77 -199 -73 32 -84 134 -347 86 92 61 -72 74 -294 -102 -84 15
6940 15 12 -28 -37 376 88 -195 -142 141 83 -95 -51 -17 25 -25 -135 -81 82 -82 -92 -118 -218 177 95 -107 157
6965 157 -307 153 -62 98 138 -51 -23 -48 56 99 -92 353 92 -133 138 -202 44 110 191 89 210 -97
6987 -97 360 51 -67 -36 -36 222 -152 122 3 -139 -84 127 -8 61 37 114 -54 69 121 -36 -13 37 22 -72
7011 -72 -74 35 -27 241 217 -179 -2 191 78 25 9 1 43 -65 70 14 -110 -344 -78 6 -74 159 -19 -115 -129
7036 -129 203 -303 173 150 -15 -193 7 -382 23 -34 -21 109 -19 -7 -79 200 -168 -22 -200 78 129 22
7058 22 -22 326 3 58 -21 -49 -213 -176 2 243 -4 -212 -155 -40 -290 -98 69 110 269 -362 40 -49 -217
7081 -217 244 -141 57 89 16 -212 74 107 -16 140 55 -59 -188 261 -57 49 -58 214 -5 -57 -18 -257
7103 -257 -51 3 81 -167 -124 -116 331 12 81 -5 -33 -22 124 72 5 81 99 146 -86 -53 126 -135 29 555 -94
7128 -94 -123 -84 133 65 -175 17 80 36 -148 74 -60 54 60 -110 -89 -31 -202 -28 63 -18 4 -248 -330 -33 222
7153 222 -6 0 1 -9 57 -8 -52 16 -220 299 165 4 -279 47 26 159 51 300 -16 51 97 -70 -140 -172 -392
7178 -392 234 265 128 -60 4 -174 -14 -67 -54 119 -16 147 -117 111 181 49 -46 156 77 -50 164 -156
7200 -156 -148 -73 -48 136 62 307 214 51 155 -119 113 -37 -183 137 -53 -22 -151 -132 -46 -111 -99 3 17 5
7224 5 -45 216 -62 4 -67 107 -29 39 183 -137 40 140 233 -53 -17 -1 -62 187 218 -100 -75 -48 -29 -14 -40
7249 -40 -327 52 79 -160 76 34 95 60 -240 7 -113 1 230 190 -226 -71 54 58 322 -146 -50 33 51 41
7273 41 -262 152 73 -185 -73 84 -305 -259 87 68 -14 44 29 86 -223 118 167 76 15 93 -77 -126 -54 -46 -220
7298 -220 138 -38 -66 217 -184 69 2 8 219 -280 153 65 -21 77 -182 43 163 100 -260 -114 174 37 -297
7321 -297 -52 -16 -84 192 239 -215 -44 -31 98 232 119 -163 60 -182 -140 -31 -108 -24 -226 155 39 34 -75
7344 -75 187 60 96 -36 64 -134 -87 -42 81 234 -134 -64 -202 142 -4 -18 298 -60 301 -62 -35 -52 -38
7367 -38 87 22 70 251 171 -235 -115 -289 253 -109 18 -13 -188 -146 22 -38 65 -255 -151 -12 -32 228 -55
7390 -55 -263 -94 -183 -167 5 107 -94 189 -25 20 -39 75 85 33 99 63 -323 285 -174 -23 172 55 100
7413 100 61 -11 320 68 108 -121 -181 272 -299 242 -85 159 167 -32 -69 -136 98 273 -83 -179 -45 127 -236
7436 -236 44 132 267 77 75 -61 184 165 -19 24 6 -61 -105 -135 -34 60 -193 307 -105 23 -142 129 170 249
7460 249 17 25 -191 -142 -125 7 89 -26 15 -276 -53 77 -382 -158 -311 -44 -19 -30 -82 223 160 86 69 160
7484 160 -70 125 -2 236 234 -233 -164 -20 -53 -81 15 -99 139 -58 -29 -190 65 165 -7 -336 -59 -288
7506 -288 -262 -48 72 -91 -18 73 158 105 -169 16 -116 7 -36 291 110 50 61 -52 76 188 -162 -137 229
7529 229 379 -39 -47 77 166 182 -44 51 165 -175 -20 -50 128 -137 -81 -97 -45 98 -93 -11 -56 -81 182 -145
7553 -145 -112 -105 -81 170 81 -88 -97 -30 59 105 -36 -102 -22 267 148 -92 57 119 -240 73 -163 184 -8 -34 29
7578 29 -9 131 93 18 -38 -213 41 68 -124 106 106 -63 -15 -29 11 40 -231 -254 -41 115 -73 -93 173 -80 81
7603 81 286 99 54 -26 -103 -153 -126 62 -24 -20 -12 -56 20 -177 99 -301 12 98 -250 -1 -106 -169 253 -104 123
7628 123 170 -147 -148 -32 272 67 69 -118 28 -237 69 -20 87 50 96 -14 -39 -55 -166 -171 118 30 -4 -201 -231
7653 -231 166 150 17 -71 -51 117 -29 59 186 182 72 -131 110 384 145 19 36 -93 130 -101 127 -244
7675 -244 184 162 46 113 -194 101 74 -150 115 78 -262 30 -60 89 -297 -165 267 129 -83 66 107 -147
7697 -147 -90 168 -286 164 -113 -234 45 -278 -75 55 -100 57 -192 74 146 -11 -34 50 25 -201 -6 40
7719 40 -115 136 4 61 -115 104 -377 -63 -108 74 -115 -233 -44 155 42 -98 204 -11 78 66 63 171
7741 171 -14 26 -150 8 168 59 -201 0 -73 -20 73 12 146 -116 -92 61 -195 17 -174 70 42 163
7763 163 111 -116 43 1 274 -62 -71 64 -129 64 -119 -86 250 -34 60 190 436 -222 66 78 -64 -122 -283
7786 -283 -299 -212 11 52 122 26 326 84 -14 -76 8 251 -12 12 -10 -221 207 -143 -269 -85 70 -4 -67 -111
7810 -111 -14 -116 37 80 -17 -65 -246 43 110 -195 -122 -6 -186 -69 -34 -1 131 47 3 116 -16 90 126 -15
7834 -15 300 0 171 -102 -151 -67 -13 21 -190 -22 187 -30 -162 -86 38 130 -7 -334 6 -62 -123 101 105 -56
7858 -56 -129 -210 117 11 -142 106 28 161 -26 106 9 -140 125 201 -73 114 60 -134 -176 77 63 36 -91
7881 -91 -225 65 172 121 8 -124 89 110 160 -179 -26 -184 17 -130 29 220 -64 69 -96 218 -17
7902 -17 55 -237 -131 -96 27 1 143 -69 162 -191 115 86 -146 -53 -21 31 -9 143 13 203 -36 -317 -67
7925 -67 200 -82 28 19 77 183 76 -3 1 -60 25 -174 -88 146 35 -69 -90 78 145 -97 -99 106 48 -57 88
7950 88 -46 -83 -43 -139 66 51 224 -320 24 -3 44 224 150 -13 54 32 -128 -173 -2 -290 -29 167 -86 -73
7974 -73 151 -196 -296 78 72 115 -178 -128 -50 46 -102 -73 -157 40 -154 53 39 353 172 185 65 -23 145 -50
7998 -50 195 -31 185 -35 -18 -133 -56 243 -37 41 113 267 79 183 -123 -1 170 -5 333 -13 74 -127
8020 -127 -33 -315 -42 6 -294 180 10 95 -50 -90 -156 -165 127 -14 191 90 -134 -147 -211 -114 -175 -8 -5 -230
8044 -230 -3 -184 142 -109 -56 -146 91 40 77 -89 -54 -34 122 36 86 -58 -70 15 193 232 -18 -17 65 -254 -44
8069 -44 -225 195 -7 86 -96 117 -309 7 66 -56 118 -134 -171 227 -136 -226 -26 18 -116 50 291 -86
8091 -86 174 20 148 -75 64 -19 -201 -8 52 303 -84 168 131 -52 39 426 -93 -7 194 -200 -88 -77
8113 -77 -61 79 326 -337 38 128 32 237 78 -149 80 6 -184 62 -48 -120 82 142 -55 153 26 52 172
8136 172 -127 172 -77 19 -83 20 143 -5 126 1 -163 56 40 10 42 64 -81 84 58 -110 89 150
8158 150 190 93 290 -134 230 -82 82 -229 3 125 -158 49 -44 34 104 -113 101 -63 -270 -81 9 -286
8180 -286 69 25 -60 -26 -228 -198 30 80 -89 -44 -231
8191b31
##END NTUPLES=NMR FID
##END=
