##TITLE=1H_LR-766-2H-2CR8
 D2O
 8 sc, 
 5.6.2023
##JCAMPDX= 6.0         $$ Bruker NMR JCAMP-DX V2.0
##DATA TYPE= NMR FID
##DATA CLASS= NTUPLES
##ORIGIN= UXNMR, Bruker Analytische Messtechnik GmbH
##OWNER= root
$$ XWIN-NMR		Version 3.5
$$ Mon Jun  5 14:38:47 2023 Russian Standard Time (UT+4h)  she@DPX200
##.OBSERVE FREQUENCY= 200.13135
##.OBSERVE NUCLEUS= ^1H
##.DELAY= (6, 6)
##.ACQUISITION MODE= SIMULTANEOUS
##.ACQUISITION SCHEME= undefined
##.AVERAGES= 8
##.DIGITISER RES= 18
##SPECTROMETER/DATA SYSTEM= spect
##.PULSE SEQUENCE= zg30
##.SOLVENT NAME= D2O
##.SHIFT REFERENCE= (INTERNAL, D2O, 0, 15.7039)
##AUDIT TRAIL= $$ (NUMBER, WHEN, WHO, WHERE, WHAT)
$$ ##TITLE= Audit trail, XWIN-NMR		Version 3.5
$$ ##JCAMPDX= 5.01
$$ ##ORIGIN= Bruker BioSpin GmbH
$$ ##OWNER= she
$$ F:/spectra/data/she/nmr/H-F/1/audita.txt
$$ ##AUDIT TRAIL=  $$ (NUMBER, WHEN, WHO, WHERE, WHAT)
(   1,<2023-06-05 14:37:11.07 +0400>,<she>,<DPX200>,
      <created by zg, POWCHK disabled, PULCHK disabled
       configuration hash MD5:
       00 E9 B6 7A A2 85 ED C7 34 08 36 98 17 FE 4E 26
       data hash MD5: 16K
       4C 0B AD B7 6D A7 72 E9 ED 69 AB E0 36 B7 BF F7>)
$$ ##END=
$$ 
$$ hash MD5
$$ 5F CB BC 32 7E A6 A0 4E 6C 5F 11 DA 23 FB 7D 1B
##$RELAX= 
##$RELAX= 
##$RELAX= 
##$RELAX= 
##$RELAX= 
##$RELAX= 
$$ Bruker specific parameters
$$ --------------------------
##$DU= <F:/spectra>
##$EXPNO= 1
##$NAME= <H-F>
##$PROCNO= 1
##$TYPE= <nmr>
##$USER= <she>
##$AMP= (0..31)
100 100 100 100 100 100 100 100 100 100 100 100 100 100 100 100 100 100 
100 100 100 100 100 100 100 100 100 100 100 100 100 100 
##$AQSEQ= 0
##$AQ_mod= 1
##$AUNM= <au_zg>
##$AUTOPOS= <>
##$BF1= 200.13
##$BF2= 200.13
##$BF3= 200.13
##$BF4= 200.13
##$BF5= 200.13
##$BF6= 200.13
##$BF7= 200.13
##$BF8= 200.13
##$BYTORDA= 1
##$CFDGTYP= 0
##$CFRGTYP= 5
##$CHEMSTR= <none>
##$CNST= (0..31)
1 1 145 1 1 1 1 1 1 1 1 1 1 1 1 1 1 1 1 1 1 1 1 1 1 1 1 1 1 1 1 1 
##$CPDPRG= <>
##$CPDPRG1= <>
##$CPDPRG2= <>
##$CPDPRG3= <>
##$CPDPRG4= <mlev>
##$CPDPRG5= <mlev>
##$CPDPRG6= <mlev>
##$CPDPRG7= <mlev>
##$CPDPRG8= <mlev>
##$CPDPRGB= <>
##$CPDPRGT= <>
##$D= (0..31)
0 1.2 0 0 0 0 0 0 0 0.06 0 0.03 0 0 0 0 0.0002 0 0 0 0 0 0 0 0 0 0 0 0 
0 0 0 
##$DATE= 1685961430
##$DBL= (0..7)
120 120 120 120 120 120 120 120 
##$DBP= (0..7)
150 150 150 150 150 150 150 150 
##$DBP07= 0
##$DBPNAM0= <>
##$DBPNAM1= <>
##$DBPNAM2= <>
##$DBPNAM3= <>
##$DBPNAM4= <>
##$DBPNAM5= <>
##$DBPNAM6= <>
##$DBPNAM7= <>
##$DBPOAL= (0..7)
0.5 0.5 0.5 0.5 0.5 0.5 0.5 0.5 
##$DBPOFFS= (0..7)
0 0 0 0 0 0 0 0 
##$DE= 6
##$DECBNUC= <off>
##$DECIM= 32
##$DECNUC= <off>
##$DECSTAT= 4
##$DIGMOD= 1
##$DIGTYP= 9
##$DL= (0..7)
0 120 120 120 120 120 120 120 
##$DP= (0..7)
150 150 150 150 150 150 150 150 
##$DP07= 0
##$DPNAME0= <>
##$DPNAME1= <>
##$DPNAME2= <>
##$DPNAME3= <>
##$DPNAME4= <>
##$DPNAME5= <>
##$DPNAME6= <>
##$DPNAME7= <>
##$DPOAL= (0..7)
0.5 0.5 0.5 0.5 0.5 0.5 0.5 0.5 
##$DPOFFS= (0..7)
0 0 0 0 0 0 0 0 
##$DQDMODE= 0
##$DR= 18
##$DS= 0
##$DSLIST= <SSSSSSSSSSSSSSS>
$$ [...]
##$SUBNAM2= <"">
##$SUBNAM3= <"">
##$SUBNAM4= <"">
##$SUBNAM5= <"">
##$SUBNAM6= <"">
##$SUBNAM7= <"">
##$SUBNAM8= <"">
##$SUBNAM9= <"">
##$SW= 18.05172834244
##$SWIBOX= (0..15)
0 0 2 0 0 0 0 0 0 0 0 0 0 0 0 0 
##$SW_h= 3612.71676300578
##$TD= 16384
##$TD0= 1
##$TE= 0
##$TE2= 300
##$TE3= 300
##$TEG= 300
##$TL= (0..7)
0 120 120 120 120 120 120 120 
##$TP= (0..7)
150 150 150 150 150 150 150 150 
##$TP07= 0
##$TPNAME0= <>
##$TPNAME1= <>
##$TPNAME2= <>
##$TPNAME3= <>
##$TPNAME4= <>
##$TPNAME5= <>
##$TPNAME6= <>
##$TPNAME7= <>
##$TPOAL= (0..7)
0.5 0.5 0.5 0.5 0.5 0.5 0.5 0.5 
##$TPOFFS= (0..7)
0 0 0 0 0 0 0 0 
##$TUNHIN= 0
##$TUNHOUT= 0
##$TUNXOUT= 0
##$USERA1= <user>
##$USERA2= <user>
##$USERA3= <user>
##$USERA4= <user>
##$USERA5= <user>
##$V9= 5
##$VALIST= <valist>
##$VCLIST= <CCCCCCCCCCCCCCC>
##$VD= 0
##$VDLIST= <DDDDDDDDDDDDDDD>
##$VPLIST= <PPPPPPPPPPPPPPP>
##$VTLIST= <TTTTTTTTTTTTTTT>
##$WBST= 1024
##$WBSW= 4
##$XGAIN= (0..3)
0 0 0 0 
##$XL= 0
##$YL= 0
##$YMAX_a= 302950
##$YMIN_a= -318149
##$ZGOPTNS= <>
##$ZL1= 120
##$ZL2= 120
##$ZL3= 120
##$ZL4= 120
##$ABSF1= 10
##$ABSF2= 0
##$ABSG= 5
##$ABSL= 3
##$ALPHA= 0
##$AQORDER= 0
##$ASSFAC= 0
##$ASSFACI= 0
##$ASSFACX= 0
##$ASSWID= 0
##$AUNMP= <proc_1d>
##$AZFE= 0.1
##$AZFW= 0.1
##$BCFW= 1
##$BC_mod= 2
##$BYTORDP= 1
##$COROFFS= 0
##$CY= 11.3945322036743
##$DATMOD= 1
##$DC= 2
##$DFILT= <>
##$DTYPP= 0
##$F1P= 15.7292609196834
##$F2P= 12.9074282941183
##$FCOR= 0.5
##$FTSIZE= 0
##$FT_mod= 4
##$GAMMA= 1
##$GB= 0.15
##$INTBC= 1
##$INTSCL= 1
##$ISEN= 128
##$LB= 0.24
##$LEV0= 0
##$LPBIN= 0
##$MAXI= 10000
##$MC2= 0
##$MEAN= 0
##$ME_mod= 0
##$MI= 1.114404
##$NCOEF= 0
##$NC_proc= 0
##$NLEV= 6
##$NOISF1= 3.799351
##$NOISF2= 2.8
##$NSP= 1
##$NTH_PI= 0
##$NZP= 0
##$OFFSET= 15.70392
##$PC= 1
##$PHC0= -20068.31
##$PHC1= 11.05272
##$PH_mod= 1
##$PKNL= yes
##$PPARMOD= 0
##$PSCAL= 0
##$PSIGN= 0
##$REVERSE= no
##$SF= 200.130013532006
##$SI= 16384
##$SIGF1= 3
##$SIGF2= 2
##$SINO= 400
##$SIOLD= 16384
##$SREGLST= <1H.CDCl3>
##$SSB= 0
##$STSI= 0
##$STSR= 0
##$SW_p= 3612.71676300578
##$SYMM= 0
##$S_DEV= 0
##$TDeff= 0
##$TDoff= 0
##$TI= <>
##$TILT= no
##$TM1= 0
##$TM2= 0
##$TOPLEV= 0
##$USERP1= <user>
##$USERP2= <user>
##$USERP3= <user>
##$USERP4= <user>
##$USERP5= <user>
##$WDW= 1
##$XDIM= 8192
##$YMAX_p= 0
##$YMIN_p= 0
$$ End of Bruker specific parameters
$$ ---------------------------------
##NTUPLES= NMR FID
##VAR_NAME=  TIME,          FID/REAL,        FID/IMAG
##SYMBOL=    X,             R,               I
##VAR_TYPE=  INDEPENDENT,   DEPENDENT,       DEPENDENT
##VAR_FORM=  AFFN,          ASDF,            ASDF
##VAR_DIM=   8192,          8192,            8192
##UNITS=     SECONDS,       ARBITRARY UNITS, ARBITRARY UNITS
##FACTOR=    0.0002768,     1,               1
##FIRST=     0,             0,               0
##LAST=      2.2672688,     0,               0
##MIN=       0,             -318149,         0
##MAX=       2.2672688,     302950,          0
$$ Real data points
##PAGE= N=1
##DATA TABLE= (X++(R..R)), XYDATA
0@%%%%%%%%%%%%%%%%%lLqJ6j6J6j6J7k5L2l3L9m6N2o0O8p7Q7r8J12j28J44j60
40h4J77j96K17k44K69k95L28l63M02m42M86n36N91o52P18p93Q78r72J080j202
60f33J347j521J727j983K307k728L299m081N025m514J83139R3906o3235n1571
74A60484j40289k24891j13453J05820J69291J42046J24729N2056j08443j93509
84b6159j57161p4373K7067J48370J89439J20833K0247p1608j66414j84965q2388
95b57112M5770J14012J55229J53058M7363r6475j51648j32587r7954j0798J25047
106a06095J80622J11884K2374m1144j21593j72563j04644L0127J10735J28309
116C8012J21366O4757m8907j39986j46662q6951J446Q7955J35117J22813N9208
$$ y = [0, 0, 0, 0, 0, 0, 0, 0, 0, 0, 0, 0, 0, 0, 0, 0, 0, 0, -3, 0, -8, 8, -8, 8, -8, 9, -16, 16, -17, 22, -24, 28, -32, 36, -41, 46, -52, 60, -68, 76, -84, 93, -103, 114, -130, 139, -156, 172, -191, 211, -231, 255, -281, 310, -342, 376, -417, 461, -511, 569, -633, 714, -807, 920, -1063, 1244, -1484, 1815, -2266, 2759, -1755, 181384, 275290, 212055, 160484, 20195, -204696, -318149, -212329, -43038, 99008, 223737, 275793, 167350, -26159, -183320, -257693, -230626, -82256, 107183, 228016, 248263, 176655, 10241, -174724, -257112, -211342, -97330, 57899, 210957, 258320, 161845, 10197, -122390, -220344, -231142, -106095, 74527, 186411, 208785, 167641, 46048, -126515, -231159, -201032, -90297, 38012, 159378, 224135, 175228, 35242, -111420, -198371, -196925, -108970, 26147, 148960, 208168]
127B08168l8153j26844j43375q1445j127O6009J25838J38607O0201n2907j10371
138D4601j13597r6901l4168P4936J41237J12928M5383j5222q3639j35327j06410
149a66179j1274O8377J01906J07324P2509j2417r6386j20532q5991k2917M8559
160a17021J04014J12086O5809j1457q3919j14399q8324k6974L9992R5162J13509
171H8478P0014j2222p6215r8442q8584m2380L6956J00142J02980N9423J956n9370
183H2736j04175r5494l4058L5150Q0935R7581P3701Q049o2449r5626q4279m1720
195a39649K0379P7815R7271O8051R148n1397q7884q3749m2480J7685P2010R4066
207E1266O7926R328m6688q0143q4723n0182J6259P3320Q6681O2872K0372l5043
$$ y = [208168, 170015, 43171, -100204, -181649, -182776, -116767, 9071, 147678, 207879, 154972, 44601, -68996, -165897, -200065, -125129, 16108, 129036, 174419, 159197, 75558, -59769, -166179, -177453, -109076, -7170, 100154, 172663, 160246, 63860, -56672, -142663, -165580, -117021, -13007, 99079, 164888, 153431, 69512, -44887, -133211, -160185, -120193, -25031, 88478, 158492, 146270, 70055, -28387, -116971, -159351, -122395, -22253, 80727, 140150, 142106, 82736, -21439, -116933, -150991, -115841, -34906, 62675, 136376, 144425, 81976, -13650, -97929, -139649, -119270, -41455, 55816, 123867, 133015, 81618, -6266, -90015, -132495, -114810, -42800, 51266, 119192, 128520, 81832, 1689, -83034, -133216, -116957, -43637, 43044, 105916, 126288, 91245]
219I1245q2936q7614m3916J4048N8156Q0852P1323K3821l7698p6753p8596m7626
231a15694M581N6049Q0840O8291K5503l0074p2078p7810m7678L71M7876P7403
243A7580O9932K5621k7901o3656p2542n1688l619M8355P4163O4268K8142k0960
255H7695o2776p4179m9788n111M0938P1234O8503L0680j9363n6221o9679n4780
267i2847j1624L9549O8120O2977L3220j0513n2673p0544n2674j1403L2578O2479
279c355O4759L5609r651m8308o5929n4813j6105L0772N9567O0529L7660k646m5574
292D2515o6156n1954j5603K3938N4159O2437L9838l613m3090o0936n2487k0727
304i1679K1404N3811O1268M0679J118l8897n9711n2804k3652J5930N0016O0752
$$ y = [91245, 8309, -79305, -123221, -109173, -51017, 29835, 101158, 124979, 87281, 10528, -68068, -115694, -111113, -55064, 25776, 94067, 119570, 89496, 17418, -60392, -108070, -107699, -59823, 17580, 87512, 113133, 85232, 21576, -50966, -102654, -106273, -57918, 16245, 80513, 108655, 87695, 24919, -49260, -99048, -104159, -63221, 8013, 76516, 107196, 87833, 31612, -38067, -92847, -104471, -64922, 3198, 66175, 99395, 88882, 36209, -34335, -87009, -98412, -65834, -3355, 61404, 97013, 87362, 39054, -26875, -81688, -97793, -67021, -7454, 53075, 90735, 88089, 42515, -23641, -75595, -91198, -67260, -13101, 49336, 89174, 85561, 42471, -18465, -70952, -91679, -70275, -16464, 44804, 85483, 86601, 47704, -12007, -64811, -88463, -72533, -22517, 38235]
316C8235M1186L424l3465n4977n3243k6067J4240M6997N6954M1365O848l0886
328E0611n3690n1802k7257J0461M4463N6734M1024Q390k5782n0218n3449k9264
340g9779R991M1375N1720M1724J3619k3894n0825n1283k7929N529L6684N2804
352A9736M4078J3763k1714m6387n0665l2002K408L4857M9841M3078J7745j7050
364E7688m4665m9573l0828j30K9463M7615M4506J8536j6742m1779m6269l1997
376f4175m115K7989M8048M3783J8347j3317l7729m6243l4731n800K6538M5268
388C863M2242K0709r519l5503m5790l5165p267K4090M3080M1480K2375o098l3176
401B5321m5907l5985q252K0998L9201M1483K5770l801l2129m3288l3988j1264
$$ y = [38235, 79421, 82845, 49380, -5597, -58840, -84907, -70667, -23670, 33284, 74649, 81497, 50611, -3079, -54881, -82138, -71677, -27214, 29520, 70544, 78934, 53152, 2934, -50515, -79779, -69788, -28413, 23307, 65031, 78650, 54756, 3931, -47352, -75281, -69752, -33068, 19736, 63814, 77577, 55863, 9476, -41189, -73191, -70783, -35926, 13915, 56993, 74738, 57688, 13023, -36550, -67378, -67508, -38045, 9570, 54076, 72612, 55870, 14091, -32178, -64175, -68290, -40301, 7747, 51530, 69877, 56560, 18831, -27412, -62143, -67943, -41405, 3863, 46105, 66814, 57295, 21792, -23998, -59163, -66430, -42340, 740, 42220, 64595, 58497, 25321, -20586, -56571, -64823, -43825, -4624, 36859, 62629, 58828, 26699, -16589, -50577, -61841]
413f1841J6349L8222M1768K4569l174k7987m0763l5675j2984J6266L6594L9776
425C1120K5955O5k6578m0811l5533j4044J3096L4194L9622K7288K375k4270l9493
438g014l5123j4642J0203L0565L9531K9755K790k4197l5823l2748j9029N791L2092
451a7849M0562K6366L369j7094l3108l7278k0505Q266K9380L4811K7215Q849j6052
464C6932l4453l5416j8997N452K6201L4533K8408J0265j4441l4050l5496j8497
476d9559L450K1682L3768L2458J1501j6160l0889l0452k1688l081K2308L6572
488I910K8567R323r615k6387l4549k4054R0K1162L0827K8732J4560q546k7761
501A2259l2638k2636k761J8055L0161K8889J5368o475k6811l2179k0956l852J3340
$$ y = [-61841, -45492, -7270, 34498, 59067, 55893, 27906, -12857, -48532, -61516, -45250, -8656, 31120, 57075, 57140, 30562, -10249, -45782, -59826, -46730, -12536, 27086, 54374, 56749, 32479, -7014, -42137, -56779, -46576, -16011, 23520, 53275, 56065, 31868, -3955, -36703, -55732, -49941, -17849, 22713, 49079, 52448, 35354, 2246, -35032, -55537, -47271, -17891, 16920, 44135, 52984, 36932, 2479, -32937, -51934, -46482, -20281, 14252, 42660, 52925, 38484, 4434, -31062, -49559, -46109, -24427, 9341, 41799, 53300, 37140, 6251, -24201, -45889, -48970, -26662, 9910, 38477, 47800, 38185, 11798, -22751, -46805, -46715, -25553, 5274, 34006, 48566, 40020, 12259, -20379, -43015, -45776, -27721, 2440, 31329, 46697, 40222, 13411, -18768, -39724, -43576, -30236]
514c0236K9254L2789J5098r689k2912k6526k5397j0510J6791L2593K6411J2693
526D0359l28j8606l3462k6938m295J4347K3642K7491J9983j352k1987k8974k3215
539c3335q830J0457K5407K7687J8245P27j9186k9632k3264p941P230K1923L0264
552A9752K0463k088j8475k3271k3268j4825P126K6460K6953J5458K905j1998k7062
565a870k7386j0459Q348J9756K4879K1283M911j5216k5397k3448j2732L847J9741
578a3743K5960J9956N256j2268k4149k3643j2798K347J7541K6241K0864M106j1212
591B4458k0280k3722j6923K278J9955K3480J7352Q371o483k3035k6161j3004K860
604c0854J3740K1568K2374R493r704k1336k1884j4626j477J3767K3049K1161R254
$$ y = [-30236, -982, 31807, 46905, 37216, 14304, -12222, -37619, -48129, -31338, 1255, 27666, 40359, 40031, 21425, -12037, -38975, -43270, -28923, -5281, 22210, 42193, 40841, 18854, -10120, -33335, -42165, -31708, -6301, 21386, 39631, 40358, 21172, -8460, -31724, -39665, -32435, -10512, 19752, 40215, 38127, 19652, -3619, -26887, -41712, -34586, -8126, 18827, 34285, 37190, 25192, -1870, -29256, -39715, -31367, -11611, 13268, 34551, 39462, 24246, -1151, -24599, -37331, -33484, -13743, 12217, 32173, 37429, 25161, 1012, -22631, -35429, -33082, -15541, 10700, 31564, 35670, 24458, 4178, -19544, -36467, -34189, -14234, 9246, 26598, 34969, 28486, 5451, -20710, -33714, -30854, -17114, 4454, 26828, 36321, 26617, 5281, -16603, -31229, -32706, -18939, 4110, 25271, 34525]
617C4525p149j9808k1976j5091k953J1731K2943K1889Q522o493j6123k0881j8285
630b9149l961J3736K1351J8319J0340k133j6926k3362j6159k438R865J8889K1067
643A9439J2093l804j6169k0320j6713n553R340J9490J9855J1704j499j4619k0636
656g392j6760n820P703J8318K0297J1991j100j2669j9513j8261o795Q094J7044
669d863J8086J3328J867j2878k0503j6299o210M904J5049K0033J4145M25j1949
682A5135j7686j6563q669M360J5650J9050J3577J968j0343j7473j6828r125L119
695b3828J4690J9038J3496K499q509j6316j7676r943L248J3839J7205J3854M539
708B6136p954j6693j6840r470J425J2202J7637J4390M377o913j4926j6943j0688
$$ y = [34525, 27376, 7568, -14408, -29499, -32452, -20721, 2222, 24111, 32633, 26140, 10017, -10864, -29149, -33110, -19374, 1977, 20296, 30636, 28503, 11577, -11785, -27944, -30382, -20517, -1628, 19439, 31532, 27728, 11559, -8761, -25474, -31027, -21687, -2197, 17658, 29362, 27863, 13244, -7392, -24152, -29972, -22269, -3951, 16346, 28337, 27237, 14568, -4945, -23206, -30001, -21907, -4863, 13223, 26551, 28418, 15540, -4963, -21262, -27472, -22568, -7519, 12514, 26659, 27084, 15135, -2551, -19114, -27783, -23423, -7773, 11277, 24854, 26822, 16479, -994, -17822, -26947, -23828, -9138, 9900, 23396, 25895, 17386, 1070, -16606, -26549, -23301, -9462, 7743, 21597, 26136, 18182, 1489, -15351, -24821, -23396, -11194, 6443, 20833, 25210, 18297, 3371, -13572, -24260]
721b4260J049J1689J6430J4146N768n933j4887j6354j0467j41J0207J6391J4591
734A8229N980n097j3719j6223j1319p20R635J5278J4569P225m309j3401j5549
747i421j0999k074Q122J5298J4946O891l670j1750j5091j1943k938Q156J4640
760A67J3967P549k081j1104j5347j2007k992O986J3547J4140Q275j453j0672j4565
774e590j1980l893O099J3152J4000Q511p98r628j4236j2386m342N494J2401J3521
788A0325R113J99r130j3985j2072m612M321J1389J3630R583N02q520j3102j1875
802a4234n567L540J1123J3530R347J208p528j2503j2183n915K894J0334J3031
815G077R770J903o831j2038j1800o589J971R808J2903R677K358n716j1414j2166
$$ y = [-24260, -23211, -11522, 4908, 19054, 24822, 18889, 4002, -12352, -22819, -22960, -12753, 3638, 18229, 24209, 19112, 5393, -10830, -22149, -22869, -13234, 2044, 16613, 23838, 19529, 6128, -9421, -20420, -22494, -14372, 926, 15872, 22763, 19093, 7343, -7748, -19691, -22629, -14473, 167, 14134, 21683, 19602, 8498, -6849, -18856, -21848, -14862, -1315, 12825, 21100, 19647, 8975, -5590, -17570, -21463, -15364, -2212, 11788, 20299, 19501, 9873, -4363, -16749, -21091, -15597, -3196, 10325, 19438, 19637, 10507, -3478, -15550, -20162, -15841, -4452, 9178, 18761, 19263, 10743, -2359, -14234, -19801, -16261, -5138, 8392, 17739, 18947, 11419, -1084, -13267, -19182, -16288, -5954, 7077, 16847, 18750, 11919, -119, -11919, -18508, -16537, -6729, 6174, 15851, 18209, 12493, 1079, -11087]
829a1087o977J691R133J2099R852L393n034j1246j1928p071Q22Q263J1837J0248
843A3995L710m525j0450j1632p567K46P592J1367J0192M309l730j0083j1571p518
857a5665k94O671J0973J0505M734l361r608j0946p706j274O074J0946J0409M736
871A6194k707q571j0834q321j583N724J0404R986N281j828q135j0733q363k052
885a5538N104R849R965N624j279p671j0302q441k515M436R422J0022N833q88p085
900F536r850q546l196M006R235R628N850q6o184r956q859l129L654Q305R217O613
916A3238N70o129r714q417l481K810P631R396O875R39n793r233q136l969J848
931a1565P277R650P054P25n119q214q269m978J593P533R086O423J602l887q346
$$ y = [-11087, -18064, -16373, -7240, 4859, 14711, 18104, 13070, 1824, -10104, -17175, -16353, -8090, 3747, 13995, 17705, 13180, 2730, -8902, -16469, -16223, -8631, 2736, 12928, 17237, 13507, 3424, -8147, -15665, -15959, -9288, 1685, 12190, 16924, 13563, 3955, -6991, -14697, -15971, -9897, 1049, 11458, 16194, 13487, 4916, -5918, -14239, -15822, -10098, 306, 10292, 15573, 13745, 5610, -5123, -13486, -15538, -10434, -585, 9380, 15004, 13725, 6054, -4248, -12689, -15204, -10768, -1346, 8676, 14509, 13621, 6536, -3314, -11860, -15056, -11050, -1815, 7813, 13663, 13577, 7393, -2563, -11422, -14551, -10897, -2592, 6625, 13238, 13808, 7679, -2035, -10452, -13933, -11123, -3492, 5904, 12779, 13718, 7925, -1308, -9444, -13413, -11565, -4288, 5362, 12416, 13141, 8022, -192, -8461, -13439, -11846, -4313, 4773, 11196, 12798, 8911, 565]
946E65q857m689J671O414Q420P151K314l934q182q282m833P52N971Q398P233K647
962A2759l567p822q036m903R0N295Q602P410K237l203o630p912n929j81N809P992
978B011O519L146j826p029q611n209P1M330P336P564L634k444o610p573n520r56
994a1167M177P402P348L662j814o170p514n401j593L428P624P592L181j612m901
1009D242p074o673j972M374P035O173L984N4n261q051n862j235K802O007P229
1024E772M609o62n016o889n989k281K636O145O777M654O7m739o869n621k599J743
1040h262N949P262M364n9l632o130o725l156K543N662N944M693J484l809p135
1055a007n790k352J106M591O839N389O45l689n727n902l481J011M936O448N026
$$ y = [565, -8292, -12981, -11310, -4896, 3524, 10675, 12989, 9055, 873, -7409, -12242, -11490, -5519, 2879, 10112, 12759, 9192, 1370, -6666, -11569, -11479, -6184, 2418, 9828, 12065, 8862, 2232, -5680, -11609, -11790, -5981, 2011, 8530, 11676, 9850, 2821, -5790, -10999, -10928, -6598, 738, 8302, 11936, 9492, 2882, -4691, -10211, -11167, -6990, 412, 7760, 11422, 9608, 3438, -4076, -9477, -11070, -7642, -18, 7574, 10755, 9143, 4242, -2832, -9505, -11477, -7103, -68, 6105, 10089, 10143, 4882, -3169, -9031, -10266, -7464, -1457, 5772, 10381, 9719, 4703, -2186, -8175, -10456, -7820, -1675, 5102, 9756, 9823, 5084, -1785, -7406, -10005, -8262, -2313, 4949, 9313, 9254, 5622, -508, -7233, -10389, -7846, -2184, 3760, 8453, 9937, 6128, -1007, -6797, -9149, -8043, -3452, 3387, 8776, 9421, 5732, 5, -5897, -9378, -8367, -3431, 3017, 8043]
1070H043J212l114n739n745l585L79M794O570M694J196k282n085o506l948R85
1085h131M558N330M816K590k196n986n833l149qL262O069N527J917k233m786n617
1101c870m087k88L645N610N111K353j546m834n568l956p89L237N615N144K188
1116G965j049m105n842m459m54L087M846N000L197r32m619n380l782j154K010
1131e671N186N605K633r56l607n100m582j440K465M884M941K952k80l512n202
1146a684m383j580K026M634M924L018M6l174n147m522j499J802M076M782L584
1161F903K84l403m925m040j871J134M063N096L339K18k738m482m478k208J215
1176e893L849M750L349P85k521m534m318k299Q75L567M736L525P48k112m270m425
$$ y = [8043, 9255, 6141, 402, -5343, -8928, -8549, -3755, 2815, 7509, 8705, 6423, 1338, -5168, -9116, -8131, -3573, 1757, 6573, 9163, 6967, 981, -4852, -8001, -8009, -4747, 1322, 6849, 8766, 6533, 1747, -3870, -7957, -8245, -4600, 1010, 6121, 8474, 6928, 2094, -3474, -7430, -8219, -4982, 633, 5777, 7965, 6916, 2811, -3031, -7490, -7944, -4857, -11, 4989, 8186, 7254, 2635, -2745, -6527, -7681, -5671, -485, 5120, 7753, 6797, 3190, -1910, -6492, -7932, -5467, -583, 4358, 7310, 7030, 3518, -1684, -6067, -7647, -5621, -987, 3937, 6955, 7001, 3827, -1320, -5842, -7341, -5539, -1463, 3319, 6903, 7187, 3784, -1141, -5181, -7052, -5918, -1855, 3241, 6580, 6798, 4060, -422, -4900, -7108, -5893, -2044, 2706, 6055, 6840, 4319, -215, -4533, -6832, -5957, -2390, 2346, 5871, 6619, 4507, 237, -4188]
1192d188k446O77L357M489L709J063k091m037m223k657L32L107M574L551J105
1207F322j552l745m491k769K86K957M095L676J576j409l774m265k708k2K497M040
1223G14L885J591j205l556m168k819k50K249L978L838J796j045l374m032k856
1238e254n91K077L972L734J820p35l036m020l048n40J926L507L749K124n62l027
1254B096l866k985q64J650L505L786K093m37k600l734l155j055J450L447L623
1269B954K173j03k355l655l222j214J384L111L564K273J78k289l572l165j371
1284e309J144K949L552K557R4k037l481l132j362P59K806L499K467L88j821l265
1300a92l126j656O66K654L455K470N91j595l134l236j648M34K436L357K579P38
$$ y = [-4188, -6634, -5957, -2600, 1889, 5598, 6661, 4570, 533, -3690, -6347, -6015, -2908, 1666, 5217, 6322, 4770, 1025, -3466, -6235, -5949, -2992, 1103, 4779, 6355, 4946, 1172, -3093, -5801, -5823, -3326, 714, 4599, 6190, 4985, 1429, -2739, -5558, -5808, -3559, 419, 4257, 6053, 5008, 1634, -2398, -5254, -5845, -3768, 204, 3938, 5758, 5023, 1987, -2033, -5081, -5621, -3695, -188, 3561, 5685, 5123, 2096, -1770, -4755, -5619, -3969, -464, 3322, 5415, 4978, 2378, -1356, -4511, -5566, -4116, -669, 2954, 5127, 5024, 2669, -986, -4208, -5422, -4038, -927, 2637, 4910, 5088, 2799, -773, -3938, -5309, -4165, -1216, 2336, 4893, 4987, 2950, -531, -3663, -5025, -4266, -1460, 2039, 4506, 4894, 3073, -192, -3318, -4974, -4308, -1654, 1801, 4271, 4862, 3267, 133, -3103, -4751, -4317, -1881, 1476, 4055, 4793]
1316D793j422l039l222j714L24K190L287K676P91j323k736l147j912P8K197L190
1332A011K535R77r69k729l196j918j2J987K976K655J201r15k639l086j994j15
1348d231J757K844K866J137p64k474k950k122k35J567K826K709J301o32k264k894
1364a559k209l76J443K721K686J415m70k110k840k237n17J289K554K715J547l83
1380C669k037k720k320o43J106K573K725J506k21j871k559k405q14J022K415K595
1396B021J641M2j721k651k298q94Q85K177K550J785J28j522k535k360r84O92K088
1413i56K457J923K45j521k389k300j107N31J958K609J841K33j235k275k326j303
1429c615M76J944K337J804O07j086k326k322j291L39J665K409J959O44j107k137
$$ y = [4793, 3371, 332, -2890, -4604, -4280, -2090, 1197, 3873, 4664, 3341, 605, -2542, -4454, -4376, -2179, 1011, 3546, 4523, 3554, 825, -2371, -4289, -4301, -2314, 662, 3317, 4518, 3603, 964, -2122, -4116, -4231, -2474, 370, 3236, 4373, 3609, 1135, -1815, -3937, -4172, -2605, 221, 2930, 4231, 3599, 1335, -1559, -3768, -4144, -2701, 20, 2706, 4121, 3651, 1541, -1299, -3536, -4053, -2764, -210, 2505, 4052, 3669, 1632, -1088, -3408, -4051, -2945, -372, 2353, 3859, 3638, 1767, -792, -3197, -4011, -2989, -574, 2021, 3662, 3704, 1983, -668, -2966, -3860, -2975, -798, 1752, 3537, 3665, 2143, -392, -2752, -3736, -3044, -956, 1501, 3424, 3669, 2148, -241, -2541, -3648, -3117, -1159, 1450, 3291, 3524, 2289, 14, -2312, -3615, -3139, -1195, 1142, 2946, 3553, 2467, 141, -2181, -3472, -3133, -1468, 941, 2900, 3544, 2437, 300]
1445C00k261j353R4J626K288J985P42r47j998k213j382q0J502K347J873O92o44
1462B571j871k338j508K3J484J961J976R47n95j942k202j366k59J199K162J964
1478B206J002n74j710k140j494l46J112K008J963J046m19j653k026j607l86R91
1494b027J967K027R33k11j485k071j682m26R63J732J914J240j44j524j954j546
1510b294n46O30J828K005J125j14j289j851j678p08O53J709K013J195o7j161j752
1527c02j799p62O13J649J802J188K24r95j880j756o41N26J366J717J462K21j089
1544A544j704j553r18L23J420J846J248L50q40j558j826q84K77J382J656J374
1560B137L83p77j557j686r63J32J300J716J357M55n84j579j825r27J98R77J616
$$ y = [300, -1961, -3314, -3220, -1594, 694, 2679, 3421, 2474, 476, -1737, -3119, -3199, -1697, 650, 2523, 3215, 2571, 700, -1638, -3146, -3123, -1639, 322, 2298, 3245, 2650, 708, -1494, -2860, -3119, -1920, 242, 2206, 3208, 2634, 924, -1216, -2710, -3056, -1944, 64, 2027, 3073, 2654, 1001, -1025, -2632, -3018, -2027, -60, 1967, 2900, 2689, 1204, -867, -2549, -2975, -2012, -280, 1634, 2874, 2730, 1206, -748, -2294, -2840, -2210, -382, 1623, 2748, 2634, 1345, -506, -2184, -2892, -2239, -530, 1483, 2678, 2611, 1450, -302, -2101, -2863, -2250, -601, 1201, 2389, 2613, 1618, -262, -2018, -2659, -2133, -767, 950, 2412, 2633, 1544, -160, -1713, -2631, -2308, -888, 958, 2206, 2556, 1716, 158, -1668, -2552, -2275, -893, 763, 2137, 2520, 1743, 186, -1500, -2463, -2331, -1031, 685, 2042, 2497, 1913, 334, -1491, -2418, -2220, -1243, 373]
1577C73J559O46p42j545j446j001j12J010J659J512M49m86j294j688j108PR16
1594a291J547J422P48m59j429j528j010k84Q11J598J382Q08k89j238j695j063
1610a970k39P55J401J430R23l44j139j488j084m71O29J522J412O68o2r59j559
1627e75j225k99O20J216J362R63q7j071j384j216m38N37J298J409Q75J4q93j529
1645d23j194m09M36J120J417R95n2q38j215j281o17M03J203J277R46J64o53j448
1663a69j257n03K85J000J301J097J87p34j235j185o68J66J061J299R34K37n74
1680A242j101j233p79J70R07J319J015L14n07j137j236p26M9Q76J204J028M00
1697A805m15j089j253o81l7P67J153J075M41m05j019j126q53p5P87J174J031M34
$$ y = [373, 1932, 2578, 1836, 291, -1155, -2156, -2268, -1258, 401, 1913, 2362, 1876, 582, -1106, -2214, -2207, -1291, 256, 1678, 2426, 1967, 538, -990, -2000, -2284, -1473, 125, 1507, 2315, 2026, 788, -907, -1970, -2209, -1454, -53, 1377, 2300, 1956, 817, -671, -1755, -2226, -1597, -75, 1337, 2005, 1943, 984, -575, -1800, -2099, -1479, -263, 1099, 2062, 1975, 904, -480, -1696, -2134, -1597, -299, 1110, 1985, 1999, 1106, -423, -1617, -2026, -1590, -470, 947, 1942, 1890, 1052, -163, -1444, -2061, -1658, -455, 822, 1768, 1932, 1279, -169, -1426, -1929, -1644, -644, 657, 1754, 1941, 1207, -28, -1213, -1881, -1715, -654, 645, 1579, 1816, 1242, 141, -1092, -1871, -1701, -794, 525, 1540, 1854, 1347, 210, -1026, -1752, -1703, -827, 377, 1405, 1805, 1390, 301, -952, -1633, -1670, -903, 250, 1325, 1766, 1361, 342, -784, -1637, -1712, -925, 249, 1280, 1714]
1715A714l20r35j171q42j40O95J136R84N15k64r09j115q87r8N94J065J005N90
1733A617k00q40j179q28j69N07J021J044O61k16q24r94q56l78M27J070J033O11
1751A507j42o54j029r69k88M81Q92R95O89k8p25j040q53l33L15Q65J046O81K5
1770A435o84r38q77l82K77Q15J042O79L7n72r44q97m51J99Q57R83O78J82n20r59
1790d0q86m44J64P03Q99Q16K27m85r28q86m68J00O45J008P30K03m26q58q54n54
1810a334J50O05R14P36K43k97p77r15o01NO62Q10P92L64l04r01q20n42oN27Q47
1831A58P90L36k45p69q08o34l0M15Q72Q24L26k53n52q62o65j12M92P97O84L84
1851A148r9n65r39o05j25M58O78P65M71p9o90p61o45j74L28P43P62N16j73n58
$$ y = [1714, 1394, 459, -712, -1554, -1694, -999, 137, 1121, 1636, 1372, 463, -652, -1539, -1637, -1043, 22, 1027, 1617, 1417, 577, -602, -1430, -1599, -1092, -71, 973, 1634, 1418, 594, -400, -1256, -1634, -1207, -137, 896, 1507, 1365, 711, -318, -1287, -1575, -1094, -202, 793, 1482, 1454, 729, -311, -1164, -1497, -1182, -317, 729, 1410, 1435, 751, -187, -1064, -1446, -1169, -354, 688, 1367, 1404, 832, -112, -1009, -1460, -1261, -404, 579, 1257, 1439, 919, -40, -926, -1370, -1206, -503, 396, 1212, 1439, 954, 26, -860, -1328, -1228, -583, 425, 1155, 1358, 932, 74, -780, -1334, -1184, -579, 335, 1071, 1314, 1017, 240, -675, -1276, -1271, -609, 201, 993, 1357, 1053, 152, -668, -1210, -1216, -689, 158, 948, 1284, 1039, 270, -538, -1172, -1202, -787, 85, 909, 1235, 982, 430, -432, -1097, -1209, -717, 80, 764, 1148, 1049, 484, -455, -1060, -1185, -727, -49, 716, 1187, 1108, 418, -343, -988, -1162, -834, -91, 671, 1187, 1014, 456]
1871D56p27o85j49K23O94P97N04o5m81q04o24k85K96P11P01M84j4m01p59o74k92
1892a094K58N50P37O11lm10p71o03l46J56O42O99M82J49l95p09o62l37J86N06
1912c54P14M99J72l70o30p12l04J23M55P14N31J59k59o63o76l98J08M72O48O28
1932H57J70k77p10n94l61J0L79O81N76K42k63n65n86n25N9M38O95N22J87j78n09
1953B48o88m64oM04N74N66L01j67n16o09n15l0K96O41N79K69j64m34o05m58r5
1974h73K85O10N34L07p2m64o26m67l2K30N22N30L70m7m24n94n25r7K69N07N17
1995D60L28Nl87n67m23k35J66N61M91L31N5l97o09l75k61K09M87N55L65l0k65
2016D64n15n38k35J75M27N40L58J22k87n45n05k45J36L49N35M67Mk21m57n38k52
$$ y = [456, -271, -956, -1105, -882, -188, 609, 1113, 1048, 567, -237, -861, -1146, -850, -139, 562, 1046, 1032, 631, -128, -802, -1094, -836, -286, 451, 1062, 1059, 649, -122, -725, -1071, -915, -273, 426, 908, 1057, 662, -47, -709, -1046, -860, -354, 360, 859, 1031, 661, 31, -681, -985, -862, -407, 307, 838, 997, 738, 75, -601, -999, -891, -419, 229, 857, 1027, 750, 40, -554, -915, -905, -526, 155, 731, 973, 710, 145, -441, -966, -907, -469, 226, 748, 935, 757, 248, -440, -904, -910, -506, 68, 634, 935, 768, 252, -357, -872, -902, -606, 35, 614, 883, 719, 285, -320, -778, -873, -588, 22, 556, 863, 791, 327, -299, -766, -798, -568, -46, 484, 854, 807, 383, -211, -736, -833, -564, -57, 460, 788, 793, 406, -161, -584, -819, -653, -92, 399, 730, 785, 388, -221, -596, -857, -648, -161, 394, 759, 729, 464, -51, -589, -824, -649, -222, 318, 676, 798, 511, -34, -539, -784, -648, -299, 236, 703, 707, 486, 29, -509, -761]
2037g61J05L56N44M02J50k43n10n41k10M3L59M36M62J10k17m24m73k69j0L99M27
2058A35M27J41q6n14m88k31oK33M91M40J62k24l42m26l66l4L09N11L43K07j46
2079E36m05m36l29j1K27M10M78K32j18l99m17l20j38K96M19M15K32j24l76l83
2099b11l95qJ68L62M72K40p4k73m12m28n4K07L89L33K76p1k09m81l58j05J90L97
2121d5L78K43m7k60l97l28j50J21L55M13K66J8k56l71l93j31R4L88L75L28l0j82
2143C89l92m04j72R1L00L79L41j2j50l50l90j93J02K55L88L29Q9k98k62l77k59
2164e96J03K59L91L09N7j94k42l76k40O9K14L66K33J50j56k94l28j75l5K55L23
2185I3K98J31j28k99l20j92p5J90L18L71J05r7k35k73l31n3K45L02K83J53o0l12
$$ y = [-761, -656, -300, 244, 646, 796, 553, 43, -498, -708, -665, -306, 130, 592, 702, 485, 61, -412, -681, -691, -292, 135, 562, 703, 617, 103, -385, -616, -622, -389, 102, 542, 704, 480, 138, -288, -654, -688, -379, 132, 475, 682, 536, 131, -305, -634, -645, -418, -8, 470, 702, 584, 185, -232, -552, -690, -394, 25, 440, 672, 548, 172, -211, -606, -614, -446, -84, 388, 628, 554, 281, -131, -559, -613, -406, -17, 316, 592, 521, 312, -169, -527, -632, -442, -45, 333, 576, 529, 269, -128, -456, -606, -485, -130, 283, 549, 567, 311, -60, -453, -584, -490, -102, 273, 601, 571, 389, -3, -407, -579, -488, -188, 191, 532, 520, 370, 20, -370, -563, -461, -206, 182, 511, 600, 302, 40, -337, -596, -493, -234, 157, 466, 523, 329, 87, -289, -529, -460, -246, 120, 353, 503, 347, 53, -275, -450, -485, -230, 93, 391, 522, 394, 95, -225, -417, -492, -302, 16, 387, 492, 395, 160, -113, -444, -497, -252, 50, 333, 486, 426, 114]
2207A14l32k11p0J96L25K64J59L5k96l34k47j00J80L48K46J46Jk19l17k86j11
2228e09J34L66K81J35m1j84l21k03j23J51K87K64J62N0k85k34l15rL9K88K91K13
2250D37j0j93k73l07o9P1K04L62K02j5j49l35k24j43J01K58K32K10L0j45k66k19
2272b41k02O9J80K91K15J47k03k56l07j01NK33L21J79N5j00k19l14j35RJ50L05
2294H1K36O0j19j70k99j67L3K02K54J93J4n2j97k61j65pJ54K59K01J01J8k77k11
2317a19k13j3J33K78K10L4mj97k50j88m8J78K04K75N%k03j76j80r5K03J62J47
2340A43K39n8k10k10k11K7k5K77J83J67j9k41j74j41p6O6K24K01J61l8j46j66
2362b7k00j12J39J59J97J12Q9j87k47j87k2M4J26K67J49K7j39j90k48j16O9K13
$$ y = [114, -218, -429, -499, -303, 22, 286, 445, 480, 184, -150, -397, -497, -317, 31, 277, 423, 424, 205, -112, -398, -509, -375, -9, 272, 407, 366, 182, -139, -342, -465, -314, -27, 237, 399, 449, 164, -70, -385, -394, -355, -67, 224, 437, 427, 234, -39, -346, -415, -344, -140, 222, 424, 409, 260, -75, -299, -442, -341, -83, 149, 359, 389, 244, -22, -241, -443, -374, -194, 97, 312, 459, 256, 0, -307, -408, -403, -170, 151, 330, 385, 285, 66, -248, -383, -374, -224, 81, 317, 377, 258, 88, -211, -378, -345, -143, 111, 304, 318, 266, 69, -192, -357, -364, -210, 49, 250, 351, 369, 92, -119, -332, -345, -212, 66, 276, 310, 306, 109, -141, -329, -377, -199, 5, 280, 285, 285, 82, -94, -274, -369, -166, -4, 143, 382, 324, 114, -96, -307, -280, -305, -28, 155, 322, 303, 62, -112, -253, -329, -263, -39, 162, 323, 285, 139, -27, -227, -339, -200, -41, 156, 268, 357, 170, -77, -264, -286, -242, -116, 151, 300, 327, 188, -2, -250, -366, -297, -84]
2384h4K37J17J3j24j71j83p7J17Q2K22J30l4r1j28j99j27L3J90K18J51Qp7j47
2407G6k45j17j9J84J68K12Jq1j44j75j26k9J96J91J67kl6j60k28j12m0J74J84
2430C9J59O1o1j71j35j59jJ18J92J05O7Lj52j58j11k5M2J43K32P6l7j53j57j59
2454b42J1K1K52J18J01p0p2j75j68r0J58J33J73P7l6q0k21m8p1Q7Q8K01R3j2j41
2479H7r7j71r3J16J16J61J47m0o4k42p6r9N0J28J68J31J2q1j68j84J5o4K29J32
2503A13R3P5j72q0j64j05M1J73J26K8J24j11j51j52p2N8N5K17Q1O7p2j03j96q3
2527b10LJ14J79P1J02j10q8j54m9n0J08J18J30K1j4j39p6j59J4M5J19J42R0p1
2551A36r0j32p8j7O7J49J21J9Lj31j10j35L0J57L2J02M8Lm8k27n6n6N2J43J17
$$ y = [-84, 153, 270, 283, 159, -12, -195, -272, -155, -73, 149, 279, 245, 154, 26, -173, -300, -267, -77, 141, 292, 300, 223, 76, -169, -286, -305, -121, 47, 259, 260, 179, 35, -140, -266, -295, -99, 92, 259, 257, 221, 61, -167, -279, -319, -145, 39, 198, 259, 198, 27, -108, -267, -268, -150, 42, 147, 214, 217, 65, -93, -204, -229, -187, -44, 188, 264, 227, 74, -83, -242, -231, -210, 42, 160, 261, 191, 119, -56, -224, -314, -156, -23, 150, 227, 191, 111, -110, -158, -229, -142, -54, 147, 240, 228, 87, -10, -181, -274, -158, -42, 119, 266, 226, 162, -80, -156, -255, -205, -77, 91, 222, 234, 153, -15, -199, -184, -248, -19, 113, 206, 281, 109, 29, -135, -240, -199, -26, 100, 128, 252, 141, -10, -162, -234, -176, -121, 96, 177, 244, 172, 69, -127, -210, -207, -93, 86, 157, 259, 149, 61, -93, -142, -192, -84, 34, 164, 185, 171, 32, -44, -203, -189, -144, -25, 117, 207, 136, 46, -86, -164, -181, -114, 35, 156, 175, 178, 47, -63, -198, -168, -11, 21, 123, 171, 174, 126, -101, -157, -213, -161, -18, 99]
2576I9O0nj13o1j82j5J36J04R3K0L2q7j51j26j7O5J41J32N4j9j08o6j66LL9L8
2602a00J65Q9o1J2j38j42qL6J06Q5N7J12j17q6j13o7O7J02P0R6M3j13j46o7m3
2627a61Q3L6R2R8N6j44p6q8p3J7J19J03L7P2p9l8k00k7L8M8J50Q1J7k0j52j32
2653a43j0J5R7P0L5J22k2j60p5n7K1R2J5Q0R9o2j19n8m7l8J18L7J36k4k9p5m8
2680c0r0RN2R0P0pL3j12q6m8NL6P9J04O2n2l2q8q2k4N4J11O0J1l5q7o1j27P4M1
2710g0L6J43j6M7q9j11l2j6MO4J15M1L9m1j94mq9J00j7J40Q0L4n6j84j6p1R5P7
2738IL4N3Pm7j4j54%l1J54L7O4M1m0j34q1j1N5N0K4Q0J5j05kl7q6J0J02L1R2r
2768A07j4j09j1n2m3L1J30Q1k3k3n2p6k4k5K0Q3N3M5Rp5m5j03Q5l1P8O9K7l0o1
$$ y = [99, 159, 154, 41, -20, -202, -217, -81, 23, 116, 136, 168, 81, -70, -196, -213, -148, -7, 125, 179, 160, 52, -14, -180, -177, -138, -100, 65, 154, 93, 105, -33, -175, -183, -147, -41, 44, 101, 213, 96, 10, -103, -170, -103, -1, 69, 165, 208, 95, -51, -118, -161, -78, -42, 50, 148, 204, 60, -16, -104, -177, -160, -41, 62, 99, 171, 92, 54, -146, -173, -135, -87, 63, 144, 161, 141, -11, -143, -153, -138, -41, 29, 64, 186, 164, 4, -71, -128, -107, -15, 0, 80, 179, 117, -2, -60, -107, -145, -27, 10, 146, 122, 93, 18, -30, -120, -111, -59, 31, 101, 94, 127, 15, -71, -119, -114, -78, 1, 105, 167, 115, 83, -5, -87, -111, -57, 54, 114, 125, 90, 3, -58, -185, -111, -70, -34, 109, 93, 140, 51, -60, -92, -108, -104, -40, 75, 116, 155, 114, -80, -84, -173, -73, -90, 50, 130, 164, 108, -76, -92, -163, -68, 9, 43, 96, 103, 56, 42, -112, -112, -143, 11, 48, 112, 153, 113, -21, -102, -113, -58, -8, 16, 96, 111, 6, 4, -33, -119, -109, -7, 24, 116, 107, 93, -16, -27, -79, -122, -91, 39, 120, 97, 74, 22, -54, -78, -103, -83, 0, 53, 98, 107, 32, -13, -116, -31, -62, 16, 85, 112, 82, 21]
2797B1q2l8kM1P2L7P6j4p2k5r6oRJ06N7O2l1l2o9j00kj1P1qJ49o7m0j2o5m6J08
2828ij8Q3M3k3l7q7p1M8qP6O9L1j2m4p8Km8N1M9j0J02k5Pj44j0o0P2N8nQ8qm6
2860C6n3p8k3Q0N1qJ29p0k0n0p5K9j3L5Q9K6J2l1m3n4n3L4nO9J09l3k5nj28n6
2890a24j3J57j5Q5K6p2j7n3n7K5K5%O8K2J9j15l2J6m3L6N7J01L2n9l4j03L4n9
2918i3K2K7J08KJ2n9q3N3p7M9OP4L8q8J9Qj41N7K2N9M9L0j9rr0q6J6K2N1Q2J3
2949G4k3j9k8m4%J8J4O5l5N3o1kn0j1J0L8K2N4m3M0n7l5p5M4L6%J00J4j00J9j04
2980h6j0L5M5M3P7K7l6j41K5n4RK6L1J02l1j6m7m7j4M0oJ03o2Q8n4k2r2J1m3N4
3010d5O8N1K3n7l2m9J9o3P8K6j0J28j21K4j01l1M3J0P8j9N7Qj08L1j09N3L6k5
$$ y = [21, -61, -99, -101, -60, 12, 49, 125, 111, 39, 14, -82, -88, -79, 27, 84, 146, 115, 83, 14, -86, -88, -99, -28, -36, 113, 46, 6, -6, -71, -117, -9, -27, 56, 99, 76, 39, -48, -119, -71, -79, -3, 66, 97, 85, 41, -37, -35, -83, -32, 17, 7, 109, 84, 91, -53, -63, -123, -51, 7, 2, 90, 82, 36, -17, -95, -118, -38, 13, 5, 134, 64, 44, -6, -81, -52, -65, -30, 59, 85, 97, 66, 23, -31, -84, -50, -55, 14, 123, 90, 65, 60, -68, -124, -137, 20, 5, 90, 116, 44, 27, -26, -83, -58, -33, -33, 35, 57, 76, -39, -71, -55, -98, -62, -5, 96, 128, 69, 35, -68, -34, -93, -71, -44, 64, 66, 78, 19, -64, -11, -88, -39, -33, 41, 79, -9, 10, 18, -123, -66, -44, 15, 64, 94, 75, 66, -24, -110, -94, -72, -21, 61, 74, 51, 32, 4, -40, -40, -22, -8, 57, 22, 75, 14, 12, -38, -49, -39, -1, 21, 75, 32, 72, 15, -20, -95, -51, -15, -15, 85, 99, -1, 18, -86, -96, -61, -16, 27, 104, 131, 95, -46, -21, -75, -66, -40, -9, 93, 62, 46, -1, -48, -62, -22, -28, 75, 13, 101, 47, 25, -67, -56, -99, -45, 23, 74, 97, 40, 8, -41, -22, -85, -7, 19, 9, 137, 16, 40, -61, -92, -49, -39, 39, 20, 77, 85, -23, 8, -101, -48, -12, -37]
3038c7J07pL5r4Lq1MN8j4R0l3j8k7ql2k7L9O2j2Q0j6k8k4o9l8M0N0L5L2k2q0q
3070d0K4l4KN4L6L0m7pj5j4k3m5N2L2K2L8k8l3k1l7RK9M7J5j0jn4jmk7N8J9K4
3103E0Jol7l2j08J11K7Q0o0M3m9k8j9m2lP7j0J0L8OL4m2r8j1R2j8P0qn3l3PKJ2
3136Cj9qNR4j3k2k5l9l2QK7Q4r3L1K8l9m6N0L4l8O0m1N6p5m1L5j5lL5j0M0J3k4
3169B0po7j1QR5l0j4P9o8J4n4K0K9k0K6KN0r6P4p3qk6J0O8K2l3k5m4N7l8LM6J7
3202B6j6P7n3o8m2P2l1k6R4j2O0p3M0m4j2ml8L8M7j4k1K7k2k3kO2MJ9j4Oj17M4
3234a6m3L8rR0j7N6L0j48j6j1J0L2R6n3j9L1l7o2K7N1lpO8l8l0j4L0p0l2j6O3
3265a9N0J4Pj8n1k1J9Pj4L6O2mj14P5o3k2pN3N0l7J8J8m7Qp3M2J4K2J7r1R4j3
$$ y = [-37, 70, 63, 98, 4, 7, -74, -70, -12, -26, 64, 31, 13, -14, -22, -54, -81, -42, 20, 8, 88, 72, 44, 20, -49, -87, -47, 3, 38, 70, 48, -32, -40, -16, -50, -48, 6, 42, 72, 25, 18, 3, -11, -34, -79, -27, 5, 27, 65, 37, 4, -17, -54, -45, -16, 31, 46, 36, 35, -19, -20, -24, -51, 7, 26, 50, 51, 45, 8, -24, -132, -21, 6, 86, 26, 69, 20, -8, -27, -69, -72, 5, -5, 5, 43, 49, 83, 41, -57, -68, 24, 6, 76, 68, 15, -18, -11, -9, 3, -16, -24, -19, 75, 62, 40, 15, -24, -56, -48, -21, 63, -30, 1, 29, -10, -56, -6, 28, -10, 50, 9, 65, -10, -51, -16, -31, -34, 1, -9, 31, 44, 20, 13, -54, -65, -57, 38, 8, -6, 73, 5, 19, -35, -15, 14, -6, 20, 22, 72, -24, 50, -23, -31, -57, -47, 21, 43, 10, -15, -59, -2, -40, -37, 9, 26, 10, 87, 34, -34, -76, -4, -35, -61, 33, 21, 81, 8, 48, 4, -8, -12, -50, -12, 35, 21, 0, 27, 5, -18, -20, 42, 46, 65, 51, 57, -60, -16, -59, -21, -30, 60, 43, 99, 129, -19, -35, -46, -36, -4, 92, 39, 20, 51, 14, -48, -21, 30, 27, 20, 88, 50, 20, 6, 36, -34, -66, -82, -19, 31, 45, 52, 34, -17, -38, -19, -12, -26, 10, 72, 68, -46, 29, -34, -56, -63, -10, 40, 3, 21, 39, -8, 0, -73, -31, -17, 5, 22, -69, 25, 12]
3297A2k6o0M5PN2Oj7K2o6J2kl6nQ4k7j8Q3q6j2K4p9K3O2Q7l8k2Mo2j6j1O1P5o7
3330IQj4K1n5l5M4m4J03l3L9k5l7L1r0J8M1k9K3R5k8Rq7P6k5o4O2JK9n2jJ5O5
3362G0m3k7L7l7N3Jm6p8J8KJ0mM0J0pj6p9J5P0m5j5J30q6N4J4o2J6m1N4j8l7M6
3394aJ7Kp3MN9J0Mo4K4N4km3p3P5j0K7Q6l3m8n8J7M1op4M9%L6k2J4m2J4nl5L1
3428b5O7l5Pj1jk6jK1M7j7l3M1k1KL3j9j2OJ0k3j6O3k6n6k3K1K6L8l5K7onj9o0
3462f1N5Pj4O8pl7ln7J3mP3rK3j4l9j5kj3K6J2%LM8m3kn6ll8J01l8L0Rj0l8M0
3497Enm3K5N4l4J9l9ol0K7l3K5pL1L1n1J5N1r1J03n1QK2k0m5O7m2L4Jm3K8rN3
3530E0m5J5l1M3o4lP5J0m0j1J7k0k3K3j0%M2l9J3rmk2j5L0Pj2j5M8n6P9k7k4j1
$$ y = [12, -14, -74, -29, -22, 30, 36, 19, 41, -25, -13, -15, -51, -56, 28, 1, -17, 66, -20, -32, -8, -87, -64, -2, 85, 47, 25, 29, -33, -49, -60, 1, 76, 9, 17, 3, 24, -31, -66, -22, -66, 37, 4, 43, 18, -19, 12, -78, -60, -19, -48, -25, 70, 42, 51, -36, 40, 15, -49, 13, 14, 43, -9, -10, 5, 70, 27, 0, 37, 0, 53, 54, 8, -70, -52, -50, -40, -44, -4, 6, -1, -17, -96, -81, -11, -56, -71, 59, -27, 27, 41, -21, -5, -46, 8, -10, -47, -1, 16, 18, -55, -51, 8, 18, 22, -42, -18, 36, 34, -9, -82, -7, -17, 10, 96, 63, 15, -43, -26, 15, 9, -65, -16, -16, 20, -2, 12, -30, -16, -21, -56, -25, 42, 7, 14, 3, 2, -24, -25, -4, 43, 26, -7, 34, 13, 15, 48, 29, 17, 23, 33, 10, -6, 57, 31, -25, -48, -27, -1, 37, 2, 29, 23, 18, -1, -61, -6, 1, -13, 55, 48, 11, 8, -49, -36, -40, 33, 24, 47, 33, -6, -21, -23, -36, -10, 2, 2, 5, 53, 10, 8, -48, -51, -89, 12, -26, 4, 13, 3, -35, 5, 0, -43, -18, 36, 2, 21, -18, -24, -54, -27, -60, -35, -42, -11, 20, -31, -16, 35, -56, 47, -4, 4, 26, 6, -39, 28, -14, 20, 21, -22, 6, -3, 50, 5, 20, -11, 32, -32, -35, 40, 50, 10, -1, 16, -4, -27, -4, -14, -14, 28, -11, 2, -7, -11, -33, -48, -18, -11, -23, -38, 10, -46, 33, 6, -18, -29]
3563b9K9j6m9N5Omm6L3m8O1O7o3l7K2k9J4L2l9j4O8k9M2K4m5Krk8mN3Qk4j3K0
3596A0k8P7p8k7QO3j4Okj3l4K0j4J9O0l0k0k9m3K9OL1RRl8M4m1L8m2nQl0P0n7
3630c8OpM8n9K9PQ3n0p6L2N3q5P2p3M9J5m2M3n8M4J0l6moN4L9l9Ql1R7q4J7p9
3663f1MQ4n9Q8l9j5pJ6k6m4Q5l4l9L9N2r5pO3j2J1MO0m6m3n0P3l2L6k3pL9K3l4
3696Dl7M2p3L5P8qj5qo8M6m8O7j9N3o5lK7pm7JM4Jpm5N9J6Oj20L9Q2k8N3l5m0
3730b0j9N1Qn7qK6Q9o9K0mk6kK2l3J2J5j0J7p1J3N0m6L5J3Lk2M6m1L4n1k1Lk5
3763f8J09r1O1k0n9N2J6p2N1L4l0K8J8n0rP3n7M9m9L2l9J5J7n3N2Nk9k8L5j2p
3794b6oK5J9l3K4l0k4M2L1k3l8K3j0j0L5k5nL2%K5o6N2k8M5l8m6N5j0J0njK4k2
$$ y = [-29, 0, -16, -65, -10, -4, -8, -54, -21, -69, -8, 59, -4, -41, -19, -48, -34, -2, -41, -55, 13, -16, 26, 50, 5, 7, -2, -30, -34, 19, 27, 3, -10, 10, -18, 59, -19, -46, -38, 25, 11, 17, 15, 2, -32, -12, -26, -7, 53, 23, 3, -26, -69, -40, -34, -3, 6, 15, -23, 21, -20, 18, -24, -29, -21, -51, 19, -38, -32, -39, 9, -50, -21, -14, 69, 19, -57, -25, 28, -57, 15, -58, -9, 6, -36, 7, -51, -7, 3, -33, -37, -43, 11, 50, 11, 19, -12, 85, 1, 18, -61, -57, 27, -32, 56, 17, 2, -5, 11, -15, -59, 26, -8, -47, -8, 44, -51, -58, 5, -7, 4, 8, 68, 22, -21, -71, 2, -30, 6, -17, -24, 15, 38, 4, -33, 9, -64, -29, 49, 41, 26, 18, -50, -4, -52, 15, -4, 49, -16, -19, 8, 1, -46, -45, -1, 0, -7, -52, 7, 23, 29, -91, -52, 30, 2, 55, 20, -20, -39, 12, 20, -37, -45, -19, 70, 1, 21, 17, -9, -11, 11, -22, -10, 5, -5, 12, -59, -46, 4, -42, -7, 6, 9, -13, 33, -8, 26, -25, -46, -43, -68, 41, -50, 11, -9, -68, -16, 0, -72, -21, 13, -17, 11, 29, -21, -30, 43, -14, 35, -14, 18, -21, -6, 11, -42, 10, 15, -14, -42, -7, -19, -26, -32, -7, 12, -21, 3, -27, -51, -9, 22, -1, -39, -16, -26, -36, -1, -26, -31, 1, 1, 26, -40, 12, -16, 29, -9, -55, 0, -10, 0, -5, -6, 18, -4]
3827dqL4J1j4m4L8n3k2L9K8mK5pRl7rJ6J4qRN7o9J4k9OJ7j2%k5M8o7M9L1k6p4
3862f7M8mL6j7M5j3k1j5j1k5N2m0K4M8n8j0j0O5l9J8Oo6R4j8n4O2l0K0n4J5L3
3893A4l3L2l7OJ7o0J20o0k2L9j2q3J43r0j3J34q0K8q5K1K6o0O3n3K7jN3J0p6J7
3923a5J7j1L7k7l7K8N9j3l2j7k0j9J8mJ6M8j3l9rj4J5L4jKn6Q3p6k0P1O5q9m0
3955e9O4k3Rk8K2n8J9N0J8j6lKm4L8m8J06p3j0L8K7n6j9L7o9P3Ql5M3L1o7K9p
3987ak6M5m5oR6k8kJPo4j0K1k1L2J7j7K1l4M8m7N5m1N8m3m2Qk0m7P9j1m2n1R5
4020a5j1L2K2o1j9L2LK5k1j4L2N0n1k9K8k0O1J5m3l3J2k0L0l0kM5J7j0l5K1n0
4051c9j1R4n7J3mk2K3l5L4j2Nk2N5L3q1P4q5P5n8J4k1L0MpJ4Qm1L6j2n0P5%q5
$$ y = [-4, -12, 22, 33, 19, -25, 13, -40, -62, -23, 5, 1, 26, 19, 28, -9, -18, -2, 12, 4, 13, 70, 1, 15, -14, -8, 9, -3, -3, -28, 20, -47, 2, 33, 7, -67, -19, -23, 13, -4, 41, 28, 7, -8, -19, -44, 8, -32, -8, 40, -18, -28, -38, 27, -12, 6, 12, -54, 40, 22, -32, 30, 0, 20, -34, -19, 14, -19, 13, -24, -18, -1, -61, 59, -1, -23, 16, 4, -79, 64, -26, -39, 95, 15, 43, -42, -21, 5, -55, 8, -45, -18, -19, 34, 44, -32, -15, 2, -9, 28, 1, -36, -8, 51, 38, 6, -11, -31, -50, -32, -36, -20, 28, 15, -24, -33, -47, -32, 2, 1, 3, -53, 30, -46, -66, 5, 70, -19, -59, 5, -18, -9, -37, -15, -73, -54, -4, 14, -2, -5, -3, -47, -9, -57, 49, -24, -34, 4, 31, -25, -44, -7, -76, -3, 5, -30, 13, 44, -23, 6, -1, -27, 18, -27, -33, 63, 35, 33, 34, 41, -23, -33, -12, -33, -1, 16, -1, 20, -14, 34, -13, 42, 1, 59, 16, -26, -18, -38, -85, -6, -17, -59, -110, -15, -26, 6, 28, -33, -52, -20, -17, 8, -13, -27, 5, 55, 4, -25, 3, -17, 44, 59, 16, -17, -5, -25, 5, -25, -27, 18, 35, 25, -10, 11, -39, -50, 44, -13, 0, -4, -26, -3, -38, -4, -16, -11, -33, 22, 55, -26, 48, -37, 38, -20, -6, -27, 3, 7, 0, 14, 22, -19, 17, 5, -45, 30, 30, -55]
4084e5L2K6K1L1n7J8j7j1K6n7N3L2j06J39q8N0nl6J1pj7Q1k6Ko3L9J5n1qN2m0
4115a6l3J33j00n8J11k5J5rRJJp7N5j4K9Kl3K2%l7k9O3%k3J3l6n4P7M5o0qO3J0
4148C7m3k4J8O7l4jl1L0j4l6P1k1p7N5j0j6K8l4K4P9l2j6N7r5M5m8J7O6n0OL0
4179D8l5jm2K5lM0jn6K1n6L0L4o0L9pOj6J7L0m1K4K1mk8RMJ4k8j1M1m5Q0m8N0
4213E1p4M1J1n7L8k1K8k9j0J7J8Qm6J3mk5J2O8pn3j3M4m1LN1j8MK1m4l0Q7p2Q2
4246E3m2l8OM3p1Q4k2k2m4O8l8rO7q8L1RM4o3J0K3k0J4j3J8j0nN4j2n2O0n4l1
4278e0N1j1M4k9j6N8p5J4m8N2L2pK5l8K8l8kn2N9l6M7MM1o1oM1rm9kj3M6nK3o
4312A2k8J9J1K5pj04P6p8J18J3p5JOJ5n4J9L4J1l8N8pk3l1O5j8l2L1qm0M9j8N
$$ y = [-55, -23, 3, 24, 55, -2, 16, -1, -12, 14, -43, 10, 42, -64, 75, -13, 37, 32, -4, 7, 0, -17, 64, 38, 40, -23, 16, 31, -20, -28, 24, -16, -49, 84, -16, -74, 37, 12, 27, 18, 27, 28, 29, -48, 7, -7, 22, 24, -9, 13, 13, -24, -53, 10, 10, -13, 0, -36, -90, -13, 32, -28, -36, 27, 37, -6, -30, -12, 55, 21, 20, -11, 19, 5, -31, 40, 19, -58, -3, -13, -29, -1, -35, -11, 68, 36, 20, 77, -18, 27, -21, -4, 62, 12, 18, 48, 13, 12, -30, -5, -8, 32, 31, -25, -4, -60, -30, 4, -56, -17, -24, -18, -34, -17, 13, -28, -4, 17, 13, -15, -6, -2, 12, -16, -27, 14, -31, 49, 1, 51, -23, 18, 29, -28, 10, -11, 17, -12, -22, -5, 13, 21, -25, -12, -16, -41, -29, 39, 32, -21, -34, 10, -31, -28, 23, 5, 9, 30, -14, -44, 43, -29, 53, 11, -27, -21, 22, -49, 35, 13, -9, -53, 15, -23, -32, 35, -53, -22, -13, 31, -32, -22, 1, -19, -5, -18, 0, -10, -15, 39, 27, -25, 35, -19, -50, 1, -10, 34, 5, -11, 47, -28, -14, -62, -10, 22, 15, 40, 2, 30, -8, -10, -62, -3, -39, 8, 12, 53, -8, -14, 27, 18, -31, -33, -46, 0, -5, 18, 12, -16, 3, 14, 39, 32, -72, 4, -74, 44, 57, -18, -17, -11, 4, -50, -31, 3, 14, -24, 34, 27, 4, -27, 38, 20, -12, 19, 11, -29, 20, 2, 7]
4344Glk0oN3k3k1K2o9L8k6L8M9r2N6LJ3N2p8l8N2J3j3j2l3J01n1O3r2L1j8oJ8
4376HJ2rk5J5j4J3MJ1oMl2L9M0k6jn4MP8o1L6j1rk2K6l1O7o3o9P0PK2K7k5l4O6
4411E7n0k8n7RQ0rk4M6J4q2M5K1m3J4o0R8n8N4j07R1Mm8M3k9j5QK9qL5J6n1Rj6
4444a2K9J0n9M7k9KJ8L5j2L3o7K6k8M6Ql3n1M0nJJ2j8N5k9k2L9n4J4k5J8k1j9
4476e1Q6j6J6m7K0n9M8JOq3O2nN1%l4l7K8J1j6L4k9RnJ4j7Nj1k0N8o1P3k1K3j6
4510A7j1J1Oj2J5J7k8k1Kl4L4J1k8K8m1L1q9R4pkQJ5J3m3L6m0m5O4m4L5k2J7k6
4543c9M4lMl6P1qOq2L1J0N4Pl8nk8k0O9l9j1L8p3J2L7l0pO4L4m3l7N1p9M3Ql7
4577c2K8K1p3O3L8k7J5n4K5Qj1j5L9n8J00jp3J3mJ6m1J3lO5o9K5joK3l6qJ2jm3
$$ y = [7, 4, -16, -22, 31, 8, -13, 9, -60, -22, -48, -10, 39, -53, 3, 6, 19, 71, -7, -45, 7, 20, 7, -5, -38, 63, 12, 75, -17, 14, -4, -10, 8, 20, 11, -14, 1, -13, 0, 4, 15, 9, 13, -19, 20, 60, 34, 33, -21, -17, 61, 0, 36, 25, 16, -6, 20, -11, 56, -7, -76, -6, 1, 23, 50, 25, -9, 57, 7, -21, -78, -69, 11, 2, -22, 24, 38, -44, 1, 22, -21, -7, -67, 31, -27, 27, -80, 11, 15, -33, 10, -19, -34, -26, 3, -5, 30, 46, -5, 4, -12, 17, 27, -32, 15, -14, -12, 6, 41, 29, 62, -5, 21, -7, 39, 47, 14, -37, 3, -2, -1, 11, -7, 48, 19, -3, 36, -18, -4, -29, -11, -32, -51, 35, 19, 35, -12, 8, -51, -3, -2, 4, -79, -17, -22, 29, 29, -5, -42, -14, -3, -19, 15, -14, -5, -10, 4, -13, -8, -19, -39, 19, -42, 31, 10, 33, 17, 6, 17, 23, 11, 26, 43, 15, -6, -4, -38, -4, 7, -21, 7, -34, -3, -92, 2, -5, -7, 1, 16, 29, -14, 22, -18, -63, 1, -43, -8, -30, -13, -39, 5, 2, 6, -30, 41, 33, 39, -43, -12, -2, 52, 59, 21, 16, -12, -32, 37, -2, -13, 25, -48, -36, 1, -29, -36, 28, 62, 19, -18, 33, -46, -3, 5, -32, -4, 17, -56, 7, 45, 18, 33, -21, 4, 12, 1, -14, 25, -33, 67, 66, -7, 6, 2, 18, -23, -10, -13, 52, -17, 8, 7, 1, 24, -12, -20, -8, -9, -52]
4611e2O9L8p8M1M1p2K6k4J4Nn0M5%j2P5q5J1M2n8NJ9j1Ql8pM8K4m0N9k9k3nQ2
4644F8m2p0L7K5k0j0K8m1j7R7n7LM3k4k3J7j7M7j5j10J12q6M2pK2L3n6L3m4o0
4674i2R6m1Q5o2K5j1MNl0jL0J7lMm1Ol5N6m7L7l1KM3j8J3l2L1l5M0k5%JL0k4q
4709a1k6N2n4J8P3o4pK8j6p0Q4Q6o2lk9N1k7m0J8rM8p7N0j7Pj0Jk6M8n9L3k1P1
4742D0r5RQ5K0p3l5O6j6Qj5O1o1J6J1k4KM9mm0J3j2m5P8m1p1P4l5NLl6R0k8m6
4775d7O3kM0j3k0k5mj7N8l2mM1n9%%J2P0q4L2n1OJ8J2K1l6M4n7K0NL1m6M4oK8
4809D2m2L0o5N2l2j8L2lmK9J3j2m8L5Nk8J2l2O4o7M2k4k6N7n8L4M3ro4K5l0K8
4841a9K0pNM2m1k6N4o2M3M5on7O1m9nmPL7L6q1J9Lk3qoL1j2K6m5L7k4KN4q3L6
$$ y = [-52, 17, 55, -23, 18, 59, -13, 13, -11, 3, 8, -42, 3, 3, -9, 66, -19, -8, 34, -24, -19, 0, -11, -3, -41, -48, 0, 24, -16, 43, 14, -9, -14, 68, 26, -44, -7, 18, -2, -12, 16, -25, -42, 55, -2, 1, 44, 20, -3, 14, -3, 44, 29, -81, 31, -55, -13, -20, 2, 35, -21, 12, -32, -92, 4, -37, 48, -14, 11, 0, 4, 9, -21, -22, 8, 25, 22, 26, -15, -9, -44, 12, -35, 2, -29, -27, 16, -2, 11, -21, 10, -25, 15, -10, -10, -9, 21, -3, -11, -37, 15, -39, -21, 52, -12, -19, 9, -7, -77, 7, 93, 31, 28, -1, 50, 23, -17, 1, -8, 40, -37, 13, -4, 3, -7, -6, -32, 16, -43, -10, -31, 40, -55, -46, 39, 59, -14, -49, 17, 1, 9, -6, 55, -6, 10, 21, -3, -1, 48, 44, 4, 17, 5, -40, 38, -3, -74, 0, -35, -30, -27, -63, 27, -1, -47, 16, 14, 54, 41, 21, -4, -8, -25, 33, 1, -3, 38, -21, -21, -21, -9, 61, -23, 9, -42, -36, -18, -6, 15, -21, 23, -34, -14, -9, 22, -24, 20, 14, 42, 0, 30, -35, 17, -15, -33, -1, -4, -8, 21, 34, 22, -26, 9, 14, -14, -2, -34, 30, -37, 5, -19, -45, 12, -46, -12, 31, 22, -42, -17, -47, -19, 1, -6, -1, 41, 0, -26, 28, -34, 9, 54, 48, -9, 52, 3, -2, -6, 1, 38, 74, -7, 12, 15, -8, -16, -22, 9, -3, 23, -22, 15, -9, -7, 47, -36, 0]
4876@l0K4L4l5K4j3l0N2L1l4m3J3K9j9J4j8Jl8N3Ql1L6k3n8K1k3P5J6m2Qk7OM
4909a5mO5m1Jk3j6L1MN2j3k7kL5o7%M5k8lJ7l1K5k7M9m7l3Q3k4JK2l5Ppm4R6j5
4944C1l5N5o6Jj2K1l7R0q1L5O9q7k9P5l2jj9j0N1k1j7l8L8Q4p2M7k3L%m3R%K6
4977A2M2n2o1Q4Qm9L0m8jL3l9M0Pk5P8k9l6K8p1L3%K2k6k9pO3l5L4ok6N7o2J6
5010a5J4o1N4Rj7lQ1jl1Nl6J9oj8Nj1M0n8K0MqMj7pK4j5MN6m4J9L7l1k7qOk9O4
5047B2l5J9k1J3Ok4m0RK9RK8p3O2j6N4l5L5m8k2N3k9L1L3n6m2l0M6K2lm2L5k9
5079c9N8l2L3m4RM1r%j5o6J04l4o1P6qqQmNK5n4K6j9M2p7P0n0M5l1k1J8K0M0j4
5113C4K4n0J2l8jM8J4o8j6P9k3j0j6k4N6oMj7l7L2j7j9L6k5mK5k2O4J1p5LN6r6
$$ y = [0, -30, -6, 28, -7, 17, 4, -26, 26, 57, 23, -20, -7, 22, 3, 17, -1, 0, -38, 15, 23, -8, 28, 5, -53, -32, -55, 20, 36, -6, 2, -25, -19, -15, -19, 46, 5, 6, -17, -33, -2, 2, 54, 41, 14, 12, 47, -20, -20, 25, -3, -6, 11, -20, 5, -22, 27, -20, -53, 30, 6, 7, 29, -6, 1, -6, -50, 46, 31, -4, 51, -15, -14, -26, -5, -42, 48, -33, 2, 71, -16, -45, 30, -2, -3, -22, -32, 19, -2, -19, -57, -19, 65, -7, 40, 17, 20, 20, -23, -14, -14, 12, 54, 2, -59, 25, 33, -16, 14, -34, -35, -2, -41, -1, 6, -19, 59, 30, -6, 22, -49, -16, -16, 6, -20, -49, -56, 7, -28, 6, 0, -26, 31, -31, -15, -1, -62, -8, 1, -16, -19, 62, 61, 30, 35, -1, 18, 12, -6, -1, -12, 28, -30, -10, -6, -14, -10, -27, -34, -10, -25, -21, 35, -9, 10, 47, 16, -11, -19, -13, -42, 22, -13, 6, -15, -2, 4, -20, -60, -51, -22, -13, 15, -58, 4, -12, 42, 7, 42, -6, -28, 25, -4, 27, 60, 4, -38, -68, -22, 0, -3, -45, -10, -39, 19, -13, 20, -24, -15, 26, 17, 17, 2, -64, 40, 6, -55, 21, 13, 5, 13, 9, 14, 39, -15, 11, -8, 34, -43, 27, -23, 22, -9, -30, -12, 8, 48, 34, 58, 8, 20, -18, -19, 29, 43, -25, -41, 38, 15, 5, -11, -35, 21, 15, 19, 2, -35, -3, -20, -39, -3, -28, -32, -7, -29, 35, 46, -29, -26, 30, -66]
5146f6L5ML4OKl2K2J4o0K0J0Nk8P0n5MK9m4L7nMn6M1M3o2%J0L2k4N7l1k1L8q2
5180d9R3k4j8Jk9K2j0N4m1m8J6K6k6l6J5L8M7p3M1Ok1L1j9k7J6J6l0PKjO0p2K5
5213hk0J8mNK5j5mJ3k2J4K7n1N8K6l0j8nj4j6l3Q0l3J3j5K9oK9r1J00m8k1pK2
5246bOj3j8J0KN9q5j1Q4o6K3pm5N7oK7rj8J2K7n2L0l1K8LL1m0M1j11N2M9j2M4
5279E9l2j2l8J2K3pj8M7q5M9L5M1r7K5o0J8J1kJ5L2m2K7n9M0l6O5m5K7OnlJ7K
5312A0ok0M2l9L5L2o6Rj2J1j3M6l3pK5J0j8K0M2k7p3M9o2L7K9k2o3J00m3J0m9
5343d6k2P5n8M8K8J7r2L4M7m1k9P2J4Rl6K0ql1K8k5m2L6MNk9N9q2P9K2l4k7Mj
5376bj4j7K8mN7l7J4n7K0L9k1Ml4JK1M5j3k2RRk9PN2p5JK8J8ll4l0j5R7n2lJ4
$$ y = [-66, -31, -27, 7, 13, 15, -17, 5, 19, -41, -21, -11, -6, -34, 36, -19, -15, 14, -30, 7, 2, 6, -50, -9, 34, -28, -28, -18, 14, -10, 47, 16, -5, 33, -49, 44, 20, 2, 3, -26, -4, -14, 40, -1, -49, -33, -7, -33, -69, -54, -16, 31, -42, -1, 5, -16, 15, -4, -31, -15, 1, -29, -22, -20, -21, 39, -33, -8, -28, -10, -14, -9, 16, 1, -3, 10, -12, 2, 29, -22, 36, 62, 32, 14, 9, -5, -21, -54, 26, -7, 6, -9, 20, 14, 43, -48, 52, 4, -17, -24, -2, 4, -9, -27, -17, -15, 44, -41, -52, 32, -34, -11, -18, -63, -6, -12, 15, 6, -12, 0, 27, -25, 5, -26, 2, 5, 36, -4, 37, -74, -22, 27, 15, 59, 27, 15, -23, -11, 12, 5, -13, 34, -51, -2, 33, 74, -23, 2, -58, -40, -29, -31, -16, 16, -26, 1, -58, -18, -54, 11, -34, -7, -1, -6, -9, 8, 10, 4, -16, 26, -13, 22, 54, -12, -3, -15, -4, -17, 29, -4, -11, 14, 24, 6, 26, 68, 41, -32, 17, -45, -8, 21, -1, -64, 36, -7, 3, -46, -68, 7, -51, -3, 25, 42, -50, -16, 31, -10, -39, 33, 47, 56, 20, 40, 32, 1, 29, 4, -38, -2, 2, 7, -22, 37, -45, 34, 56, 22, -5, -1, -2, -16, -33, -5, -9, 48, 11, 25, -32, -12, 27, 6, 10, -24, -23, -2, 43, 30, 8, 17, 26, -3, 4, 56, -19, -18, 10, 28, 25, -9, -39, -54, 43, -9, -12, 2]
5411Bj6L1o4MJ6J5L0mL6n4K7j7m5M5n5P6L7j18O9p0N2j5L4J1m5K4NPl2j9O2j3
5443A6J8n4MJ3M4Nk6m2K9K2Nll9j3K1J1pN3o3jm9P8k0K6m4K0oOk7OP0n5L7J3l7
5478A1J4k3K3m4K5PPn0L9oJ8l6L2k6k3P8m6n0Q5n3ONQ7k0q9K3PK9p4K7O8j7q8
5511e4J6L1%O6j01pO1l8J0LJ6m9P0k8lrRkk9M8l0JJ2j9K4K7o0L2m3M4N2m5%K8
5545C3J9p5k0M3L0J7j4j4k7k2J9J0K1p0N6j4l4oL2J4j8K2j0l6L2k0J1J0Jl8K2
5576b6j9QM6l2K0ojK1Kppn6O5on0P1m0%J0L4n9M1J5rk5J6n8Q4rl6L5n8K0Q4p4
5611frO9n2PMM1l6J7m5J4MJ3J4m0j0pJ4n5Q7qk3L4k8m7ON3k3J4j2L8mk6Ml3M3
5646A2r7Q7l6k7Q6kj2N8j00J3RJ9k1Oj4J6J5M4k7j9p2KP4j8j4j4L9j9K2k3j6j0
$$ y = [2, -14, 17, -47, -43, -27, -12, 18, 14, 50, -4, 23, 6, -39, 6, -49, 27, 64, -54, 15, -55, -3, -18, 16, 27, -18, 6, 11, 18, -14, -33, 29, 16, 34, -20, -16, -3, 41, 46, 20, -22, 7, 29, 34, 31, -8, -21, 0, 11, 4, 57, -6, -7, -56, 22, 2, 28, -16, 4, -2, 4, -23, -17, 53, -2, 35, 48, 11, 25, 2, 25, -19, 6, 13, 20, -30, 9, 3, 21, -15, 17, -9, -32, 46, 0, -50, 35, -18, -12, -7, 80, 60, -29, -6, 1, 30, -44, -17, 51, 34, -54, -38, -7, -7, 59, -42, -49, 12, -26, -16, -13, 3, -46, 24, -4, -7, -16, -7, -9, -38, 10, -20, -19, -7, -26, -2, 25, -35, -3, -46, -2, 50, 5, 5, 33, 52, -23, -43, 0, 30, 47, 33, 19, -8, -30, -11, -1, 20, -50, 6, -8, -42, -48, -16, -2, -20, 2, -8, -44, -12, -32, -21, -11, -10, -48, -26, -45, -37, 9, -23, -3, -9, -10, 11, 13, 6, -1, -57, 8, 2, -48, 23, -17, -17, -7, 27, -32, 9, 24, 15, -10, 6, -52, 32, 23, -13, 22, -36, -16, 68, -6, -15, 54, 2, 9, 13, 54, 18, 35, -10, 4, 8, 21, 35, -5, -15, -22, -8, -63, 24, 16, -7, 27, -1, -48, -42, 11, -12, 2, -10, 28, 24, -2, 2, -31, 12, -85, 2, -34, -61, 25, 23, 11, 69, -31, -18, -9, 10, -11, -5, -19, -3, 12, 56, 29, 10, -62, -60, 14, -4, -18, -32, 7, -12, 10, -13, -29, -39]
5678c9M5qL3n6M5Nm6N3n4L5k4N6l9M7j7k8j8l9L4M1l1j1M6m8M3L2%m4nk5j6K5
5710hK6m0J8j1J9N4o9J7Mmk1k6J9M3j7J8n5J7J0KJ1m1L0nm2O1J8l0k3O2Ono0J6
5744fJ1nK0j3k6j4Rj8K0P4n3Nl4K6j9J8N2o1J4Pl6j%K5L0p7j5Q6m3J3Op2R9o2
5778d0NL8qL7n0L6M0q2L6Km1Q1j9J1p7N6ql4M5o5K6Oo9J8K4K1%J6M4l4%l2J7n5
5812e5O1j4L1ol0j2N4Kl1k8j4mRk3R8l7j1kO3k7ml0j1j5P1J6r2L7km2L5N8p6K5
5846fL5mJ2p9K6m9N9j0qk4J8J4JN2k2r%K0Pn5J6L6j3K9k0m1m4K0N3j3%l0M4K9
5880D4l7Rl2oR5o5oj0K8l7J6J2L5o3l5M5Jk8K1okL0n2P2l2mJj0K9n8K6J6J0k5
5914a8m7N5K6o2lN0k7L5n6M4Lk2M4o0PM0l8Q5l9k5oJ8J0j3m0K6%J0m6L1L9n9K0
$$ y = [-39, 6, -2, 31, -25, 20, 25, -21, 32, -22, 13, -11, 45, 6, 53, 36, 8, -10, -49, -15, 26, -5, -16, 30, -18, 25, 57, 57, 13, 8, -17, -33, -8, 18, -22, -4, -15, 4, 58, -11, 6, 10, 6, -15, -41, -22, 21, 4, 22, -33, -16, -6, -4, 7, -34, -4, -9, -51, 10, 28, -2, -25, 37, 43, 38, -22, -6, 5, 0, 20, 7, -19, -33, -24, -42, -22, 52, -1, 4, -30, -4, -23, -5, 47, -14, 0, 7, -29, -30, -30, -5, 25, -52, -67, 19, -24, -11, -5, -77, 22, -40, -35, 3, -5, 32, -18, 18, 58, -24, 12, 14, -27, 54, 35, 46, -31, 25, 17, -17, 28, -37, -11, -5, -74, -56, -32, -11, -11, 5, 49, 15, 15, -17, 0, -55, 6, -8, 23, 17, -13, -25, 29, 31, 0, -28, -42, -46, -37, -60, 38, 1, -10, -12, 51, 24, 20, -10, -21, -36, 35, 51, -41, -4, -6, -48, -13, 45, -31, -6, 29, 25, 37, -42, -16, -65, -6, -16, -24, -48, -30, -16, -15, 37, 15, 6, 6, 26, 33, -22, -6, 30, 17, 46, 26, -15, -59, -39, 14, 1, 1, -29, 15, 44, 7, 16, -16, -22, 73, 8, 2, -8, 20, -17, -1, 11, 46, -17, -52, -7, -6, -34, -13, -19, -21, 9, -43, 29, -3, -7, -6, -16, 13, -45, -19, -3, 7, -18, -65, -10, 16, -46, -49, 1, -26, 9, -47, -3, 0, -22, 22, -38, -31, 9, -29, 56, 17, -8, -14, 4, 14, 1, -39, -13, -13, -3, -49, -18, 21, -38, -18]
5947a8j6MMP4Ln7M0oj6n4Q4n8K0ql5R9p6J2Nq5P9J6M0k3k7J6k5L1rm3N0pm0RJ7
5982@jk7J4j5L0K2n7k9J19l6rm3L5m3M8%k7O5o9L4K1kmk2j4l2J4K6rL4Qo0L0k7
6016b6O5Pj06N1O7J1m9L3l2oJ6q4Q3k9j6j4opL2MM3o8M9l4P3p3RL8n0k1M9mj7
6049a2J6MjJ4K7o2K2j1qqL4j7rjNj7L0k8K6J0j1J1j3j9j6N1J3n3j9Q8l5n5P7j1
6083B2j7K8l4j7J5rL7Jk5J1J8n6j1j5M7J2N1j02L3j7J3KK7l2K6L0l5n9Q3qj5M
6115HJ2p8N4j9M1ql3j5oN2k2K5J5o2P0Lq9M2K2J6k8P2o0K0k0o5P1j9k5Qk6J0N0
6148A6j1Lj8jJ3jk8J5K4j02J04mj6l4nL7n9M0k4J7L1N7p4K7l5J9oN0o7L0j4K0
6180Dl9N5Jk1K0m9M1mk7N7q5L7K0J3qKl7l5j7O3nN2n6L7o5O0j9OP2q1j5L0j0J4
$$ y = [-18, -34, -30, -26, 48, 51, -6, 34, 28, 12, -42, 42, -16, 4, -4, -39, 60, -16, -4, 1, -84, -5, 11, 51, 28, 1, 17, -8, 23, 14, -29, 21, 14, -26, -17, 0, -1, -28, -14, -29, 1, 23, -34, -63, 56, 20, 11, -32, 3, -40, 8, 8, -19, 46, -23, 11, 32, 30, 26, 4, -10, -42, -28, -2, -11, 23, 31, -29, 1, -26, 39, 46, -60, -9, 58, 69, 20, 53, 21, 15, 31, -53, 30, 1, -15, -29, -35, -42, -10, -6, 37, -31, 18, -16, 57, -16, -7, 31, -19, -40, 9, 5, -12, 4, 8, 7, 21, 48, -14, 8, -3, -11, -19, 15, -2, -11, -12, -7, -24, 6, -22, 4, 14, 3, 14, 1, -18, -34, 17, 30, -23, -42, 46, 11, -44, 33, 22, 5, 33, -1, -18, -3, -12, 25, 26, 1, 12, 30, -26, -37, -52, -5, 7, 58, -44, -11, -28, -15, -13, 14, -18, 8, 38, 3, -56, 27, 19, 4, 8, 20, -58, -4, -23, 18, 10, -23, -38, -44, 8, -14, 11, 26, -36, 34, 37, -52, -10, 12, 28, 0, 72, 12, 32, 12, -53, 18, -1, -26, -18, -44, -34, 16, 5, 8, -10, -11, 2, 1, -27, -12, 12, -90, 14, 10, -6, -40, -45, -8, -67, -27, -51, -34, -3, 54, -20, 7, -28, -9, -15, 35, -32, -2, -16, 4, -35, 20, 21, 0, 20, -29, 12, 8, -19, 38, -47, -10, 10, 23, 15, 17, -20, -55, -72, -9, -14, 38, -18, 19, -46, 14, -5, 1, 73, -8, -23, 7, -3, 11]
6214A1J5m9O1j7L2rqm0o5O3j9O4l6O4p2KOj4L3o3N9n1J6K1k0m8L4%J19q4p5Q6
6246A6J1k9L0k8k8N5o8P3pn2lJ2RL9K9jj00L2P4m1J6n5j1J9k2LlK7L1m8L9Jk6
6279fnl9M5kj4l3M8K1l4l5P9k4Jj5n5Q8Mo9N7mJ2p9R5j15J09l8j0N7n4Ro0J43
6311G7p7K5K3%j3Nk1Mm7M7l4l6J0K3j0Q9j9r0O8n4M7m5P1j0o0N0Oj8k3j6k4OL2
6344a4k9M0M8r5R1n8K0n5M6L1o1L6j8M2n9j2N2NK7o7J0K4PJ5m8N4j2K6l7j5L4
6375B8n0j0j6P6j1p1J03k5l3P6p0J5j1%K5m8K8j7k2N7rm6R4n9Mj0k7N3n7J6J7
6406@l3M1j3j9O3k7j4J4l7lRN8m6J8Ql3K5K0Nqk0k8L1K1rp9P3k0qL6l7KM7k4r
6441Dj7l7K8jL7k6L5o7OM6n4J9K0j8Q6n9Ml7P7%j3p8oP1o6N6Ok0K0nk2k6N4K5
$$ y = [11, 26, -23, 38, 21, 53, 44, 36, -4, -69, -6, -25, 39, 3, 67, -5, -3, 3, -11, 22, -41, 18, -33, -17, 4, -16, -64, -30, -30, 89, 5, -70, 16, 27, -2, 28, 0, -28, 27, -41, 32, 25, -27, -30, -18, -9, 30, 59, 58, -42, -10, 64, 23, 39, -16, -27, -8, -30, -27, -30, -3, 28, -20, 19, 20, -6, -11, -50, -5, -7, -21, -54, -6, 15, -19, -54, 25, 1, 2, -13, -68, 20, 24, -45, 12, 8, 20, -59, 36, -79, 30, -8, -18, 39, -15, -6, -66, 77, 0, 25, 48, 48, 35, 40, 19, 23, -24, 23, -11, -47, -37, -14, -24, 65, 46, -44, 24, -30, 17, -28, 43, 33, -27, 23, 29, 11, -12, -28, -52, -46, -14, -43, -3, 45, -50, 41, -17, 3, -52, -6, 25, -36, 0, -18, 24, -35, -47, 5, 10, 37, -30, -20, 4, 11, 26, -22, 32, 20, 46, 9, -6, 28, -22, -32, -48, 28, 17, -54, 49, 24, -9, 67, -3, 12, 1, 1, 26, -22, 6, -11, -33, 24, 15, -31, 63, 4, 8, -2, -29, 24, -33, -17, 0, -33, 8, -5, -24, 39, 12, -2, 12, -25, -28, -19, 39, -7, 11, 19, -14, 11, 31, 36, 28, 8, -20, 11, 32, 23, -56, 17, -3, -11, 25, -12, -10, 37, 13, 4, -13, -50, -22, -23, 14, -12, 23, -44, -38, 8, -46, -27, -7, -25, 61, 2, 6, -31, 46, 46, 33, -45, -51, 20, -46, 10, 16, -4, 16, 11, -11, -37, 17, 42]
6475D2J5j06R1k5Kk6ml4K3O3n6J1j4qOM8j0L3Mll2l4M5nnm3M2J2j0Pl6kPL6m4
6510a0k5M7L3l2m5L2m3L8oqQ0p6%qJ2K9Rj3J5q1J2J3K5L3m1L3o1L1l3J8J8J2%
6543Hnj2K2OJ5m6k9M9Nm1J03p3kn9jQ5p9N7K7K1l5k3K1m5L2MK3j8j7KRLm9L3J4
6578Em2K4l1N3l5l2M3j6P9r4pJ8O2o4L4nK7J8mk2J2m1Pj9L1j2k5n0K3RN4M6o4
6611a8k1J1K1k0K1qQk1rOK9j9k6R5o2jJ0L1pm7%M5m5QK1LK4q7R3J1m6j4O0Mn2
6646bK0J1Np5O3n8M4K7j9J8m5m5K0K7k9J1j8Q0n8L9pn9N4K5k0k6KJ9RO7r6Lj4
6679b7K6L6m6K6j7J2K6m0K8J4j1j2k6K3l3L5l4L0n5L1K6N5q4J7rM0kJ3l0k3J0
6710ao3P7o0j5J7K7J5Lj6K8m0K0rL2J0n6J3PM3l2Nl3P8n2k2O9k9m6N3k4LNL6m1
$$ y = [42, 57, -49, 42, 17, 19, -7, -11, -45, -22, 41, -15, -4, -18, -26, -20, 28, 18, 51, 55, 52, 20, -14, 31, 26, 21, -22, 20, 32, 22, 29, -7, -9, -2, 34, -10, -35, 12, 45, 13, -32, 0, -43, -5, -11, -19, 61, -15, -15, -23, -11, 18, 27, 14, 29, -52, -40, -27, -2, 31, -10, 23, -38, -7, -40, -22, -4, 8, 8, 3, -9, 13, 19, 34, -12, -41, 8, 13, -28, 75, 2, 0, -59, -60, 25, -54, 3, 30, 51, 16, -7, 14, -31, 1, 5, 28, 10, -7, -5, 4, 7, -42, -9, 5, -37, -13, -44, 9, -26, -58, -15, -31, 48, -46, -53, -35, 27, -37, -3, -8, 19, 37, 33, 11, 23, -18, -11, -30, 1, -11, -36, -86, -63, -54, 0, 46, -18, -39, -28, -7, -27, -6, -14, -6, -27, -36, -30, -1, -20, -46, 49, -13, -14, -4, 27, 20, -27, -27, 18, -27, -19, 2, 5, 29, -58, 35, 46, 0, -14, 46, 50, -2, 18, 29, 34, -41, 22, -36, 8, 35, 16, 34, -11, -56, -36, -9, -38, -27, -45, 35, -23, 16, 9, -50, 4, 29, 9, -17, -15, 4, 13, 80, -16, -13, -27, -1, 35, -11, 15, -2, 10, 36, -4, 24, 38, 27, 15, -11, 12, -21, 14, -20, 10, -45, -14, 12, 67, -17, 0, -9, 31, 29, 42, 12, -11, -1, -64, 13, -47, -62, -45, -18, -3, 0, -16, 12, -28, -8, -17, 15, 25, -31, -18, -11, 32, 0, 5, -28, 50, -2, -24, 45, 16, -30, 23, -1, 2, 7, 43, 2]
6744BJ4k6K9l7J4jL9n5J7j2K8n7M9m6L9P1n2j7pQ4r1N3q2Q6o8NL2rn1O7Ll1Jq
6778a7Kqm9N7o6J06l0m3J09m9n5M6K7ln2qJ1pJ2j1N5l0KL4k6M4p4M2K4m4J9kj2
6811DK2l6J4lN3n3l7kL8K3l2K1k6N5k4l4J4Oo5R8o4K3L3j7Jn0M3j8K3J3nl1m3
6844e6R1q7P7l6L2Nk6jo2K6J01n0LJ3p0J8L7n1O4k4k6%J3J5Oj8m7L2K2j2m6M1
6876a6N7j9k5JN2l7k0M4n0j4L1m3L5l7L0k6OK0k1K2k4Pk7N6l7l0M8lm5P4j5j2
6908a8K9j9QL1l8KJ0M0p7OM7j0l7K4OL0n0K1K8k7m2L6J2qJ5jl1N8p5M7J8J0m9
6941dNpnM5lol6L1m7m3K0M9KL2oJ5k4J1l5j5n3Q5Mjm0j2N1nJ9Rm7N1l4kjJ2rN8
6979F4o9J9K8Po1O5o6pPK6p4O2J3J3k1m1qL5k7M0M3n4k5N9j6m6M9m4J9N0k4n3
$$ y = [2, 16, -10, 19, -18, -4, -5, 34, -21, -4, -16, 12, -45, 4, -42, -3, 68, 16, -1, -8, 76, -15, 38, -44, 42, -26, -21, 11, 2, -49, 18, 21, -10, -9, -17, -15, -23, -72, -15, -81, 25, -5, -48, 61, 12, -43, 3, 30, 27, -25, -33, -22, -29, -17, -28, 27, -3, -1, 33, 7, 51, -23, 19, 43, -1, 18, 16, 4, 26, -10, 4, 1, 54, 1, -36, -38, 0, 23, -9, 12, -14, 41, 17, -17, -3, 3, -62, 36, -28, -5, 28, 11, 12, -38, 5, -13, 10, 23, 18, -13, -56, 35, -52, 25, -11, 21, 26, 0, -1, -63, -37, 64, 14, 17, 30, -40, -22, 15, -36, 28, 4, -22, -22, -9, 6, 12, -6, -53, -21, 1, -11, -57, -16, 41, 22, -3, -2, 50, 13, -7, 37, -13, -27, 4, -39, -4, -41, -11, -37, -31, -11, -32, -10, -34, -27, -54, 2, -35, -65, -17, -20, -65, 9, -6, -18, 11, -8, 0, 31, -7, -5, 5, 45, -32, -26, 21, 11, -26, -2, 4, 34, -16, 5, 33, 6, -36, 0, 12, 4, 19, 18, -13, 45, -30, 17, 35, 45, -4, 1, -6, -11, 34, 31, 25, -11, 20, -27, -70, -50, -1, 1, 33, 27, 42, 18, 29, -6, -21, -74, 11, 15, 14, -26, -38, 13, 8, 27, 36, -11, 40, 6, 4, 3, 15, 6, 64, -5, 14, 42, 49, -12, 53, -13, -20, -13, 13, -61, 1, 14, 27, 6, -35, -43, -8, -35, 5, 48, -6, -31, 28, 12, -34, 15, -29, -10, 40, 16, -37]
7011c7P2l1j1K7K5m9l6N9PJ4Mm8M9j2Lo2rL5kj4L9l1K4M7q9QK8n8P0j4k1m1M6
7044hM1m6L3Qpk8L7Ro4MM6J7o7L2k0L7l0j4K2pM3l2K0l5jnj7M7l9L7J1m0j1K2
7078eJ7Rj9J4kj5l0PN2o1L7J3j7Ml5N1m7k8O0m8M9j0Mk6N0oo2O0m0oJ4j8J9l3
7112d8R0K2j15N4J9j3j0j8J2j7N2ok8M9rJ5n0mkm5J6J2L4n6M5j5M6Ln3J9P8m2
7144C5q8Q1OKK4j9l0K2K6o6j1O2m8K7l5Lj0L1n3L3N2q9P3K5o5qJ7l9N8L5qq7L3
7177a1k5k7L3K7j1L4n0L7k2k3%N3j5J2Rm3M3p6M1J6K5n8O1j5j0o0M8QK2n4K5L5
7209B9j09O6Qk6M5Jp3O4L0p0L6qJ9l9K3N7l9M1n2rj1P5r8OQ3m9n%nL8m6J9L3q9
7243e5K1K3j4M5k3l0OJ3K3K2n2K4n5k1K7J4L6q7R5m5O3k9oJJ0k2N3j9rL4k3k1
$$ y = [-37, 35, 4, -7, 20, 45, -4, -40, 19, 26, 40, 44, -4, 45, 33, 36, -26, -35, 0, -2, -16, 23, -8, 16, 63, -26, -18, 10, -48, 22, 8, -13, -54, -8, 33, -13, 20, 28, 21, -7, 30, 39, -25, -21, 25, 42, -25, 7, -13, 24, -6, -20, 2, -5, 38, 6, 26, -9, -10, -15, -32, 15, -24, 13, 24, -16, -27, -5, 12, 21, 2, 16, 14, -1, -31, -24, 28, -33, 4, 17, 0, 4, -31, 20, -27, -55, 5, -43, 6, -4, 0, -26, 24, 18, -44, 16, -24, -30, -16, -34, -15, -48, 42, 64, -51, 3, 22, 9, -1, -19, -7, -24, 28, 22, -6, 43, 34, 49, -1, -5, -7, -52, -36, -24, 10, -46, -1, -16, 30, 33, -20, -1, 77, 35, -53, 28, 34, 36, 60, 41, 11, 33, 59, -7, -18, 44, -4, 23, -12, -9, -19, 12, -41, -8, 44, -45, 28, 53, -12, -20, -3, -42, 16, 51, 43, -44, -11, -36, -63, -30, -3, -14, 20, -30, 7, -15, -38, -38, 15, 0, 12, 21, -22, 21, -55, -14, 2, 27, -31, 30, 15, 5, -55, -7, 1, 23, -31, -6, 29, -80, -14, -6, -32, 13, 14, -59, 5, 35, -35, 1, -7, 12, -27, -4, 53, 14, 55, 3, -6, -17, 58, -40, -34, 49, 0, -5, -5, -10, 28, -18, 1, 34, -55, -34, -11, -25, 20, -3, -33, -27, -14, 9, 31, -21, 3, -52, -73, -46, -32, 4, -83, 12, -33, 30, 1, -5, -4, 6, -16, 37, 18, 9, 43, 20, -1]
7275a%Nl1K3L0j0j5N7k3n9K0J0k5JK7QM3q7J9J2K6j7j7m5P2o7N1M0l5K0l3j8N7
7308C8m0j9J0J0j4l5N4jj1k5O8q2R5m4qk5j7J0M1klJ6k4n2L0K5Q8p9qj9K0K0j4
7341Cj0K6J4J1l8q9P4L0j2l9L2L1j1m1J8l3k3O0oK3j8mK1l7L8J7K0p3K0o1P0R
7373B2j6m6L4L9n0P2q8pK8J7m8ONO2Km0lj9LJ0J4ON4p1M5L7q1j3J7J9J4OM9p0
7407Il8M2O2o6nJ6mk1k2j8N2Lknol7L7ll1n5qJ29j9l0k9L0K1L2j9K4p7K5k6L7
7441bl7L2J6L3k9k5Qm1N9K4o0QOO9p5J3lj0qJ0j9LK7j1k1L6M0k8m9N0J9o6O1J4
7475D4Ll9J3l5K0K6m2J6p3J00o3N3M7j00RK7K4k0k4J9m3K6M1kl3RkL3n0OK2qJ4
7508A8k4M0k4mk9M2k8lKM6mj7l1L3k2NK1m3j4N7j7kK7m2L5K8p1pN7l5j0M8o8L8
$$ y = [-1, -1, 4, -27, -4, 26, 16, 1, 58, 35, -24, -4, 6, -19, -18, 9, 17, 60, -27, -8, 4, 30, 13, -4, -49, 23, -44, 7, 47, 12, 32, -1, -19, 38, -2, -21, -11, -1, -15, -50, 4, 3, -8, -33, 35, -47, 48, 4, -4, -29, -46, -36, 5, 3, 0, 16, -8, -60, -30, -5, 83, 4, -4, -23, -3, 17, 3, -7, 19, 33, 44, 6, -83, -9, 21, 9, -30, 2, 33, 22, -19, -1, -34, -57, 3, -3, 20, 2, -2, 19, -18, 20, 37, 57, -16, 4, -57, 13, 22, 6, -40, -6, 33, -17, 55, -33, -40, -12, 5, -43, -37, -32, 30, 32, -8, -11, -30, -27, -17, -3, 3, 57, -14, 31, 68, -13, -26, -9, 10, 24, 30, 79, 9, -29, 13, 75, 9, 4, 20, 16, -5, -27, -45, 7, 10, 8, 3, -3, -40, -3, -6, -37, -92, -100, 29, 10, -20, -49, -19, 2, 34, 15, 39, -38, -13, -39, -2, -39, -7, 9, 42, 13, -12, -4, -45, 14, 38, -22, -14, -8, 61, -14, -1, -4, -14, -22, -12, -31, -28, -1, -12, -33, 3, 43, 15, -34, 16, 35, -31, 30, 44, 47, 8, 21, -14, 6, 32, -10, 6, -67, 33, -30, 23, 70, -30, -21, 6, 30, 10, -14, 5, -38, -12, 29, 27, -6, 3, 1, 34, -16, -10, 12, 4, 18, -6, 34, 10, 6, -23, 19, -9, -12, -10, 36, 32, 15, -16, 17, -5, 0, 21, -22, -36, 21, 4, 2, 29, -13, 22, 50, -21, -28, 29, -6, -16, 32, -36, 2]
7542BJ0Jm9L0NJ4l2rM0j5J3k6N7p6J8K6Ll1rL4K0k2m2Q2j8m3qL0k6N1o1O3k8n
7576aj5J1QM7n7m0L8K4J4m5M3K0r3QJ7K0k1j7OJ4N4n5k3JmM0%K8l9j0M3l4K5O
7610A3K0l4j4mK5J8m4jqL6k9N6m7k8M6J3k6j9L3n1J1R6r5L9o0jQ6n3j8M6k6K0
7642@l4N3Kj1L3k9o7L7K6j2KJ6j8j9jN9k5Jj4P8j09M0Rl3M6k2k5n8N5N2j9k4j7
7675b8L7l7lK6k1OjL2o4J02k1q8J8kJ03j12N7m6J10o8L7m5m5O3qL8p5P4K7j7p1
7706b2j9L9J7o8O4K%M6j43J10m4m8Q3l7j3RN6m0Mk3L7l3N4l4m6L3l0J8M7N2j08
7737c7N5m3K1J4l2K1j0J8j00P0K6mJ5rj0pLK2j2kLn7J5O2q7R7k1l5K5M3n8l1L8
7770gORj1m0L0M7k6m2M5pl9M0j0l1K4L8l9L%j5jR6p3J5l1k2N1OK3o5lK1K1j7L
$$ y = [2, 12, 13, -36, -6, -1, 13, -19, -28, 12, -3, 10, -16, 41, -35, -17, 9, 12, -19, -28, 6, 26, 4, -38, 44, 26, -17, -25, 5, -21, 30, -31, 32, 4, -1, -16, -5, 3, 50, -7, -47, -9, 15, 29, -16, 27, 47, -46, -38, -21, -1, -22, -39, -33, -19, 35, -20, -43, -42, -46, -6, -6, 22, -17, -27, 16, -18, 7, 13, 33, -1, -15, -19, 6, 24, -20, -21, -29, 7, -22, 34, -13, -41, 5, 18, -8, -27, 6, -45, -34, 62, -33, 6, -54, -55, 31, -22, -40, 6, -20, 0, -34, 19, 21, 10, 43, 14, -53, -16, 10, -2, 0, 16, -2, -21, -22, 37, 12, 13, -1, 77, -32, 8, 17, -16, 30, 8, -17, -75, -20, 32, 13, -11, -28, 9, -28, -31, -5, -26, -20, -21, 11, -53, 49, 28, -60, -42, -44, 59, -53, 4, -42, 68, 0, 37, -8, -53, 10, 2, 40, -35, 39, 66, 49, -22, -41, -2, 15, -53, 11, 13, 13, 59, -84, 26, -18, -66, 17, -20, -33, -24, 32, -8, -4, -27, 10, -23, 31, -3, -49, -16, -46, -28, 19, 71, -37, 18, -25, -4, 10, -22, -1, -11, 7, -93, -23, 3, -1, 14, 5, -5, -12, -9, 13, 1, -1, 2, -55, -40, 22, -65, 32, 11, -24, 1, 44, -14, -45, -7, -1, 8, -3, -43, -13, 34, 8, -34, 11, 4, -35, 5, -5, -36, -12, 26, -13, -10, -10, -25, -26, 70, -3, 12, -19, -41, 10, 16, 39, -26, -29, -8, 13, -4, -1]
7805ak3O5m8Pm8L0K2Rn9M6o6N5L1k3ML2j2k4m4M8m7JM0K8no1P7n1L7l7P0o5K9
7838A7n0L2O2o0k7J5Llk0P6l5J3l7MRjL4k9J1J0lK2k6k7k1rJ7N6m3qQnM0o0J4
7873b1rK8M0k8K4k4m3P6m3M1m1l6L4M6J0p2K9J2m4NnL2n4P5lk5J0Kon0L2jj5K0
7907dJ2rj8K5l7M4k8jM4J7m2j5K5j4l8L9Lj6K4j2l1O1j0j3m6O2L5m8l9N5m8M4
7939B1m8R1k5k6k2%QJ2Nn8Q0n9rN6n4Q0r9M4ORNp8L7RjL4K1On7nJ2K7o3L4K3p
7975IRo3Q0o6j9K6Q5j6q2J3Qk4J2J0K5j2j5L9N5o3p2N8J2k0J3k1qoM0n8O0j0K6
8008B5jj6KK8l2M5o0RKJ7j6J8j6rj7K3j1J1pOl2k7L3L5qlj9j1N3l1l1N8LLj4j7
8044gk3KM9K0m3L6k8m0L8j0J1k4k4J09m0k0M5q1J9j1K5j4nl4Q8k0j0j7J2n4O6
$$ y = [-1, -24, 41, -7, 0, -48, -18, 4, 13, -46, 0, -66, -11, 20, -3, 1, 33, 21, -3, -47, 1, -46, -45, -5, 23, 18, -43, 34, -17, 20, -17, 53, -12, 17, -33, -1, 61, 1, -26, -11, -8, -11, -31, 45, 10, 23, -14, -10, -1, -2, 32, 3, 14, 24, 21, 43, 17, -10, -31, -40, -23, 33, -10, -18, -10, -15, 25, -35, -21, -30, -2, 38, 10, 34, 10, -33, 43, 0, 41, 0, -36, -2, 44, 54, -18, 11, 23, -21, -16, -21, 11, -43, 32, 29, 4, 14, 16, 10, -40, -8, -9, -24, -4, 8, -1, -19, 6, -31, 13, -15, -16, 28, 45, 3, -12, 13, -1, -39, 0, 3, -13, 11, -1, -32, 29, 19, 6, -40, 22, 57, 9, -30, 25, -23, 21, -27, 64, 39, 13, -9, -9, -1, 11, 16, -42, 38, -21, -30, 26, -28, 52, -47, -3, 3, 12, 17, -61, -24, -15, -16, 18, 39, 45, -12, -17, -5, 22, -41, -7, 16, 9, 18, -45, 35, -31, -50, -24, 61, 45, -37, -24, -16, -40, -28, -18, 7, -5, -20, 19, 74, 11, -61, -3, 9, -11, 2, -19, -27, -33, 7, -51, 9, -1, 25, 24, 8, 10, 38, 6, 51, -9, 0, 2, 19, 3, 21, 5, -4, -21, 2, -9, 2, -5, 1, -31, -58, -25, 10, 2, -1, -20, -31, 22, -9, -40, 18, 21, 24, 10, -7, -30, -28, 21, 41, -2, 34, 6, -34, 4, -6, 5, -19, -43, 66, 26, 6, 51, -30, -11, -22, 3, -11, -16, -50, 38, 18, 8, -9, 3, -51, 15]
8075A5J6j00O7J3J0m4M0p9L1K8pN4j9K2k4l1Lk1M3q9J09m2K5l0j2L3lJ0r7N9L
8106a7K2LK8l0N1o2J7k6J5nLL2l2nJ1n0O4j9j9J7j6J4L4j8ok4J6N7q9RJ5L3l3
8139a0J6J1J4l8l8O2j9M7m8J5J6jm1L1k7M8o9J1rk9J10m0k3J2M9q2K3j9K3%j1
8170a6J5m2L3J5nL5Kk3K%m9O3L1p1K4po3L0j2N2k2
$$ y = [15, 31, -69, -2, 11, 21, -23, 17, -62, -31, -3, -10, 44, 25, 47, 23, -8, -5, -26, 17, -72, 37, -5, 20, -10, -22, 11, 8, 18, -79, -20, -17, 5, 8, 36, 6, 57, -5, 12, -14, 1, -4, -1, 31, -1, -6, 5, -45, 19, 0, -19, -2, -18, -4, 30, 12, 6, -18, -2, 55, -34, -25, -10, 23, -10, 6, 17, 31, -7, -45, 17, -2, 45, -3, 12, 28, 27, -14, 17, -10, 38, -31, -20, -29, -58, 52, 12, -11, 1, 50, -32, -9, -28, -5, -5, -16, -1, -43, -10, 5, 0, 35, 37, 14, 16, 16, -33, 30, 61, -10, 14, 7, -56, -26, -38, 14, -8]
8191h
$$ Imaginary data points
##PAGE= N=2
##DATA TABLE= (X++(I..I)), XYDATA
0@%%%%%%%%%%%Qj6J6j6J6k4L2m0N6o4P2q8J04j20J36j60J92k22K54k88L28l76
33b00M24m80N44o08O80p60Q48r45J049j167J295j432J583j745J924k123K339k577
51a351K838l128L450l809M216m674N202n813O525p379Q420r719J1394j3653J6883
66I402k1910L0904n1964J93939J42579k65615j10227j20671q7933K8845K41262
77a1389J99148O8228l2165q3441j89199j74197n0192Q6756J43974J78098J19293
88B54914j1159j27585j54716j49388p7212N9889J69131J56460R5968K0786q8882
99A48206j83515j50875m1408M4272J08496J69517J35335k334j13162j31522j24209
110a41199r0471K2179J47745J64397R1120J3610o0298j37869j54881p7537L4058
$$ y = [0, 0, 0, 0, 0, 0, 0, 0, 0, 0, 0, 0, 8, -8, 8, -8, 8, -16, 16, -24, 32, -32, 40, -48, 56, -64, 72, -88, 104, -118, 136, -152, 176, -200, 224, -256, 288, -320, 360, -400, 448, -497, 552, -615, 680, -752, 831, -914, 1010, -1113, 1226, -1351, 1487, -1641, 1809, -2000, 2216, -2458, 2744, -3069, 3456, -3923, 4497, -5222, 6172, -7481, 9402, -12508, 18396, -33568, 160371, 302950, 37335, -72892, -193563, -281496, -252651, -11389, 187759, 255987, 223822, 140381, -48818, -223015, -273207, -186451, -42477, 135621, 254914, 243755, 116170, -38546, -187934, -265146, -205257, -36126, 120334, 216302, 237088, 148206, -35309, -186184, -227592, -183320, -74824, 94693, 230028, 227694, 114532, -16990, -141199, -231670, -209491, -61746, 102651, 193771, 207381, 147083, 9214, -145667, -223204, -189146]
121a89146J13672J40902J09546L0165o0281j26450j41508q1518K6639J05333J21744
132D9098J02759M9307n2123j38170j30661n7661R844P1609J31702J26311L2486
143A94501o5611j04304j08671q8156j0389R1538J31350R4918L4611k9606r7898
154D2283j27844q2938L887P5429J09680J02296M9314l0657r6883j17226q2119
165a54778p491O6076J03341R8989N6471j9634r3104j12075p2727j3158M6417R7588
177d085J06257N1696k6385p8045r5614q0969k4730N2723R8921R1463N0000q745
189A32487p1470j04020q0273j9155M2671Q4757R3922N8726p648o8401r4434p7507
201a10345k6491L5807Q1071R0620N9674k332o4069r0316p3830l1099K5189P7848
$$ y = [-189146, -75474, 65428, 174974, 205139, 144858, 18408, -123100, -204618, -177979, -72646, 49098, 151857, 201164, 149041, 10871, -119790, -177451, -167607, -95998, 35704, 162015, 194501, 128890, 24586, -84085, -172241, -182630, -91092, 40258, 135176, 169787, 140181, 42283, -85561, -168499, -164612, -89183, 20497, 122793, 172107, 141450, 44567, -72659, -154778, -162269, -96193, 7148, 106137, 162608, 142974, 49870, -62205, -134932, -148090, -101673, -4085, 102172, 153868, 127483, 49438, -46176, -127145, -151875, -99152, -231, 91232, 141232, 132487, 61017, -43003, -123276, -142431, -99760, -15003, 78919, 137645, 129997, 61596, -32838, -110345, -136836, -101029, -19958, 70662, 130336, 128004, 63935, -26381, -100211, -131310, -106121, -28273]
213b8273R3835N7275l203n1728p9012p9474l8878K7572P5470Q0470N4155R053
225A17262m5629q2750p6544l2605K2482O5634Q0996N8837Q939m4363p7333p5802
237h0876l7359J8540O2181P6796O0653J6063m0223p5639p1680l7287R767N5169
249d3895P7797O1133J4513l5017o7312p1599m2253Q565N3102P1643O0118K1438
261A08233l0294o6785o8361m0754J465M5657P1774O0925J9532k6434n8193o6778
273e0013m5386M83M5648O6764N8100K4429k1920n8423o6438m4585m167L9963O6708
286A1163N9982K5115j7212n1225o5636m9207o411L7856O0182N6473L0492j1372
298H0200n0652o4032m5944q720L1107N7598N8083L1385r806m6225o1397m7493
$$ y = [-28273, 65562, 122837, 119634, 67906, -11106, -90580, -129458, -101886, -26416, 54054, 108209, 117262, 71633, -11117, -87661, -120266, -97784, -32150, 48846, 107683, 116622, 72259, -5074, -80876, -118235, -99695, -37514, 39282, 99935, 115998, 75775, 136, -71544, -108831, -99064, -43895, 33902, 95035, 109548, 74531, 7219, -64380, -106633, -98068, -44966, 26677, 86795, 108233, 77939, 11154, -57207, -97961, -96496, -50839, 20935, 81860, 101392, 74958, 16765, -50013, -95399, -94916, -49268, 17496, 75596, 100025, 78105, 19682, -46756, -91341, -95508, -55545, 11163, 71145, 96260, 79048, 27823, -37813, -87020, -93431, -55575, 4607, 61080, 91572, 80200, 29548, -34484, -80428, -89148, -58041, -443, 57640, 89025, 79219, 32994, -28403, -75896]
310g5896j1578K7839N3903N7071L4049o881m3877n8111m6198j4933K3668N2853
322h091N6663L3296m637l9755n6982m7946j6568K1325M9578N6335L6549j666l7376
335D0725n3463m7310k1699J6449M8530N4847L4526J597l0315n1340m9464k1564
347g8481J6317M3771N0934L6862N521l0070n0693m6947k2664J1532M1215N1678
359B8975L7260O576k5820m7302m8072k5014J0400L8714M8140L7677J0753k3374
371D8913m7451m7175k4382P212L4262M7845M0545J2407k2223m4382m5044k7025
383f6498K268L1774M7428L9893J3293j8232m0189m4101k8553L29K9662M5415L8903
396E1392J4275j5902l7572m3353l0339j644K8853M4096L7720J6255j1458l5897
$$ y = [-75896, -87474, -59635, -5732, 51339, 85388, 78507, 34630, -23481, -69679, -84612, -60944, -8091, 48572, 81868, 77231, 37476, -19506, -67452, -84020, -62695, -13117, 43218, 79767, 78101, 40725, -12738, -60048, -81747, -65298, -16768, 38079, 72605, 74202, 43887, -7453, -56917, -78481, -62164, -18393, 32541, 69403, 74924, 44854, -5839, -52786, -75450, -63918, -22703, 28975, 66235, 72811, 46991, -311, -48383, -73397, -62997, -24283, 23857, 61534, 72287, 48913, 1462, -45713, -70095, -62883, -28621, 19224, 59769, 72176, 49953, 5571, -39473, -66498, -64230, -32456, 14972, 54865, 68158, 49926, 9737, -34364, -62917, -62588, -32926, 12489, 51392, 65667, 49765, 12193, -31160, -61499, -63143, -34290, 9806, 47526, 63781, 52323, 16426]
408A6426m4760l0729k086K5210M0299L8904J9612j0553l4979m1733l0216n952
420f0557K2094M0492L9035J9298q036l1285m1248l2204p441K0246L7797L8021
432C6212K1157m949k8996l9827l2343q948J8587L5271L5983K2529j699k8284m0627
445a5934l0665q031J4207L1777L8888K5825l622k7997l5320l0052j4640J1117
457d4447L4560L8394K2224o57k1400l4775l3501j4976J1583L1330L5783K3710
469D7828K265j9559l3847l3982j6312J0715K9680L2641K4455P251j7688l5997
481b550l2679j3156O877K3076L4129K9029N297j9737l0330k9181j8721L065K6465
494a8416L4681K4823O395j3582k9813l2717j8860L731K3315L2158K6321Q876j1960
$$ y = [16426, -28334, -59063, -61149, -35939, 4360, 43264, 62876, 52323, 17344, -24389, -54605, -60557, -38463, 2029, 41064, 60362, 52326, 21041, -20207, -52411, -59852, -39606, -1809, 36212, 57369, 52420, 23424, -16403, -48746, -57694, -39107, -3836, 32147, 54676, 52977, 24693, -15934, -46599, -54630, -40423, -8646, 30242, 56067, 52445, 24448, -10872, -40924, -55564, -44447, -9887, 28507, 50731, 50074, 28674, -6101, -39602, -54578, -42995, -11665, 24118, 47828, 50093, 30534, -3313, -37295, -53607, -42892, -13212, 19429, 43884, 51135, 33447, -2550, -35229, -48385, -41508, -18432, 15697, 44726, 50023, 30286, -44, -29225, -47946, -44881, -18416, 16265, 41088, 47483, 33901, 4088, -28629, -47489, -43758, -20443, 11715, 38036, 46912, 34952]
507C4952k7969l2496k0135L213K1734K8331K6292J3683j0796l0852l0075j5774
519c9892j564J4859L1770L1389Q991j3179k2432k6200k4116m936K0801L0919K3610
532C0020J1080m556k3063l1398k1475j744J5850K6910K6887J3512n843k1656k9218
545a4694k3169l907J6031K5015K4569J7057j924k3728k9639j8681m919Q535K4283
558e171L0105J5645o307j8822k3320k3034j0458J2109K6509K4337J4032M83j6398
571A9710k7627k3146p185R707K1756K5390J7082J61j6319k5136k2766r085Q574
584b8884K0744K4210J8258K168j6560k4874k0428j0061L945K0370K7438J7173
596C3499j75j2359k0305k3829j4192O715K1188K1946J5983N886j0292k3834k3466
$$ y = [34952, 6983, -25513, -45648, -42435, -20701, 7630, 33922, 47605, 36809, 5957, -24118, -39892, -41456, -26597, 5173, 36562, 45553, 32374, 9942, -16258, -40374, -45310, -24509, 6410, 30020, 41100, 36544, 13481, -17917, -39392, -41136, -25286, 1624, 28511, 42023, 36180, 14524, -14694, -37863, -41770, -25739, -724, 23845, 40902, 38978, 15250, -14389, -33070, -37989, -29454, -5171, 24934, 40579, 34272, 15450, -7870, -30904, -41362, -29253, -2744, 21593, 35625, 36108, 19710, -7917, -31063, -38248, -28541, -6785, 18605, 35687, 35848, 19529, -5607, -28373, -37458, -28884, -8140, 16070, 34328, 36496, 19936, -4938, -25366, -35427, -31482, -11112, 16326, 33499, 33324, 20965, 660, -23169, -37361, -30646, -9458, 12488, 28471, 34357, 24065, 231, -23235]
609b3235j0424M630J6428K2573J8812N410j0655k1825k2439j1986L266J5454K1512
622G521J9696P296j0693k1538k0097j2122o67J4043K3858J9508M828q383j7206
635F044k1384j5789L44J5490K0632J7540Q656n810j8939k1703j3640q45J1894
648a7510K0393J9220Q499n742j6753k0514j4906j858J1539J9187J8785R648m814
661B5174j6582j9500j4628l820J0092J9979J8695Q702l140j3671k0173j6715l250
674b8837J0446J7147J7300J1507j227j4816k0023j4703m091P363J6631J8799J1457
687B6953j399j3181j8618j5472n306O655J5845J8323J2130o17j2401j7484j5017
700a9589o971N341J6056J8221J1231K69j0283j7074j6371o972N375J4438J7111
$$ y = [-23235, -33659, -29029, -12601, 9972, 28784, 34194, 23539, 1714, -20725, -32711, -29445, -13991, 7521, 27217, 34513, 23820, 2282, -17815, -29937, -30604, -16561, 7297, 26805, 31633, 23250, 6044, -15340, -31129, -30785, -15295, 5337, 22877, 31533, 25723, 6784, -14919, -28559, -29404, -17510, 2883, 22103, 30602, 24860, 8107, -12407, -27313, -29171, -17632, 1555, 20340, 29988, 25174, 8592, -10908, -25536, -29356, -19264, 715, 19410, 28112, 24972, 11301, -8872, -25587, -28837, -18391, -1244, 16056, 27563, 26336, 11520, -8503, -23206, -27297, -19934, -3303, 15496, 26953, 25554, 12373, -6245, -21717, -27023, -20368, -4523, 13800, 25930, 25313, 12912, -4572, -19589, -26560, -21219, -5163, 13058, 24289, 24558, 14275, -2799, -19170, -26142, -20767, -6329, 10782]
713A0782J2600J683j0245j6645j5451p766L505J3815J7435J2312K213q577j5713
726e2j6020q415L268J2792J6244J3003L357q027j5271j5444q906J964J1996J6251
740F740J2718L982o490j4647j5826r067J683J0632J5142J3468N086o404j4201
753B816j4909r155J3R817J5490J3578M866n470j2749j4739j0300p02R596J4766
767B918J3093N769m098j2283j4756j0336j139Q385J4020J3262O373l518j1567
780F123j4141j0664k014P661J3758J3118O558k711j0516j4060j1053k422P182
793a3181J2898J2659P325j618j0237j3954j0764k841O004J2104J3017P871j270
806A8013r638j3220j0857l720N164J1751J2838P946l29q731j2871j1041m126M336
$$ y = [10782, 23382, 25065, 14820, -1825, -17276, -25042, -21537, -7722, 9713, 22025, 24238, 15661, -52, -16072, -24487, -21219, -8427, 7817, 20820, 24177, 16150, 879, -14565, -23471, -21507, -9511, 6740, 19458, 23440, 16950, 2303, -13523, -22590, -20907, -10275, 4867, 18335, 23421, 17017, 2816, -12093, -21248, -21235, -11418, 4072, 17650, 22516, 17046, 4297, -10442, -20742, -21444, -11848, 2918, 16011, 21780, 17682, 5399, -9357, -19693, -20832, -12447, 1573, 14835, 21208, 17690, 6123, -8018, -18682, -20696, -13035, 723, 13841, 20399, 17688, 7172, -6888, -17941, -20363, -13181, -283, 12376, 19701, 18083, 7846, -6108, -16872, -19713, -13709, -1605, 11412, 19283, 18013, 8375, -4845, -15702, -19422, -14258, -2507, 10331, 18277, 17948, 9217, -3654, -14695, -18821, -14485]
820a4485J0906J2717Q561K7q180j2127j0844m988L537J0651J2541Q355O95p083
834A0283j1664j1278n369L118R949J1922Q770J621o500j1411j1056n762K266R329
848e782J1776Q896K043n574j0875j1219o203J927Q688J1254Q993K884m990j0676
862A142j1043o091J174P701J0950R408L321m698j0085j0531o554L20P229J0916
876C159R355L436l905r360j0530o957j26O744J0473R321L923l283q790j0408p132
891a4080o91O168J0072R313M344k683q468j0092p192j178N388R716R572M527k434
906A2282p687r587p570k026N208R597R077M616j436o959r845p919j912M724Q830
921f07Q798N247p40o701r762p876k125M172Q010Q779O030k43o815r418p241k639
$$ y = [-14485, -3579, 9138, 17699, 17726, 9546, -2581, -13425, -18413, -14876, -4225, 8316, 16671, 17366, 10283, -1381, -12659, -18028, -14910, -4961, 6961, 15731, 17352, 10852, -559, -11615, -17377, -15111, -5782, 5994, 14890, 16933, 11359, 484, -10735, -16938, -15011, -6323, 4931, 13924, 16808, 11818, 1142, -9901, -15992, -14818, -7117, 3833, 13241, 16562, 11864, 1779, -8752, -15306, -14986, -7757, 3159, 12514, 15950, 12045, 2685, -7845, -14802, -14928, -8184, 2289, 11610, 15533, 12250, 3460, -6948, -14080, -14771, -8603, 1469, 10782, 15126, 12443, 3975, -6117, -13309, -14487, -9099, 617, 10189, 14716, 12282, 4595, -4992, -12562, -14588, -9380, 217, 9294, 13910, 12474, 5515, -4330, -12249, -14161, -9437, -607, 8191, 13438, 12698, 5997, -3765, -11641, -13766, -9594, -1584, 7195, 13225, 12982, 6167, -3251, -10492, -13131]
937a3131K808P821R449N879n68n785q306p810l782K904Q021Q686N563N39m954
952G334q659q070l458K485P165Q435O037R33m622q297p975l721K093O536Q097
967D313O553J567m735q239p275l858Q76O135Q849O418R49l868o845p885n006J288
983a0763O429P654N988K339l022p523p963m259P72N260P661O548K383k907p047
998A550p738m533M88M747P100O966L079l097o981o758m457j042M252Q113O929
1013H618J920k354n203p239n938n28M893O919N987L425j347o034p342n079q12
1028a0114L608O718O603L360j193n349p183n462q63L295O011O696M096j182n555
1043C486o316n066k173K636O830O654L102o19l819o720o275j756L343N588N747
$$ y = [-13131, -10323, -2502, 6947, 12826, 12258, 6473, -1833, -9643, -13425, -10521, -2500, 6186, 11749, 12288, 7334, -1325, -9395, -12853, -10368, -3203, 5232, 11269, 12202, 7580, -717, -8692, -12413, -10320, -3784, 4313, 10866, 12433, 7698, -541, -7816, -11674, -10798, -4663, 4186, 10604, 11553, 7685, 840, -7045, -12051, -10763, -4334, 3320, 9308, 11647, 8625, 1102, -6861, -11120, -10348, -5088, 2573, 9121, 11504, 8597, 1550, -6188, -10721, -10233, -5486, 1614, 8580, 11659, 8562, 1581, -5177, -9634, -10676, -6424, 1689, 8618, 10538, 8184, 2981, -4258, -10196, -10724, -5831, 1088, 7075, 10500, 9153, 3119, -4223, -9302, -10114, -6506, 212, 6815, 10175, 8982, 3633, -3550, -9012, -9875, -6580, -569, 6127, 10223, 9041, 3486, -2830, -7896, -10069, -7433, -603, 6051, 9153, 8534, 4715, -2005, -8280, -10036, -6693, -1105, 4642]
1058D642M402L19m755o708n203j995J973N433O553M177M5l933o307n576k153J746
1074g340M993O384M756O9m107n547n104l198J159N515O555L663M83k586n575o324
1090f204k890J807M637N425M618J488l102n880n310k876O72M238N961M590J236
1105H410k531n292n539l165N44L883N604M925J509k523m856n153l603o8L976N770
1121A891M283J658j496m663n867l593M91L292M829M940K438j826m905n058l327
1136f913o10K949N227N044J980j462m073n135l913n98K778N036M810K342j186
1151F276l914m868m023j010K760M890M501K328m53l577n299l935p92K346M225
1166e45M681L018n41l661m848l748j363J803M422M764K702k85l085m695m070j507
$$ y = [4642, 9044, 9363, 4608, -2100, -7303, -9298, -7325, -1892, 4661, 8838, 8883, 4950, -1357, -6933, -9086, -7340, -2347, 4037, 8793, 8862, 4755, -792, -5896, -9094, -7935, -2420, 4135, 7798, 8281, 5695, 120, -6204, -9094, -7287, -2650, 2775, 7393, 8881, 5779, -101, -5411, -8287, -7615, -3377, 2584, 7174, 8410, 5879, 587, -4952, -8117, -7573, -3690, 1914, 6839, 8348, 5825, 969, -4184, -7787, -7855, -3879, 1891, 6174, 7832, 6336, 1673, -4194, -7787, -7296, -4004, 825, 5765, 8203, 6377, 1472, -3586, -6913, -7523, -4574, 653, 5697, 7677, 6215, 2142, -2993, -6906, -7504, -4726, 310, 5120, 7462, 6276, 2362, -2506, -6529, -7539, -4779, 111, 4612, 6940, 6487, 2910, -2389, -6324, -7116, -4770, -545, 4136, 7154, 6613, 2952, -1896, -5644, -7007, -5204, -782, 3982, 6684, 6399, 3314, -1381, -5451, -6958]
1182f958J760M130M569K941K4l040m512m054j616J422L880M564K966L18k701m456
1198g63l970j755J069L640M393L377L52k609m042l940k141P94L617M453L115N21
1214F111j996l992m153k257Q60L261M104L258R66j881m003m049k211N00K924M087
1230A529L410J116j699l765m083k236K22K722M045L479J171j501l449l911k588
1245e538j7K639M006L238J370j109l338m014k587J2K278L657L441J626j057l281
1261A326l767k523m07K078L636L444J685q78k950l720k708n55J877L506L488J730
1277E262o41k683l632k824p53J708L384L403J863l94k514l603k859q69J521L143
1293d88L374J978j44k364l498k805j055J301K923L375K143p0k238l284k890j235
$$ y = [-6958, -5198, -1068, 3501, 6442, 6466, 3426, -1086, -5140, -6756, -5334, -1454, 3110, 6076, 6394, 3693, -763, -4733, -6488, -5419, -1779, 2614, 5991, 6343, 3734, -308, -4248, -6389, -5595, -1978, 2475, 5590, 6111, 4115, 123, -4030, -6287, -5427, -2166, 1938, 5196, 6162, 4281, 278, -3771, -5982, -5482, -2558, 1529, 4939, 6055, 4356, 591, -3492, -5728, -5506, -2784, 1261, 4740, 5911, 4410, 961, -2950, -5538, -5555, -2916, 1090, 4328, 5698, 4589, 1251, -2763, -5350, -5338, -3060, 597, 4038, 5664, 4607, 1326, -2441, -4964, -5371, -3293, 343, 3787, 5472, 4594, 1644, -2076, -4784, -5339, -3462, 44, 3532, 5262, 4621, 1938, -1694, -4518, -5271, -3563, -179, 3224, 5087, 4693, 2179, -1424, -4283, -5152, -3631, -488, 2886, 4864, 4720, 2356, -1142, -3947, -5002, -3701, -778, 2597, 4740, 4670, 2432, -852, -3742, -4977]
1309d977J099K821L404K188Q0k012l157k975j296R43K671L216K297L38j856l172
1325c88k849j381O51K467L293K354L47j632k902k920j579N06K392L159K315O16
1341D449j383k867k944j578L34K231L016K420P23j340k727k899j682L22J992K963
1357A030K436Q69j108k665k903j713J8J936K848K480R74r62k457k833j845j8J694
1374b219K799K489J023q08k253k851j911j28J524K644K533J236p32k281k622j903
1390c460l89J334K625K587J169n72j962k649k084m91J355K499K462J358l92j896
1406A494k713k008o07J221K331K454J423j42j773k568k153o87J064K165K419J665
1422C585j05j732k481k030q63P93K185K528J390O4j386k402k267q99Q81J999K280
$$ y = [-4977, -3878, -1057, 2347, 4535, 4615, 2603, -554, -3529, -4825, -3882, -1211, 2005, 4302, 4640, 2784, -388, -3237, -4618, -3967, -1500, 1793, 4147, 4494, 2862, -40, -2960, -4539, -4033, -1641, 1518, 3833, 4449, 3066, 199, -2745, -4323, -3989, -1758, 1258, 3678, 4401, 3061, 334, -2565, -4247, -3925, -1933, 1030, 3466, 4335, 3227, 562, -2341, -4054, -4036, -2100, 748, 3228, 4202, 3240, 783, -2050, -3895, -3913, -2219, 580, 3069, 4092, 3284, 1031, -1820, -3731, -3859, -2335, 309, 2842, 4078, 3346, 1065, -1557, -3460, -3849, -2515, 110, 2697, 3866, 3294, 1332, -1317, -3401, -3892, -2537, -38, 2424, 3782, 3390, 1494, -1219, -3227, -3834, -2613, -282, 2172, 3595, 3453, 1680, -888, -3041, -3728, -2664, -499, 1920, 3585, 3480, 1748, -733, -2763, -3626, -2833, -648, 1880, 3270, 3334, 1948, -454, -2721, -3620, -2739, -740, 1540]
1439A540J664J77j417k335k098r49N33J918K369J632K78j203k342k074r92M66
1455b833J714K276J807L87j244k114k005j211K50J809K345J618L41r09j921k266
1471a956j209L89J511K062J790O27q95j994k083j289J55J438K113J750P03q17
1487B295j852k071j269J0J191K143J966O80p83j712j950j399k19J279K114J724
1503B147P74m68j629k049j482p2J110J749J889R68m32j677j899j407l06R84J752
1520d8J850J020l64j527j824j456m18Q39J802J810J004k86j314j746j611n95R12
1537a952J743J763R67Nj245j903j577m57P31J482J828J162m3j244j686j466p67
1554b659N81J657J645J128L9r37j798j521o72M38J565J621J163J67j020j579j540
$$ y = [1540, 3204, 3381, 1964, -371, -2469, -3418, -2885, -967, 1402, 3034, 3312, 2109, -233, -2307, -3299, -2833, -1119, 1157, 2964, 3351, 2107, -7, -2012, -3223, -2973, -1164, 1181, 2799, 3140, 2231, 310, -1956, -3165, -2776, -1265, 797, 2587, 3214, 2319, 325, -1758, -3047, -2892, -1454, 659, 2409, 3112, 2295, 443, -1628, -2897, -2887, -1696, 447, 2413, 3093, 2310, 598, -1352, -2751, -2970, -1691, 423, 2147, 2921, 2453, 824, -1225, -2707, -2779, -1669, 80, 1969, 2937, 2505, 828, -1071, -2478, -2784, -1800, -48, 1802, 2822, 2458, 931, -893, -2349, -2767, -1928, -126, 1684, 2688, 2402, 1088, -658, -2269, -2864, -1952, -209, 1554, 2521, 2526, 1281, -622, -2199, -2656, -1925, -443, 1385, 2547, 2504, 1260, -426, -1892, -2659, -2078, -421, 1224, 2352, 2391, 1454, -344, -1865, -2537, -2099, -534, 1087, 2250, 2417, 1397, -182, -1722]
1571a722q34M72J388J572J245K86p63j740j599o59L53J048J726J370K47q90j414
1588H6j463r80J44J301J622J180M03n48j429j700q40K16R72J511J361M89o33j382
1606C10j520r70M5J097J452J233N81m53j420j546r03N5P51J539J412N66n39j201
1624D89j366j127j41Q90J467J300N77k67j184j481j103r2P20J364J293P73l67
1641A745j006j442j050k52O11J332J316P46j98j022j470j000k68N07J306J349
1657A204P96k51q83j348j159l67N67J275J223P70Q3r21j392j198l33M91J028J373
1675I58R24n2q97j176j122n19L33J112J271Q77M5p27j151j133n20J89J025J302
1693G39R05P0o03j150j197o02K79J023J131Q71K29n23j226j078o42K52Q05J200
$$ y = [-1722, -2556, -2084, -696, 876, 2121, 2407, 1644, -96, -1695, -2354, -2001, -953, 773, 2143, 2390, 1500, 86, -1377, -2357, -2213, -912, 710, 1890, 2293, 1745, 316, -1384, -2224, -2008, -1036, 475, 1836, 2325, 1692, 310, -1210, -2180, -2135, -1038, 414, 1647, 2228, 1775, 355, -1191, -2094, -2039, -1288, 251, 1663, 2229, 1690, 489, -877, -2004, -2145, -1255, 212, 1512, 2089, 1822, 638, -843, -1946, -2038, -1318, 46, 1339, 2112, 1745, 739, -703, -1753, -2005, -1394, -62, 1254, 2000, 1802, 780, -690, -1690, -1958, -1451, -145, 1204, 2000, 1749, 866, -482, -1641, -2008, -1441, -166, 1057, 1827, 1910, 989, -403, -1601, -1934, -1443, -415, 958, 1882, 1830, 933, -243, -1365, -1884, -1551, -439, 832, 1709, 1754, 1027, -124, -1257, -1777, -1588, -563, 739, 1644, 1714, 1111, -39, -1236, -1838, -1559, -536, 595, 1466, 1695, 1172, -54, -1132, -1774, -1522, -717, 483]
1711D83J074J79n64j069j065o69J7Q90J097J013K83m68r01j189p43J20P60J064
1729C12R71L45l68j010j097p04mP45J046R75L93l09r80j061p41m3O11J026J065
1748A172L81l04q02j049p65j82O01J047J001N12k68q04j094q27j42N73R30R77
1766I57N44j24q10r45q37k03L95Q86J026N51j36p42r66p66l12L84R06R73N99j48
1786A232n84r57q51k82L54P88J030N26N1n34r42r24k94L18P69R22O84Q8n98r39
1806a43q26l74J98P88Q70P60O3n22q81p55m56J17P17R15O59J29m45p71r01m45
1826a303K08O14Q28P07K08l87q34q58l74R1N72P87P36K63l30q23q19n12J12N46
1846e68Q32P12K51l67o93p65n59l1O08Q34O79K29j86o52q56n87k1N46P34O89L80
$$ y = [483, 1557, 1736, 1172, 103, -962, -1631, -1614, -724, 373, 1386, 1669, 1201, 300, -889, -1632, -1512, -752, 312, 1283, 1628, 1260, 250, -847, -1551, -1555, -810, 236, 1211, 1604, 1295, 315, -746, -1487, -1530, -919, 107, 1172, 1553, 1249, 447, -602, -1367, -1549, -948, 99, 1100, 1612, 1344, 540, -554, -1381, -1523, -950, -20, 957, 1501, 1377, 567, -378, -1215, -1418, -1023, -137, 889, 1440, 1304, 562, -404, -1170, -1482, -1098, -192, 781, 1380, 1232, 648, -309, -1160, -1442, -1088, -300, 730, 1256, 1307, 773, -169, -1093, -1387, -1069, -300, 622, 1306, 1394, 796, -143, -969, -1343, -1145, -357, 513, 1273, 1336, 814, -67, -822, -1278, -1161, -444, 471, 1130, 1259, 814, 43, -858, -1303, -1095, -481, 347, 1054, 1262, 875, 41, -817, -1191, -1100, -528, 259, 995, 1258, 928, 105, -714, -1226, -1114, -568, 264, 976, 1227, 860, 167, -598, -1157, -1188, -580, 254, 933, 1162, 976, 324, -532, -1119, -1140, -594, 140, 829, 1209]
1867A209k92n91q49n25k7L74P53P11L89k15n68p84n99j41L84P69P54L59j66n51
1887C94p45m88k33L71O42O76M06o4m45p94o77j09L28O62O47M53k2n30p36n86j60
1908a010J80O54P21M46k0n03o48o07k52J53O67P27M21M0m39o09o43k87K24N53
1928b32P34M30N9l78o31o96k87J59M88P40M73J50l98o54n51k94J19M19O82N32
1948H64R7m10n07o81l14Q9N08O63M13J69k91n46n71l92K9M35O43M53K67l09n69
1969D0n34l61L6L34O39N43J83j75n36n80m55N8L92N52N02K67k23m99n47m03j24
1990h91M63M70N17L08j60m86n82l45j20L09N34N13K47r3m40n33m14j02K90M57
2010e8N86K52j05l31n64m14j46J78N39N24L12n3l18n51n23r3K18N06L90L84N5
$$ y = [1209, 917, 326, -523, -1048, -1075, -701, 52, 763, 1152, 937, 369, -415, -1014, -1155, -771, -2, 752, 1111, 945, 394, -351, -839, -1072, -701, -59, 617, 1023, 959, 514, -280, -957, -1066, -738, -76, 571, 1024, 1002, 472, -264, -850, -1010, -830, -176, 545, 991, 971, 468, -180, -787, -1039, -886, -219, 508, 929, 969, 530, -79, -722, -1009, -785, -232, 502, 932, 991, 613, -18, -714, -1001, -842, -354, 386, 859, 1009, 611, -43, -594, -888, -769, -350, 332, 864, 961, 551, 44, -637, -951, -862, -354, 309, 722, 891, 600, 54, -517, -909, -880, -445, 198, 651, 918, 609, 40, -494, -855, -819, -485, 154, 697, 880, 705, 169, -411, -866, -808, -416, 136, 638, 905, 682, 183, -364, -767, -891, -428, 42, 559, 867, 707, 221, -361, -706, -826, -517, 17, 530, 777, 684, 244, -289, -703, -805, -515, -58, 528, 780, 675, 344, -220, -634, -780, -602, -63, 461, 773, 720, 402, -149, -672, -765, -547, -41, 349, 733, 788]
2031G88m18n20m03j62J32M50N23K62L4k59n58l89k47J75M00M62M59K5l08n96m01
2052e51j40O7M21M83L09P1k19m22n15k09Q6L96M89L32K06l39m86l94k21L9L27
2073b70N05L30O9j74l90m78l42J71L32M04L54J48j72m09m63k90N3K95M12M07J44
2094F36j26m51l74l17j5L44L76L96J92j46l42m23k90k2J98M32L51K21j34k91m47
2115b32l04o2K04M12L35K06l8l26l86l37mJ09L95L92K01k8l52l75l40j10K22L52
2137f6M20K48j00k78l40l45j11J60L29M22K43Ol29l50m00l6Q2L74L05K41R9k97
2159B77l49k88j94J44K30M26K07O9k13l78k75j85pL53M04K08Q2j62l41m01j48
2180e41J25K90K71K91Q1j91l21l38k01R8K44K85L10J40j61l51k88j82J1K03L43
$$ y = [788, 370, -150, -553, -715, -583, -133, 390, 652, 686, 427, -131, -520, -767, -592, -192, 270, 729, 754, 446, -150, -551, -691, -624, -203, 280, 589, 660, 441, 19, -496, -705, -619, -223, 266, 598, 804, 465, -21, -415, -636, -597, -270, 235, 565, 634, 460, 70, -408, -750, -579, -247, 157, 511, 659, 487, 78, -385, -675, -622, -327, 85, 492, 636, 510, 59, -315, -632, -647, -303, 73, 469, 661, 515, 173, -250, -540, -562, -364, 68, 419, 640, 506, 215, -232, -536, -598, -394, 18, 353, 559, 521, 195, -191, -528, -532, -423, -28, 364, 565, 537, 185, -190, -530, -640, -418, -66, 354, 602, 502, 224, -116, -461, -572, -412, -83, 339, 582, 588, 259, -91, -491, -527, -445, -71, 234, 475, 574, 277, -72, -360, -554, -410, -180, 246, 453, 522, 309, -69, -344, -529, -536, -183, 221, 429, 511, 349, 8, -393, -541, -416, -126, 145, 436, 517, 326, 5, -333, -534, -436, -192, 93, 403, 543, 382, 31, -257, -439, -428, -225, 118]
2201A18L17N6j22l43l23j75K9K43L03L06Q9q1l45l73j55N5J55L63J99J24p2k55
2223A13k97k39J4J63K24L41K28j89k06l69k30K5J52L82K51J36q5k67k66k11j29
2244d59J73L28K37J67n7k49l33j40j11J05K17L30J90m3k02k78k57J1M9K73K76
2265B27J81l7j57k84l49L9Q5K05K48K30L9j99k74k68p2Q4K14K61J72R8j59l04
2287b0k73j24J00K14K57J80J3j37k68k16j19M9K08K59J52L5j03k26k19j13J3K43
2309i5K54J57O3j71j73k23j46L0J44K79J84J53j63k66l00m4k3J27K39K33J51j62
2331B48j88j91k38k5J86K57J98Q4r7j13k97j69j9J04K27K55J28j19j42k07j59
2352b77l3M8K25K89J09p5j77k20j38k0Q7K19J54J45r7r7k26k08n9J41K54J76O7
$$ y = [118, 435, 491, 369, 26, -297, -472, -443, -200, 103, 409, 498, 417, 72, -301, -456, -401, -246, 117, 316, 440, 368, 113, -184, -423, -409, -246, -22, 319, 547, 358, 152, -217, -447, -422, -270, 112, 363, 499, 414, 147, -119, -330, -459, -286, 42, 279, 446, 389, 140, -193, -333, -444, -339, -122, 208, 398, 355, 153, -125, -382, -371, -322, -49, 227, 408, 371, 214, -70, -419, -380, -295, -90, 158, 388, 427, 228, -46, -314, -386, -302, -88, 173, 345, 443, 284, -20, -293, -417, -317, -103, 154, 334, 347, 210, -58, -274, -393, -344, -136, 123, 275, 310, 207, -19, -238, -351, -338, -95, 159, 316, 379, 208, 35, -188, -334, -304, -160, 119, 303, 456, 293, 27, -273, -317, -340, -213, 26, 259, 410, 248, 60, -131, -369, -394, -208, 49, 247, 331, 234, 121, -176, -345, -364, -260, -33, 222, 350, 231, 89, -118, -277, -310, -262, -37, 252, 361, 286, 109, -111, -249, -269, -182, 37, 191, 336, 239, 142, -84, -292, -351, -210, 44, 220, 287]
2375B87j01n8k04j87q5Q8J77K55R8nj29j91j81o7J19J18K37Q5N0j57j83k26m4
2398c04J14J53J83J72m5q9k13k06l7KK45J33K01l1l9k50j77r9KK03J94J23O8j12
2422A91j41k62j06R1J28J51J69O7j75j89r1q4K8P7K23J35J21j75j47j39j37RJ70
2445h6J75Q8P7n7j64j72j14K9R9J80J46P4q5r4k35n0k5M1J75K01P7j45q3k01q6
2470b35p6J55J19K26lO3j59k05j03J8N9J56J53P0M7j52j98j82J3M4J43K08Q5m6
2494B00p7k28o7l2J00Q9J56R8j8n1k22j04q2J4J85J56Q1o6%j99j26p1Q7P5K12
2519A10R0Pm3j67j84n4M9J69J36M4J00j21j38r3n4J1P3J21J67k9j12n1j47m0k3
2544a79J23J00J55K7o7j96j11j0l8J45J13R4K4l2j33j66o1N6M4J66J35Qn3j18
$$ y = [287, 186, 128, -76, -263, -348, -260, -83, 172, 270, 265, 136, -55, -236, -303, -184, -66, 171, 256, 306, 149, -34, -260, -304, -190, -37, 146, 318, 273, 184, -29, -235, -272, -270, -25, 108, 309, 278, 239, -11, -188, -287, -285, -82, 112, 235, 303, 191, 50, -212, -318, -227, -99, 52, 221, 288, 113, -76, -167, -251, -223, -146, 77, 212, 333, 158, 11, -128, -265, -256, -86, 89, 177, 254, 197, 33, -139, -253, -224, -125, 55, 201, 275, 190, 96, -139, -189, -214, -173, 2, 203, 280, 135, 52, -149, -235, -311, -156, -37, 189, 186, 249, 90, -115, -218, -200, -141, 15, 168, 238, 285, 133, -65, -247, -234, -190, -47, 161, 246, 200, 123, -105, -172, -204, -104, -15, 141, 239, 221, 170, -52, -156, -238, -224, -39, 117, 198, 132, 132, -67, -193, -264, -177, -102, 110, 200, 207, 164, -3, -187, -241, -192, -23, 113, 157, 257, 136, -2, -95, -149, -138, -65, 56, 223, 194, 82, 31, -116, -156, -179, -56, 44, 199, 226, 159, -37, -148, -158, -196, -51, 62, 156, 180, 148, 15, -151, -212, -156, -112, 54, 189, 197, 144, 26]
2568B6j45k9k1J14J30K0J33m5j49j48k3m5J11R3R3J09n0j00j84m4J8J1J30J70
2592A75m0K3j08j32j12pK3J23J11M6L8q0j17j53%R0O8J32J29n9j21m0q8p5J6J26
2618c2J20R8k9n6q3j47K2j5P1J49P2J2n2j66j01n0N1N7J28R0k3o8j44K9j19K4
2644a62J57J2P6J17j25r0n9j22K3J19R5N4P1qj37j19k9m2J41P6J00o5kp4j03k1
2670a17mM1J38N0O3n8j31q0n4K0K8J08J28mLj44p7m7NM3J26K6J9J5m2j21o8k7
2698a61J18O0J65nq6J2j35j10j8P7J01J06O4j62J9m9r4k1L9J31nQ2o5l8o4j12
2724a51%J11kR3Q5j7j06k6j12j6P6J0J50k1N2o7n7n4o8L3J24M8M5j4p4k8r4p5
2752a55L9R4P1R5q8J5o9o6r7O7L1J05M5Jm2p5p7l9K8P3N1R8lKj50k8m8P1qP5J41
$$ y = [26, -119, -148, -169, -55, 75, 95, 228, 183, 34, -114, -137, -182, -71, 22, 115, 224, 174, 74, -110, -154, -136, -125, 5, 175, 135, 158, 50, -82, -194, -201, -178, -55, 56, 102, 140, 60, -57, -210, -210, -120, -52, 80, 209, 150, 29, -11, -99, -174, -158, -32, 88, 186, 157, 101, 18, -129, -107, -122, -51, 98, 170, 182, 130, -36, -137, -187, -136, -79, 49, 139, 116, 48, -96, -67, -186, -162, -5, 7, 83, 200, 75, -15, -74, -196, -173, -54, 41, 95, 166, 158, 21, -98, -127, -169, -28, 48, 148, 83, 81, 7, -96, -117, -121, -80, 58, 108, 171, 113, -18, -98, -152, -132, -104, 4, 132, 128, 131, -13, -90, -137, -132, -89, 37, 63, 82, 97, 55, -66, -134, -161, -43, 17, 182, 177, 91, 103, -32, -142, -160, -83, 18, 124, 188, 26, 45, -4, -98, -119, -80, 51, 46, 128, 63, 25, -39, -151, -151, -40, -42, 51, 136, 119, 13, -13, -125, -141, -65, -55, 95, 74, 126, 59, 2, -52, -120, -87, 37, 85, 130, 116, 42, 14, -80, -155, -116, -22, 49, 144, 56, 71, 2, -64, -161, -94, -63, 42, 87, 88, 46, -29, -106, -145, -117, -44, 7, 105, 102, 104, -46, -74, -122, -51, -59, 16, 157]
2783A57n0Pj16m1n6kR3Q4Q3J9r8j02qp5kK2R6J04Kq2n8k1r9L6Q0RM4N2J3j02l5
2814d6n4NJ3K7J52%l0n2m2p8L5J9O3J16l4m4Lo2q8N2O5j5Q9J7k5o1l8n3K1k6R2
2845B1N4J3J7p2j05mn5O9Q0oP2l5lj03j5o7J2R4O9O0jm6L4j57l4L7L6Q1P2j04
2875A4J4n9J2n7l7J30JL7M0n6k4q0o6K9J14M5m8O2n4n1n8j0K5J0J19JK2m9rn8
2905d1m3NJ9J09PK9l9o9Jl6k9O6O1K0LK5Nj03q3J8MP0O4k3Kq4o7pR1k1O9L4J4
2938G1J4o1o9n9Kj0J26OL2np7O2r6NK4M3L6Rm5M1l1p0j1rJ09RM1Kq3n7K9lo3O8
2972b0M6L3Lm7o1J5q3oJ00K8L4l6M9o1n2j1L9O4m2P6n6Qm4L3k4k7M2N7N7o6j2
3003C6l0q7LN2j2O6J5l5M2o2l5k9N5J2J0R8m4l3m6r2qK4R6K1M6m5Ml1l6n5L5O
$$ y = [157, 107, 114, -2, -43, -99, -101, -8, 76, 159, 178, 80, -22, -30, -105, -107, -85, 11, 115, 117, 35, -23, -44, -143, -107, -27, -18, 26, 78, 91, -11, -46, -100, -95, -82, -55, 97, 97, 67, 15, -27, -105, -70, -51, 12, 128, 94, 50, 53, -9, -97, -45, 20, 5, 94, 111, 86, 25, -13, -66, -45, -71, 21, 75, 88, 105, 33, -72, -76, -131, -62, 18, 12, 84, 49, 46, -57, -72, -139, -127, -33, 36, 96, 95, 49, 83, -74, -108, -71, -35, 46, 118, 14, 28, -31, -19, -76, -113, 17, 18, 55, 95, 39, 15, -65, -131, -102, 12, 57, 9, 71, 17, -34, -92, -102, -77, -67, 52, 53, 75, 26, 17, -41, -84, -79, -60, 49, 56, 85, 46, -23, -22, -58, -87, -21, 40, 60, 63, 88, 93, -10, -93, -75, -71, -1, 63, 40, 42, -42, -109, -116, -25, -46, 23, 57, 71, 85, 24, -45, -104, -102, -112, 14, 20, 52, 47, -30, 32, -64, -59, -35, 8, 44, 53, 8, 49, 18, -52, -63, -72, 37, 46, 87, 89, 6, -51, -22, -25, -88, -20, 26, 59, 62, 15, -46, -31, -114, -120, -20, 8, 42, 6, 55, -6, -58, -69, -30, 34, -8, 68, 12, 20, -24, 9, -15, -42, 0, 57, 114, 48, 36, 6, -81, -78, -26, -38, 28, 43, 8, 50, -12, -47, -76, -21, -9, 1, 99, 55, 22, -24, -116, -124, -100, -4, 17, 63, 18, 22, -9, -45, -100, -65, -59]
3035e9P0KJ0J0Lj08N2o3Q9OM5k1j6J7n6n3m4J13K8k3K3O8o8ml3p5M4N6J9O6r7
3066Aj4k8l7j6L3R0K4m4K5l2o3%j9L8PN0M1Ok1n8j2M5p1L4J4L1K4K0o9rk7J5j0
3099c2N9PK1Or9j5kM7K2K1j1k0M2n2m7J7J0L0Qj4M2j5rk6q0O9j0O0kj9O5p2j3
3132a2rjk0P2L0L9r4K5l7p0oP3j1L9J8Mp6Nkl3K3J5O3j6L3p2ol1J3KQ5N6m1k5
3166C3%r3J1O5n0O3K5k3J7J1k8m3j7RQ9j7m1oj6l2nlN7k7LP5Lr0K0J3l9J7lk7
3200d9J22p5j6PJ3p0J15n9J4Q5o4J2n8L0l7nkJ29r7M4n4J3l4m6O9M1kpMjo0J4
3232b4j5qoK8R3p9KNo1L5K8k0L9j3oM2o7k3jJ5NP9nNk6J6j6m1LK5K5k4P5m3o9
3267b7K8l4M4l9N6o1N8oo7K6k2JO7o4K9M4n5L0m9J9kkM9p8N0l4O5J3k2r6N9J01
$$ y = [-59, 11, 13, 23, 33, 36, -72, -20, -83, 6, 12, 57, 36, 20, 37, -19, -72, -116, -3, 25, 2, 25, 93, 25, 21, -12, -87, -43, 13, 32, 98, 1, -13, -41, -78, -94, -61, 29, 53, 9, 34, 2, -61, -61, -80, -42, -35, 15, 56, 62, 41, -17, -29, 16, -55, -21, -7, 24, 48, 68, -1, -10, -37, -22, -32, 27, 34, 55, 61, -38, -53, -55, -8, 14, 35, 24, 4, 46, -6, -53, -36, -26, 4, 12, -2, 40, 25, 16, -10, -90, -21, -31, 29, 27, 8, 73, 1, -12, -21, -22, -42, 30, 60, 99, 5, 30, -7, -77, -83, -10, -21, 18, 36, 40, -36, -31, -33, -66, -43, -28, 35, 19, 52, -20, -26, -57, -44, -42, 43, 99, 58, 33, 33, -60, -49, 16, -34, 29, 54, 31, 48, 59, 31, -12, -29, -20, 69, 52, 11, 5, -11, -43, -48, -51, 6, -21, -18, 57, 60, -30, -10, 3, -36, -19, -22, -49, 73, -2, -18, -11, 2, -68, 47, -12, 2, 87, 23, 35, -23, 7, -30, -35, -37, 92, -5, 39, -15, -2, -36, -82, -13, 28, 26, 19, 23, 22, -38, -24, -39, -47, -53, -25, 68, -11, -9, -4, -65, -30, -2, -22, 17, 4, -2, 40, -27, -50, -51, -36, -31, 48, 43, 48, 22, 38, 22, -19, -16, 9, 34, 10, 85, 42, -27, 1, -33, 11, -28, 28, -33, 25, 19, -48, -22, -44, -43, 24, -40, -11, 33, -22, 8, -41, -22, -24, -26, 23, -55, -5, -39, 26, 39, 17, -79, -20, 81]
3299H1j01O9l0M3r4L2k6J5%%J3O2Jm5om0j2N3m7K4pL6j8n0k1N1nJ8J4J4j4l4J2
3332a2o9Q7m0Q6p4JQN5o6m0K8J5P0l6k4QnL2q7K8k6ON8qPl3P7j06O6Mk3k3lK4
3366a5N6o8J8m1N4mK6K1j5k4ln8N9j9K7K9k1PKK7j10L7J2M7K2o2J7Qj5l1jJ1l8
3399d5O0J2j2o0L0K5k3J2l1O3j5Jj4m5P0o2M0m3L6J7N9r7M3%n6K1L8L1k6J5j7
3430B7n7J4LoLP6k4j6J4jj13N2J8L1j1Rj0k6l5LL3k9Q5l1K8j3p1K0m2M5lKN7j2
3464B0J0olp3O1n0P6%j3k1j3MM0J9p4pQ5r8O9n3j5O9Np9O4l9kj0N7p9N1Nn0O5
3498A5J4j2MOm7J0k2O8o2J12r2L4j0n1L5l6Mj1L6NO8k2l6j7k2RJ4M4o0K1Pk9L0
3531Gj9m9M8Jj7N6m8K6p7J3N4k6%J1J3kK6J4m5%k0J3L9j8j1L0j0j6J5k8M3rj1
$$ y = [81, -20, 49, 19, 62, -32, 0, -26, -11, -11, -11, 2, 64, 65, 20, 14, -26, -38, 15, -32, -8, -15, 21, 3, -47, -68, -17, -22, -4, 10, 24, 10, -24, -12, -81, 6, -34, 52, -22, -21, -13, 42, -24, -64, -36, -21, 49, 13, -11, -3, -8, 24, -63, -35, -61, -55, 3, -5, 2, -31, 46, -60, 6, 10, -13, -36, -39, -15, 41, -27, -9, -50, 4, 0, 26, 47, 32, 8, 5, -53, 6, -13, 14, 43, 22, 29, 31, 58, -52, -15, -3, 44, 66, 4, 21, 29, 14, -17, -18, -7, -45, 15, 27, 15, -45, -15, 10, -13, -1, -32, 31, 16, 17, 3, -42, 28, -34, 6, -37, -1, 16, 75, -22, 21, 21, -35, -14, 24, 55, 29, 44, 27, -30, -16, -13, -19, -16, 60, 36, 20, 34, 33, -80, -28, -10, 21, 10, 19, 9, -17, -52, -49, -16, -45, 40, 9, 37, 24, -47, -27, -69, -24, -27, -25, 32, 20, 30, 24, 21, -52, 9, -41, 35, 35, 22, 1, -12, -8, 32, 51, -23, -30, 55, -43, 26, -27, -42, 27, 32, -47, 17, -22, -24, -34, 23, -56, -5, 0, -50, 15, 29, 17, 21, 27, -20, -10, -32, 36, -26, 86, -6, 28, 18, -33, 2, -34, -30, -41, -5, 0, 68, 46, 10, -7, -29, -20, -6, 38, -22, -1, 6, -23, 7, -12, -61, -13, -12, -29, 27, -21, 5, -72, -59, -5, -31, -31, -20, -7, -9, 17, 31, -14, -14, -34, -21, 18, 0, -11, 19, 9, -7, 8, -20, 23, 14, 3]
3564CL3m7n7R6lm0K5k3J8Lmj7M2n4J0kK9K2Qm5j7rj7N1On3R9n7L9oo2N3n8J0N0
3599B6j5NLk6L4m8M4Lj4LJ5ml9k2L7j3l2L1j4M1j3L2k1n8rP9o4M4k9nK8k3J9l4
3633c9L0j9M8k8K9J1l6mj9L9K7kRm3k1L3m6l1O0k4N6k3J9j1r7M8l0N7J3J9p6O2
3665A1K0j11O4qk0K7l4P9n4K5j2j2N4n3lO6j3Rl8kLMn0L4M7l1k4K4K4m4O2k9o4
3698d9Q8mk2j1OJ0j03Q7Jk5J1K3j4k1j3M1L6Lm5L2%l7Pj7P9p2K3k7J2J2J2o0j3
3731e0L6j9J8L1j7K3k2K6j5n5M3k1k2L2Rn2M8n0K7K2l8K2pJ3M0m4N4q2RL8K6k4
3763aN4k3k1k4L7j6j8M9m0jpJj1j0MK0M2K6r9P3o1Mj6O6l4j2OJ1j8%J8l9pM3n
3798iJ4M3q8K8nJ7j2%j5KO7ro4N1%j0qJ8pk1L2k5L9k9lk3LN4nk7n1N3m7K8K2L
$$ y = [3, 36, -11, -68, 28, 25, -15, 10, -13, 5, 8, 4, -13, 29, -25, -15, -17, 12, 34, 42, -3, -20, -29, -46, 5, 11, -42, 57, 0, 39, 33, -29, 24, -34, -24, 26, 11, 16, 19, -7, 27, -21, 23, 26, 12, 15, 30, 26, -13, -35, 2, -11, -43, -12, -26, 15, 2, 34, 13, -45, -54, 25, -39, 5, -24, -29, -1, -24, -5, -39, -9, -28, 20, -8, 21, 32, -4, -8, -27, 12, 39, 37, 46, 3, -18, 15, -31, -62, -2, -26, 30, 7, 26, 15, -82, -34, -64, -7, 6, 25, -51, 11, 31, -80, -16, -24, -44, -17, -51, 28, -26, -1, -13, -25, 29, -24, -27, 39, 26, 35, -3, -5, -2, 2, -48, -14, 33, 2, -22, 2, 26, -18, 44, 15, -49, 39, 35, 13, 2, 8, 18, -85, 2, 3, -22, -11, 12, -2, -23, -36, 5, 41, 44, -1, 31, 31, -6, 1, -16, 63, -9, 14, -13, -1, 11, 23, -37, -50, -14, -33, -15, 16, -1, 22, 0, 26, 11, -44, -1, -22, -44, -12, -3, -55, -7, -57, -30, -8, -46, -24, -31, -18, 22, -22, 32, -50, -41, -3, 23, -1, 53, 30, 9, -15, 22, 6, -12, 37, -3, -4, -11, -10, -21, -31, -27, -7, 35, 61, -38, 35, -26, -22, -38, 28, -6, -18, -12, -1, -19, -19, -1, -40, -47, -4, -9, 5, 48, -40, -12, -17, 0, -12, -12, -27, -25, 42, 33, -31, 20, 20, 10, 2, 20, 13, -8, 24, -1, 38, 9, 6, -17, -14, 40, 35, 8, -43, 10, -37, -9, 13, 16]
3834A6qq2K7j9M1l2K3k2K1k7J2M2K0L1r4R4m6j7L8j2Ol5P0l3k0L4n3M7m8N3m5
3865a8lN5p2N9n9j5P4o9OL4k0l4L1M5k7M7p4M0l3M1Rp9O9rL1kk9K8qo7P9MK0n0
3899Dj5O9n9Ok2k6N8o2N2k6KJ4Ql0M4mm5O0%n4J0M1j7j4%o0L8O2l5M5k4q2O3l7
3933c6N2L6n2K3q0R7kr7O2K0j2%l0K0j0j6MO0l3L3q0J4P5k9m6M0l1k3Pk0M4k2
3965c2O3j0m3L9K9j6p4MNO7p5O5ml2nJ5j1P2j21P0Q6r7lk6P1Ol1Rp1K1N8m7J9
3998AJ1l6OKLJ2K1k3jk9M0o9M8k6J3qM0Km3P3r7J15n0J6K8m3k4kJ5pO7l0l2j2
4032a9M1J0J7j8K1k3on3M3k3j1N5p5O0o4R8n7J9k7M2p0l4N1PL9l9l1mK0K2j4L5
4064A2m1M0m6nL2rN3J9K3n9J3kj8k5P5n6l1J0J6K2ok3m4qL9qL1k2J3k3KLj9KK6
$$ y = [16, 8, -74, -47, -66, -25, -57, -34, -56, -35, -62, -50, -8, 12, 43, -51, 43, -3, -20, 18, 6, 12, -23, 47, 14, -6, 28, -25, 22, -26, 27, -18, -21, 34, -38, 21, -38, -53, 21, -48, -42, -8, -28, -62, -31, 14, -13, 34, -40, 0, -33, 8, 17, -62, 7, -2, 29, 27, -2, 26, 18, -49, 30, 34, 54, 4, -11, 58, -1, 5, -17, -43, 15, -47, 5, -21, -19, -5, 3, -27, 17, 13, -32, 28, 28, -26, -16, 25, 8, -6, -6, -66, -28, 34, -1, 44, 20, -62, 1, -36, 16, 52, 0, 23, -57, 40, 38, -59, 3, 23, 11, 11, -19, 1, -9, -25, -21, 39, 6, 39, -41, -27, 48, 19, -27, 13, -18, -41, -34, -54, -10, -32, 31, 21, -22, 17, 46, 30, -44, -40, -35, 32, -43, 22, 18, -14, -19, -4, -15, 57, -64, 6, 92, -5, -8, -34, 37, 43, 12, 21, -50, -29, 29, -18, 1, 12, -24, -18, -16, -13, -1, 20, -3, -4, -33, 7, -62, -14, -40, -27, -35, 5, 7, -36, 37, -60, 55, 5, 21, 49, 6, -18, -20, -5, -12, 55, 25, -7, -19, 22, 32, 49, 31, 52, 29, 23, -30, 13, -10, -21, 34, -41, 19, -45, 53, -4, 15, -12, 30, -40, -74, -23, -16, 23, -16, -47, -51, -31, -9, -23, 12, -29, 11, -35, -40, -8, -17, 36, 55, 78, 19, 32, 30, 12, -13, 62, 6, -25, -15, 1, 23, 17, -6, -50, -58, -19, -27, 4, -18, -5, -28, -26, -23, -42, -40, -14]
4099a4L2K7m0Nl5J4O2m3M2n7K1n5K0j3m1N2l3P8rrlJ2l6M6k2RjQk8l7J4J1J8m8
4133e3J4L4k3M9l8M3k6OJ5k2L8m6JJ2m5L5Nj0O3j7j0j8n2M2m5J07o1K5m7K9j0
4164eK2p1N7nMKj6q3J29o7M5j9n6Q1n4M2k2j0P7m6l6P7q6L3j0P2p5K3j4l5L1J5
4196@L2K3n3K2k1L9m7M1l4l5N1Jl0M6o9K6J6NJMj5L4Ro4J9M3j03Q4K0n3LL4ok
$$ y = [-14, 18, 45, 5, 10, -25, -11, 51, 8, 50, -7, 14, -41, -21, -34, -75, -23, -56, 22, 13, 4, 1, 13, -23, 23, 1, 10, 9, 17, -11, -48, -34, -23, -5, -53, -39, -5, -28, 21, -17, 26, 0, 6, 21, -1, 37, -9, -8, 4, -41, -6, -1, -11, 52, 35, 25, 7, -45, -3, -48, 59, -2, 23, -24, 5, -5, 17, -54, 3, -2, 2, 4, -12, -95, 34, -33, 12, -7, -63, 18, -36, 6, -16, -26, 51, 5, -31, 46, -40, -7, -17, 55, -20, 3, -11, -46, -15, 0, 32, 55, 2, 24, 3, 42, -5, 36, 2, -33, 18, 19, -11, 35, -34, -8, 8, 13, 14, 18, 3, 37, 46, -18, 1, 44, -59, 25, 45, -8, -5, 29, 23, 21]
$$ [...]
8191B2
##END NTUPLES=NMR FID
##END=
