##TITLE=1H_LR-766-2H-2CR5-7
 D2O
 8 sc, 
 5.6.2023
##JCAMPDX= 6.0         $$ Bruker NMR JCAMP-DX V2.0
##DATA TYPE= NMR FID
##DATA CLASS= NTUPLES
##ORIGIN= UXNMR, Bruker Analytische Messtechnik GmbH
##OWNER= root
$$ XWIN-NMR		Version 3.5
$$ Mon Jun  5 14:28:56 2023 Russian Standard Time (UT+4h)  she@DPX200
##.OBSERVE FREQUENCY= 200.13135
##.OBSERVE NUCLEUS= ^1H
##.DELAY= (6, 6)
##.ACQUISITION MODE= SIMULTANEOUS
##.ACQUISITION SCHEME= undefined
##.AVERAGES= 8
##.DIGITISER RES= 18
##SPECTROMETER/DATA SYSTEM= spect
##.PULSE SEQUENCE= zg30
##.SOLVENT NAME= D2O
##.SHIFT REFERENCE= (INTERNAL, D2O, 0, 15.7039)
##AUDIT TRAIL= $$ (NUMBER, WHEN, WHO, WHERE, WHAT)
$$ ##TITLE= Audit trail, XWIN-NMR		Version 3.5
$$ ##JCAMPDX= 5.01
$$ ##ORIGIN= Bruker BioSpin GmbH
$$ ##OWNER= she
$$ F:/spectra/data/she/nmr/H-F/1/audita.txt
$$ ##AUDIT TRAIL=  $$ (NUMBER, WHEN, WHO, WHERE, WHAT)
(   1,<2023-06-05 14:27:22.54 +0400>,<she>,<DPX200>,
      <created by zg, POWCHK disabled, PULCHK disabled
       configuration hash MD5:
       00 E9 B6 7A A2 85 ED C7 34 08 36 98 17 FE 4E 26
       data hash MD5: 16K
       86 26 AE F5 77 75 15 C7 8D C6 1D 54 A8 D8 95 E3>)
$$ ##END=
$$ 
$$ hash MD5
$$ A7 74 33 AE B1 BA 70 5F 1B 4E 2C A6 DA 8B 06 9B
##$RELAX= 
##$RELAX= 
##$RELAX= 
##$RELAX= 
##$RELAX= 
##$RELAX= 
$$ Bruker specific parameters
$$ --------------------------
##$DU= <F:/spectra>
##$EXPNO= 1
##$NAME= <H-F>
##$PROCNO= 1
##$TYPE= <nmr>
##$USER= <she>
##$AMP= (0..31)
100 100 100 100 100 100 100 100 100 100 100 100 100 100 100 100 100 100 
100 100 100 100 100 100 100 100 100 100 100 100 100 100 
##$AQSEQ= 0
##$AQ_mod= 1
##$AUNM= <au_zg>
##$AUTOPOS= <>
##$BF1= 200.13
##$BF2= 200.13
##$BF3= 200.13
##$BF4= 200.13
##$BF5= 200.13
##$BF6= 200.13
##$BF7= 200.13
##$BF8= 200.13
##$BYTORDA= 1
##$CFDGTYP= 0
##$CFRGTYP= 5
##$CHEMSTR= <none>
##$CNST= (0..31)
1 1 145 1 1 1 1 1 1 1 1 1 1 1 1 1 1 1 1 1 1 1 1 1 1 1 1 1 1 1 1 1 
##$CPDPRG= <>
##$CPDPRG1= <>
##$CPDPRG2= <>
##$CPDPRG3= <>
##$CPDPRG4= <mlev>
##$CPDPRG5= <mlev>
##$CPDPRG6= <mlev>
##$CPDPRG7= <mlev>
##$CPDPRG8= <mlev>
##$CPDPRGB= <>
##$CPDPRGT= <>
##$D= (0..31)
0 1.2 0 0 0 0 0 0 0 0.06 0 0.03 0 0 0 0 0.0002 0 0 0 0 0 0 0 0 0 0 0 0 
0 0 0 
##$DATE= 1685960841
##$DBL= (0..7)
120 120 120 120 120 120 120 120 
##$DBP= (0..7)
150 150 150 150 150 150 150 150 
##$DBP07= 0
##$DBPNAM0= <>
##$DBPNAM1= <>
##$DBPNAM2= <>
##$DBPNAM3= <>
##$DBPNAM4= <>
##$DBPNAM5= <>
##$DBPNAM6= <>
##$DBPNAM7= <>
##$DBPOAL= (0..7)
0.5 0.5 0.5 0.5 0.5 0.5 0.5 0.5 
##$DBPOFFS= (0..7)
0 0 0 0 0 0 0 0 
##$DE= 6
##$DECBNUC= <off>
##$DECIM= 32
##$DECNUC= <off>
##$DECSTAT= 4
##$DIGMOD= 1
##$DIGTYP= 9
##$DL= (0..7)
0 120 120 120 120 120 120 120 
##$DP= (0..7)
150 150 150 150 150 150 150 150 
##$DP07= 0
##$DPNAME0= <>
##$DPNAME1= <>
##$DPNAME2= <>
##$DPNAME3= <>
##$DPNAME4= <>
##$DPNAME5= <>
##$DPNAME6= <>
##$DPNAME7= <>
##$DPOAL= (0..7)
0.5 0.5 0.5 0.5 0.5 0.5 0.5 0.5 
##$DPOFFS= (0..7)
0 0 0 0 0 0 0 0 
##$DQDMODE= 0
##$DR= 18
##$DS= 0
##$DSLIST= <SSSSSSSSSSSSSSS>
$$ [...]
##$SUBNAM2= <"">
##$SUBNAM3= <"">
##$SUBNAM4= <"">
##$SUBNAM5= <"">
##$SUBNAM6= <"">
##$SUBNAM7= <"">
##$SUBNAM8= <"">
##$SUBNAM9= <"">
##$SW= 18.05172834244
##$SWIBOX= (0..15)
0 0 2 0 0 0 0 0 0 0 0 0 0 0 0 0 
##$SW_h= 3612.71676300578
##$TD= 16384
##$TD0= 1
##$TE= 0
##$TE2= 300
##$TE3= 300
##$TEG= 300
##$TL= (0..7)
0 120 120 120 120 120 120 120 
##$TP= (0..7)
150 150 150 150 150 150 150 150 
##$TP07= 0
##$TPNAME0= <>
##$TPNAME1= <>
##$TPNAME2= <>
##$TPNAME3= <>
##$TPNAME4= <>
##$TPNAME5= <>
##$TPNAME6= <>
##$TPNAME7= <>
##$TPOAL= (0..7)
0.5 0.5 0.5 0.5 0.5 0.5 0.5 0.5 
##$TPOFFS= (0..7)
0 0 0 0 0 0 0 0 
##$TUNHIN= 0
##$TUNHOUT= 0
##$TUNXOUT= 0
##$USERA1= <user>
##$USERA2= <user>
##$USERA3= <user>
##$USERA4= <user>
##$USERA5= <user>
##$V9= 5
##$VALIST= <valist>
##$VCLIST= <CCCCCCCCCCCCCCC>
##$VD= 0
##$VDLIST= <DDDDDDDDDDDDDDD>
##$VPLIST= <PPPPPPPPPPPPPPP>
##$VTLIST= <TTTTTTTTTTTTTTT>
##$WBST= 1024
##$WBSW= 4
##$XGAIN= (0..3)
0 0 0 0 
##$XL= 0
##$YL= 0
##$YMAX_a= 326825
##$YMIN_a= -344324
##$ZGOPTNS= <>
##$ZL1= 120
##$ZL2= 120
##$ZL3= 120
##$ZL4= 120
##$ABSF1= 10
##$ABSF2= 0
##$ABSG= 5
##$ABSL= 3
##$ALPHA= 0
##$AQORDER= 0
##$ASSFAC= 0
##$ASSFACI= 0
##$ASSFACX= 0
##$ASSWID= 0
##$AUNMP= <proc_1d>
##$AZFE= 0.1
##$AZFW= 0.1
##$BCFW= 1
##$BC_mod= 2
##$BYTORDP= 1
##$COROFFS= 0
##$CY= 11.3945322036743
##$DATMOD= 1
##$DC= 2
##$DFILT= <>
##$DTYPP= 0
##$F1P= 15.7292609196834
##$F2P= 12.9074282941183
##$FCOR= 0.5
##$FTSIZE= 0
##$FT_mod= 4
##$GAMMA= 1
##$GB= 0.15
##$INTBC= 1
##$INTSCL= 1
##$ISEN= 128
##$LB= 0.24
##$LEV0= 0
##$LPBIN= 0
##$MAXI= 10000
##$MC2= 0
##$MEAN= 0
##$ME_mod= 0
##$MI= 1.114404
##$NCOEF= 0
##$NC_proc= 0
##$NLEV= 6
##$NOISF1= 3.799351
##$NOISF2= 2.8
##$NSP= 1
##$NTH_PI= 0
##$NZP= 0
##$OFFSET= 15.70392
##$PC= 1
##$PHC0= -20066.35
##$PHC1= 11.05272
##$PH_mod= 1
##$PKNL= yes
##$PPARMOD= 0
##$PSCAL= 0
##$PSIGN= 0
##$REVERSE= no
##$SF= 200.130013532006
##$SI= 16384
##$SIGF1= 3
##$SIGF2= 2
##$SINO= 400
##$SIOLD= 16384
##$SREGLST= <1H.CDCl3>
##$SSB= 0
##$STSI= 0
##$STSR= 0
##$SW_p= 3612.71676300578
##$SYMM= 0
##$S_DEV= 0
##$TDeff= 0
##$TDoff= 0
##$TI= <>
##$TILT= no
##$TM1= 0
##$TM2= 0
##$TOPLEV= 0
##$USERP1= <user>
##$USERP2= <user>
##$USERP3= <user>
##$USERP4= <user>
##$USERP5= <user>
##$WDW= 1
##$XDIM= 8192
##$YMAX_p= 0
##$YMIN_p= 0
$$ End of Bruker specific parameters
$$ ---------------------------------
##NTUPLES= NMR FID
##VAR_NAME=  TIME,          FID/REAL,        FID/IMAG
##SYMBOL=    X,             R,               I
##VAR_TYPE=  INDEPENDENT,   DEPENDENT,       DEPENDENT
##VAR_FORM=  AFFN,          ASDF,            ASDF
##VAR_DIM=   8192,          8192,            8192
##UNITS=     SECONDS,       ARBITRARY UNITS, ARBITRARY UNITS
##FACTOR=    0.0002768,     1,               1
##FIRST=     0,             0,               0
##LAST=      2.2672688,     0,               0
##MIN=       0,             -344324,         0
##MAX=       2.2672688,     326825,          0
$$ Real data points
##PAGE= N=1
##DATA TABLE= (X++(R..R)), XYDATA
0 0 0 0 0 0 0 0 0 0 0 0 0 0 0 0 0 0 0 -8 8 -8 8 -8 12 -14 16 -16 22 -24 28 -32 39 -43 50 -55 62 -72 79 -91 100
39 100 -113 127 -139 155 -172 192 -212 235 -258 285 -313 345 -380 419 -463 508 -563 623 -691 769
59 769 -859 967 -1094 1249 -1446 1693 -2029 2492 -3159 4049 -5524 203886 279847 184226 176849
74 176849 62666 -205731 -344324 -208646 -39931 73792 212094 296946 180261 -27321
84 -27321 -174899 -254451 -251533 -99898 107731 229091 253860 202466 32755 -176991 -267655
95 -267655 -224311 -127218 31601 217192 277819 173620 34596 -90179 -224153 -266396 -124156
106 -124156 70803 166435 198899 200720 82835 -127630 -244705 -202632 -103611 7694 149065
117 149065 246758 204424 53803 -102540 -201874 -215590 -137809 -3236 137610 228735 204981
128 204981 66227 -86186 -171285 -198209 -161176 -23099 149303 219346 169240 79333 -33872
139 -33872 -170131 -232433 -150484 -6009 103629 177494 201988 116269 -46153 -161370 -181938
150 -181938 -144852 -55324 83333 188448 181504 88140 -25036 -126290 -183674 -153671 -42146
161 -42146 87433 171774 176978 101779 -16474 -124946 -184269 -164458 -58818 77267 161961
172 161961 169382 119065 17101 -110992 -185150 -153599 -57807 43032 130720 174852 127310
183 127310 7366 -102245 -152866 -146146 -79545 36353 138918 165426 114916 22155 -80598
194 -80598 -153302 -154204 -79916 28761 120713 156398 120723 31894 -70085 -142776 -149978 -81851
206 -81851 24048 110685 147085 124579 42171 -69228 -144293 -144385 -85650 3603 99567 156593
218 156593 133103 45597 -51307 -121864 -146313 -104061 -6946 89409 136409 123772 59407 -35057
230 -35057 -114649 -136619 -94437 -11783 77010 131483 122948 57666 -31983 -109191 -138420 -100702
242 -100702 -15962 71172 126332 129376 71775 -23285 -103543 -131527 -104385 -33526 57474 123147
254 123147 126100 71279 -10016 -87839 -129916 -108988 -34550 51133 111185 124837 81930 -2431
266 -2431 -84005 -123203 -108841 -47813 37935 106322 121474 81865 9439 -68777 -117772 -108288
278 -108288 -46812 31309 93658 117160 85513 9511 -68741 -111605 -106536 -55305 25849 96968
290 96968 119509 87713 20603 -56918 -112335 -114360 -62120 14627 82269 115068 95716 30326
302 30326 -47271 -99953 -107407 -67013 5274 75115 108281 91366 33529 -40350 -96042 -106359
314 -106359 -67897 507 69510 107370 94552 38487 -33003 -89647 -106978 -73926 -5886 62245
326 62245 100305 94816 46085 -26411 -85934 -102667 -73717 -13619 55204 100864 97090 47741
338 47741 -19752 -77884 -104295 -82675 -20093 49545 92950 96400 58695 -8179 -72055 -98819
350 -98819 -79259 -27440 36362 86390 94958 56170 -6680 -63194 -92503 -81220 -29658 37590
362 37590 84921 91887 59642 736 -61475 -96116 -84304 -34260 28541 78433 94904 67747
374 67747 7926 -54372 -89322 -83893 -42023 19341 72957 91927 67333 12721 -46435 -84743
386 -84743 -84824 -45401 15168 68081 89620 70312 19128 -40280 -80968 -85005 -50179 8294 62073
399 62073 85522 70156 24727 -33022 -77349 -83941 -49600 5300 55469 83162 74409 27807
411 27807 -33139 -75077 -81927 -55595 -4270 53330 86247 75740 32038 -22040 -67001 -84507
423 -84507 -62109 -8996 46180 77416 73927 38375 -14877 -62307 -80821 -60409 -11508 40941
435 40941 72957 73351 42000 -11693 -62259 -80333 -59371 -16269 32259 71933 79965 44714 -10999
448 -10999 -54142 -73261 -66079 -26698 31584 71967 72908 44376 668 -47610 -77961 -67832 -24114
461 -24114 26477 63290 74584 52519 4413 -45681 -74001 -68087 -30749 19217 58207 72430
473 72430 56117 10913 -41942 -69841 -62615 -33239 9005 54997 76522 53439 6218 -34220
485 -34220 -61057 -69537 -42161 13522 57838 67930 53362 20911 -27789 -68426 -71230 -38543
497 -38543 5493 44714 68149 61377 23640 -25625 -61196 -66670 -42148 -1058 39566 66197
509 66197 63238 25180 -24758 -55560 -61212 -47943 -10842 40999 70072 56887 23781 -10441
521 -10441 -47549 -71009 -52273 -3526 36205 55021 58961 37621 -10868 -53734 -63328 -45888
533 -45888 -14123 27423 60769 62641 33833 -7053 -44916 -64347 -52467 -16561 23571 54754
545 54754 64085 40039 -4700 -40636 -55991 -53884 -26887 21546 57254 56489 34459 6517 -31281
558 -31281 -63355 -57376 -17752 19953 43045 57068 48204 6676 -39048 -57041 -49368 -27736 8111
571 8111 46993 61851 43343 7705 -28040 -52783 -54852 -30695 7625 42648 58223 45300
583 45300 11402 -24505 -49332 -55749 -35352 5946 41803 53252 44584 20434 -18529 -52757
595 -52757 -55760 -30524 613 29961 53552 52146 18967 -21063 -43919 -49234 -37982 -5931 33653
608 33653 54066 46194 20469 -12489 -42408 -53878 -39199 -6276 29205 51069 48690 24461
620 24461 -8701 -38445 -53582 -42446 -8612 26188 45240 47153 30708 -4324 -39583 -51332
632 -51332 -37778 -12713 17643 45567 51798 28811 -5635 -32417 -46868 -43849 -17776 19319
644 19319 44313 46899 30997 2097 -29975 -48569 -43230 -18108 14282 40166 47574 33089 4247
657 4247 -26928 -46821 -44314 -20122 11548 36504 47145 37146 7405 -26004 -44165 -42400 -24672
670 -24672 5128 35741 47982 35351 8945 -18942 -40648 -45395 -26526 5558 32426 43615
682 43615 36914 13485 -17609 -40628 -43949 -27087 1712 29528 43724 38226 15720 -14620 -38648
695 -38648 -44068 -28714 -1681 25624 42568 39934 17561 -12310 -35038 -42357 -31350 -4966 24236
708 24236 41118 38656 19782 -8019 -33395 -43009 -31783 -6796 20297 38818 40088 22205 -6056
721 -6056 -30632 -41000 -33033 -9904 17730 37015 39438 23869 -3158 -28578 -40046 -33225 -12264
734 -12264 14641 35936 40068 24824 -855 -25176 -39008 -35568 -14796 12857 33452 38639 27238
747 27238 3262 -23045 -38114 -34968 -16452 8868 30759 38887 28218 4583 -20258 -35665
759 -35665 -35427 -18912 6984 29461 37622 28635 7411 -17361 -34861 -36080 -20070 4740 26587
772 26587 36522 30286 9879 -15563 -33283 -35193 -21559 1534 24384 36340 30774 11122 -12794
785 -12794 -30857 -35478 -23646 -308 22638 34676 31145 13860 -10158 -29722 -34984 -24175 -2860
798 -2860 19670 33597 31786 15102 -8124 -27317 -34176 -25520 -4818 18009 32233 31520 16794
811 16794 -5651 -25795 -33989 -26167 -6633 15476 30782 32162 18519 -3685 -23689 -32723 -27103
824 -27103 -9193 13394 29591 31675 19480 -1090 -21340 -32287 -27791 -10345 11179 27425
836 27425 31491 21264 789 -19942 -30932 -27885 -12499 8753 26202 31363 21878 2717 -17353
849 -17353 -29804 -28643 -14017 6951 24285 30567 23108 5094 -15630 -28954 -28531 -15220 4439
862 4439 22293 30367 24280 6610 -13776 -27304 -28441 -17106 2260 20889 29650 24387 8314
875 8314 -11150 -25805 -28738 -18309 681 19092 28397 24885 10161 -9286 -24663 -28513 -18943
888 -18943 -1010 17102 27426 25554 11782 -7701 -23373 -27781 -19757 -3309 15085 27081 25971
901 25971 12403 -5866 -20950 -27326 -21511 -4860 14246 25734 25134 14054 -3202 -19866 -27549
914 -27549 -21784 -5850 11914 24004 25591 15783 -1719 -18656 -26629 -21862 -7428 9611 22617
927 22617 25970 16992 -712 -17284 -25001 -22049 -9939 7689 22543 25831 16599 1224 -14207
940 -14207 -24666 -23930 -10633 7194 20219 24324 18667 3948 -13744 -24384 -22756 -11395 4226
953 4226 18511 24874 19468 4531 -12095 -22760 -22807 -12899 2461 17262 24699 20085 5431 -10614
967 -10614 -20799 -22735 -15196 881 17226 23825 18932 7327 -7245 -20559 -24321 -14836 880
980 880 14330 21893 21031 9500 -7474 -19892 -22260 -15562 -2298 13018 22507 20930 9710 -5341
994 -5341 -18049 -22509 -16606 -3440 11450 21643 21286 10428 -4143 -15972 -21885 -18408 -4730
1007 -4730 11547 20273 19555 12301 -873 -16062 -23155 -17170 -4591 7773 18234 22082 13850 -1802
1021 -1802 -14711 -20116 -18076 -8052 7195 18930 20766 13482 870 -12640 -20563 -18637 -8342
1034 -8342 5521 17470 20952 14147 1776 -10671 -19516 -19894 -9537 5449 15798 19124 15747
1047 15747 4637 -10859 -20069 -18087 -9413 1838 14141 21201 16315 3260 -9021 -16981 -19160
1060 -19160 -12280 1793 14544 19269 15843 6034 -7194 -17453 -19131 -12033 149 12607 19173
1073 19173 16444 6672 -5587 -16248 -19587 -12661 -3 11024 17466 17555 8610 -5725 -16169 -17766
1087 -17766 -12783 -3128 9779 18899 17325 7580 -3662 -13340 -18661 -14844 -2808 9664 16574 16738
1101 16738 10031 -2151 -13659 -18137 -14213 -4280 7734 16274 17236 10413 -971 -12256 -18023 -14715
1115 -14715 -4972 6129 15015 17788 11619 -551 -11452 -16344 -15007 -7251 5146 15341 17012
1128 17012 10963 1426 -9173 -16836 -16089 -6933 4607 13164 16584 12849 2433 -9282 -15972 -15308
1142 -15308 -8227 2601 12731 16780 12874 3336 -7664 -15285 -15713 -8921 1574 11511 16487 13469
1156 13469 4094 -6646 -14067 -15658 -10153 704 11117 15665 13227 5548 -5013 -14011 -15985 -10027
1170 -10027 -140 9289 15148 14307 6259 -4764 -12950 -15094 -10942 -1698 8827 15040 14035 6792
1184 6792 -3302 -12063 -15363 -11425 -2371 7635 14272 14384 7702 -2271 -11123 -14978 -12005 -3405 6725
1199 6725 13483 14169 8605 -1166 -10467 -14643 -11910 -4195 5345 12954 14546 8931 -659 -9313 -13896
1214 -13896 -12704 -5371 4878 12511 13984 9397 809 -8378 -14006 -12839 -5658 3729 11370 13992
1228 13992 10177 1623 -7631 -13336 -12869 -6490 2709 10731 13840 10624 2503 -6643 -12745 -12940 -7393
1243 -7393 1670 9990 13508 10720 3316 -5449 -12131 -13127 -7743 1125 9088 12894 11147 4245 -4905
1258 -4905 -11709 -12872 -8189 -32 8222 12950 11551 4773 -4065 -10973 -12871 -8850 -937 7418 12411
1273 12411 11618 5537 -3054 -10140 -12603 -9301 -1718 6734 11980 11666 6148 -2125 -9502 -12535 -9605
1288 -9605 -2395 5748 11285 11887 6864 -1350 -8806 -12092 -9951 -3321 4913 10930 11884 7204 -684
1303 -684 -7972 -11806 -10380 -3960 4292 10434 11665 7608 412 -7222 -11691 -10594 -4607 3334 9543
1318 9543 11567 8457 1235 -6581 -11070 -10478 -5307 2275 8986 11504 8530 1766 -5622 -10513 -10746
1333 -10746 -5844 1814 8450 11181 8910 2551 -4957 -10199 -10752 -6334 915 7720 10945 9173 3256
1348 3256 -4182 -9715 -10709 -6752 154 6908 10651 9563 3846 -3631 -9160 -10538 -7364 -687 6379
1363 6379 10528 9547 4396 -2487 -8398 -10644 -7730 -1182 5684 9746 9615 5188 -1984 -8153 -10274
1378 -10274 -7647 -1878 4867 9620 9852 5353 -1452 -7409 -10151 -8327 -2500 4397 9207 9796 5978
1393 5978 -567 -6822 -9923 -8483 -3249 3577 8740 9602 6253 236 -6006 -9730 -8687 -3590 2974
1408 2974 8004 9623 6909 757 -5737 -9251 -8507 -4271 2045 7742 9722 6936 1241 -4767 -8801
1423 -8801 -8948 -4723 1705 7143 9287 7305 2005 -4400 -8691 -8933 -5090 996 6603 9262 7729
1438 7729 2571 -3614 -8320 -8923 -5573 249 5865 8941 7859 3059 -3093 -7642 -8647 -5882 -451
1453 -451 5473 8770 7766 3362 -2327 -7152 -8874 -6286 -647 5074 8242 7984 4188 -1867 -7028
1468 -7028 -8691 -6398 -1425 4161 8048 8235 4374 -1301 -6301 -8444 -6827 -2020 3736 7684 8140
1483 8140 4832 -691 -5850 -8187 -6987 -2665 3112 7543 8073 5014 41 -5046 -8094 -7330 -2743
1498 -2743 2769 6638 7840 5716 438 -5092 -7795 -6914 -3407 1776 6732 8250 5566 767 -4030
1513 -4030 -7548 -7760 -3922 1777 6098 7586 6154 1777 -3775 -7363 -7345 -4134 830 5550 7719 6126
1529 6126 1926 -3030 -6913 -7547 -4340 585 4953 7319 6667 2582 -2941 -6595 -7124 -4849 -362 4755
1545 4755 7434 6429 2704 -2031 -6152 -7483 -5036 -385 4092 6934 6808 3379 -1827 -5941 -7104
1560 -7104 -5430 -1252 3647 6947 6832 3596 -1091 -5396 -7070 -5500 -1592 3012 6441 6907 3882
1575 3882 -795 -4767 -6631 -5836 -2042 2931 6297 6537 4094 -46 -4545 -6906 -5940 -2253 2235 5810
1591 5810 6863 4600 218 -4055 -6469 -6080 -2940 1781 5507 6554 4718 818 -3549 -6339 -6155
1606 -6155 -3085 1282 5164 6479 4896 1188 -3098 -6012 -6263 -3418 955 4668 6244 5204 1710
1621 1710 -2800 -5889 -5984 -3515 366 4250 6349 5346 1781 -2438 -5409 -6138 -4078 68 4170 6135
1637 6135 5397 2403 -1750 -5239 -6254 -4228 -443 3525 5808 5540 2698 -1477 -4822 -5945 -4358
1652 -4358 -785 3070 5661 5598 2945 -1123 -4505 -5822 -4576 -1249 2789 5491 5615 3198 -546 -4084
1668 -4084 -5783 -4918 -1489 2448 5130 5504 3566 -145 -3915 -5725 -4751 -1831 1837 4877 5696 3809
1684 3809 112 -3528 -5440 -5023 -2365 1446 4642 5576 3953 587 -3016 -5142 -5001 -2636 1103 4288
1700 4288 5371 4066 884 -2719 -5084 -5102 -2747 866 3975 5352 4368 1289 -2431 -4864 -5043 -3133
1716 -3133 309 3715 5372 4451 1598 -1917 -4547 -5128 -3419 -9 3371 5131 4423 1804 -1540 -4290
1732 -4290 -5139 -3634 -234 3071 4789 4507 2339 -1175 -4169 -5020 -3488 -711 2496 4712 4729 2381
1748 2381 -1023 -3652 -4795 -3894 -1007 2551 4668 4522 2707 -470 -3534 -4967 -4025 -1224 1976 4302
1764 4302 4734 3028 -128 -3214 -4750 -4096 -1578 1603 3973 4637 3243 118 -2916 -4483 -4055 -1909
1780 -1909 1251 3844 4679 3215 344 -2488 -4404 -4285 -2181 1042 3610 4462 3443 840 -2230 -4297
1796 -4297 -4303 -2410 700 3306 4483 3593 1080 -2059 -4167 -4237 -2570 281 3067 4512 3729 1346 -1734
1813 -1734 -3705 -4290 -2929 -18 2825 4270 3650 1577 -1244 -3576 -4279 -2940 -152 2552 4005 3805
1829 3805 1885 -1126 -3481 -4213 -2972 -501 2208 4066 4006 2066 -849 -3266 -4121 -3271 -881 1929
1845 1929 3900 3965 2225 -458 -2819 -4032 -3377 -1025 1754 3576 3829 2431 -125 -2752 -4085 -3425
1861 -3425 -1232 1353 3339 3989 2638 80 -2499 -3784 -3408 -1576 1018 3301 3938 2704 267 -2219
1877 -2219 -3683 -3549 -1785 957 3187 3847 2818 651 -1867 -3627 -3743 -1977 684 2833 3721 3099
1893 3099 953 -1699 -3466 -3518 -2096 231 2579 3708 3064 923 -1513 -3167 -3579 -2359 63 2482
1909 2482 3682 3119 1192 -1207 -3031 -3641 -2469 -178 2203 3410 3151 1555 -875 -2953 -3560 -2521
1925 -2521 -347 1916 3345 3326 1735 -735 -2725 -3429 -2636 -711 1631 3280 3340 1830 -424 -2431
1941 -2431 -3434 -2869 -850 1490 3041 3165 1989 -191 -2264 -3313 -2802 -951 1315 2902 3309 2177
1957 2177 2 -2153 -3256 -2950 -1267 1035 2809 3330 2269 335 -1850 -3130 -2936 -1415 709 2516
1973 2516 3302 2357 397 -1620 -2951 -2957 -1668 654 2463 3057 2427 802 -1397 -2961 -3059 -1563 259
1990 259 2112 3135 2622 830 -1334 -2692 -2923 -1941 133 2162 3016 2539 1101 -979 -2676 -3027 -1977
2007 -1977 -36 1853 2978 2769 1210 -809 -2382 -2912 -2163 -332 1675 2790 2700 1380 -538 -2298
2023 -2298 -2916 -2109 -490 1408 2695 2740 1494 -464 -2099 -2861 -2330 -694 1255 2589 2712 1712 -222
2040 -222 -1991 -2814 -2393 -898 1040 2507 2739 1759 -54 -1696 -2659 -2501 -1051 896 2312 2821 1910
2057 1910 230 -1599 -2628 -2464 -1138 671 2204 2736 1974 334 -1407 -2485 -2552 -1280 512 2028
2073 2028 2601 2064 474 -1242 -2419 -2430 -1464 352 1893 2662 2130 647 -993 -2365 -2643 -1525 221
2090 221 1681 2503 2249 986 -860 -2248 -2465 -1615 -95 1598 2502 2186 995 -693 -2016 -2488 -1767
2107 -1767 -240 1386 2425 2284 1103 -590 -1948 -2400 -1888 -491 1292 2293 2285 1178 -319 -1775
2123 -1775 -2469 -1932 -470 1074 2202 2317 1406 -221 -1691 -2310 -1975 -724 873 2156 2316 1452 -43
2140 -43 -1481 -2252 -1981 -824 749 1995 2333 1535 115 -1394 -2251 -2074 -974 650 1859 2217 1642
2157 1642 295 -1256 -2214 -2046 -1009 443 1761 2272 1765 388 -1119 -2027 -2144 -1208 284 1621 2160
2174 2160 1701 539 -871 -1996 -2180 -1275 115 1499 2169 1814 715 -768 -1884 -2176 -1394 47 1307
2191 1307 2020 1861 824 -646 -1822 -2036 -1406 -203 1185 2099 1915 839 -532 -1635 -2076 -1520 -239
2208 -239 1195 1998 1956 1011 -261 -1561 -2065 -1594 -391 969 1866 1923 1116 -165 -1441 -1996 -1591 -494
2226 -494 840 1803 1966 1196 -125 -1313 -1903 -1703 -693 693 1748 1984 1302 109 -1172 -1943 -1765
2243 -1765 -704 540 1548 1860 1352 209 -1101 -1865 -1744 -843 416 1482 1919 1447 256 -977 -1806
2260 -1806 -1772 -960 272 1398 1879 1493 380 -762 -1626 -1785 -1022 209 1357 1754 1475 545 -659 -1657
2278 -1657 -1749 -1072 97 1171 1759 1619 617 -646 -1579 -1695 -1210 -99 1102 1744 1586 735 -485 -1375
2296 -1375 -1719 -1310 -293 961 1672 1586 776 -331 -1337 -1706 -1309 -300 916 1541 1603 963 -180 -1275
2314 -1275 -1665 -1264 -402 687 1509 1661 1030 -208 -1110 -1595 -1386 -594 633 1503 1633 957 24 -988
2332 -988 -1645 -1518 -613 501 1344 1556 1177 197 -932 -1630 -1426 -610 392 1245 1538 1214 189 -893
2350 -893 -1479 -1432 -749 230 1213 1584 1163 270 -748 -1412 -1478 -868 189 1128 1529 1271 367 -580 -1322 -1449
2370 -1449 -949 85 999 1452 1312 536 -528 -1334 -1464 -964 -60 882 1466 1381 569 -405 -1180 -1452 -1031
2389 -1031 -196 814 1414 1327 630 -253 -1088 -1467 -1047 -257 707 1365 1288 738 -150 -1097 -1472 -1093 -305 597
2409 597 1282 1338 786 -109 -996 -1348 -1111 -419 535 1232 1342 765 -24 -821 -1230 -1224 -546 440 1186 1376 869
2430 869 94 -772 -1329 -1209 -518 342 1069 1253 984 184 -752 -1218 -1218 -639 238 1012 1297 956 263 -661 -1168
2451 -1168 -1213 -739 136 1006 1275 1052 312 -579 -1137 -1216 -795 121 832 1262 1039 391 -449 -1102 -1238 -788
2471 -788 33 797 1185 1161 498 -408 -1035 -1222 -861 -140 730 1204 1121 488 -298 -926 -1290 -916 -153 626 1123
2492 1123 1086 638 -161 -874 -1190 -908 -257 564 1128 1142 615 -106 -809 -1157 -934 -328 481 1050 1173 707
2512 707 -50 -762 -1158 -967 -395 399 1014 1075 800 49 -688 -1083 -1029 -504 320 1002 1088 801 144 -658 -1063
2533 -1063 -1051 -547 225 847 1095 891 179 -550 -1018 -1019 -619 177 854 1119 871 273 -486 -969 -1021 -644 13
2554 13 797 1109 898 293 -354 -886 -1009 -685 44 660 1083 977 446 -255 -787 -1092 -657 -36 605 997
2574 997 906 454 -227 -789 -1053 -728 -154 486 959 1028 481 -208 -782 -1016 -783 -186 447 915 998 541 -100
2595 -100 -729 -1016 -746 -249 379 890 944 614 -49 -709 -939 -836 -266 385 906 978 619 73 -596 -943 -852
2616 -852 -321 280 807 970 646 36 -523 -923 -834 -448 225 794 887 687 152 -511 -887 -877 -442 151 680
2637 680 925 711 260 -407 -864 -861 -494 135 660 938 737 238 -376 -810 -830 -544 15 629 830 775 306
2658 306 -293 -777 -843 -587 -19 501 814 803 341 -226 -722 -825 -640 -50 508 842 779 436 -194 -647 -873
2679 -873 -689 -179 469 727 745 439 -120 -611 -856 -705 -199 404 765 791 474 -89 -591 -809 -676 -260 268
2700 268 739 854 511 -43 -481 -746 -725 -308 217 687 818 525 69 -496 -742 -661 -340 232 624 811 555
2721 555 101 -416 -774 -758 -319 95 634 793 618 188 -421 -700 -681 -364 75 534 784 694 195 -317 -681
2742 -681 -774 -443 23 547 753 667 248 -236 -674 -777 -463 -63 502 702 636 267 -161 -624 -751 -523 -110
2763 -110 372 677 672 318 -165 -560 -681 -519 -127 334 711 646 318 -111 -502 -654 -548 -163 310 636 681
2784 681 405 -50 -417 -743 -566 -167 291 635 626 391 -55 -509 -626 -557 -244 153 552 656 459 -19 -452
2805 -452 -625 -631 -327 172 601 643 468 46 -293 -654 -608 -279 117 509 629 520 99 -247 -640 -601 -316 112
2827 112 491 647 510 188 -284 -555 -609 -383 15 390 637 498 145 -284 -557 -601 -463 -29 368 629 512
2848 512 201 -183 -442 -643 -428 -7 328 564 547 330 -177 -517 -562 -400 -90 320 610 515 316 -115 -445
2869 -445 -550 -415 -78 306 580 579 306 -72 -427 -582 -506 -182 262 537 497 340 -26 -348 -578 -505 -108 177
2891 177 448 534 378 -6 -339 -521 -497 -180 214 468 623 415 14 -311 -478 -512 -187 114 452 510 388
2912 388 90 -251 -493 -519 -207 111 392 522 448 94 -236 -506 -496 -291 -8 392 517 430 166 -234 -478
2933 -478 -447 -360 -6 347 468 452 155 -140 -405 -490 -331 -2 253 479 431 178 -113 -395 -454 -307 -66 263
2955 263 431 467 224 -168 -359 -470 -382 -65 246 463 437 238 -103 -398 -518 -362 -175 226 388 451 200
2976 200 -54 -357 -465 -428 -104 212 382 450 286 -15 -270 -433 -405 -146 206 385 428 314 -4 -298 -420
2997 -420 -414 -211 103 457 445 252 73 -213 -409 -422 -180 121 358 440 338 91 -168 -390 -374 -212 62 292
3019 292 452 385 105 -211 -355 -426 -216 59 284 471 372 115 -144 -328 -397 -254 -16 242 374 372 154 -140
3041 -140 -365 -378 -267 -18 170 415 344 131 -52 -349 -401 -283 15 200 380 383 186 -135 -313 -443 -271 -99
3063 -99 178 425 307 192 -31 -238 -413 -367 -69 165 373 421 270 55 -259 -422 -295 -106 118 386 352
3084 352 238 11 -231 -376 -346 -140 78 296 353 238 44 -224 -350 -339 -179 76 251 409 239 64 -225
3105 -225 -370 -304 -153 50 242 302 277 111 -190 -291 -310 -213 31 237 361 261 114 -123 -324 -322 -257 -26 192
3128 192 334 251 166 -105 -252 -345 -192 -101 177 299 241 137 -98 -268 -400 -247 -41 175 305 356 212 -58
3150 -58 -222 -288 -290 -55 115 245 327 232 -83 -218 -310 -215 -142 120 278 311 178 33 -167 -297 -227 -131 139 268
3174 268 344 207 28 -177 -311 -283 -80 121 253 312 185 8 -234 -270 -325 -97 101 256 372 211 82 -134
3196 -134 -296 -302 -151 54 228 343 255 83 -120 -226 -235 -109 55 293 312 245 83 -85 -233 -232 -148 -11 212
3219 212 311 312 86 -99 -223 -301 -219 -16 176 239 226 49 -116 -192 -227 -190 -38 136 254 266 104 -45 -246 -275
3243 -275 -192 -32 136 328 307 136 -39 -147 -244 -193 -8 141 286 205 160 18 -161 -263 -247 -75 117 223
3265 223 265 182 -3 -193 -275 -212 -90 106 272 252 161 10 -192 -335 -260 -89 70 223 243 188 42 -135 -203
3288 -203 -161 -158 23 243 182 180 80 -82 -227 -257 -135 60 191 281 178 77 -131 -216 -208 -102 57 137 284 179
3312 179 114 -120 -189 -213 -175 39 120 229 156 87 -84 -104 -253 -184 -18 172 243 251 106 -35 -184 -275 -115 -27 124
3337 124 194 264 151 -39 -111 -229 -202 4 131 172 246 148 -18 -197 -159 -225 -47 118 200 194 124 -15 -144 -205 -223
3362 -223 -99 92 169 267 125 -17 -118 -161 -168 -63 63 185 213 127 64 -131 -171 -137 -85 84 197 218 102 20
3386 20 -190 -224 -196 -101 6 204 213 187 89 -47 -178 -141 -140 47 143 195 146 67 -73 -172 -193 -69 37 141 161 196
3412 196 77 -87 -163 -253 -152 -3 139 168 135 62 -58 -156 -202 -140 -22 89 176 137 66 40 -111 -184 -145 -28 107
3437 107 214 196 138 -22 -158 -202 -171 -70 87 155 184 75 -6 -129 -205 -148 -13 27 170 184 129 -3 -111 -203
3461 -203 -209 -82 31 158 170 171 21 -62 -194 -129 -94 86 108 208 114 16 -96 -165 -141 -75 51 78 209 123 -5
3486 -5 -125 -144 -148 -110 3 136 148 147 64 -59 -171 -145 -115 -12 98 122 106 67 -63 -171 -203 -127 -19 96 138 162
3512 162 97 -49 -107 -175 -80 22 53 108 163 133 -20 -126 -136 -154 -70 53 107 99 134 -11 -79 -118 -100 -33 116 130 168
3539 168 91 -14 -64 -164 -139 -1 94 114 162 78 -29 -72 -73 -150 -17 49 141 126 41 -33 -107 -169 -128 -20 38 115 161
3566 161 86 46 -83 -119 -165 -84 2 106 133 138 22 -96 -96 -107 -91 54 149 150 102 8 -75 -132 -121 -85 2 27 97 118 69
3595 69 -40 -81 -131 -93 0 48 60 136 54 -20 -67 -172 -38 -38 145 133 70 79 -40 -75 -151 -105 -10 74 79 102 94 -10 -125
3624 -125 -82 -114 4 73 102 131 127 -33 -104 -115 -71 -33 112 67 135 79 -6 -83 -155 -137 -66 40 87 115 59 0 -72 -185
3652 -185 -137 -48 21 132 142 90 8 -31 -150 -80 -87 5 81 104 160 57 -68 -59 -70 -90 39 25 127 95 37 -38 -115 -133
3680 -133 -73 -39 116 125 96 -6 -33 -88 -77 -60 33 63 79 75 -18 -31 -52 -156 -70 -45 73 121 6 102 -57 -70 -110 -104
3708 -104 -7 18 94 45 59 -13 -72 -80 -91 -18 47 82 82 73 1 -50 -105 -65 -18 103 94 119 71 14 -41 -102 -42 -31 -6 89 93 77
3740 77 23 -5 -94 -81 -42 84 67 99 27 -6 -5 -73 -64 -37 79 76 92 83 20 -64 -50 -99 -58 2 16 129 96 27 -20 -84 -84
3771 -84 -52 -18 64 137 93 29 -67 -18 -58 -69 -17 85 33 55 1 -12 -58 -86 -82 38 9 59 106 61 14 -67 8 -53 -14 95
3801 95 88 50 44 30 -43 -14 -101 -2 10 74 87 2 22 -87 -104 -10 17 11 34 92 104 13 -84 -78 -86 -86 -12 37 107 53 12 -119
3833 -119 -57 -61 43 51 90 54 95 52 -15 -73 -56 -77 -57 42 69 16 40 -81 -34 -74 -75 52 57 93 74 -25 -22 -25 -103 -44 -56
3864 -56 0 36 6 -26 9 -38 -40 -46 -49 -12 68 34 36 -11 -74 -95 -48 -6 -9 73 75 101 52 -66 -56 6 -14 58 60 103 63 1 -40
3897 -40 -124 -74 -13 19 89 90 16 23 -73 -62 -19 -14 36 51 62 31 -32 9 -25 -78 -49 28 41 31 17 4 -52 -2 -36 -39 36 22
3929 22 44 12 24 -22 -81 -32 -1 -18 -5 62 61 5 -3 -84 10 -66 -15 -25 96 53 13 -6 -65 -30 -27 22 -36 26 76 52 42
3960 42 -44 -79 -1 -7 53 70 10 41 -13 -47 -51 -11 35 -12 64 93 -9 -29 -78 -93 16 -16 10 56 33 13 -3 -30 -60 -9
3990 -9 25 48 102 33 73 -33 -8 -63 -60 8 28 76 97 50 -33 5 -91 -43 -37 44 78 27 116 -19 -5 -46 -94 20 13 6 -8
4021 -8 57 -11 -43 -18 -5 19 11 81 63 40 13 7 -14 -14 -32 -33 31 4 60 -1 -19 -72 -73 13 -4 14 51 28 4 -30 -26 -68 -55 43
4055 43 39 96 97 45 1 -35 -23 -46 -34 47 60 -1 9 14 26 -51 -65 31 76 74 42 -29 -33 24 -35 43 -37 45 62 56 19 -36 12
4088 12 -70 -59 4 5 76 8 -15 -2 -44 -49 -28 -17 78 23 120 18 13 -9 -51 -41 -1 19 70 6 -16 -22 8 -16 -26 57 -32 26
4120 26 43 -26 -38 -6 -64 -29 -18 46 54 70 59 17 5 34 -34 -20 -18 23 38 48 -20 -79 -39 -59 -21 43 -7 44 -17 7 32
4151 32 30 1 11 -2 -2 58 21 15 -33 -75 -32 -69 -20 20 42 50 -28 -33 3 -39 -15 -7 49 -6 53 43 -8 2 -35 11 -1 18 22 10
4185 10 4 42 -65 -57 -21 -39 37 -6 -28 -24 19 -21 0 -21 -40 20 34 8 30 27 -19 9 -99 -36 -29 18 15 76 18 -6 -56 -73
4217 -73 -18 32 -15 -20 32 33 -4 -27 5 46 59 17 79 6 -17 -21 -25 -94 -29 9 45 49 34 6 -9 -42 12 -17 31 14 18 14 -5 38
4251 38 -42 23 -66 -15 32 31 14 20 2 -21 -16 -19 2 20 -11 71 -23 -24 56 -38 1 -32 36 43 34 28 -15 -16 -46 -25 -7 7 26 66 3
4286 3 21 -23 24 -63 57 34 24 -33 15 -32 -7 -70 -42 -45 -13 1 -42 45 28 8 18 -5 -29 -31 12 24 36 17 -10 42 -68
4317 -68 -36 6 -40 7 77 19 -11 2 -30 -51 -19 38 35 75 39 -4 -11 -55 -3 -37 20 9 64 28 27 -33 -3 -8 -47 -34 -36 38 1
4350 1 7 -12 -27 -39 -12 49 -5 42 51 35 9 -21 -11 25 73 -1 3 29 -30 -7 -20 -19 -85 8 83 10 44 8 7 -45 -49 -54 36 11
4384 11 -9 -18 37 -25 -1 11 -55 39 -28 56 1 9 17 -22 -52 30 32 -5 34 -7 42 32 -12 -69 -15 4 7 85 55 -45 36 20
4416 20 16 -69 2 -26 -16 -5 28 9 -51 -42 -26 8 -6 19 35 19 -11 -26 21 11 6 10 41 23 5 71 4 -80 -23 -15 19 86 0
4449 0 10 24 -13 -1 -12 25 15 5 43 34 13 17 -32 17 -15 17 -29 15 16 43 -28 -31 -38 -16 -23 58 20 51 -23 -33 25 26 -40 -4
4483 -4 16 -9 2 14 17 12 -17 -72 -34 62 59 19 37 -11 -5 -6 -8 19 -34 -14 -9 -59 -28 14 -38 9 3 31 10 -12 -13 14 12 16 -25 -33 28
4520 28 29 67 6 20 3 -6 -6 60 53 -29 34 65 24 -11 -14 17 14 8 68 -29 4 -26 10 -28 -27 -60 10 64 -28 28 -37 -35 -38 -5 6
4555 6 -61 -10 70 -19 12 51 -10 -12 -65 -29 67 -21 12 56 -2 15 40 -18 -20 39 31 41 15 9 -18 -3 -23 -20 48 9 31 76 17
4588 17 24 -4 1 1 -3 45 59 -76 21 -8 5 19 -50 46 -31 26 67 -33 67 21 75 11 16 23 1 75 8 23 -39 -45 35 0
4620 0 20 45 50 -12 4 38 -22 -14 -26 6 -7 -14 11 18 -10 -8 -24 27 -24 33 -17 -2 -3 6 -21 18 -8 10 15 19 43 26 -31 -8 37
4655 37 23 13 47 8 -41 -16 -57 23 -32 -8 5 -26 20 4 43 -29 -4 -22 -18 -12 -1 -24 -30 0 -33 -8 24 -24 34 -1 -2 1 16
4688 16 33 58 54 9 -8 -29 33 32 6 -4 -12 10 -28 -25 22 27 12 -24 -35 -35 18 5 65 -39 -30 -1 -72 -48 2 4 12 54 21 -26
4722 -26 -34 11 29 35 -4 0 -31 3 36 -44 10 26 0 18 -40 19 32 5 -13 -4 34 -21 -18 -58 -4 -38 3 20 -37 -12 34 -1 39
4755 39 -37 -10 44 35 29 13 30 2 -10 -75 -35 -22 -23 21 48 25 -7 -56 38 -10 13 -20 1 2 -13 -17 40 -4 17 1 31 38 45 -22
4789 -22 0 -6 -27 30 -53 16 -4 30 -9 -8 16 18 -42 33 -32 1 -20 -32 16 -26 25 -17 -19 46 19 4 -40 -27 -23 -25 8 11 42 0
4823 0 45 23 5 -56 27 -36 5 47 13 5 23 63 35 -28 22 35 29 -21 29 20 -2 -19 -25 30 -22 -19 -22 15 -19 2 -16 45 -14 34
4857 34 -2 45 -47 79 12 -29 26 -4 5 21 27 46 4 15 -10 15 20 -15 -44 -1 47 16 24 -22 -1 7 46 18 28 33 -5 -73 -42
4890 -42 -48 -26 -48 52 -16 27 15 -29 26 -33 32 -40 43 27 -31 23 15 27 0 56 22 -11 3 -59 -34 -75 -38 32 12 -22 -14
4921 -14 -18 -52 24 -42 -23 40 24 44 99 -3 9 -3 10 -31 -25 2 -31 4 34 13 -26 41 -3 0 -8 -24 11 33 -4 32 2 56
4953 56 19 75 24 30 49 16 34 40 3 25 -17 29 -38 18 -5 -20 -1 32 -11 -11 49 25 0 -22 33 -46 12 4 5 -16 23 23 -44
4986 -44 -26 36 14 55 33 30 23 4 -13 -36 10 72 1 26 18 -31 48 9 60 28 -13 -6 47 14 18 4 2 10 -46 -19 10 -10 -31 19
5020 19 9 8 -8 -53 -23 2 17 -13 25 0 -16 73 22 28 37 -39 7 -14 -1 -15 6 23 2 5 43 14 -16 -9 -16 -72 79 -46
5052 -46 15 -35 35 0 -1 20 42 -44 -12 54 -63 -8 1 -80 12 59 0 11 -30 18 -9 -4 -17 -12 20 27 48 -25 -12 -37 41 35 -29
5085 -29 101 66 40 30 10 -35 75 26 -23 52 51 13 30 -37 -4 54 -10 -14 36 11 21 -5 -7 -35 32 41 45 -23 3 27 -33 11
5117 11 -30 49 -51 -27 83 57 -51 -20 23 -21 20 -41 -1 21 46 5 -9 36 7 -37 7 13 -73 5 11 -41 -26 -24 -34 35
5147 35 -2 18 -25 -12 17 -49 11 -26 -20 -45 -3 -44 -13 -13 16 -49 8 8 35 40 6 29 60 -17 -8 -10 -23 -9 25 25 29 16 -40 -62
5181 -62 10 -19 17 -4 11 46 19 11 -2 -22 -27 18 -20 -54 70 9 -69 41 -18 15 -5 37 65 29 26 -23 22 -5 -50 53
5211 53 -34 33 -13 -7 -7 14 -20 31 3 44 25 12 13 -30 -2 -40 -1 -8 26 27 -24 -5 -33 -30 -25 30 -60 -34 42 -7 -19 10 -41 42
5245 42 -49 6 67 -19 -13 56 -26 45 1 24 -4 6 -3 36 24 -4 29 11 5 -39 -19 58 18 -1 -51 39 12 -63 20 -41 15 49
5277 49 1 38 -2 -44 -55 12 -30 5 24 37 -9 6 12 -44 28 -12 14 32 20 -26 -28 -21 0 -21 25 -4 22 -23 -54 -23 32 -19
5309 -19 50 -19 2 8 9 -8 -11 12 -19 -20 -3 -8 3 -9 7 6 -38 21 -36 14 -20 -29 58 -10 -6 -15 -33 32 35 31 16 4 10 4 22 -16 31
5346 31 -48 80 -6 -7 11 -5 -74 40 17 -13 44 -17 -3 8 39 35 -28 -2 1 -15 -11 16 -24 -8 -35 4 9 2 61 -32 45 12
5378 12 -12 -7 -1 41 5 13 49 47 5 5 67 31 22 -17 43 -8 10 -20 47 -4 -20 -9 7 -13 -5 19 -24 -39 18 -24 8 19 -19 14
5412 14 -27 -38 -28 7 20 21 55 5 -53 13 48 -54 13 11 20 8 63 39 4 105 25 -32 35 -19 34 50 -11 32 -41 47 -63
5443 -63 -31 14 13 -53 6 -10 52 -6 -63 5 -5 -20 -6 -29 -3 -49 30 21 -7 40 1 15 38 6 13 20 -20 -14 2 32 -10 -28 3
5476 3 -29 43 -9 36 -24 -43 -4 -16 11 -3 -7 23 17 5 -4 -16 11 17 9 29 -52 4 -10 4 -21 -43 10 -5 24 25 -22 9 2 25
5510 25 39 62 25 19 67 4 6 61 -18 -6 34 41 14 -45 10 23 14 -15 22 22 6 -20 -57 -10 -27 42 18 22 -10 0 50 16 -15
5543 -15 25 44 56 12 42 -56 7 -46 12 -34 -55 28 -28 15 18 -9 2 -32 35 60 8 20 -21 -33 -22 41 -6 7 -61 -84 -17
5574 -17 23 -60 -24 42 -65 40 -73 6 10 48 2 51 26 -34 75 28 11 30 47 -2 20 -8 -29 18 34 23 -69 -47 -17
5603 -17 -4 42 43 21 64 -11 -26 6 18 -27 -6 5 -22 -47 20 -1 -76 -18 -31 41 -4 53 -32 -11 38 35 11 36 24 -2 12
5634 12 22 -10 43 35 2 -26 -57 -31 59 -26 24 -43 44 -17 -12 -24 23 -6 4 24 -49 -9 -4 56 9 -7 -14 -4 -31 20 -25 33
5666 33 -16 27 -44 -54 -25 36 51 -34 -4 -24 32 -20 -2 4 -2 23 29 37 66 32 -27 2 -28 49 29 -1 -43 0 -27 -51 19 -19
5698 -19 20 -72 -30 4 -12 -16 -52 27 11 -43 -11 -20 14 31 39 54 6 19 -6 20 -39 -17 39 -17 13 25 -8 17 3 -8 -42 6
5730 6 -5 14 -4 59 -76 11 19 -27 8 -5 -40 -7 -23 7 -4 -8 6 -13 1 85 17 41 -3 -17 -20 -62 -9 19 -37 16 -35 -35
5762 -35 61 10 -17 -15 38 28 -54 11 2 -6 2 43 36 -14 -5 -37 -10 16 58 -65 35 -42 -37 -30 22 22 -2 -9 -21 51 33 18 25 48 -8
5797 -8 9 40 27 18 -8 9 -67 -18 -1 3 75 5 -9 12 24 -27 -8 -33 45 -14 13 16 32 32 10 -33 13 -35 51 -22 -54 3 -79
5830 -79 8 37 -83 51 0 -22 0 -6 -23 -12 -2 9 -7 -29 -47 -47 -19 21 -54 46 33 -21 -1 9 0 -19 30 2 31 40 25
5861 25 19 -14 -15 9 45 -1 1 13 -11 21 -11 -34 -45 10 -23 11 -4 30 3 2 41 29 35 8 -36 20 23 3 17 33 -24 -1 36
5894 36 71 61 -15 25 7 19 -2 17 -13 -34 7 -24 -20 41 -30 0 -31 -26 -9 -21 2 22 -26 -14 39 -2 20 34 -56 57 -27
5925 -27 1 -31 -11 22 -4 8 34 48 13 27 -24 56 -2 50 16 -24 -30 44 34 -31 16 -6 -33 7 53 -5 7 -40 21 -43 -16
5956 -16 13 -12 1 -32 -16 -9 -30 -39 -35 28 33 53 20 -23 8 21 -4 -8 -1 82 -3 -73 -14 2 12 21 2 6 -23 35 66 -21 -15 -9 33
5991 33 32 -7 68 4 31 19 -15 -45 -15 -21 11 27 2 4 26 -1 2 -22 49 -39 -29 62 -65 31 -39 83 -3 30 -16 13 28
6022 28 -5 -10 65 67 -11 38 8 -28 66 18 -1 -38 29 -2 -83 -37 -32 -29 -1 -44 -52 8 -1 0 -19 -24 -32 -25 42 -2 22 26 37 -13 38 28
6058 28 22 33 -24 12 -4 -8 -4 67 -41 -61 15 7 14 -3 64 37 34 -7 5 -23 -10 -17 66 -1 -29 51 10 14 -4 13 -1 -24 -8 -28
6092 -28 34 -72 -47 23 18 34 2 40 41 20 38 10 0 -34 2 14 4 12 -14 -13 -37 25 14 -14 48 -30 1 -35 -16 -24 45 26
6124 26 43 35 -12 18 -5 30 22 -64 -27 -44 -9 10 27 0 -20 -19 6 28 10 24 9 -37 43 2 -2 62 0 15 -18 -9 27 15 34
6157 34 1 -48 19 -7 -31 6 10 -11 -19 5 -22 -71 44 -25 1 -7 -30 -26 45 3 -24 -25 23 -31 81 24 22 0 -45 1 -7 -30 -3
6190 -3 16 4 37 23 34 -6 -19 4 -5 59 75 39 45 7 -7 -3 16 -20 1 -54 46 -16 -15 -26 -38 4 -7 18 -24 47 22 45
6222 45 -26 -55 -34 13 -14 13 10 2 -5 28 32 -9 10 -4 43 15 22 -27 24 -53 21 44 51 43 68 32 -20 52 23 -64 34 -3 -19 6
6256 6 -4 -2 39 58 -24 -31 17 6 14 16 -51 8 23 23 48 -57 -31 5 -12 -34 -6 -4 27 0 39 -4 45 36 8 10 25 0 4 2 -17
6291 -17 5 44 -36 7 51 -44 32 2 -51 19 -20 -12 15 -4 -25 8 21 14 10 -14 30 5 18 -30 -7 51 -13 -33 13 20 28 -6 14
6324 14 34 11 12 -18 -5 17 27 10 57 31 34 41 12 27 3 32 -15 33 -40 17 -21 27 29 34 -5 27 -3 31 2 2 38 18 -9
6357 -9 8 23 -51 22 3 -1 -1 -25 46 0 -12 -22 13 -5 29 1 23 -12 12 33 -7 27 3 36 -3 72 22 36 32 -11 -24 37
6389 37 1 -1 17 67 1 -13 6 12 13 35 -8 50 31 24 -5 -16 -5 5 19 7 -2 3 -53 17 -48 28 -7 -19 14 11 78 -19 39 13
6423 13 39 -36 -2 -50 -53 16 0 -64 -31 27 12 -23 32 51 -16 -18 3 1 27 -83 46 44 18 8 -44 -14 -51 62 -29 -31 51
6454 51 36 -5 -14 11 3 42 38 11 83 48 34 -60 32 2 8 29 59 -3 -13 77 41 -46 -66 7 10 -26 -45 -2 -25 -29 9 -10 2
6487 2 -47 53 29 -39 -7 -29 -37 35 30 -4 -4 48 -20 37 33 4 -36 29 11 -75 25 -8 -19 -29 0 -22 -30 -27 37 48 -13 -44 13
6520 13 9 -17 -6 23 -43 4 19 42 27 28 -23 38 24 -40 -27 47 -45 -42 -15 -4 63 33 -17 57 -1 8 -2 -35 1 42 66 -57
6552 -57 -12 50 -52 35 -79 0 31 37 -53 36 42 4 50 -6 23 14 18 27 19 39 -18 6 61 45 20 55 17 -32 36 -9 13 4 8
6585 8 29 4 31 7 70 26 26 -10 10 54 15 -21 4 -21 -8 1 15 19 41 26 -28 36 -1 76 -2 -8 6 13 -10 17 42 33 33 3
6619 3 14 22 13 8 -63 17 16 -24 41 -41 9 5 13 10 -13 -32 8 -50 4 -44 19 24 47 -14 -40 38 19 15 -25 31 -12 7 32 4 29
6654 29 42 49 0 62 -1 -29 9 41 -10 -10 23 -12 30 -4 12 -12 24 -15 10 -2 19 45 16 17 -17 4 -25 -11 -33 68 -18
6685 -18 17 15 -33 -24 -24 -11 -77 43 -16 1 -23 17 -31 32 39 -9 -34 58 -16 -9 14 -34 1 7 35 64 11 12 -27 9 6 -23 5 -13
6719 -13 17 -2 -40 -16 -10 59 0 20 23 20 -24 -62 21 21 45 38 50 9 62 7 -17 47 -33 -1 44 7 6 28 27 55 -4 -44 22 27
6753 27 -11 20 -3 63 26 -80 -27 -34 -57 17 43 11 8 54 -34 -53 -48 58 25 -44 58 -10 -7 -27 41 -11 13 3 -16 12 -8
6784 -8 40 51 15 -36 -3 58 0 6 4 -2 -19 28 -17 15 -3 45 -62 13 -20 38 -3 -19 16 -39 25 -1 4 -3 -2 37 -20 -57 -47
6817 -47 -16 2 33 7 22 7 28 -3 24 13 -45 14 7 10 0 -12 18 27 -11 6 -9 -1 -16 -100 -18 -12 -11 26 21 13 -4 44 3 8 0
6852 0 -27 -28 17 13 -2 19 58 -45 13 25 31 25 -28 -48 10 8 50 -21 46 39 -14 51 1 42 48 0 29 56 -26 -60 43 34 20 63
6886 63 -10 -44 -6 11 28 25 -39 2 14 -32 -43 -31 -22 7 -19 -26 -4 9 29 -26 -40 6 20 -17 -22 2 65 79 16 -6 -24 -4
6918 -4 4 -13 -23 68 31 -14 -13 67 32 37 -44 -3 5 10 21 14 0 36 27 -20 -42 -71 -34 38 13 58 10 4 -39 5 -3 27 20 -11 36 -55
6954 -55 24 17 17 -71 -23 52 -10 1 4 -7 -13 -17 3 0 -7 -8 22 -9 -28 -61 29 52 -23 -54 13 -10 -40 21 11 4 -19 69 9 -24 10
6989 10 41 1 21 45 7 44 -43 3 14 36 -28 -20 2 -17 41 27 48 13 66 9 -14 -15 8 4 33 29 -6 41 -26 -22 -9 -22 57
7022 57 15 34 25 0 8 51 18 17 12 77 41 21 16 7 -2 -16 2 18 45 2 13 31 41 -11 18 12 43 17 -24 28 36 -4 1 4 19 7
7058 7 -28 -10 -28 -21 29 -38 -64 -36 -28 37 -18 -17 15 -19 -10 -37 0 -43 23 36 -10 6 5 -15 34 -26 -16 44 -20 32 -7 35 -23
7091 -23 20 6 40 75 41 30 -3 -32 -3 -27 33 32 0 -6 -51 -1 13 -3 25 17 -10 -8 -14 1 1 5 34 -9 5 91 13 90 22 -4
7125 -4 -8 -10 33 22 -20 63 31 29 27 -11 -80 46 31 17 11 -23 -57 29 2 -51 -19 -64 -33 -27 -15 -6 -13 51 21 17 -57 -41 -26 -26 -2
7160 -2 -24 -30 -10 -44 -17 36 -26 -28 9 25 4 -29 -5 -7 -31 18 35 38 -4 13 6 -54 24 -14 -42 -48 13 -2 -10 -13 19 -17 -31 20 -8
7195 -8 -31 7 -22 15 -17 -30 -14 -22 42 -52 10 26 21 -5 37 3 82 -69 96 -4 31 -5 -32 -47 34 -6 5 -27 -5 9
7225 9 82 15 -21 -4 10 26 -21 -2 -68 -15 20 2 -20 10 51 33 -8 7 1 -13 -48 6 1 26 -30 -20 -30 -13 -13 -17 -41 24 3
7258 3 25 -25 1 -40 8 26 41 9 12 41 35 -11 42 -28 -1 23 -27 -23 38 13 -7 31 22 -5 25 -39 -54 16 -35 -53 -3 6 -18
7291 -18 4 0 46 19 6 25 -5 8 -43 -30 34 -21 1 25 6 -8 7 24 29 8 -17 7 53 28 27 6 -13 25 -24 27 17 30
7323 30 -2 -10 -61 23 37 -22 -10 -18 36 7 28 46 -31 -19 17 -3 20 27 10 -31 12 -24 40 -1 -70 36 -53 0 6 6 38 -43
7355 -43 28 64 -16 -24 -45 -17 5 -39 13 -61 -16 -14 -36 31 15 -10 -29 -2 22 10 -67 21 0 -28 -27 2 20 -1 -1 -5 54 -32 -27
7388 -27 -37 -11 -10 -17 46 8 22 17 -21 -11 61 -35 6 -3 -55 -62 14 -31 6 -42 16 25 12 18 -38 3 -14 46 13 -34 -2 -14 -2 33
7422 33 -37 21 8 -30 13 -32 -16 -9 14 47 0 -4 5 31 30 2 22 14 -31 25 54 -4 -72 37 -1 43 -43 -17 10 -11 -41 34
7454 34 20 21 -8 -29 8 17 -61 23 29 -48 26 -13 13 58 7 -11 3 -15 -12 -21 -46 4 -8 56 -12 44 0 -39 69 27 30 -26 -8
7487 -8 -8 22 -28 -27 30 -19 -9 17 -34 -11 3 -14 -23 30 -10 -34 19 68 54 1 58 29 62 -13 37 48 25 7 12 -30 -26 -28 24 5
7521 5 0 -5 6 27 2 21 -15 41 3 -12 -4 12 -10 -38 -15 42 -13 -23 -18 -19 46 33 30 -33 40 7 6 -36 -2 28 8 -25 45 -2
7555 -2 38 66 69 -34 14 -40 -38 21 15 -39 -47 -53 -7 4 -46 7 -8 -6 -2 -67 6 18 -16 -16 -19 29 47 -20 -55 2 46 37 -35 74 -17
7590 -17 -19 -4 15 14 29 -2 -23 -92 -6 58 1 -9 60 10 36 -32 -56 65 -8 44 53 -23 48 -22 41 15 -35 -5 46 -28 22
7621 22 -35 -6 -13 22 10 50 -15 4 -27 -12 5 -9 -16 18 -87 5 57 -1 22 5 47 -18 -10 12 14 2 7 5 47 15 4 -30 -22
7654 -22 -35 -20 -18 -16 36 6 8 -18 22 -12 -14 -30 -122 47 -41 -5 -42 -12 49 3 60 5 -1 3 -34 -22 31 -59 16 9 -36 -3 48
7687 48 16 -13 -6 39 17 36 0 -40 8 7 10 -4 5 23 -13 -10 -40 39 60 -22 -75 -20 -15 -25 46 28 1 -14 -7 -8 -33 2 19 -55
7721 -55 24 10 2 -5 23 23 -6 33 48 11 -31 -20 -16 -6 -28 -60 -26 13 46 34 -10 10 -7 63 -9 13 -5 -5 -12 13 -6 -51 -62
7754 -62 -50 -2 26 28 27 -23 -19 26 16 -19 18 -6 -27 9 30 37 -1 -15 -16 6 22 53 -31 -15 -19 -20 38 -49 21 101 4 8 -17 -29
7788 -29 31 4 -11 37 3 -37 28 -11 33 23 74 -36 57 4 61 50 -34 3 -15 9 -19 -25 -17 -32 18 28 -63 -5 -10 11 37
7819 37 10 -29 4 6 6 1 23 12 -20 -4 5 -2 38 35 -5 -26 26 -26 -48 5 -2 -7 16 -14 -33 -13 18 -16 7 -27 -15 24 58 -27
7853 -27 24 41 15 -11 21 32 6 -27 27 7 -62 25 -16 20 19 30 44 -46 -51 -5 30 -15 -11 -38 -9 0 -57 -19 17 -15 49 -16
7885 -16 41 -27 -2 -28 10 30 -91 -31 5 -14 -2 27 48 0 -39 19 11 42 -13 31 -22 -4 19 22 -50 -23 52 -13 44 2 78
7916 78 29 27 -4 48 18 17 4 -32 -40 -9 5 19 25 -1 38 36 47 -4 10 34 36 -15 3 -10 19 33 51 15 22 -7 4 -20 13 -28
7950 -28 -10 -14 -26 -18 17 -19 42 -19 -11 -41 -30 7 4 -9 -2 2 34 12 18 -28 68 -14 15 -26 34 13 60 3 -21 15 3 9 4 13 -6
7985 -6 7 2 -51 7 25 5 -7 6 52 -4 -5 1 2 -8 -3 69 -33 10 -25 -7 -17 -14 8 -21 0 14 20 -18 -17 7 3 -6 44 -22 25
8020 25 26 -25 3 -16 1 44 4 -28 6 51 12 -41 23 60 -74 -30 -5 -10 42 -8 -1 -27 2 13 12 -80 -63 3 -48 36 27 -54
8052 -54 27 -42 -31 16 -7 3 -29 26 -17 72 12 39 35 8 2 -63 0 14 32 -20 -44 -7 -40 -14 2 11 -14 -36 -47 -23 20 -15
8084 -15 28 11 -18 -49 20 0 -31 -49 -37 -18 -34 18 -21 1 10 -7 6 -13 13 24 -31 10 3 47 78 1 8 -32 -13 -51 27 21
8116 21 85 -27 -14 17 0 28 -38 -33 -66 -19 -5 -33 7 -3 58 21 -28 16 14 3 14 -15 -18 -20 -14 4 -9 32 -5 -15 9 13 33
8149 33 28 0 -16 3 3 -24 42 -11 10 -49 -10 5 77 -34 48 -36 1 -22 -101 -5 -8 -44 -24 -31 -50 62 -27 -2 39 -1 60
8180 60 -19 3 50 -31 29 0 -18 -19 6 -36 23
8191B3
$$ Imaginary data points
##PAGE= N=2
##DATA TABLE= (X++(I..I)), XYDATA
0 0 0 0 0 0 0 0 0 0 0 0 0 8 -8 8 -8 16 -16 24 -24 32 -40 48 -56 64 -72 88 -100 116 -136 152 -176 200 -224
33 -224 256 -288 328 -366 408 -456 512 -568 631 -699 774 -857 946 -1043 1152 -1267 1396
50 1396 -1539 1696 -1871 2063 -2280 2526 -2803 3126 -3500 3940 -4472 5125 -5951 7036 -8526
65 -8526 10718 -14253 20947 -38141 180421 326825 14740 -62139 -161653 -296245 -297782 -17044
77 -17044 196880 242496 222003 173509 -28494 -229380 -276219 -189227 -65211 119018 262926
88 262926 254916 123048 -20671 -176373 -279916 -225801 -45801 107543 209866 258977 176862
99 176862 -28522 -183226 -220952 -203875 -115006 85002 248531 233802 119766 15740 -117404
110 -117404 -254980 -245037 -71974 97414 181668 218776 187149 40345 -142914 -237302 -211753
121 -211753 -103900 41286 165648 218749 181626 55250 -112027 -212722 -189406 -96730 12215
132 12215 138340 225229 176602 23815 -104403 -168231 -193003 -137056 20981 169025 202463
143 202463 152782 68141 -62758 -193268 -213985 -115490 9042 111694 188354 188475 78089
154 78089 -70835 -163392 -179322 -130826 -21502 109463 187225 171148 77552 -47943 -148957
165 -148957 -180453 -135076 -32388 93499 180301 170669 79615 -29269 -120627 -174851 -148231
176 -148231 -33729 91272 152421 149094 95494 -11675 -129026 -174424 -126300 -32907 66800
187 66800 149544 169509 99434 -18471 -116975 -162073 -142858 -58277 57862 145399 162788 107284
199 107284 5785 -95491 -151684 -140673 -66516 41716 129738 149798 100609 13879 -80215
210 -80215 -145847 -140158 -60216 41580 115263 143688 113594 22383 -84170 -141950 -131823 -71903
222 -71903 19610 110740 149332 111611 26316 -64357 -128619 -137179 -78805 16966 100896 138671
234 138671 115101 37246 -58283 -124757 -135441 -86717 3938 93875 136577 116923 49844 -40032
246 -40032 -116048 -135777 -88509 -6022 73664 123758 118971 53568 -36622 -103110 -122179 -89764
258 -89764 -13181 73733 122823 112331 54386 -27588 -102056 -129530 -93867 -17617 63479 119040
270 119040 122252 66315 -19158 -91133 -122791 -102144 -32398 53907 110479 114484 70739 -4989
282 -4989 -82517 -119971 -97769 -33561 42355 102421 117577 74217 -3525 -74801 -112345 -102485
294 -102485 -44194 36964 98000 111588 77166 8886 -65874 -109655 -99969 -45253 27994 89558
306 89558 110637 78937 10540 -61431 -105901 -102642 -51341 23696 86913 111242 86136 20886
318 20886 -53983 -102323 -104308 -61119 9965 77502 107178 86379 29066 -39959 -92568 -101815
330 -101815 -60992 6411 67509 99051 86940 31808 -39690 -89482 -97276 -64051 -1121 66105
342 66105 102025 87803 35745 -29502 -83892 -101987 -70164 -5450 57680 93655 90192 45041
354 45041 -24037 -80283 -96227 -69917 -14308 50098 93597 91376 45830 -17813 -71923 -95986
366 -95986 -76908 -20288 45369 87247 89208 53153 -6925 -65477 -93026 -75349 -23980 35887
378 35887 79501 87667 54426 -5255 -61645 -88366 -74938 -27638 33110 79515 89088 57586
390 57586 100 -57429 -88905 -80137 -35409 25080 74713 89891 62969 8371 -47745 -82478
402 -82478 -81300 -41426 19099 68180 83392 62723 15459 -41968 -81659 -79750 -39934 13909
414 13909 60775 84057 68625 17689 -40538 -75969 -77657 -47527 5509 58703 83302 67069
426 67069 21375 -31879 -71048 -78928 -50229 2854 55072 80427 67739 25734 -26225 -68779
438 -68779 -82147 -54744 -89 49960 75030 71415 37125 -20006 -68337 -78207 -52616 -10669
450 -10669 37027 74446 74747 34093 -18398 -56256 -72147 -59192 -14322 40351 71921 68335 37058
463 37058 -10263 -55815 -76215 -60334 -16613 34472 69152 71096 42154 -3509 -50035 -76397
475 -76397 -63482 -18672 28413 59535 70708 51110 -411 -51870 -69858 -56972 -27856 16872
487 16872 63264 75931 45380 161 -37824 -65036 -67919 -33062 20314 57819 66116 49528
499 49528 11802 -34918 -66426 -64629 -31907 14312 51677 65015 51820 15594 -32976 -67273
511 -67273 -63796 -30936 7490 43763 69719 60982 14402 -33552 -56070 -60147 -45808 -2056 49498
524 49498 68148 50331 20248 -15822 -54682 -68721 -41875 2674 38059 58611 57667 26600
536 26600 -19703 -53377 -61616 -44362 -5734 36705 59596 56026 30142 -12419 -52216 -62729
548 -62729 -42203 -9860 26087 58778 63032 28613 -15131 -41851 -55192 -52500 -17885 32961
560 32961 59181 51823 31373 965 -40547 -65631 -50557 -12073 22334 47448 58612 40740
572 40740 -1392 -39968 -55992 -48492 -21155 17156 48264 56514 38808 2236 -35582 -54501
584 -54501 -48127 -23386 12754 47774 58863 37910 3168 -27944 -51237 -55570 -28184 15286
596 15286 44195 50731 42160 14983 -26859 -55324 -50640 -25014 5147 35716 55501 46065 11469
609 11469 -24727 -46741 -50249 -32252 2467 36523 52932 44835 15998 -19927 -44953 -49750 -34378
622 -34378 -2268 34017 52376 43034 17185 -12963 -41184 -53309 -35913 7 30298 45542
634 45542 45818 24867 -13126 -43777 -49191 -34194 -8237 24201 49071 48399 23151 -9357 -35896
647 -35896 -48520 -39708 -10742 22940 44732 45937 26581 -4890 -33739 -47016 -39671 -13488 20095
660 20095 43138 44822 27942 -428 -31150 -48352 -40258 -13736 15641 38407 46947 32518 252
673 252 -29918 -43618 -39738 -19845 11766 39318 46120 30864 3893 -24334 -43150 -42322 -20785
686 -20785 10154 35628 44714 33501 7238 -21925 -41483 -42475 -23257 6982 32696 42931 34690
699 34690 10957 -19195 -40208 -41215 -23822 3147 29402 43119 35771 11480 -16801 -37035
711 -37035 -41688 -26906 1322 28309 41350 36183 15222 -13296 -36155 -41624 -27910 -2102 24495
724 24495 40093 37161 17225 -10242 -33258 -41069 -29256 -4221 21629 37834 37685 19785 -8244
737 -8244 -31505 -39470 -30191 -7911 18905 37516 37662 20488 -4821 -27953 -39213 -32103 -9393
750 -9393 16758 34572 37198 23147 -2130 -26684 -38054 -31900 -11902 13486 33396 37898 24233
763 24233 -312 -23812 -36555 -33348 -14652 11316 31717 36905 25371 3020 -20785 -35751
775 -35751 -33825 -15755 8834 28769 36070 27101 5037 -19345 -34123 -33099 -17644 5944 27413
788 27413 36065 27460 6766 -16466 -32534 -34044 -19409 4213 25278 34687 28619 9390 -14381
801 -14381 -31245 -33467 -20596 1419 23036 34135 29174 10903 -11973 -29266 -33492 -22204 -498
814 -498 21138 32759 29521 13036 -9535 -27941 -33063 -22905 -2776 18519 31696 30172 14371
827 14371 -7692 -25693 -32200 -24284 -4885 16995 30570 29841 15953 -5111 -24143 -32220 -24931
840 -24931 -6374 14543 28936 30419 17748 -3192 -22317 -30954 -25781 -8944 12312 27801 30085
853 30085 18668 -878 -20036 -30366 -26590 -10242 10435 25900 29670 20206 1361 -18461 -29560
866 -29560 -26571 -11715 7993 24239 29791 21359 2803 -16570 -28020 -26873 -13647 5924 23002
879 23002 29239 21826 4664 -14323 -26931 -27276 -15034 4297 21432 28444 22528 6642 -12334
892 -12334 -25992 -27497 -15870 2524 19262 27527 23682 8447 -11084 -24737 -26561 -16953 -137
905 -137 17625 27704 23841 8962 -9052 -22498 -26662 -18825 -1407 16693 26339 23741 10874
918 10874 -6616 -21555 -26899 -19454 -2730 14798 24913 23943 12769 -4666 -20644 -26644 -19441
931 -19441 -4150 12025 23655 25182 14033 -4155 -19020 -24717 -20380 -7051 10850 23840 24312
944 24312 13933 -1278 -16384 -25264 -21835 -7283 9726 21331 23774 16066 485 -15844 -24532
957 -24532 -21457 -8696 7570 20101 23867 17207 2065 -14750 -23845 -21124 -9878 4821 18738
970 18738 24887 17869 2075 -12723 -21125 -21969 -12741 4289 19040 23093 17059 5087 -10028 -22072
984 -22072 -22757 -11929 3106 15973 22573 19185 6105 -9834 -20542 -21913 -13456 1051 14963
997 14963 22135 19450 7531 -8391 -19774 -21228 -14084 -1400 13476 22844 19605 7143 -6225
1010 -6225 -16849 -22137 -16748 -1198 13694 20114 18686 10665 -3904 -18118 -22056 -14934 -2959
1023 -2959 9921 19897 20699 10708 -3918 -15633 -20751 -16744 -4702 9543 19024 20165 11955 -2298
1037 -2298 -14908 -19913 -16877 -6771 7839 19311 19963 11427 -167 -12042 -20610 -18745 -6168
1050 -6168 7697 16151 19020 14611 1433 -13269 -19755 -16580 -8052 4197 16292 20590 13846 1499
1064 1499 -10462 -18299 -18318 -9307 4080 15070 19382 14825 3123 -9655 -17528 -18062 -10668 2725
1078 2725 14839 18699 14276 4879 -7386 -17977 -19013 -9910 2142 11983 18086 16719 5794 -8152
1092 -8152 -16438 -17042 -11756 -741 12138 18804 15514 5941 -5228 -15005 -18345 -12438 -644 10748
1106 10748 17286 16173 7458 -4518 -14319 -17807 -13197 -1988 9968 16601 15898 8817 -2891 -14132
1120 -14132 -17909 -12744 -3011 7513 15988 17371 9288 -2917 -12255 -16337 -14214 -5059 7536 15948
1134 15948 16022 9700 -407 -11201 -17177 -14410 -5019 5938 14238 16421 11062 247 -10365 -16061
1148 -16061 -14598 -6279 4898 13525 16132 11521 1465 -9580 -15760 -14420 -7127 3226 12847 16505
1162 16505 11801 1931 -8068 -14587 -15220 -8443 2848 12280 15422 12174 3733 -7004 -14765 -15020 -8400
1177 -8400 1476 10663 15438 13014 4182 -6273 -13570 -14875 -9441 473 10065 15026 13114 5255 -5089
1192 -5089 -13016 -14767 -9887 -682 9002 14623 13244 5827 -3908 -12023 -14905 -10544 -1287 8140 13777
1207 13777 13502 7086 -3137 -11754 -14383 -10636 -2586 6859 13725 13872 7316 -2213 -10282 -14015 -11565
1222 -11565 -3432 6243 12904 13405 8142 -944 -9613 -13867 -11638 -4023 5274 12198 13542 8688 -85
1237 -85 -8848 -13587 -11945 -4912 4251 11530 13665 9287 644 -7990 -12876 -12181 -5907 3373 11057 13323
1253 13323 9401 1667 -6935 -12651 -12572 -6300 2576 10036 12980 10146 2556 -6198 -12117 -12407 -6962
1268 -6962 1501 9269 12767 10492 3334 -5282 -11511 -12210 -7488 686 8543 12576 10654 3854 -4537
1283 -4537 -10905 -12329 -8060 -120 7886 12205 10890 4801 -3539 -10361 -12334 -8520 -992 6799 11609
1298 11609 11183 5459 -2806 -9673 -11938 -8830 -1925 6046 11301 11279 5902 -2063 -8806 -11727 -9396
1313 -9396 -2654 5503 10895 11138 6490 -938 -8140 -11654 -9594 -3126 4580 10147 11261 7219 -377
1328 -377 -7666 -11192 -9728 -3964 3701 9809 11290 7479 450 -6714 -10934 -10172 -4616 2888 9156
1343 9156 11062 7935 1268 -5989 -10459 -10206 -5168 2205 8491 10730 8201 1953 -5327 -10197 -10170 -5463
1359 -5463 1515 7728 10735 8687 2388 -4716 -9586 -10121 -6300 636 7487 10510 8681 3145 -3668
1374 -3668 -9127 -10358 -6572 182 6498 9965 9050 3888 -3241 -8717 -9970 -6913 -779 5870 9881
1389 9881 9242 4291 -2417 -8067 -9987 -7366 -1345 5178 9395 9233 4701 -1842 -7404 -9730 -7682
1404 -7682 -1938 4839 9132 9143 5257 -964 -7005 -9973 -7956 -2348 3922 8444 9469 6022 -512
1419 -512 -6474 -9280 -8045 -3333 3132 8252 9307 6015 187 -5618 -9085 -8363 -3620 2743 7717
1434 7717 9147 6442 856 -5191 -8890 -8432 -4070 2047 7209 9014 6725 1519 -4661 -8632 -8478
1449 -8478 -4384 1404 6547 8961 7208 1872 -4254 -8081 -8398 -5082 698 6312 8838 7164 2430
1464 2430 -3163 -7687 -8752 -5454 287 5586 8308 7463 3146 -2819 -7393 -8312 -5533 -319 5026
1479 5026 8239 7525 3351 -2342 -6965 -8398 -5950 -902 4491 8021 7904 3951 -1819 -6408 -8043
1494 -8043 -6402 -1708 4172 7828 7526 4184 -787 -5790 -8370 -6565 -1746 3479 6992 7875 4982
1509 4982 -670 -5721 -7678 -6566 -2755 2831 7256 7826 4739 50 -4732 -7702 -6998 -2729 2447
1524 2447 6478 7605 5379 383 -4558 -7277 -6972 -3474 2015 6379 7458 5484 1223 -3856 -7462
1539 -7462 -7202 -3489 1299 5419 7524 6115 1500 -3524 -6646 -6955 -4226 703 5366 7134 5748
1554 5748 2045 -2793 -6611 -7086 -4131 391 4659 7098 6281 2390 -2574 -6265 -7055 -4676 -136 4340
1570 4340 6764 6391 3009 -2053 -6014 -6854 -4832 -797 3732 6859 6583 2988 -1600 -5283 -6878 -5346
1586 -5346 -1160 3526 6382 6373 3698 -904 -5057 -6707 -5283 -1654 2810 6089 6456 3758 -651 -4606
1602 -4606 -6446 -5560 -1939 2581 5867 6439 4108 -171 -4271 -6347 -5743 -2423 2107 5645 6462 4327
1618 4327 448 -3600 -6274 -5936 -2672 1733 5039 6143 4719 849 -3484 -6002 -5736 -3024 1042
1633 1042 4786 6315 4786 1073 -2930 -5629 -5904 -3390 773 4543 5979 4861 1668 -2486 -5521
1648 -5521 -5917 -3498 370 4119 5952 5125 1936 -2202 -5309 -5906 -3853 -46 3753 5850 5376 2288
1664 2288 -1731 -4867 -5722 -4190 -687 3361 5682 5225 2544 -1163 -4443 -5719 -4325 -746 2986
1679 2986 5199 5227 2953 -908 -4380 -5662 -4372 -1228 2503 5163 5401 3244 -498 -4000 -5499 -4598
1695 -4598 -1575 2048 4826 5379 3440 -145 -3570 -5336 -4701 -1974 1830 4676 5395 3613 415 -3215
1711 -3215 -5323 -4831 -2147 1366 4251 5196 3889 679 -2927 -4947 -4734 -2403 952 4081 5182 3956
1727 3956 880 -2568 -4770 -4800 -2787 662 3929 5175 4085 1251 -2066 -4598 -5084 -3071 450 3402
1743 3402 4837 4336 1807 -1849 -4402 -4799 -3195 -186 2997 4863 4381 1827 -1511 -3946 -4793 -3550
1759 -3550 -435 2868 4672 4312 2125 -1111 -3799 -4769 -3672 -709 2502 4436 4381 2387 -695 -3576
1775 -3576 -4753 -3641 -891 2187 4287 4540 2712 -453 -3367 -4574 -3796 -1464 1776 4209 4527 2856
1791 2856 2 -2805 -4457 -4011 -1687 1529 3819 4315 2926 236 -2713 -4377 -3983 -1769 1230 3583
1807 3583 4386 3249 448 -2516 -4224 -3991 -2074 801 3372 4479 3386 714 -2167 -3929 -4070 -2439
1823 -2439 571 3252 4286 3402 1099 -1726 -3817 -4154 -2516 325 2872 4034 3554 1400 -1538 -3720
1839 -3720 -4045 -2637 -54 2486 4066 3651 1569 -1311 -3401 -3905 -2816 -369 2421 4004 3670 1687
1855 1687 -990 -3258 -4076 -3113 -501 2187 3822 3688 2084 -561 -3058 -4032 -3082 -770 1726 3510
1871 3510 3808 2261 -342 -2799 -3817 -3112 -1141 1486 3463 3815 2267 -247 -2533 -3699 -3298 -1376
1887 -1376 1348 3343 3715 2441 210 -2203 -3790 -3404 -1413 1051 3015 3660 2698 396 -2153 -3600
1903 -3600 -3356 -1648 774 2902 3685 2881 636 -1900 -3353 -3416 -1944 433 2698 3638 2842 852 -1493
1920 -1493 -3164 -3432 -2062 277 2460 3408 2961 1120 -1354 -3136 -3434 -2172 67 2246 3438 3063
1936 3063 1239 -1198 -3009 -3394 -2323 -187 1976 3383 3135 1411 -863 -2662 -3381 -2531 -436 1865
1952 1865 3234 3035 1611 -555 -2537 -3327 -2553 -641 1551 3053 3175 1817 -365 -2307 -3311 -2672
1968 -2672 -824 1345 2865 3053 1965 -181 -2249 -3162 -2613 -1069 1091 2800 3219 2015 -51 -1946
1984 -1946 -3107 -2910 -1293 983 2630 3015 2217 409 -1765 -3038 -2785 -1355 624 2445 3114 2278
2000 2278 400 -1576 -2760 -2863 -1598 593 2313 2968 2351 700 -1332 -2794 -2888 -1668 239 2081
2016 2081 2953 2442 826 -1140 -2570 -2922 -1791 52 1914 2835 2517 1006 -970 -2526 -2882 -1930 -156
2033 -156 1760 2806 2631 1244 -718 -2322 -2839 -1994 -337 1515 2636 2656 1405 -560 -2129 -2672 -2069
2050 -2069 -463 1267 2615 2652 1465 -365 -2034 -2708 -2250 -730 1230 2500 2656 1610 -96 -1860
2066 -1860 -2637 -2298 -919 960 2332 2616 1670 82 -1688 -2605 -2293 -970 805 2182 2646 1805 137
2083 137 -1502 -2520 -2378 -1149 647 2181 2533 1910 320 -1310 -2424 -2458 -1209 492 1862 2532 2043
2100 2043 540 -1252 -2358 -2380 -1425 234 1746 2473 2058 711 -991 -2255 -2412 -1471 60 1536 2446
2117 2446 2189 831 -871 -2059 -2375 -1655 -70 1492 2336 2139 984 -608 -1961 -2419 -1680 -197 1279
2134 1279 2281 2233 1011 -497 -1864 -2337 -1776 -358 1231 2211 2207 1234 -358 -1744 -2259 -1888 -556 999
2152 999 2150 2187 1271 -212 -1538 -2241 -1955 -626 875 1955 2176 1443 24 -1415 -2210 -1916 -767
2169 -767 647 1917 2201 1503 94 -1293 -2140 -1968 -890 614 1816 2183 1601 253 -1212 -2063 -2036
2186 -2036 -1064 418 1732 2072 1635 377 -970 -2010 -2078 -1060 273 1454 2087 1792 534 -971 -1900
2203 -1900 -1923 -1251 115 1422 2065 1678 631 -646 -1771 -2012 -1377 2 1290 1967 1791 768 -583
2220 -583 -1657 -1996 -1397 -180 1170 1967 1815 879 -472 -1598 -1931 -1496 -334 1020 1871 1853 982 -347
2238 -347 -1459 -1853 -1577 -399 908 1834 1819 1044 -142 -1332 -1909 -1575 -440 783 1684 1862 1162 -33
2256 -33 -1272 -1886 -1633 -606 680 1574 1869 1292 67 -1130 -1827 -1637 -693 471 1548 1842 1235 189
2274 189 -966 -1657 -1661 -890 436 1433 1779 1342 308 -876 -1731 -1752 -926 324 1299 1737 1446 419 -818
2293 -818 -1567 -1585 -977 131 1199 1699 1451 512 -611 -1493 -1725 -1123 -26 1106 1703 1489 547 -484
2311 -484 -1466 -1733 -1194 -103 1013 1633 1504 762 -461 -1378 -1641 -1173 -206 876 1606 1543 765 -369 -1255
2330 -1255 -1606 -1258 -318 817 1516 1574 886 -152 -1145 -1674 -1315 -469 718 1467 1487 989 -46 -1064 -1563
2349 -1563 -1284 -444 580 1347 1548 1026 3 -1025 -1539 -1383 -614 468 1323 1561 1071 105 -887 -1445
2367 -1445 -1417 -724 322 1260 1486 1130 220 -760 -1436 -1409 -704 279 1150 1376 1167 393 -631 -1369 -1382 -818
2387 -818 126 1028 1481 1251 343 -621 -1272 -1385 -849 0 930 1414 1220 461 -436 -1198 -1395 -962 -42 862
2407 862 1362 1202 593 -412 -1171 -1442 -956 -155 708 1297 1296 681 -307 -1069 -1307 -1012 -258 637 1299 1284 708
2428 708 -226 -978 -1314 -1089 -399 654 1225 1291 743 -12 -856 -1396 -1137 -411 477 1134 1258 790 14 -894
2448 -894 -1291 -1094 -460 386 1035 1227 982 89 -769 -1210 -1125 -536 351 1015 1232 917 194 -641 -1122 -1142 -638
2469 -638 221 982 1216 999 234 -535 -1187 -1235 -679 138 905 1216 1012 338 -477 -1161 -1161 -771 -15 829 1214
2490 1214 1048 378 -421 -1031 -1239 -765 -17 787 1205 1068 430 -281 -945 -1215 -875 -99 654 1099 1071 482
2510 482 -252 -918 -1172 -852 -209 525 1103 1164 613 -235 -833 -1047 -853 -249 485 1037 1121 647 -76 -852 -1089
2531 -1089 -918 -309 379 974 1085 706 -49 -736 -1068 -925 -378 336 874 1083 770 92 -631 -1067 -973 -477
2551 -477 287 880 1058 797 156 -552 -1032 -989 -535 222 833 997 749 157 -515 -960 -1021 -528 121 754 1080
2572 1080 793 247 -450 -949 -976 -592 81 752 975 871 351 -379 -922 -975 -645 37 651 1042 929 412
2592 412 -270 -866 -992 -686 -51 655 998 939 411 -245 -766 -997 -707 -165 504 922 836 475 -163 -746 -1018
2613 -1018 -759 -154 462 883 937 508 -91 -755 -910 -658 -249 424 859 964 550 -21 -600 -890 -769 -335
2633 -335 328 829 854 614 20 -602 -901 -785 -360 246 725 865 578 59 -475 -875 -789 -398 200 714 944
2654 944 695 141 -471 -801 -852 -458 93 647 917 689 162 -373 -874 -855 -468 63 655 841 743 225 -334
2675 -334 -743 -822 -457 42 584 814 757 325 -262 -734 -791 -564 -20 494 804 784 314 -144 -693 -788 -620 -52
2697 -52 422 761 712 373 -178 -662 -832 -583 -134 353 717 794 450 -128 -613 -789 -626 -240 319 771 814
2718 814 466 -18 -558 -755 -650 -225 286 704 740 459 79 -499 -762 -635 -296 240 600 721 590 63
2738 63 -469 -722 -657 -346 156 598 763 613 70 -391 -688 -654 -396 84 617 744 539 128 -319 -697 -683
2759 -683 -408 82 581 678 613 235 -245 -641 -703 -361 49 489 639 643 207 -240 -598 -760 -467 -75 449 690
2781 690 637 304 -185 -571 -679 -490 -78 383 619 643 347 -89 -489 -693 -497 -76 342 647 626 356 -125
2802 -125 -516 -658 -487 -126 348 643 632 379 -81 -465 -664 -554 -198 256 599 619 330 24 -411 -653 -624
2823 -624 -190 157 530 657 419 32 -367 -615 -581 -234 109 466 638 456 136 -346 -551 -514 -349 99 467
2844 467 629 458 138 -324 -536 -539 -311 112 476 583 444 153 -226 -547 -574 -396 45 378 557 562 176 -208
2866 -208 -536 -545 -365 30 381 564 543 221 -193 -515 -548 -424 -75 329 560 568 228 -113 -429 -606 -409 -67
2888 -67 325 529 455 259 -89 -422 -592 -408 -115 242 510 568 311 -59 -435 -528 -378 -138 238 483 559 333
2910 333 -11 -369 -524 -388 -178 195 428 499 322 16 -312 -531 -484 -156 165 431 504 353 83 -271 -479
2931 -479 -471 -220 80 442 481 424 115 -280 -451 -461 -240 74 355 519 385 153 -216 -435 -433 -265 58 362
2953 362 485 416 179 -178 -451 -497 -258 -17 328 437 468 148 -201 -382 -490 -299 -9 317 454 435 240
2974 240 -91 -387 -442 -291 -22 226 446 447 224 -90 -402 -389 -309 -23 240 415 427 235 -67 -366 -407 -383 -142
2997 -142 178 369 402 252 -46 -338 -454 -424 -159 153 396 386 255 -25 -302 -368 -401 -216 157 383 404 234
3019 234 -58 -256 -432 -372 -132 119 352 358 311 58 -219 -420 -423 -193 64 333 399 309 93 -224 -398 -410 -202
3042 -202 -4 292 413 365 158 -195 -380 -444 -293 19 279 384 305 185 -91 -401 -393 -280 24 235 391 324
3064 324 216 -95 -310 -378 -235 -109 226 378 363 134 -103 -323 -342 -323 -37 241 303 312 164 -68 -307 -395 -323
3087 -323 -65 160 328 338 179 -16 -222 -412 -236 -58 114 319 378 246 -34 -266 -329 -271 -84 130 303
3108 303 355 264 43 -231 -358 -316 -184 75 264 339 236 84 -176 -311 -365 -183 58 268 348 220 9 -195
3130 -195 -341 -369 -153 42 184 382 297 72 -122 -305 -318 -155 24 190 359 294 162 -86 -296 -259 -188 37
3152 37 203 335 353 161 -93 -250 -267 -251 -43 227 357 291 128 -117 -235 -314 -212 -67 165 350 297 86
3174 86 -57 -258 -251 -232 -60 110 248 315 171 -28 -266 -304 -259 -39 147 259 311 226 2 -203 -257 -176 -84 120
3198 120 226 365 198 -45 -210 -275 -259 -134 89 218 274 221 67 -140 -317 -331 -86 94 199 297 199 31
3220 31 -151 -340 -249 -137 25 246 280 221 47 -111 -301 -219 -194 30 239 247 256 61 -79 -214 -247 -108 50 215
3244 215 251 241 100 -118 -250 -246 -130 -23 165 259 219 111 -134 -229 -314 -238 -49 139 245 213 141 -46 -151 -251
3268 -251 -197 -5 145 290 240 148 -25 -165 -273 -179 -36 166 290 278 113 -7 -164 -282 -208 -71 101 224
3290 224 251 175 -27 -147 -225 -251 -132 60 203 229 162 -24 -138 -294 -248 -130 69 163 264 199 21 -158 -193
3313 -193 -231 -99 39 207 224 233 55 -123 -205 -225 -131 -4 214 250 257 53 -121 -157 -229 -98 -9 127 187 209 118
3338 118 -132 -107 -221 -118 17 139 208 180 30 -84 -175 -249 -139 -30 140 213 181 174 -78 -124 -225 -140 -22 161
3362 161 183 172 121 -30 -177 -234 -147 -31 109 232 252 166 -10 -135 -226 -223 -53 96 191 187 105 -15 -131 -213 -108
3387 -108 -117 64 180 162 109 -4 -119 -241 -140 -69 58 182 203 127 109 -114 -163 -161 -66 30 104 161 121 72 -52 -234
3413 -234 -162 -107 45 164 255 142 49 -48 -192 -220 -72 -28 136 147 145 26 -30 -203 -174 -98 -8 117 171 140 74 -91
3439 -91 -143 -176 -123 -9 104 129 150 63 15 -159 -165 -120 -4 85 135 125 121 42 -209 -179 -155 -8 38 128 123 102 -34 -119
3467 -119 -161 -99 -70 106 188 129 92 17 -118 -198 -185 -39 77 115 199 164 22 -136 -136 -160 -59 53 105 191 119 -42
3493 -42 -58 -143 -178 -43 84 138 167 133 22 3 -194 -125 -80 47 185 134 125 16 -87 -157 -174 -99 -2 114 121 139 47
3520 47 -31 -157 -152 -80 19 107 131 84 42 -68 -102 -121 -77 83 70 115 109 52 -62 -112 -171 -100 -72 81 121 156 79 -31
3548 -31 -112 -121 -101 -79 29 99 110 73 -80 -103 -174 -90 -69 54 145 133 92 -35 -54 -111 -127 -22 51 106 89 57 7 -100
3576 -100 -88 -50 -32 98 122 112 154 -20 -32 -79 -99 -56 38 61 110 123 -18 -65 -137 -146 -62 23 70 102 55 10 -104 -159
3604 -159 -82 -106 -48 98 156 143 28 26 -72 -135 -89 16 63 125 127 73 -76 -33 -77 -47 1 41 128 164 45 -16 -146 -100
3632 -100 -122 -52 46 117 70 13 -63 -137 -98 -44 14 64 116 109 76 -38 -23 -146 -75 31 28 113 130 62 13 -87 -163 -37
3660 -37 -6 74 103 127 95 26 -8 -134 -40 -57 71 106 126 72 -9 -12 -65 -96 -48 63 29 87 114 -10 -41 -139 -86 -85 9
3689 9 117 108 101 50 3 -107 -104 -84 10 51 137 119 -9 -15 -34 -32 -46 35 41 81 96 -19 -10 -98 -70 -57 21 86 106 78 72 -51
3721 -51 -110 -117 0 45 54 69 29 22 -7 -45 -35 -66 7 56 138 107 27 -8 -121 -114 -92 9 91 113 96 73 -12 -40 -85 -112 -13
3752 -13 63 77 146 72 -12 -78 -85 -66 -23 40 85 62 100 9 -77 -123 -58 -67 30 97 55 77 -23 -11 -34 -157 -74 11 52 119
3782 119 94 39 17 -44 -104 -36 -19 42 122 105 64 3 -35 -68 -15 -21 84 54 60 32 0 -42 -97 -79 -40 71 145 105 8 -43
3812 -43 -100 -77 -88 45 4 51 43 9 40 -5 -84 -59 9 75 116 89 69 -27 -97 -51 -40 -11 11 147 69 31 14 -45 -32 -69
3842 -69 0 100 124 23 77 21 -50 -50 -73 -23 -24 31 57 39 -35 -72 -41 -79 -38 20 26 62 120 20 -56 -87 10 15 32 58 118
3873 118 106 18 6 -71 -97 -80 9 51 136 96 -1 -28 -95 -72 -40 -9 23 30 38 62 4 -66 -64 -52 -16 36 75 49 17 -13 -48
3904 -48 -115 -59 -1 53 93 71 37 -28 18 -59 -30 31 56 -14 35 29 22 -76 -86 -73 34 32 28 71 74 10 -10 -87 -118 -54 57 38
3936 38 35 60 45 -63 -102 -31 -36 107 16 75 45 64 -43 -71 -27 5 20 69 20 60 74 -35 -65 -95 -25 47 36 58 46
3965 46 22 -16 -54 -60 10 14 26 57 34 -17 30 -23 -39 -62 79 21 44 57 8 -21 -73 -49 -10 32 76 111 51 -11 -6 -37 -61
3996 -61 2 7 35 80 97 39 12 -68 -47 -29 1 45 43 69 26 40 -4 -94 -16 -35 35 19 29 -26 -20 -31 -101 -17 -1 -13 57 63
4028 63 26 38 -70 -97 -87 -38 18 100 17 13 13 -6 -40 -40 -30 -16 47 38 51 16 -39 -63 -47 10 59 7 69 -2 12 -33 -13 -26
4060 -26 17 38 22 44 6 12 7 -43 38 7 4 48 2 56 -13 6 -29 -77 -28 5 -5 18 104 34 -11 0 13 -9 -2 24 76 117
4092 117 -5 31 -7 -40 -45 35 33 39 19 7 -7 -35 0 -22 19 17 79 45 21 27 13 13 -62 45 10 57 -9 2 28 -46 -92 -4
4124 -4 40 29 92 64 6 17 44 -13 -91 16 -10 -17 74 26 25 -6 -52 19 -6 -36 59 37 21 -11 -42 -6 -59 -29 -18 -13 16 37
4156 37 54 -80 -8 -61 -33 -12 19 41 57 30 -90 3 -19 -5 -53 78 17 26 24 -6 -41 -48 -20 67 -1 69 33 30 -14 -54 0
4187 0 12 21 45 33 -20 14 -31 -46 -54 -1 -29 16 19 42 80 -26 -49 -61 -45 -38 3 65 26 6 29 -63 30 -80 6 46 104 81
4219 81 65 -19 -18 -70 -46 -36 -5 -5 89 -10 -1 -42 -3 -69 6 -19 11 9 33 26 -19 -84 -59 39 -8 8 18 -3 -13 13 -21 -55 2
4252 2 41 87 0 42 48 -10 -47 -25 32 34 27 30 71 61 36 -46 -23 -58 -37 3 44 29 4 -49 -10 -24 -13 31 -13 41 6 39 -21
4285 -21 -62 -1 -48 -47 -12 -29 20 28 6 -36 -26 -28 -6 -9 36 48 49 -10 -16 3 -44 -26 -6 17 46 27 -63 57 17 -19 -24 -43 -1
4318 -1 23 -16 -10 -51 -13 -26 -12 -44 54 29 8 -4 10 17 -16 -45 -21 53 18 9 4 20 3 -2 -37 2 -37 -15 81 -39 22 -40 0
4351 0 -71 -36 -9 3 -19 -57 20 -10 -29 23 27 -1 -7 -10 30 -19 -38 -36 -52 -29 10 46 82 16 43 -33 8 -18 10 18 42 43 -1 36
4385 36 -14 0 -59 -32 21 -25 -33 34 -45 -26 -59 -7 -6 -3 39 -15 -45 45 12 -52 -31 0 -21 -33 10 -5 -26 -77 -47 -50 -23 -3
4417 -3 1 -8 -53 31 -36 3 -23 2 -11 14 34 32 55 -2 5 -5 -16 13 -7 -11 -27 -21 -3 48 -47 5 -9 31 3 30 23 -27 -29 -54 20
4452 20 16 41 -14 38 -60 -16 -16 -2 19 27 -16 103 3 16 30 -64 -1 -28 21 -43 45 -46 -9 -5 -42 -23 30 15 -42 0 8 13
4484 13 -72 -7 -2 -35 5 14 -4 4 33 -2 -31 -62 -70 6 -34 -26 41 23 12 -8 -19 4 7 20 -8 39 -33 3 41 32 11 -12 -29 34
4518 34 33 -15 53 -16 -23 15 49 16 -39 32 19 -21 -5 -21 19 -19 -18 -12 -8 25 -3 -63 -17 -11 -5 33 -9 -17 55 -29 -41 -7 -19 -63
4552 -63 -42 -27 26 37 4 45 27 20 -43 -52 13 -48 31 -5 31 9 -7 23 -8 1 -3 14 10 26 -42 -17 -39 -39 -16 -3 46 -45 -32
4585 -32 -8 11 -31 -3 -7 32 -22 23 -10 16 6 -18 -1 -3 22 2 24 -27 -2 -11 -24 17 22 42 31 53 -24 1 8 15 -13 -42 21
4618 21 24 19 39 5 30 -65 -19 -25 -7 38 27 -13 4 52 -21 -12 -12 52 51 45 21 33 38 -51 36 7 -52 33 40 26 -28 -27 28 -43 -8
4653 -8 12 20 16 37 14 79 -33 -26 -6 45 9 -40 -7 17 11 -18 -21 -12 24 -1 -7 5 66 -11 -15 -1 28 1 43 -37 15 80 -16 -25 -36
4688 -36 21 28 29 39 58 25 56 -4 -28 2 25 5 -59 -14 -37 -15 -10 5 6 -37 26 -17 -62 24 -69 -18 -3 -2 3 0 26 30 10 37
4722 37 -22 20 -17 43 60 38 19 33 70 29 18 -36 -15 62 -11 11 16 -6 -20 -25 -14 7 -35 -4 6 -22 25 -37 -23 -25 50 31
4754 31 -12 -18 0 -11 -13 -62 -40 -63 -48 -9 -6 60 -10 -4 9 33 19 -24 25 44 30 -43 45 -33 -45 9 -19 12 36 -25 -11 68
4786 68 62 1 10 5 -36 -32 -36 59 21 -9 -45 30 -25 31 -10 36 -48 -38 -31 14 11 -13 53 25 38 36 -32 -19 6 -44 -33 -9 -7 -29 40
4821 40 7 -19 -41 -10 -27 22 -20 -24 -7 23 18 -26 32 2 40 7 90 21 -21 20 10 -23 -10 -12 13 2 -16 11 -21 30 31 14
4853 14 -40 25 23 12 4 16 -1 28 -18 73 46 36 36 29 25 16 0 -57 31 -31 6 -54 20 -8 23 -23 13 49 -31 3 28 8 3 -54
4887 -54 -33 -4 43 -36 -14 25 49 1 34 18 -38 40 65 34 24 -31 0 -7 23 -38 19 4 -30 -40 -25 -15 13 11 -18 -24 -18 54
4919 54 55 13 30 -23 16 -13 -27 26 19 6 11 28 -7 -5 16 36 27 -58 29 -2 21 27 36 -23 34 4 -5 33 17 36 20 5 3 12 45
4954 45 -7 -24 11 -18 -96 27 -24 50 -41 -15 3 -17 -26 14 -30 -68 -18 12 10 -57 27 10 -17 -9 15 56 46 -2 1 5 16 0
4986 0 -24 -43 11 4 15 -44 66 28 12 42 10 6 -4 -12 34 -3 -36 -21 59 -6 -8 11 3 26 2 16 10 -34 -8 -24 56 11 30
5019 30 26 -19 68 26 -16 34 19 -18 44 54 30 53 84 14 74 63 -17 13 -46 32 -58 -23 21 -43 -43 -13 12 -1 13 26 -49
5050 -49 -20 8 -52 8 -14 -26 23 -41 -7 12 3 4 -41 -29 13 -18 -39 -18 -1 15 8 -1 1 -8 -6 40 53 35 23 29 5 25 45 58
5084 58 29 -38 12 -40 61 42 -21 -35 16 31 -14 -72 33 -5 -78 -30 27 46 -8 2 -19 -43 -31 -39 29 44 21 20 21 -48 4
5115 4 25 -38 70 12 -9 -37 43 33 26 -6 25 42 51 57 -3 -4 -24 -5 -27 -36 42 -18 6 18 24 58 -18 -34 63 -74 -2 28 -17
5148 -17 41 30 26 10 3 40 20 57 18 -27 -2 40 16 -30 26 12 -31 51 44 -9 17 -6 -42 -42 -29 -48 10 28 9 27 -2 -29
5180 -29 43 -13 -37 63 0 32 4 16 -13 -12 -5 41 28 12 15 -33 -11 -4 48 29 44 -15 55 8 -25 -23 26 -11 -4 -6 42 21 -12
5213 -12 -58 7 -42 -2 -42 0 -18 72 4 -1 38 -39 9 11 -45 -39 50 -14 95 2 35 -8 3 -11 53 -40 66 16 -7 -60 -17
5244 -17 71 35 51 1 50 -6 -24 3 -2 47 17 14 35 -10 -33 15 80 26 4 -51 -6 -11 18 4 -1 31 6 11 18 -10 7 16 -72 28
5278 28 11 62 -20 63 10 66 -2 -16 12 -17 2 -11 8 53 40 -37 13 84 33 16 -53 -30 -53 -14 6 -56 -19 5 43 -7
5308 -7 -25 -25 -33 34 26 12 -7 -2 21 -27 35 40 43 18 -13 35 16 -7 6 -19 12 4 -17 -22 25 56 8 41 -19 15 -5 1 -13 37 24
5343 24 4 17 29 -18 8 -27 24 -34 1 -15 -3 42 -37 9 8 -7 80 -23 5 27 52 47 21 41 46 16 -16 -13 -36 -1 35 -13
5375 -13 54 39 8 -34 10 -42 56 -10 -49 16 70 -12 -8 24 32 -1 5 20 -36 -26 -24 -49 19 31 -3 15 22 11 15 -5 56 3 0 72
5409 72 30 19 55 23 -1 -22 -24 -2 75 1 4 -50 -36 17 0 -60 -10 12 -26 -41 -63 3 -32 -39 17 46 -17 8 -11 -15 -59 -11
5441 -11 -34 31 3 -37 16 31 -14 -13 16 11 42 27 29 9 9 -10 27 -2 16 -43 73 30 -48 -26 15 -5 -17 2 -67 -70 3 -50
5473 -50 -14 32 -4 -7 26 36 61 -8 -68 16 -11 -1 -31 -47 1 18 -12 8 -35 -7 -75 -6 -25 38 12 -43 -58 -2 54 3 8
5504 8 10 -33 23 -66 13 31 -2 -60 25 17 8 -35 -30 32 -46 51 -11 1 -5 10 -41 38 -3 6 -12 -3 -7 -14 3 -21 -28 33 4 66 -50
5539 -50 41 -3 41 22 11 -5 29 43 -1 -59 -2 36 29 -9 0 -29 -5 -2 -27 -11 35 18 5 -78 -18 45 14 20 -44 -2 17 -43
5571 -43 -9 32 -34 -8 25 -14 15 41 20 94 3 38 14 -22 1 -1 -14 18 -65 -6 -68 -15 24 38 60 23 31 -21 -3 4 -12 -75
5603 -75 -8 -28 -33 -19 6 -12 16 42 -32 -43 43 -21 11 28 -29 -44 -1 14 6 -38 46 7 23 7 -2 -17 15 25 32 -11 -18 45 -8
5636 -8 1 -57 -35 4 94 27 -20 -17 1 11 -9 6 57 20 -5 20 14 70 12 0 -29 -4 62 56 37 -23 -7 -26 13 -10 -31 26 -38
5669 -38 2 29 -29 -71 -11 22 -11 -25 15 18 -30 27 27 8 -32 34 -2 -28 -12 -12 -2 7 -14 28 55 19 -67 -48 21 10 18 50 17
5702 17 4 60 10 -40 -34 25 -6 -10 34 27 22 38 -47 9 2 -12 50 17 1 -12 -2 12 21 43 10 -4 -6 -2 -15 -32 -24 -14 -33 7 -10
5737 -10 -20 -17 6 -22 35 5 3 -8 61 -31 -9 49 -5 -6 44 4 9 -10 31 8 -12 -12 53 91 9 3 -20 -49 -36 -68 -33 -17 -32
5770 -32 30 -11 16 4 -18 -33 -10 3 20 -12 -8 -2 14 21 52 -24 23 -26 35 14 32 55 -10 -12 34 41 0 39 -16 59 -25 -8 48
5803 48 6 9 1 -47 32 0 2 14 5 -81 -23 9 -58 12 27 -23 -9 -79 -29 -32 26 -29 19 -4 17 14 -16 50 19 -10 -43 101 27
5836 27 14 51 27 13 -19 5 33 14 33 11 -15 -7 55 -13 -22 -36 -5 39 53 4 -5 -50 -52 -2 -38 41 18 8 -5 32 -35 -57
5868 -57 79 -5 28 -16 50 -1 -15 41 45 41 23 -26 1 20 22 48 -20 -26 -6 8 41 -23 4 -3 29 19 -9 -34 -37 33 -27 -39 -33
5901 -33 -32 -9 -6 -18 25 12 41 35 9 -37 -6 14 21 12 -1 27 17 24 31 -21 8 -27 39 -4 63 5 32 -61 25 4 -3 64 -20 -23 33
5936 33 -1 -10 -17 -17 -26 67 45 -16 23 7 5 12 28 -15 6 8 -34 -62 -24 -3 24 16 -3 3 79 58 16 9 -4 -26 -40 -22 27 13 -25
5971 -25 27 40 22 5 11 22 -36 15 -15 -37 28 20 -37 -42 8 -9 10 -11 -2 3 11 26 42 -27 11 -39 -20 22 17 -6 -35 14 52 68
6005 68 18 1 25 3 -34 -20 -55 -17 94 -35 -33 -11 -29 10 25 -43 53 22 12 -22 -3 -8 -30 10 31 20 -12 30 13 -43
6035 -43 24 -2 8 9 -1 7 -6 -26 30 11 -36 3 -41 25 19 21 -7 40 -1 22 29 9 -31 13 27 44 11 76 -4 37 26 49 -23
6068 -23 -40 -4 -49 -22 -4 16 39 29 63 15 21 -11 39 -84 -2 12 47 14 30 27 -16 -27 25 45 25 -1 5 -53 -17 49 20
6099 20 -7 54 79 24 -46 77 13 -43 -6 -32 29 -44 -46 24 -48 17 44 -4 -8 -11 -11 -3 33 44 -11 -78 13 -22 6 -3 6 27 -101
6132 -101 22 47 -42 21 32 14 19 38 -16 0 -25 54 -27 11 -8 -16 -6 28 -39 -13 -1 -5 11 -25 31 32 19 20 -16 1 16 34
6164 34 3 15 13 -10 112 20 8 10 -18 -27 61 -13 56 -23 11 22 70 41 9 23 45 17 -3 17 34 -13 42 -12 30 2 -37
6195 -37 -3 25 1 33 30 -51 -10 3 -38 15 25 -25 -31 6 10 30 33 7 6 41 38 13 47 49 34 -37 -35 27 4 -8 8 -14 34 6
6229 6 29 49 48 -16 -62 2 50 -8 3 12 -28 0 23 29 -71 -30 13 -14 7 -43 16 14 -31 52 -8 49 -18 7 -11 -39 28 45
6261 45 11 47 41 -34 -9 -14 -6 23 -30 -24 16 -1 32 0 0 -22 -7 -69 -9 -22 -14 -30 19 20 12 -7 53 30 -11 -6 8 -6 24 48 44
6296 44 -31 -34 25 2 -1 -24 32 16 -1 -23 6 21 17 -1 12 28 -25 22 15 -18 23 22 -16 -46 -17 -58 24 46 -47 -29 59 -7 -7
6329 -7 -33 -5 38 25 12 32 1 -28 -5 19 -9 30 68 39 20 -10 -2 -47 -44 5 67 28 19 37 26 5 -17 -58 -17 1 -37 50
6361 50 32 29 -41 -72 -12 -25 52 -3 38 -4 -40 -52 -9 -62 -16 11 17 3 9 89 48 -7 29 47 33 5 14 1 60 37 45 54 -19
6394 -19 30 -8 -30 -2 -4 -44 35 13 35 -1 -10 36 3 11 26 3 -15 12 -8 -4 -13 -48 -47 23 -34 35 42 23 -10 22 -10 28 35 20
6428 20 21 -20 -7 -8 30 1 -4 49 4 3 57 6 38 -1 -37 -25 -2 23 23 -39 -26 -29 2 -29 -59 -5 13 24 12 -35 46 -47 -21
6461 -21 -28 9 -40 8 70 -9 28 -7 -14 -20 -43 24 18 1 -14 -33 12 -9 -6 23 14 33 23 41 20 19 12 13 -3 -18 6 21 -24 2 -12
6496 -12 21 -44 40 -26 -19 -46 -51 3 -34 -10 -24 7 -12 41 -7 -46 23 10 34 0 5 -8 -44 -17 6 14 46 -30 -15 44 -11 19
6528 19 13 11 -49 19 -17 -13 27 -100 18 -26 11 -49 -52 59 4 20 8 -70 30 42 63 -13 10 36 -12 55 -13 18 -11 -6 2
6559 2 1 -8 -64 0 -4 6 -8 2 53 -16 -33 40 16 9 -6 -41 27 -23 22 32 -14 38 1 -21 7 9 -57 -44 65 -37 -5 42
6591 42 50 -17 -21 9 -2 6 47 7 35 -6 31 6 12 24 6 38 -27 5 0 36 33 20 18 1 45 -40 -48 6 12 -12 -21 10 -47 -2 -11 -36
6627 -36 -12 -4 33 -20 23 33 -6 -21 -1 -3 28 5 26 7 46 -26 -7 -21 -3 30 32 11 17 -7 3 -29 3 -3 6 -22 33 37 10 -10
6661 -10 -46 15 19 29 24 -61 28 86 -32 6 4 -2 -4 -26 -22 12 -23 -58 7 9 -6 57 -34 47 19 52 11 29 20 -1 30 48 -26 -8
6695 -8 -71 54 13 30 47 7 -4 19 -34 -28 25 -14 -12 -1 18 -31 -32 11 -13 -28 -52 35 11 24 26 -39 26 -30 27 34 42 4 40
6728 40 -4 -21 -35 -16 -35 -14 27 40 -8 -34 13 8 3 6 -8 -29 -33 -22 -14 2 28 -47 -41 28 31 8 29 3 5 -43 -18 -36 -10 -35
6762 -35 -10 5 -15 68 -2 2 10 17 -7 -53 33 53 -1 -6 51 -22 4 17 -30 -18 -5 -1 81 -36 26 3 -8 21 -26 10 -24 -18 -47
6795 -47 -26 -52 -8 -22 -13 -70 48 39 13 13 -36 -6 -9 11 23 -25 14 36 -10 -42 13 -26 -35 -23 3 8 -13 -15 -2 -49 6 -23 46
6828 46 13 40 -39 19 -21 40 -5 2 -36 23 -33 -7 -15 4 -16 -12 -13 -30 53 -28 -18 -16 -17 -20 22 -42 -38 28 -31 2 -21 26 -68 14
6862 14 -5 12 7 17 49 -13 8 -8 -19 36 -25 -80 -32 8 -36 -56 -43 -27 -14 44 -13 30 -2 29 -33 -8 -27 -30 -19 10 31
6893 31 12 40 -16 39 -24 -1 40 -7 32 -58 -27 -62 37 60 18 14 -18 4 -25 -42 -53 -16 -10 -22 1 -11 5 17 -33 5 6 14
6925 14 -17 -44 20 32 -3 -8 12 -12 60 23 -2 25 -21 -5 41 -10 27 1 40 -13 55 -5 -23 6 17 57 0 -17 14 15 -16
6956 -16 -27 -21 52 13 -39 -32 -54 -16 6 -28 -23 -6 -30 -31 -38 -14 25 -57 -27 56 -36 -23 -8 33 10 -21 54 -1 23 -20 -7 9 11
6989 11 -30 -10 -3 6 23 -25 1 54 -22 72 1 -1 -12 2 51 -8 -12 -1 1 -23 -14 -20 -5 -20 -42 -4 -16 4 19 -24 48 36 5 -6
7023 -6 16 8 -19 -11 -37 22 39 -3 1 -3 24 -1 -5 8 -26 -22 -16 13 -48 9 12 -25 6 -22 -1 -27 5 25 -45 -13 3 7 49 5 -13
7058 -13 12 -17 -52 -32 -64 3 -22 -19 35 -7 22 2 -44 52 36 36 23 29 9 2 0 -4 2 -25 -20 -26 -8 -33 -15 -23 6 -1 32 -8 -16 16
7094 16 -27 -18 24 10 60 -8 8 -86 27 13 -16 21 9 21 -45 9 -18 -18 66 15 -17 -3 -18 -8 27 -6 -13 21 -49 2 15
7125 15 32 10 15 4 -1 51 -19 -29 -15 35 -26 25 39 4 -32 25 60 -25 43 -5 14 8 24 16 -24 38 31 33 -8 -7 -22 -1 -17 -20
7159 -20 24 16 -3 -27 41 36 -30 25 1 14 -34 -13 -28 -3 14 -46 -66 23 -22 -12 -24 -54 -23 37 -20 -22 24 -16 34 12 10 -1
7191 -1 -13 15 18 -23 3 16 26 -35 -3 -16 0 8 19 46 0 -35 23 -7 40 14 26 -42 44 18 23 -49 -10 -36 -1 32 -39 -6
7223 -6 -30 -31 -23 -5 -20 26 -25 -59 -55 24 -32 65 14 -55 47 56 39 8 19 -52 -36 1 20 3 -22 24 33 26 3 -43 25 5 -4 11
7257 11 -6 -18 27 9 -85 21 -66 14 26 -25 18 14 -18 -25 24 4 38 -7 -33 -25 -10 -36 4 -19 25 43 -5 40 -5 10 -33
7288 -33 11 -17 33 9 21 67 41 -21 -13 35 -42 48 32 -28 -5 22 -32 31 23 21 14 -19 -39 -19 2 -23 -33 23 5 34 -7 6
7320 6 33 -10 3 -4 -26 25 14 -11 -8 13 -12 16 0 15 49 18 -6 -6 10 -13 7 32 -18 8 37 -39 62 13 -21 -43 14 14
7352 14 -22 -34 -2 15 -7 -27 -39 42 -15 -44 -35 -24 -30 7 28 -9 18 -50 -4 57 -20 4 37 4 -20 -11 -3 -13 -40 26 -48 -7
7384 -7 -13 -7 -51 56 59 14 -4 -22 -45 -34 -18 -53 42 -57 12 -15 -6 10 12 14 -22 9 -10 -15 3 40 49 32 29 10 -28 2 -14 -52 27
7419 27 50 7 60 8 -40 18 -1 2 -56 -12 -23 -14 -19 -9 -25 -11 1 -47 -25 9 36 -37 3 -8 2 -24 10 26 -39 70 2
7450 2 -29 27 33 1 -17 39 16 -64 9 32 -23 7 -33 3 16 -41 18 -55 -23 44 -34 -42 -30 60 -3 -1 -11 -3 -59 -19 -33 5 50
7483 50 34 24 -74 20 -11 -13 -54 35 21 -26 -7 6 34 9 -26 36 -30 17 16 45 59 52 76 -2 8 -13 -6 -10 -44 -41 40 -3 -27
7516 -27 27 34 -7 15 7 -12 21 39 42 -24 -14 16 -96 -16 -35 -22 31 -24 -13 -54 38 -12 -11 11 -32 -48 -1 -38 22 -36 25 74
7548 74 17 10 9 -17 -6 21 -19 16 40 15 -2 6 -10 -17 58 0 -22 -19 -18 -17 -16 -4 -27 -10 -3 1 -2 19 17 41 -21 9 -29 30 72 20
7584 20 8 9 -54 26 18 25 17 -1 -9 8 17 -29 -11 -41 10 -14 0 -23 -57 36 39 22 -17 -25 13 39 -34 17 -18 -14 22 6 22 -17 -26
7619 -26 4 -16 -46 -9 -3 59 -92 14 28 -22 79 -48 -3 -9 -25 11 34 91 -37 46 18 14 5 -48 -64 20 -2 -41 2 7
7649 7 -13 -6 -22 1 -4 10 -13 -21 -4 41 -18 -25 -36 -20 -8 -53 1 -21 27 0 2 42 4 39 1 -6 42 -10 13 33 -2 -45 -11 -48
7683 -48 -18 -60 -11 10 -10 -4 -15 -10 -56 -32 -23 27 -50 -26 9 -57 -19 0 5 54 12 -12 19 -29 -11 44 -25 30 -29 -19 -19 -13 -12 12
7717 12 8 -25 -16 -37 -7 6 46 6 10 20 1 -37 23 -15 24 -14 -79 -28 -19 40 -14 8 -29 -24 10 -10 42 31 14 -7 19 50 -16
7750 -16 -9 -9 30 -76 26 3 13 29 15 -42 -34 -24 2 41 -15 -18 -45 -14 20 -38 0 -60 -28 28 42 39 25 31 -26 -23 8 49 -48
7783 -48 -59 1 -27 -9 13 -23 -16 16 -10 -18 -28 2 38 47 -23 5 14 -8 -16 -10 2 17 10 59 -36 0 -25 0 -12 26 -17 -27 26 19
7817 19 27 -24 14 -28 40 -23 -12 -47 -15 -83 -13 17 -10 -2 -7 78 8 21 4 -16 4 -7 8 41 58 52 -15 -30 -12 -8 61 -16 43
7850 43 -24 -6 15 -40 -11 48 -2 1 -19 7 -2 -18 -37 4 27 -29 -10 -19 -5 50 68 -8 -27 2 36 20 -43 -15 -23 23 20 4 -4
7883 -4 49 -42 21 -6 33 -8 66 3 -24 -19 13 -12 53 77 -7 -47 0 -5 4 29 -22 -24 -39 -3 -10 -62 -6 19 -32 -34 -15 48 6 -7
7917 -7 7 11 30 -63 82 -10 -20 -26 3 38 19 6 1 11 -30 -17 22 -10 11 -5 -37 24 -27 34 -8 -47 -6 17 15 26 48 -65
7949 -65 -14 -16 -10 -4 23 -28 -27 -26 13 13 -23 27 23 -15 -46 6 -35 -7 -16 -27 1 33 -22 -35 33 21 7 28 51 -3 -3 -24 6 35 50
7984 50 50 23 -34 -18 -26 -16 -46 -48 -16 -1 -10 59 -41 5 -43 24 47 -13 -51 -20 43 -46 11 10 -7 60 -13 -37 -46 18 12 35 -32
8017 -32 21 -32 -21 33 16 -3 -40 -19 10 1 58 -26 30 -22 -48 -70 -16 2 42 13 -34 7 15 -29 3 -2 27 -27 13 -14 -9 12
8049 12 13 -2 18 9 27 41 -7 32 4 57 -10 -41 -11 -20 -5 37 3 -22 68 14 -11 -19 -2 58 -3 -38 -14 62 -17 13 17 -38 6
8082 6 -53 19 -63 -16 -40 -8 13 -4 35 -19 12 40 39 -2 29 2 15 -52 -3 -21 -22 -17 -12 17 -3 7 -43 13 5 38 36 27 -25 -2
8116 -2 -31 -38 19 18 -99 -27 71 -23 -38 -22 41 36 -35 -50 31 -28 -42 15 -12 12 17 66 -5 3 -2 14 22 -7 26 25 -22 -39 -7 21
8150 21 5 -52 18 -39 -17 37 37 -1 26 57 3 24 13 13 -2 -48 -18 33 -49 -28 21 -19 -4 2 27 18 -52 51 -10 -5 29 8
8182 8 45 15 -1 -44 -45 6 7 -12 -14
8191a4
##END NTUPLES=NMR FID
##END=
