##TITLE=1H_LR-765-CR5-EtOH
 CCl4
 8 sc, 
 17.5.2023
##JCAMPDX= 6.0         $$ Bruker NMR JCAMP-DX V2.0
##DATA TYPE= NMR FID
##DATA CLASS= NTUPLES
##ORIGIN= UXNMR, Bruker Analytische Messtechnik GmbH
##OWNER= root
$$ XWIN-NMR		Version 3.5
$$ Wed May 17 14:38:10 2023 Russian Standard Time (UT+4h)  she@DPX200
##.OBSERVE FREQUENCY= 200.13135
##.OBSERVE NUCLEUS= ^1H
##.DELAY= (6, 6)
##.ACQUISITION MODE= SIMULTANEOUS
##.ACQUISITION SCHEME= undefined
##.AVERAGES= 8
##.DIGITISER RES= 18
##SPECTROMETER/DATA SYSTEM= spect
##.PULSE SEQUENCE= zg30
##.SOLVENT NAME= CDCl3
##.SHIFT REFERENCE= (INTERNAL, CDCl3, 0, 15.7039)
##AUDIT TRAIL= $$ (NUMBER, WHEN, WHO, WHERE, WHAT)
$$ ##TITLE= Audit trail, XWIN-NMR		Version 3.5
$$ ##JCAMPDX= 5.01
$$ ##ORIGIN= Bruker BioSpin GmbH
$$ ##OWNER= she
$$ F:/spectra/data/she/nmr/H-F/1/audita.txt
$$ ##AUDIT TRAIL=  $$ (NUMBER, WHEN, WHO, WHERE, WHAT)
(   1,<2023-05-17 14:37:18.67 +0400>,<she>,<DPX200>,
      <created by zg, POWCHK disabled, PULCHK disabled
       configuration hash MD5:
       00 E9 B6 7A A2 85 ED C7 34 08 36 98 17 FE 4E 26
       data hash MD5: 16K
       22 D8 D0 B0 38 51 3B 7A F7 84 6D D9 09 C1 1C D0>)
$$ ##END=
$$ 
$$ hash MD5
$$ 94 23 42 EA 1F 53 CC 3E 74 D7 B3 D7 D7 27 83 D9
##$RELAX= 
##$RELAX= 
##$RELAX= 
##$RELAX= 
##$RELAX= 
##$RELAX= 
$$ Bruker specific parameters
$$ --------------------------
##$DU= <F:/spectra>
##$EXPNO= 1
##$NAME= <H-F>
##$PROCNO= 1
##$TYPE= <nmr>
##$USER= <she>
##$AMP= (0..31)
100 100 100 100 100 100 100 100 100 100 100 100 100 100 100 100 100 100 
100 100 100 100 100 100 100 100 100 100 100 100 100 100 
##$AQSEQ= 0
##$AQ_mod= 1
##$AUNM= <au_zg>
##$AUTOPOS= <>
##$BF1= 200.13
##$BF2= 200.13
##$BF3= 200.13
##$BF4= 200.13
##$BF5= 200.13
##$BF6= 200.13
##$BF7= 200.13
##$BF8= 200.13
##$BYTORDA= 1
##$CFDGTYP= 0
##$CFRGTYP= 5
##$CHEMSTR= <none>
##$CNST= (0..31)
1 1 145 1 1 1 1 1 1 1 1 1 1 1 1 1 1 1 1 1 1 1 1 1 1 1 1 1 1 1 1 1 
##$CPDPRG= <>
##$CPDPRG1= <>
##$CPDPRG2= <>
##$CPDPRG3= <>
##$CPDPRG4= <mlev>
##$CPDPRG5= <mlev>
##$CPDPRG6= <mlev>
##$CPDPRG7= <mlev>
##$CPDPRG8= <mlev>
##$CPDPRGB= <>
##$CPDPRGT= <>
##$D= (0..31)
0 1.2 0 0 0 0 0 0 0 0.06 0 0.03 0 0 0 0 0.0002 0 0 0 0 0 0 0 0 0 0 0 0 
0 0 0 
##$DATE= 1684319838
##$DBL= (0..7)
120 120 120 120 120 120 120 120 
##$DBP= (0..7)
150 150 150 150 150 150 150 150 
##$DBP07= 0
##$DBPNAM0= <>
##$DBPNAM1= <>
##$DBPNAM2= <>
##$DBPNAM3= <>
##$DBPNAM4= <>
##$DBPNAM5= <>
##$DBPNAM6= <>
##$DBPNAM7= <>
##$DBPOAL= (0..7)
0.5 0.5 0.5 0.5 0.5 0.5 0.5 0.5 
##$DBPOFFS= (0..7)
0 0 0 0 0 0 0 0 
##$DE= 6
##$DECBNUC= <off>
##$DECIM= 32
##$DECNUC= <off>
##$DECSTAT= 4
##$DIGMOD= 1
##$DIGTYP= 9
##$DL= (0..7)
0 120 120 120 120 120 120 120 
##$DP= (0..7)
150 150 150 150 150 150 150 150 
##$DP07= 0
##$DPNAME0= <>
##$DPNAME1= <>
##$DPNAME2= <>
##$DPNAME3= <>
##$DPNAME4= <>
##$DPNAME5= <>
##$DPNAME6= <>
##$DPNAME7= <>
##$DPOAL= (0..7)
0.5 0.5 0.5 0.5 0.5 0.5 0.5 0.5 
##$DPOFFS= (0..7)
0 0 0 0 0 0 0 0 
##$DQDMODE= 0
##$DR= 18
##$DS= 0
##$DSLIST= <SSSSSSSSSSSSSSS>
$$ [...]
##$SUBNAM2= <"">
##$SUBNAM3= <"">
##$SUBNAM4= <"">
##$SUBNAM5= <"">
##$SUBNAM6= <"">
##$SUBNAM7= <"">
##$SUBNAM8= <"">
##$SUBNAM9= <"">
##$SW= 18.05172834244
##$SWIBOX= (0..15)
0 0 2 0 0 0 0 0 0 0 0 0 0 0 0 0 
##$SW_h= 3612.71676300578
##$TD= 16384
##$TD0= 1
##$TE= 0
##$TE2= 300
##$TE3= 300
##$TEG= 300
##$TL= (0..7)
0 120 120 120 120 120 120 120 
##$TP= (0..7)
150 150 150 150 150 150 150 150 
##$TP07= 0
##$TPNAME0= <>
##$TPNAME1= <>
##$TPNAME2= <>
##$TPNAME3= <>
##$TPNAME4= <>
##$TPNAME5= <>
##$TPNAME6= <>
##$TPNAME7= <>
##$TPOAL= (0..7)
0.5 0.5 0.5 0.5 0.5 0.5 0.5 0.5 
##$TPOFFS= (0..7)
0 0 0 0 0 0 0 0 
##$TUNHIN= 0
##$TUNHOUT= 0
##$TUNXOUT= 0
##$USERA1= <user>
##$USERA2= <user>
##$USERA3= <user>
##$USERA4= <user>
##$USERA5= <user>
##$V9= 5
##$VALIST= <valist>
##$VCLIST= <CCCCCCCCCCCCCCC>
##$VD= 0
##$VDLIST= <DDDDDDDDDDDDDDD>
##$VPLIST= <PPPPPPPPPPPPPPP>
##$VTLIST= <TTTTTTTTTTTTTTT>
##$WBST= 1024
##$WBSW= 4
##$XGAIN= (0..3)
0 0 0 0 
##$XL= 0
##$YL= 0
##$YMAX_a= 515614
##$YMIN_a= -572597
##$ZGOPTNS= <>
##$ZL1= 120
##$ZL2= 120
##$ZL3= 120
##$ZL4= 120
##$ABSF1= 10
##$ABSF2= 0
##$ABSG= 5
##$ABSL= 3
##$ALPHA= 0
##$AQORDER= 0
##$ASSFAC= 0
##$ASSFACI= 0
##$ASSFACX= 0
##$ASSWID= 0
##$AUNMP= <proc_1d>
##$AZFE= 0.1
##$AZFW= 0.1
##$BCFW= 1
##$BC_mod= 2
##$BYTORDP= 1
##$COROFFS= 0
##$CY= 11.3945322036743
##$DATMOD= 1
##$DC= 2
##$DFILT= <>
##$DTYPP= 0
##$F1P= 15.7292609196834
##$F2P= 12.9074282941183
##$FCOR= 0.5
##$FTSIZE= 0
##$FT_mod= 4
##$GAMMA= 1
##$GB= 0.15
##$INTBC= 1
##$INTSCL= 1
##$ISEN= 128
##$LB= 0.24
##$LEV0= 0
##$LPBIN= 0
##$MAXI= 10000
##$MC2= 0
##$MEAN= 0
##$ME_mod= 0
##$MI= 1.114404
##$NCOEF= 0
##$NC_proc= 0
##$NLEV= 6
##$NOISF1= 3.799351
##$NOISF2= 2.8
##$NSP= 1
##$NTH_PI= 0
##$NZP= 0
##$OFFSET= 15.70392
##$PC= 1
##$PHC0= -19890.07
##$PHC1= 3.252718
##$PH_mod= 1
##$PKNL= yes
##$PPARMOD= 0
##$PSCAL= 0
##$PSIGN= 0
##$REVERSE= no
##$SF= 200.130013532006
##$SI= 16384
##$SIGF1= 3
##$SIGF2= 2
##$SINO= 400
##$SIOLD= 16384
##$SREGLST= <1H.CDCl3>
##$SSB= 0
##$STSI= 0
##$STSR= 0
##$SW_p= 3612.71676300578
##$SYMM= 0
##$S_DEV= 0
##$TDeff= 0
##$TDoff= 0
##$TI= <>
##$TILT= no
##$TM1= 0
##$TM2= 0
##$TOPLEV= 0
##$USERP1= <user>
##$USERP2= <user>
##$USERP3= <user>
##$USERP4= <user>
##$USERP5= <user>
##$WDW= 1
##$XDIM= 8192
##$YMAX_p= 0
##$YMIN_p= 0
$$ End of Bruker specific parameters
$$ ---------------------------------
##NTUPLES= NMR FID
##VAR_NAME=  TIME,          FID/REAL,        FID/IMAG
##SYMBOL=    X,             R,               I
##VAR_TYPE=  INDEPENDENT,   DEPENDENT,       DEPENDENT
##VAR_FORM=  AFFN,          ASDF,            ASDF
##VAR_DIM=   8192,          8192,            8192
##UNITS=     SECONDS,       ARBITRARY UNITS, ARBITRARY UNITS
##FACTOR=    0.0002768,     1,               1
##FIRST=     0,             0,               0
##LAST=      2.2672688,     0,               0
##MIN=       0,             -572597,         0
##MAX=       2.2672688,     515614,          0
$$ Real data points
##PAGE= N=1
##DATA TABLE= (X++(R..R)), XYDATA
$$ [...]
2036a529L349l342k13M486m216Q9M136l641n9L319k774o37L532l371o90L956l878
2053a483k42L955l730l72L691k149r94L247k157j045M061l291q19M057l618p08
2069a597L441k692o89L006k248j085L608k371j048M130l041p64L690k342r32K845
2085A911k028j261L146k328j330L800k716j124L719k410j032L282j587j284L169
2100A927j839j178L065k283j125L227k223j026K572j532j118K481j227r45K582
2115A358j368j053K718j107j681K769j447j469K237q06j405K098j143j345K456
2130H12q21j341K473r71j240K269p06j176J821m23j394J681j079j220K035p49
2146b9j406J871m26j172J703k58r70J463k74j144J612n84j079J211l30j182R59
$$ plain form
2036 -1529 1820 -1522 -1735 2751 -1465 -1376 2760 -881 -940 2379 -395 -1032 2500 -871 -1561 2395 -1483
2053 -1483 -1725 2230 -1500 -1872 1819 -330 -1324 1923 -234 -1279 2782 -509 -1328 2729 -889 -1597
2069 -1597 1844 -848 -1537 1469 -779 -1864 1744 -627 -1675 2455 -586 -1350 2340 -2 -934 1911
2085 1911 -117 -1378 1768 -560 -1890 1910 -806 -1930 1789 -621 -1653 1629 42 -1242 1927
2100 1927 88 -1090 1975 -308 -1433 1794 -429 -1455 1117 -415 -1533 948 -279 -1224 1358
2115 1358 -10 -1063 1655 548 -1133 1636 189 -1280 957 151 -1254 844 -299 -1644 812
2130 812 -9 -1350 1123 152 -1088 1181 475 -701 1120 697 -697 984 -95 -1315 720 -29
2146 -29 -1435 436 10 -1162 541 283 -687 776 502 -642 970 386 -693 518 188 -994 -35
2163c5N2j156J196q6q32J331k34o73P77L09j034R52R4r60O95j71q31Q15k26q44
2183h61P02J38o28O78J89o42O77J80n34P52l86k95L09Po14K68L83j008q6M93J33
2204a45R1j71j12N32j82L55r9R3j81R8K2k33l46J5J6N0l70J80J06Q6M02k96J82
2227I3K46l68J03K71m40J97L15l41m97N31m48P9K99p07L43M83k07K0P09l35j54
2248A92N93p76m29R99q35j22O32q21j55P88n1o69J199n72o04J359n14k97Q68m35
2268C50m88O39l68p73J047m85q07J026l64p18J405o45n81J458l99l61O59k8j117
2287e50J223n04q53J010k31j315J385j67q11R36J74j115J361r4p81R34J06j529
2305h21J320Qj297J054J83j479J018K36j448J495J65j379J247L71j185J271J31
$$ plain form
2163 -35 17 -1139 57 -29 -861 470 236 -437 340 649 -385 567 661 -299 396 225 -606 209 -17 -861
2183 -861 -159 -21 -649 29 218 -424 253 433 -101 651 265 -30 279 286 -328 -60 323 -685 -771 -278 -145
2204 -145 -54 -225 -337 195 13 368 269 362 181 279 301 68 -278 -263 -247 -197 -567 -387 -281 -195 207 -89 93
2227 93 339 -29 74 345 -95 102 417 76 -421 110 -338 -259 40 -667 -324 159 -48 -28 681 346 192
2248 192 785 9 -420 579 -256 -378 254 -567 -722 66 15 -654 545 -27 -631 728 214 -83 785 350
2268 350 -138 501 133 -640 407 -78 -885 141 -223 -941 464 -181 -762 696 297 -64 595 567 -550
2287 -550 673 169 -684 326 95 -1220 165 -2 -813 123 297 -818 543 449 -332 602 708 -821
2305 -821 499 507 -790 264 447 -1032 -14 222 -1226 269 434 -945 302 673 -512 759 890
2322H90j457J265J75j658R80K81j841J460K15j330J197J65j408J237Q71j777J330
2339E95O68j852Q24P88j763Q23P36k188J042Q15j706R81J246k028J081J030j949
2356h57J196P35j497P66P56k020O51J211k103P15J301k082P14J522k160P27J549
2373A124j869N38J557j775K95J585j932J03J332j864M05J454k007M75J613j733
2389f99K29J971k028L15J794k018M84J408k345L11J673j968K7J792j824k75K220
2406A067k045N10J681j839L70J756j619l16J792j725l10K180k091n25K109j990
2422i95k39K393j862k20K235j703k03K231j542q52K383j879l67K137k403q9J917
2439I42j512n57K119j502n70K397j730l39K306j676p19K203j475n16J715j447
$$ plain form
2322 890 -567 698 873 -785 195 476 -1365 95 310 -1020 177 342 -1066 171 1042 -735 595
2339 595 1263 -589 235 1023 -740 83 819 -1369 -327 488 -1218 -237 1009 -1019 62 1092 -857
2356 -857 339 1074 -423 343 1099 -921 -270 941 -1162 -447 854 -1228 -514 1008 -1152 -425 1124
2373 1124 -745 -207 1350 -425 -130 1455 -477 -374 958 -906 -501 953 -1054 -579 1034 -699
2389 -699 -470 1501 -527 -212 1582 -436 48 1456 -889 -578 1095 -873 -846 946 -878 -1153 1067
2406 1067 -978 -468 1213 -626 -256 1500 -119 -435 1357 -368 -678 1502 -589 -1114 995 -995
2422 -995 -1234 1159 -703 -923 1312 -391 -594 1637 95 -757 1626 -253 -620 1517 -886 -975 942
2439 942 -570 -1127 992 -510 -1080 1317 -413 -752 1554 -122 -841 1362 -113 -629 1086 -361
2455c61q52K422j790j102K780j565q92K606j535n93K176j093r85K046q91j155
2471g84K116j686q01K271j706q11K274j197p93J995q54j103K554j102j321K531
2487A583j500r26K085j374q59J567o39j323K093r21j217K493j165j031K164q12
2503B18p94J543n41q13J619p31j766K193j212j147K313j155o82J568p15l53J003
2520E48j11j234J992n36j284J668j105r18J581q13n61J151n38p04J053J24j175
2537h62J380mj182J571n19n28P53n25n54N52j25q67Q75J66j060J258m92l65R17
2556C89l94J22L54j15p27Q60lr60P53k90o89Q43o15o6O82m73j7M12K54n28N54
2577C46M01r06P92n8n80kk32L30m24J49j44j01N75p04O41K17k91M94n96M13K52
$$ plain form
2455 -361 -1213 1209 -581 -1683 1097 -468 -1360 1246 -289 -882 1294 201 -784 1262 371 -784
2471 -784 1332 -354 -1155 1116 -590 -1401 873 -324 -1117 878 24 -1079 1475 373 -948 1583
2487 1583 83 -843 1242 -132 -991 576 -63 -1386 707 -214 -1431 1062 -103 -1134 1030 218
2503 218 -576 967 426 -387 1232 501 -1265 928 -284 -1431 882 -273 -955 613 -102 -455 548
2520 548 437 -797 1195 659 -625 1043 -62 -980 601 -212 -773 378 -160 -864 189 313 -862
2537 -862 518 514 -668 903 384 -144 609 84 -470 82 -43 -910 -35 131 -929 329 -163 -528 389
2556 389 -5 117 471 356 -371 489 486 -474 279 -11 -700 143 -472 -538 144 -329 -346 66 320 -208 346
2577 346 747 -159 633 575 -5 -7 -239 91 -333 -184 -328 -429 146 -558 83 300 9 503 -93 320 572
2598E72m86L24o59O10n42k46J51l7P9j49O30l36L1M65k42J37L93n47N29m65j32
2619H0l05L91l46l96Q46r50K24O59n34L37P04o97J5M39j29k57N00q23j34P50p03
2640c29LN60q75K05P24p21l5J102n63l59J296p30l94J018j042R3M90q98n9P76
2660B62o63l23J328q53l90J420p18l42R74r66J80J045r91m52J255p99p03J032
2678B96n23p64J585j045j94J195q96R2R76m94p61J590q16p48J220r77l00Q99p70
2697d35l09J141p43n81J677p42r25K008o14r79J566j046n10J053p53m67J102l65
2715G8j215J406n43n80J657o93o50J367m58q42J140k79j028J119l17q92J201n76
2733a05j094J674n44p55J028k83n25J183L3j029Q57J85j132J059k83j077J100
$$ plain form
2598 572 86 410 -249 361 -181 -427 -276 -313 -234 -383 247 -89 -58 407 165 302 695 148 677 212 80
2619 80 -225 166 -180 -576 270 -680 -456 203 -331 6 710 13 28 467 338 81 581 -242 -376 374 -329
2640 -329 -326 234 -641 -436 288 -433 -468 634 71 -288 1008 278 -116 902 -140 -47 443 -455 -514 262
2660 262 -401 -724 604 -249 -639 781 63 -279 695 -271 -91 954 -37 -489 766 -33 -736 296
2678 296 -227 -991 594 -451 -645 550 -346 -254 722 228 -533 1057 241 -507 713 -264 -564 335 -435
2697 -435 -744 397 -346 -927 750 8 -917 1091 477 -502 1064 18 -492 561 -192 -659 443 78
2715 78 -1137 269 -274 -854 803 110 -540 827 369 -473 667 388 -640 479 162 -730 471 -105
2733 -105 -1199 475 -69 -824 204 -79 -604 579 612 -417 440 625 -507 552 269 -808 292
2750B92m92n06P49K4q25R82K36r96J192l77p94J013K0r54J037m17p17N42J7p77
2770g51J110l57j012J314R6j054J091m4o65J046l16q35P06k5j187J169j13r08
2788g35N91J00o55P49J8n63P38O43j318P87L71j272Q99O8r20M25L45r68L05M17
2808B5p79M99M82o99N77N75r74M11N14p13R0N23q23o0P51q01NP02r55K75P56o21
2830b40K33L28l42Q0M47l74p4N54q27K60L13o41k12P89p24j13Q70l88l35R10n61
2851d7j20Q46n95o7L73m71j49N60o59n0M68k94k89O01m19J94M01l47J8O51m43
2872A62k87P07m10k80N41o14l28Q70o01p0L21r4l96O69Pj57L71J19p31P58k01
2893C56m28J43k90k75N82k48m06N26J92n38P83l90k05O47n9m98P77m25n54M43
$$ plain form
2750 292 -200 -706 43 67 -758 224 460 -536 656 279 -515 498 518 -436 601 184 -533 9 26 -751
2770 -751 359 2 -1010 304 400 -654 437 393 -272 774 458 -377 329 304 -883 286 173 -735
2788 -735 -144 -44 -699 50 68 -495 243 886 -432 355 726 -546 353 421 -499 -74 271 -697 -392 25
2808 25 -754 -255 227 -472 105 680 -294 117 631 -82 8 531 -292 -352 399 -402 -397 305 -650 -375 381 -240
2830 -240 -7 321 -21 59 506 132 58 612 -215 45 358 -283 -495 294 -430 -543 327 -61 -396 514 -47
2851 -47 -167 679 84 17 390 -81 -230 330 -329 -379 89 -205 -494 107 -312 -118 283 -64 -46 605 162
2872 162 -125 582 172 -108 433 -181 -509 361 -240 -310 11 -83 -479 190 197 40 411 530 -201 557 356
2893 356 -72 71 -219 -494 88 -160 -566 -40 152 -386 397 7 -198 449 390 -108 669 244 -310 133
2913A33p2n26O62l50m98O25l3k77O73k13k61O13j68j84M66k69k51L89l63k70K9
2934a45p8l02J89M62o22N41%k94M67j3l20N05k1l69J07J04l28j49L06m08kK16
2956a54k57L03K38k05L56o2J3L32l03m08K37j64k64J52n0P0j12j59lK62J26P3
2978B1KJ51n0L66j45k04K33l01j73j93L02j82j74r5L43j5J05J9m1q8L51N7j39
3001A50J05j72J02n7k93J44o8k61J03K04r0j57N47j4n08Q03l58j14J25Oj76J12
3023A33p2m14N93l51n04O65l23k45Q56m58k11O19j89P7K52j25n98N17j47j88J27
3044A4m17j77P21o54M6Q13k09n21Q72k91j96Q67o57q9M22k77n83N10l11n77P05
3065A1r0l96Q36k21n89Q70m2m71P59p32j65P21k95p49O30k70n81J029l62m98J057
$$ plain form
2913 133 61 -465 197 -153 -651 -26 -59 -336 337 124 -137 476 308 124 590 321 70 459 96 -174 -145
2934 -145 -223 -525 -336 126 -496 45 45 -249 218 205 -115 390 369 0 107 211 -117 -266 40 -368 -370 -154
2956 -154 -411 -108 130 -75 281 219 232 564 261 -147 90 -74 -338 -186 -236 -166 -278 -437 -440 -178 -52 21
2978 21 23 174 124 490 345 141 374 73 -100 -293 9 -173 -347 -442 -99 -114 -9 10 -31 -119 232 289 150
3001 150 255 83 185 128 -165 -21 -89 -350 -247 -43 -133 -290 257 243 -265 538 180 66 191 197 21 133
3023 133 61 -353 240 -111 -615 50 -273 -518 338 -120 -331 288 99 176 428 303 -295 222 75 -113 14
3044 14 -403 -580 141 -513 -467 346 137 -384 488 197 1 868 211 122 544 267 -316 194 -117 -694 11
3065 11 -79 -475 361 140 -449 421 379 -92 667 -65 -230 491 196 -553 77 -193 -774 255 -107 -605 452
3086D52k81m21P18l36l26Q12m16o30Q47l44q85J054m70l59O70l94m43R16m6n66
3106d48J006l41m22J165n54j013J141m08o85R84k47j150R47k40m32J096n72l88
3124e61Q86j54l72N06j37l99O29k02q32J017l42n48P47k64j030J251j43o43R23
3143C32k4o63R25l04m70P46l00n84O31k40m73O18M5j047P66J97n53P70k57p09
3163e94J103l0j105J074J43r60L68no07O90J88q24O16J43j212J306J58p79M05
3182G8J76l10N98l89l67M25n2o93O16r8n93L65M17q37P64P8o81Q57J9p09Q96l
3204E57j034P87j19q87O26K89p31N35j27n38J023j42m06L71J68n99L72M32r81
3223d04O58n7o63O44k16n21L48j90J6L07M22p03P98j40m73O52j47n50M76N8l99
$$ plain form
3086 452 171 -250 468 132 -194 618 202 -428 419 75 -810 244 -226 -585 85 -309 -752 164 118 -448
3106 -448 558 217 -205 960 406 -607 534 126 -559 425 178 -972 -25 -265 -697 399 -173 -561
3124 -561 325 171 -201 305 168 -231 398 196 -636 381 39 -509 238 -26 -1056 195 52 -591 332
3143 332 308 -355 570 266 -204 542 242 -342 289 49 -424 194 239 -808 -42 155 -398 372 115 -594
3163 -594 509 479 -626 448 591 -369 -1 -6 -613 77 265 -559 57 200 -1012 294 452 -327 78
3182 78 254 -56 542 153 -214 211 159 -534 82 -16 -609 -244 173 -664 100 178 -503 354 373 -336 560 557
3204 557 -477 310 191 -696 -70 219 -512 23 -104 -642 381 239 -167 204 372 -227 145 577 -404
3223 -404 254 197 -466 178 -38 -559 -211 -401 -385 -78 344 -359 439 299 -174 478 331 -219 257 315 -84
3244h4k8L69p03K66K51l34N00j98l11N87Pm01J57J12j43j27J01j11P9k0m39M87
3266A7m6j16L78k00j58K7K64k5l74M79q9K21k40l85J96J34j1m70M00J2l05N59
3288B68m40J04J84k22L52K6j26p2M9N0l24J28j06N7p5j05J98m5K53k5k06L02j93
3311C2L47j51k25K66q6l04K1J72m79L02l5M2k13L20m6m8J84J58J25j86J9O3j26
3334A52l15K46K27m28R1Oj78L12l78K01j28N1K89m00L94m6J25q9j43K23j30j76
3356i4N3K7l77K34j8K67l7K04L3j50M2J28J45l82j36J87o6K2l66J11Pj10K15n8
3380a19o4J14J05K1Q3m2r2J44mj02K1k30j53J69k45M95n10M42P5j03N8Q4L2j60
3404A9K07j0J10j66k82J50j25j78J11N5Q2k01J19J90J07R1q3j20J72k05K95k55
$$ plain form
3244 -84 -112 257 -446 -180 71 -263 237 39 -272 315 322 -79 78 190 47 -80 21 -90 -11 -31 -470 17
3266 17 -29 -145 233 33 -125 -98 166 141 -233 246 157 378 138 -247 -51 83 72 -398 2 14 -291 268
3288 268 -172 -68 116 -106 246 272 146 74 123 173 -151 -23 -129 -72 -147 -252 -54 -99 154 129 -77 225 32
3311 32 379 228 3 269 183 -121 -100 72 -407 -105 -140 -98 -311 9 -37 -85 99 257 382 196 215 278 152
3334 152 -163 83 310 -118 -27 -21 -199 113 -265 -64 -192 -141 148 -252 142 96 221 132 -11 212 82 -94
3356 -94 -41 -14 -391 -157 -175 92 55 259 292 142 184 312 457 75 -61 126 60 82 -284 -173 -166 -276 -61 -119
3380 -119 -183 -69 36 57 140 98 6 150 146 44 65 -165 -318 -149 -394 101 -409 33 108 5 63 147 179 19
3404 19 226 216 326 160 -122 28 -97 -275 -164 -109 -27 -228 -109 81 188 279 196 76 248 43 338 83
3426H3j80J98j7k14K7l7n2K50k92m7N41k74Q6K13k52J99p4N0n79J20L48k95J18
3449h0P1m59N46ok31K75J87l10J30K5k63L79l9m57N43j18m61M53k95k67L57K64
3471B44k99o4M15p40N86J66l85M86k33j63K24k42k84K63J24l60K42J71n90N96
3491A57p0k57L37%j42K02j9m58J53M84q04M91ml63L40l0n06M79K67k74p5O84q03
3514b11P0O62r79R38l97n27L36mk94M03J26n40L00M46p93O36J17o48N53o3m48
3535c17N21J15m75J63J50p38M77J62o77R53j39n37P38k20j1j62O88p63J28L10
3555C66p10N36k05o31Q14j42l93L84J01K9j09L96o06L78M14r92P53k10n64M83
3575I2k2k22q1L75q32M81L36o36R48p0n83P37k91J06l46M30n83J60M06r16N88
$$ plain form
3426 83 -97 101 84 -130 -103 -140 -192 58 -234 -281 260 -14 72 285 33 232 158 208 -371 -251 97 -198 -80
3449 -80 -9 -468 78 72 -159 116 303 -7 123 148 -115 264 225 -232 311 193 -268 185 -110 -377 -20 244
3471 244 -55 -119 296 -444 142 308 -77 409 176 13 237 -5 -289 -26 98 -262 -20 151 -439 157
3491 157 87 -170 167 167 25 227 208 -250 -97 387 -417 74 70 -293 47 17 -489 -10 257 -17 -92 592 -211
3514 -211 -141 521 -458 480 83 -444 -108 -112 -406 -3 123 -417 -117 329 -464 172 289 -359 194 131 -317
3535 -317 204 319 -156 7 157 -581 -104 58 -619 334 195 -342 396 176 165 3 691 -72 56 366
3555 366 -344 192 -13 -644 170 28 -365 19 120 149 40 436 -170 208 622 -370 383 173 -391 92
3575 92 70 -152 -233 142 -690 -209 127 -509 439 369 -214 523 232 338 -8 422 -161 -1 405 -511 77
3596G7Q8o24Q32n34P8L2K83l83J06L98n54O50j2q33P67l79l23M05l04K09l02L38
3618A5k12N8L41q79P65N24q02N90m34K34o02O53l61j42L98o34M00M79r27P61l22
3639i7l2K30j26k0J05O4m51R4M82p27P01j67m03L58j15l0J46J49l20L31J73n21
3661a76N81j00l00K24k29j02J54l01k0j98N28j75Q4K02l67M11L4j48J81l65L28
3682B46n04K47q7k05O64n52K62k52j7L1N0L52J12m0k05j94N16n10J01p2j99M24
3704A68l57R7p8L9j9j57J52K10q5L34k74L01j53M3r2k56J97N5k23J16l84K10l6
3727a92O3L69l15K84l12K57P8m7k85J99r9j77J9J24k75M9J79L2Q9l94L71m7j82
3750b12L06J68L8K5k08P0j60j24n3P6j62J69R0l23L60k34Q5L9K61J31k17n5J89
$$ plain form
3596 77 165 -459 373 -161 -83 -51 232 -151 -45 353 -201 449 437 -396 371 -8 -331 74 -230 -21 -323 15
3618 15 -197 -139 202 -677 88 612 -190 400 -34 200 -402 251 -110 -252 146 -488 -88 391 -536 225 -97
3639 -97 -129 101 -25 -45 60 124 -327 -233 249 -478 223 56 -347 11 -104 -134 12 161 -159 172 345 -176
3661 -176 405 305 5 229 0 -102 52 -249 -269 -467 61 -114 -30 172 -195 216 250 102 283 -82 246
3682 246 -258 -11 -98 -303 361 -191 71 -181 -198 -167 -117 235 347 307 102 -92 424 -86 15 -57 -256 168
3704 168 -189 -92 -170 -131 -150 -307 -155 55 -30 304 30 331 178 221 129 -127 70 125 -98 18 -366 -156 -192
3727 -192 -129 240 -75 209 -103 154 232 185 -100 99 0 -177 -158 -34 -309 -260 -81 -49 40 -354 17 -30 -212
3750 -212 94 262 300 325 117 187 27 -97 -150 -74 -236 -67 23 -300 60 -174 -89 -50 211 342 125 70 259
3773B59k7k3k00j89J31J34l02O4J88j38lqN8L36j05K9L9j39J31o0k86Q4j24K36
3797H5j34r6Q8m4K19Jl2J41m03M71m58K42L1k25J47N9k44KQ9j05j1n4J77J18M2
3822A06k48L24j19m5M45k83K68n29J41k54J15L2j51j23K3M7L15K0R0Qo0j16K30
3845B36p7k32o6K17k18K52l25k26K72R7j76N1M87l48R6K45l01L74j00j14j25N4
3867G3n1j82L06j05k99K45j89o4L53k48M45j92K66L0n37M12l5J16m38J76j62l9
3889a19l03M31o10O77k7j58K05o8J04j4J71p2N9j40J0O4j67l08Q5L9K8O6k8m31
3913e06K39M42M2j20N2p4L0nM7l01L52n43J69J91m5k91L01p9k39M53k87L05P5
3936B08k6o1r6N3m6J1r8m4L3m4j79K20j75pM61Km1j97K09o0K1j36k17K74j59q4
$$ plain form
3773 259 232 209 9 -180 -49 85 -217 -153 35 -103 -106 -114 -56 280 175 204 243 104 235 175 -111 -27 -151 85
3797 85 -49 -145 -57 -101 118 119 87 228 -175 296 -162 80 111 -114 33 92 -152 -150 -61 -166 -177 -231 -54 64 106
3822 106 -142 182 63 18 463 180 448 -81 60 -194 -79 -47 -198 -321 -298 -251 64 84 174 182 122 6 236
3845 236 159 -73 -139 78 -140 112 -213 -439 -167 -70 -246 -195 292 -56 40 285 -16 358 258 144 19 73
3867 73 22 -160 146 41 -258 -13 -202 -266 87 -161 284 92 358 388 -149 263 228 344 -94 82 -80 -119
3889 -119 -422 9 -601 76 49 -109 96 28 132 118 289 217 276 136 146 210 43 -265 -180 -141 -113 -47 -75 -506
3913 -506 -267 175 217 97 149 75 105 100 147 -154 198 -345 -176 15 -30 -321 -20 -99 -338 115 -172 133 208
3936 208 182 121 25 78 32 43 -55 -99 -66 -110 -289 -69 -244 -251 210 212 171 -26 183 123 144 8 -209 65 -94 -178
3962a78N14m87j46M89l82J06L1j27J28J6j0L07J4k80J23J07k23j95K65m54J65
3983b17R8J8o6M22j42K9L24m40M4J24q8n5K02j39l23O4m4l9L05k36j27M26p3R3
4007A60R0j43M7J76j15l68J34N2j75J97k03n8P0P6J1J88M6k35K29O1l39M00l05
4030dL83J03p06j66J55r2J16K27l01J32M08k57M4r2j12K54O0k49K30p9k57q3J56
4053a30Q2m21O51n28J28J53k06M27O0n14L57K05N1m68L53l18j96L65l26K26k19
4074b68K2mJ31J04l17N10j26j9L34j31j27K14l54J07j36Ql48J76O4m7K63j50j4
4097a08J28J23m7j93l4L87j52q0j12K00l18Q5J37j9K58m60J38J6R7O5p7J4J88
4120B36j69j45J36j09K20m23L46l44J28j6j23L68m76N63l24J91K5j75M99k28j64
$$ plain form
3962 -178 336 -151 -297 192 -190 -84 -53 -180 -52 -36 -46 261 275 -5 118 225 2 -193 72 -382 -217
3983 -217 -119 -101 -167 255 113 142 466 26 70 194 106 51 253 114 -209 -145 -189 -228 77 -159 -286 140 67 160
4007 160 250 107 154 330 215 -153 -19 33 -142 55 -148 -206 -136 -60 -49 139 185 -50 179 240 -99 301 -4
4030 -4 379 482 -224 -390 -235 -327 -211 16 -285 -153 255 -2 42 -50 -162 92 152 -97 133 54 -203 -286 -130
4053 -130 -48 -469 182 -346 -218 -65 -271 156 216 -298 59 264 315 -153 200 -118 -314 51 -275 -49 -268
4074 -268 -246 -250 -119 -15 -332 178 52 33 367 236 109 323 -31 76 -60 -52 -400 -224 -160 -207 56 -94 -108
4097 -108 20 143 96 -97 -131 256 104 24 -88 112 -206 -121 16 -3 255 -205 -67 -51 46 111 34 48 236
4120 236 67 -78 58 -51 169 -254 92 -252 -124 -140 -263 105 -371 192 -132 59 84 -91 408 180 16
4141A6J67k35J87n75L18K57m18L7j24L00k5q5M35l04J87K16j33J08l23K94j40
4162A60k03J0j83K35k49NJ46j99N68O6l59K39j9k21K79p7k38J0J14j90K52m96
4184c50J11L45l17l4M0K17P3MK63n28L92j7o38P37m36l4J2J53k93o0K63k03K76
4207b4m0j15M68n7k22K87j62q0K6mk78j87J73p5K84k72K83J04k26J24K83l58K81
4230B13l0n9K9M9j58k66J88j79K2K26l85J97K85l1j01J20K74m76J90L8k03M19
4252C62m00O6j57R4j17J54J5k00M8L14l35L76j6j68L06k54j8k5p6k28K55r5j77
4275b76P0l6Q7K42k78J7J2l6K65l6K89l02N1J28l76L38l25j4K41p3k39J75k3K63
4299A64kr4n3N5o2L4O5n1k44K97n90L88K23k29p4J98j0l7J84k38J38K57j47k47
$$ plain form
4141 16 183 -52 135 -440 -122 135 -283 -246 -370 -70 -95 -180 255 -49 138 354 221 329 6 300 160
4162 160 -43 -33 -216 19 -230 -225 -79 -278 290 356 -3 236 217 -4 275 198 -40 -30 84 -106 146 -350
4184 -350 -239 106 -211 -245 -205 12 85 89 352 -176 216 199 -439 298 -138 -172 -160 -7 -300 -360 -97 -300 -24
4207 -24 -64 -179 289 232 10 297 135 55 81 77 -201 -388 -215 -290 -6 -278 5 109 -117 7 290 -68 213
4230 213 183 124 153 202 44 -222 -34 -213 -191 35 -350 -153 132 101 0 120 394 -82 108 146 -57 362
4252 362 -38 28 -129 -35 -152 2 17 -183 -135 179 -156 220 204 36 342 88 70 45 -31 -259 -4 -99 -276
4275 -276 -206 -242 -155 87 -191 -174 -162 -198 67 31 320 18 69 197 -179 159 -166 -180 61 -12 -251 -76 -99 164
4299 164 162 68 15 70 8 42 107 56 -188 109 -481 -93 130 -99 -173 25 15 -22 162 -76 62 319 172 -75
4323g5L14j40j53QJ30j57k4j15r7K30RJ49j00lK00RL53m39L18q2k47M0j29L5j42
4348a08k11J60J77j11p0J56Pj45L22k06J85L68k04l81l8l03K10J70J35m38M50
4369A25m71J89M3J49M2j27K26J0Nm3j93J99k57K19j79j02m8J24k62K09J39k73
4391b76L54P0pQ8J74l24r6L04m25o5j4n1J43r1J42J6jN2k3K14n4p9J82j77P6j67
4417c5m8J04Q9j96P1J55l51rJ43J93j25K13o5k1J4J5j62q5M68m09J18m15K10J01
4441b7j67J86P4J87k75J75k03kK36M9n6k4k70K59j10j31M9k4l9m9K0J45q5M1J10
4466F9Q9k57J89J39j01o2j13n8L11p8k61O1Rj50J36J34L7o7k5k13O39j58n8O3
4490B75k31P8j89K88l17o3J32l2R8j97L89j44j15L8J7L01n1l08K51j92oj83J93
$$ plain form
4323 -75 239 99 -54 -46 84 -73 -97 -212 -309 -79 -70 79 -21 -24 176 185 538 99 417 335 88 128 -1 34 -108
4348 -108 -319 -159 18 -93 -163 -7 0 -145 177 -29 156 524 320 -61 -99 -402 -192 -22 113 -325 125
4369 125 -346 -157 -114 35 77 -50 176 186 191 148 -45 154 -103 116 -63 -165 -213 -89 -351 -142 -3 -276
4391 -276 78 148 141 229 403 79 -17 287 -138 -203 -217 -268 -125 -216 -74 -58 -59 -7 -30 184 130 51 233 56 132 -35
4417 -35 -83 21 110 -86 -15 140 -211 -220 -77 116 -9 204 139 118 132 147 -15 -100 368 -41 77 -338 -128 -27
4441 -27 -194 -8 66 253 -22 153 -50 -52 184 233 177 153 -117 142 32 -99 -50 -74 -113 -162 -142 3 -82 -41 69
4466 69 158 -99 90 229 128 66 -47 -105 206 128 -133 -72 -63 -213 -77 57 94 27 2 -211 428 270 212 275
4490 275 44 122 -67 221 -96 -159 -27 -59 39 -158 231 87 -28 10 27 328 277 -31 220 28 22 -161 32
4513C2j9j13j4J9K05J01q1l5j15P5K73l22J27k53R0J6j88J40r0R8p9n9J98j39
4537a33L10k24K02N5q8J42m3l65J86N0j75p5j35J38j79L13j24K30p1Q9o8K44k79
4560@M7J00j22J0N5k24K0Nj77J72k09K38L0j43K38p8K56l35J33J86k33N1j53L5
4584i8j24K17j31k72K09K65k6L8r7l0J91l6P9k9k39J20J95l81J00jm75K14l3K47
4608i7J89k93J78L43p2M2k71J89k36r0L49k81K58j57m60L84k5j95K23N9K0J11
4630A68j5Ok19K85m19L04j05k05J88j65o4k4K46Ok34M76l57L72%k51J70j50K31
4653B44k16K84k60k52M11l96MK55o57L80Q2J01jR5j0J07n9P1j63O8j24J10k84
4676b10j5J80j25k1r6L27k86L12K30o18M66K2l85M25q2o4j44K26j60j96L28j49
$$ plain form
4513 32 13 -100 -114 -95 110 211 130 95 -20 55 328 6 133 -120 -30 -14 -202 -62 -152 -54 -133 -192 6 -133
4537 -133 177 -47 155 210 122 264 221 -144 42 92 -83 -158 -293 -155 -334 -21 -145 85 14 103 35 279 0
4560 0 47 147 25 35 90 -134 -114 -109 -286 -114 -323 -85 -55 -198 40 -38 218 -117 16 202 -31 20 -133 -98
4584 -98 -222 -5 -136 -408 -199 66 40 78 -19 -49 142 106 185 156 -83 37 232 -149 -49 -50 -525 -311 -344 -97
4608 -97 92 -201 -23 320 248 290 19 208 -28 -118 231 -50 208 51 -409 -25 -50 -245 -22 37 57 168
4630 168 153 159 -60 225 -194 110 5 -200 -12 -177 -241 -265 -19 -13 -247 229 -128 244 244 -7 163 13 244
4653 244 28 312 52 -200 211 -185 -181 74 -583 -203 -121 -20 -21 74 64 171 112 183 20 88 -36 74 -210
4676 -210 -225 -45 -170 -191 -287 40 -246 66 296 -322 144 166 -219 206 124 60 -84 142 -18 -214 114 -35
4698c5p9K17l12K28J57m59J99L37k44J36l5j36P5P0l12M10k11k79N30n15L54o
4720I0K17j58j26L26l87J44L64p86M83j52l55M12k59L0j88J14j02J35L03k28L99
4741B76k34M5m2K58j30l39l7J25n9R6m90K52N80p52O76l07j35L82l4p9o0K19k82
4764g1K22J54n91J12K03m08K04R6K60k60rJ43M3Q8k15L37l26n8L70j78k97J30
4786e1j36j19PK51l06N09j02k32K56N9j65J72K17l62R6M7j70l01M54l26L8N0p6
4809a90O8J74j24N3j3k6k34O88l63J89J86k47j19j81O7o2Lk73L99L0k08K72q4
4832Ek50M33P2l13J05o3J01k55N5J58k07K5j82J22K6K54K4k13J71J45k55J92j83
4855c3lJ11o3Q9k56Q1L0l00J05J24JN2J0R9K8j44K30P6k12K8k31R8K36j3j71m7
$$ plain form
4698 -35 -114 103 -209 19 176 -283 -84 253 9 145 110 -26 49 119 -193 217 6 -273 257 -258 96 90
4720 90 307 149 23 349 -38 106 470 -316 167 15 -340 72 -187 -157 -345 -231 -333 -198 105 -123 276
4741 276 42 87 45 303 173 -166 -203 -78 -137 -41 -531 -279 301 -451 225 -82 -217 165 131 52 -8 211 -71
4764 -71 151 305 -286 -174 29 -379 -175 -79 181 -79 -88 55 98 186 -29 308 -18 -76 294 116 -181 -51
4786 -51 -187 -306 -299 -48 -354 155 53 -179 77 136 -29 143 360 -2 94 141 -29 -330 124 -202 -164 -114 -190
4809 -190 -122 52 -72 -19 -32 -58 -292 396 33 222 408 161 42 -139 -72 -134 -131 -404 -5 25 -183 89 5
4832 5 -245 188 260 -53 52 -11 90 -165 -110 48 -159 -134 -316 -194 -168 86 110 -103 68 213 -42 150 -33
4855 -33 -36 75 12 101 -155 -74 -44 -344 -239 -115 -114 -62 -52 47 75 -69 161 237 25 53 -178 -80 156 143 -28 -75
4881g5M0j35k2L11j18j09J34M0N5J6j07L13n48L65q8m51K31P2J07j24J20Nk03
4904a71K51J11j12J19mk79J44o2o9J64j38j19N9R4m9J94k32K08r7J39j62K31j1
4927B09m9rk32K02k33r2L5Oj08K60K4k05L83q4o7O1Qk0J9r2jK05l07Q7o9o8Q9
4954d8j8n6k29L67Q4j20J22K62k20q4j31J70o9n5K25j66j54j59K42m6l13L82J
4977a3RQ7J24K60k95M7q9J82k48m08L81Oj04j17j61R6N8R2L27k97P9o0K55Lj24
5002I0j62J39k15J58k90L14j98M8j08J72j9q9J99j20J76L04n36J94J72k46k59
5023b76K22K89m02L20j48l2o3k15L61j97J91K09j3j75k4K49r0j84m3j70J80j14
5045a25o9N7P3k29K40J58o4j40K90n2J01o2k33K57O8m13P3k53L09j15j73J99o6
$$ plain form
4881 -75 -35 -170 -192 119 1 -108 26 66 121 137 30 343 -205 160 72 -379 -148 -76 31 -93 27 32 -171
4904 -171 80 191 79 198 194 -85 59 -3 -72 92 -46 -165 -106 -12 -61 133 -99 109 12 151 -11 220 209
4927 209 160 151 -81 121 -112 -204 -169 -163 -271 -11 13 -192 191 107 40 101 109 89 108 16 15 220 -87 0 -69 -137 -48
4954 -48 -66 -122 -351 16 100 -20 102 364 144 60 -71 99 30 -25 200 34 -120 -279 -37 -83 -396 -14 -13
4977 -13 -4 83 207 467 172 219 130 312 64 -344 37 43 -61 -178 -339 -243 -185 -93 234 -63 16 -44 211 214 90
5002 90 -72 67 -148 10 -280 34 -164 -116 -224 -52 -71 -160 39 -81 95 399 -137 57 229 -17 -276
5023 -276 -54 235 -167 153 5 -27 -90 -305 56 -141 50 259 246 71 47 296 206 22 -21 -191 -11 -125
5045 -125 -194 -137 -64 -293 -53 105 41 -99 191 139 240 178 -55 202 270 -143 -70 -323 -14 -129 -302 -103 -169
5068a69L16l05K83K9k09J80j11L6q6K68l65o6K90l01rJ43j37L1l4L00q6L38j08
5091B28m03N18l67n7J65m0K1j08k55J60J27j71m2L37Q4l58L18k19r4N12m61J83
5113G8k14p0J25P2O8m28L36j59K00J89l67K73Jp2j32K17l0R6l0m00L84j36o2k98
5137c59M13k40L22q4m4j4J40k33K16J70j80m0K05k53o7M7j00k5j45J80p7L20j93
5160d1J7K87k85J60j03k0k1J17J09m14J90k32j77M42k6K7J4M3J2j49M3J79j93
5183b1J57L8k09K25j91K43j73q4N1j83K35j75J13k56L11P1k03K95k13k00K99k17
5205h7J43k20j36j06J39L01q4O8Q8l91M42l16J40q6L4M1M54j8n99M33l42j41L23
5228H0j4k91M3J87m5p8j12J21P5M20j69j61N5j81K26k06k3J70k40j63K91K7m13
$$ plain form
5068 -169 147 -158 125 154 -55 125 14 50 -36 232 -133 -199 91 -210 -219 -76 -213 -182 -216 84 -2 336 228
5091 228 -175 343 -24 -81 84 44 65 -43 -298 -138 -11 -182 -224 113 197 -161 157 -62 -156 356 -105 78
5113 78 -136 -206 -81 -9 59 -369 -33 -192 8 197 -170 103 104 32 -100 117 87 183 153 -247 137 1 -61 -359
5137 -359 54 -186 136 52 8 -6 134 -99 117 287 107 67 272 19 -48 -1 -101 -126 -271 -91 -168 152 -41
5160 -41 -24 263 -22 138 35 15 -6 111 220 -194 -4 -236 -413 29 3 30 44 87 99 -50 -7 172 -21
5183 -21 136 174 -35 190 -1 242 69 -15 36 -147 88 -87 26 -230 81 152 -51 244 31 -169 130 -87
5205 -87 56 -164 -300 -406 -267 34 -50 18 106 -285 157 -159 -19 -105 -71 -30 424 406 -193 240 -102 -243 80
5228 80 66 -225 -182 5 -40 -118 -230 -109 -34 386 217 56 111 -70 156 -50 -73 97 -143 -306 -15 12 -401
5251d01M44n4J03O4Q8m89O63l16l8l2M6j40L08j87j50K41j82M30m23LJ37j45%
5274c0J05k5j89lM85m79K8L3J2l09L59n2r0R0PJ14P5n1j82K76k31K27k48oK4p0
5300a30R3M6k82K65j13k6L51j6k11M1K69k10j62K50j59N2j96J31l04J16K98k23
5322a20n6j53K93K7OM2JJ29k7q6O7j10q2Q8N1j88L44k69j50J20L6q2J44M8M9k3
5348I9N6j82j43K06n6j30J9qj5J51J35l00J46k9j9K41r0P7j6M9k38n5K26j5L1
5373A40m10j9K88K09k23J19l9J08p2N9r6P8n8j10J62l6k2n9l4j49J27l85M40%
5397A8r4Q9M2o0p0J29R0o6M5k28k9L51n3j84k68L0K22o6j6K4K92k36j1K27j17
5422F1p0K89n73Q1J66o0J92o9k10J60o0n1j80L75j48J24K8j01J4L03j29j8m4k07
$$ plain form
5251 -401 43 -11 92 156 244 -245 418 102 64 32 78 -62 246 59 -91 150 -32 398 -25 -22 115 -30 -30
5274 -30 75 50 -139 -142 343 -136 -108 -75 -63 -372 -13 -65 -155 -65 -58 56 131 80 -102 174 -57 170 -78 -84 -60 -130
5300 -130 -37 9 -273 -8 -121 -147 204 188 -23 18 287 77 -85 165 6 58 -138 -7 -311 -195 103 -120
5322 -120 -176 -329 -36 -9 -3 39 40 169 142 56 123 13 -69 19 70 -118 226 -43 -193 -73 -37 -119 25 73 122 99
5348 99 155 -27 -170 36 -20 -150 -131 -139 -154 -3 132 -168 -22 -51 -70 171 81 158 142 191 -47 -102 124 109 140
5373 140 -270 -289 -1 208 -15 104 65 173 101 160 64 142 84 -26 136 100 78 19 -15 -164 -37 -422 18 18
5397 18 -76 13 55 -5 -75 54 144 78 123 -105 -134 217 164 -20 -288 -258 -36 -102 -118 -94 198 -38 -49 178 61
5422 61 -9 280 -293 -212 -46 -106 86 17 -193 -33 -93 -144 -324 51 -97 27 55 -46 -32 271 142 124 80 -127
5446a27J49q5p4K4J94l58M31l23J53m7L15l62K15P1k83r1L16k25o4J27n2K6J00
5469C0k57J80L60l28k82P41k37k52K68l47J22J28k36K2K3p0j2jn0K09Q9P8l51
5492a73J46O3J13J77k29j46o3j30K39J09l02L69n45J89P8J60j31J07J57jp4J04
5514B17j83l9K8j19J54K5k76K57Q0j63j25J91j71L28p6k7j72L17j86j0J5j83J05
5537a3J17k89K42l7k31J11M7k42J91J8J62J56j79K37m04J90j87J56l73K45L2j6
5559f7L9J25k25q2K65L4j5j44K23j79PJ16n0nj42n8q9K07K42m35J41j28K8K09
5583A7j14N1M5r7K28l1rj29k97J96M7K29n27L40J21j54K8K37q8J83j7k89K8l7
5607c9J07J80j51Q1j82Ol7o3kJ6q4K48k8Q8q4n1K48l63J73J50j76o6Q3k21n3J25
$$ plain form
5446 -127 22 -63 -137 -113 81 -277 154 -169 -16 -63 252 -110 105 176 -107 -198 118 -107 -171 -44 -96 -70 30
5469 30 -227 -47 313 -15 -297 444 207 -45 223 -124 -2 126 -110 -88 -65 -135 -147 -148 -198 11 100 178 -173
5492 -173 -27 36 149 326 97 -49 -112 -242 -3 106 -196 173 -372 -183 -105 55 -76 31 188 187 113 217
5514 217 34 -5 23 -96 58 83 -193 64 144 -19 -144 47 -124 204 128 101 -71 246 60 50 65 -118 -13
5537 -13 104 -185 57 20 -211 -100 -53 -295 -104 -86 76 232 53 290 -114 76 -111 45 -328 -83 -51 -67
5559 -67 -28 97 -128 -210 55 89 74 -70 153 -26 -19 97 47 42 -100 -158 -247 -40 202 -233 -92 -220 -192 17
5583 17 -97 -46 -1 -98 130 99 90 -39 -336 -140 -93 136 -391 -51 70 -84 -56 181 93 276 259 -30 -2 -39
5607 -39 68 248 97 178 -4 2 -35 -98 -100 -84 -168 80 52 140 56 5 253 -110 63 213 37 -29 54 -167 -220 -95
5633i5K02l08k3l7J66K14K17j12j74j8m5o7M55m12P8k29R4K02m00K35K80l18K25
5656A30j55M1J66k21L06pj2j97j5K84l16Oj72p8R5J97q1Q3k8j86J21J48q4J0O9
5681A04J26l74K20j81Nqp8K50Rk30J29O2M0L26m71j32K64j46J77J3k01k8m2j28
5705b94L28k15J41k32L08j20N8l9J56r3K19k98J08J6N6%Qj31r2p8N7K23n3j58
5729a25j82L14O2N2J54l85J98J13m72L82j51K6j67K06j04k6J34j06J95K32k60
5750I0K28k77L7KJ23k84l8q1J2L6K69m4j57J03j07K67j5k46L11j32k03N4N9k3
5774a6J48j36p3j3K33l54PK06o2N8J3n2j7J61N2j88L38m76K99k23n8NK66l4k74
5799a90J80R7k27J52R0O5n2k13L19j22NJ13j01j3r6j3j58K12rj13N6L6k50L42
$$ plain form
5633 -95 107 -201 -224 -261 -95 119 336 224 50 32 -13 -80 375 -37 41 -188 -94 108 -292 -57 223 -95 130
5656 130 -25 16 182 -39 267 260 248 51 36 320 4 10 -162 -240 -145 52 -29 54 26 -160 -39 109 25 35 104
5681 104 230 -144 76 -105 -100 -108 -186 64 73 -157 -28 34 74 400 -71 -203 61 -85 92 105 -96 -124 -166 -294
5705 -294 34 -181 -40 -272 36 -84 -26 -65 91 -2 217 -81 27 43 99 99 107 -24 -116 -194 -137 86 33 -125
5729 -125 -307 7 69 121 275 -110 88 201 -271 111 -40 -14 -181 25 -79 -105 29 -77 118 350 90
5750 90 318 41 78 80 203 -81 -119 -200 -188 -152 117 73 -84 19 -88 179 164 -82 229 97 -106 -52 7 -16
5774 -16 132 -4 -77 -90 143 -211 -204 2 -60 -2 11 -41 -58 103 155 -33 305 -171 128 -95 -153 -148 118 84 -190
5799 -190 -10 87 -140 12 102 167 115 -98 221 99 104 217 116 103 7 -6 -164 48 39 -74 -18 18 -232 110
5823A10j49J29J20k58k8R4k6k06L6K34k99P5K35k61J77q5K71nk8o2M5J49n32L65
5847A01j81J30j64P9l26K47k29J27J47J78r0J18L3k16J01n5j91K50K24k87L6O3
5869I5l68J33J69j85J31M64k54p8J30k21Q9O0l72J95J08k57J62J4k10N0j4J35
5891b4r9K09l02N10O2l68L18j45n7K6k9k65J41K67l46P3o4j19M45j28l58M46K5
5914B18L1J61j07k48o4N8j1j83O5m3J84q4q0J05j5q4J65Oj54K65o9j33QK07l37
5939a39K47r2N3j05m0k36L74rj43K4q2j11N69j93j33K99j54k88J44l4n1J02K7
5962B9j29L0J5j8M00k76j97L04k87J51Q5J36j68Jj93L1p6O7lJ2R4l4m2j08J31
5987d5O2J72j57o3n5l4p4L81k02j81K3L40l1p5j42R2K16k7Lr6P6p7j56J53N1l03
$$ plain form
5823 110 -39 90 210 -48 -76 18 -8 -214 -178 56 -243 -168 67 -194 -17 -102 169 164 136 74 119 268 -264 101
5847 101 -80 50 -114 -35 -361 -114 -343 -216 -69 109 19 137 170 -46 55 0 -191 59 283 -4 32 95
5869 95 -273 -140 29 -156 -25 439 185 107 237 16 105 165 -207 -12 96 -161 1 15 -195 -145 -159 -24
5891 -24 -123 86 -216 294 356 -12 306 161 104 130 101 -164 -23 244 -102 -29 -93 -212 233 105 -253 193 218
5914 218 249 410 303 55 -9 49 38 -145 -80 -123 61 -23 -103 2 -13 -97 68 74 -80 185 116 -17 -9 198 -139
5939 -139 108 16 69 -36 -76 -312 62 53 -90 -66 -148 -259 310 117 -16 283 129 -159 -15 -49 -100 2 29
5962 29 -100 -70 -55 -73 327 51 -146 158 -129 22 107 243 75 76 -117 -86 -162 -95 -98 -86 8 -26 -68 -176 -45
5987 -45 17 189 32 -31 -86 -120 -194 187 -15 -196 -173 167 136 61 -81 11 227 200 203 107 183 106 -50 103 154 -149
6013a49j09J15J09J00j19k77L58l9K20m8l27J6K19oR2l42K09j12n9J87j37P6M1
6036A8O6O9n0j7J85j13m8k47K85l1j15j14j52K05j30J27j97J47j0o5K54p6L46
6059C37k54J11J6m5r0J5J49m42L10l1j33k67N87k94K19k96r0L46j09J47j36M5
6081I5N5NL3k30m8J09j98K08nj62J14Pk23J12L18p3k22J00m0O3o0Q2j11L30j83
6106G6J40k98j69K32P3Q6k16k08N49k46j5R4L9j61j60M93k15j98J75k65K43j25
6128g6K3O0k34J12J78K2L4j66J95JO5m2m49M44q7l7j69j2qp2N08m93K14k4O0M40
6154D87m37J49j03j67o1L39m44J59R7j40j60K42mpK23k45L4K5r8P3J60k9M2o6
6178F9j98J94j04l8k17M26k91M3J17P6lqP6j49MK21n19K94J74l69L2R4k11K16
$$ plain form
6013 -149 -258 -143 -34 66 -53 -330 28 -11 209 161 -166 -150 69 63 155 -187 22 -90 -149 38 -99 -23 18
6036 18 84 153 103 86 271 158 110 -137 148 117 2 -112 -264 -59 -189 -62 -259 -112 -122 -187 67 -9 337
6059 337 83 194 210 165 75 90 239 -203 107 76 -57 -324 263 -31 188 -108 -198 148 39 186 50 95
6081 95 150 155 188 -42 -90 19 -179 29 24 -138 -24 -17 -240 -128 190 117 -105 -5 -45 18 -42 40 -71 259 76
6106 76 216 -82 -251 -19 54 140 -76 -284 265 19 4 98 137 -24 -184 309 94 -104 71 -194 49 -76
6128 -76 -53 7 -227 -115 63 85 119 -47 148 149 214 172 -277 167 80 43 -126 -138 -146 -218 290 -203 11 -13 47 487
6154 487 50 199 96 -71 -132 207 -237 -78 19 -121 -281 -39 -43 -50 173 -72 -38 -13 -111 -38 122 93 135 69
6178 69 -129 65 -39 -77 -294 132 -159 -116 1 77 74 66 142 -7 -3 218 -301 -7 167 -202 -170 -76 -287 -71
6202g1J2P1r0J50j88J71j4j15K77J28l21P3J92n90M32k20K7%m8j28K87J01o1K76
6226C51k84K8k8J2M1N4k0l23J24j61K3L02m08K67J85j71m3j92J94J17k64K32j32
6249i6L01k53j25J62k82K89o7Q4j86J6M13m57K30P5K8J95n06K13J56k93J02k03
6271b04J53j9L2j10O3K16j71K02K0j13j72K67j19O3O4k4k32J34k51K84j78o4K58
6294I9k94J53J93J90k59k9R8j37q7k5m8K91j77k8j15R9K15j14J57l25P9K42o9
6317A09l51L34q3k87N14l45K5J97k42k4L71k19k83K74k29L93J10l03qJ76M4k49
6339g6K53r7L3J14k08l33K76q0o9J96j99J11M10n16J05J0p6J09K60k22K06q3m14
6362b90L42j10N6k1Q9l0k60J98m18L99L31m24K94p8l4J14k16r2k0J08j67K48R5
$$ plain form
6202 -71 -59 12 -78 72 -116 55 41 -74 203 331 10 83 275 -315 117 -103 -76 -76 -124 -252 35 136 75 351
6226 351 67 95 67 79 120 174 154 -169 -45 -206 -183 119 -289 -22 163 -8 -51 -243 -49 68 -196 36 -96
6249 -96 205 -48 -173 -11 -293 -4 -71 13 -173 -157 256 -201 29 104 132 327 -179 34 190 -103 -1 -204
6271 -204 -51 -70 -38 -148 -85 131 -40 162 182 69 -103 164 45 108 172 148 -84 50 -201 83 -95 -159 99
6294 99 -195 -42 151 341 82 53 151 14 -73 -98 -146 145 -32 -60 -175 -76 139 25 182 -143 -64 178 109
6317 109 -242 92 9 -278 236 -109 -84 113 -129 -153 218 -1 -284 -10 -239 154 264 -39 -47 129 173 -76
6339 -76 177 80 113 227 19 -314 -38 -118 -187 9 -190 -79 331 -185 -80 -70 -146 -37 223 1 207 124 -290
6362 -290 52 -58 -2 -23 66 36 -224 -26 -444 -45 286 -138 156 78 44 158 -58 -150 -170 -62 -229 19 114
6385A14l70L66j59j2Q5L49l11k61L49k21K6J81l54m2M28j97k2K40j35j38o1K14
6407F9m5N0L4OL3O8k28m8Q4j6K6j00j0N1P5j50K37K6j83K3rK44m7k10l0J45O8
6434A63m3k67P6k6J0K82n8m76K43K03J57r9k81L07k01j31K11J4m8P7p3j6M0J07
6458A71k32Nl2N2O2J17j31L33l35J06m2L5k70j01K35J3L3j9l04K37L8j14K72j92
6482f3J48k95J28J77M0q3J13k18J42j7pP9O5k86j16L53l95L24j20J93mj47R1N6
6506A58n8j90K29j61j60K65m6r3R3R2J8n1l3O0j7l07J29J61j34J0j49j21O6P9
6530a60L58k56K08k00R9%K6r4N9o0K11k38L10k20L5K8n3k0l17L64o0K3M1l6J24
6555A72l48n4L91j92Q5j11L25l01J5j2o7l2J43j60n9Q3J35j36J42M30l71p7J36
$$ plain form
6385 114 -256 110 -49 -61 24 373 62 -199 150 -71 -45 136 -218 -260 168 -29 -51 189 54 -84 -145 69
6407 69 24 74 108 114 147 215 -13 -61 23 7 33 -67 -77 -26 49 -101 136 162 -21 2 -7 237 190 -20 -50 95 163
6434 163 120 -147 -71 -97 -87 195 137 -339 -96 107 264 165 -116 191 -10 -141 70 84 36 113 40 24 64 171
6458 171 -61 -56 -88 -36 26 143 12 345 10 116 74 109 -161 -262 -27 -14 19 0 -304 -67 -29 -143 129 -63
6482 -63 85 -210 -82 95 135 52 165 -53 89 72 65 144 209 -77 -193 160 -235 89 -31 162 158 11 102 158
6506 158 100 -90 139 -22 -182 83 37 -56 37 129 147 96 63 123 106 -201 -72 89 -45 -35 -184 -305 -239 -160
6530 -160 198 -58 150 -50 49 49 75 -19 40 -20 191 -47 263 43 78 106 53 33 -284 80 20 43 84 48 172
6555 172 -176 -230 161 -31 54 -57 268 -33 -18 -30 -97 -129 14 -146 -205 -122 13 -123 19 449 78 1 137
6578A37q8K50k47Lj43lj52K32L6j74K12K31l13J68l29J68K1j04L72k92J18m7K18
6601B74j15j73k13J84j85M47N3k25n6p6l7RL64j70l1l05J73M19l02M1m5j09PJ57
6625H6j14j68K80j13k6J55j04P4K12l71J01m2j00O2o0oJ32K78l92j45L54J10k65
6648f2J47l5k15K56q3k15J26L37m21K91j47j44K09o1Q8j64K65k66O9K73k68J99
6670A79n2l96L44Lk9L2M8k69J36J47k56L39J1k66K72l36K13K1j6l13K17J57k08
6693b2n4k2R4M2n%M9j2j14J17J52l29o6J90k37K77r6L8j9j11K84k90J58k8r6K63
6719A63n07L89J38o8K3R1k87J85l21J84J49R2l90K48K32m09M26m13Q1J02L13l75
6741D6J9k66K05O5J07k66J64j13l31N64r7q4J07M0l3j95r2J96p9M6j73L00j70
$$ plain form
6578 137 49 299 52 55 -88 -91 -243 -11 25 -149 63 294 -19 149 -180 -12 9 -95 277 -15 103 56 274
6601 274 159 -14 -227 -43 -228 219 272 47 -9 -85 -122 -113 251 81 50 -255 -82 337 35 76 31 -78 -71 86
6625 86 -28 -196 84 -29 -55 100 -4 70 282 -89 12 -30 -130 -68 -128 -134 -2 276 -116 -261 93 203 -62
6648 -62 85 50 -165 91 8 -207 -81 256 -165 126 -21 -165 44 -17 71 -93 172 -94 -25 248 -20 179
6670 179 127 -269 75 78 49 81 129 -140 -4 143 -113 226 237 -29 243 -93 120 141 125 -188 29 186 -22
6693 -22 -76 -98 -4 38 33 33 82 70 -44 73 225 -104 -170 20 -217 60 -36 2 -17 -128 156 -134 24 -4 -100 163
6719 163 -344 45 183 115 138 229 -58 127 -194 -10 139 231 -159 89 321 -88 338 -75 6 108 421 46
6741 46 65 -201 4 69 176 -90 74 -39 -370 194 97 13 120 160 127 -68 -160 36 -43 3 -170 130 -40
6764d0j01L62l05k22L39j93L57m12K1K39M1N9l54L76o3q5K44k16N5m5k58j29J86
6787a44K31r6K54l46J30j07M8PN6O5q4k8J30q8l63K48N6J40m3r6P6j72K07k57
6811a76R8J18j34K8K26o9j72K5J61L1k39q2K8j7R4K34Pk68J77l25K50J29k07J34
6835E1J92N7k86k2O8l52J88j30K19K1j2j50J66p4J14j83K87j64j44Q1J5Q2n8M7
6859A3q0J48l2%J1j15J18N5p3n6N7j12J65k04J04j18L8l3L66k77l8J86j2p3rj65
6885a36M9JK1J30j79J70K02l96J67K03j14k09Q3m6O6J25p6N4j41j54K81q4p8o3
6909a24J36J66j14k55J24J44k1l5j77J6K08o8j69L13J1m7K3N6Oj82k42J74O1q4
6933h0l9j09K15K04k56J70k1J0k36J81j39N13l87j9m6k8J65p4j35Q4L1J70m86
$$ plain form
6764 -40 -141 221 -84 -306 33 -160 197 -215 -194 45 86 145 -209 167 104 19 263 47 102 57 -201 -330 -144
6787 -144 87 -9 245 -101 29 -78 -30 -23 33 98 14 -14 116 28 -335 -87 -31 109 66 -30 46 -126 81 -176
6811 -176 -78 40 -94 -66 160 91 -81 -56 105 136 -103 -185 -157 -174 -80 154 161 -107 70 -255 -5 124 -83 51
6835 51 243 300 14 -8 60 -292 -104 -234 -15 6 -6 -156 10 -64 50 -133 154 -10 -154 -73 -58 24 -34 13
6859 13 -67 81 49 49 60 -55 63 118 45 -11 46 -66 99 -105 -1 -119 -81 -114 252 -25 -63 123 111 38 29 -136
6885 -136 -87 -86 -65 65 -114 56 258 -138 29 232 118 -91 -8 -54 12 137 61 115 -26 -180 101 17 -61 -124
6909 -124 12 178 64 -191 -67 77 56 21 -156 -140 68 0 -169 144 155 108 131 187 193 11 -231 -57 4 -80
6933 -80 -119 -228 -13 191 -65 105 84 94 -142 39 -100 413 26 7 -39 -67 98 24 -111 -27 4 174 -312
6956c12L78j20M3J76j46q9j07L7K91J19l91p8q1J94P1k13k16N23j03k6N8j67J29
6979c0J57J78n92J60J95j61r9L37k61J84j23J01k4L25l98L15j32n5Q9q8K08j34
7001A52k83J77j00J27r2o5j5j82L82J8j62%k5q0Q9R4m3R6p7Q8j1l2k46L14k98
7026a74p2J85J26j20J22L3l9O1j43J86j85K78k45J29j37J38m06K55J3k30J20p4
7048a79N79n89NK40q3L4J02o7j17P5q9P5p2M3k50J71j06kJ89M0m7R4o5j13M30
7073B98l28K28k15k62J44K07k0j74K8j02J3N3n9J03J13jq2J83j00j76J88J08l02
7096a55L38k67n2QO3L7k3O4q1J52j3L7j54O2r2j5j7J62J4k00J74k24L0M0K39l23
7122a96K18k35J63J9N7K08m25L06K9P4j12j32o6K02k86K52r6Q7k93L82m00K11
$$ plain form
6956 -312 66 -54 -11 165 19 -70 -177 -140 151 270 -121 -199 -280 -86 -15 -228 -444 79 -24 -50 8 -159 -30
6979 -30 127 305 -287 -127 68 -93 -192 145 -116 68 -55 46 22 347 -51 264 132 77 166 78 286 152
7001 152 -131 46 -54 73 -19 -84 -99 -281 101 119 -43 -43 -68 -148 -59 35 -8 88 11 99 88 56 -190 124 -174
7026 -174 -246 -61 65 -55 67 100 61 122 -21 165 -20 258 13 142 5 143 -263 -8 5 -225 -105 -179
7048 -179 400 -189 -184 56 -27 7 109 42 -75 0 -89 -14 -86 -43 -293 -122 -228 -230 -41 -1 -48 46 -19 -132 298
7073 298 -30 198 -17 -279 -135 72 52 -122 -94 -196 -183 -130 -189 -86 27 26 -56 127 27 -149 39 147 -155
7096 -155 183 -84 -136 -128 -65 -28 -51 13 -68 84 71 108 -46 16 -76 -91 -108 54 68 -132 42 -182 -152 -112 127 -196
7122 -196 22 -213 -50 -31 26 234 -191 115 144 218 106 -26 -92 110 -176 76 -20 67 -226 156 -244 -33
7144c3j34J79M6j7j69K55J32m31L21l48K74M9Rm7k78K57j15K23k83j43L13K39
7166B99m76N7M40o21J44L68k54j06J22l03K79L3P4j0J35j84L07j12m34L42j54
7187e4J18J18m01J76j10J37l8J74j10r3P5l1Oj25J65J17o9J7K5N5l71P5J35j49
7211a58R8J74j58J27k0j52J13J28R5k56k3k9j59J54k3J76k02J53N1j87L24k01
7233B5Q8l11L93k20J72k41n9M45j10m40M34l66J54J36j94J50j34J59k3J20j74
7254DK32l70J28L34m17j7J26j19M1K26j40P2j63k3J51J08j57m8J83J52j99J92
7276B96k53m6M9j34K97m30J35N6P2M8Q9l12K15K76l41k6O7l2N9l8l5k00M09k57
7300c6K3j01K00o7j47M2l3J98J14j27K27l22j18J61k4p5r4l2L15p3M1j86Q7J63
$$ plain form
7144 -33 -167 12 58 41 -128 127 259 -172 149 -199 75 124 133 86 -192 65 -50 173 -110 -253 60 299
7166 299 -177 -120 320 -301 -157 211 -43 -149 -27 -330 -51 -18 56 46 181 -3 304 192 -242 100 -54
7187 -54 64 182 -219 -43 -153 -16 -54 120 10 -83 -8 -39 -33 -158 7 124 55 72 97 152 -219 -144 -9 -158
7211 -158 -60 114 -44 83 63 -89 24 152 247 -9 -32 -61 -220 -66 -89 87 -115 38 89 -98 226 25
7233 25 113 -198 195 -25 147 -94 -153 292 182 -258 176 -190 -36 100 -94 56 -78 81 58 178 4
7254 4 236 -134 -6 328 -89 -106 20 -99 -58 168 28 100 -63 -86 65 173 16 -32 151 303 104 296
7276 296 43 -3 46 -88 209 -221 -86 -30 42 90 179 -133 82 358 17 -9 58 26 85 47 12 -188 221 -36
7300 -36 -13 -114 86 19 -128 -86 -119 79 193 66 293 -29 -147 14 -10 -85 -179 -211 104 31 72 -114 -27 136
7324A36j94K08k34K05j15K2m2q1K25n49M40l8k72K91j27PK96j8n5j08M4l47K57
7347d9L21j67N5k5k82K39j00j53K84k18q2K12o8J86l97R2K56K29j73J46l65j01
7369a60K35n2Qn8n4J37P6P7l18j16K85P0o9j93L58j48k8j23J32r8J17k42J77K
7393A5m33L36N3k9J14p0P9Ok8j46J79k81K82j0q3oJ16l79K80j91J38k24J97J91
7417A06k39K64k7L9l2j38k02N31l94J00J23j79J09n8j34j60J91J08J72j68Q6L5
7439A33j60J21k92L97m11MJ12J23j38L01k64O2J0J74q9P7J40l39J52Q7j29k46
7461a75K09q8Q2j23j5K0Q0J92o9j72o8K32N9N1j45r2J81Oj32j6j03J51j33P4M1
7486D7NJ66j56J07l23R5k35L04j66N0K91l07L33L3j14m19L18J43l06J13j06J33
$$ plain form
7324 136 -58 150 -84 121 6 28 -14 -95 130 -419 21 -17 -289 2 -125 -118 178 160 105 -3 41 -306 -49
7347 -49 272 105 160 135 -147 92 -8 -161 123 -95 -177 35 -33 153 -244 -152 104 333 160 306 -59 -160
7369 -160 75 23 31 -27 -81 56 132 209 -109 -225 60 130 61 -132 226 78 50 -73 59 -39 78 -164 13 15
7393 15 -418 -82 -29 -58 56 -14 65 71 43 -103 76 -205 77 67 -16 -22 94 -285 -5 -196 -58 -282 -85 106
7417 106 -133 131 104 143 111 -27 -229 302 -92 8 131 -48 61 3 -131 -291 -100 8 180 12 98 133
7439 133 -27 94 -198 199 -212 -208 -96 27 -111 190 -74 -12 -2 172 83 160 300 -39 113 200 71 -175
7461 -175 34 -54 28 -95 -110 -90 -10 182 113 -59 -127 105 164 215 70 -22 159 165 33 17 -86 65 -68 6 47
7486 47 52 218 62 169 -154 -59 -294 10 -156 -106 185 -122 211 244 130 -289 29 172 -134 -21 -127 6
7508Fj59M51m41K00J68nm91K46J31k65J38L8N4J95l70k4J45q7r2j3L78j21n5J03
7532A30o1j83K10K6J0l07K45k4p0J23pK21k86J8J2j12J08L4J60k70j01K28j2m62
7556c70L15J15O0j04R9j51m2J22M6r9K4m2K0J29k99L71k30j3k17L63j35J81O9
7579B12l1j53k60M26j50P9l43L02J15j54R2j35k1p9O8K52l13l2O1j38J24Q5j11
7602a04L54k18K41l93M92m94K59K82l37p1O0M7j88rK23q0q4J04j0q8m8K94m40
7625b08M65l31J00J1j90j02J92j18L74j68r1l57Q8L03m8L35j87j8J51k14L0k75
7647b58J90O4O3n5m4j94L05j53R2r9J30J03j85J44k45J13P6n2q8Q9q4j30K99j74
7671i3j56K73j27L0j5J76M4j22L0j47P0%J73n1j46K08K8r4k44J68m5J74k10P9
$$ plain form
7508 6 -153 298 -143 57 225 220 -271 -25 106 -159 -21 17 71 266 -104 -128 17 -70 -162 -175 203 82 27 130
7532 130 69 -114 96 122 132 -175 70 46 -24 99 92 313 27 45 57 -55 53 87 247 -23 -124 104 92 -370
7556 -370 -55 60 120 16 115 -36 -78 44 90 -9 15 -27 -7 122 -177 194 -36 -49 -266 97 -38 143 212
7579 212 181 28 -232 194 44 123 -220 82 197 43 135 0 -21 -100 -32 220 -93 -125 -64 -202 -78 7 -104
7602 -104 250 32 273 -120 372 -122 137 419 82 11 71 118 -70 -79 144 64 -20 84 74 -14 -62 232 -208
7625 -208 257 -74 26 37 -153 -255 -63 -181 193 25 -66 -423 -335 -32 -80 255 68 50 201 -13 17 -258
7647 -258 -68 -4 59 4 -40 -234 71 -82 10 -89 41 144 -41 103 -142 -29 47 -5 -93 -4 -88 -218 81 -93
7671 -93 -249 24 -103 -73 -88 88 132 10 40 -107 -37 -37 136 85 -61 147 175 81 -163 5 -40 134 -76 3
7695CJ21j55Q2Q7l06M6R8M1J24j13j87L73m27K33LN7Q2j77n1K61k84K49l3k05
7719g8Q7k12K09r8j35L86O6k75J20j19j85L91k33J23R4m0k51J76m1k33L38J03
7741A93j17j79M03l73J29j35J72J52L6k36j01L5qm3J93j60N0j44K3n9j24K57J15
7764G9K4m09J86K71r4q8R3j37N7j8j39M0K60j90j0J41P3k40J73J51k10J3j49K42
7788A19k7j16j51J03J14k2J99j95J4O1j86k5Oj7L15j42j01Q2kJK37j43j73J65
7812A16o8L8m88P01j30k61J39r9J81l5Ok80K44K9m15K20J0J26J16l1pr5K32k85
7836c6K13j92J15R0j91J70k55j17K13L05m63J07N8k92M39Q9m72N38j03l61R7J41
7858I3j73J39J79j18j87Q2k75J71l9K9r0Q0N2J78n3K4Nk88K08K26j70j10kN2J9
$$ plain form
7695 3 124 -31 51 138 -168 -122 -24 17 141 28 -159 214 -213 20 23 80 162 -15 -66 195 -89 160 127 -78
7719 -78 9 -203 6 -92 -227 159 225 -50 70 -49 -234 157 -76 47 141 101 -150 26 -15 -248 90 193
7741 193 76 -103 300 -73 56 -79 93 245 281 45 -56 -21 -29 -72 121 -39 11 -133 -110 -169 -293 -36 79
7764 79 103 -306 -120 151 57 -31 62 -75 -18 -36 -175 -135 125 -65 -75 66 139 -101 72 223 13 26 -123 119
7788 119 92 -24 -175 -72 42 20 219 24 38 99 -87 -112 -106 -123 192 50 -51 31 29 30 267 124 -49 116
7812 116 48 86 -402 299 169 -92 47 -52 129 94 100 -180 64 93 -322 -102 -92 34 150 119 112 17 249 -36
7836 -36 177 -15 100 190 -1 169 -86 -203 10 315 -148 -41 17 -275 164 253 -219 319 216 -145 -48 93
7858 93 -80 59 238 120 -67 15 -260 -89 -128 -99 -189 -109 -57 121 68 92 97 -191 17 243 73 -37 -39 13 32
7883C2k3K5l8R0k23J50j20J70m9J9k9q8J30O2q4K8j54n3p4L75j60J08R4j90j59
7908a61M0J22r8q5J93l9J96j27N7R1q0k54L53k42O3N6k45j13K40l35L59k6P2k21
7932a84J56o2K6J05p7j99R0L23j90P0j88J08n3K6J01P5p2j55M7K42j0k30K73k72
7956e0r6K30k29K4j06j71L14on2L27j5l1k24J23m5J06j83K0K16l73R3K03l6k76
7980b37M37o6l39L95Q4n14K54p1N3l7o8K66p0o7r7J44m62K24J49L03M2l18o9K75
8004B11k35J2J09Q8l0j95j51K60k04K20k08Q6J8n1L27o4k45J43l01L61mkj42k17
8028b14M14j55o1j67k5P8K07J49k31O2m2k8r2K54K2Q4j29q8l3J98q7j5j10J04
8052I5%o6j36J77O5l58N03j86J46p0q1M9j31L1L5l03K43j0j04o1J50L6j35M3J20
$$ plain form
7883 32 9 34 -4 86 -137 13 -107 63 14 33 4 -84 46 108 24 52 -102 -155 -229 146 -14 94 188 -2 -161
7908 -161 -121 1 -97 -182 11 -28 168 41 98 189 109 -145 208 -34 29 85 -160 -273 -33 -368 -9 -35 37 -184
7932 -184 -28 -90 -64 41 -36 -235 -145 178 -12 58 -130 -22 -75 -49 52 127 55 -100 -53 189 179 -51 222 -50
7956 -50 -146 84 -145 -121 -227 -398 -84 -90 -142 185 170 139 -85 38 -7 99 -84 -64 152 -221 -128 75 39 -237
7980 -237 200 134 -205 190 274 -240 14 -57 -4 -41 -109 157 87 20 -77 67 -395 -171 -22 281 323 5 -64 211
8004 211 -24 -12 97 185 155 -40 -191 69 -135 85 -123 -37 -19 -70 257 193 -52 91 -210 151 147 145 3 -214
8028 -214 200 45 -16 -183 -208 -130 77 226 -5 57 15 -13 -105 149 171 255 126 38 5 203 116 101 -9 95
8052 95 95 29 -107 70 135 -223 280 94 240 170 89 138 7 38 73 -230 13 3 -101 -162 -12 24 -111 -68 52
8077E2Nj59L59k30j48K04r1mj1K82k52N%K1j87%K93k20L6K37j93L13l55J45NM5
8103A52l05P6j5p5K31l22J73J0L9K7K0J33k1J09k93J65k15K89Ol18J29L8mk54
8127b25L37p9K48j18k83j45J96K48k05M6J32k47kK38k43K54j95k46K81Kl2K36
8149A98k64K13j44J42J16n2l26N0J67k45J58J37k27j08J95J61l55K17k96M38P7
8170B52m35K34j98K43j81K36l41L35j52p2l2J32k30L2o8M07k11R2J27l19L02
$$ plain form
8077 52 57 -102 257 27 -121 83 -8 -12 -23 259 7 12 12 33 -154 -154 139 -81 -45 192 -1 312 -43 102 107 152
8103 152 -153 -77 -92 -167 64 -258 -85 -75 -36 -9 11 144 123 232 -61 104 -111 178 184 -134 -5 33 29 -225
8127 -225 112 33 281 163 -120 -265 -69 179 -26 20 152 -95 -97 141 -102 152 -43 -289 -8 -6 -38 198
8149 198 -66 147 3 145 261 209 -117 -67 100 -145 13 150 -77 -185 10 171 -184 33 -263 175 252
8170 252 -183 51 -147 96 -85 151 -190 145 -7 -79 -111 21 -209 -177 -245 162 -49 43 170 -149 153
8191A53
$$ Imaginary data points
##PAGE= N=2
##DATA TABLE= (X++(I..I)), XYDATA
0@%%%%%%%qJ6j6K4l2M0n6P2q8J04j28J60k00K47k95L46m09M83n64O56p60Q79j012
30e41J160j326J510j713J937k183K454k753L081l441L834m262M732n249N809o418
46c369P086p813Q609r485J0447j1506J2676j3971J5417j7042J8878k0971K3378
59A2334k6186K9515l3526L8470m4744N2993o4382Q1240j09039J65551m56923N88269
71B33572Q2036q28796Q18507l84554L5477J59664j26410j45115L02074O6799o36021
82d22767O06592O2347o14840N37243j89916j9150R3743j21077L4465N4134J57525
93A78299m71353L53066K62477o75389M59349J2137k23076J69367j06545M3131
103A463j9080J44144l23901J48667L90972o96023L71672K22649m62426L05440
$$ plain form
0 0 0 0 0 0 0 0 0 -8 8 -8 16 -16 24 -32 40 -48 56 -72 88 -112 135 -160 186 -223 260 -304 352 -408 471 -541
30 -541 619 -707 803 -910 1027 -1156 1298 -1455 1626 -1815 2019 -2243 2489 -2760 3049 -3369
46 -3369 3717 -4096 4513 -4972 5475 -6031 6645 -7326 8091 -8951 9927 -11044 12334
59 12334 -13852 15663 -17863 20607 -24137 28856 -35526 45714 -63325 102226 -354697 233572
71 233572 315608 -513188 305319 -79235 -43758 115906 -10504 -155619 146455 213254 -422767
82 -422767 183825 246172 -368668 168575 -21341 -40491 53252 -67825 -33360 20774 178299
93 178299 -293054 60012 322489 -352900 106449 118586 -104490 64877 -41668 1463
103 1463 -17617 126527 -197374 -48707 342265 -353758 17914 240563 -221863 83577
113H3577n3047r1776J15909L0818k27483J25860L06395n95581L06462K58286n31631
124b72211L57874n0460j45676J99148r1591o9827O5762J99117l68852J32443L15879
135B71606m91811K59200O8532k43139K24373j02671n2175P0166R1903k03129K5722
146h1423L09431l96842J44047J88606l07135K18741m3072j05529J19613P994j17635
157f3204j078K31938k84605M3349K39699l08367J65819L6387j56020J51215k0789
168C4344p8406J6769J48454j75998k1424K37615k63300Q7861J00863j92518J45319
179C9579j8004q0392M8643P1970r2416m1755J98666j80618J4348J49890j88011
190g8100J02439K3638j04908O5070K9902o3967l2228J35931j13963k5169J50541
$$ plain form
113 83577 30530 -61246 54663 85481 -142002 -16142 290253 -305328 1134 259420 -272211
124 -272211 85663 35203 -110473 88675 -2916 -72743 -6981 192136 -176716 -44273 271606
135 271606 -220205 38995 107527 -135612 88761 -13910 -66085 4081 95984 -107145 -81423
146 -81423 228008 -168834 -24787 163819 -143316 75425 32353 -73176 46437 54431 -63204
157 -63204 -64282 167656 -116949 -73600 166099 -142268 23551 59938 -96082 55133 34344
168 34344 -44062 -27293 121161 -54837 -76261 161354 -101946 -14085 86778 -105740 39579
179 39579 21575 -58817 -10174 61796 -30620 -72375 126291 -54327 -39979 109911 -78100
190 -78100 24339 47977 -56931 8139 38041 -25926 -58154 77777 -36186 -61355 89186
201H9186j52885O3559N4771j08821P7966Q758m7101n916P1638n6025m8578J20928
213F7480j03873Q348P6703j01727N6774J7933m7002J5984L6048k1047m0912Q5430
225E0139n2885k4430P8254p8503K4188K9311n2589J9183J7405j5950k3674N0358
237B0807k1671k8975O5198m8441Q248L5199m5083K2756O042j6303l376J1956m862
250A495k0938K8468j8663k451K0210k2532J7994j326l118Q095o961J1909j1856
263C26L571M152j0737M248o441N426q605J063R912j7594J6532Q47j2597J8848
277H951l494p515Q929M777j4134M147J2937k7343J1717J2072l1891J9656Q519
290G328k7445J8728J2431k5379J3584K1401l2586J3567K5217m2576J8193K2283
$$ plain form
201 89186 -63699 -140 54631 -54190 23776 32534 -14567 -20483 51155 -4870 -53448 67480
213 67480 -36393 -28045 48658 -53069 3705 21638 -25364 -9380 26668 5621 -35291 50139
225 50139 -2746 -27176 51078 -27425 -3237 26074 -26515 -7332 10073 -5877 -29551 20807
237 20807 -864 -29839 35359 -13082 -4834 30365 -14718 8038 14080 -2223 -5599 6357 1495
250 1495 -19443 9025 -9638 -12089 8121 -14411 3583 2257 -861 7234 273 12182 326
263 326 3897 8049 -2688 1560 -4881 545 -8060 -6997 2915 -14679 1853 2700 -9897 8951
277 8951 5457 -2058 6871 11648 -2486 1661 14598 -12745 -1028 11044 -20847 -1191 7328
290 7328 -20117 -1389 11042 -14337 -753 20648 -11938 1629 26846 -15730 2463 24746
302B4746m5606J9142K1272m4357J7352K6471m4654J6941L3622m9307K0077L6278
314C1977n3396K1521L4652n5234J9138L5374n8347J7023L8919o2393J9351M1849
326C0434o3585K2802M2478o1183K1646M3895n9364J6566M7851o2812J3155N0059
338D1942o7106J2648M9839o5921J0646N2779o3162P103O0067o5198O975O5344
350D5956p0089J0009O2811p0770R020N8214o5854M27O2733o5680n517P2493p0892
363b7139k643P5812p2834K811P1962o8599j89P1061o6006p931P6555p1405j0119
376b8664P8729p4228n621P2939o6862p653P2368n7944j7564Q3047n9295k5439
388c6187R2573o7102k2575Q8470o8149k0068Q1169o1848k6308Q6664o0944l2314
$$ plain form
302 24746 -20860 -1718 19554 -24803 -7451 19020 -25634 -8693 24929 -24378 -4301 31977
314 31977 -21419 102 34754 -20480 -1342 34032 -24315 -7292 31627 -30766 -11415 30434
326 30434 -33151 -10349 32129 -29054 -7408 36487 -22877 -6311 41540 -21272 -8117 41942
338 41942 -25164 -12516 37323 -28598 -17952 34827 -28335 -21232 38835 -26363 -19388 45956
350 45956 -24133 -14124 48687 -22083 -13063 45151 -20703 -20276 42457 -23223 -28740 43753 -27139
363 -27139 -29782 46030 -26804 -23993 47969 -20630 -20819 50242 -15764 -23695 52860 -18545 -28664
376 -28664 50065 -24163 -29784 43155 -23707 -31360 41008 -16936 -34500 48547 -10748 -36187
388 -36187 56386 -10716 -33291 55179 -12970 -33038 48131 -13717 -40025 46639 -14305 -46619
400d6619R7641o6461k6261R3963o5245j8366P9571n4327k5462P9531m8958m2876
412d3869R5074n6305m4916R9612o2575k9442Q4006n3349k3931P5023l9646m1638
424d1956Q9333l9430n6719J01481m9154m7091Q8796m8972l5363P4075l5653m8578
436d9231Q6534k8516o9799J08892l8674o2532J03945m8537l8179P9926m1685l9974
448c7830P6067k6623o7660R5077k6528p3011J00131l7852m4954P8431l5318l3283
460c3353O6487j6924o2076Q2359r588q3438R5874k5937n9195P9089l6064l1323
472c4089N7560j5924n1308O5079Q395q6102Q5754j50p7193Q2913k3421m4157O1237
485B8594j7753m9662N6577J1238q8117P6895J4339r1650Q7537j4867n2441P1343
$$ plain form
400 -46619 51022 -15439 -41700 52263 -12982 -31348 48223 -6104 -31566 47965 -993 -43869
412 -43869 51205 -5100 -50016 49596 -12979 -42421 41585 -11764 -35695 39328 -318 -41956
424 -41956 47377 7947 -48772 52709 3555 -43536 45260 -3712 -39075 35000 -653 -49231
436 -49231 37303 8787 -61012 47880 9206 -53326 50619 2082 -36097 43829 2144 -37830
448 -37830 38237 11614 -56046 39031 12503 -60508 39623 1771 -43183 35248 -70 -33353
460 -33353 33134 16210 -45866 36493 26905 -56533 39341 13404 -45791 33298 -2766 -34089
472 -34089 23471 7547 -43761 21318 29713 -56389 29365 29215 -47978 34935 11514 -32643 28594
485 28594 10841 -38821 17756 28994 -59123 17772 32111 -59539 27998 13131 -39310 32033
497C2033k4613l7585N3562M802p2249O0134K3421r4235P6378l499o1973P0666
509B6842k8375k8690M7824k897m8694M0691L4098q4065N6800J9429p1709O5904
521B7158k1110l2610M6273j3274l3185K4240L4709p1239L3949M3299q0161N8336
533A6385J36m5378N3864j5967k8063K3659K5763n7587J5597N4031q3220M3583
545B803J9758o2401O1025j7223k9646L7658O684l6868J0562M8003o5746K3324
557b067L3946o5083N1806j2486l3458M1484r796k0910N588L7150m3454L131M7357
570C3208n8787L7107L939l9197M5698j8431j3793P262J9369k3737j5452N1342
582B8528m9496J4986K4832m7126M5520j2230j9255K1913L179r853j6235M0511
$$ plain form
497 32033 7420 -30165 23397 28199 -44050 16084 39505 -54730 21648 18149 -43824 26842
509 26842 -1533 -30223 17601 14704 -33990 6701 40799 -43266 13534 32963 -38746 27158
521 27158 6048 -26562 19711 6437 -26748 -2508 32201 -39038 -5089 38210 -41951 16385
533 16385 16521 -28857 25007 9040 -19023 4636 30399 -27188 -11591 42440 -40780 2803
545 2803 22561 -39840 21185 3962 -25684 11974 18658 -18210 -7648 40355 -25391 -2067
557 -2067 31879 -33204 18602 6116 -27342 14142 4346 -16564 -10976 26174 -17280 -14149 33208
570 33208 -25579 11528 15467 -23730 21968 3537 -10256 -2994 16375 -7362 -22814 28528
582 28528 -20968 -5982 18850 -28276 17244 5014 -14241 7672 10851 998 -15237 25274
594B5274l1975n277L4963m7246L3794m382k7145L1674j0247j950r029K4961j0331
607C084j8978L9599l5309J6527R342l3341L3821j5301m522R66M629N237k6061
620b0307L3070j8492j869K3218l3295L0656q244j1393J4922r988J2042k1214J6642
633E748j672j7345K5040k6831J8151J96j7419K3828j6470J3012q391N59J5034
646A3440k3182K0038j2212J407R124k1020K0677j4430L923L542j2601K1135j8666
659h825R107L735q204J3370j5644J5528q403k897J2207k0673J9204j1063n220
672g778J4055j4597J0167p801P240p59p210J8519k0393J4378K605j8009K1294
685A1711j2454j025L650k389k9o672J4437j7610Q254J1123k4371K3696n048r980
$$ plain form
594 25274 -6701 -11978 22985 -24261 9533 5151 -21994 9680 -567 -2517 -11546 13415 3084
607 3084 -15894 23705 -11604 4923 14265 -19076 14745 -556 -5078 -4112 517 5754 -20307
620 -20307 12763 -5729 -7598 15620 -17675 12981 4737 -6656 8266 -1722 10320 -10894 5748
633 5748 4076 -13269 11771 -15060 3091 3287 -14132 9696 -6774 6238 -2153 -1594 13440
646 13440 -9742 10296 -1916 -509 8615 -12405 8272 -6158 -2235 1307 -11294 9841 -8825
659 -8825 282 4017 -4187 9183 -6461 9067 664 -2233 9974 -10699 8505 -2558 -7778
672 -7778 6277 -8320 1847 -5954 1286 527 -6683 11836 -8557 5821 8426 -9583 11711
685 11711 -743 -1768 1882 -507 -536 -7208 7229 -10381 -2127 8996 -15375 8321 3273 -6707
699f707J4626o074q56j251Q296j2203J538J3904k5031J5819L230j8967J7452l112
713F64o211N271O010q524L81J6183k1949R133J2365k5202J5834K235j5534R297
727d7M014j1305J690J4935j8883N574J7674k5428J3889R749k0543J2361N328j4724
741e716M095J1687j8136K163J7731k4666Q902J4596k3415J2215R862j6732O484
754i30J2601j5849J169J7599k1514L032J8085k4482O619J4004k0820N064J4372
767H950j6712P23J9432j8933R21K1368k2294L449J8082k1337K864J5758j8754
780f483p19J8116j8235k003K1232k0052j76K1651j9990J062J9619j8245q21J9749
794A4705j8491k795K0426j9319k995K0816j9534k286K0354j7542k138K0277j5750
$$ plain form
699 -6707 7919 1845 989 -262 8034 -4169 -2631 11273 -13758 2061 5291 -13676 3776 664
713 664 -5547 -276 5734 -2790 -2409 13774 -8175 958 13323 -11879 3955 6190 -9344 -47
727 -47 3967 -7338 -5648 9287 -9596 -4022 13652 -11776 2113 11862 -8681 3680 9008 -5716
741 -5716 -1621 10066 -8070 -5907 11824 -12842 -3940 10656 -12759 -544 9318 -7414 -930
754 -930 11671 -4178 -3009 14590 -6924 -3892 14193 -10289 -3670 10334 -10486 -5422 8950
767 8950 -7762 -7039 12393 -6540 -5619 15749 -6545 -3096 14986 -6351 -3487 12271 -6483
780 -6483 -7202 10914 -7321 -9324 11908 -8144 -8320 13331 -6659 -5597 14022 -4223 -5044 14705
794 14705 -3786 -6581 13845 -5474 -8469 12347 -7187 -9473 10881 -6661 -8799 11478 -4272
807d272l650K1744j5746n770K2352j6588o162K1133j6031o737K0966j5418p174
820a1353K1471j4005p186K2132j3298p660K2408j2943q019K1533j2915q978K0939
833A2126j2566j0133K0685j1717j0700K1300j0952j0032K1729j0325r993K1523
845A0945r609j0250K0754r172j1897K0031r063j2750J9876q695j2424J9725p216
858B55j2747K0088n651j3413K0788n533j3595K0378o521j3154J8487o078j3499
871a0195J7001m212j4734J7289k683j5148J8613k788j4422J8630k794j3554J6568
884G571j651j4526J5201n02j6753J6284j428j6540J7309k351j3735J4876k90j2907
898i442J3194K749j5108J3762K814j7186J5355P84j6290J3835N7j4090J1001L216
$$ plain form
807 -4272 -7922 13822 -1924 -7694 14658 -1930 -8092 13041 -2990 -9727 11239 -4179 -11353
820 -11353 10118 -3887 -11073 11059 -2239 -9899 12509 -434 -8453 13080 165 -8813 12126
833 12126 -440 -10573 10112 -1605 -12305 8995 -1957 -11989 9740 -585 -10578 10945
845 10945 1336 -8914 11840 2668 -9229 10802 1739 -11011 8865 170 -12254 7471 255
858 255 -12492 7596 1945 -11468 9320 3787 -9808 10570 4049 -9105 9382 3304 -10195
871 -10195 6806 2594 -12140 5149 2466 -12682 5931 3143 -11279 7351 4557 -8997 7571
884 7571 5920 -8606 6595 6093 -10660 5624 4196 -12344 4965 2614 -11121 3755 3465 -9442
898 -9442 3752 6501 -8607 5155 7969 -9217 6138 6922 -9368 4467 4524 -9566 1435 4651
912D651j5176J1409N286j6943J4220L659j6493J4760J308j3374J0571L126j3938
925f934Q152N768j6620J0289N204j7039J3176K147j2824J0939K678j0523P438
938A851N552j2497O890O714j5628Q988L602j3164Q440K333r627M878O191j0370
952e847M191Q888j3524P424O794j3433Q284K931r635M240M263q747J573P728j1667
967f537L870Q071j2793P066N302r259N414L538o335J226O920r105J235Q088j2786
982f085M927N264j0184N409K156n081K260M112m274n7P682q161K139N882q802
997b813L740J662m695J366J389k711j046N304n216K44O823o869L252K411l318
1012d77K450m09l96j323K603k910k582N881n458L35K943l359K654q89M96R81O78
$$ plain form
912 4651 -10525 884 6170 -10773 3447 7106 -9387 5373 6681 -6693 3878 7004 -6934
925 -6934 1218 6986 -9634 655 5859 -11180 1996 4143 -8681 2258 4936 -5587 1851
938 1851 7403 -5094 1796 8510 -7118 1870 5472 -7692 748 3081 -6546 -1668 4523 -5847
952 -5847 -1656 7232 -6292 1132 7926 -5507 2777 5708 -3927 313 4576 -4171 -2598 5130 -6537
967 -6537 -2667 5404 -7389 -323 4979 -4280 1134 4672 -1663 -437 6483 -2622 -1387 6701 -6085
982 -6085 -1158 4106 -6078 -669 1487 -3594 -1334 2778 -1496 -1553 6129 -2032 107 5989 -2813
997 -2813 927 2589 -2106 -740 649 -2062 -3108 2196 -3020 -2776 4047 -2822 430 2841 -477
1012 -477 1973 1564 1168 -155 2448 -462 -3044 2837 -2621 -2286 657 -2702 -48 -937 -441 540 1218
1029A218l0j821M531l210q52K036k778J525k201N78J096k412J533j480L095r02
1045g4j191K912j100J865k657J120K696m972K263j082m14Q30k847J762J37N93
1061a59k747K465L725o222L995J608k907K867k452J13J288j225k893J806L323
1076B585p514L585L208n311M222q07q22L268q50l034K686L720q009K585N302q505
1092c691L438R74m386M096o86l179L317M151q023L662O892r859M487K762o844
1107b889N463q67n161M119K422q299K700P420j0355M202N406q393O548Q3m880
1122b481M873J819p044K266P170j1081K313P298j0799N490K318p820O244K316
1136B882o679K598P622r036R77R165j1129L924M856r986N582K434q302L329N904
$$ plain form
1029 1218 1188 -633 3898 688 -164 1872 -906 619 -1582 -1004 92 -2320 -787 -2267 828 -74
1045 -74 -1265 1647 547 2412 -245 875 3571 -1401 862 -220 -634 196 -2651 -889 -752 -159
1061 -159 -2906 -441 3284 -2938 1057 2665 -242 2625 173 286 1574 349 -2544 -738 2585
1076 2585 -4929 -1344 1864 -3447 775 -32 -854 2414 1564 -1470 1216 4936 -3073 -488 4814 -3691
1092 -3691 -253 721 -3665 431 -255 -3434 -117 4034 -3989 -327 6565 -3294 1193 3955 -2889
1107 -2889 2574 1707 -3454 665 3087 -5212 -2512 4908 -5447 -1245 4161 -4232 2316 2399 -2481
1122 -2481 2392 4211 -2833 -567 6603 -4478 -2165 5133 -5666 -176 2142 -5678 566 2882
1136 2882 -3797 -1199 6423 -2613 -1636 7529 -3600 324 5180 -4806 776 3210 -5092 -1763 4141
1151D141q683Q12R736j0374K959P748j0583N780L810q911L840N231q496k01R149
1166E958r862K14R059j1066M132O151r599M940N375p988Q82Q822q510j253R890
1181G145j0787J760P437j1160L942N963q947J600P584p112r39R416q286N41Q820
1196F977j0058K480O396q687J060O077o436k136Q723o851k154R708q628J019P967
1211E457p787Q93O909n869k087Q145n805l624R319p611k130R197q738k81Q303
1226D291o493j568Q312m966k856R096n948k607R360q152j174P548o822j648O897
1241C270m975k850P590m116l238Q709n305j891Q172n853j600O725m225l398O533
1256C548l378m398P108l948l466P452m015k592O876k965l318O683j954m540O848
$$ plain form
1151 4141 -4542 -3730 6006 -4368 -1409 6339 -4244 1536 5346 -3565 275 5506 -2990 -3191 5958
1166 5958 -3904 -3690 5369 -5697 -1565 4586 -5013 -73 5302 -2686 -1804 7018 -1492 -2745 7145
1181 7145 -3642 -1882 5555 -5605 -1663 4300 -4647 -3047 4537 -2575 -3514 5902 -2384 -1843 6977
1196 6977 -3081 -601 5795 -2892 -1832 4245 -2191 -4327 4396 -2455 -4609 5099 -3529 -2510 5457
1211 5457 -2330 -1437 5472 -397 -2484 5661 -144 -3768 5551 -2060 -4190 5007 -3731 -4012 4291
1226 4291 -2202 -3770 4542 -424 -3280 5816 -132 -2739 6621 -1531 -2705 4843 -1979 -3627 3270
1241 3270 -1705 -4555 3035 -1081 -4319 4390 -915 -2806 5366 -487 -2087 4638 413 -2985 3548
1256 3548 170 -4228 2880 -1068 -4534 2918 -1097 -3689 3187 222 -3096 3587 1633 -2907 3941
1271C941k301n594P727l601m250O715l145l902O241j979l843O410j325m647P083
1286C530j703m660O383k169l940N532k075m462N100j291m514N558q97m469N824
1301A747o18m264N738q54l914M862m34m797M616n35m474M121o4m695M039M16m383
1318c493M083Q72m022M206Q34m649L945R20m662L287N49m293K915N59m017K761
1334b05J155l864K707J799l786L132J347l806K704J581m072K100J452m286J991
1349e1J404m042K039J392l416K342J350k597J844J569k652J437J971l077P99J809
1365B121l418R57J378k930O52J952k836Q67K358k575J183K291k404R23J598k556
1381d39Q47J187k265J07J367k142rJ904k066rK221j646N29J816j647N58J306j383
$$ plain form
1271 3941 1640 -3954 3773 172 -4078 2637 -508 -4410 1831 -148 -3991 2419 1094 -3553 3530
1286 3530 1827 -2833 3550 1381 -2559 2973 898 -3564 1536 245 -4269 1289 392 -4077 1747
1301 1747 1129 -3135 2603 1749 -2165 2697 2263 -2534 2082 1547 -2927 1194 1130 -3565 474 890 -3493
1318 -3493 590 1462 -2560 1646 2480 -2169 1776 2696 -1966 1321 1870 -2423 492 1051 -2966 -205
1334 -205 950 -2914 -207 1592 -2194 938 2285 -1521 1183 2764 -1308 792 2244 -2042 -51
1349 -51 1353 -2689 -650 742 -2674 -332 1018 -1579 265 1834 -818 619 2590 -487 312 2121
1365 2121 -1297 -340 1038 -1892 -1240 712 -2124 -1257 1101 -1474 -291 2000 -404 519 2117 -439
1381 -439 408 1595 -670 -563 804 -1338 -1347 557 -1509 -1518 703 -943 -414 1402 -245 313 1619 236
1399B36k05J714j800m93J243j680J61P41j092M16N45j88j90J634j078J98J068
1416A230o73p3O06j029J59Po98j00R5j05q37J294p2k52R88n51R40m71J50L70p33
1437B45M97r09L8M09r74j61k9R00j066M9J563j287J230J59o74J249m35o58O45
1456G91K21j425j52J644k453N97P27j831K041m11p26J774K51j309K79K275k755
1473d62O27J445k655J561k09k177K002N86k722P70K938k986M57L286l392J756
1489H25J268l306K512N35l725J893J876l664J56L270l812J330K264m012L077J612
1505B099m323L011K285m133L50L998m537M38L084m945K266K259n278K975K884
1520B433m824R75M255l774j14M324m515J680K931o212L065L178o399J387M420
$$ plain form
1399 236 31 1745 -55 -548 695 -985 -824 -83 -1175 -759 -214 -402 -592 1042 -36 162 1230
1416 1230 557 484 1090 61 220 227 -471 -571 -476 -581 -1418 -124 -196 -448 540 -11 929 458 608 978 245
1437 245 742 -167 -129 280 -694 -855 -884 16 -1050 -1001 562 -725 505 664 -10 1239 804 146 791
1456 791 1012 -413 -565 1079 -1374 -777 -50 -1881 160 -251 -977 797 1048 -261 18 2293 -462
1473 -462 165 1610 -1045 516 307 -1870 132 718 -2004 -1234 1704 -1282 -825 2461 -931 825
1489 825 2093 -1213 1299 1834 -1891 2 1878 -1786 -1630 1640 -2172 -842 1422 -2590 487 2099
1505 2099 -2224 787 3072 -1061 -711 3287 -1250 -812 2272 -2673 -407 1852 -3426 -451 2433
1520 2433 -2391 -1416 2839 -935 -1049 3275 -1240 440 3371 -2841 224 3402 -2997 -1610 2810
1535B810m996k17M672m301R45L770n070K495M042o709K163M924n981n0M823m854
1551a534j86M259n495J615M778p005K038N976o271J79N884n081p9M607n406R04
1567h17M692o722R17N932o551o30O522n267n96N819n005P53M821n626O04O337
1583E183o655r47P127n922j729N998n141q8M886n285L70O460o009r50P870n852
1599f84j638O669n091n49N048n904J21N618n877j016P299n750j939P656n071j239
1615b347O048m895J65N357n552r52O808n452k923P420m615k204N991m674n51N791
1631C415n039q08O269l913k822P234l670l270O363m478j556N442n047q96N808
1646C032m130k566O336k501l464O644l471j926N896m691q39N318l986k383N355
$$ plain form
1535 2810 -2186 -2403 2269 -2032 -1087 2683 -2387 108 4150 -2559 -396 4528 -1453 -1503 3320 -1534
1551 -1534 -1720 2539 -2956 -1341 3437 -3568 -1530 4446 -1825 -1646 4238 -843 -922 3685 -1721 -817
1567 -817 3875 -2847 -1930 4002 -2549 -3179 3343 -1924 -2520 3299 -1706 -953 3868 -1758 -1154 5183
1583 5183 -1472 -2419 4708 -1214 -2943 3055 -2086 -2174 2712 -2573 -2203 4257 -1752 -2702 5168 -684
1599 -684 -2322 4347 -744 -1293 3755 -2149 -2028 3590 -2287 -3303 3996 -1754 -3693 3963 -1108 -2347
1615 -2347 3701 -1194 -1029 4328 -1224 -2176 4632 -820 -3743 3677 -938 -3142 2849 -1825 -2376 3415
1631 3415 -1624 -2432 3837 -76 -2898 4336 666 -2604 3759 -719 -2275 3167 -1880 -2776 3032
1646 3032 -1098 -3664 2672 171 -3293 3351 -120 -2046 3850 -841 -1680 3638 -348 -2731 2624
1661B624k232m253N965k485k950O131l875j109N481l431j815M716j695l745N195
1676B522j646l673N501l330k150N161l471j690M667k048k424M259n95l268M760
1691B575j786k692M792k916k036M004j611k841L299j66l679M139o99l118M883
1706B148j727k316M214j503k174K927l84k962K594J29l588L480p75k913M176j531
1722b05j852L187l88j807K101L14k828K856j95k904L194q72k626K708n95j873
1738a785J601R51k384K033Q22k890K846r3k192K331m0k234J683M2j993J142O73
1755E13k292J661L04j600J898O4j508J265P37j199L64R22j864R17Q49k034R74
1772b9O3j335J298J88j129Q28M09n02L03J078j350O25P74j572Q19J35j187M98
$$ plain form
1661 2624 392 -3861 2104 -381 -3331 2800 -1075 -2184 3297 -134 -1949 2767 1072 -2673 2522
1676 2522 876 -2797 2704 -626 -2776 2385 -1086 -2776 1891 -157 -2581 1678 1083 -2185 2575
1691 2575 789 -1903 2889 -27 -2063 1941 330 -2511 788 622 -3057 1082 383 -2735 2148
1706 2148 421 -1895 2319 816 -1358 1569 1185 -1777 817 946 -2642 838 63 -2850 1326 -205
1722 -205 -2057 1130 742 -1065 1036 1350 -1478 1378 1183 -1721 1473 601 -2025 683 88 -1785
1738 -1785 -184 767 -1617 416 1238 -1652 1194 1101 -1091 1240 1200 -1034 649 691 -1302 -160 513
1755 513 -1779 -118 186 -1414 484 548 -960 305 1042 -157 207 1129 -735 182 1031 -1003 -29
1772 -29 34 -1301 -3 185 -944 -116 293 -209 94 1172 -178 447 1221 -351 468 603 -584 -86
1790h6kn37o8N81p78P55O28p50O93K26n24K97L03m48k04N12p36P0M9n09p9M42
1812a65m54K41L33R3J59o5K52k90N02j7k62N0m25k27J0K06k86q5J88j60O7L12
1834b3P2N0J73K75k41K11m2p23M50O5p17N20m81m05K47M16n11P12N91j091R32
1855D80L66j137J260l28j003Q58N3j433P12J67j236R00M03j218J125O06j157J064
1873D82L78j284Q56P58j519N78O40j901P49P63j811R33P61j403R15P35j411Q54
1891G3J430k017P34J415k508J260R01k227O77J002k011N80J582k110N73J889k563
1908a320J312J465k224J109J303k215M49J642k545L9K647l159L45K525k814P32
1924g09K203k672Q17K013k424N19K680l057k0K701l194N14K405l169M01K319k531
$$ plain form
1790 -86 -88 -625 -693 -112 -890 -135 493 -257 436 662 138 435 738 290 86 598 -138 -68 -19 -528 -607 -165
1812 -165 -619 -378 -45 48 207 142 394 104 606 589 327 377 -48 -275 -265 -59 -345 -430 -242 -402 -335 -23
1834 -23 49 99 272 547 306 517 475 -248 202 267 -450 70 -411 -816 -569 -153 -664 48 639 -452 480
1855 480 846 -291 969 641 -362 496 549 -884 -172 -5 -1241 -341 62 -1156 -31 575 -582 482
1873 482 860 -424 432 1190 -329 249 889 -1012 -263 500 -1311 -378 383 -1020 -105 630 -781 73
1891 73 1503 -514 220 1635 -873 387 1288 -939 -262 740 -1271 -691 891 -1219 -646 1243 -1320
1908 -1320 -8 1457 -767 342 1645 -570 -121 1521 -1024 -985 1662 -1497 -1152 1373 -1441 -709
1924 -709 1494 -1178 -361 1652 -772 -253 2427 -630 -650 2051 -1143 -629 1776 -1393 -992 1327 -1204
1941a204R2K899k627k86L449k990j40L437l611M01K694k640n72K913k745r76L681
1958A775k981n87L875l798N09L585l236N1K995k221j388L843k589j441M246l963
1974a325m49M044l782j04L335k628m91L619k468j248M262l162q85M401l975n53
1990a409L909l564o43L431k219j984M676k580j862N089l551q82M457l111r75L498
2006B280k100j890L805k064k597M829k904j980M955l307j075M283k304j695L865
2021B101j610k120M228k443k255M593k837j563L971k874j467L637j389k225L958
2036A705j264k878N272k472k162M633k724j981L643j401k439L514j473k585M177
2051A565j567k755M868j766k446M118j155k403L409j043k413L645j233l517M469
$$ plain form
1941 -1204 -1112 1787 -840 -1126 2323 -667 -807 2630 -981 -580 2114 -526 -1098 1815 -930 -1906 1775
1958 1775 -1206 -1793 2082 -1716 -1207 2378 -858 -807 2188 -33 -1421 2422 -167 -1608 2638 -1325
1974 -1325 -1774 2270 -1512 -1616 1719 -909 -1400 2219 -249 -1497 2765 -397 -1282 3119 -856 -1409
1990 -1409 2500 -1064 -1707 1724 -495 -2479 2197 -383 -2245 2844 -707 -1589 2868 -243 -1218 2280
2006 2280 180 -1710 2095 31 -2566 2263 -641 -2621 2334 -973 -2048 2235 -69 -1764 2101
2021 2101 491 -1629 2599 156 -2099 2494 -343 -1906 2065 -809 -2276 1361 -28 -2253 1705
2036 1705 441 -2437 2835 363 -1799 2834 110 -1871 1772 371 -2068 1446 -27 -2612 1565
2051 1565 -2 -2757 2111 345 -2101 2017 862 -1541 1868 825 -1588 2057 824 -2693 1776
2066A776j635k597L867j256k199K927m60k262L321n26k811M082j122k932L749
2081A922j239k801K973k38k593K686n02k420L531q64k899M010n14k609L098n36
2097A005k268K247j12k411K603n60k620K874l61k664K968j56j934K344k64j771
2113a080J946J92k615K578k18k447K479k96k284J987J16k088J963L19k136K230
2129F46J66j909J953J03k146K054J51j810J392Q3k153J503K70j864J886J74j392
2146h93J297M93j521J235N22j678J185J81j591J153l5j436J235J35j239N28Q94
2163D65j126N90P14j014J149j01q74P08L79r77J03N45j046K32N11j048P00J28
2181C8p66Q09K64o66L66Q72o25k65P29p44K4K00o24O5J83n28N9M90j39l8O95j85
$$ plain form
2066 1776 141 -2456 1411 155 -2044 883 423 -1839 1482 956 -1855 2227 1105 -1827 1922
2081 1922 683 -2118 855 617 -1976 710 208 -2212 1319 455 -2444 1566 1052 -1557 1541 1005
2097 1005 -1263 984 872 -1539 1064 504 -2116 758 397 -2267 701 545 -1389 955 691 -1080
2113 -1080 866 1058 -1557 1021 803 -1644 835 539 -1745 242 358 -1730 233 552 -1584 646
2129 646 812 -1097 856 959 -1187 867 1018 -792 600 683 -1470 33 303 -1561 325 499 -893
2146 -893 404 897 -624 611 1133 -545 640 821 -770 383 348 -1088 147 282 -957 -429 465
2163 465 -661 -71 643 -371 778 677 -197 511 890 -87 16 561 -485 -253 258 -790 -90 38
2181 38 -728 81 345 -321 45 917 292 27 756 12 36 236 -388 -323 -140 -668 -609 -119 -258 -296 399 214
2203B14L9K89m11L85m03J78Q1l47j01m3l83L43n45O58k7K17l27K87J84l03M71
2224D56k50j64N48n04k46J68j90k74L51k77j09N00j70l84Q85j81k04M78J29l13
2244B49K99p1o66N54j9r84P92l88n51Q10k85k74O23J31m87R77q3p16Q11j3j229
2265e20J138m66p84N65R7o97P33J32j051J047J11p24J012j41p66J018J31j330
2283d95O02L86j260O22M30j190N84M55j038R49P97j638Q95O94j122O79Q34j935
2301g51J036O87j758P02O05j684O85Q63j223O71P28j134P24J210j968P39R84j721
2319f05O66P11j548N29R07j623N46J048j637P00J204j643O52J440j675L75J049
2336A096j374J30J374j852K53J316j737J21J159j594P06J340j839P10J348j771
$$ plain form
2203 214 253 542 131 516 113 291 372 25 -76 -119 -502 -159 -704 -46 -73 144 -183 104 288 -15 456
2224 456 206 42 590 86 -160 8 -182 -456 -105 -382 -491 9 -161 -545 340 159 -45 433 562 249
2244 249 548 477 -189 365 346 -638 154 -234 -785 25 -260 -534 89 220 -267 710 627 -89 722 709 -520
2265 -520 618 152 -632 -67 30 -667 66 198 -853 194 305 -419 593 452 -314 704 835 -495
2283 -495 107 493 -767 -145 285 -905 -321 134 -904 45 842 -796 99 793 -329 350 1184 -751
2301 -751 285 972 -786 -84 521 -1163 -478 385 -838 -167 561 -573 151 1361 -607 132 1116 -605
2319 -605 61 772 -776 -247 660 -963 -417 631 -1006 -306 898 -745 -93 1347 -328 47 1096
2336 1096 -278 -148 1226 -626 -373 943 -794 -673 486 -1108 -402 938 -901 -191 1157 -614
2352f14M61J815j888J22J458j981K64J298j857O3J498j561O1J864j322o40K386
2369A427j979J05J847j623K95J272j491o85J768j628m51K022j649m95K422j713
2385e56m46K327j264n02J890j403r33K346j871k17J765j506r71K373j691p47K212
2402H06j047j081K287q89j115K815j641q06J890j088j085K090j205j416K373r36
2418d8j417K385r98j173K431q81j342K403r93j200K163r05j880K343j057j410
2434a579K436q57j336K158o34j737K557l71j892K402n38j586K524j042j852K296
2450I49p43j448J800l58j752K057j97j964K857m39k266K578l97j546K065k90j902
2467i96J556K72k291J867J9k268K426l78j686K182k36j318J553M59k126J624N57
$$ plain form
2352 -614 -153 1662 -226 -104 1354 -627 -363 935 -922 -859 639 -922 -861 1003 -319 -959 1427
2369 1427 -552 -447 1400 -223 72 1344 -147 -832 936 -692 -1143 879 -770 -1265 1157 -556
2385 -556 -1002 1325 61 -441 1449 46 -887 1459 -412 -629 1136 -370 -1341 1032 -659 -1406 806
2402 806 -241 -1322 965 76 -1039 1776 135 -671 1219 131 -954 1136 -69 -1485 888 -48
2418 -48 -1465 920 -78 -1251 1180 299 -1043 1360 367 -833 1330 425 -1455 888 -169 -1579
2434 -1579 857 0 -1336 822 188 -1549 1008 637 -1255 1147 609 -977 1547 505 -1347 949
2450 949 206 -1242 558 200 -1552 505 308 -1656 1201 762 -1504 1074 677 -869 1196 906 -996
2467 -996 560 832 -1459 408 427 -1841 585 207 -1479 703 467 -851 702 1161 -965 659 1216
2484A216k280J802K1k417K226j51j836J371L82j439J491N47k083J670N89k395
2500a286K282j21j589J328j3j464P09O32j743J376N40j950J685oj552J860k6j006
2518c44R50L49j728R18M97j894J563K4j599J476n8j184J124M53j048P76P74j589
2536e40Q64O17j531J336k46j287J013r7q11L90L50o27R9J044j452J348M83j386
2554d33R13rm54M05p4p90J44N17r02K90P93j244O42J51l89O22oP5J95L61n43l78
2576a14Q23q39K56j81k24J82k76K77k9j22K67n5N20n59J95M33n88N89o35J03j33
2597a10j00J52m12J62K08l56J70K15L6j4J78L16m95M50j78k7J8n68K26j35K5j45
2619c84K19J89n55N31J58o05J073n19k13P96m57j42K85j65p34N85j72n99P05j90
$$ plain form
2484 1216 -1064 738 759 -1658 568 417 -1419 -48 334 -1105 386 933 -1150 520 1109 -1286
2500 -1286 996 875 -714 614 601 -863 -154 478 -1265 111 651 -1299 386 380 -1172 688 662 -344
2518 -344 606 955 -773 145 642 -1252 311 335 -1264 212 154 -1030 94 547 -501 275 1049 -540
2536 -540 324 941 -590 746 500 -787 226 129 -682 -292 58 -569 -470 574 -878 470 953 -433
2554 -433 480 471 17 422 348 -442 -298 219 -683 -393 400 -844 -202 -51 -440 182 176 251 446 807 264 -114
2576 -114 709 -130 126 -55 -279 -97 -373 -96 -125 -247 20 -35 485 -74 121 554 -34 555 -80 23 -110
2597 -110 -210 -58 -470 -308 -100 -456 -286 -71 -35 -49 129 445 -50 400 222 195 213 -355 -129 -264 -239 -384
2619 -384 -165 24 -531 0 158 -447 626 107 -106 690 233 91 376 211 -523 62 -110 -709 -4 -194
2639a94n67J041l27l19R89l73k99M82M8p39P60j21j080J317q23o23J220q00k06
2658f14P21k3o40J082l6q41J127l06q68J000m49o94P31k80r02J255k67r60J012
2677D8J16j118J479kr13J114n97l84Q72j07j086R36Kj501J151J53j192J335m05
2696i9q69J541k13r61J185K18j192Q93K40j335R89k75j096J097k61q70J022J75
2714A89r08R36L12q18Q16J39j166J003K10j304R89k81j167J099J00j274J199J64
2732B38j089J328j56q27J277m53n93N98M25j075O52R4j068N73L80j276J029J54
2750B11j194J224L78j154P93M62r83O45M34j468R37K41j124N52K74j065P32M31
2768C26j123O32P04j107Q20N25r75N25J46n67K74K01o77K39K78r53K70P88r20
$$ plain form
2639 -194 -761 280 -47 -366 623 250 -49 433 481 -258 502 381 -699 618 -205 -828 392 -408 -614
2658 -614 107 84 -556 526 490 -351 776 470 -398 602 153 -541 190 -90 -992 263 -4 -964 48
2677 48 164 -954 525 523 -390 724 127 -257 615 508 -578 358 360 -1141 10 163 -1029 306 -99
2696 -99 -968 573 360 -601 584 802 -390 503 743 -592 397 122 -974 123 -138 -1008 14 189
2714 189 -719 217 529 -289 527 666 -500 503 713 -591 398 117 -1050 49 149 -1125 74 238
2732 238 -851 477 321 -506 771 318 -275 323 748 -327 325 419 -649 -76 304 -972 57 211
2750 211 -983 241 619 -535 258 720 -263 382 816 -652 285 526 -598 -46 228 -837 -105 326
2768 326 -797 -165 539 -568 252 777 -198 327 473 -94 180 381 -296 -57 221 -732 -462 326 -594
2787e94L77O38r25O58L86o22R3Q01r88J80M66j017K90P91j210L10M89q03L32P37
2807C89m77j20Q82o53K17O84j022J60L95q83K19M22n16j49N06m04R1P56o82j08
2827b93J059p52J73N13l15n99R29o63j86M53p07j97Q65o67M9L91q2m3M56p9l87
2848h2N35o9n32M35r9o87O75m56m54O26l6n26O89J62p13Q71nl00N58l98l44N66
2870D16j96m64O67k59q47R28j86o33N81R0l85N01J3m61N12K86n80L81j25p41P46
2891B44k58o22N74ln52L57K28m56M67M53m22L88q4m28Q74m37l85K46k93k36J63
2912a82K63m87L77J20n18O21J83o60L98L75m45J20J79n52RN45o22K11L6n20K54
2933b95Q3n9L23K22k64K12J90j40j40L90n86O9L81o07l6K64n71J15M62m59L00
$$ plain form
2787 -594 -217 421 -504 154 540 -82 11 812 -176 4 470 -547 -257 534 -676 -366 123 -680 -348 389
2807 389 -88 -208 674 21 238 922 -100 60 455 -428 -209 213 -303 -452 54 -350 -259 497 -185 -293
2827 -293 766 14 187 700 385 -214 715 52 -134 319 -388 -585 280 -387 -338 53 -29 -72 384 305 -82
2848 -82 453 384 -148 287 188 -499 176 -280 -734 -108 -144 -670 19 181 -532 339 334 34 592 194 -150 416
2870 416 220 -244 423 164 -683 245 59 -574 7 97 -288 213 226 -235 277 563 -17 364 239 -502 244
2891 244 -14 -636 -62 -65 -617 -260 -32 -488 -21 432 10 398 314 -114 760 323 -62 184 -109 -345 -182
2912 -182 81 -406 -29 91 -427 194 377 -283 115 490 45 165 344 -208 -199 346 -276 -65 -29 -549 -295
2933 -295 -212 -271 52 274 10 222 412 272 132 522 -64 5 386 -221 -257 7 -564 -449 13 -446 -146
2954a46N65n63L68P9k49K18o3P7m20R0j03M3J37o22K46M29l10K68r6K95r9K75
2976D19n4k44K8k5k23M4l75L07j89J4j56J3L42k38N17n8j98R8Q4J85k94J65j4
2999A48M8k39l3l51M23o5j39J05Kj04L43J90l47L71J77n66K56l20MJ90k09p6L04
3022A12m83j33K53r1n6P09pm97O56l62l17Q00l73k12K13j73n77N00P6o92N03J13
3044c8m24P33j79j98J52N34o34N71P2q95M68J3j058R23m13j14L05J67n10N68M58
3065E01p99N04K65m74N33j8p59N82j81n66K30L78r96L87P21p70N98J22n85O56
3085C29J91p77O60j15p48P03K06j134Q26J53j006N68M0o02O77K36l37L14L60q76
3105c32P14K23j122J015l88o98J035n44n57O79j19n45O50J35o15P90J38j028J114
$$ plain form
2954 -146 419 -144 224 303 54 272 209 286 -134 -44 -147 -104 33 -589 -343 86 -224 44 -52 243 144 419
2976 419 365 121 149 124 -99 -55 -430 -123 -312 -298 -454 -441 -99 -337 180 122 -76 22 106 291 -3 162 148
2999 148 196 -43 -76 -427 -4 -69 -208 -103 -101 -205 138 328 -19 352 529 -37 219 -101 -97 93 -116 -192 112
3022 112 -371 -504 -251 -342 -398 311 304 -193 463 101 -216 584 211 -1 212 39 -538 -38 38 -654 -151 -38
3044 -38 -462 271 92 -106 46 580 -54 517 589 -306 162 175 -883 40 -373 -487 -182 -15 -525 43 501
3065 501 -298 206 471 -3 530 512 -247 335 154 -412 -182 196 -800 -413 308 -462 136 258 -327 329
3085 329 520 -257 403 288 -460 243 449 -685 141 294 -712 -144 -104 -706 -29 207 -130 184 544 -332
3105 -332 382 605 -517 498 110 -588 447 -97 -654 25 -94 -639 11 146 -469 321 459 -569 545
3124E45j3q84O30R1j024M37M31j123R05l9n24N96K85n65L25L53r72P68N90j100
3144b88O00j8q72O55k40n87R04K25j032J59P67o55K16Q98r90K85M40n82N13N2
3164D50q62R5O14j021M61M75q25M67M23n85M35M28o95L95M20r01N15L65q00J86
3184D0K54r09O26q0n95O98O7l88M74L01n44J56N38r05L82Q8m00J23J81q01N41
3205a53L81m96J82L88q51L42M57o34Q17Q3p70J96O91p21O7M43o62R8L57o38K28
3226a95L21o05M88J26k28J19K09k21K36J60n10K59j33m04O2L4J18K3J05j97k1
3247b54N96m46J20L07l32K21Q5k37K90q1m49k84L12j45N8K97l39L41J53j34q9
3268a0J75K00k05N4k5n3j0j89n1J4q7k15K43O0j8J39r5j22L56J11n4j4k23J60
$$ plain form
3124 545 532 -352 278 369 -655 -218 213 -910 -5 -44 -568 28 313 -252 73 426 -546 222 812 -288
3144 -288 312 294 -578 77 -163 -750 154 379 -653 -494 273 -382 -166 732 -258 27 467 -115 398 450
3164 450 -412 -317 297 -724 -263 212 -613 -146 277 -308 127 555 -140 255 675 -226 289 654 -146 40
3184 40 294 -615 11 -69 -664 34 101 -287 187 488 -56 100 638 -267 115 203 -197 -74 107 -694 -153
3205 -153 228 -268 -86 302 -549 -207 250 -384 433 516 -254 -58 633 -88 -21 422 -240 -142 215 -423 -195
3226 -195 126 -479 9 135 -93 26 235 14 250 410 -100 159 26 -378 -316 -282 -164 -141 -36 -233 -254
3247 -254 342 -104 16 323 -9 212 297 60 350 269 -180 -464 -152 -297 -239 58 -281 60 213 79 -10
3268 -10 165 365 160 214 189 136 126 -63 -114 -100 -187 -402 -159 -99 -117 22 -73 -195 161 272 218 204 -19 141
3292A41r9k13o9n8M8l7L8nK60Q4O3q3m7M17k91j35K77l41QK66k49k76J4K6J82
3317g9K08k19jL9K95j10Q8j07Q4j31KK61m25J07k01K4o9k7m6n1K18K86j44M7J44
3342A93J4n0k9Mr5P8o6j02p1o7K18K1j38j56J70J24M3J67J00m7p6r0l1J41j53
3367A02J1l38m1P5r6J76J24n9K75k55J41L33l12K05p1m2l73J13L3q9k4K5j42M2
3391a87l3R3Q4K02p1j72M31k76K19p6l23o9O5J28q1o7k03n0M26m03M56j17J42
3414A18Q6J13n25L24L6j00R5J47o50K23%k26K98k90L93r9j22K28q2K70l42R6J01
3437I2J3L13m89K3J12k69J42j28L38m06Q1L46n66L94K24l6J68J06k50j5R1m91
3459b07J85L2n90K54N81n49J59J95l24K91J97j3k51O62o13j79P09q11K73K42r33
$$ plain form
3292 141 42 -171 -240 -298 -250 -287 -249 -254 6 90 153 70 23 440 149 14 291 -50 -42 224 -25 -301 -287 -261 -79
3317 -79 129 -90 -91 -52 243 133 221 114 198 67 69 330 -95 12 -189 -165 -234 -261 -307 -358 -140 146 2 49 193
3342 193 207 157 128 132 37 115 49 -53 -124 -191 27 48 -90 -246 -76 48 91 258 358 311 235 145 114 255 102
3367 102 113 -225 -266 -191 -287 -111 13 -46 229 -26 115 448 136 341 270 228 -145 -32 1 -88 -112 -87 -229 -187
3391 -187 -220 -127 -43 159 88 -84 347 71 290 214 -109 -178 -113 15 -66 -133 -336 -386 40 -363 93 -24 118
3414 118 204 317 -208 116 152 52 147 294 -356 -133 -133 -359 -61 -351 42 -57 -179 49 -33 237 -105 -9 92
3437 92 105 418 -71 -48 64 -205 -63 -191 147 -259 -178 168 -398 -4 220 184 352 458 208 193 284 -207
3459 -207 -22 10 -580 -326 255 -294 -135 60 -264 27 224 211 -40 622 9 -170 539 -272 1 243 -690
3480f90K83L75l86M3L91r8O9N18q41N36L88n95M40q7n25O0M69n03j93N66m36k
3502b18M32n86P00L3m04O7J93l16O4L97l23k23N47q01L15K02m62L27K04m75J14
3523b13M22p9l72P08j35j47M75q31L35j5l95n3J27j12k30P88l40l84R03p24N69
3544B97K68q15O42n4j70l40N71m32k05M98p26K66O89j036N40L15m94L44M7k16
3564a1l33R16o04k80O43p74M87J80r00M92J55j54l79P69j81l51R35o80J17O18
3584F65j159N99J45m57L7J41o8k39P17j032L38P62q78K96M62m13L06j7j77k82
3604b54O93m85k42Q65q22L8L42o13L09R7j30L43J81k05K1N2k09J59M83j046N75
3625A52m4m02Q3l0k76K18K43j22k28J010p17L57J70p34O18l14J93l18K45j8n19
$$ plain form
3480 -690 -407 -32 -418 -375 16 -82 -13 505 -336 200 588 -7 433 346 -179 -119 350 -153 -346 220 -216 -218
3502 -218 214 -372 328 361 -43 24 217 -99 -35 362 39 -184 363 -438 -123 79 -383 -56 148 -327 -213
3523 -213 209 130 -242 466 331 184 659 -172 163 148 -247 -300 -173 -285 -515 273 -67 -451 452 -272 297
3544 297 565 -250 392 338 168 -172 399 -33 -238 260 -466 -200 489 -547 -7 308 -186 158 205 -11
3564 -11 -344 572 -32 -312 331 -443 44 224 -676 -184 -29 -183 -562 207 26 -325 610 -70 47 665
3584 665 -494 105 250 -207 -170 -29 -97 -336 381 -651 -313 449 -429 -133 329 -84 222 205 28 -254
3604 -254 439 -46 -288 577 -245 -207 135 -478 -169 -72 -202 141 322 117 138 190 -19 140 623 -423 152
3625 152 108 -294 -211 -241 -517 -299 -56 -178 -406 604 -113 244 414 -320 298 -16 177 -141 104 86 -433
3646d33N82m57L7O59o16J66K92q9r4QK22l23L06l04L2M95o83J51P6m11M32j29
3668h1r1J38J67j57J5M52o73M68N1m74L04j31J29m06J20Q0k24L52j10k18N96l61
3690e4o5M7K72M7j91J29j82jm4l01N47k55n8J71l82M50j08N1J25J7L0k17M30k33
3714B25p2j0k25J82m91L08O3n5k7p8L49j41k1L62l98j7L20j80J77l33J38l04L81
3737A53k55n24M18O5K46m5Q2O9k37K06l00k9M41J61l13J0j55K1p4K96l04j27K25
3760C0k11J62k9K80k66k4K19J0j90J26j46L9k27K99l01j06K69j11l4L66k46J19
3782B8K74j08L5Q4k36N8J49n29K6J47j07L7N9P1kp8n6lM02k08J15r9O1L9j40j19
3808a00J27J92k81j30L6j16J20J07r7k5R4J99N6P4O4m30K33k88lL77j38k80M8
$$ plain form
3646 -433 149 -308 -271 388 -228 -62 230 141 47 55 277 -46 260 -44 -12 483 -200 -49 27 -384 48 -81
3668 -81 -172 -34 133 -24 -9 443 -230 238 289 -185 119 -12 117 -289 -169 -89 -313 39 -71 -289 307 -54
3690 -54 -119 -72 200 247 56 185 3 2 -42 -343 204 -51 -109 62 -320 130 22 73 198 215 245 28 458 225
3714 225 153 143 -82 100 -391 -83 -20 -75 -102 -180 169 28 7 369 -29 -46 274 94 271 -62 76 -228 153
3737 153 -102 -626 -208 -143 103 58 140 209 -28 178 -122 -151 290 451 138 148 -7 14 -60 236 -68 -195 30
3760 30 -181 -19 -48 232 -34 -58 161 171 -19 107 -39 0 -227 72 -229 -335 -66 -177 -211 155 -91 28
3782 28 302 194 229 313 77 135 284 -245 -219 -72 -179 -142 -83 -12 -14 -92 -148 -151 251 43 158 59 120 159 19 -100
3808 -100 27 219 -62 -192 -156 -272 -152 -45 -142 -167 -73 126 182 256 320 -110 123 -165 -168 209 71 -209 -161
3831a61Q5k43L12j81M03k19R4o8L84k03j92L0j58q4J80j00j97m0J33K15k95L78
3853G3L2J06k57J84q2j25L25p6m4n6J16j7l94k0L2j16K13J0M11j14j82K84J10
3876D13l07j1K03j86j43m0l1l5j3l2J3K14k45J81j12J80J91R6l45K12L26n89L80
3899C20j27k21J38j68M7j29q7J5L19rr4J1K04o7J22j70J22j8o5j11l0j3J4l4m7
3924g8l14K66O1J52K10l07j2L04J2k96L34l24j67K24j13m75N85k85m7L58j66k94
3946c72O36k37M5L31m42k2M11l97Q5K07k26m65L55Qm03M75l2L5R9mj47P8j5j28
3970a25L99m16L03j94m7j44R9j89K14R0J61j03n4J33k20K50M5k67L86k44n14P58
3992C21l96j49L03k06K34m4r4n8kM73k27N4j04J36Pj82l44L31j20J7Q7Nk22L91
$$ plain form
3831 -161 -76 -319 -7 -188 215 -4 90 22 406 203 11 41 -117 -201 -21 -121 -318 -358 -225 -10 -305 73
3853 73 105 211 -46 138 56 -69 256 180 136 80 196 179 -215 -235 -203 -319 -106 -96 315 201 19 303 413
3876 413 106 95 298 112 -31 -71 -102 -137 -150 -182 -169 45 -200 -19 -131 49 240 336 -9 203 529 -60 320
3899 320 193 -28 110 -58 -11 -140 -227 -212 107 98 4 15 219 152 274 104 226 208 143 32 2 -11 3 -31 -78
3924 -78 -392 -126 -65 87 297 -10 -22 282 294 -2 332 8 -159 65 -48 -523 62 -223 -270 88 -78 -372
3946 -372 264 27 72 403 -39 -61 350 -47 38 245 19 -446 -91 -83 -486 -11 -43 -8 91 87 -60 18 3 -125
3970 -125 274 -142 161 -33 -80 -224 -125 -314 -100 -10 151 48 -6 127 -93 157 202 -65 321 77 -437 321
3992 321 -75 -224 79 -127 107 63 -31 -89 -91 382 155 209 105 241 248 66 -278 53 -67 -50 37 42 -180 211
4016B11p2k72K03J29Lj13O2k77L43l8k68J8Mj69K77j02j4K32l10P9J46m2j07K97
4040B20r9q9L51o7k62J18l31J17K0J37j91K8o7k4k3L24r3M5k50K81K28j19j90
4063F4j5l72J57k61L53k07L58k26q4K07m6K99k03N2J05m0M5k40J61n5j78J81m69
4086d14L95j50l12L21L7L20m5l10J69j0L64k19j39j40K29N2k08l6P2j12J22l2
4108d6J52k66J6M55l96K46k31J5L28k35K10k97r5J08j96J74j74J6m6L2L64l28
4130a94J51n0Q5R0j7R3R1l7j03k71J83j26N4m8J05O6k71J68N2m19N51l3K20k27
4154A13k73L55n14K09N3j17K95l41M3k33K74K78k51K67k02M95l23j33K19q9n3
4175G2k18J78kk53J8K90l29K86j69M59j46l50L41j58N6k01J73Q7j48K40m11J63
$$ plain form
4016 211 139 -133 70 199 202 89 151 -126 217 179 -89 -71 -67 -236 41 -61 -75 157 -153 -74 72 30 -77 220
4040 220 121 32 383 316 54 172 -159 -42 -22 115 -76 -48 -115 -139 -162 162 69 114 -136 145 373 254 64
4063 64 49 -323 -166 -427 -74 -281 77 -149 -233 -26 -72 227 24 76 181 141 186 -54 107 52 -126 55 -414
4086 -414 -19 -169 -481 -160 -123 197 152 -158 11 1 365 146 7 -133 96 148 -60 -96 -24 -136 -14 -46
4108 -46 106 -160 -144 311 -85 161 -70 -55 273 38 248 -49 -144 -36 -232 -58 -232 -216 -262 -230 134 -194
4130 -194 -43 -93 -8 82 65 158 249 212 109 -162 21 -105 -51 -99 6 72 -199 -31 21 -398 153 120 340 113
4154 113 -160 195 -319 -110 -57 -174 121 -220 -177 -410 -136 142 -109 158 -44 451 128 -5 214 125 72
4175 72 -146 32 30 -223 -205 85 -244 42 -127 332 186 -164 177 19 75 -126 47 134 -14 226 -185 -22
4197b2j90j19J48J5K68n0p4J76j8NK2K28m6l51K04l59j31M27j98k36L07Q1j07
4220b0j40J91K2J52Q6l14J93k5r9j62K2J80k16M5j09k6L72l64J56K45m05K75j14
4243e5K07K15k46j09KM5l90L70o0m7K01k39J49j94L10J6Q7m6j60K45J7o20J56
4266a46L11l12N7J53o3j40k43K8O55m19P1L00Q4m79L72L7J7j4k90k22q7M26n39
4289d43K46K21k89K16M4j37K02P6j80L02O7l26J60J43m56J65k48J15P8m8k57m
4311c53L88k15L53q7j92L18k27J50K80l51j1j37M9k3l32K59q0RL79l58J44P7j4
4334B6K44k22J41O4l0l48Q8J0k75M4Q1Q2J66j10j22L7L70j56L0M7N3j78j43l1
4358a32J78l7k62K09k00K55k83J56J28J87Kl13L60L4l80K49J06j75r0Ko0Q9k15
$$ plain form
4197 -22 -212 -331 -183 -168 100 50 -24 152 134 139 161 389 343 -8 196 -163 -294 133 -65 -301 6 87 -20
4220 -20 -160 31 53 205 291 -23 170 145 46 -116 -94 86 -130 -85 -194 -220 152 -212 -56 189 -216 59 -55
4243 -55 152 367 121 12 14 59 -331 39 -21 -68 133 -106 43 -151 159 175 262 216 56 301 318 -302 -146
4266 -146 165 -147 -90 63 0 -140 -383 -355 300 -119 -48 252 336 -143 229 266 283 269 -21 -243 -330 96 -443
4289 -443 -197 24 -265 -49 -5 -142 60 136 -44 258 325 -1 159 302 -154 11 -237 -122 -44 -92 -349 -353
4311 -353 35 -180 173 86 -106 212 -15 135 415 64 53 -84 -35 -58 -390 -131 -211 -202 177 -181 -37 40 26
4334 26 270 48 189 253 223 -125 -37 -27 -302 -258 -177 -95 71 -39 -161 -124 246 90 120 167 220 42 -101 -132
4358 -132 46 9 -253 -44 -244 11 -272 -116 12 199 201 -112 248 282 -98 151 257 82 -8 -6 -66 23 -192
4381a92K4K00j14j33M96l72J25K81j60k12K73j50k58L39k48l07K26k9k8J80Q0
4402B1k5L0j30Q3K05q0r4j0Q5K15k06k55K24k08Mj24K37l12L08j76m2J80K10K32
4426C72j80j03M7j16K58l51j35K81k21q3J25q4L0K90j98o8K23j05K38Nj91r4M05
4449C45l39Oj81M0k59L62k61J13k0P8K51m0j08j3L55k18K05k06j88O5P5j07k29
4472b74K88n2j20OK55q8r6J93J08k8j49J54R4j03j84q8k7k09K39j14l5J74k90
4495c46K81J80M8K16k90J46j47L01j99j61r3k73L47j64J5Q6k38J43J09J4Q5J0
4517G0K28k99K71q1k02o1L08l27j83R7r7Q1J53K7m2k03K57K21J95j3m23J56J9
4540A52k66P7r0K38k24j45J51j62m3L04m9K13q3J86O5j76R0k06J28L3o9K5n66
$$ plain form
4381 -192 -168 32 -82 -215 281 -91 34 315 155 -57 216 66 -192 147 -101 -408 -182 -211 -239 -59 21
4402 21 -4 26 -104 -21 184 104 10 0 85 300 94 -161 63 -145 -141 -265 -28 -340 -32 -208 -250 -70 140 372
4426 372 192 89 136 20 278 -73 -208 73 -148 -231 -106 -190 -160 130 -68 -136 87 -18 220 225 34 -60 345
4449 345 6 12 -169 -129 -388 -26 -287 -174 -194 -116 135 95 -13 -26 329 111 316 110 -78 -13 62 -45 -274
4472 -274 14 -38 -158 -152 103 15 -81 112 220 192 43 197 291 188 4 -84 -111 -320 -81 -195 -230 -56 -346
4495 -346 -65 115 163 379 89 235 88 389 190 29 -64 -337 10 -154 -139 -53 -291 -148 -39 -25 60 70
4517 70 298 -1 270 189 -13 -74 234 -93 -276 -179 -276 -195 -42 -15 -57 -260 -3 218 413 400 -23 133 152
4540 152 -114 -37 -127 111 -113 -258 -107 -269 -312 -8 -57 156 73 259 324 148 238 32 160 193 124 149 -417
4563d17L31k7j70K12q3r1L78K49j49k69J18j09O2l2j13L49l01J23R3l48KJ90r3
4586i5J17j9m9M4L9O5R0o7l1j51K6j8J49j12n2m5j76K26n5K27q2m8J63k82L61
4611B25l8J6k11P7j47j83N48l57j47K52l73L07K04o60M33K07n2J90j68k24O0R9
4633E8k29O7J01k83L02k13L47k40O6M3J44j47R5J39M7k61mK7k64R2L9j25l2N8
4657a73O3k12L16pJ9J17j58K11j70J56j76R8j55l3K09l67n8J41k16M90p3l1j55
4680a64L24j34k70N52k69k40M34m64J71K5j91j9J77n7j80L36k61J25K33o5R9O1
4702B23l17K57j37J02k50R9K4l91M40l16Q7L73k15QP7p0MJ16J84j79K88m33n8
4725h4M5j70j1K93M0j64J06k22L81o3r8o0K73j12j26O2j25O2J77n10J93j85J50
$$ plain form
4563 -417 -86 -113 -283 -71 -154 -245 133 382 233 -36 82 -27 35 3 -110 239 -62 61 154 -194 -192 -2 -95
4586 -95 22 3 -46 -2 37 102 192 125 94 -57 -31 -49 100 -12 -64 -109 -285 -59 -114 113 31 -17 146 -136 225
4611 225 187 203 -8 69 -78 -261 287 -70 -217 35 -338 -31 173 -487 -54 153 101 291 123 -101 -41 58
4633 58 -171 -104 -3 -286 16 -197 150 -90 -24 19 163 16 111 250 297 36 32 59 -205 -113 -74 -199 -231 -173
4657 -173 -110 -322 -6 -13 6 123 -35 176 6 162 -14 84 -71 -104 105 -262 -320 -179 -395 95 22 -9 -164
4680 -164 160 26 -244 308 39 -201 233 -231 -60 -35 -226 -245 -68 -125 -305 31 -230 -105 128 63 162 223
4702 223 -94 163 26 128 -122 -23 1 -390 50 -266 -179 194 -21 -13 64 -6 -2 114 298 119 407 -26 -84
4725 -84 -39 -209 -220 73 113 -51 55 -167 214 151 53 -7 266 154 28 90 -35 27 204 -306 -113 -298 -148
4748a48q3J26J4K19K90p52K90L64o1k02K65n80J93K56l62R4K62l09o6J25O9m23
4770d19K38m4M13l7j15K35Q1k94J15K09n54Q8M30o67K15Q1Nn8J94n7j31K94L3
4793B55Ok08j5J69j50l70J55K36j33k2L07n13K65Q7k03M01k6j22P3k5o3J6j09
4816A1Q6k70JJ0P8l9K0lJ87l26K64R7k3j13M07m96l4K39n0j84j9p3J24l2j09J30
4842a17J27j89J08L36k32n7%J48j56L55k97o8J47k5l6l83K0K55L3k1K2P7m4L70
4866C73j65j93l4K31J56m68K18k42N2K01k09J06j40J4L80l67J84k10J51Q0k1l4
4888F3q6J99l74J39n1M9KmK3J6r5L18k10j05K07k8j39K27r0k01J83n3K0m9J09
4913G0m17O1J22J3l2J13K45j22K24o1pm6p0j12k81K04q0O0j74M42p4j03O7Q3N8
$$ plain form
4748 -148 -231 -105 -91 128 418 -334 -44 320 259 57 322 -258 -65 191 -171 -77 185 -124 -190 -65 4 -419
4770 -419 -181 -225 188 151 36 271 352 58 173 382 -172 -84 346 -321 -106 -25 -20 -78 116 59 -72 222 255
4793 255 261 53 38 207 57 -313 -158 78 -55 -77 230 -283 -18 69 -134 267 241 119 192 167 104 120 11
4816 11 97 -173 -172 -162 -84 -123 -103 -106 81 -245 19 116 93 -20 387 -109 -143 96 46 -138 -157 -230 -106 -138 -247 -117
4842 -117 10 -179 -71 265 33 -24 -24 124 -32 323 26 -42 105 80 44 -339 -319 -64 -31 -52 -30 47 3 373
4866 373 208 15 -19 212 368 -100 118 -124 -72 129 -80 26 -114 -100 280 -87 97 -113 38 118 97 63
4888 63 -23 176 -198 -59 -110 -61 -59 -63 -40 -24 -119 199 -11 -116 91 63 -76 151 61 -140 43 -10 10 -39 70
4913 70 -347 -286 -164 -151 -183 -70 175 53 277 216 209 163 93 -19 -300 -96 -176 -116 -290 152 78 -25 42 125 183
4938A83k84J99J55P6k32q2Q1k48J54k48j85K12P5l20L78K71l18M15k21nJ51M8
4960B55j80j35J84J77l84J7N1j09k02L82p5n3J13m1J28K92l4l38J03k7j07n2o9
4983a04J03j11o8J5K08n0K37k64j3J9K07k34J20N8j42L47k72j22K7J36l84J05
5005a82p8J33O8J1L44l35K80j68j44K74j29p8q5o6L16n13J88L0O7k43J58R5LL74
5029C20l49P6j78M32j22J81l46j60k8K03j73N8qk52M75k92K05J03J7j10J77m7
5051A82k1j59l5J08Jj61k63L38m15M76O0j17q8N9K91l59L80j91k9K83n64K10K20
5074B06j20l03K9O9k25O56l36k01J12K7j51L60l85K27J09k05J6N0q4l43L77n3
5096a68L2M21m64R3J54J55n45M72l1j07L39k09l32K11n7O8o5k15J78P5P7k34J47
$$ plain form
4938 183 -101 98 253 329 97 15 96 -152 2 -246 -431 -219 -144 -464 -86 185 -133 282 61 56 207 255
4960 255 75 -60 124 301 -83 -66 -15 -124 -326 56 -19 -72 41 0 128 420 386 48 151 124 17 -35 -104
4983 -104 -1 -112 -180 -165 43 -7 230 -34 -47 -28 179 -55 65 123 -19 328 56 -66 -39 97 -287 -182
5005 -182 -260 -127 -59 -48 296 -39 241 73 -71 203 74 -4 -89 -155 161 -352 -164 -134 -67 -310 -152 -57 -54 320
5029 320 -29 47 -131 301 179 360 14 -146 -174 29 -144 -86 -94 -346 129 -163 42 145 162 52 229 182
5051 182 161 2 -33 75 76 -85 -348 -10 -425 51 111 -6 -94 -35 256 -103 277 86 57 340 -224 -14 206
5074 206 86 -217 -188 -119 -344 312 -24 -225 -113 -86 -237 123 -262 -35 74 -131 -115 -65 -149 -492 -115 -168
5096 -168 -136 285 -179 -86 68 223 -322 150 119 12 351 142 -190 21 -36 32 -33 -248 -70 5 82 -152 -5
5119ek21R3M56j02j2q4j00p7J03o2k48K19P3k75L28N3n04N84k07J88q5j30o8l
5143h6J65j61L38l30l80N16k32m5k5K12k36J79j70J12J20J21l5L27K16p36J93
5164F3j09k84J98q5K51k16l3p0N70k00j21J24j79O5M7J37j32J30m62O3Q1J10q5
5187a37P5J56k80L55n3j26J78O8j7m7J19j95J04Nk04j48J63j98P6j56J21K73k9
5210A03l37M73j46o6J74Pk46K25k19n8J60Nm6k8j74k15J62K37l88M41r4J01J8
$$ plain form
5119 -5 -226 -133 323 221 209 125 25 -52 51 -11 -259 -40 33 -242 86 139 -365 219 12 200 115 -15 -83 -86
5143 -86 79 -82 256 -74 -454 62 -170 -215 -240 -28 -264 -85 -255 -143 -23 98 63 390 606 -130 63
5164 63 -46 -330 -132 -217 34 -182 -215 -285 285 85 -36 88 -91 -26 21 158 26 156 -306 -243 -162 -52 -137
5187 -137 -62 94 -186 169 116 -10 168 236 219 172 291 96 200 205 1 -147 16 -182 -106 -262 -141 132 103
5210 103 -234 239 93 27 201 208 -38 187 -32 -90 70 75 29 1 -173 -388 -226 11 -377 64 -30 71 89
$$ [...]
8191B61
##END NTUPLES=NMR FID
##END=
