##TITLE=1H_LR-764-2-C1-R2A
 CDCl3
 8 sc, 
 19.5.2023
##JCAMPDX= 6.0         $$ Bruker NMR JCAMP-DX V2.0
##DATA TYPE= NMR FID
##DATA CLASS= NTUPLES
##ORIGIN= UXNMR, Bruker Analytische Messtechnik GmbH
##OWNER= root
$$ XWIN-NMR		Version 3.5
$$ Fri May 19 14:25:36 2023 Russian Standard Time (UT+4h)  she@DPX200
##.OBSERVE FREQUENCY= 200.13135
##.OBSERVE NUCLEUS= ^1H
##.DELAY= (6, 6)
##.ACQUISITION MODE= SIMULTANEOUS
##.ACQUISITION SCHEME= undefined
##.AVERAGES= 8
##.DIGITISER RES= 18
##SPECTROMETER/DATA SYSTEM= spect
##.PULSE SEQUENCE= zg30
##.SOLVENT NAME= CDCl3
##.SHIFT REFERENCE= (INTERNAL, CDCl3, 0, 15.7039)
##AUDIT TRAIL= $$ (NUMBER, WHEN, WHO, WHERE, WHAT)
$$ ##TITLE= Audit trail, XWIN-NMR		Version 3.5
$$ ##JCAMPDX= 5.01
$$ ##ORIGIN= Bruker BioSpin GmbH
$$ ##OWNER= she
$$ F:/spectra/data/she/nmr/H-F/1/audita.txt
$$ ##AUDIT TRAIL=  $$ (NUMBER, WHEN, WHO, WHERE, WHAT)
(   1,<2023-05-19 14:24:08.06 +0400>,<she>,<DPX200>,
      <created by zg, POWCHK disabled, PULCHK disabled
       configuration hash MD5:
       00 E9 B6 7A A2 85 ED C7 34 08 36 98 17 FE 4E 26
       data hash MD5: 16K
       33 A6 80 A9 2E 65 97 6F D8 99 F5 EA 4A A7 D2 08>)
$$ ##END=
$$ 
$$ hash MD5
$$ 5D 7F 4A 5F C4 D5 82 86 13 94 9C 9E F6 93 A9 B4
##$RELAX= 
##$RELAX= 
##$RELAX= 
##$RELAX= 
##$RELAX= 
##$RELAX= 
$$ Bruker specific parameters
$$ --------------------------
##$DU= <F:/spectra>
##$EXPNO= 1
##$NAME= <H-F>
##$PROCNO= 1
##$TYPE= <nmr>
##$USER= <she>
##$AMP= (0..31)
100 100 100 100 100 100 100 100 100 100 100 100 100 100 100 100 100 100 
100 100 100 100 100 100 100 100 100 100 100 100 100 100 
##$AQSEQ= 0
##$AQ_mod= 1
##$AUNM= <au_zg>
##$AUTOPOS= <>
##$BF1= 200.13
##$BF2= 200.13
##$BF3= 200.13
##$BF4= 200.13
##$BF5= 200.13
##$BF6= 200.13
##$BF7= 200.13
##$BF8= 200.13
##$BYTORDA= 1
##$CFDGTYP= 0
##$CFRGTYP= 5
##$CHEMSTR= <none>
##$CNST= (0..31)
1 1 145 1 1 1 1 1 1 1 1 1 1 1 1 1 1 1 1 1 1 1 1 1 1 1 1 1 1 1 1 1 
##$CPDPRG= <>
##$CPDPRG1= <>
##$CPDPRG2= <>
##$CPDPRG3= <>
##$CPDPRG4= <mlev>
##$CPDPRG5= <mlev>
##$CPDPRG6= <mlev>
##$CPDPRG7= <mlev>
##$CPDPRG8= <mlev>
##$CPDPRGB= <>
##$CPDPRGT= <>
##$D= (0..31)
0 1.2 0 0 0 0 0 0 0 0.06 0 0.03 0 0 0 0 0.0002 0 0 0 0 0 0 0 0 0 0 0 0 
0 0 0 
##$DATE= 1684491847
##$DBL= (0..7)
120 120 120 120 120 120 120 120 
##$DBP= (0..7)
150 150 150 150 150 150 150 150 
##$DBP07= 0
##$DBPNAM0= <>
##$DBPNAM1= <>
##$DBPNAM2= <>
##$DBPNAM3= <>
##$DBPNAM4= <>
##$DBPNAM5= <>
##$DBPNAM6= <>
##$DBPNAM7= <>
##$DBPOAL= (0..7)
0.5 0.5 0.5 0.5 0.5 0.5 0.5 0.5 
##$DBPOFFS= (0..7)
0 0 0 0 0 0 0 0 
##$DE= 6
##$DECBNUC= <off>
##$DECIM= 32
##$DECNUC= <off>
##$DECSTAT= 4
##$DIGMOD= 1
##$DIGTYP= 9
##$DL= (0..7)
0 120 120 120 120 120 120 120 
##$DP= (0..7)
150 150 150 150 150 150 150 150 
##$DP07= 0
##$DPNAME0= <>
##$DPNAME1= <>
##$DPNAME2= <>
##$DPNAME3= <>
##$DPNAME4= <>
##$DPNAME5= <>
##$DPNAME6= <>
##$DPNAME7= <>
##$DPOAL= (0..7)
0.5 0.5 0.5 0.5 0.5 0.5 0.5 0.5 
##$DPOFFS= (0..7)
0 0 0 0 0 0 0 0 
##$DQDMODE= 0
##$DR= 18
##$DS= 0
##$DSLIST= <SSSSSSSSSSSSSSS>
$$ [...]
##$SUBNAM2= <"">
##$SUBNAM3= <"">
##$SUBNAM4= <"">
##$SUBNAM5= <"">
##$SUBNAM6= <"">
##$SUBNAM7= <"">
##$SUBNAM8= <"">
##$SUBNAM9= <"">
##$SW= 18.05172834244
##$SWIBOX= (0..15)
0 0 2 0 0 0 0 0 0 0 0 0 0 0 0 0 
##$SW_h= 3612.71676300578
##$TD= 16384
##$TD0= 1
##$TE= 0
##$TE2= 300
##$TE3= 300
##$TEG= 300
##$TL= (0..7)
0 120 120 120 120 120 120 120 
##$TP= (0..7)
150 150 150 150 150 150 150 150 
##$TP07= 0
##$TPNAME0= <>
##$TPNAME1= <>
##$TPNAME2= <>
##$TPNAME3= <>
##$TPNAME4= <>
##$TPNAME5= <>
##$TPNAME6= <>
##$TPNAME7= <>
##$TPOAL= (0..7)
0.5 0.5 0.5 0.5 0.5 0.5 0.5 0.5 
##$TPOFFS= (0..7)
0 0 0 0 0 0 0 0 
##$TUNHIN= 0
##$TUNHOUT= 0
##$TUNXOUT= 0
##$USERA1= <user>
##$USERA2= <user>
##$USERA3= <user>
##$USERA4= <user>
##$USERA5= <user>
##$V9= 5
##$VALIST= <valist>
##$VCLIST= <CCCCCCCCCCCCCCC>
##$VD= 0
##$VDLIST= <DDDDDDDDDDDDDDD>
##$VPLIST= <PPPPPPPPPPPPPPP>
##$VTLIST= <TTTTTTTTTTTTTTT>
##$WBST= 1024
##$WBSW= 4
##$XGAIN= (0..3)
0 0 0 0 
##$XL= 0
##$YL= 0
##$YMAX_a= 186874
##$YMIN_a= -238830
##$ZGOPTNS= <>
##$ZL1= 120
##$ZL2= 120
##$ZL3= 120
##$ZL4= 120
##$ABSF1= 10
##$ABSF2= 0
##$ABSG= 5
##$ABSL= 3
##$ALPHA= 0
##$AQORDER= 0
##$ASSFAC= 0
##$ASSFACI= 0
##$ASSFACX= 0
##$ASSWID= 0
##$AUNMP= <proc_1d>
##$AZFE= 0.1
##$AZFW= 0.1
##$BCFW= 1
##$BC_mod= 2
##$BYTORDP= 1
##$COROFFS= 0
##$CY= 11.3945322036743
##$DATMOD= 1
##$DC= 2
##$DFILT= <>
##$DTYPP= 0
##$F1P= 15.7292609196834
##$F2P= 12.9074282941183
##$FCOR= 0.5
##$FTSIZE= 0
##$FT_mod= 4
##$GAMMA= 1
##$GB= 0.15
##$INTBC= 1
##$INTSCL= 1
##$ISEN= 128
##$LB= 0.24
##$LEV0= 0
##$LPBIN= 0
##$MAXI= 10000
##$MC2= 0
##$MEAN= 0
##$ME_mod= 0
##$MI= 1.114404
##$NCOEF= 0
##$NC_proc= 0
##$NLEV= 6
##$NOISF1= 3.799351
##$NOISF2= 2.8
##$NSP= 1
##$NTH_PI= 0
##$NZP= 0
##$OFFSET= 15.70392
##$PC= 1
##$PHC0= -19899.33
##$PHC1= 12.25272
##$PH_mod= 1
##$PKNL= yes
##$PPARMOD= 0
##$PSCAL= 0
##$PSIGN= 0
##$REVERSE= no
##$SF= 200.130013532006
##$SI= 16384
##$SIGF1= 3
##$SIGF2= 2
##$SINO= 400
##$SIOLD= 16384
##$SREGLST= <1H.CDCl3>
##$SSB= 0
##$STSI= 0
##$STSR= 0
##$SW_p= 3612.71676300578
##$SYMM= 0
##$S_DEV= 0
##$TDeff= 0
##$TDoff= 0
##$TI= <>
##$TILT= no
##$TM1= 0
##$TM2= 0
##$TOPLEV= 0
##$USERP1= <user>
##$USERP2= <user>
##$USERP3= <user>
##$USERP4= <user>
##$USERP5= <user>
##$WDW= 1
##$XDIM= 8192
##$YMAX_p= 0
##$YMIN_p= 0
$$ End of Bruker specific parameters
$$ ---------------------------------
##NTUPLES= NMR FID
##VAR_NAME=  TIME,          FID/REAL,        FID/IMAG
##SYMBOL=    X,             R,               I
##VAR_TYPE=  INDEPENDENT,   DEPENDENT,       DEPENDENT
##VAR_FORM=  AFFN,          ASDF,            ASDF
##VAR_DIM=   8192,          8192,            8192
##UNITS=     SECONDS,       ARBITRARY UNITS, ARBITRARY UNITS
##FACTOR=    0.0002768,     1,               1
##FIRST=     0,             0,               0
##LAST=      2.2672688,     0,               0
##MIN=       0,             -238830,         0
##MAX=       2.2672688,     186874,          0
$$ Real data points
##PAGE= N=1
##DATA TABLE= (X++(R..R)), XYDATA
$$ [...]
1871gM68n52q87N07P72p5p43L1Q21Q2n42o31J019M28m91r76J071N74o49p07O61
1892A74O08o31m68K39P30J88j408l1Q42R2j183O0J228m8r69k0O85J02k28o08M37
1913b09P88m27j002O25J154n14r16N46N80j73o54K95L23K76n03n36L11P88r16
1932a64m07N86M76p97m53N41N07l29l10J27L67l6K5o96N58R78q15q48J141J64
1952F15m81l92O15J12j12l65k39P07r3n18l96J064j71q15m93J394J12p07k40L85
1972a8J40k21k21m93J003M38r52k75R42L98j144K94P87k98o74J57K62p5L06o51
1992b95MQ23k44j021J81J571o85j232L47J003o76n03L51N98J20j14r86L1J184
2011D57j69j000R89O80r69p57O58R20q19J82J60m46J12j61k59O10Q79o52j458
$$ y = [-7, 461, -91, -978, -471, 301, 226, -517, -486, 335, 417, -125, -756, 263, 691, 200, -776, 295, 869, 220, -487, 174, 782, 151, -317, -78, 652, 840, -568, -599, 243, 335, -848, -788, 440, 392, -577, -597, 88, 190, -38, -646, -209, 579, 152, -850, -225, 929, 415, -501, 45, 625, 452, -202, 93, 416, 692, 189, -347, -36, 752, -164, -571, 15, 491, -306, -759, -218, 289, -40, -350, -223, 144, 108, 133, -563, -5, 973, 158, -690, 451, 615, 134, -258, 357, 469, 357, -8, -247, 460, 367, -151, -547, 517, 346, -469, -962, 432, 544, -163, -403, -18, 122, -99, -320, -813, 190, 628, -324, -599, 343, 741, -403, -109, 678, 380, -294, -137, 125, 50, 356, -295, -291, 532, 288, -733, -552, 1019, 334, -898, -551, 452, -224, -727, -376, 222, 342, 228, -758, -727, 457, 288, -712, 277, 957, -12, -769, -111, 809, -10, 172, 332, -114, -2, -163, -422, 188, 1067, 415, -1043]
2030a043P40P74o18k65J013r5q53M7k30K05N71j0p54L13R09j304m08J526N28j033
2050A3k61O50m77k15M56k28K95O49r96r92J146O48q87l54J296l48j483P91M47
2069A50l94K93J58q67N06K46p17j96J984j79j753M93O07r5o39P86L46n54M1m27
2089b11l06R49J35j041K11J326j279j318J544O56o26n15P41p43m2O25j61lR90
2108I32m41j715R33J136q46m73J176J17j026K21J52l38N70J97j151K78J212j310
2126c76p14J494N16j442k98J061o31n6N25jj24N43o56j047J366N52p73n01J497
2145I35l14j375L21O57j12J81J9n49K18N36r79kJ398k35j583K13J215l87o81M80
2165d4K41l77J10k66o18J190L71j039j55J173m22j009J009P87n62n41K99J6j05
$$ y = [-1043, -303, 471, -147, -412, 601, 506, -347, -300, -530, -325, 246, 236, -518, -205, 704, -600, -1008, 518, 1046, 13, -248, 402, -75, -290, 166, -62, 233, 882, -114, -1106, 40, 688, -199, -553, 743, 395, -1088, -297, 150, -244, 49, 207, -660, -154, 92, -625, -821, 1163, 984, -769, -276, 331, 236, -403, 383, 729, 175, 216, -211, -517, 432, 567, -474, -263, 1063, -216, -1534, 10, 666, 40, -475, 266, -477, -519, 106, -55, -58, 932, 491, -1224, -291, 845, -1, -474, 702, 819, -207, 14, 166, -172, 398, 595, -556, -278, 934, -376, -1090, 404, 920, -522, -820, 241, -390, -446, 79, 78, -46, 497, -159, -1206, 160, 712, -61, -562, 935, 621, -754, -433, 224, 112, 293, 312, -237, -19, 517, -462, -464, 934, 699, -884, -671, 544, 157, -524, -44, 197, -180, -70, -336, -954, 236, 607, -432, -587, 586, 164, -845, 164, 951, 389, -152, 147, 163, 58]
2184E8J55l55K15N88m11j075M05J145n93q06R20Lo29q2L09J20J79r3n24K88M09
2205B26n46m01J439K41j053l71Q48j66l46L57j41M41l65o2m26L65M01o68l45J014
2225D42k91o65K52K91m9J5o2k25K77L28l49l25N67J92p86J65P68j61n55M87j30
2246A86j48j9k69L17N02lp09k65R39k24p62N39L62l09k95k63M38%k7o34N78L65
2268B99k77p08M32O28k73m60K76J94k9k4j51N50J2o08k59M27K32j61o24M70M00
2289C46n81n3K65J29j40k75O7L4K99m95o7P26l2l93o3L77J42k50l8j0L77k81j13
2312b9J25J03J28n18K22K90J39q21J81J73L21l77l33L86J27j34m94M51L29j97
2332G2l15J53M10j99l74j9M76K55m80j26L61M8o5l84L52K03k77k54J63M77k17
$$ y = [58, 213, -142, 73, 661, 250, -825, -420, 725, 132, -674, 246, 249, -380, -462, -153, -33, 146, 53, -471, -183, 226, -320, -721, 718, 959, -94, -465, 383, 217, -129, 228, 87, 528, 163, 101, -325, 40, 441, -227, -572, 442, 151, -514, -262, 29, -20, -5, -67, -292, -15, 313, -36, -361, 206, 398, -388, -223, 545, 384, -171, 316, 186, 38, 19, -250, 67, 569, 566, -143, -408, 531, 307, -455, 84, 446, 137, -158, -421, 17, 17, -10, -644, -66, 299, 22, -686, -254, 374, 101, -359, -83, 111, 82, 58, -93, 457, 469, -139, -398, 29, 261, 100, -524, -54, 346, -235, -288, -23, 106, -34, -309, -242, -208, 91, -404, -471, 255, 223, -170, -233, 144, 286, 36, -2, -12, 365, 84, -29, 96, 199, 327, -191, 31, 321, 460, -361, -180, -7, 314, -63, -396, -10, 117, -17, -511, -60, 269, 72, -243, -90, 320, 121, -253, -272, 204, 459, -21, -147, 214, 262, 197, -187, 165, 368, 91, -163, 0, 477, 260]
2353B60n38K4L72R8n14O2M76Ro16O9L15M5p7k82L61J54j6m72K69J78j70p9j3L18
2377B33J4l49K7L78j6m33J40J31J55l99l72O38j03j81j20J11M69n33j09K25K32
2398A38k73l33j56P76n6k27L7K15L39l27k73K06L11l72j27J06J32p1k70l62O92
2419A05j28k93J12L0J75j01k83K40L13K44r52K20O09k03m76K58L22M2l25O3L51
2440C23N4k14k75O7M69m23m42K48N77l66m06P46k9k96m52L36L34k00j41m84L88
2461a86M26j68l43M17N11o14m41O09j1j44r1K06j08J22k13k53O51J50m29m56M59
2482I4J24m52p1M40j37k47K70j94K46j00j74k62Q91j28o52m0P52k57l02J16J72
2503H9j10j3J37j86L35j15m22l2O51k55n95M19Q66j026n9L84j52J0K35k04j52
$$ y = [260, -278, -254, 118, 216, -298, -236, 240, 249, -367, -298, 17, 62, -15, -297, 64, 218, 202, -270, -1, 177, 7, -72, -85, 233, 247, -102, -75, 303, 287, -146, -6, 125, 280, -119, -491, 147, 44, -137, -257, -146, 323, -210, -319, -94, 138, -135, -468, -624, 152, 96, -131, -94, 121, 460, 133, -140, 66, 377, 5, -122, -16, 116, 45, -225, -587, 105, -23, -316, -204, -174, 1, -100, -383, -143, 170, 414, -538, -318, 291, 88, -388, -130, 192, 234, -91, -28, 323, 377, 163, -112, -45, 424, 1, -441, -193, 384, 18, -388, 358, 329, 33, -419, -83, 251, 51, -90, -574, -186, 240, 72, -271, 146, 657, 43, -398, 211, 200, 56, -35, 171, 63, 185, -28, -281, 370, 520, 91, -365, 94, 218, -234, -305, 135, -2, -249, 21, -173, 73, -27, -201, -463, 428, 300, -352, -392, 360, 103, -199, -83, 89, -21, -34, 103, -83, 252, 137, -285, -317, 334, 79, -516, -97, 769, -257, -316, 68, -84, -74, 161, -43, -195]
2524a95L30n5n21L17O63l53l04K00J25m36L72L37n13J83K58p72K51M28k59k00
2544a44O35l4p89k1L26j3j84L02j64q4L22k32n18P06M08o35n69Q91ql44J91O04
2566F46k75k74P8n79O18K55m37j60P85p2j206N98L75j59k00K03k49l93M37k79
2586b88r3P61j79m31j33P05k24o78N50L42n16j55J75J10J52K1M9l28L06O7q49
2607f36P19P07n36m95M33j38n55L89L27j15j88K62n61n1P08j92l43L75L68p48
2627b70j77N52K69m22J60m0k57L03q5p0K22M72q06n31J048k53k85P4L92k69k08
2648a81r1j32L40M18l67l24M40R0n72RO08k58m2r9L58m70L45j97J23L10J02k17
2670A93m89O38k89j42L2J69j34j91q9M36l23L69j46l43O12n41m8J48N65l73l52
$$ y = [-195, 135, 80, -441, -124, 539, 186, -118, 82, 207, -229, 143, 480, -33, 150, 408, -364, -113, 315, 56, -144, 491, 457, -332, -353, -27, -40, -224, 78, -86, -170, 152, -80, -598, 108, 516, -119, -688, 203, 195, -149, 42, 646, 371, 97, 175, -404, 214, 469, 32, -128, 657, 585, -621, -23, 352, 193, -7, 196, -53, -446, -9, -288, -381, 380, 201, -230, -363, 342, 118, -560, -10, 332, -184, -339, -164, -54, 98, 119, 168, -160, 146, 213, -636, 83, 790, 254, -241, 192, 54, -501, -112, 215, 100, -88, 174, -387, -438, 270, 78, -265, 110, 478, -270, -447, 105, 374, -48, 112, 72, -185, 118, 33, -37, 185, 657, -149, -680, 368, 115, -170, -96, 296, 27, -181, -272, -404, -64, 354, -13, -337, 103, 193, -379, -370, 238, -20, -62, -161, 197, -273, 72, -125, -2, 308, 410, 193, -296, 342, 53, -89, -57, 112, -22, -213, -302, 134, -189, 180, 34, -309, 303, -238, -286, -138, 427, 54, -298]
2691b98K05J64k78K56n6J5L08k84m61L96L07m36q7O9N62n04L9K00N8m15J57J41
2713E8j99J92P5l50K91K71l04m57L63K39l00k41L78O1l50K20q3J44L4n0O0J88
2735B40j31k63r6N16k0k53K9R8M5k12j04J51j04J2p6l6J32L93k41l51O48j05l85
2758a13p9K64J72J6m94M99j59k5r9j86L79o1l04j03N46r8m71J67M72l65j37J92
2780A3n3K50l89j14J61L15j42l48M40j2k79L4J27K53j70Q9k97K56J86k63k03M54
2802C08k46k53J99l1M6M3l73J16K94J34n34R8K45j3O7j33K42j34j36M2J35K49
2824C65k46q4j11n8K38j80p4P0M28l37k46J12L18n15J83J00L1J48k45K61o8j77
2846h7N6k08L72P5l90r6K22q8p7j19L85J39n7j84J12R6j02j68J84L09k95j10k50
$$ y = [-298, -93, 71, -207, 49, -7, 8, 316, 32, -429, -33, 274, -162, -249, -180, 382, -122, -83, 117, 175, -240, -83, 58, -141, 51, 126, -224, 67, 338, 34, -423, -60, 179, -121, -362, 16, 77, -273, -53, -136, 8, 42, -8, 52, 240, 109, -154, -250, 266, 246, -7, 22, 120, 165, -47, -151, 0, -104, -92, -168, -204, -72, 321, 80, -271, 377, 272, -113, -192, 72, 244, 260, -234, 265, 106, 81, -18, -204, 175, 114, -190, -293, 253, 155, -316, -149, 323, -42, -179, 13, -40, 210, -179, -293, -132, 183, 41, -307, 133, 121, -158, -124, 3, 256, 86, 175, -122, 134, 320, 57, -146, 308, 62, -191, 8, -23, 23, 66, -307, -191, 103, 237, -297, -199, 46, 33, 100, -33, 209, 75, -61, -19, 116, 365, 119, 35, -76, -134, 104, -76, -150, -80, 348, 11, -235, -123, 195, -320, -137, -37, -6, 142, -103, 158, 90, -87, -31, -239, 133, 208, -182, -278, -56, -144, -221, -340, 45, 184, 127, -57, 55, 151, 49, -119, 65, 374, 79, -31, -281]
2869b81L26p1K2j52J53l8M8o2J27J11k0n64L81J09k30%K60J26j34k70J78J87j73
2892C3J78k86K99j50j83J01J66j11m8j61J79M63o16L8J0K15J7q9k67r2L48j38
2914i4J7k1J27o4j4Q0J93k42K22L8m0j51j20Q5L76l91j81K76j50J93m51M44j42
2937a0O6j24O9n27N07J02l59L25l9j90j3L1N86n86Q4M3nJ48k24j01L12J03l52
2960a54J41k0J25l1l41K52J69k64J66j85J49J27j39j53J6K16k85j19K46L17j59
2981G4O1j81K06n2j21j9P2K65l38J1k5M67j02m68O01k74l67J29J06Op7K7J10j3
3005I8n1l02Q6L56P9n71J29N11k50k40M75l71K69j99K79k80J07J5m42K58M71l29
3027I8n10K63K58j54jm6M25k98k96N6K85J18j55m3l65P04k05m00M27j81n0k14
$$ y = [-281, 45, -26, -4, -156, -3, -41, 7, -55, 72, 183, 163, -401, -20, 89, -141, -141, 119, 245, 111, -159, 19, 206, 33, 211, -75, 224, 74, -109, -8, 158, 47, -1, -162, 17, 480, -136, -98, -88, 127, 144, 55, -212, -304, 44, -94, -77, -98, 29, -35, -49, 31, 224, -18, 204, 242, 202, 51, -69, 16, 392, 1, -180, 96, -54, 139, -312, 132, -10, 56, -68, 1, -526, -19, 83, -276, 49, 10, -180, -193, -162, 424, -162, -78, -35, -40, 108, -116, -217, 95, 198, -154, -13, -33, 92, 61, -280, -28, 141, -123, 43, -142, 7, 134, -5, -158, -142, 74, -211, -330, -84, 233, 74, 135, -46, 160, 108, -13, -32, 40, 305, -33, -22, -47, 420, 318, -150, 451, 177, -190, -61, 45, 51, -26, 1, 111, 98, 47, -255, -169, 187, 266, -305, -176, 335, 85, -155, 320, -51, 218, 19, 298, 18, 125, 140, -302, -44, 427, 98, -412, -149, 109, -45, -46, -92, 333, 35, -261, -205, 80, 198, 43, 0, -365, 339, 134, -266, 161, -20, -70, -284]
3049b84L50k46K16j4q4J5L87j93m18M30J26l75k2L97j94l46O5J85n5O6R1m23L06
3072b0J15k82K23K72k7l40j6P6j33J06L03r9j21K14p5j83M1Mk19K11J70J40p68
3095d08L25J42j09K58j0l18Q0L1j39L10j55K17o43K64N34m49J05J70l57Lk7L29
3117A53k98M11j11k77J23K15k86r8K82M85o72L04k30k67L45j70P3Q0j21J1l01
3138c49L04M96m90j44K98l51ML68j11L4J75l76kL25q6j27lJ50Mk36J41lp7J61
3162A05J27k04J27oj92k69K42K98k53j86K42o1J7J09m7o0o8J25j16j55O20m46
3184e1k04L67j08j70q7N18l36J41Q3J64j57k55Q7j35K45pm49J98K81j54q5J76
3206F2K8p3j40jk8J62K16k15q4O1J97k55K51k25J99j65J20J26l32J11m2J3r1J99
$$ y = [-284, 66, -180, 36, 22, -62, -47, 340, 147, -271, 159, 285, -90, -112, 285, 91, -255, -190, -5, -60, 6, 97, -326, -20, 95, -187, 36, 308, 281, -59, -75, 1, -132, -26, 277, 178, 57, 271, 196, 13, 54, 58, -161, 50, 220, 360, -408, -83, 59, -50, 208, 198, -120, -40, -9, -148, 162, 7, 224, -419, -155, 379, -70, 35, 205, -152, -149, -176, 153, -145, 266, 155, -122, 1, 216, -70, -168, 114, 599, -73, 231, 1, -266, 79, -91, -18, 62, -59, -48, -349, -45, 451, -39, -183, 115, -236, -232, 136, 25, 59, 234, -142, -144, 181, 95, -32, -35, 115, 119, -117, 24, 21, -56, 105, 232, 28, 155, 149, -43, -312, -70, 228, -25, -211, 31, -30, -13, 96, 49, -11, -79, 46, -70, -225, 395, -51, -255, 112, 4, -166, -253, 265, -71, 70, 153, 317, 160, -95, -8, -143, 102, 95, -354, -156, 125, -29, -114, 62, 90, 17, -123, -124, -152, 10, 226, 11, -73, -12, 185, -70, 181, -44, 155, -10, 110, 236, -96, 15, -27, -14, -105, 94]
3230I4k71L06j97K6m0J50j80K06j11j51p8J57M3K90k23J05J01k29J01j00R9j8
3252H0M1q8j43J0Q1j38J25j93l1M48J67l32j63L97k68k10K18J5J39m45L64K9j49
3275d6k2J87k8j60J24k06J91J77p6n6j45L39l09p8LJ6K83j85j46J96K35j98l96
3298c00L34o4l36L98j67L40k96k5p2M71k93J30j22J13Q3j36l8J0j8Q2J2j90K62
3321A78j28r5mK25j46O9pq7N4j83J20O9N9j71p5J87r6p8K09k80J89J41q9P3k15
3346h1J85r6K9j43L36k62P4k92N85k40j39J28j89J96k68K97k27j7J28l94L19K71
3368B00M9k82J69K85m40n4p3L78k22j31K66J00k57k64L55J17j52J00o1j56n2K80
3390A55j18J59J18l48j27Q1L0J59j47R6P5k50K12k3j72J44r9JJ56r0r5J71o2n3
$$ y = [94, -177, 129, -68, -42, -82, 68, -112, 94, -17, -168, -246, -89, -46, 244, 21, 126, 227, -2, 99, -1, 98, 80, 121, 33, -110, -100, -19, -157, -32, -225, -256, 192, 359, 27, -136, 261, -7, -217, 1, 16, 155, -290, 74, 103, -46, -68, 119, 91, -69, 55, -151, 40, 217, 141, 85, -60, 279, -30, -108, -105, -89, 194, 9, -137, 59, 294, 96, -300, 34, -30, -366, 32, -135, 205, -91, -116, -188, 283, -10, 120, -2, 111, 194, 58, 20, 30, 12, 94, 106, -84, 178, 50, -45, -49, 176, 30, 99, 92, 5, 59, -124, -4, 65, 124, -47, -122, 65, -31, -109, 100, -180, 9, 150, 61, 134, -81, 104, 8, 37, -106, 230, -32, 42, -250, 335, 95, -44, 84, -105, 91, -177, 120, -107, -124, 4, -390, -71, 200, 249, -33, 136, 421, -19, -73, -146, 232, 10, -121, 145, 245, -12, -276, 79, 196, 44, 144, 83, -73, -125, 155, 37, 196, 314, -34, -161, -80, -50, 109, -38, 58, 133, -117, 95, 72, -100, 44, -55, -54, 102, 12, -83, 88, 26, -27]
3414b7j55J70o0K97j60k81L14k56J32K54m61L14r3n0o2K12J5l40q2L43m44L04
3436a16K11J47n1j80q4J35K77q7l45m4L23J30k85k93J82L22k90P9J3mQ0l00K54
3459G4m7j80R7M0n4j02R4j26K77l0p4N4q2P1o1L8J78J27l84J59j17k9J55j39J11
3484E0l1P3j2k78K19L3j25k1N2K87l4n38M47k84Q8K8N5j52J45j07q7P77l47r9
3508A39j21K56l55j6P7J52k58N5o7l7J29R9p4o9J20k03K02l3k45K15j33jm0R9
3532a09L05k69j21K50jJ6m1K81k54K7j24J40p2j3K18k78R8M9j89m8K38q3L2m8
3556DJ97l85j22L22j10KjL49l28J28k12MJ68k6K20n07O71l6n92J43M18o3m25J00
3580h1K32j0k23J41Q3j59J89l87J87n8J10L9k85M23o1p0m3J37j46K22j72l67N48
$$ y = [-27, -182, -12, -72, 225, 65, -216, 98, -158, -26, 228, -233, 81, -12, -62, -124, 88, 103, -237, -319, 24, -420, -116, 95, 242, 191, 11, -73, 62, 339, 252, -93, -137, 186, 316, 31, -262, -80, 242, -48, 31, 44, 40, 120, -180, 74, 27, -153, -56, -16, -70, -172, -78, -204, 73, 43, -31, 23, -59, 12, -49, -11, 167, 294, -90, 69, -48, -77, 78, -61, 50, 19, 92, 80, -198, 21, 54, -71, -92, -40, 247, 213, -325, 122, -162, -74, -46, 9, -143, 2, -105, -192, 585, 238, 139, 18, 274, -81, -97, -20, 132, -126, -71, -138, -175, -46, 53, -21, -90, 30, -173, 29, -4, -249, -34, -167, -168, -208, -109, 196, -73, -194, 56, 55, 71, 30, 311, 57, 84, -40, 100, 28, 15, 233, -45, 53, 102, -87, -135, 103, 20, 52, 4, 201, -184, -306, 16, -94, -92, -93, 256, -72, 56, -156, -152, 16, -10, 210, -297, 374, 338, -254, -111, 307, 244, -181, -81, 151, 141, -82, 59, 142, -17, 172, -215, -28, -86, 24, 63, -222, 201, 140, 70, 27, 164, 18, 240, 68, -299, 249]
3603B49k00k83K28J80Q4m03J30J2q0o0R1p6J37k42K72J72k5k39j43L31j69J53
3625A19l72J58nkJ56l8r6R4J32k20R8P5j0m9j02J50j85J22r8k29J92K30k92N9
3649a13K86m19Q9K38j58j47J44l9K27k18M35m41p8N45l92r4O7J44j28R4J9p0%
3672iJ9K28J1l51L04k83K25L8j37j59L0J72l31J64J68O3k77J55Q0j29P2M3j46
3695e0j23K38n2oj2K30k79J92J81m81N4J77j69J91Mn1M0k8j14j44M45l89N3m1
3719a34J80RP0k56J52p6l2j20J2J67J19j12J56m9j04j57J13K33j63j82L37m6k34
3742a17J90o6k3J46J30m49K87o5m7l7NJ81k12J29n6k27L23l1m9j25K34P9p0q3
3766D7M0m9j84K97j81Q8j23P3L3k4J54l96L56n0j23RJ15l45L57r8j02J18r6J94
$$ y = [249, 49, -234, -6, 174, 258, -145, -15, -3, -83, -143, -52, -128, 9, -233, 39, 211, 186, -53, -196, 135, -34, 119, -253, -95, -100, -102, 54, 16, -80, 14, 146, -74, 24, 99, 89, 40, -62, 88, -97, 25, -73, -302, -110, 120, -172, -113, 173, -246, -157, 81, -77, -224, -80, -119, 108, -110, 325, -116, -194, 351, -41, -135, -68, 76, -52, 42, 61, -9, -9, 10, 238, 249, -102, 202, -81, 144, 182, 45, -114, -84, 88, -243, -79, 89, 152, -125, 30, 110, -19, 53, 96, -50, -173, 65, 13, 7, -5, 225, -54, 138, 319, -162, -108, 69, -100, 91, 95, 44, 84, 56, -58, -202, 243, -146, -93, -134, 46, 55, 125, -131, 21, -55, -87, -207, -195, -28, 91, -21, 135, 86, -18, -175, -62, 171, 8, -174, 163, 117, -117, 73, 7, -16, 130, 260, -189, 98, 33, -14, -51, -46, 135, -77, 52, -4, -231, 92, 61, 12, -113, 121, 200, 130, 47, 87, 38, -146, 151, -30, 58, -65, 8, 41, 17, 171, -225, 131, 81, -42, -33, 82, -263, 94, -4, -106, 12, -84, 110]
3790A10k79J79n1n7j15K80J6k6k28K61j42Lj03K12J13k61M11m46K61j36j1j21
3812a30J6J56o9k35QK84J96l07nJ95p9Q4p1O0j21J14l02K22J23j83R7Q3qN9l26
3837a39L30p7j65j62J10r9L73j80K8P4j8J57k95J0J47o2j45L1J69P0m3j82J96
3860A28n2p1l0Lj11J03J49j79J35K8k0J4J21l63K47j42j66K14L0K3m01M11j85
3883a14o4K65r2k37K04J37J50k72k09L24j17j4p8J13Q9k99J52J50o2J00r0l22
3905b86K97k0j43L14j57Lj11j28K42j96K61j6J8k4k10K68j4K72n51P7k2J29J59
3928A62k19J47o2l2l0k52M11j75P5q4j39L3J97N0j76L28k58J82j92p2K57k09J3
3951d5j26Q1J70p5j23M98l87N5KJ09j39P3jj38L46k15j38oN5k3l3O9N5k67K01
$$ y = [110, -169, 10, -41, -98, -213, 67, 83, 57, -171, 90, -52, -49, -152, 60, 173, -88, 323, -123, 138, 2, -9, -130, -114, 42, -27, -262, -254, 30, 226, -81, -86, 109, 30, 114, 43, 103, -18, 96, -206, 16, 139, -44, 53, 136, 128, 187, -139, 191, 114, -51, -213, -103, -202, 171, -9, 19, 93, 75, 232, -63, -53, 94, 32, -113, -82, 87, 157, 114, -68, 128, 76, 5, -25, -22, -133, -30, 119, -60, 75, 103, 83, 97, 218, -145, 102, -40, -206, 8, 38, 61, -340, 71, -114, -178, 87, -5, -242, -38, 99, 249, -23, -232, 92, -25, -39, -117, -4, 85, -214, -62, 88, 26, 126, 36, -286, 11, -9, -152, 162, 5, 8, -103, -231, 11, -185, 76, 60, 78, 54, -156, 112, 98, 370, -181, -104, -126, 3, 162, -57, 90, 28, -4, -34, -286, 125, -50, 25, -59, -198, -165, 32, 82, -94, 234, -24, 158, -34, -106, 151, -58, -45, -171, -90, 80, 5, -118, 380, -7, 48, 50, 159, 20, 93, 92, -46, 300, 85, -53, -59, -4, -27, -60, 9, 64, -203, -2]
3976bM1Pj11K04k6k98J48K63k43L8J66l28L09J33m34K66j03K6K73j69l30J53L1
3999A4M4J6n3n0L05r0j96K15l30J42k5lj12n2K23M8q3j40J08J06j02j17K50k55
4023a37M30l93q9J95RP1j63J43j88K50j78J97J14p0L6m36J51n1R9j14L91o6j61
4046D0Ok63RO1N7q3J6K19J2j50J24J9k05N8L00k02o2l5R3j40J86K5R8l25J44J62
4072A64j76j5j95J96j38K09k06N8K94j62k8M8j78J68M9j5j36M6q0k83O27q8K1
4095A80o6J78l85n8K66M0j11q9k15N81l36j25J48N7j22L20k45J22m6j67K90k19
4117bK84k69j62K21l24%L42o0O9k20K3l8j23M66l27Q6J39j02k95L47r3J09j2j0
4141D9j74K52L0j21l26K29q3j14L54p2J61k04J54P3j79j53K15k67K71Jl34L71
$$ y = [-2, 39, 46, -65, 139, 113, -185, -37, 226, -17, 21, 187, -141, 168, 301, -133, 133, 30, 56, 329, 160, -170, -17, 14, 58, 74, 21, -29, 276, 186, -10, 205, -125, 17, -8, -11, -123, -175, 48, 96, 13, -127, -19, 87, -15, -132, 118, -137, 293, -100, -189, 6, 15, 86, -77, 66, -122, 128, -50, 147, 261, 191, 227, -209, -58, -109, -10, -124, 267, 201, 40, 46, -217, -208, -147, -90, -173, -157, 62, 74, -76, 48, 67, -138, -80, 220, 18, -44, -79, 14, -126, 60, 85, 183, -142, 2, 164, -12, -27, -222, -26, -164, 45, -161, -103, 191, 29, 1, 49, -129, 39, 88, 73, -63, -17, -97, -380, 247, 159, 180, 114, 292, -93, -151, 115, 155, 44, -45, -260, 321, -15, -140, 8, 65, -57, 263, 18, 140, 94, -73, 217, -2, 282, 13, -149, 72, -252, -252, 90, 30, 99, -121, -98, -136, -259, 207, -120, -34, 105, 3, -292, 55, -38, 71, 59, 49, -125, 127, 157, 36, -290, -61, -144, -258, 96, 24, 185, -19, 135, 208, 29, -124, 91, -176, 95, 96, -238, 133]
4163A33l2q7K25l41L01j01k26Q4O9j27J43j97k9K78k54L89l08R6j53J62j34K43
4185A34l78J94o7K88o9O1j98l35M20j01l21M91j32r5n4N2O1m2L7J58j13k03R6
4208a16P7j16J73o5j28K43O3m03J93L00j51l12L78k18o6L23j44o3J3Q1j27j33
4230a98J96J23j21R3J06j65k5j07K12j33M7q1P2J86rl31K32r0n1k5J16j95n7L26
4254A21M5k24j13K97J5MJ8pk79J71J8m08M38j23j80K3L13l1q0j05K25K5q3r9j24
4279a43nJ67j56p7k20N54n8k59M36P3k88J90k79O9K04l25n6K17M6Mk63L89l10
4302i0k01K85m5J06L4l0r3k0p1L5k68N74j01k99J14K7O3j48J00J1q9J65o6k5L86
4327C54l87J29j33J4K7Q5k82J18K17j95J03L2k07J90l24J65J43o0J4P2j2k00J68
$$ y = [133, 101, 14, 239, -102, 199, 98, -128, -44, 25, -102, 41, -156, -185, 93, -161, 228, -80, 16, -137, 25, -109, 134, -244, -50, -117, 171, 102, 163, -35, -370, 50, -51, -372, 119, -13, -108, -162, -110, -49, -91, -54, 104, -9, -212, -116, -39, -155, 18, -47, -175, 68, 131, -272, -79, 221, 70, -242, 136, -82, -148, 175, 31, -32, -19, 62, -65, -198, -2, 121, 0, 93, 199, 34, 9, -98, 114, -19, 28, -53, 19, 205, 196, -135, 97, 7, -44, -69, 47, -148, -205, 121, 166, -58, -171, 126, 141, 145, 163, 156, -123, 48, 66, -342, 96, -27, -207, -184, 129, 98, 18, -87, 138, 163, 80, -19, -143, -148, 19, -137, -214, -434, 120, 62, -197, 239, 312, 24, 214, -65, 4, 208, -117, -173, 44, 90, 94, -169, 220, -90, -291, -6, -51, 55, 89, 59, -34, -54, -125, -90, -358, 216, 115, -184, -70, -43, 20, -128, -28, -17, -106, 59, -7, -32, 354, -33, 96, -37, -23, 4, 89, -193, -75, 142, -53, 50, 82, -125, 65, -259, -94, 49, -11, 3, 75, 63, -137, 31]
4350C1Q0k44J18o6j04K1K20N2j55J45q6k60M19k11n4j04l7J20j2K11n3K13m83
4373b39R2K35O2j35Q4q4N4k82L70M6n58K81J66K24k47n7j50M89j51k63j9k3J46
4396D1k75R1J50j25J66p5Q4M1j34n4rM9j2J33n9r2J90l16M8L36r8j30k0k28M03
4421A05n3r3O3l7M9k37K64J16m03J50j16Q0K24k26P3r4J81j85L6R4J35r0N3j62
4445g3Q4j3j17J37k7l08L81N8j03R4j66N6o5J74n28K93J67j16q6M01j09P6p4j21
4469A5k22J78J74m07L41l7J65O5l94J35J46Pm2n7j93Q9n9N7J15J06k06k7m3N2
4493d2K1Ppj25J09L1Q4k18L10l2M1k52L8R7nk08J86r1j2j84L72o4j99j00L55R8
4519B10j83k20K17r0M4J16N8J73k58Mj75J16j49K38J8j53j80j4K28J46j7m6r5
$$ y = [31, 111, -133, -15, -81, -185, -164, 56, 108, -47, 98, 12, -248, 171, -40, -94, -198, -235, -115, -127, 84, 31, 244, -239, -147, 88, 150, 15, 99, 15, 69, -213, 157, 203, -355, -74, 92, 316, 69, 12, -138, 351, 200, -63, -82, -105, 41, -234, -143, 7, -118, 48, -27, 57, 98, -36, -90, -99, -50, -62, 71, 12, -80, 110, -206, -158, 178, 80, -50, -70, -298, 105, 52, -41, 22, -15, 34, -203, 61, 177, -226, -76, -192, -112, 112, -114, -41, -135, 46, -139, -103, -9, 126, 36, 89, -73, 11, -2, -119, 18, -9, -317, 64, 122, 19, 113, -53, 3, -62, 112, -416, -123, 44, -72, -158, 243, 134, 210, 136, 15, -207, -29, 145, -262, 79, 42, 207, 272, -122, 13, 159, 166, 124, 67, -126, -37, -96, -39, 76, 182, -24, -51, -94, -42, -21, -14, -21, -146, -37, -6, 78, -140, 170, 138, 179, -73, -35, 62, 57, -151, 35, -56, -68, -252, 120, 56, -143, -243, 112, 210, 27, -193, 24, -66, -22, 94, 152, 325, 67, 71, -104, 12, -137, 101, 119, -34, -214, -228, 0, 146, 129, 83, -12]
4542a2l0K56k12k28K07m6o1Q2K11k84K77k70J6P4J21q4N9j21J15j1k19P1j1P7
4566b3n4J68j33m4lK65j70n1J20l62L08nk27K50k04L86m27K9K28n0j39J82p7K27
4590A94k78J28M9J1j21j61K26p0L91l83M1Q2j04j54K42j2J8l30L66j65k8L42m94
4613b10K60j40R6J91q9k2J6k57J27K7q4O0L6J69j87r6J15l5j76J91J31o2k03K4
4637a18J45kn8J70o1R4l73L23k46L6j6r6Q2J84j86K67p0N1k55Q1m1O1j36K67m6
4662E7r5J43q4q7O4m7N4Q4l64L92N1k57L02j50%n7q3m7J38N9j19k7K55l1j83O7
4688C5k5K7L8o6m2Q3j90J06j04J62J69k57J75j9j84L26k78K57l43J75q8P1O5j33
4712d0K25k44J00j0J4j7j03Q4J05N9k02J6R5k91M2K17j91r5R1q3K97q1q2P9j7
$$ y = [-12, -42, 214, 2, -226, -19, -65, -126, -44, 167, -117, 160, -110, -94, -20, 101, 17, 76, -45, 70, 59, -160, -89, -100, -23, -77, 91, -42, -86, -89, 176, 6, -45, 75, -287, 21, 16, -211, 39, -165, 221, -206, -177, 51, 1, -138, 44, -33, 194, -84, 44, 93, 104, -17, -178, 48, -22, 369, -14, 27, 109, 5, -149, 93, 81, 99, -231, 135, -30, -58, 284, -210, 50, -90, 6, 197, 108, 86, 102, -155, -28, -1, -85, -25, 11, 180, -7, -103, 12, -23, -199, -8, 123, 61, -142, -118, 27, 25, -33, 137, 76, 170, -203, 120, -126, -90, -106, -202, -120, 64, -122, 145, 75, 126, -129, -48, -89, -28, -164, 103, 57, -38, 105, 21, -66, -2, -49, 5, 89, -275, 117, 168, -89, 213, 63, 63, 6, -77, -124, 14, 73, -46, -73, 182, 151, -32, 35, 10, 37, 75, 9, -33, 50, -140, -34, -138, 24, 193, -64, 111, 92, -92, 234, -44, 213, -130, 45, -43, 28, 93, -40, 185, -59, 41, 31, 45, 28, -75, 9, 114, 173, -29, -13, 82, -209, -167, 50, -141, -236, -145, -228, 69, -12, -94, -15, -32]
4737c2m2L8j78R7M8j08J60M8N6K2k18K45j31j20K87j09k95J86j22j07K66l7j8
4760f4J69jj93J8M6K23j69k7J65K5j60r9K10j52P3J4k59K59k5P9l42l4K51jK9
4785C5j43J9J67j46q2N4J05j72N51k87L7P3j41l4k3K13m53K02Q5k58P5J50j55
4808a28K64k51L01m90L65Q5k15K40j79J00j42K4N5J0K5k6k0k74K19k29L76R8m2
4831A66j62J02j97L10j26j96J52jnJ44J51n60K89J70j45j22OJ2j22j49K08k4L2
4854f7r7J6N3P7%n6R3q2R1j37Q5o1R0K36k05k41K63J21k92J04l7lJ38p3J14k23
4880i3J33k19J12K3l0r2KK58m6j23J60J22Jm06J68j37J40M5m5%l6K05r7K34q3
4905A96l50J30J32j64j88K88M7r8J67l88J72P2k99K39n8q2r0L25j36K08j89L4
$$ y = [-32, -74, -36, -214, -117, -69, -177, -17, 31, 87, 109, -109, 136, 5, -115, 172, 63, -232, -46, -168, -275, -9, -46, -64, 105, 104, -89, -71, -25, 198, 29, 2, 167, 192, 32, -67, 143, -9, 64, 78, -181, 78, 53, 132, -210, -244, 7, 6, 35, -108, -89, 78, -68, -150, -96, 9, -163, 388, 101, 138, 211, 70, 36, 13, 226, -227, -25, 60, -198, -123, 27, -128, 136, -115, 186, -304, 61, 146, -69, 171, -8, 92, -50, -26, 29, 39, 64, 38, 18, -256, -37, -266, 110, 208, 166, 4, 106, -91, 219, 93, -103, 49, 48, 43, 187, 338, -222, 67, 237, 92, -30, -24, -12, -134, -283, -75, -99, -67, -164, -148, -95, -18, -18, -74, 19, -63, 28, -109, -24, -85, 5, 241, 36, -205, 58, 179, -113, -9, -46, -49, 89, 16, 130, -93, 40, -179, -67, -44, -74, -166, -164, 94, 48, -75, 85, 207, 208, -198, -30, -167, -27, 18, -27, -27, -63, 142, 45, 279, 196, -154, -24, 108, -56, -244, 44, 91, -7, 160, -228, -56, 16, -283, -44, -102, -184, -274, 51, -85, 123, -66, -32]
4927c2o7N0K5L1K05n7Lp9j35J80j42N9j49J26J16j66j68m3J62J43Op4M61m83K11
4952A83k08j33R6L94m87j8K41M8k07k0L8P4P9p6o3j56J98j48Q0K23k55p6Q9L39
4976B35j73j41pJ21M1j97Q7j69L8K63o4m0p4J41j47L1J31k88M0kK20j72P3J83
5000A30k87J00K1K14J3k46l2L0J63lk29J9K25j53P6j32J65j27J05O9k76J83J66
5023A94k41J15n4J72n8j66J45J7l02L22j32J31L5l61L0L24j24k13J75j1k49K70
5045A9k28J44J02M5q6o6J58m3L1k16L40q4q5J6j0R4k04j48K93j67K57j02l7k31
5069b08P3J72K1j4p0J49k57L62k28N9Q7j32j71K43j41N2N4j07k04J31K5o5J72
5092CL5N5p7K29k87KJ4J00j34l6J32j07J71n4L7k09J96r7J62p8L7k95K28J1N0
$$ y = [-32, -99, -49, -24, 7, 212, 155, 158, 79, -56, 124, -18, 41, -108, 18, 134, -32, -200, -243, -81, 62, 68, -6, 455, -28, 183, -25, -158, -62, 332, -155, -173, 68, 116, -91, -111, -73, 1, 80, 4, -59, -215, -17, -165, -85, 138, -117, -193, -104, 235, 62, -79, -86, 35, 76, -121, -34, -203, -165, 98, 34, -6, -80, 61, -86, -55, 76, -212, -172, -174, 46, -126, -53, 130, -157, -57, -36, 178, 191, -55, -87, -57, 106, 103, -126, -107, 118, -35, 41, -91, 74, -53, 52, 121, -155, 28, 194, -47, 68, 14, 186, 128, -38, 107, 124, -178, 144, 12, 143, 178, -183, -153, 171, 47, -166, 9, -2, -251, 19, -209, -65, 37, 82, -4, -70, 88, 45, 76, -140, 200, 116, 31, 47, 37, 131, -73, -221, 72, -95, 162, 60, 23, -208, -135, 37, 58, 44, -26, 123, -134, 228, 0, 59, 146, 14, -157, 86, -55, -3, 51, -56, -260, -129, -104, -169, 3, 38, 93, 16, 245, -42, -40, -26, 74, -60, -96, 36, -71, 100, 46, 83, -126, 70, -27, 135, 57, 94, -201, 27, 38, 88]
5117H8Kr7PJ48J3k20Q9mJ83n3k17r7J25K33J06n04N29j42j65K2J6j41K90k40J31
5142A02k30oJ58J15j51K09k79R4R7k49K06o8J85m47N88j47J06k77j05J05j88J32
5164e0j97L11j32k7N6j53m3M21k98L03n14K65P4J9k03J38Q2l2j18K38j35j69J22
5187d2N1m4J82J84m48J69j08j27R4j30J56J54L4q5r3j77J56j75K62m3J91k79P6
5210d2J22j17q5J42J15j12o0j24M5K19j60k00K42L56m43N1L0N1r0Q2j39L39k26
5233dj74J29j33J54K5j42J82j12M3K43j59l66p4M51j38m0K12k56M06j75j11M0
5255Ar0n9M0o6J50R9N1j87J64J01k19j12K4J16k35J70M9n9j70J81J60j96q3K91
5279A21j34J0P7k54K27l6Q7K5l15K35O7M9k45lJ03j34J08j25J43p3J74J66m76
$$ y = [88, 90, -7, 0, 148, 161, -59, 30, 26, 209, 156, -61, -158, -33, 200, 306, -198, 331, 189, 24, 46, 62, -79, 211, -29, 102, -128, -134, 24, 139, -12, 197, -82, 12, 109, -140, 66, -2, 183, -264, 324, 177, 283, 6, -99, 6, -182, -50, -247, 64, -68, -95, -39, -192, -235, 186, -112, 191, -323, -58, 16, 35, -168, -30, 52, 20, -98, 140, 5, -164, -42, 9, -35, 147, 331, -117, 52, -56, -183, -89, -219, -63, 91, 125, 40, -53, -230, -74, -249, 13, -30, 161, -118, -42, 80, -37, -122, 20, 135, 23, -37, -161, -116, 103, -57, -257, -15, 341, -102, -51, -21, 30, -60, 22, -117, 222, -4, -178, -49, -182, -28, -3, -145, 37, -75, -32, 211, 52, -314, -388, 63, -75, -115, 97, -159, 247, 72, -39, 1, -89, -148, -108, -174, -24, 75, 126, -61, 103, 204, -15, -127, -103, 13, -222, -52, -3, -62, -232, -51, 109, -87, -170, 121, -13, -3, 74, -180, 47, 11, 98, 123, -192, 43, 110, 159, -86, -89, 14, -120, -12, -137, 6, -67, 107, 273, -203]
5302b03M99k04q0l2Q6j9p0j92L67j3j14l2l5M6r3K2j4R2n3j33J55J36j20J19q8
5327B7jJ15k04p6J79j83R1Q2K75l23r4J31K4p8J57k46J15R5J67k74K16k9m7J07
5351B26m54K39R8k16P6j9K24ol45M19j53k32K26j13L9P5q8mj41K90J7k42K04r4
5375B6l8J45P4k34J99j38K12m31K1J58j18m5M7L74k2j7j22k09Q4L45k34j29K6
5398b6L7O3q2n5K2Q4j02O5M1j02J27j66j16O0K88k85L49k71J28o3p3J34p4J16
5422I9j6j13O5q6nK21l17K91j1j13q8n1J79n7k14J11K10j08j35J08K19j36l4J
5446B0p7n9J36k30K25O5J04m16L97r1j48N7o3R5r0K00m11L73j59L4J75l15L50
5469A72j59o4P6j30N6j07J63j02J74J39k31l2K9R8o8j9N7m4m1J83j61O2k15Q6
$$ y = [-203, 296, 92, 12, -20, 66, 47, -23, -215, 152, 139, 25, -7, -42, 4, -89, -67, -81, 11, -42, -175, -20, 116, -4, 115, 27, 26, 141, -63, -139, 40, -143, -52, 30, 305, -18, -112, 19, 43, -35, 122, -124, -9, 86, 253, -21, 195, 166, 119, 226, -228, 11, 109, -107, -31, -50, 174, 168, -177, 242, 89, -143, 83, -30, 9, 84, -4, -8, -149, 141, 158, -84, 120, 26, -12, 133, 207, -27, 172, 34, 246, -185, -164, -6, -124, -169, -122, 252, 230, 213, 91, -118, -34, 311, 77, -52, -26, 11, 74, -8, -63, -41, 43, -59, 6, 47, -55, 72, -94, -210, -150, 138, -147, 202, -69, 59, -4, -77, 57, -17, 99, 83, -30, 35, -51, -56, 165, -152, 139, 128, 15, -73, -124, 55, -2, -216, -105, 105, -3, -138, -30, 189, 53, 19, 20, -57, -116, 20, -210, 15, 80, 184, -232, 165, 74, -74, -17, -80, 15, -75, 125, -286, 87, -72, -38, 137, -178, 172, 13, -51, 25, -105, -49, -156, 7, -95, 79, 218, -13, -45, -16, 82, 14, -5, 52, 8, -33, 150, -11, 51, -164, -78]
5493g8K20k93K25r0q8K06O8K15m9n36J70K19J18k66k54L24RJ31j67J02k05r6O1
5516e4R5l41O67j63k25on5J90QJ6k29K32k70J29J74k11j96K90p0P7O9l91J13j01
5540b52K92Rj13L9Q5j30o0P2K73k60L3j57L1K46L9n8j88K08j43O8K40j84j28k1
5564e9k7J20P3K07k55p4o5m0J38q0J7R2l07J83J72p7J7K51k84k7K4K22k23j04
5588a06K61l75J19k02L84j13j3J53n2j10L9n4r0J34q1L59m14J90j62J01P4k55
5610b13J56j4oK1j08J12j81K32o4J48o6K0o3r9K15j12j4k03J95l8J22l8n5P4j20
5635i9J39j40K86k72k8J90j6j10k52K44j08K85k00j3J56J18k42K4p6P9K09j45
5657B9j62K47o9j69Q4K00j9M5k76lK11j64J66k17J24j75L68j24j34j04L79j94
$$ y = [-78, 142, -151, 74, -16, -104, 102, 170, 385, 336, -200, -30, 189, 307, 41, -213, 111, 120, 251, 84, 186, -19, -115, -54, 41, -300, 367, 204, -21, -27, -82, 108, 116, 132, -97, 135, -135, -6, 168, -43, -239, 51, -19, 58, 127, -264, -151, -252, 40, 49, -64, -25, 60, -70, -130, -58, 215, -45, -12, -169, -138, 108, 147, 89, -99, 109, -34, 34, 274, 90, -38, -59, -86, 34, 107, 314, 59, -15, -80, -120, 18, -62, -45, 47, -260, -77, 95, 18, 35, 286, 2, -25, -1, 221, -2, -106, 155, -220, -101, -303, 81, -32, -45, 108, 56, -54, -15, -69, -159, -25, -106, 253, -161, 29, -133, -32, 42, -213, -57, -71, -77, -56, -164, -52, -233, -1, -65, 83, 17, 37, -26, -125, 90, -22, -36, -239, -44, -82, 40, 2, -53, 21, -99, 40, -100, 186, -86, -114, 76, 60, -50, -302, -58, -166, 119, -81, -94, 62, 180, -62, -38, -114, -35, 174, 29, -133, 114, 45, -124, -40, 160, 141, 186, -90, -93, 118, -46, 120, -97, 27, -148, 220, 96, -38, -142, 237, 43]
5679D3j63P3J64p7J07Kk27J26p7j20J52J20Jj83K0J11k52j02J84J10J11p9N4K8
5703A26Rk33L28j28k40K28j06j27K92j01J5J5k40K39k45J86k7j3jj1K04l40L45
5726A75Nj09J32l29M9M5l7o8K05j54J81L0o6k07J53j67N4R4J6j28R9n2L08l75
5750a46K89k72J06j9K0n7k10L67j02P5o9j44J32R7Lr1j11J68j58Q0r5Q7J53K6
5774A29RN2k87m3K66l60L3L29q0j5k1K1j38J49O0j40q5M7m9J03j09R4J31j14j01
5799a19L15k62k1o3Q6P0k5J1Q9j60K84l3k28K15j81mJ79j10o0J52k15J12K55j2
5823B75k36j43J82n6j08K76k04K85k42lL7j93J25p3J01J67k44k53J11K38k40J23
5845g5R2r8j00M05l47k9K68k95Q2J70Q6k70j01J30L51j59j92%J50J4j72K33j61
$$ y = [43, -120, -47, 117, 40, 147, 149, -78, 48, -29, -149, 3, 123, 124, -59, -39, 72, -180, -282, -98, 12, 123, 44, 98, 126, 135, -98, 230, 102, -138, 90, -16, -143, 149, 48, 63, 78, -162, 77, -168, 18, -9, -22, -23, -34, 170, -170, 175, 180, 71, 203, -126, -77, -32, -69, -137, 68, -86, 95, 125, 59, -148, 5, -162, -108, -14, 2, -126, -27, -79, 229, -146, 143, -129, -23, -42, -22, -79, -289, 78, -24, 51, -18, -162, -30, 67, 70, -21, -132, 36, -122, -42, -137, -50, 103, 129, 138, 190, -97, -140, 126, -234, -201, 128, 48, 33, 12, 33, -105, 44, 104, -36, -121, -74, -123, -20, -129, -35, 96, -18, -119, 196, -66, -87, -150, -64, 6, -19, -8, 81, -79, 205, 172, -56, 159, -22, -26, 153, 43, -17, 135, -80, 32, 287, 275, 39, -104, 78, 22, -86, 190, -14, 271, 29, 26, 63, -130, -5, -78, 23, 190, -54, -307, -196, 42, -198, -75, 17, -81, -181, 224, -123, -152, 116, -179, -97, 73, 159, -111, -212, -82, 269, 110, -82, -82, 68, 82, -90, 143, -18]
5868a8J7n3N7R1n1j42j1J1R9Q0k33K12k97M38j46l45L52oj37mK10j43r8L60q0
5893A63j67p4N3M0j4K37j31j41K71l03J04Qo4K37q8o3O7m9q2P8L1l44K75J08r6
5918E6K3n3J42j15l2l0J38j9m2k30J68M5j57J27j39J88J12l44J37M7j27Q6J73
5941A54j21P2j94N1o3K40m15N05k13n5L33k57J31l29J91o3j17L25l8k2K50m53
5963h8OK27K8j83r4J5J07J63k61M28m37K07M5k27k7j48K03K24j02Qlj85j02J54
5987d2O8l2Q6LL4j79j43L78j81j52K57j18N8k37L64K7p4j74K98n9j59P3j36Q0
6011D0K6k73L44j86L9O6J24j65o9J5J3L21k06j84mR7j42J55j40K19l43K34J65
6034A46j42M5m5L7J5L2J51k78O1r9J7r9J39J0n2J79K2j27R7k94K67n7k40k4Q2
$$ y = [-18, -1, -54, 3, 94, 43, -99, -110, -99, 0, 80, -153, 59, -238, 200, 54, -291, 61, 55, -82, -86, 124, -19, -117, 243, 163, -4, -78, -25, 15, 1, 238, 107, -34, 237, -66, 38, 46, -18, 219, 131, 68, 135, 86, 4, 82, 113, -231, 44, 152, 56, 79, 26, 168, 53, 21, -9, 129, 110, 68, -162, 6, 51, -106, 21, -118, 70, 182, -162, -25, 22, -105, -19, 154, 33, 105, -89, -38, -101, 139, -276, 229, 16, -39, 294, 37, 168, -161, 30, -33, -150, 175, 137, 115, 365, -88, -82, 145, 173, -10, -104, -89, 18, 181, -80, 348, -89, 118, 163, -64, -91, -239, -36, 188, 86, 94, 91, -94, -196, -42, 26, -6, 80, 83, 117, -62, -205, 173, -8, -160, 97, -21, 37, -200, 164, 191, 117, -57, 241, 182, 23, 96, -40, 40, 66, -207, 137, -49, -10, 56, 180, 15, -54, -39, -26, 295, 89, -95, -99, -2, -144, 11, -129, 90, -253, -19, 146, 4, 49, 4, 41, 56, 88, 239, -39, 22, -77, -60, -159, -20, -10, -62, 117, 139, 12, 109, -185, 82, 25, -215, -239, -157]
6059a57K84k68o1O1J43M0k65k53J70K82N3l4N1Q6j80P7J14o9j4K1m9m1q8o2R0
6084f9O4J63P9j16k5k33J9k91M72k8Pj12K44j06N3j47J8N7r7J62m7j11n5K36k25
6109h8J96J6m5jJ07m12J81o2P4j1k57M38j72J65q9m9j47K56k0k36K69m4j25J90
6133A34l45J0M0N2K73r6k54J02N0j51K53j66l0J68K8k61K61R4k08p9J93o4k22
6156b18L93k86J65K7r4j37M33m18J16j08N6J02o6J74k50j6L6K70k60j5O6J29p9
6179B0K42j63j08n2J66J8l58K05K55j67q4j54J08l8K77j66q4K11J7m00J72J00
6201A7j07J68k34L53j08l17J03N8n7L7j23M1K19j05M8k05M06N8k50K07m19N6K28
6224G4j59N0q0KK66k82J01K07j71Q3J1lj43%j69J15J77j60j12R7J49K8l14R9J8
$$ y = [-157, 127, -141, -202, -141, 2, 42, -223, -476, -306, -24, 29, -5, 46, 132, -48, 29, 143, 74, 60, 81, 32, -9, -97, -159, -69, -5, 158, 237, 121, 96, -137, -118, -409, 63, 35, 42, -70, 174, 68, 121, -26, -8, 49, -48, 114, 67, -44, -99, 137, -88, 108, 124, 79, 78, 185, -227, -46, -108, -34, -45, -302, 136, -36, 129, 40, -9, -156, 100, 80, -156, 113, 69, -56, 134, -211, -201, -161, -109, 164, 68, -186, -84, -34, -185, 68, -98, -128, 40, 68, -193, 68, 162, -46, -125, 68, 4, -218, 175, -111, 54, 81, -13, -150, 283, -135, -19, -127, -71, 31, -35, 139, -111, -127, -91, 179, -81, -96, -30, 99, 20, 262, 99, -9, -61, 105, 123, -235, -30, 225, 58, -26, -180, -72, -110, 167, 1, -83, 128, 145, -255, -83, 17, -90, 78, -156, 197, 89, -228, -125, -67, -124, -87, -210, -169, 50, -55, -7, -212, 194, 252, 2, 209, -210, -154, 74, -85, -35, -115, -113, 153, -129, -28, 179, 8, 91, 102, 99, -44, -44, -213, -98, 79, -81, -193, -96, 53, 81, -233, -134, -116]
6249a16J09L8L4r4J26J7n8j7o4L41m73J56p3J46N4l28J99%P9j05mR5n0r4O1J10
6275H9k18P0P5j21K04k83L01p3O5m37J31J56J35Q2k35k32K56l3J02p9q3J53J79
6298B04j02j95J34k05J10J00J29L8m14l4R9K03J02n4k31R2QM0k17K75K5q8j33
6321a14j35M09k70N5n6J5J84k72J55M5M4Jj38RR2N5P2j32J71j09J39l02L1O2k0
6346iK9K06k08m3l2L6K04j53k26L20k52L7J13L0J06R1l38J2k1l9K92m92N45j17
6370I1l33J04J05j35J14J9O2j55P0P6n8K48r0k9n0J6P8k33J10n6M1J92j68j59
6394a40J98K1o1j9j49L92j9l40k08M39l26J45L70m35L17m49L06p8l7K10j20k62
6416b45L07K6k08p5K17Q5r7r7K43m2m71L19j21J56pkJ23K99m09J43j08q1j56J32
$$ y = [-116, -7, 31, 65, -29, 97, 114, 56, 39, -25, 316, -157, -1, -74, 72, 126, -202, -3, -3, 76, -29, -33, 62, 12, -82, -21, 89, -129, -59, 16, -105, 99, -184, 117, 44, 109, -328, -197, -41, 94, 176, -59, -291, -35, -68, 34, -45, -128, 25, 204, 102, -93, 41, -164, -54, 46, 175, 213, -201, -235, -136, 67, 169, 115, -116, -24, -16, 24, -193, 82, 107, 19, -114, -249, 160, -110, -55, -111, -96, 88, -184, -29, 16, 60, 61, -77, -68, 24, 79, 151, 19, 190, 81, 220, -82, -51, 11, -9, 20, 226, 18, -25, -57, -21, 183, 30, -196, 124, -128, -91, 22, 52, 158, 249, -89, -77, -98, -137, 155, -337, 208, 91, -242, -138, -33, -168, -54, -35, 27, -128, -58, 18, -40, 208, 118, 89, 39, 55, 133, -100, 10, -46, -5, 187, 19, -140, 58, 79, 18, -1, -150, 242, 223, -117, -325, 114, -212, -67, 303, -132, 185, -264, 42, -36, -73, 137, 17, -245, 62, 88, -120, -195, 22, 107, 10, -87, 156, 114, -357, -38, -159, -3, -10, -12, 111, 410, 1, 144, 36, -45, -201, -69]
6440f9J18jq2J05J6m7j56P6k23L62k42K91o9o1l5j1J45j11J72l9j12J50O3k78
6464c8K42l04Ro5J21K39j16l74M39j62M79k50m52l3L34l3r4O0Oj09L4J89k00J28
6488E0l6j10M1M7J02l05K05m7o0K26j47Q3j9J30k27n4R4J14j04p5K08m2P5j81
6512c2l6J95j87J54L2j86o3J93K36j07j78k70J32L60k20n1N3J28k40Q7j21K10
6534H9O5l21L25j65J78m9l0j4k57N13m64O5M5kkM3m24K43M09j77k37K6J06k07
6558b42L86J38l95J34n2J0OO0m5K21l42J60M0m9J6k17n2K07J13k49Q9M6r6j13
6582b26K03J15n7r5K11l0k87K55K42l70J96k79J25oJ64P1k73j61K63j16M9M4j29
6605i1l0L0J91j35J7mJ95o0k26N6j1o2L14k97j03J58O5J56m59M13M3k02J40j85
$$ y = [-69, 49, 48, -34, 71, 87, 40, -116, -40, -263, 99, -143, 148, 79, 18, -17, -28, 117, 6, 178, 139, 27, 177, 240, -38, 204, -100, -91, -156, -35, 204, 88, -286, 153, -9, 470, 220, -232, -265, 69, 36, -58, 2, 8, -101, -67, 122, -78, 50, 14, -96, -55, -8, 94, -211, -6, -53, -113, 113, -34, 49, 30, 160, -67, -121, -27, 87, -17, -92, 116, 74, 149, -32, -68, 127, -60, 94, 126, -60, -123, 70, 306, 199, 21, -249, -117, 243, 23, -28, 25, 153, -87, 0, -121, 89, 154, -167, 158, -7, 171, 122, 92, 78, -179, 334, -130, -65, -20, -22, -24, 19, -405, -162, 247, 70, -167, -141, -35, -242, 144, 282, -113, 21, -31, -21, -15, 45, 0, 221, -121, 39, 79, 30, 46, -171, -223, -16, 97, -152, -63, -17, -113, -226, -23, 92, 35, -60, 151, 121, -166, 89, 331, -39, 157, -122, 3, -3, 161, 232, -41, -202, 61, -55, -6, 38, -91, -121, -91, 100, -35, -18, -22, 173, 113, -113, -57, -68, -130, 184, -113, -216, -58, 7, 163, -296, 117, 160, -42, 98, -87]
6629h7N9K07j6j19k1k19j1K62j10k7K83k59On3K38l31J86k3J26l1Q3j31j53m8
6653a89M33m96Q6j07L68j07L21j29m13L24K0l36K01j40J69N8j43J46j30K64j31
6674F9k25K04P8l3j42L06j36k81K76j86J91j49J07j44j11R5j85N22k65P7l4Q7
6696A21l9k79R3K8J07j26j08J15Q7j12J29r9J18J76j84n7l5K9m5Q7R0J29j00n1
6720G4j17k62L37J45o7k61j67P0L15P6p9K5m7j87L32j61j88NK37r5k50K74R3R
6744A11R3k02l7K96j43k23j29J95j40N8K05l29K26n5j36L23m29N65j52j82K20
6765A35k11j12K34j22M8p7K54K8k38Q6l18M10j66j63K92k38L24j06j8j46J5J02
6787A3R4l15n1K36j30J76k68J11L45j64k35J99L6Q2pk52MJ2k3Q3L6K02l59J35
$$ y = [-87, -28, 179, 163, 44, 23, -196, -207, 55, -55, -82, 201, -58, -52, -105, 133, -198, -12, -35, 91, 60, 143, 12, -141, -189, 244, -252, -166, -273, 95, -12, 309, 180, -233, 91, 111, -225, -24, -164, 5, 63, -80, 66, -64, 200, 69, -156, 48, 126, 93, -49, 257, 121, -160, 116, -70, 121, -28, 79, -65, -176, -81, -266, 256, -9, 68, 34, 121, 82, -197, -104, -76, 31, -95, -203, -88, -1, -113, 16, -83, 35, 211, 27, -30, -65, -36, -81, 6, 96, 225, 125, 74, -43, -305, 32, 177, 110, -151, -318, -248, 67, 143, 64, 89, 42, -145, 187, 26, -162, -157, 80, -15, -265, 9, 102, 111, 204, 2, -35, 261, 118, -105, -234, -39, -179, -121, 84, -245, -19, -74, -210, 113, -316, 249, 97, -85, 135, -76, -188, 46, -76, -28, -105, 149, 177, -61, 25, -293, 117, -49, -212, 80, -158, 166, 60, 42, -104, -89, 13, 107, -208, -259, -23, -153, 23, -245, -134, 211, 47, -188, 11, 47, 129, 122, -130, -126, -114, -137, -54, -18, 184, -175, -40]
6811d0J06J30j05j85k15L12o8L08j75j10o1Q5J81R2k55J5o8L6j61J82n7J23j15
6834d5K35j04j83J71k58J69J15j66N1k56K50j55J44k7J69l0N5k63J24Q1q3q7J93
6857A00j20j48j01K73j4j95L38j10L3K9n9j05j09K78k92j06N69k94r0J96j33M3
6879a7L71n7m39L19r7j01K02j96j87K31j42J57j30J35j40J19k6J75m3l23K16L7
6901F4j90K62n0J5N0m80J42J77j27L17l1n7j09Q6m9j4k16K53K19k44j06M02l54
6924d0o7j4K37ol65K88J21l58K79r0l3j03O2J04J53p7j91j35M9L83m33K19J40
6947A23k53j3J94m5r5J70j27J91j16j15J3oJ34o1j45Q7k30M12r1K14j18j89M9
6970a7p6L5J92l09j0K7K26k9j39J5j19L89q9o0j33N8Q2N1r4j99M37k76M5J06q6
$$ y = [-40, 66, 196, 91, -94, -309, 3, -65, 243, 68, -42, -103, -18, 163, 255, 0, 15, -53, -17, -178, 4, -53, 70, -45, 190, 86, -97, 74, -184, -15, 100, -66, -15, -271, -21, -176, -32, -59, 110, 80, 135, -128, -4, 77, -6, -93, 100, -20, -168, -269, 4, -10, -205, 133, 23, 56, 85, 26, -79, -188, 90, -202, -308, 261, -33, -123, 73, -60, -17, 354, 297, -142, 177, 80, -21, 181, -15, -202, 29, -113, 44, -86, 49, -91, 28, 2, 177, 134, -189, 27, 64, -126, 136, 86, 101, 151, -329, -187, -10, -137, 180, 149, 92, -17, 69, 20, 6, -210, 43, 262, 18, -88, 314, -40, -107, -121, 116, 110, -255, 33, 154, -204, 75, -15, -48, -151, -89, 15, 168, 91, -100, -235, -186, 197, -236, -17, 123, -130, -143, 51, 6, -89, 81, -46, 145, 29, -86, -73, -79, 55, -6, -151, -64, -294, 118, 27, 241, 123, -66, -17, -93, -58, 134, -175, -185, -158, 68, 39, -100, -85, -204, 185, 96, 36, -97, -39, 43, 94, 0, -199, 238, -38, 7, 113, 27]
6995B7j5k4j09l0J15M3J7j29o5K60l66N48k19J44k69R4rj09O1K08j91k68J88O1
7019c7N1j14L76j47r4lk12J68J13j94L03m93J33J75r5L29k44K2j17Q9j87N55l46
7042C1Jq7L08j39r3q2k79K39J8k03K84P0m2k31M04k63J36k52L7J15J13k43K7J62
7066C1j53O4K1K70k33j46J06P0J28J06l20l1O2J5J03k56K34k8J63j67Q9l5k28
7089a35K3L08k48L35j58k68N5K76l07k6L8j44L62k91M13j71j14n0Q7Q2n7J5j85
7112a60K48Qj81K45j72K10j89pJ93k27m2M0Q0N6k70J88o2p1J89J85o5j21P6l11
7136a60L4L58j42n1q9o6K42k52P5K13J03j68o2j15q6K78o5n7O8MR4j62r6J86J65
7161B49l62J18k66J34Q0Q6J75q7j64K73k84k6j64L64j15j59J23R2j3m09J54M06
$$ y = [27, 12, -12, -121, -151, -36, 7, 24, -105, -170, 90, -276, 272, 53, 197, -72, 22, 13, -96, -35, 173, -18, -286, -98, -37, 14, -100, 276, 129, 35, 32, -180, -12, 101, -93, 210, -283, -150, 25, -70, 259, 15, 37, -80, 9, -178, 377, 31, 32, -55, 253, 114, 21, -61, -340, -101, -83, -286, -2, 68, 26, -205, 199, -64, 72, -180, -143, -28, 85, -158, -131, 31, -122, -58, -37, 233, 0, -146, -40, 30, 158, 264, -56, -87, -25, -10, 93, -163, 71, 43, 206, 39, 128, 93, -135, -112, 196, -52, 283, 125, -143, -88, 188, -119, -145, -107, -251, 111, -180, 233, 62, -52, -102, -15, 67, 10, 25, -160, 88, 96, -85, 160, -12, 198, 9, 2, 195, -32, -74, -34, 46, 102, -168, 20, -42, -113, 76, 261, 196, 75, 151, -160, -126, 232, 90, 39, -50, -116, 126, -126, -51, 162, 265, 97, 35, -80, -166, 112, 47, -10, 58, 62, 156, -6, -102, 84, 249, -113, 5, -261, -127, -47, 39, 214, 127, -37, 236, -48, -74, -238, 126, 11, -148, -25, 67, 54, -355, -201, 205]
7183B05k38J4K05j1m39OM11k21J51j94J65j11P3R3l3o7N2m62L16J33M2J17l05
7206i8J1r4K22QJ44j44j44n3K69n2k75K68k48p9K22j95N2J73j3O8N5k49R5K36
7230A79r8K5k46M89n12K38l43M47j64k74L57l89K58J18k3k13Q7j13K28k22L7K27
7252I3k2l8j8Q1O1j67j80J58P3o8j60J43M0r8OK7j59K32k15R4K27j27o7J10r0
7277f4N5j70j0M0K80j04J48k93K0Q0k20K36l3O7j58L6O1J91j43N9k93J80j68K60
7301E7k77J80l0K7L81o75K80J16J10k53K36J9m8q0j16m7Q3Q6r9Q8K0n1p4J12n6
7326a1J08l2j20J46kk87L10M7k58J63j67J44J25R8l08K57j30k15J62J40n7k16
7348a03j26L22j35N0K9o2M7J06l03K73j49J03j31O1J8j30K49k85Q9O3K5k6R3j12
$$ y = [205, -33, -19, 186, 175, -264, -258, 153, -68, 83, -111, 54, -57, 16, 109, 76, 9, 61, -401, -85, 48, 90, 207, -98, -87, -181, 41, 49, 193, 49, -95, -148, 121, 69, -206, 62, -186, -265, -43, -238, -186, -13, -26, 42, 97, -152, -57, 179, 81, 106, -140, 349, -163, 75, -268, 179, 15, -259, 98, -291, -33, 85, 62, -151, -64, -177, 51, -171, -134, 93, 71, 33, 15, 96, 157, -10, -190, -32, 41, -27, -187, -44, -4, -102, -96, -69, -228, 4, -211, -117, 110, -17, -84, 26, -64, -9, -179, -189, -149, 131, 27, 175, -118, -98, -18, -238, -2, -35, 32, -126, -90, -29, 162, 19, 78, -215, -35, -203, 57, -220, -40, -70, -43, 338, -337, -57, 59, 169, -84, 152, 171, 123, 43, -73, -120, -37, 49, -50, 38, 58, 7, -67, 45, -11, 97, 65, -55, 91, 89, -198, 112, 159, -99, 64, -103, 41, 166, 264, -44, 213, 83, -132, 30, 170, 113, -103, -229, 93, -42, 8, 37, -25, 22, 128, -175, 98, -51, 52, -79, -18, 0, -130, 119, -166, -77, -14, 11, -15, 78, -34]
7372c4J44k92K15j32j56K15P0k76J52J57K06l25O3J9J60j71Q0p4M1o2K22l28J44
7395C8J21k37l7J9J41k46K55k16Q8J72J98o3l54J60O0j9l77K31j6K55l42J72R3
7418I6j18j63pk1L11J1J1j28p7j6K69j38k43L20j64J54k84J77J0O1r9l4n9J79
7442D8k7L3j35J58k08J92j18o5K36ll35J97M2J19j61K21j62j2k8jj87L02j72Q6
7466B0J02L7k00K03j59J20l12J46P0j45K88l24K23p8j3m4Q4j08Q9J8J60k41J82
7489A18j94J51mk95K98k20Q4M7pP9n5j53L02j30o3j37k3J10M5K2K42l29L6P2O6
7514F2j09k68L73m6r3n4OK63nk77M9J19k04J61Q7j93m9J59j7J41n0Q1l47J55N1
7539eJ22k83M92l59j5j54L15nl55M50k74K92k00j05nK32k37oJ31m9j58K69J7m5
$$ y = [-34, 110, -182, 33, -99, -255, -40, 30, -246, -94, 63, 269, -56, 7, 26, 186, 15, 95, 21, 62, 0, 222, -106, 38, 159, -78, -115, -96, 45, -201, 54, -162, -74, 98, 296, 233, -121, 39, 99, 80, -297, -66, -82, 173, -169, 3, 96, -22, -185, -192, -213, 98, 109, 120, -8, -85, -101, 168, 30, -213, 107, -57, 97, -187, -10, 0, 61, -38, -72, -131, 48, 21, 54, -81, 77, -131, 61, -57, -122, 114, 111, -224, -27, 15, 134, -27, 194, 32, 20, -8, -9, -196, 106, -66, 20, 122, 159, -41, 162, 3, 123, -189, -43, 27, -118, 170, -154, 69, -9, -22, -66, 18, -90, -1, 17, 177, -64, 118, -76, 75, 71, -224, 74, -146, -62, -15, -22, 57, 2, -151, 151, 21, -42, -179, -202, -92, -47, -25, 217, -112, -76, -4, 62, -47, -315, 58, 12, -81, -135, -129, 134, 129, -148, -99, 20, -184, -23, 64, -129, -178, -19, -36, 105, 55, 136, -211, -56, -5, 117, -166, 326, -33, -48, -202, 113, 108, -247, 203, -71, 221, 21, -84, -89, 143, -94, -100, 31, -18, -176, 93, 110, 65]
7563F5k12r3K91O3J53k53J28M0j07k3k91L25j71K37k58j50M10j74J25j78J09r
7585B7j56n0L84j80n3J0j1pN4o2l8q3J00k1J46J45j80l5l1J02k9k12L00j36p0
7610h6J74N4L9L0j53l76N01p2m9l2J28k9k39O3K84j61J34k47J27o5j49J48j0j77
7634a63L9K98J09j64rk98QJ84O6O0l17K59m3J63ql74O9Q5J5J88l08R3P5q0J36
7659H3j13N5j32K75j64J11j38PKJ77j51J84q5k72L95k27q8J67P1k12J54k23J82
7682E8k01K07K08n21L23p4k4k8l6M9j84K22J00r8L9j50J35j89j7N3k03K85J63
7705A17j41M1p1P4J88j47k05J44L14j81P1k20J04o8J06J9m7k01J03j56K9K88m82
7728c21L46O4k38K19m22L64l35L51L33l74m1J77N3q1n5P5o8%k58J20K95k3k37
$$ y = [65, -147, -240, 51, 114, 267, 14, 142, 182, 75, 52, -239, 86, -85, 152, -106, -256, 154, -20, 105, -73, 36, 27, -129, -179, 205, 25, -28, -18, -29, -36, 18, -44, -82, -165, -65, -86, 60, 205, 25, -10, -41, 61, 32, -180, 120, -16, -86, 88, 142, 181, 211, 58, -318, 183, 111, 62, 30, 158, 129, -110, -47, 237, 76, 210, -37, 90, 25, -124, 24, 14, -163, -124, 174, 283, 119, 110, -188, -180, 4, 70, 130, -187, 72, 29, 192, 184, -190, -121, -36, -21, 167, -141, -48, 27, -53, 83, -30, 25, -107, 168, 4, 115, -23, -16, -14, 163, 12, 196, 111, -161, 234, 7, -81, 86, 157, -55, 99, -124, 58, -143, 64, 272, -249, 74, 0, -24, -52, -88, -39, -223, -1, 99, 1, 40, -110, 25, -164, -181, -128, -331, -46, 117, -24, 17, -54, 20, 208, 61, -144, 0, 314, 133, 204, -16, 88, 20, 126, 145, 98, -103, 0, -156, -127, 161, -321, 25, 89, -149, 70, -352, 12, -323, 28, 361, -13, -54, 123, 176, 95, 40, 115, 47, 47, -211, -91, 204, 181, -56]
7751e6J43K0n4j37N7Q7j26j50L83j98K50m91J25K21J43k83r0Q7K33K6k54j53J44
7774g3j7N9j54L45Jk31j87K90j90J56j62l2J64J14k83J90M0k6o4K4j0j04L16j69
7798cJ4j46J44N4m9j44J42N0J44j40j30K30j39J57j40QJ72m39K79q3N9k26J87
7821AR1N1j84k28L97j02J47k65J90Jk25M0L2P5R9j4r2j20q4O1K36r6k35L0L02
7846A08k54J98o8J44N1k26J24j24P3j87J62k10J3L04l37M40j61j54K17l37Q4J03
7868c7q5K83k11J78Qk39m8m3K38j00J59k28l65N78k48J11JK49ql60J4K23q5K00
7892A85r9j78J39q1p9O5J11Jk41J93O1N5k5k32K47J4K56k93j41o1J34N8j35K67
7916B21l42L23l0l93K20Q4J8j13j14P2n9J04j70L15p9k63M17j59l5L3n3Jl5n7
$$ y = [-56, 87, 107, 53, -84, -27, 60, -66, -216, 167, -31, 219, -272, -147, 74, 217, -66, -156, -69, 164, 190, -64, -217, -73, -90, -31, -185, 160, 161, -70, -257, 33, -157, -1, -163, -195, -31, 83, -200, -10, 30, 4, -60, -36, -46, -150, 166, -3, 11, -135, 9, 63, 14, -130, 12, 62, 206, 66, -64, 166, 27, 184, 44, 52, 224, -215, 64, -19, 40, -186, 1, 92, 143, -41, -269, 128, 26, 173, -92, 98, 99, -126, -86, -54, 21, 120, 106, 14, -106, -190, -129, 107, 11, -224, -194, 108, -146, 52, -16, 128, 179, -47, 77, -47, 26, -161, 1, -209, -196, 108, -229, 211, 50, -104, 113, -224, -140, -37, -122, 161, -50, 128, 136, -103, -151, -194, 44, -56, 103, -125, -490, 88, -160, -49, -48, 201, 193, -167, -153, 70, -15, 185, 86, -92, 47, -34, -113, -48, 63, 64, -177, 16, 77, 132, 107, -125, 122, 136, 392, 99, -42, -103, 31, 89, -46, 221, -121, 202, 172, -221, -1, 83, 101, -12, -126, -54, -113, -9, -179, 136, 57, -206, 211, 52, 17, 50, -3, -2, -37, -94]
7940i4K03j25N4J13l52Q0J28Q1j61q8K45l3k4j58j16K23L32l64K11l41J06J51
7962G1J27k19R1j52J64k18j74K64P4J36q5l32K58J12Q8j75j8J11k01K40k09K37
7984A90n8q0O3j45L2q9p4K44N0L5l22J81J78j25J51l35M7l5L0j1r7K20j30N5j35
8009a60J06l1P1l09N14j38j48OQ4m4J60P8P4m08mJ06J09K5j87O2j30J37J40M8
8033A61k23K9M5J53ol57K17L7j17K72q6q3q6K2j19Q8n2mj42j10M11m1k52L48o0
8058D5j7j33J20N4j05K36p9r8j38Q6J26q4j79K77p3m7K56l43L5k0K47pk79J97
8082G7m8j02J48M7p4k4j47K88l99L81P1j79K1k43M45m42K93O1j95J0m5R6r9J41
8106H2K6k12J98j43j27K06k12K03J82k07p7J9p1L41k22l80N51j74J85k48M4j10
$$ y = [-94, 109, -16, 38, 151, -201, -121, 7, 88, -73, -161, 84, 51, 27, -131, -247, -24, 308, -56, 155, -186, -80, 71, 198, -21, 70, -82, 82, -136, -310, -46, 28, 164, 79, -253, 5, 117, 205, 30, 12, 123, -78, 162, -47, 190, 132, 52, 115, -30, 2, -87, -161, 83, 133, 168, -154, 27, 205, 80, 231, -104, -57, -92, -62, -73, -170, 50, -80, -25, -160, -54, -85, -14, -323, 191, 53, -95, -89, -5, -49, 111, 189, 263, -145, -149, -43, 66, 91, -96, -34, -164, -27, 113, 161, -62, -33, 12, 165, 159, -198, 19, 56, -61, 211, 125, 42, -44, -22, -141, -53, -105, -109, -251, -361, 50, 9, -243, 105, 45, 28, -105, 15, 69, -36, 200, 121, 23, -115, -29, 97, 13, -166, 111, 38, -9, 247, -96, -61, -81, 166, 159, -120, 77, 29, -73, 75, 122, 48, 24, -123, 165, -234, 147, 218, 39, 60, -183, 262, -180, 113, 174, -21, -11, -56, 40, -59, 82, 108, -104, 94, -49, -176, 30, -182, 21, 203, -4, -81, -62, -133, 208, -14, -394, 157, -17, 168, -80, -36, -146]
8128a46J00k0J8l4m0J08j70k5K03j59L6j05KK17j05J16n6R0J34j81j52M9OJ86
8152G2r7K17j99L0k3r5K96k3j25j82K95p6o9K45l96o8J57J83k31j93M26Q5j50
8175G9k6k2K65k97j46K45j40O4N7J20j41j11J9j60J65j31
$$ y = [-146, -46, -66, -48, -82, -122, -14, -184, -209, -6, -165, -129, -234, -232, -15, -120, -4, -60, 30, 164, -17, -169, -120, -114, 72, -25, 192, -7, 23, 0, -95, 201, 178, 53, -129, 166, 90, 21, 266, -130, -198, -41, 142, -89, -282, 144, 229, 79, 53, 31, 296, -1, -147, 98, -42, 22, 79, 199, 58, -53, -34, -194, -29, -160]
8191a60
$$ Imaginary data points
##PAGE= N=2
##DATA TABLE= (X++(I..I)), XYDATA
0@%%%%%%%%%%%qJ6j6J6k4L2m0M8n6P2q8J04j20J44j68J92k24K64l04L44l93M49
33B40n12N77o50P32q20R18j027J143j271J413j565J731j913K112k331K571k832
50a484L119l437L787m175M609n099N655o288P018p875Q898j0137J1678j3660J6307
65H916k0045K5771l5726N7848j93465O3035K80540k41994K5831J26176r4220j00970
77i8303J10229R271k1736Q1965j8057j80486P5265J27041j33386k0042J81693
88A13454n8752j33777N2723N0570m9218K6620O0722n3940m7329O2534m3176n6571
100g6140J20568K8925j16957K3051M7008o6977j161P8114j0815m2528M4318q392
112A9014q7209O3954Q0989r5327r537Q9663o4374o1940O9838K0215l5932K1171
$$ y = [0, 0, 0, 0, 0, 0, 0, 0, 0, 0, 0, 0, -8, 8, -8, 8, -16, 16, -24, 24, -32, 40, -48, 56, -64, 80, -88, 104, -120, 144, -160, 184, -209, 240, -272, 305, -345, 387, -433, 485, -542, 601, -670, 743, -822, 909, -1004, 1108, -1223, 1348, -1484, 1635, -1802, 1985, -2190, 2419, -2680, 2975, -3313, 3705, -4170, 4728, -5409, 6269, -7391, 8916, -11129, 14642, -21084, 36764, -156701, -93666, 186874, -55120, -29289, 96887, 2667, -98303, 11926, 21197, -539, 81426, 63369, -117117, -41852, 85189, -48197, -68239, 113454, 54702, -79075, -26352, 24218, -25000, 1620, 62342, 8402, -38927, 23607, -19569, -76140, 44428, 73353, -43604, -20553, 26455, -40522, -41683, 36431, 25616, -16912, 27406, 19014, -68195, -4241, 76748, -18579, -28116, 61547, -2827, -64767, 5071, 25286, -10646, 10525]
124A0525J2203m9724Q457N4257m5946k3621Q2293k1253p8292M2061L4209m0488
136a5319m315L0301Q04k1259M599N417j8220K7934J9654m6537Q706L8809l4659
149d085j8732L0873Q334j5520r535Q636K510o758O771r413j499L1533j8413k9313
163b4611L0781R236k5725R45J3810M463j1326j0345O188O385N908n945j1390K0347
177H721P449k9780L520K4098k421j2000m837Q583M435j3758j684R576O515j532
191F885j7554L37J9288n825j0900P972P397k436j2864m117J3939M472p372n791
205f569L319J0810r404j2333J6534J0513q642p069j346R403K979j2086N26J1765
219H400J116j2914j0539J4707J1031j5810m521J1303K169n210q940L655J5832
$$ y = [10525, 22728, -26996, -18539, 35718, -10228, -33849, 48444, 27191, -51101, -9040, 25169, -15319, -19634, 10667, 11471, -9788, -5189, 228, -17992, 9942, 29596, -16941, -8235, 30574, -4085, -22817, 8056, 16390, 870, -8665, -29, 2481, -4277, 2494, -6919, -8418, 23115, 4702, -24611, 6170, 15406, -10319, -9374, 4436, 8899, -2427, -12772, -6584, -199, 5709, -236, -11626, 8721, 16170, -13610, -10090, 14008, 11587, -413, -5250, 3333, 7768, -5990, -7674, 1902, 8417, 6885, -10669, -10332, 8956, 3131, -7769, 203, 7600, 5164, -7700, -11817, 2122, 6594, -778, -6569, -3250, 7560, -1844, -14177, 2357, 12870, 4228, -2841, -4187, 5216, 8195, -3891, -3365, 8400, 9516, -3398, -13937, 770, 11801, -4009, -8530, 2773, 4942, -268, -9208, -5553, 10279]
232A0279m926j4281K191J1472J306j4604r08J8194j093j3964O30P087O606m122
246C867j0535P115J1040p938j2268N099J4668n275j6502P140J0937o684o266M15
260e187N890N586p450q477Q054J0185p461j2711J0303J2796j2619r093J0294N557
274E667l500n267r29Q078L541q507n253Q925Q464j1746r137J3080N271j1128l922
289f363M851N549j245r123J66R789K129j0398m491J3302M437j4657j921J2091
303D116J196o858l753L890Q112k786r700K206J0988M0j3589K27J5150k705j3016
318f482L160P700j59n835m631M679P822n228j0111M619J2172n007j3002P106J0739
333G542o134p601K999O455J786o603m699P425P658p851r614R344J0192r902q844
$$ y = [10279, 5353, -8928, -6737, 4735, 6041, -8563, -9471, 8723, 7630, -6334, -5704, 1383, 7989, 3867, -6668, 447, 11487, 3549, -8719, -3620, 11048, 5773, -10729, -3589, 7348, 664, -5602, -5187, 703, 6289, -1161, -9638, -1584, 8601, 1140, -11571, -1268, 11528, -1091, -10184, 110, 5667, 2167, -3100, -4029, 4049, 7590, -917, -6170, 2755, 11219, -527, -9664, 3416, 8687, -2441, -6363, -1512, 4037, 2792, -6331, -6165, 3624, 5753, -4645, -9136, 4166, 8603, -6054, -7975, 4116, 5312, -1546, -5299, -1409, 6703, 3917, -5783, -3577, 7411, 7451, -6138, -5911, 9239, 6534, -6482, -3322, 4378, 4219, -1616, -6247, -1568, 6254, 1026, -9085, -4466, 7706, 2699, -10303, -3197, 7542, 1408, -6193, -3194, 3261, 5047, -1556, -6255, 1170, 8828, 977, -8637, 707, 10899, 997, -7847]
348g847Q797O948n637p275J583P664P52r255l997J0747N188j2647n417J3615L909
363G128j1803k469Q394L861m517n736K616Q034l49j0460m9J3275r32j3709K822
378c894J0874k763p405J089L830K047k899n668J489R414k257j2303L708J2065
392G327o326r648O621O508l594l603l58K328N077j500q455M080J0632p297j1214
407i422R569R599q874n755O046K283k608j881j700L390O583o772j0135R363Q834
422H520j1682n170J2277J953j0396j427N833K026k3j992l930M468N646r475m308
437g680J4147L133j4142o27J0013k047n732K678K520j03P59n791m737J0934M509
452G834j3169l62J2558m653j1773N511R036k890l246k74j920L886K508p624R55
$$ y = [-7847, 950, 7898, 2261, -5014, -3431, 4233, 4985, -4270, -8267, 2480, 7668, -4979, -10396, 3219, 7128, -4675, -7144, 1250, 5111, 594, -5142, -2526, 5508, 5159, -5301, -5350, 7925, 6993, -6716, -3894, 6980, 4217, -3188, -2099, 1731, 3778, 879, -4789, -3300, 6114, 3857, -8446, -4738, 7327, 1001, -8647, -2026, 4482, 888, -2715, -3073, -745, 4332, 2832, -5623, -1543, 9089, 1792, -9422, 147, 9746, 872, -4883, 1163, 3446, 838, -1043, -2743, 647, 7230, 458, -9677, -314, 8520, -3162, -8332, 3945, 5898, -4498, -5925, -92, 1934, 1911, -81, -4011, 457, 6103, -3372, -7680, 6467, 9600, -4542, -5169, 4844, 2797, -2935, -257, 2263, 2160, 2919, -2872, -7609, 3325, 7834, -5335, -5697, 6861, 2208, -9565, -4054, 4982, 2092, -1154, -1428, -3348, 538, 3046, -4578, -3623]
467c623J2843l599j5101N215J2300n591o851O319L363m855k252j043Q89Q082p73
482E323j1625K923J0569p786j0063J0963R059j0094o167N862J122r14R53k453
496b328K162P424p394j0395J0075J0429j0022n994J0560K554j0370j751O424K301
510C675N89m079m494M954L904q258l143J1062M006j2220l690R163R63n966J095
525b439M579O43j793n391j187P556M368p721k490R298j109j1320K952J0103j271
540D778m243p14j020J262J208m032R34Q432j096j2694P9J0381j499o213M610M914
556E087m746n792L79M129M480O37n296k059N635j507p999N403J1927m744j0815
571e281K532N381l640q75N063N71j425k142p027J588J0784o45r090L893N629r512
$$ y = [-3623, 9220, 5621, -9480, -4265, 8035, 2444, -4407, 1912, 5275, 420, -1832, -2875, -1986, 6096, 5323, -6302, -3379, 7190, -596, -10659, 304, 9363, -731, -6898, -1036, 86, -828, 125, -2328, -166, 7258, -136, -10531, -456, 9973, -49, -6043, 4517, 7071, -3299, -5050, 1374, 3675, 4264, 185, -4309, 645, 4549, -3709, -6852, 4210, 8216, -4004, -7694, 1469, 2432, -3534, -2439, 2140, 2783, 990, -4401, -5588, 1968, 6336, -1385, -3875, 5423, 4314, -7006, -4054, 6049, 4778, 535, -179, -1199, 63, 1271, -2761, -1827, 6605, 5509, -7185, -7106, 3275, 1776, -4437, 173, 5087, 341, -5451, -5072, -943, 3537, 4174, -1122, -3181, 2454, 947, -7052, -1649, 10278, 5534, -5281, -2749, 2632, -1008, -1883, 3180, 3751, 2326, 184, -6843, -5255, 5529, 4884, -4206, -313, 5316, -4196]
587d196n624R819O107m155k635j167j476L044L34l065N839O503r447r198P790
602a527P894o305j564P352j649p279j033J832L462N116l867q230M520N109r317
617e486j767J3699J476j2907m40O053k445J63L738j389R72K323q274m194J2776
632D298M422j1561n8R708n925q122O263N506j839l79k644m548N018L609p740K63
648c729J1580m316j2886N062R040n019k703M671m18k031M01l498P68R500j299
663E123j1258M360R372q235n920R379M102p041j842J853o32K211L69n431K806
678g84P135p402q369R906N773r118j703O983p77m553J298N16Q41M360l367o363
694e624O405N540r114j977R632K21p672J67M477j037n66J65k130K586L203p148
$$ y = [-4196, -9820, -1, 6106, 1951, -684, -1851, -3327, -283, 51, -3014, 2825, 9328, -119, -9317, -1527, 6367, 62, -1502, 5850, 4201, -3078, -4111, -2279, 1183, 6299, 2432, -5798, -1278, 3831, -5486, -7253, 6446, 7922, -4985, -5425, 628, -1817, -1654, 2084, 695, 1667, 3990, -4284, -8478, 4298, 8720, -2841, -2899, 6809, 884, -7238, -975, 4531, 2692, 2313, -331, -4879, 139, 3748, -3992, -3729, 7851, 3535, -9351, -4289, 4751, -268, -2971, 1700, 1282, -749, -348, -3846, -3078, 6422, 5123, -6135, -1775, 7597, -638, -6558, 2821, 6923, -118, -1960, -107, -739, 1472, 1841, -3590, -784, 6351, -1051, -9420, 486, 6259, -2859, -4562, 2421, 1644, -2909, -1611, -1095, -254, 4106, 739, -5624, 781, 6321, -2793, -4770, 4862, 5083, -2589, -2422, 2055, 1018, 452, 617, -1513, 1073, 4276, -2872]
710b872k633Q813Q31q082R74N721j413m928J572K647N21P5k986j666O180O21p430
727d055J784P664k745o522K619M760k007k355J063N8J707m94n284J853O314k637
743A723o573L527M844l141m228K877L241j674k051j197J798L940k936m142M416
758D24M094m719l628M285L869l255l271K185K863q33l479j156N049J523n916j583
774c548N225J497m732k350M395K329m150k116K354L144p90m930J350N679j534
789A823n330J689M548l99m229n6M639Q7k992j817K161L464k802m026L230L585
805C575l507k850J685L262j018l738O75K797J94k124j937L119K770l768j952L451
821F34J601k012k342J622L121j490k222L1K632J248l717j398M276P31m120o05
$$ y = [-2872, -5505, 3308, 4139, -3943, -2969, 2752, 1339, -3589, -2017, 630, 1151, 1226, -1760, -3426, 2754, 3375, -4055, -2271, 5393, 2648, -3874, -1255, 3505, 1498, -857, 206, 264, 1971, 1477, -3807, -1954, 4360, 1723, -4850, -1323, 3521, 380, -3848, -971, 2270, 596, -1455, -2652, -854, 3086, 150, -3992, 424, 4518, -201, -3829, 456, 4325, 1070, -2201, -16, 2847, 2014, -1465, -2621, 2428, 3951, -1965, -3548, 1677, 3174, -1558, -3908, 487, 2816, -1334, -3450, -1096, 2048, 1258, -3672, -2322, 3357, 1823, -3507, -1818, 2730, 2331, -1898, -1954, 2685, 2772, -220, -2037, 124, 3588, 786, -3240, -10, 3575, 68, -2782, -1097, 2165, 1147, -2591, -1916, 881, 1075, -1049, -2986, 133, 2903, -865, -2817, 634, 2235, 223, -2119, -497, 2624, 1134, -1088, -1057, 1575, 2823, -894, -2292, 1984, 2715, -1405, -2010]
837b010K586J584k579k323K446J912j027l031O0M262l68m777J030M236l41l410
853a750m56L509J070k973j108K220K018j355l364J597M148k314l656J949K876
868B411r62l127l32L626L0l315p04K656K322l289k889L417K533l043j944J635
884i75L150q28l892J261L644m30l172p07L831J252m395p30M157L86k415k173J821
901b15K996k387l285K009L291q58m343K32N085j572l783J526K404L24k595j749
917b920L188K489k474k778J831L573k221m088L292L668k510k121L41J757J069
932B096k515j704L031K100l391l704L764L823m211k557L964Q61k329j717J016
947a473K807R75l351j527L354J934m200j368N909Q35n927L1L032L48p05j106N99
$$ y = [-2010, 576, 2160, -419, -2742, -296, 1616, 589, -2442, -2382, 1880, 1512, -3265, -2235, 2001, 1660, -1750, -2206, 1303, 2373, -600, -1708, 512, 2530, 1175, -2189, -592, 3556, 1242, -2414, -465, 2411, 1449, -1678, -2010, 1616, 1646, -1669, -2373, 283, 2605, -684, -3573, -156, 2377, -666, -2610, -975, 2175, 1347, -2545, -1284, 2360, 1930, -1242, -1949, 1882, 3134, -1261, -1991, 2166, 2552, 137, -2036, -215, 2781, 394, -2891, -882, 2409, 1551, -2792, -2560, 2525, 953, -2830, -1304, 1100, 1424, -1171, -2920, 268, 2757, 283, -2495, -664, 2909, 688, -3400, -108, 3560, 1050, -1071, -730, 1027, 2096, -419, -2123, 908, 3008, -383, -4087, -323, 3500, -711, -3268, 696, 1557, -772, -2489, -1473, 1334, 2309, -1042, -2569, 785, 2719, -1481, -2849, 3060, 3895, -2032, -2001, 1031, 1379, 674, -432, 167]
964A67J278l40l362n30N144J133n968l7M824k497l212K460K448l15j285j290p47
981b129K457J814l583l2N364k054o019K941M139j827j157R21k32n29J22j318P7
998a045M535m90o658J474N181l618k873M543J410k925j920P18M78K252R52l700
1014a686O93M480m119m332N687L873m546j947L024j93k287J166R47m19K772k096
1030A017n438L758M524n147j703N809o0o141O85L620r17J62J040k772K76L277
1046A990l611k568P210J693p195j20N074j668l472L273K065k042N80j346l283
1061c420M669K552n639K1N873k697o606L465N123l077j643K396j505j204K169
1076D77k028n08N743j046o713K217N272l621l066N786J762n322j74J260j473K730
$$ y = [167, 1445, 1105, -2257, -2787, 2357, 3490, -2478, -2515, 2309, -188, -3400, -940, 1508, 1193, -92, -1382, -2129, 328, 2142, -1441, -1473, 3891, 1837, -4182, -1241, 2898, 1071, -86, 835, 603, 74, 196, -1122, -1045, 3490, 3000, -3658, -2184, 2997, -621, -3494, 1049, 2459, -466, -2386, -1668, -1190, 1062, 2014, -1686, -993, 3487, -632, -4964, 723, 4596, 50, -1897, 1127, 934, -1353, -187, 760, 341, 3113, 1017, -4421, -663, 3861, -1286, -2989, 2820, 2760, -3381, -2696, 924, 7, 169, 1209, -1563, -1287, 1990, -1621, -4189, 3021, 4714, -2481, -2601, 2473, 805, -2667, 606, 2671, 629, 1209, -137, -3420, 1249, 3801, -1838, -1817, 4056, 1359, -5247, -1782, 3341, 264, -1379, 1017, -488, -1692, 477, -1551, -2059, 3684, 2638, -4075, -1858, 3414, -207, -3273, 2513, 4275, -1047, -1221, 39, -1434, 1296]
1092A296J484l939K99L937l972m349N989M123n353k080M082j955k401K599M24
1107A84k74K843k588m747L694M386m149j836O076n20o427J091L596r10P51N94
1123A764k572J74K039k726j367N413J526o352r68M482j649k315K991J368j736
1138G2m27j103j172K727L123l889j367M481j464n030K825M699k401j135O29r43
1154c75k91J551j281k21L432n30n739J240M846j849k801K630R81k201j558P46
1170a420J171J500q1l198O94L077j872l040L805L120l585k465K378J304j449o1
1186a22L98P74N48k048j990K779K621l061k356L482Q81l366p85K710R41j736q87
1203a217J52J125L94j651m41L147M59l316o00L407J08k563J56K117J21j444p77
$$ y = [1296, 2780, -1159, -860, 3077, -895, -5244, 745, 4868, -485, -2565, 1517, -438, -2839, -240, 184, -90, 2753, 165, -4582, -888, 3498, -651, -2487, 3589, 3069, -3358, -2267, 1329, 419, 1170, 1764, -808, -634, 1405, -1321, -2688, 2725, 4251, -2101, -3069, 1413, -236, -2551, 440, 1808, 72, -355, -1458, -2630, 97, 3220, -669, -2036, 2445, 981, -4049, -1224, 3475, 1074, -61, 568, -375, -666, 885, -396, -617, 2815, 2285, -3454, -2214, 2632, 783, -2018, 612, 1593, -608, -2166, -1420, -249, 1251, 1170, -2028, -1334, 1743, -129, -3169, 636, 3756, 171, -2294, 84, 1388, -61, -122, 276, 1050, 1598, -450, -2440, 339, 2960, -101, -2457, 1025, 1906, -1460, -2245, 465, 1406, -330, -1217, -1065, 60, 454, -1197, -1638, 1509, 1968, -1348, -1948, 1459, 1567, -996, -840, 1277, 1398, -46, -823]
1220h23M76J610mk227j93K526l93k623J48K763m04k230J78J539k6o78q77O36J580
1239I78l28k748J010K729o95k415J021K028n92k146N66J454M21j119r83R15J395
1256A491j188j943J178K338j646k514J646J933j291j623O33J211L64j313r08J706
1272G4J367j773j336J813J565j779j343J636J841j256j443L41J374J28j755n64
1288a110J959Q16k354r90K170Q36k154n35J496M92p58j053K98J653j59j846Q5
1305a154K121K57k433M33J887J35j677l43J304N59p39j229R67J180o65j612K89
1322g20J772m10j912P53J519k39j554l00J278N29j191r55J111J558j099j561J206
1339b15J741r71j697N14J739k57j623J2J622R89j983j136J649J545k038j385J416
$$ y = [-823, -347, 1263, 1259, -968, -1161, 1365, 972, -1651, -1503, 1260, 856, -1374, -1196, 343, 317, -361, -1238, -602, 978, 650, -2098, -1088, 1641, 946, -1469, -448, 1580, 988, -1158, -592, 862, 1283, 164, -819, 96, 1491, 303, -1640, -462, 1876, 230, -2284, -638, 1295, 4, -1619, -986, 225, 589, -724, -1632, 74, 1441, -332, -1668, 145, 1710, -69, -1412, 224, 2065, 809, -634, -293, 1081, 1209, -546, -1110, 849, 1665, -689, -1679, 491, 1327, -827, -1362, 134, 626, -132, -1185, -887, 766, 607, -1239, -1154, 967, 1224, -1209, -776, 1111, 1246, -431, -774, 530, 1089, 350, -879, 88, 1268, 603, -1009, -720, 1052, 642, -1270, -517, 1002, 763, -791, -1091, 187, 716, -475, -1430, -319, 1239, 140, -1421, -215, 1526, 555, -1142, -628, 1111, 854, -769, -757, 865, 1854, -129, -1265, 384, 1929, -109, -1494, -78]
1356g8J606j833r95O68J462l99j999N40J984k81j735k78K061L55k102m58K241
1373G59M42j492o46J061J343j204j318R48J629q37j695K92K239n37j922J48J531
1390G41rj349m63J483N26j417o00N47J525o69j814J110J649j124j129N82J375
1407I64k73j079r8J092K88p83o17O96J233j056j455Q01J515q09j411O26R90m78
1425A46r60p6R74M13o07j027P51J501j072j540J242J699j179j305P80J019l09
1442D50o78J90O71O28r74j520J568J472k098r53J838N85j889o73J687N89r50l36
1460c93m61R25J79j176n37K454M97k637n78K655L6j976J072J267q61o45m73J93
1478d59J387O82k073q18K571m10k874J517K500j248k082Q08L26k87L80k34r1J278
$$ y = [-78, 1528, -305, -1300, -632, 830, 431, -1568, -1028, 956, 675, -1060, -1338, 723, 1078, -1024, -1482, 759, 1201, -291, -937, 124, 1467, 263, -1055, -107, 1522, 685, -1010, -718, 1521, 984, -938, -790, 741, 732, -617, -1080, 403, 929, -488, -1088, -541, 984, 315, -1499, -389, 1260, 136, -993, -411, 964, 691, -388, -486, 606, 894, 111, -506, 190, 1423, 367, -1088, -287, 1228, 419, -992, -366, 624, 146, -814, -890, 84, 497, -110, -1137, -386, 1115, 43, -1497, -255, 1444, 265, -1040, -260, 759, 450, -228, -38, 633, 1261, 287, -1233, 335, 1807, -291, -1244, 594, 1179, -710, -1383, 304, 893, -57, -393, -854, 71, 250, -926, -1463, 991, 1488, -1149, -1727, 928, 964, -1012, 60, 1327, 466, -179, -652, -459, 928, 1610, -463, -1281, 1290, 880, -1994, -477, 2023, 775, -1307, -499, -173, -460, -80, -314, -405, 873]
1496H73n22k373Q63K686q20k265K095R74j983o43J485J23M26P5j569j00J717n33
1514E09j805J754J796k760j431K286r0n74N89K10q67L97l38j590J607K252j718
1531B27k031K196L01k065K87K339p2q99j22r30N04J496p28j344J835R28l175o98
1549a951L208J06k190O21R69j082n96K57o5J265J050k173j392K738J10k373Q82
1566f16K855j450k135J136O68o82R89j48r35J166K29k753P22K803q22k358J255
1583g6J233j612n74J191M08l13R9j468k94K032J69j922Q49K381k083j893J687
1600a86J079q21R0O85r38K81K59j434O96K437j235k237J688P77k224p5J978J34
1618I54j166m93l50L93J163k27j327J538R35k689r82K966N93j742M50P86o40o90
$$ y = [873, 351, -2022, -1159, 1527, 707, -1558, 537, 1511, -472, -1115, 370, 493, 919, 994, -575, -675, 1042, 509, -1296, 458, 2254, -506, -1937, 349, 259, -315, 274, 484, -383, 14, -324, -1914, -307, 1945, 227, -1804, 392, 693, -1372, -1085, 1254, 1182, 283, 161, -769, -265, 1231, 503, -841, 994, 1922, -1253, -1951, 1257, 1363, -827, -206, 763, -319, -915, -658, -723, 542, 1592, -581, -1973, 765, 875, -1498, -616, 2239, 789, -1346, -210, 458, -224, 765, 617, -318, 848, 1077, -1676, -954, 1849, 1027, -1331, -76, 1157, -455, -1029, 162, 570, 257, 356, -1112, -1406, 626, 795, -1127, -278, 2103, 20, -1873, -186, 893, 72, 162, 847, -91, 190, 449, -985, -289, 2148, 913, -1324, 364, 1141, -1083, -1158, 820, 954, -212, -705, -1055, -662, 501, 274, -1053, 485, 1420, -1269, -2251, 715, 1308, -434, 16, 802, 162, -528]
1636e28K82K2J090O36j613j345J954Q76k084j0K314n08k316L01J237k00j04m8
1654d4m74O13J70j873M35K649k60k250N54J277r98q27J511N12l17n08n76j88J212
1673F18R2j124N32J258j292j953J711J171j029m58O36l63m05K63m04P29R79p27
1691B34j522P88J334j268k56J416Or59j22n0M98O92l32o79M61Q48j219j086J754
1710E38P44j456n90O76L0j52l84K22P91Rj443k46J269R24j678j27J631k05j352
1729g99K42Q84L65o48j87P8O39j23o75l68J840n30j418K99J140j98j175L57O74
1748C97j65o79j96K27O83o2j139M13J166o22p54M41J018l62q33K56R41l38m24
1767c2k85O72N78o70r88Q01P81p87p02M13Q81m36j000O83M28k15n05k14P11L20
$$ y = [-528, -246, -224, 866, 1502, -111, -1456, 498, 1374, -710, -720, 1594, 1086, -1230, -929, 308, 108, 4, -44, -518, 95, 265, -1608, -1173, 1476, 1216, -1034, -480, 797, -201, -1028, 483, 995, 678, 170, -406, -594, 618, 710, -414, 118, 1376, 84, -1869, -158, 1013, -16, -474, 162, -201, -606, -343, -747, -18, 961, 234, -1288, -500, 834, -434, -690, 726, 732, -227, -349, -399, 99, 791, 459, -220, 241, 1089, -130, -1216, 538, 1282, -174, -764, -88, -58, -210, -594, -372, 419, 428, -1015, -1261, 8, 932, -746, -873, 758, 553, -799, -557, 327, 692, 44, -143, -65, 574, 451, -224, -592, 1248, 718, -700, -401, 739, 541, -634, -277, 397, 232, -447, -643, -416, 267, 205, -934, -521, 645, 23, -731, -290, 728, 366, -467, -211, 730, 392, -32, -317, 355, 933, 263, -725, 76, 857, 70, -632, -219, 662, 226, -774, -91, 337, 122, -383, -597, 114, 434]
1787D34j169k6Q41M38r25j05P43M91o79n76P21L13r0p38K7N07M00q52k65R74M06
1808H70j136m87J053J47p17m84N54M64l82m45J3J116l24p68k11J105K00r08k06
1827e46J189K8o52m40N94N82q13m37M56N04K5j321N04J213m42r88K4P60m6p62
1847e68j78P35K22m24m08K82Q98q58m91P68N16j59p41k3Q17R1n12k44M06M92l09
1868C12q58P61N72p51n14M91N13l57p70j00Q86m9m56l22Q73M94j244k46P16P26
1888F77j155k83J044L61o52n68O86O38k66p36l73J402J47j479Q7J098J00j110
1906c82p6O16J29l34m92M39M73l84j038O07J054n13j044P63N29k55o16L08M91
1925B75J36l39j93m2R81l60p26M13R77j151n94Q68K38l38j86n3p1K08j39n12P85
$$ y = [434, -735, -761, 80, 518, -407, -512, 231, 722, 43, -533, 188, 501, 411, -327, -300, 207, 607, -245, -510, 464, 870, -266, -753, 300, 447, -270, -754, -200, 264, -118, -563, -550, 566, 242, -526, -737, 368, 568, -340, -546, 643, 671, 19, -421, 173, 755, -58, -495, -39, 465, 490, -831, -327, 886, 444, -544, -520, 240, 194, -568, -746, -11, 211, -213, -621, -339, 559, -299, -790, -22, 494, 335, -406, -429, 388, 479, -33, -277, 129, 621, 312, -546, 215, 787, 36, -478, 13, 526, 169, -601, -701, 185, 136, -320, -642, 231, 725, -519, -765, -49, 677, -478, -761, 283, 644, -8, -576, 110, 748, 482, -254, -627, 775, 922, -557, -470, 628, 728, -382, -458, 158, 287, -47, -539, -100, 373, -11, -1049, -442, 612, 99, -945, -182, 347, 92, -524, -216, 275, 411, 72, -121, -163, 818, 458, -268, 145, 1122, -29, -623, 245, 483, 145, -41, -94, -165, 43, -96, -608, 177]
1946A77J97n64n37N65O89r17j43J005p2o54k99M03L98M9k91m62P54M37j017l88
1966f70J065J18n34l27M58j37j50j3K95J27J78n67q31J406o4q19j87J332m14j086
1986h20K10R32j18j62n4J29M39J10j145L66J071l36j147J01J051m47o52L78M52
2005C58l53j56n12K06J039m78q91P77R74j039j091J298N49q33j28L39j11j88M66
2024B26j53M3Q84q36r68O93J025j020l16J101k6r76j82M45K7N40Q3r65r1Q43q03
2045d26o87J273Q75j379j44M31m9r8N34j29j21L70p38l99Q79R06j062n26J349
2064H59m68j295N29J068k69o55K88m32L5P92p70k4J083r9j913K60J673n13n69
2083d20P06L62r17L5J61j26P36K89j304J85J154p73j104J283J116j497m25Q06
$$ y = [177, 374, -190, -727, -162, 527, -390, -533, 472, 400, -254, -553, -150, 248, 297, 6, -456, 298, 735, -282, -670, 395, 513, -21, -348, 110, -27, -177, -190, 105, 232, 410, -157, -988, 418, 354, -465, -652, 680, 266, -820, -610, 322, 204, 42, -12, 117, 556, 666, -479, -113, 958, 622, -525, -424, 627, 180, -472, -94, 358, 5, -151, -663, -457, 582, 104, -787, -10, 964, -75, -1166, 132, 681, -152, -280, 59, -52, -240, 226, 73, 116, 1000, 164, -804, -111, 914, -106, -422, 679, 653, -323, -505, -60, -33, 507, 590, -375, -466, 377, -426, -1113, 160, 1035, -344, -488, -57, -106, -204, 330, 201, 80, 450, -288, -687, 192, 1098, 36, -490, 859, 391, -904, -375, 693, 424, -231, 57, -375, -340, 452, -318, -342, 741, 642, -1271, -1011, 662, 149, -420, 286, 648, -269, -234, -73, -199, 537, 826, -478, -293, 861, 88, -1016, 267, 1383, -114, -539, 267]
2101B67k08k62N20r7o36P63k12j212N36J279p51p93J280O4j146K95P39k49n2N66
2121F91j006k41J248l36j064J119P88j511k95P43K95o22L43J24l66L53l91r35
2139a063R71R06r29q54J301Oj087L26J106n43j91M60o51K6N87l79m41J288J59
2158I98j438j27R08J85j072O97O52r23r0J19m27Q73K03j239k13J392l18r10L98
2177c32J300r17o28M40J76K3L09l14j74O50m01r74O48J070m00j017P69M09p80
2196a43l40N09J10N7j52p58L8R86n09j28O18K18j084j11P35j15k38L69K36j31
2216A67J10m06j39O46L24o13l71N26J27q04O27J05j00m02J30k5p3K35l23j88O83
2237B36J42p77j05Q12j45n69K73J78J78n10L24k01O95j40m68j39O21K41p92j0
$$ y = [267, 59, -203, 317, 220, -416, 347, 135, -1077, -541, 738, -13, -806, 474, 538, -608, -313, 426, 177, 125, 691, -315, -556, 692, 356, -708, 411, 1199, -312, -607, 136, 431, -191, 152, 276, -90, 263, -128, -1063, -92, 814, -115, -969, 332, 338, -749, -423, 683, 140, -51, 409, -242, -216, 371, -8, -449, 839, 998, -440, -567, 341, 526, -546, 151, 803, -120, -210, -91, -518, 355, 558, -681, -894, 498, 180, -730, -332, 968, 51, -577, -137, 39, 62, 371, 57, -117, 533, 132, -842, -194, 876, 476, -541, 228, 637, -143, -483, 26, 136, 193, 41, -717, -679, 307, -202, -330, 288, 506, -578, -689, 46, -69, -307, 62, 298, 167, 277, -129, -268, 378, 702, 89, -282, 244, 371, -433, 194, 299, 199, -203, -73, -98, -171, 64, -259, -447, 236, 378, -399, -504, 308, 163, -406, -133, 45, 223, -287, 37, -164, 531, 391, -77, -216, 405, 646, -146, -156]
2257a56N07j83m65J3O43j16l74j82J63L58J26r67M03O48n25l27M14K36k82l43
2277d09L04K74l9k39J3K62K03m77k62M80K44m03j90L14K82j41m65J16L65m4n32
2298c44P3M94J08m01k9J52j9j15l47N92L42n33j41L08N1q5k09o7M77J1m15j04
2320b01O70o3o49j42K95K46j18m37N00L39n82k63R9L19K2l68q8O44m7m72j17N39
2342A26K38k73m00N14K29o51OM24Q8lm49P1M34L8m33N1K90j26k17k11L75J4m13
2365b78J54J0j4K3k32J71L26m38j04L97J07o9k16L0M73j7j27l21J80L67k42l54
2387a74K91K94k39l56O9M37m29r1o1J89K25k39j43L03J01m54k18L53R1j32j65
2408c48L50K24j70P4n2L3K44o25KN31Mm25m5M71Nk85J1K1L53j08n17J12K02o0
$$ y = [-156, 351, 168, -297, -284, 359, 243, -131, -313, -150, 208, 334, -633, -230, 418, -107, -434, -20, 216, -66, -409, -105, 169, 130, -109, -96, 166, 369, -108, -370, 110, 354, -49, -239, 75, 357, 216, -249, -133, 232, 188, -344, -271, 223, 331, -70, -99, 53, 34, -81, -428, 164, 506, -27, -168, 140, 191, 106, -103, -170, 307, 318, -97, -201, 469, 406, -243, -385, -90, 156, 38, -399, 101, 440, -142, -405, -306, 13, 35, -333, -421, 223, 176, -296, -413, 126, 364, 91, -309, 205, 434, -217, -211, 213, 301, 298, -151, -80, 354, 392, -41, 10, 300, 174, -43, -254, 121, 135, -278, -124, -114, -128, -105, -337, -166, 160, -278, -382, 15, 122, 53, -163, -133, 340, 323, 196, -125, 55, 422, 180, -174, 117, 411, 172, -184, -115, 322, -107, -198, -259, -70, 155, -84, -227, 76, 177, -277, -495, -142, -51, -183, -348, 2, 226, 56, 130, 78, 111, 355, -270, -268, 263, 267, -158, -203, 268, 273, -12, -1, 20, 373, 265, -252, -140, 62, 2]
2432Bo01J70O31rk70k62M93q1k29j1R4J60Km58L15N24j83o32M67K32m47j91M79
2455A95l05L24m04N1M20K6l69o14O75L45n22k36L01M41o78J34L26j80J05j9j14
2476i8P0M63l95l04N05R3n84oR09k87p07J99J8J75J2n4l13O35j87n96Q3N14j11
2499C4n20L77L01m90J4M3J64L43K2n87K92M31k88k68L2P07p80n3J32L80k30J61
2521B17o5l32K95j74n03L49N90m47m06K68K36n56J62N89l28K30K2m38K54J06J70
2542B39o08P83M1n76k4K21M54k42P6p6o13L30k3k72L39M13n10m02M84J29o51L24
2564a64N18k72k04m6J90k17L83L6n79P24M6p37PR76j14q36L37pj42K64j68J33
2586A28j80N38p17j92O50j6m66jP70p81k71K82M39m02K15o6q1P4M81p30J76O74
$$ y = [2, -599, -429, 202, 193, -77, -339, 154, 73, -156, -167, -73, 87, 89, -369, -54, 470, 287, -345, 122, 354, -93, -284, 195, -110, 214, -190, -139, 281, 307, -62, -676, -1, 344, -178, -414, -113, 328, -350, -216, 110, -70, 35, 16, -98, -28, 435, 40, -264, 241, 334, -250, -256, 653, 366, -341, -142, -124, 51, 63, 9, -304, 331, 144, -452, -369, 145, 34, -486, -109, 192, -298, -284, -241, -77, 266, 288, -299, -7, 424, 136, -132, -100, 607, -173, -226, -94, 286, 56, 217, 152, -180, 115, -59, -562, -213, 377, -70, -476, -208, 28, -528, -366, 223, -105, 125, 147, -291, -37, 69, 239, -369, 414, 455, -121, -145, 76, 530, 288, 364, 288, -325, 5, -18, -290, 49, 462, -48, -450, 34, 163, -488, -164, 354, 82, -122, -168, 22, -195, 188, 224, -355, 369, 415, -322, -315, 661, 547, -289, 48, 41, -101, 163, -5, 128, -52, 486, -231, -423, 227, 211, -255, -256, 514, -267, -538, -256, 183, -219, -4, -70, -151, -77, 404, -326, -150, 524]
2608E24k00q35O95N9o26K53K12K03k74j96J0j04N50j68l46K58J34m34j70P50l04
2629iK0J7q7j96J29J45l16M19K41k53n83O13M09m94k1N06l17l11l3Q5N7K11p5
2652A57m49K75J9k03j55N86L62q59p4K17P3j10J29J16j72M56n60J50J41K50l03
2673D6p8M67j04o94M30K30p2j36L0j0L5l62J91o6J73Q2o05N9O07k17l06L08J10
2696A18k46Q0k71K08L26j68k70J86K10k16j13L89K0k91r4K00J61k47O9J5J23j9
2718A70k18j50L50O2r9k74L83J2n09J50J90L36l21J20n31K25J80J51j38K2L65
2739D76n31n6KM03o47N09p5n3rj83j96M27K79n91j0L84J88n24n7L06J06j25M8
2762G1j17K33j7j34k4L70J07p16J59J16lj25j25K77K1k26J27R7K33j81l51J53
$$ y = [524, 324, -511, 184, 243, -383, -130, 82, 285, 11, -185, -175, -279, 271, 103, -243, 15, 149, -285, -455, 295, -9, 11, 28, -59, -255, -126, 19, -297, 122, 363, 110, -473, 140, 549, 55, 34, 540, 223, -88, -121, -36, 21, 232, 157, -292, -17, 2, -201, -356, 230, 592, -267, -341, -124, -51, -161, -32, 84, -88, 368, -192, -42, 99, 349, 46, -32, 435, 331, -363, 67, 297, 225, 89, 119, 109, 144, -218, -27, -93, 80, 162, -443, -384, 223, 6, -300, 8, 118, -128, -48, -319, -111, 215, 47, -223, -37, 173, -43, -156, 233, 253, -38, -132, 68, 229, -18, 51, 66, 189, 170, -48, -198, 152, 214, 115, -159, 224, 236, -273, -123, 67, 403, 82, 202, -329, -104, 76, 227, 89, 111, 476, -55, -111, -109, 294, -353, 156, 81, 28, 19, -164, -360, 67, 346, -245, -255, 129, 317, -207, -264, 42, 148, 23, 71, -46, 187, 170, 36, 12, 382, 489, -227, -68, 48, 45, -80, -205, 72, 93, -133, -6, 91, 324, 143, -208, -55]
2784e5R9j71j66O41l32j88q2J46J52k54j17K92m9L34m21r2K64j6k8P8L52j39k57
2807il3J37J50j89l36L26J34J16j98l15L66j48o1OJ18j34j60O1L43k59j36Pm1
2830b55K03J15k07J57N4J91l37L1K66O1l25q0J21M26l68m59J32N04k01k92J68
2851i5K61k26k44K8L78j06N3j53P3L11k93j99J00K81j88l09K59J75j04r0J61K91
2873C64J1m42k24M38O3j29k63K36k9j34o5Q5J76j78J44Q2r0J04l33J3J77J84j76
2896A4Q7Oq2Q4j81K26Mk20l5J51O7k0k27j24M58P4m39K5M70j73j27l31q3M70j1
2921H3k68J49q4K30m70L84M8J18k76mJ01j0l19L96j38K2J82m14J27K55M7l26j11
2944b78N39l31k88L12k37K86k35K27J78k44l5r7L16r4j90J98r0K90j70k11J52
$$ y = [-55, 44, -127, -293, 348, 16, -172, -254, -108, 44, -210, -327, -35, -84, 250, -171, -263, 1, -15, -43, 35, 387, 248, -9, -42, 95, 245, 56, -280, 46, 180, 296, 98, -217, 149, 1, -60, -54, 64, -70, -230, -169, 174, -85, -221, -214, -255, -52, 63, -144, 13, 67, 258, -79, -48, 218, 279, -46, -126, -5, 421, 53, -406, -274, 230, 29, -263, -95, 166, -60, -304, -276, 102, -4, 49, -104, -31, 280, -13, -212, -112, 169, -19, -328, -69, 106, 2, -88, 73, 364, 375, -67, -291, 147, 210, 81, -182, 54, 25, -109, -174, -89, 87, -91, 53, 135, 45, 149, -184, -171, 6, 190, 14, 101, 107, 25, 109, -72, 154, 158, -62, -97, 54, 121, 101, -126, -250, 208, 282, -157, -132, 338, 165, 38, -293, -376, 94, 83, -185, -36, -120, 110, -360, 24, 72, 190, -86, -90, 11, 1, -318, 78, -60, -38, 144, -270, -143, 112, 159, -167, -278, 261, -70, -358, -46, -283, 3, -232, -5, 173, -71, -106, -203, 113, 19, -171, 27, -63, 227, 57, -154, -2]
2965bM37n15j48J80K22J38j17k13K64k9j98j76L05k7j24q1L14n95J34J75j48K71
2987F7L9k63j45j2K65l70K07L18P5l12M1J11r8LK11N4j78O1j96q9M93j83l67L96
3011A28Oj95j80K87Nn2L7m5j59O3l5J90k33M67j80l27qM36j13k55K97k24J21J
3035C2j79R3L05j59l35J38K87o8m97L47L12n16m3L98L1j35j30nJ60P5j06k17K84
3058G2K36j50l83O04m42j09J14M79l31j44L94o40K44L07l76J72J20l47j70K25
3078a25L33l28j51O08k28m10L49k21l8K91K11l69j64K27K92l51p9O59p05K81q
3099G4j70J98j01Nn9J78L05o52Q6M10r1m11K43K36n25P4J32J90R1m5m26mN15p3
3123A80m54K46M04l24j46L19j96k05M68kk27j35j32j46L78K54k60n2k9kj54K9
$$ y = [-2, 435, -80, -228, -48, 174, 312, 195, -18, 246, 217, 19, -157, 148, 121, -3, -84, 230, -365, -231, -56, -204, 67, 106, -157, -302, -314, -49, -419, -212, 106, 181, -131, -90, 21, -77, -74, 137, 191, 13, 74, -122, -211, 282, 99, -268, 128, 134, -61, -241, 46, 51, -1, 36, -9, -168, -105, -140, 50, -183, 284, 104, -223, -231, 205, 92, -163, 134, -90, 31, 32, -147, -54, 251, 92, -243, -105, 182, 114, -383, -36, 276, -240, -283, 115, 146, 11, -119, -124, 36, 111, 5, -212, 72, 308, 158, -225, 379, -63, -172, -58, 421, 90, -54, 340, -300, -56, 251, -125, 47, 167, -180, -350, -125, 208, -120, -271, 337, 109, -301, 48, -173, -211, 80, 291, -78, -242, -15, 277, -74, -153, 506, -199, 82, 74, -96, 102, 1, 6, -53, 125, 430, -222, -136, 274, 183, -228, 15, 251, -274, -200, -68, 122, 213, 168, -258, -262, 253, 180, -274, -28, 376, 52, -94, 225, 29, -176, 292, 290, 63, -72, -204, -350, 28, 282, 22, -30, -59, -61, -215, -186]
3145a86J88NK79k37Q6j35RK23m43L29qj78j0K28k66O9L42r9j86pM1j78J33J32
3169A31Q9m76K93K07k69r1L8j2J44j26j39J99J83k92n6L09j79j93N6M28J25m68
3191i9j3j1K35o4J28J0j66L63p20L85L7K9k19J52K25m88J21J40M9k5K2j68k76
3214c53K27k44K01n0M65j22l14K92J8j28J01P9j44p8KN7j48L74k83j99N36j1k66
3237A2l4k10N26l93N8l0r9K11n6J85j71K33r1q0k2J14k93p4K59j27J25j2l31L38
3261C8j4N7k85L47j94rj70L19J26l69k4J55L3n8j51K55K35j41o4k13Q5K14l02
3284a30j65N22l61K73j72K85j68j09J88Nj0j24m2o1L36k92l30L56K00j44k84J65
3306f2J63l86K77k67K46p5j63o2L38K9j41J93N7K5j93k1j28K71q3N1n9l2M0K3
$$ y = [-186, 2, 7, 286, 49, 135, 0, 9, 232, -211, 118, 110, -68, -78, 150, -116, -47, 295, 196, 10, 3, 44, -134, -1, 131, 220, -256, 37, 244, -25, -116, -78, -90, 54, -72, -211, -12, 171, -121, -177, 132, -47, -240, -184, 244, 369, -99, -112, -123, 112, 48, 176, 186, 20, 383, -337, 48, 85, 114, -105, 47, 272, -216, -95, 45, 94, 69, 91, -77, -353, -126, -370, -169, -219, 246, 124, -190, 102, 120, -8, 93, 172, 28, -50, -48, 9, -139, 235, -48, -247, 289, 278, 12, -22, -232, 294, -99, -41, -71, -170, 41, -15, 170, -1, 232, 141, 61, 39, 153, -140, -214, 45, -82, 43, 31, -300, 38, 24, 81, -204, 143, -51, -60, -230, 89, 215, -154, -178, -23, 10, -48, -199, 56, 291, 150, 86, -127, -42, 172, -130, -295, 227, -134, 139, -33, 252, 84, -25, 163, 168, 158, 34, -8, -69, 267, -25, -355, 1, 201, 57, -227, -62, 101, -285, -8, -275, -29, -104, -267, -329, 9, 38, -103, 90, 147, 172, -21, -42, -170, 101, 18, 69, 10, -22, 18, 41]
3330D1j61K63L7m50P2J67O6j17q0K16N5k97K71j36R7mJ8q0J01LJj70J11j0L7j68
3356a17J98K09q5l13K10r4J20l28L03j22j72J69J00p9N6j40j51M8L03r7J93k19
3378hk88K86n5N1kj6j30J42M64l68j36J24j27J91k50J17J88o2l08J77p0K76l10
3401a14l5L42l53P2o8K26J83k43l96J67J93j14k2R1J37j55J19j5P1p2j01j80M1
3424b26J4K39o3O9O8j25m4j53K59p3K2j25j77M69K8l12RK48j36l27M40k28L93
3447B69k64J7M9J25m8j51j51M01j90K9k86J78K15l60K49j63p1O6O1J17J27m40
3469b21O7M42n28M90j55k3N1j86j42J62R5J56j91k5J72K42m06l4K7O9Rj68J71
3492G4l28L37k56K89q7J18l02J37k28J60L21p8n6kk27qJ32r9j75N62p8l14J19
$$ y = [41, -120, 143, 180, -270, -198, -31, 35, -82, -162, 54, 109, -188, 83, -53, 44, 40, 58, -22, 79, 82, 83, -87, 24, 14, 51, -117, 81, 290, 205, -108, 102, 8, 128, -200, 103, -19, -191, -22, 78, -1, 55, -85, -236, -188, 115, 18, 211, -8, -296, -10, -65, -14, -16, -32, -162, -20, 444, 76, -60, 64, -63, 128, -122, -5, 183, 121, -187, -10, -80, 196, -114, -149, 193, -160, -88, -156, 70, 253, 10, -386, -219, -26, -140, -162, -71, 66, -89, 30, 15, 86, 14, -87, -267, -226, -212, 27, -36, 33, 101, -24, -68, -221, 38, -35, -13, -138, -315, 154, 182, -130, -121, 127, -9, -336, 104, -124, 269, 5, 22, 71, 196, 148, -3, -154, 247, 57, 86, -200, -22, 193, -167, 82, -81, -152, -86, -25, 92, 219, -221, -154, 288, -240, 250, 95, 72, 123, -63, -205, -43, 52, 208, 17, -8, 164, 406, 0, -34, -7, 62, 71, -97, 74, -254, 83, -173, 116, 29, 147, -155, -18, -246, -86, 235, 157, 101, 99, -128, -136, -4, -103, -278, 284, 206, -108, 11]
3515A1k14K31n6O3N8p3j25K83j90k78L91L3j69l7J47j08j5j08K91j89R5J50m43
3538b52M26j62r7J79o4j55J38l8J87j19k2qQNL77m19N8K93n88L51l77J58J43p1
3562d9R2k54l3J15k2l2K63j63o1p5K19j53J46L9Jn0m4l8R0K29j89k5J26k80m7
3587a95n0P2L24j87j63M30l56J56R5om7pok14K56o3j72Q9M05n47rJ8R3L0K26l5
3613A37l1m1L2q8M2K88j69k07K1l7R2j25J98q9p4J91nk38Q5Mj75J60p2Q6j20r5
3639b30J75j63J70m3J69k71J77O9j1K30l4l78K48j25J26k27J63QK41l36k48L57
3661F7kk17J11K5L46m09k3J56M3j8q2P5j67%j80N14k19P9k8k85M18m11J7M17l50
3686a23J43k05M8K76k96j12J97j05j7L64K1k74K35j22n5r4K21k03K04k15K02k1
$$ y = [11, -203, 28, -28, 35, 93, 20, -105, 178, -12, -290, 101, 134, -35, -72, 75, -33, -48, -156, 135, -54, 41, 191, -252, 174, 12, -85, 94, 30, -125, 13, -25, 162, 43, 21, 13, 21, 26, 403, -16, 42, 335, -253, 98, -279, -121, 22, -49, 43, -211, -244, -129, -151, -183, 80, -83, -144, -219, 0, -153, -7, 32, 33, -17, -61, -99, -9, 220, 31, 6, 132, -148, -195, -245, -173, 151, -36, -199, 231, -125, 31, 126, 120, 73, 66, 60, -154, 102, 39, -133, -44, 361, -186, -195, -177, -84, -54, 172, 137, 106, 65, 97, 9, 51, 339, 170, -37, -16, -53, 39, -86, 112, 23, -51, 140, 135, -103, -18, -14, -189, -29, -101, -15, -135, -230, -55, -218, -48, -91, 78, -193, -16, 53, 42, 272, 238, -140, 108, -17, 109, -118, 45, 53, 294, -42, -290, 67, 65, -152, -41, -16, 330, -79, -102, 54, 97, 79, -3, 72, -95, -95, -275, 239, 20, 99, 71, -214, 204, -207, -190, 227, -123, 20, -185, -137, 139, -157, -269, -72, -177, -194, 170, 191, -83, 152, 30, -25, -119, 102, -101, 103, -112, 90, 69]
3708F9l38K88Q7l0l03L40j08Q4k24k3J24K53m29nM06m60K00p1J69p0j34J01k13
3731b87M40j85n5M8O9L21l64r0K12j00K92K6m54K06K0O2p7J43rj05j51R9p3J14
3755A02K8n5L0l6K8J8l9N5m23K8K66q6j03L96mk03l3j54J24L9k3l7J93l25L57
3780A43m09J78K08J88k00r9N8j45k3L3j00K32pk09J53J16K13l21j6J85l1k05j58
3803b16K82Q1n6J02j08J83m60p5L19NQ1r1kj3P5j02J87k09r5K27j76J48R8l84
3827a99j18N26j92O4P1j22J22Lj46K04j3rm55L34K9q0J5Q9p4j09J41o7O0j34m8
3852a08M16k21K3j20k79J89M0R6l8j12J64j02m1j99N01j64l8K02J3j92j43R0m2
3875f5J41j85P8M2K74l79R7l7N8P6r2J96k35l0Pj92M20l09J07O7Q1k32j30K69
$$ y = [69, -269, 19, 106, 76, -227, 113, 5, 89, -135, -158, -34, 219, -210, -215, 191, -269, -69, -140, 29, -41, -175, -74, -287, 153, -32, -87, -39, 30, 351, -13, -103, 109, 9, 301, 327, -127, 79, 99, 161, 84, 227, 218, 113, -38, 61, -12, 102, 130, 75, 105, 69, 97, 115, 76, 131, -292, -264, 2, -84, -187, 209, 205, 2, -31, -185, -61, -22, -45, -82, 111, -214, 143, -266, -88, 120, 308, 108, 9, 67, -78, -101, -68, -168, 64, 57, -152, 1, 117, 330, 9, -7, 178, 147, -58, -216, 66, 147, 91, 193, 85, 268, -192, -267, 52, 57, 138, 47, 45, 32, 107, 5, 192, -17, -112, 115, -61, 87, 185, -199, -317, 209, 17, 81, 152, 30, 152, 155, 9, 213, 200, 191, -264, 70, 99, 19, 34, 123, 49, -60, 81, 14, 74, -60, -108, 308, 87, 110, -10, -289, -100, -60, 36, -2, -114, 50, -52, -93, -292, 209, 45, 7, 209, 222, 30, -113, -23, -65, 76, -109, -31, 11, 285, -94, 3, -34, 24, 100, 8, 204, -31, -61, -54, -246, 174, -135, -28, 39, 120, -112, -242, 27]
3899B7K45l72p9J54j48P2P6q5K86k19j9k07K29L30l35K9N9j15J42k43k3J85J53
3922A42j41R1l23K38J62j94j81J95J05j56j1K19k7r8l1o3K09o6oj58K37l80L84
3945A47k59J00j4o2JK39j15j1l1j43L01M7r6p7k8J78k72P4J18j57j57K84r2M5
3969B0k07J67j14j1K42j21o5J6J38k41K0J36Oo9k6J14j09Q2j47r7K14j7o1N0L
3994g7N8L3o9L2r8J52J50k15J27k77K82K2j27k6l2K12j27j20RK72r9o4nM7p6K10
4020A94m94J65K58J31k85l9K74m48M61k44K13k55j44k3K34R2j44r6O1L42l42M9
4042d0L12j82j98J01m5q4K18l59J42M0J98j51lJ20K29n38J92J14M6j62j6J43k26
4065a49j40L86r4n7m3J41l04L29k10K81j72K29kk86L34j86k03K14J47J13j31j79
$$ y = [27, 272, -100, -179, -25, -173, -101, -25, -110, 176, -43, -62, -269, -40, 290, -45, -16, 43, -72, 70, -173, -196, -11, 142, 1, 92, -231, 7, 169, -25, -206, -11, 94, -62, -73, 146, 119, 21, -10, -73, 136, 70, 64, -94, 143, -237, 147, -112, -12, -26, -88, -87, 152, 37, 26, -5, -148, 153, 200, 104, 27, -1, 177, -95, -21, 97, -60, -217, 67, -25, 20, -187, -20, -134, -145, 97, -24, -89, -73, 65, -176, -156, -20, -14, -83, -109, 5, -104, -22, -169, -266, -52, -69, -130, -80, -77, -19, 14, -55, -23, -121, 31, 181, -34, 93, -184, 98, 120, -7, -33, -65, 147, 20, -100, -91, 181, 82, 18, 13, 60, -16, 194, -300, -135, 123, 254, -31, -70, 204, -244, 217, -27, 186, -69, -213, -236, -2, 90, -54, -150, -89, 253, -89, -40, 272, 90, -108, -7, -52, -136, 82, -277, -135, -95, 103, -48, -51, 69, 298, -240, -48, 66, 112, -50, -66, 77, -149, -289, 97, 3, -54, -97, 44, -260, 69, -141, 140, -32, 197, 195, -91, 243, 57, -146, 68, 215, 328, 197, 18]
4087A8OJ06j07l5K3j96L71k00O2jj18J13K01l35j05J37l9K72k12R9J5l9j14m3
4111a21M3J12j78J12R3j29k6M2k3m2L2J91M2L4k42J12M7l79J57J19kn7J47j02
4135a8J33q5j25J07K31k17MK7k04K79k0j84p0J79K55l40j50L80Nk83O2J74j51
4158a1L7o4J55j31n1J61q5%J17N3j00r7J47k50J05K0j01K3J7L2p9J56O1j32j08
4183a25J29J01j78K84j77k83K00o3K18l07L37n4J18k88j10j52L27r7k80L10O2
4204b8J95k11K49m28M89j79k06QL25K9k08N8q6m6qMj57K05q6K33k1k90j49J89
4228a19J73j26j40R2K50n9j52J07R1j05R5j75M7M0k61l9M17Qj77N1p8J52k14n11
4252f33R32j33j90J37n4k70Q7K50j39J05LJ95j24l10Q3J8J96j79J18J92l37r1
$$ y = [18, 24, 130, 23, -12, 11, -185, 186, -14, 48, 47, -71, 42, 243, -92, -197, -60, -99, 173, -39, 60, 75, 36, -78, -121, -78, 34, -144, -32, 61, -68, -94, -52, -75, -117, -85, 106, 148, 182, -60, 52, 99, -280, -123, -4, -6, -63, 84, -18, 115, 30, -95, 12, 243, 26, 30, 57, -147, 132, 112, -72, -142, 37, 292, -48, -198, 182, 187, -96, -34, 140, -11, 26, -38, 117, -14, -65, 96, 11, 11, 128, 181, 81, -16, 131, -119, -14, 6, -95, -72, -55, -23, -102, 54, 115, -17, -125, 4, 105, -73, 211, 34, -249, -49, -112, 106, -201, 136, 82, 200, -88, -198, -350, -23, -120, -400, -90, -28, 167, -44, 205, -223, 266, 87, -119, -111, 214, 243, 35, 93, 7, -39, -47, -43, -200, 5, -81, 152, 131, -159, -308, -119, 54, -72, -212, -120, 130, 71, -81, 26, 117, 12, 107, -68, -21, 19, -242, -281, 136, 144, -33, 18, -60, 92, -122, -633, 299, 166, -24, 113, 59, -211, -124, 126, -13, 92, 95, 290, 166, -144, -61, -43, 153, -26, 92, 284, -53, -144]
4274a44K34r7p8j8J75k6n6J44k56j84J20L31p0k81K61l11L25n0q1L92n03L36K15
4297C78m61J09p4J40J37p4j11J3K20k29k22M09k30n0J27o6n1J45k06Q5J18j35
4319b8J9k8q6J39j90n2L85j79J92k31J83j32P4J43O5l75J63m6n1Q5P4P0j42j79
4343a27K40j1m1k52R6J53K04l19J75j11J08j73n7m4L4J58l8k02J04KJ97N7k19
4366f6o0R2J25k5k37J34R5M0l37L89m9j1k49K30j8r7l4r4L17o3j33R5j26%J70
4391H8k50J46J03K88l54j92PK08N7j91P2J08J26k53L3J5Q1k19K0K78k32L0n0n8
4415a39K45l93K50J05J38j92j52L53j24n2O0O4j67J45k77M02r7r6l4J08J2k63
4437a04J13l7l2J60k2k05J23j14N4L32m15K78j68l8L3o3N4O9q9J31p2j16R7L4
$$ y = [-144, 90, -7, -85, -103, 72, 46, -10, 134, -122, -306, -186, 145, 75, -206, 55, -256, 69, 19, -62, 330, -173, 163, 378, -83, 26, -48, 92, 229, 155, 44, 57, 277, 48, -174, 235, 5, -45, 82, 16, -35, 110, -96, -11, 107, -28, -9, -37, -123, 16, -174, -226, 159, -20, 172, -59, 124, -8, 66, 209, 274, -101, 62, 16, -35, 50, 124, 194, 52, -127, 113, 102, 61, -191, -95, 58, 262, -57, 118, 7, 115, -58, -115, -159, -125, 33, -5, -207, -103, -101, 96, 153, -66, -126, -34, 91, 66, -171, -37, 58, 98, -239, 150, 101, 90, -159, 71, 53, -44, -78, -172, 145, 82, -51, 44, -82, -82, 88, -162, -16, 87, 375, 21, -171, -164, 44, 101, -90, -18, 90, 216, -37, -4, 11, 92, -127, -107, 171, -61, -31, -81, -139, 106, -287, -37, 68, 206, 14, -138, 215, 91, 39, 99, 163, -4, 141, -136, 266, 169, 73, 39, 147, 159, -104, 9, -28, -60, 100, 78, -127, -4, -118, -64, 268, -147, 131, -37, -75, -42, -105, -51, 18, -71, 60, -12, -128, -31, 3]
4461CM7K6J2M3m8J1J9R7l46J98k4M7L1J8l2k67O5K05m43L32j77M01m17J52j18
4486a65K20j31J56k44k5L40k38m2J59mN3J6k78J45K68j60n6O8rm4n3j28L01k91
4510a42k17P04j73k68L19n4n02K35KJ96J38k64K46j45j01J74k44K61k69p3L8%
4532a39Q8KO0n5j15J09m1L62l55J32j69lj9K17P0l71K95k18M05k79r3K02l29K55
4556A1p2K0J86q3p6q0R9k20L66j37j5P6J81k30K0j82K91n2k4j4k28J27Q3j35L2
4581e6J07j52L09l25nJ47q8j36J94K18k48j8K53k23J19j16Q2j40Q1j18L0J42L4
4604I1K00k55k43k2L01J3Onj98k43pL81MO9m8n1L56m76M39j13m00rQ8R0J22j7
4630G3N7p7K1J33n0k83J87k9k41J57j00K01J86j67n8p6K04l3k43P7Q8r8J18M5
$$ y = [3, 50, 76, 88, 131, 83, 94, 113, 210, -136, 62, 38, 85, 116, 134, 102, -165, -100, 105, -338, -6, -183, 218, -199, -47, -165, 55, -76, 80, -164, -189, 151, -87, -129, 30, 26, 79, 95, -183, -38, 230, 70, 14, 82, 73, 29, -24, -152, 149, -142, -359, 345, 172, -96, 223, 169, -333, -98, -96, 100, 238, -26, 220, 75, -26, 148, -96, 165, -104, -177, -139, -139, -51, -49, 11, -44, -159, -50, -91, 271, -84, 48, -121, -124, -143, 74, 144, -227, 68, -150, 255, -24, -117, 85, -244, 11, -61, -41, 145, 62, -14, -94, 5, -215, 151, 14, -1, 75, 256, 26, 46, -136, 155, 103, 79, 65, -163, -36, 47, -88, -56, 51, -101, 208, -117, -122, 25, -63, -199, -5, 213, -35, -53, 200, -23, 96, -20, 62, -78, 3, -115, -85, 57, 91, 291, 36, -207, -229, 72, 85, 91, 86, -112, -355, -362, 19, 23, 92, 44, -7, 349, -127, 312, 199, -201, -210, -122, -32, 90, 73, 130, 53, 74, 207, 157, -126, 61, 32, -209, -52, -152, 49, 235, 68, 10, -66, 138, 105, -138, -61, 27, -71, 47, 92]
4654I2Pm39k4L75k0On0J80j75j28%K75M0l7P2k86j5lj61J16J95K5l6n8k3R2J78
4681A98j55j0K2P5j02J37k28o4L69j04K29k38k03Rj60J94p4o3jK01l4Mp3O3j8
4706b6P6k36M1K24j92K09o7Q0j50j80J3K93R1p7N8l62K28O8o5l1J05j43K4J10
4730I1l02L27j74n0K20j62N3rl2MJ5k17J65qj00L06k94M28k18j89n8J84J49o3
4754F6R5r1K58m84J95J56k37L04k65p2K51n48O08j88M0j86J4K37L0j45J37q8j45
4777e8n2J68k34J47L08m20J99j48J27j43J40J49k65j61K10p4J51k92J86K09j22
4798B5L0q4J51l55L1J41N7ro0R2qJ46jk79R2Q8m71N89l06M4k3L55k47P3l59L55
4824F7k55K33Q3l08K62J04k06p7l0M1Q0j26K31j19J08j01j2r6M00m38K86j34R7
$$ y = [92, 99, -340, -364, 11, -9, -3, -53, 127, -48, -176, -176, 99, 139, 102, 174, -112, -127, -130, -291, -175, 20, 45, 9, -49, -72, 20, 198, 43, 33, 55, 130, 28, 165, -63, -127, 242, 138, 367, 129, -74, -65, -225, -31, -105, -168, -169, 32, -2, 2, -71, -8, -26, 50, -186, -145, 79, -113, 96, 29, 109, -41, -221, -208, 85, 176, 99, 157, -205, 23, 91, 26, -5, 100, -43, -19, 91, -211, 116, -58, -108, 112, -50, 3, -6, -38, -34, -19, -236, -71, -79, -179, 127, -167, 261, 43, -146, -204, -20, 129, 66, 161, 70, 328, -156, 39, 195, -42, 262, -3, -75, 176, -372, 236, 48, 88, -98, -84, 153, 183, 38, 175, 87, -58, -110, 58, -176, -29, 279, -141, 58, -90, 37, -106, 34, 183, -82, -243, -33, -107, 44, -248, -62, 147, 25, 55, -29, 122, -233, -202, -61, -4, -13, -73, 19, 11, 157, 156, -123, -31, 57, -414, 175, -131, -87, -110, 245, -2, 71, -288, 67, -188, 45, 128, -180, 82, 186, -20, -97, -127, -86, -6, -132, 99, -20, 88, -13, -25, -121, 279, -159, 127, -7, 90]
4847I0J42m0k11j79J85J55q3j57j0q6K74k77R3J80l69L99m34K10J96j72k6J22
4869Bj03J10P3k04J81n0j78K29j14J4o5O4pM4J78m52L88k68K63o9l06K13R0O1
4893I4L0l76J60K99m47L46j13K11j45p4q6K00J03J9k41J03j96rL61l61Q0K6m8
4916f4R3jN4J83q9k31j45J65J4J13j6l5J48k16N3Q5j31Q3k59J34p8K57j80L1P7
4941D5j79J05k78L76M5j0O8j71o6K13j83j19m2L25K00k90O6l02K35j17M4j10K02
4964E7J13j80k52K26n9j15L31J2p0J10k29PJ03k08J70o0K43k63P0L34j71l00J12
4987a9k4o6or2K93j15rJ28L3r0R5q1k11K9J20J82k50l9L10j48j00J09n6K01k41
5012d7K25j74R2k35K19Q4p4R7j40J6r0l1J04o2j22J94j97K29k82J53nK15r1K5
$$ y = [90, 232, 192, -19, -198, -13, 142, 59, -98, -108, -194, 80, -197, -104, 76, -293, 106, -328, -118, 78, -94, -120, 2, -101, 9, 82, -122, 59, 9, -169, 60, -54, -40, -105, -41, -48, -4, 174, -278, 110, -158, 105, 36, -270, -57, 33, 94, 124, -252, -92, 207, -240, 106, -7, 204, 59, -15, -101, 99, 202, 221, -20, 83, -113, -122, 239, -122, -42, -16, -64, 29, 28, 82, 265, 176, -55, -200, -35, -21, 92, 76, 41, 189, -27, 26, 111, -20, 63, -196, -62, -140, 117, -63, -32, 45, -134, -29, -307, 69, 114, 104, 172, 1, -65, 148, -35, -154, -196, 129, 329, 39, 105, -197, 38, -79, -35, -145, 57, 170, -10, -262, -36, -95, -210, 121, 133, 63, 173, -56, -49, 54, -154, 16, -44, 199, -64, 6, 340, 169, -131, -19, -43, -109, -115, -207, 86, -29, -38, 90, 123, 33, 128, 47, -164, -135, -15, 167, -83, -122, 188, 40, -60, 49, -7, 194, -47, 178, 4, 96, -139, 80, 164, 90, 187, 47, 63, -27, -58, 46, -16, -138, 56, -141, 88, -194, -41, -46, 169, 78, 103]
5036A03k1l1Oj8r9p7m8J50m4r6K09M9j44Q2o7J02KJ69j22O4J0k21K7Q0r0K70l75
5063a30PM26j39j64o9L06l64P3K47m06J04J93k2J9j23j89L96k48m2J19j87L49
5085A56l15J2n0J70r7Q0J4J76l13J17O3K0%j35m1O2K84j74j4o3J15q5Q7O1l21
5110a91LJ83m06L62k6J34j41J55J17j86j0L5l2n2J50J17j84J34p8k49k10L39J69
5133A33k61K86j13r1M7j40J28k0M4j52R6n2J0L6J08k7p2o4J79j43N2j57L76j70
5157C3j11K35j53M6m1Oj44M8J24j25l6o9M43m08J18J04l1k24k1J55q8K24M7j96
5181f4J01j37J54P3k08J17k51L82r9r6KO7m1J64p7k38K13K36m9m66L73o5l7R8
5205A52k33j43L03J68m45J30k08K17j36k3M05k86O1Q6K0O1j85J36j57n0j9K19
$$ y = [103, 82, 51, 57, 39, -60, -137, -185, -35, -79, -175, 34, 83, -61, 21, -46, 56, 58, 227, 105, 169, 179, -42, -15, 65, -25, 245, -130, -123, 303, 164, 0, -69, 237, -127, -54, 193, -213, -109, 84, 62, 81, -42, -231, 165, -83, -125, -6, -193, 156, -159, -147, -197, -27, -124, -44, -30, 146, -167, -50, 13, 33, 33, -102, -143, -81, 203, 29, 15, -48, 67, -18, 69, 130, -191, -188, -5, -411, -49, -75, 59, -82, 73, 190, 4, -6, 29, -3, -55, 95, 212, 28, 162, 84, -165, -375, -36, 133, -128, 158, 45, -46, 1, -139, -11, -31, 13, -139, -43, -95, -85, -49, 59, 32, -40, -104, 75, -68, -16, -173, 203, 33, -78, 157, 4, 50, 9, 15, -129, -81, 43, -82, -118, -187, 256, -152, -34, 70, 39, -185, -206, -51, -139, 85, 132, -64, 37, -100, 54, 127, -81, 36, -215, 167, 68, -28, -26, 41, 0, 164, 87, -151, 62, 298, 249, -217, 156, 91, 54, 152, -81, -224, 79, 247, -198, -68, -276, -59, -195, -218, 187, -99, -38, 48, 68, 129, -56, 80, -77, -127, -146, 73]
5227G3p4q8J50J75m13N07j96k47L42l36O4J99j23j71J18J05j40K89m70L63p5K26
5249B78m09K17k09k6J42r1J33j00L20o2l22J6J09k10L10j08r8K06m5n8j18RJ92
5272G6j7n5N5k4j39L6l1O2O2O8L5j84J3J98N8l5j54j67K05R2j17q1J12M5nm8j50
5299i0l6K10j52r7K9L8J57k43J83J82m00J76R7o8r6M6J05l6P6mj22q1k0N3R1O6
5325F4k61kK67n6K2k41J82r5K21O7o2J62k55J07Lk2j98mL69k23N1j00K86l95k20
5350c33M45k24K73k75K5N3rL8j40N5J97j03J21j50r2O8O9k24K49j35J78N4l49
5373b09L6J49J50l93J87R3n5J38k95P9L26l27m6K05J24j98J8l3J18kj5J39j45
5396D4m2j3O2L7k34o0N8L67l32K57ol5J31j76j7j52J04j28L21k07J72p1R5j89
$$ y = [73, -1, -89, 61, 236, -177, 330, 134, -113, 229, -107, -43, 156, 33, -138, -20, 85, -55, 234, -236, 127, 52, 278, -131, 86, -123, -149, -7, -98, 35, -65, 255, 193, -129, -113, -4, -214, 96, -12, -110, 96, 51, -7, -125, -116, 76, 59, 4, 59, 35, -104, -68, -99, -37, 25, 93, 128, -56, -43, 155, 213, 178, 24, -143, 62, 154, 37, -44, 68, 113, 108, 60, -90, -126, 84, -68, -165, -136, -98, 59, -184, -1, 181, -219, -43, 54, -14, -110, -64, 41, 5, 81, 77, -45, -126, -146, -93, -2, 64, -197, -199, 68, 12, 34, -207, -25, -120, 101, 168, 106, 268, 13, 120, 123, 101, -97, -101, 268, 45, 96, -4, 282, -113, -333, 112, -112, 161, -114, -89, -36, -45, -7, -147, -92, 105, 2, 123, -27, -119, -51, 18, -206, 43, -92, 86, 140, -209, -173, -24, 126, -267, -80, 13, -42, 96, -199, -120, 206, -121, -167, 38, 162, -36, -18, -51, 67, 65, 50, 189, 44, 2, -11, 51, 88, -146, -206, -148, 219, -113, 144, 138, 103, 234, 58, 41, -111, -7, -135, 186, -21, 151, 80, 175, -14]
5420a4J91k67J95j38j08L13k41rK09j60R4j81J19n9l1L0J15O6k89J73m9j30L04
5443A33Nk16J38m1k10K67j5j99K44l27K55J25j73j6j3K02k82L94l52l8k21L91
5465E1KP1j96j92K89l2r6j1j44L61j64R9Q6j01J90q6k8j26j07l1J10j38L73j97
5489a7j9J61k23Q0j08J95j48J64ll78J81M4O1j67K35j18J33r1k78L40j57q8L05
5512A04k17K8J16r8K44m65L45J04j78K6P8o7J28j8N4k58K53k49r1J87K63k86K43
5535B46q3j05o8J47l78K35M7L5J17k79j6J78M4m9p0n8M0N2l34L35K29j06j85J75
5559A49j95J20k50K43p3R9j39L4k9J76l26K91O7K8l9l88K59L4k7j65K79j39n9
5582e0K02o2N9j4j51P4j63Q3j71L8K97j28M6j9k43m4J34q5K40j17M7n9L94m65
$$ y = [-14, 177, -90, 105, -33, -141, 172, -69, -78, 131, -29, 65, -116, 3, -56, -87, -57, 58, 124, -165, 8, -41, -171, 133, 138, -78, 60, 19, -191, 76, 61, -138, 106, -221, 34, 159, -14, -30, -43, 159, -123, 271, -81, -119, -340, 51, 53, 124, -72, -264, 25, -7, -103, -114, -258, 103, -61, 38, 124, 23, 213, 127, 99, -27, -134, -165, -55, -193, 180, -17, -36, 125, -98, -18, -126, 69, -79, 85, 82, -296, -115, -71, -10, -177, 58, -60, 73, -18, -296, 44, -113, -201, 104, -113, -85, 31, -67, 177, -288, 57, 161, -17, 9, 87, 20, 148, 130, 184, -74, 179, -70, -161, 26, 289, 3, 246, 163, 58, -10, 137, -241, -6, 41, 76, 193, -86, -102, 76, 120, 71, 1, -57, -17, 35, -299, 36, 265, 159, -26, 149, -46, 74, -176, 67, -6, 93, -46, -12, -41, 135, -191, 100, 167, 195, 156, -232, 27, 61, 34, -131, 148, 9, -50, 152, 90, 149, 135, -16, 58, -105, -22, -193, -155, 142, 14, 60, 41, -202, -246, -112, -197, 43, -74, -27, -86, 308, -157]
5606a57n1M9K88p9k08K74r7L0K6J01k34p4N5p5J71k16J91j80K71p3J33q0Q1j52
5630fn6m0o4L02l15L65k06j45L38Mq1l7J1j13J64j01j94K93p2K13j48Q9l21J53
5654C3o6J56l12N6J24lJ83j60j6J35l48K35j55J49L2j75J79k92K49n3q3J96n4
5677A0L0n0Q8n2n8M0j70K28J3j65jl2J57MJ20o7o6J37k41o4M83k83J09k55j23
5702b08n2L52m3o1N8j24m3N9O6J69l31n0L2M7J18j13k80K83l8R2K8J79rr6m0J85
5728A80j98J04n2l41K82k14J60R6k29K24J6K87l44J20M1l67J01R8kjm0L7L40j79
5752A19j19j16K44j46k7j7O2M6p2QK43j84m8K99l85K63j60Q0j1J14m9j91J5J00
5776F8j93J63o9n2j1J52K6J78k94n0K31j93P4k7k6M5j18K78J31l31J78j33J72
$$ y = [-157, -208, -159, 129, 50, -158, 116, 19, 49, 75, 176, -58, -132, -77, -152, 19, -197, -6, -186, 85, 12, 145, 65, 146, -6, -62, -102, -166, 136, -179, 186, -20, -165, 173, 177, 96, 59, 70, -43, 121, 20, -174, 119, 47, 260, 112, 201, -120, 33, -33, 123, -189, -133, -9, -12, 171, 11, -5, 130, -218, 17, -138, 11, 43, -132, 47, -245, 4, -49, -132, 64, 10, 40, -10, 78, 26, -32, 8, -162, 66, 79, -86, -87, -119, 38, 42, 162, 95, 29, 166, -75, -139, 344, 61, 170, -85, -208, -260, 92, 49, -12, 46, -78, -121, -62, 4, 173, -158, -208, -176, -129, -11, -124, -404, -121, -159, -67, -39, 140, 131, 35, -5, 180, -18, 86, 34, -307, -25, -239, -79, 17, -212, 12, 28, 315, -29, 91, 132, -235, -134, -36, -38, -39, -79, -42, 298, 119, 0, -116, 128, -18, -45, -62, 0, 46, -26, -18, 225, 41, -7, 292, -93, 170, 10, 90, 79, 193, 144, -47, -32, 68, -125, 38, -31, -83, -94, 58, 84, 262, -32, -82, 149, -44, 30, 3, -23, 22, -96, 182, 313, -18, 160, 27, 199]
5799A99j83Q1J4l7j41J63m3M4j67jj42J58J57k06K20N6k91r0L97J70l44j7O4j61
5823a00K12L3L5l45J91J43j76o9K73j85J02j25j28K0N99m73rj09r6L17Q3j91N8
$$ y = [199, 16, 97, 111, 74, -67, 96, 53, 97, -70, -71, -213, -55, 102, -104, 116, 172, -119, -209, 188, 358, 14, -3, 61, -100, 112, 145, 180, -165, 26, 169, -7, -76, 197, 12, 114, -11, -139, -119, 480, 7, -2, -111, -207, 110, 193, 2, 60]
$$ [...]
8191B7
##END NTUPLES=NMR FID
##END=
